##TITLE=1H_DE-21_oil_d6
 DMSO-d6
 8 sc, 
 6.6.2024
##JCAMPDX= 6.0         $$ Bruker NMR JCAMP-DX V2.0
##DATA TYPE= NMR FID
##DATA CLASS= NTUPLES
##ORIGIN= UXNMR, Bruker Analytische Messtechnik GmbH
##OWNER= root
$$ XWIN-NMR		Version 3.5
$$ Thu Jun  6 15:26:17 2024 Russian Standard Time (UT+4h)  she@DPX200
##.OBSERVE FREQUENCY= 200.1309
##.OBSERVE NUCLEUS= ^1H
##.DELAY= (6, 6)
##.ACQUISITION MODE= SIMULTANEOUS
##.ACQUISITION SCHEME= undefined
##.AVERAGES= 8
##.DIGITISER RES= 18
##SPECTROMETER/DATA SYSTEM= spect
##.PULSE SEQUENCE= zg30
##.SOLVENT NAME= CDCl3
##.SHIFT REFERENCE= (INTERNAL, CDCl3, 0, 15.7039)
##AUDIT TRAIL= $$ (NUMBER, WHEN, WHO, WHERE, WHAT)
$$ ##TITLE= Audit trail, XWIN-NMR		Version 3.5
$$ ##JCAMPDX= 5.01
$$ ##ORIGIN= Bruker BioSpin GmbH
$$ ##OWNER= she
$$ F:/spectra/data/she/nmr/H-F/1/audita.txt
$$ ##AUDIT TRAIL=  $$ (NUMBER, WHEN, WHO, WHERE, WHAT)
(   1,<2024-06-06 15:23:56.75 +0400>,<she>,<DPX200>,
      <created by zg, POWCHK disabled, PULCHK disabled
       configuration hash MD5:
       00 E9 B6 7A A2 85 ED C7 34 08 36 98 17 FE 4E 26
       data hash MD5: 16K
       ED 42 99 E2 30 69 45 85 31 65 13 A9 57 8D 8F DD>)
$$ ##END=
$$ 
$$ hash MD5
$$ 03 57 69 95 CD 75 AE E7 C9 71 0B 39 37 FB 7C F2
##$RELAX= 
##$RELAX= 
##$RELAX= 
##$RELAX= 
##$RELAX= 
##$RELAX= 
$$ Bruker specific parameters
$$ --------------------------
##$DU= <F:/spectra>
##$EXPNO= 1
##$NAME= <H-F>
##$PROCNO= 1
##$TYPE= <nmr>
##$USER= <she>
##$AMP= (0..31)
100 100 100 100 100 100 100 100 100 100 100 100 100 100 100 100 100 100 
100 100 100 100 100 100 100 100 100 100 100 100 100 100 
##$AQSEQ= 0
##$AQ_mod= 1
##$AUNM= <au_zg>
##$AUTOPOS= <>
##$BF1= 200.13
##$BF2= 200.13
##$BF3= 200.13
##$BF4= 200.13
##$BF5= 200.13
##$BF6= 200.13
##$BF7= 200.13
##$BF8= 200.13
##$BYTORDA= 1
##$CFDGTYP= 0
##$CFRGTYP= 5
##$CHEMSTR= <none>
##$CNST= (0..31)
1 1 145 1 1 1 1 1 1 1 1 1 1 1 1 1 1 1 1 1 1 1 1 1 1 1 1 1 1 1 1 1 
##$CPDPRG= <>
##$CPDPRG1= <>
##$CPDPRG2= <>
##$CPDPRG3= <>
##$CPDPRG4= <mlev>
##$CPDPRG5= <mlev>
##$CPDPRG6= <mlev>
##$CPDPRG7= <mlev>
##$CPDPRG8= <mlev>
##$CPDPRGB= <>
##$CPDPRGT= <>
##$D= (0..31)
0 1.2 0 0 0 0 0 0 0 0.06 0 0.03 0 0 0 0 0.0002 0 0 0 0 0 0 0 0 0 0 0 0 
0 0 0 
##$DATE= 1717673036
##$DBL= (0..7)
120 120 120 120 120 120 120 120 
##$DBP= (0..7)
150 150 150 150 150 150 150 150 
##$DBP07= 0
##$DBPNAM0= <>
##$DBPNAM1= <>
##$DBPNAM2= <>
##$DBPNAM3= <>
##$DBPNAM4= <>
##$DBPNAM5= <>
##$DBPNAM6= <>
##$DBPNAM7= <>
##$DBPOAL= (0..7)
0.5 0.5 0.5 0.5 0.5 0.5 0.5 0.5 
##$DBPOFFS= (0..7)
0 0 0 0 0 0 0 0 
##$DE= 6
##$DECBNUC= <off>
##$DECIM= 32
##$DECNUC= <off>
##$DECSTAT= 4
##$DIGMOD= 1
##$DIGTYP= 9
##$DL= (0..7)
0 120 120 120 120 120 120 120 
##$DP= (0..7)
150 150 150 150 150 150 150 150 
##$DP07= 0
##$DPNAME0= <>
##$DPNAME1= <>
##$DPNAME2= <>
##$DPNAME3= <>
##$DPNAME4= <>
##$DPNAME5= <>
##$DPNAME6= <>
##$DPNAME7= <>
##$DPOAL= (0..7)
0.5 0.5 0.5 0.5 0.5 0.5 0.5 0.5 
##$DPOFFS= (0..7)
0 0 0 0 0 0 0 0 
##$DQDMODE= 0
##$DR= 18
##$DS= 0
##$DSLIST= <SSSSSSSSSSSSSSS>
$$ [...]
##$SUBNAM2= <"">
##$SUBNAM3= <"">
##$SUBNAM4= <"">
##$SUBNAM5= <"">
##$SUBNAM6= <"">
##$SUBNAM7= <"">
##$SUBNAM8= <"">
##$SUBNAM9= <"">
##$SW= 18.0517689322627
##$SWIBOX= (0..15)
0 0 2 0 0 0 0 0 0 0 0 0 0 0 0 0 
##$SW_h= 3612.71676300578
##$TD= 16384
##$TD0= 1
##$TE= 0
##$TE2= 300
##$TE3= 300
##$TEG= 300
##$TL= (0..7)
0 120 120 120 120 120 120 120 
##$TP= (0..7)
150 150 150 150 150 150 150 150 
##$TP07= 0
##$TPNAME0= <>
##$TPNAME1= <>
##$TPNAME2= <>
##$TPNAME3= <>
##$TPNAME4= <>
##$TPNAME5= <>
##$TPNAME6= <>
##$TPNAME7= <>
##$TPOAL= (0..7)
0.5 0.5 0.5 0.5 0.5 0.5 0.5 0.5 
##$TPOFFS= (0..7)
0 0 0 0 0 0 0 0 
##$TUNHIN= 0
##$TUNHOUT= 0
##$TUNXOUT= 0
##$USERA1= <user>
##$USERA2= <user>
##$USERA3= <user>
##$USERA4= <user>
##$USERA5= <user>
##$V9= 5
##$VALIST= <valist>
##$VCLIST= <CCCCCCCCCCCCCCC>
##$VD= 0
##$VDLIST= <DDDDDDDDDDDDDDD>
##$VPLIST= <PPPPPPPPPPPPPPP>
##$VTLIST= <TTTTTTTTTTTTTTT>
##$WBST= 1024
##$WBSW= 4
##$XGAIN= (0..3)
0 0 0 0 
##$XL= 0
##$YL= 0
##$YMAX_a= 46776
##$YMIN_a= -72284
##$ZGOPTNS= <>
##$ZL1= 120
##$ZL2= 120
##$ZL3= 120
##$ZL4= 120
##$ABSF1= 10
##$ABSF2= 0
##$ABSG= 5
##$ABSL= 3
##$ALPHA= 0
##$AQORDER= 0
##$ASSFAC= 0
##$ASSFACI= 0
##$ASSFACX= 0
##$ASSWID= 0
##$AUNMP= <proc_1d>
##$AZFE= 0.1
##$AZFW= 0.1
##$BCFW= 1
##$BC_mod= 2
##$BYTORDP= 1
##$COROFFS= 0
##$CY= 11.3945322036743
##$DATMOD= 1
##$DC= 2
##$DFILT= <>
##$DTYPP= 0
##$F1P= 15.6554695791079
##$F2P= 12.8336369535428
##$FCOR= 0.5
##$FTSIZE= 0
##$FT_mod= 4
##$GAMMA= 1
##$GB= 0.15
##$INTBC= 1
##$INTSCL= 1
##$ISEN= 128
##$LB= 0.24
##$LEV0= 0
##$LPBIN= 0
##$MAXI= 10000
##$MC2= 0
##$MEAN= 0
##$ME_mod= 0
##$MI= 1.114404
##$NCOEF= 0
##$NC_proc= 0
##$NLEV= 6
##$NOISF1= 3.799351
##$NOISF2= 2.8
##$NSP= 1
##$NTH_PI= 0
##$NZP= 0
##$OFFSET= 15.70392
##$PC= 1
##$PHC0= -25320.35
##$PHC1= 24.38748
##$PH_mod= 1
##$PKNL= yes
##$PPARMOD= 0
##$PSCAL= 0
##$PSIGN= 0
##$REVERSE= no
##$SF= 200.130013532006
##$SI= 16384
##$SIGF1= 3
##$SIGF2= 2
##$SINO= 400
##$SIOLD= 16384
##$SREGLST= <1H.CDCl3>
##$SSB= 0
##$STSI= 0
##$STSR= 0
##$SW_p= 3612.71676300578
##$SYMM= 0
##$S_DEV= 0
##$TDeff= 0
##$TDoff= 0
##$TI= <>
##$TILT= no
##$TM1= 0
##$TM2= 0
##$TOPLEV= 0
##$USERP1= <user>
##$USERP2= <user>
##$USERP3= <user>
##$USERP4= <user>
##$USERP5= <user>
##$WDW= 1
##$XDIM= 8192
##$YMAX_p= 0
##$YMIN_p= 0
$$ End of Bruker specific parameters
$$ ---------------------------------
##NTUPLES= NMR FID
##VAR_NAME=  TIME,          FID/REAL,        FID/IMAG
##SYMBOL=    X,             R,               I
##VAR_TYPE=  INDEPENDENT,   DEPENDENT,       DEPENDENT
##VAR_FORM=  AFFN,          ASDF,            ASDF
##VAR_DIM=   8192,          8192,            8192
##UNITS=     SECONDS,       ARBITRARY UNITS, ARBITRARY UNITS
##FACTOR=    0.0002768,     1,               1
##FIRST=     0,             0,               0
##LAST=      2.2672688,     0,               0
##MIN=       0,             -72284,          0
##MAX=       2.2672688,     46776,           0
$$ Real data points
##PAGE= N=1
##DATA TABLE= (X++(R..R)), XYDATA
$$ [...]
$$ plain form
1849 -168 89 249 -9 -61 125 -113 -69 -99 19 433 -239 142 149 63 4 -38 -51 333 88 112 144 66 91 -248
1873 -248 167 18 -264 -282 131 -41 -17 -33 -145 138 -135 12 -4 177 -176 -57 266 -66 -318 -88 272
1894 272 236 324 175 206 -33 -138 32 -57 -12 117 211 -183 377 213 -161 128 -115 -100 -227 344 -427 -122
1916 -122 251 154 48 55 189 27 -79 13 -13 -311 -83 -155 30 -75 79 26 90 -48 174 90 191 -22 -113
1939 -113 -42 181 -266 -345 119 282 152 8 -179 -80 53 -1 -133 -184 -64 -27 1 172 107 71 -187 -56 -35
1962 -35 56 -109 4 174 -117 -68 -211 -67 113 31 -301 -51 85 -9 -50 -51 -134 -68 24 151 25 243 246 123
1986 123 -4 140 -11 -26 199 81 96 329 -24 140 109 -430 -162 139 -59 137 64 231 194 -101 -49 9
2008 9 219 -19 40 -262 18 69 103 62 19 311 -101 30 -158 37 25 161 -47 87 -112 9 -130 176 -29
$$ packed form
1849a68K57J60k58n2J86k38M4l0J18M14o72L81Pq6n9m2j3L84k45K4L2p8K5l39
1873b48M15j49k82j8M13j72K4j6j12K83k73J47j6J81l53J19L23l32k52K30L60
1894B72l6Q8j49L1k39j05J70q9M5J29R4l94N60j64l74K89k43J5j27N71p71L05
1916a22L73r7j06PJ34j62j06R2k6k98K28p2J85j05J54n3O4j38K22q4J01k13r1
1939a13P1K23m47p9M64J63j30j44j87R9J33n4j32n1J20L7K8J71o5l6k58J31K1
1962c5R1j65J13J70k91M9j43J44J80q2l32K50J36r4m1jq3O6R2J27j26K18Lj23
1986A23j27J44j51j5K25j18J5K33l53J64l1n39K68L01j98J96p3J67l7k95N2N8
2008IK10k38N9l02K80N1L4m1m3K92m12J31j88J95j2J36k08J34j99J21j39L06k05
$$ plain form
2031 -29 26 -160 89 -446 74 -125 55 170 -87 -344 -287 6 216 -172 -14 -28 -100 65 3 -137 55 146
2053 146 50 101 -95 -259 113 -149 -42 -180 42 25 103 -58 -241 97 69 111 165 247 -209 -235 -75 112 128
2076 128 42 55 -224 -166 -29 124 39 61 23 -6 71 -96 -153 -10 -170 -179 -87 -90 -22 -77 76 141 -217 -39 -13 -16 -33
2103 -33 -94 62 -189 34 28 -120 -91 76 125 123 73 -139 -208 18 -70 101 124 -70 57 -8 96 -156 -30 25 -391
2128 -391 -66 186 -45 -270 -215 -201 -200 -161 3 -192 128 -85 158 132 -35 168 191 31 -206 213 123 -9 181
2151 181 -84 244 70 -33 32 -206 128 251 23 33 -219 2 -46 240 176 -58 53 127 41 190 -14 152
2173 152 -165 -97 38 181 -65 130 -16 68 195 -431 -199 -79 131 53 -26 66 -63 -98 105 21 -96 -357
2195 -357 38 10 -62 68 56 -99 -174 -266 -112 -15 165 -18 13 30 -231 -113 -113 -3 200 66 -73 247 163 -159
$$ packed form
2031b9N5j86K49n35N20j99J80J15k57k57N7K93K10l88J58j4p2J65o2j40J92R1
2053A46r6N1j96j64L72k62J07j38K22j7P8j61j83L38k8M2N4Q2m56k6J60J87J6
2076A28q6J3k79N8J37J53q5K2l8k9P7j67n7J43j60rR2lO8n5J53O5l58J78K6lj7
2103c3o1J56k51K23oj48K9J67M9kn0k12o9K26q8J71K3j94J27o5J04k52J26N5m16
2128c91L25K52k31k25N5J4JL9J64j95L20k13K43k6j67K03K3j60k37M19r0j32J90
2151A81k65L28j74j03O5k38L34J23k28J0k52K21m8K86o4k34J11P4q6J49k04J66
2173A52l17O8J35J43k46J95j46Q4J27o26K32J20K10p8p9R2j29l5K03q4j17k61
2195c57L95k8p2J30j2j55p5r2J54R7J80j83L1J7k61J18%J10K03j34j39L20q4l22
$$ plain form
2219 -159 -6 -136 134 13 15 48 -109 227 115 169 134 -198 3 82 18 -96 -254 -232 -209 110 58 -42 99
2242 99 -102 -82 -101 -156 -40 -73 106 -240 -176 86 35 81 -214 -51 98 145 -142 -27 -71 132 29 293 -158
2265 -158 48 152 -109 -262 -122 -160 59 -95 38 -176 -76 -26 -51 241 50 -79 -101 76 104 -14 -211 -18
2287 -18 -128 -21 53 -231 -39 82 -232 -181 -91 80 -110 -68 -174 91 -82 201 -6 128 256 -226 -18 -96
2309 -96 68 153 -108 -27 35 173 45 -50 -78 215 -236 -66 218 -67 -232 129 -52 94 115 -62 -4 75 -96
2332 -96 -259 -16 49 84 17 -266 -86 52 -123 -233 -35 121 86 101 15 146 -23 61 13 51 -94 -40 54 -237
2356 -237 73 35 80 -100 250 69 -196 -92 -68 -23 -35 109 -73 197 -159 -173 -306 33 -323 3 -80 -199
2378 -199 123 -13 -118 77 169 174 -49 -114 136 -106 -105 -302 146 167 -183 -241 225 124 -335 260 -110 33 108
$$ packed form
2219a59J53j30K70j21KL3j57L36j12N4l5l32K01P9o4j14j58K2K3L19n2j00J41
2242I9k01K0j9n5J16l3J79l46O4K62n1M6k95J63J49M7k87J15m4K03j03K64m51
2265a58K06J04k61j53J40l8K19j54J33k14J00N0k5K92j91j29k2J77K8j18j97J93
2287a8j10J07P4k84J92J21l14N1R0J71j90M2j06K65j73K83k07J34J28m82K08p8
2309i6J64Q5k61Q1O2J38j28r5k8K93m51J70K84k85j65L61j81J46K1j77N8P9j71
2332i6j63K43O5L5o7k83J80J38j75j10J98J56l5J5q6J31j69Q4m8L8j45N4R4k91
2356b37L10l8M5j80L50j81k65J04K4M5j2J44j82K70l56j4j33L39l56L26q3j19
2378a99L22j36j05J95R2Nk23o5K50k42Jj97M48K1l50n8M66j01m59N95l70J43P5
$$ plain form
2401 108 9 -244 28 38 -38 -2 143 -202 -302 170 -84 303 -181 -79 56 -34 -66 230 -139 -172 115 9
2423 9 21 -20 26 -13 21 -26 -135 -36 27 -4 -96 142 -165 -103 48 29 62 -44 52 -90 -155 0 -129 -1 -146 204
2449 204 102 -218 -45 -31 60 -209 64 -56 170 85 -51 -28 -52 101 255 -180 114 -48 13 -24 59 121 26
2472 26 190 -49 -248 -39 13 151 -140 26 21 47 58 24 -108 1 -125 -111 194 191 -298 -192 -23 15 115 90
2496 90 -46 139 -10 -154 -149 -66 79 -174 85 -191 -72 -163 3 -224 63 133 -123 -61 75 201 -19 -198
2518 -198 32 -66 141 42 236 -59 158 124 -143 -99 -18 14 -192 45 45 -167 252 38 -244 10 44 124 347
2541 347 105 167 29 83 -26 102 -298 122 110 -120 -27 -19 32 222 -47 275 -72 173 87 14 10 -64 167 -69
2565 -69 -13 12 145 24 326 -221 -86 -34 55 -112 73 -94 20 0 144 -168 40 -4 21 -245 -227 17 106
$$ packed form
2401A08r9k53K72J0p6L6J45l45j00M72k54L87m84J02J35r0l2K96l69l3K87j06
2423IJ2m1M6l9L4m7j09R9O3l1r2K38l07O2J51j9L3j06R6j42o5J55j29J28j45L50
2449B04j02l20J73J4R1k69K73j20K26q5j36K3k4J53J54m35K94j62O1l7Q3O2r5
2472B6J64k39j99K09N2J38k91J66nK6J1l4j32J09j26J4L05lm89J06J69L8J00k5
2496I0j36J85j49j44NQ3J45k53K59k76J19r1J66k27K87P0k56O2J36J26k20j79
2518a98K30r8K07r9J94k95K17l4k67M4Q1L2k06K37%k12M19k14k82K54L4Q0K23
2541C47k42O2j38N4j09J28m00M20j2k30R3QN1J90k69L22l47K45q6p3mp4K31k36
2565f9N6K5J33j21L02n47J35N2Q9j67J85j67J14k0J44l12K08m4K5k66J8K44Q9
$$ plain form
2588 106 -191 -186 -109 -402 122 125 295 51 -204 77 83 -143 -12 63 -121 91 -144 -112 163 19 -73 -130 -77 41
2612 41 -8 -27 2 -207 -3 -238 -85 -221 69 85 -163 -73 128 72 -126 -75 186 -214 -25 -277 112 70 -244
2635 -244 -127 -295 -117 -67 -9 -53 -44 137 48 -216 214 -87 -126 -82 32 182 213 117 174 -172 -28 233 -79 -178
2659 -178 178 -173 -38 -31 -123 14 39 57 69 -191 250 2 227 -50 91 -13 -39 -85 49 39 187 95 13 -76
2683 -76 -169 35 -50 141 -28 -125 184 208 -27 170 -54 109 163 -174 -34 70 -149 -178 141 111 88 -231 -345
2706 -345 -41 -277 -3 -75 -317 77 13 108 -77 104 -182 -4 -106 31 -132 -55 370 -152 -52 -122 -170 74
2728 74 258 -67 -31 -260 17 70 223 -141 118 -327 142 -223 107 281 116 179 -23 72 386 5 -223 -80
2750 -80 -24 -67 -104 -239 -17 -36 -312 -137 116 -179 19 17 -321 -127 -172 189 -32 -93 -101 40 163 -36 -2 -271
$$ packed form
2588A06k97NP7k93N24LJ70k44k55K81Ok26J31P5j84K12k35L2K75j44r2n7N3J18
2612D1m9j9K9k09K04k35J53j36K90J6k48R0K01n6j98N1K61m00J89k52L89m2l14
2635b44J17j68J78N0N8m4RJ81q9k64M30l01l9M4J14J50L1r6N7l46J44K61l12r9
2659a78L56l51J35Pr2J37K5J8J2k60M41k48K25k77J41j04k6m6J34j0J48r2q2q9
2683g6r3K04q5J91j69r7L09K4k35J97k24J63N4l37J40J04k19k9L19l0k3l19j14
2706c45L04k36K74p2k42L94o4R5j85J81k86J78j02J37j63P7M25n22J00p0m8K44
2728G4J84l25L6k29K77N3J53l64K59m45M69l65L30J74j65O3k02R5L14l81k28J43
2750h0N6m3l7j35K22j9k76J75K53k95J98kl38J94m5L61k21o1qJ41J23j99L4k69
$$ plain form
2774 -271 192 -141 30 90 32 32 250 -135 -117 -304 -162 -29 165 -24 24 212 124 27 -304 333 -46 28 42
2797 42 -70 -67 37 124 63 75 -159 -127 -80 -220 42 -151 -244 -151 -168 23 -33 216 137 -128 207 275 -44 -181 -32
2822 -32 -146 -3 -69 134 -240 -183 -71 -47 -122 -314 -34 15 -50 29 -123 10 132 -237 -119 27 -170 -102 -78
2845 -78 -284 36 -3 -277 218 153 178 255 -114 -9 -60 138 88 94 -28 178 8 99 230 -16 178 73 109 117
2869 117 -53 -145 136 148 216 281 -309 173 -91 -13 -120 -216 -33 -189 108 68 -40 157 -298 105 197 164 92
2892 92 -319 -139 -112 165 -127 -36 239 -14 -186 54 -74 -74 -25 42 116 34 -65 200 -97 -104 96 19 -155 -349
2916 -349 -53 145 119 81 -129 -217 198 -36 -47 -122 65 -232 -149 -120 -41 12 -283 -69 255 -127 319 -28 83
2939 83 -2 -311 -11 -14 124 -103 -26 -299 87 177 -195 -9 -439 -22 -80 48 70 -171 -27 -238 -22 -279 -160
$$ packed form
2774b71M63l33J71O0n8%K18l85J8j87J42J33J94j89M8J88q8r7l31O37l79P4J4
2797D2j12LJ04Q7o1J2k34L2M7j40K62j93r3R3j7J91n6K49p9k65L35O8l19j37J49
2822c2j14J43o6K03l74N7J12K4p5j92K80M9o5P9j52J33J22l69J18J46j97O8K4
2845g8k06L20l9k74M95o5K5P7l69J05n1J98n0Oj22K06j70R1J31k46J94j05L6Q
2869A17j70r2K81J2O8O5n90M82k64P8j07r6J83j56K97m0j08J97m55M03R2l3p2
2892I2m11J80K7K77k92R1K75k53j72K40j28%M9O7P4q2r9K65k97pK00p7j74j94
2916c49K96J98k6l8k10q8M15k34j1p5J87k97Q3K9P9N3k95K14L24l82M46l47J11
2939H3q5l09L00lJ38k27P7k73L86R0l72J86m30M17n8J28K2k41J44k11K16k57J19
$$ plain form
2962 -160 175 -69 49 -64 -24 -80 -78 190 -133 -300 26 141 -254 -40 20 -440 -37 -94 203 2 -351 -228
2984 -228 64 -68 128 184 -40 -193 67 -252 -176 39 107 441 -247 92 -66 -68 -133 -56 37 -160 302 -77 120
3007 120 29 -92 53 -161 38 75 46 62 252 -166 -168 -79 -198 187 -27 -158 -72 -12 -88 113 -8 -17 45 150
3031 150 63 -40 -210 39 -55 33 108 29 -123 -42 -71 -75 40 172 -52 4 73 122 19 -309 18 -99 5 53
3055 53 -141 -104 -21 -114 112 -138 178 205 147 63 -94 -27 -115 254 210 -26 52 6 480 108 -40 -10 -91 -175 122
3080 122 -143 -284 69 -53 -6 314 32 1 -81 147 -157 -263 85 166 -2 -134 152 122 -158 -138 -205 -158 108
3103 108 108 -111 -77 53 9 -16 -145 110 -251 272 -20 76 125 150 1 27 -199 246 146 27 -87 274 -37
3126 -37 -5 24 65 7 -66 -23 -103 15 -366 -21 4 -241 -73 -95 284 136 31 243 -9 -279 -243 -9 16 223
$$ packed form
2962a60L35k44J18j13M0n6KK68l23j67L26J15l95K14O0m60M03n7K97k01l53J23
2984b28K92j32J96N6k24j53K60l19P6K15O8L34o88L39j58ko5P7R3j97M62l79J97
3007A20r1j21J45k14J99L7k9J6J90m18kQ9j19L85k14j31Q6O0p6K01j21rO2J05
3031A50q7j03j70K49r4Q8P5p9j52Q1k9mJ15J32k24N6O9M9j03l28L27j17J04M8
3055E3j94L7Q3r3K26k50L16K7n8q4j57O7q8L69m4k36P8m6M74l72j48L0q1q4K97
3080A22k65j41L53j22M7L20k82l1q2K28l04j06L48Q1j68j32K86l0k80K0o7M7K66
3103A08%k19L4J30m4k5j29K55l61N23k92R6M9K5j49K6k26M45j00j19j14L61l11
3126c7L2K9M1n8p3M3q0J18l81L45K5k45J68k2L79j48j05K12k52k70L6K34K5K07
$$ plain form
3150 223 -90 -298 35 124 -228 -183 -66 -167 103 -6 16 -297 -64 -113 -118 107 -141 5 -263 79 -27 -288
3172 -288 21 -128 -85 51 -44 -75 118 87 246 12 -13 -5 161 100 67 149 -96 -8 -170 88 -102 -66 26 -18 17
3197 17 -70 202 -196 -68 -15 -112 57 16 114 -69 -44 -159 -63 -33 126 110 50 -86 -55 118 -197 92 -36 73
3221 73 -84 27 143 188 23 327 183 51 -78 8 -229 159 -32 -264 120 91 -33 54 80 112 96 63 179
3244 179 106 -136 195 -47 13 168 -124 79 -153 106 15 40 5 -79 15 198 -179 -42 -28 110 28 -8 -323
3267 -323 -107 41 -216 -212 -119 65 -103 9 61 -143 68 -184 -195 -157 -28 97 -232 62 -61 -42 85 -198
3289 -198 -119 -180 -18 127 135 12 -250 7 108 -93 41 -19 -1 -24 183 -38 -42 123 198 103 -101 -29 -22 46 248
3314 248 70 187 28 151 304 -359 111 -29 342 -39 175 -184 344 322 10 -243 44 -49 -76 -108 35
$$ packed form
3150B23l13k08L33Q9l52M5J17j01K70j09K2l13K33m9nK25k48J46k68L42j06k61
3172b88L09j49M3J36r5l1J93l1J59k34k5QJ66o1l3Q2k45Q8j62K58j90L6R2m4L5
3197A7q7K72l98J28N3r7J69m1R8j83K5j15R6L0J59j6o0j36L1J73l15K89j28J09
3221G3j57J11J16M5j65L04j44j32j29Q6k37L88j91k32L84k9j24Q7K6L2j6l3J16
3244A79p3k42L31k42O0J55k92K03k32K59r1K5l5q4R4J83l77J37J4J38q2l6l15
3267c23K16J48k57MR3J84j68J12N2k04K11k52j1L8J29J25l29K94j23J9J27k83
3289a98P9o1J62J45Qj23k62K57J01k01J34o0J8k3K07k21mJ65P5r5k04P2PO8K02
3314B48j78J17j59J23J53o63M70j40L71l81K14l59N28k2l12k53K87r3k7l2J43
$$ plain form
3335 35 -43 -182 -319 117 21 -157 80 -296 163 -116 17 -175 33 -58 -22 -141 -408 -108 -84 67 99 243
3357 243 -153 205 4 41 136 -20 -45 -8 72 212 44 101 46 -21 29 -69 78 -117 -29 -25 -159 35 -119 -87 -33
3382 -33 -166 193 180 -135 -10 -197 -27 98 -128 -5 -47 31 -52 261 -104 -119 5 44 -31 250 -45 -144 -20
3405 -20 223 -112 -173 129 146 61 -24 -223 -102 -20 -250 -169 -41 -36 25 -131 -257 73 -106 -2 149 -17 185
3428 185 -157 128 -40 51 -268 24 137 47 -39 340 -139 72 -114 -63 0 -197 93 -155 -339 130 -73 141
3450 141 121 49 68 50 389 -95 275 150 24 -125 29 -46 192 152 -52 212 -244 31 -171 70 150 -123
3472 -123 107 57 -36 -43 -403 64 -112 38 99 136 -13 48 -38 -79 -7 148 91 -51 -73 10 133 33 114 180 71
3497 71 195 99 31 61 -224 145 -35 116 -207 -118 -348 -246 -223 -49 -288 320 142 47 244 -238 117 -163
$$ packed form
3335C5p8j39j37M36r6j78K37l76M59k79J33j92K08r1L6j19k67L00K4J51L2J44
3357B43l96L58k01L7R5j56k5L7Q0J40j68N7n5o7N0r8J47j95Q8Mj34J94j54L2N4
3382c3j33L59j3l15J25j87J70J25k26J23m2P8q3L13l65j5J24L9p5K81k95r9J24
3405b0K43l35o1L02J7q5q5j99J21Q2k30Q1J28NO1j56j26L30j79J04J51j66K02
3428A85l42K85j68R1l19K92J13r0q6L79m79K11j86N1O3j97K90k48j84M69k03K14
3450A41k0p2J9j8L39m84L70j25j26j49J54p5K38m0k04K64m56K75k02K41Q0k73
3472a23K30n0r3pl60M67j76J50O1L7j49O1q6m1P2J55n7j42k2Q3J23j00Q1O6j09
3497G1J24r6o8L0k85L69j80J51l23Q9k30J02K3J74k39O08j78r5J97m82L55k80
$$ plain form
3519 -163 -58 -129 -48 23 -88 -80 -30 187 -128 154 -157 190 -258 -43 -56 -176 221 -93 -61 -72 -156 132 -56
3542 -56 -159 14 141 -258 -55 74 74 158 -206 224 -21 66 -171 24 104 105 -81 329 -133 -337 135 -3 74
3565 74 -95 -122 -273 13 -47 -105 107 -176 66 -137 11 -180 61 -87 140 -164 -114 -168 -24 161 -27 335
3587 335 -41 56 19 -158 -160 -105 19 62 -87 -197 8 -234 -212 213 129 111 -95 121 -130 152 -67 143 82
3610 82 193 168 321 -75 -252 158 38 -102 159 -2 43 31 19 55 97 -326 -3 -202 -38 201 55 -19 -248
3633 -248 -61 -182 94 222 13 6 77 -134 -208 -149 -20 -47 124 -205 128 -30 -159 80 -150 -117 -55 -81 241
3656 241 -197 -89 85 -118 -135 94 -154 196 -46 -74 -183 48 20 14 39 -44 -44 -23 69 -27 95 -355 230 203
3680 203 -362 168 -122 -163 276 144 -47 3 210 96 110 123 -75 -96 46 18 35 73 174 -49 -64 132 -34
$$ packed form
3519a63J05p1Q1P1j11QN0K17l15K82l11L47m48K15j3j20L97l14L2j1q4K88j88
3542e6j03J73J27l99K03J29%Q4l64M30k45Q7k37J95Q0Jj86M10m62k04M72j38P7
3565G4j69k7j51K86o0n8K12k83K42k03J48j91K41j48K27l04N0n4J44J85j88L62
3587C35l76R7l7j77kN5J24M3j49j10K05k42K2M25q4j8k06K16k51K82k19K10o1
3610H2J11k5J53l96j77M10j20j40K61j61M5j2j2L6M2m23L23j99J64K39j46p4k29
3633b48J87j21K76J28k09pP1k11p4N9J29k7J71l29L33j58j29K39k30L3O2k6L22
3656B41m38J08J74k03j7K29k48L50k42k8j09K31k8oK5q3%K1R2r6J22m50N85k7
3680B03n65N30k90m1M39j32j91N0K07j14J4J3j98k1J42k8J7L8J01k23j5J96j66
$$ plain form
3703 -34 206 -146 352 59 -2 25 -380 -68 -314 214 -39 -80 131 213 -136 -196 -57 34 -82 47 -15 -176 210
3726 210 233 -20 -154 -183 -15 90 90 21 -131 43 -266 -127 -156 -178 -14 -27 -53 58 -88 -333 -31 69 -20
3749 -20 -5 249 190 99 -136 43 162 -120 -96 -355 -398 -36 -86 45 128 128 -216 -107 -70 -13 96 -97 -106 -49 2
3774 2 121 -82 -20 -10 23 152 58 288 198 218 -134 101 56 -12 200 85 51 59 -52 420 155 181 -77 0 -134
3799 -134 -280 186 -82 145 49 -239 -18 17 108 -55 30 -3 75 -50 17 201 -324 -358 67 101 45 66 132 194
3823 194 -158 -106 -4 -107 284 214 -106 43 -238 -96 -138 7 -96 53 250 199 193 2 113 133 217 174 36
3846 36 -146 -7 -48 -229 89 -222 135 6 17 58 -77 1 -188 43 268 170 32 33 198 -93 -230 22 182
3869 182 9 86 57 201 132 -27 -90 180 37 -68 44 -5 -39 92 49 -81 -240 312 -148 -53 227 169 -144
$$ packed form
3703c4K40l52M98k93o1K7m05L12k46N28k53m1K11Q2l49o0J39R1j16J29o2j61L86
3726B10K3k53j34k9J68J05%o9j52J74l09J39k9k2J64j3k6J11j46k45L02J00q9
3749b0J5K54n9r1k35J79J19k82K4k59m3L62n0J31Q3%l44J09L7N7J09j93rN7N1
3774BJ19k03O2J0L3J29r4K30r0K0l52K35m5o8K12j15l4Qj11M72k65K6k58P7j34
3799a34j46M66k68K27r6k88K21L5R1j63Q5l3P8j25O7J84n25l4M25L4n6K1O6O2
3823A94l52N2J02j03L91p0l20J49k81J42m2J45j03J49J97n1oj91J11K0Q4m3j38
3846C6j82J39m1j81L18l11L57j29J1M1j35P8j89K31K25r8j38JJ65k91j37K52J60
3869A82j73P7k9J44o9j59o3K70j43j05J12m9l4J31m3j30j59N52m60R5K80n8l13
$$ plain form
3892 -144 104 -49 -147 -57 -65 -37 -3 48 51 244 -7 11 -20 46 -125 -167 139 59 128 37 87 69 -219 -102 -22 293
3918 293 56 96 149 -19 -46 173 119 32 -239 226 66 -178 -6 -87 -141 216 129 -118 177 319 128 210 328
3941 328 192 -163 35 -148 202 70 -240 -20 57 -29 -5 -39 -71 176 8 60 164 174 -201 174 167 -76 233
3964 233 -298 -13 -50 -179 -52 74 241 86 226 -159 -192 56 18 -195 -407 -107 -22 -267 -283 158 4 -84
3986 -84 274 -59 118 82 -251 142 35 30 -98 168 -38 -55 201 -114 -72 32 -83 286 -156 168 -47 11
4008 11 79 120 101 47 60 -235 151 3 344 58 112 57 -31 38 27 236 -12 -204 89 -14 100 83 -37 -156
4032 -156 -148 224 103 58 -205 62 32 -138 96 -193 -15 349 77 -43 11 -175 181 62 229 -113 -179 130
4054 130 -140 -61 316 -5 115 154 -10 -35 285 -179 195 -26 -40 -32 114 97 149 40 18 -183 77 -209 -246
$$ packed form
3892a44K48j53r8R0qK8L4N1LJ93k51J8l1O6j71m2L06q0O9r1N0j8k88J17Q0L15
3918B93k37M0N3j68k7K19n4q7k71M65j60k44J72q1n4L57q7k47K95J42j91Q2J18
3941C28j36l55J98j83L50j32l10K20P7q6K4l4l2K47j68N2J04J0l75L75pk43L09
3964B33n31K85l7j29J27J26J67j55J40l85l3K48l8k13k12L00Q5k45j6M41j54q8
3986h4L58l33J77l6l33L93j07nj28K66k06j7K56l15M2J04j15L69m42L24k15N8
4008A1O8M1j9n4J3k95L86j48L41k86N4n5q8O9j1K09k48j92K93j03J14j7j20j19
4032a56QL72j21m5k63K67l0j70K34k89J78L64k72j20N4j86L56j19J67l42o6L09
4054A30k70P9L77l21J20L9j64k5L20m64L74k21j4QJ46j7N2j09k2k01K60k86l7
$$ plain form
4077 -246 202 63 115 -327 -110 -95 298 32 -7 141 98 -163 85 -113 -90 90 63 186 16 274 -131 -101
4099 -101 -46 179 -139 -117 6 -17 31 -135 118 -53 216 173 141 -14 117 -36 -214 126 -106 143 -25 161
4121 161 -8 -296 -189 103 22 90 303 67 -207 102 -183 106 -62 -60 -65 -223 60 59 -100 67 -18 -35 185
4144 185 119 -130 -279 -208 111 -124 98 28 -103 -108 48 -73 -90 64 -227 -231 141 122 -55 145 21 3 90 -150
4168 -150 137 4 67 -153 49 -285 196 51 -248 202 -49 -89 67 95 232 -39 -319 240 -61 89 -27
4189 -27 360 20 -78 37 133 -304 -94 320 -177 -87 -86 -47 -82 -49 -71 -16 -89 166 -258 83 -119 81 -49 108
4213 108 15 97 -43 83 26 83 -97 -144 111 -308 -90 185 246 -112 71 -148 106 -80 -233 52 -42 -88 90
4236 90 116 -27 -127 -471 -111 -79 -18 -186 52 27 -199 -171 -3 -250 -201 -94 -159 -33 -1 168 212 36 97 129
$$ packed form
4077b46M48j39N2m42K17J5L93k66l9J48m3k61K48j98K3J80k7J23j70K58m05L0
4099a01N5K25l18K2J23k3M8j66K53j71K69m3l2j55J31j53j78L40k32K49j68J86
4121A61j69k88J07K92q1O8K13k36k74L09k85K89j68Knj58K83jj59J67q5j7K20
4144A85o6k49j49P1L19k35K22p0j31nJ56j21j7J54k91mL72j9j77K00j24j8Q7k40
4168a50K87j33O3k20K02l34M81j45k99M50k51m0J56K8J37k71k80N59l01J50j16
4189b7L87l40r8J15R6m37K10M14m97R0JL9l5L3k2N5p3K55m24L41k02K00j30J57
4213A08r3Q2j40J26n7N7j80m7K55m19K18K75O1l58J83k19K54j86j53K85r4m6J78
4236I0K6j43j00l44L60L2O1j68K38k5k26K8J68k47M9J07o5J26L2J69M4j76O1L2
$$ plain form
4260 129 -108 103 234 -61 -118 19 -85 114 -68 -142 -25 227 152 -78 159 1 -120 104 223 -142 192
4281 192 -75 -45 75 37 -159 -314 -189 285 162 -150 -28 208 -42 155 -19 -133 -37 -82 -87 245 177 -58
4303 -58 132 173 59 -10 -21 -4 41 48 -155 27 -68 29 -330 -92 155 -339 -45 -136 30 28 12 -192 -226 181 -78
4328 -78 -5 -11 89 56 -80 -189 -59 106 -198 104 -148 -30 180 -5 -41 93 -113 -50 59 -200 -52 72
4350 72 180 96 108 -167 -184 -18 284 10 -34 -21 308 -71 49 211 210 39 -222 -9 -25 -250 -134 -114 -107 213
4374 213 30 38 14 -104 -35 -22 -127 -45 -45 179 173 -195 -42 -206 -25 64 5 -298 -179 407 -231 -260 20 255
4398 255 150 -65 249 -175 -89 -23 -286 49 -60 -175 -91 -41 46 -223 -431 -112 -155 66 145 -16 158 -82
4420 -82 114 17 40 -11 206 12 51 94 -151 -242 -50 16 -61 -150 1 159 -196 237 155 191 6 -76 224 -122
$$ packed form
4260A29k37K11J31k95n7J37j04J99j82p4J17K52p5k30K37j58j21K24J19l65L34
4281A92k67L0J20l8j96j55J25M74j23l12J22K36k50J97j74j14R6m5nL32o8k35
4303e8J90M1j14o9j1J7M5Pk03J82r5R7l59K38K47m94K94r1J66kj6k04l4M07k59
4328g8P3oJ00l3j36j09J30J65l04L02k52J18K10j85l6J34k06O3J09k59J48J24
4350G2J08q4J2k75j7J66L02k74m4J3L29l79J20J62jj71k61K13j6k25J16K0PL20
4374B13j83Qk4j18O9J3j05Q2%K24ol68J53j64J81Q9n9l03J19N86o38k9K80K35
4398B55j05k15L14m24Q6O6k63L35j09j15Q4N0Q7k69k08L19m3K21P9j61J74k40
4420h2J96r7K3n1K17j94L9M3k45r1J92O6p7q9J51J58l55M33q2L6j85q2L00l46
$$ plain form
4444 -122 248 -269 -41 -177 -283 -57 4 54 -102 -163 -10 157 59 35 -61 16 86 -297 50 46 -116 260 -55
4467 -55 -221 -94 -199 -4 54 165 86 -208 54 -47 18 24 -72 -51 -40 -147 -71 -31 -174 -208 -325 237 107 -76
4491 -76 262 -36 271 68 -50 -97 146 167 -115 -20 283 128 212 -151 -447 -63 -337 177 -16 -77 89 -139
4513 -139 -141 22 279 103 77 -94 3 95 13 -28 72 26 -129 40 -316 35 145 281 -94 84 -246 -195 -284
4536 -284 -383 -88 15 -45 -45 -203 151 -40 78 -41 -67 70 95 -66 104 -166 -159 -127 60 10 -224 -39 288
4559 288 -65 -11 -135 -60 17 -187 192 -82 -39 -63 19 151 -81 35 252 207 -73 144 122 -213 -92 150 124
4582 124 -97 61 -214 5 179 167 247 352 -105 238 9 10 165 -193 -100 100 198 37 178 -112 35 -237
4604 -237 -251 46 -322 -243 -91 -189 -143 271 17 -187 269 -163 134 201 -147 -150 -190 -216 260 72 -268 372 26
$$ packed form
4444a22L70n17K28j36j06K26O1N0j56o1J53J67r8k4r6P7P0l83L47mj62L76l15
4467e5j66J27j05J95N8J11p9k94K62j01O5Or6K1J1j07P6M0j43l4j17N62j30j83
4491g6L38k98L07k03j18m7K43K1k82R5L03j55Q4l63k96L84k74N14j93o1J66k28
4513a39kJ63K57j76k6j71R7R2q2m1J00m6j55J69l56L51J10J36l75J78l30N1q9
4536b84r9K95J03o0%j58L54j91J18j19k6J37K5j61J70k70PL2J87n0k34J85L27
4559B88l53N4j24P5P7k04L79k74M3k4Q2J32k32J16K17m5k80K17k2l35J21K42k6
4582A24k21J58k75K19J74j2Q0J05m57L43k29JJ55l58R3K00R8j61J41k90J47k72
4604b37j4K97l68P9J52r8M6M14k54k04M56m32K97O7l48lm0k6M76j88l40O40l46
$$ plain form
4627 26 -110 -210 62 -281 7 -217 -55 240 2 -39 -42 58 -47 161 -3 -57 124 -153 119 70 -96 -132
4649 -132 73 -104 152 213 286 -224 160 -22 85 9 -261 199 2 128 35 48 -95 -11 -106 34 -5 -16 -111
4672 -111 -395 70 -123 -1 -202 -192 -69 -14 -48 51 101 132 -63 -64 143 244 228 -159 91 -109 7 43 -161
4695 -161 -165 12 -317 -12 151 72 29 -152 55 35 168 -8 -233 -490 118 41 -117 180 54 85 -202 -290 193
4718 193 -14 272 136 -39 101 218 128 -262 -174 136 81 -123 -69 -203 138 -121 -94 -336 25 -101 46 42
4740 42 -285 62 57 80 -68 130 36 -265 51 48 128 141 -36 101 -61 -114 116 82 140 147 -47 155 -230 37 107
4765 107 -49 126 -39 44 -125 -164 137 154 49 40 33 -118 -6 -29 -85 133 -423 -211 -119 -168 238 -162 -286 219
4789 219 220 -305 -151 -31 -221 128 56 63 154 -34 233 -18 -136 247 -77 -86 221 -122 -304 200 -70 6 51
$$ packed form
4627B6j36j00K72l43K88k24J62K95k38m1lJ00j05K08j64n4J81k77K72m9j66l6
4649a32K05j77K56O1P3n10L84j82J07p6k70M60j97J26r3J3j43Q4r5J40l9j1r5
4672a11k84M65j93J22k01J0J23N5l4R9N0L1j95jK07J01j6l87K50k00J16L6k04
4695a61mJ77l29L05J63p9m3j81K07k0J33j76k25k57O08p7j58K97j26L1k87q8M83
4718A93k07K86j36j75J40J17r0l90Q8L10n5k04N4j34L41k59K7k42L61j26J47m
4740D2l27L47nK3j48J98r4l01L16lQ0J3j77J37j62n3K30l4N8Pj94K02l85K67P0
4765A07j56J75j65Q3j69l9L01J7j05rpj51J12k3n6K18n56K12R2m9M06m00j24N05
4789B19Jn25J54J20j90L49p2PR1j88K67k51j18L83l24rL07l43j82N04k70P6M5
$$ plain form
4812 51 41 -219 138 239 134 111 187 134 -21 165 -94 135 108 63 -133 61 260 61 -80 43 234 62
4834 62 27 6 -95 105 -97 89 -15 -46 -104 -46 69 -99 -29 -210 -66 -41 -55 20 251 18 -190 -76 95
4857 95 239 361 110 -6 -71 70 94 -35 -67 -179 -117 33 -168 -27 -203 -28 -97 -346 -74 163 122 -220
4879 -220 -118 114 -100 -274 -61 -17 -128 -145 -118 381 25 -284 149 -285 112 91 -152 91 -26 155 -19
4900 -19 9 33 51 8 188 -22 -82 115 96 51 21 208 -37 -114 51 -195 88 56 -234 -34 -195 -85 -149 -280
4924 -280 -35 -96 -245 -14 88 163 -93 -184 -127 -175 -220 55 227 -10 43 -151 -70 -66 73 -285 144 172 122 -67
4948 -67 -2 109 305 122 -300 54 194 -31 -127 -54 71 -6 115 101 -34 -88 -20 -117 -73 -124 106 -110 -13 -109
4972 -109 -62 75 135 61 -103 -42 -141 -25 30 -78 121 -77 201 -8 -177 181 -96 -11 -233 -269 52 19 -124
$$ packed form
4812E1j0k60L57J01j05k3P6n3j55J86k59K29k7m5j96J94J99j99j41J23J91j72
4834F2l5k1j01K00k02J86j04l1n8N8J15j68P0j81J44K5j4P5K31k33k08J14J71
4857I5J44J22k51j16o5J41K4j29l2j12O2J50k01J41j76J75o9k49K72K37m1l42
4879b20J02K32k14j74K13M4j11j7K7M99l56l09M33m34L97k1k43K43j17J81j74
4900a9K8K4J8m3J80k10o0J97j9m5l0J87k45p7J65k46K83l2k90K00j61J10o4j31
4924b80K45o1j49K31J02P5k56r1N7m8m5K75J72k37N3j94Q1MJ39l58M29K8n0j89
4948f7O5J11J96j83m22L54J40k25r6P3J25p7J21j4j35n4O8r7M4n1K30k16R7r6
4972a09M7J37O0p4j64O1r9J16N5j08J99j98K78k09j69L58k77Q5k22l6L21l3j43
$$ plain form
4995 -124 -137 -112 -51 -140 -119 144 129 -369 -105 64 -316 -71 229 74 -115 166 38 158 62 -41 8 142 155
5018 155 -1 102 -122 172 15 -114 78 -13 261 109 110 29 -13 -9 173 -65 29 -74 29 81 130 13 39 -15
5042 -15 -60 -151 238 -50 -37 287 -156 94 20 74 -54 -238 235 26 4 76 -57 246 100 198 -29 63 -20 -24
5066 -24 216 -192 68 159 -125 -69 -35 -116 87 -170 -22 -315 -75 76 -4 48 19 -156 22 181 55 -197 304
5089 304 -2 124 33 -70 108 -117 7 -310 179 204 45 -87 -112 -69 -26 -171 -150 -147 -165 114 134 73 -97 102
5113 102 27 -137 118 14 43 -105 -78 38 -46 167 208 54 108 328 -15 -73 221 -64 -157 176 136 56 -56
5136 -56 155 -55 7 37 -32 -143 134 -50 -129 63 -88 -78 -158 43 260 6 -148 -239 -77 -103 257 -286 -177
5159 -177 274 24 -132 -48 119 -1 44 2 110 73 82 -20 -351 182 -93 -312 -377 17 149 42 -49 -177 67
$$ packed form
4995a24j3K5O1q9K1K63j5m98K64J69l80K45L00j55j89K81j28J20r6j03M9J34J3
5018A55j56J03k24K94j57j29J92r1K74j52Jq1m2MJ82k38R4j03J03N2M9j17K6n4
5042a5m5r1L89k88J3L24m43K50p4N4j28j84M73k09k2P2j33L03j46R8k27R2q3m
5066b4K40m08K60R1k84N6L4q1K03k57J48k93K40J51q0N2k9j75J78J59j26k52N01
5089C04l06J26r1j03J78k25J24l17M89K5j59j32k5M3M3j45K1Lj8K79K0o1j70J99
5113A02p5j64K55j04K9j48K7J16q4K13M1j54N4K20l43n8K94k85r3L33m0q0j12
5136e6K11k10O2L0o9j11K77j84p9J92j51J0q0K01K17k54j54r1J62k6L60n43J09
5159a77M51k50j56Q4J67j20M5m2J08l7Rj02l31N33k75k19o5L94J32j07r1j28K44
$$ plain form
5182 67 116 -221 171 119 47 -160 172 144 -151 -398 -162 157 -138 229 112 84 -109 -115 13 395 70 4 -40
5205 -40 -48 -128 -145 -135 -261 -129 -261 81 62 -141 266 -197 82 319 -80 -163 -11 -116 301 -76 46 -10 110
5228 110 -43 89 176 -100 -373 -6 210 82 92 -117 -53 -107 177 -42 69 313 -282 -33 140 -94 -183 -131
5250 -131 25 -214 -48 -305 -157 153 -13 109 -361 319 -70 38 -104 -52 336 -252 205 -34 -34 50 242
5271 242 -137 181 -213 -88 272 -93 76 216 23 -49 79 121 160 94 158 250 146 -179 48 -152 -194 -19
5293 -19 20 -50 -197 160 222 -20 -113 90 -142 -5 -90 -146 -298 -114 33 137 -78 69 -53 133 48 128 -63
5316 -63 174 104 -107 -3 -80 -39 122 10 144 87 -193 -80 -28 28 -217 54 -146 24 27 312 -85 -23 -15 390
5340 390 216 -29 -118 76 -93 118 -3 82 -206 211 17 168 -284 -30 -26 -198 -35 -242 -227 28 -85 99
$$ packed form
5182F7M9l37L92n2p2k07L32k8k95k47K36L19k95L67j17k8j93oJ28L82l25o6m4
5205d0qq0j7J0j26J32j32L42j9k03M07m63K79K37l99q3J52j05M17l77J22n6J20
5228A10j53J32Q7k76k73L67K16j28J0k09O4n4K84k19J11K44n95K49J73k34q9N2
5250a31J56k39J66k57J48L10j66J22m70O80l89J08j42N2L88n88M57k39%Q4J92
5271B42l79L18l94J25L60l65J69J40j93p2J28M2L9o6O4R2j04l25K27k00m2J75
5293a9L9p0j47L57O2k42r3K03k32J37q5n6j52J84J47J04k15J47j22J86q5Q0j91
5316f3K37p0k11J04p7M1J61j12J34n7k80J13N2N6k45K71k00J70LK85l97O2QM05
5340C90j74k45q9J94j69K11j21Q5k88M17j94J51m52K54Mj72J63k07J5K55j13J84
$$ plain form
5362 99 16 -150 164 -139 19 -31 73 89 -90 128 56 55 -52 4 -245 65 8 100 46 48 -169 -62 -295 -4
5386 -4 -60 -146 -238 29 400 -179 -182 -157 -94 204 140 108 -102 2 -94 286 19 -171 -125 33 -50 62 -66 155 32
5411 32 81 299 -101 -228 102 126 207 -20 40 -49 -141 -146 -160 126 -97 64 -401 147 66 103 -38 -23 -60 -264 85
5436 85 -249 -6 -58 143 -45 86 -76 16 -225 -18 -127 247 -234 41 -6 -19 108 -9 -70 100 77 22 -33
5459 -33 58 99 -199 220 324 -307 108 187 -341 110 19 -6 74 135 120 215 140 71 -154 124 72 86 135 51 47 -131
5485 -131 144 -18 20 -46 -30 -97 123 -18 32 -124 -478 96 106 -32 -192 -157 102 -249 -52 -224 183 -202
5507 -202 0 -28 -38 -33 31 120 -4 134 -174 162 -178 -239 51 115 -161 -23 -26 -348 3 112 62 -46 55 -193
5531 -193 -176 -57 241 -160 -38 -213 -31 -61 -225 101 15 38 34 -123 -279 188 47 -175 173 -18 -30 -168
$$ packed form
5362I9q3j66L14l03J58n0J04J6j79K18p2jj07N6k49L10n7R2n4Kk17J07k33K91
5386dn6q6r2K67L71n79lK5O3K98o4l2k10J04r6L80k67j90M6J58q3J12j28K21j23
5411C2M9K18m00j27L30K4Q1k27O0q9r2nj4K86k23J61m65N48q1L7j41J5l7k04L49
5436H5l34K43n2K01j88J31j62R2k41K07j09L74m81K75m7j3J27j17o1J70k3n5n5
5459c3R1M1k98M19J04o31M15P9n28M51r1k5Q0O1j5R5p5o9k25K78n2J4M9q4mj78
5485a31K75j62L8o6J6o7K20j41N0j56l54N74J0j38j60L5K59l51J97j72M07l85
5507b02K02k8j0NO4Q9j24J38l08L36l40o1K90O4k76J38ll22L51J09n0j08J01k48
5531a93J7J19K98m01J22j75J82l0j64L26q6K3mj57j56M67j41k22L48j91j2j38
$$ plain form
5553 -168 -103 -282 166 92 103 195 -44 51 203 -74 -3 14 -5 -102 -55 5 -97 -65 -14 153 16 83 -183 65 -357
5578 -357 -202 -58 -94 -111 -169 181 199 258 -46 -53 -273 -119 -12 -66 -84 -2 75 -304 140 -153 -324 145 -382 -29
5602 -29 28 -82 127 -67 -201 172 46 132 -9 -237 53 -93 -94 44 -56 74 148 -203 -207 60 -28 -50 -464
5625 -464 48 103 11 -27 -176 108 25 41 -88 114 -6 -77 -155 301 74 -85 28 117 -14 -220 -37 29 -181
5648 -181 116 176 -396 2 -164 -40 -269 103 137 151 161 -180 33 -80 -76 24 16 222 145 -263 -108 0 -51
5671 -51 -166 -240 197 366 80 26 30 46 145 -163 83 -50 -57 143 10 -40 197 103 256 -235 -120 32 -56 81
5695 81 25 -177 92 83 -66 -236 162 220 -36 43 31 174 -163 5 13 122 66 70 -217 -17 388 120 133 215 130
5720 130 -170 54 -49 -60 -56 -123 124 198 -353 179 -118 7 93 -85 71 -261 41 -442 -47 -147 -163 80
$$ packed form
5553a68O5j79M48p4J1R2k39R5J52k77P1J7j9r7M7O0j02L2N1J67j37O7k66K48m22
5578c57J55J44l6j7n8L50J8N9l04pk20J54J07n4j8Q2P7l79M44k93j71M69n27L53
5602b9N7j10K09j94j34L73j26Q6j41k28K90j46jJ38j00J30P4l51mK67q8k2m14
5625d64N12N5r2l8j49K84q3J6j29K02j20p1p8M56k27j59J13Q9j31k06J83O6k10
5648a81K97O0n72L98j66J24k29L72L4J4J0l41K13j13MJ00qK06p7m08J55J08n1
5671e1j15p4M37J69k86n4MJ6R9l08K46j33pK00j33n0K37r4J53m91J15J52q8J37
5695H1n6k02K69rj49j70L98N8k56P9j2J43l37J68QJ09n6Mk87K00M05k68J3Q2q5
5720A30l00K24j03j1Mo7K47P4n51N32k97J25Q6j78J56l32L02m83L95j00j6K43
$$ plain form
5742 80 -124 116 406 -24 -33 -2 -375 -49 -56 58 69 194 242 -19 78 37 160 17 -35 24 -126 193 77 -2
5766 -2 -58 -97 -119 19 91 -47 79 -132 7 2 -66 -8 -120 217 74 93 -232 -21 -23 124 235 -102 95 -294
5790 -294 2 -82 -2 253 10 116 111 182 56 112 38 -248 -301 -179 -108 -66 -122 58 234 -133 -75 27 76 35 70
5815 70 -45 -142 10 -190 -14 -191 144 -159 303 -37 -96 -229 -348 180 -11 -2 -38 -1 -10 15 -178 -312 -174
5838 -174 -172 -99 -204 -68 -13 -142 98 48 89 -2 170 293 -98 238 181 68 -77 -56 178 -77 34 -3 -139
5861 -139 -38 24 98 -106 -171 102 -16 -262 -125 -109 122 -65 56 60 -78 -211 318 55 -8 -3 56 -162 -37
5884 -37 -143 -171 -46 -181 -162 14 23 284 380 -27 -141 -105 58 192 -216 91 -236 18 -312 238 -120 96
5906 96 -92 130 -186 125 125 43 -17 234 -120 -15 45 -174 -86 113 -129 -75 311 302 -52 -48 78 29 -21 -35 -6
$$ packed form
5742H0k04K40K90m30rL1l73L26pJ14J1J25M8k61R7m1J23j43n2N9j50L19j16p9
5766bn6l9k2J38P2j38J26k11J39no8N8j12L37j43J9l25K11kJ47J11l37J97l89
5790b94K96q4Q0K55k43J06nP1j26N6p4k86n3J22P1M2n6J80J76l67N8J02M9m1L5
5815G0j15r7J52k00J76j77L35l03M62l40n9j33j19N28j91Rl6L7rK5j93j34J38
5838a74KP3j05J36N5j29K40n0M1r1J72J23l91L36n7j13j45K1K34k55J11l7j36
5861a39J01O2P4k04o5K73j18k46J37J6K31j87J21Mj38j33N29k63o3NN9k18J25
5884c7j06k8J25j35J9J76RK61R6m07j14L6J63J34m08L07l27K54l30N50l58K16
5906I6j88K22l16L11%q2o0K51l54J05O0k19Q8J99k42N4L86rl54MJ26m9n0j4K9
$$ plain form
5931 -6 -172 -131 -5 -297 186 203 -8 -56 -110 54 113 -129 183 -141 -163 198 92 -119 103 35 -101 125 -91
5954 -91 83 199 189 -71 -8 12 111 260 228 -316 8 -84 197 -199 186 -127 0 68 179 247 -155 -34 47
5977 47 108 -69 25 129 4 -58 191 201 80 -378 -298 235 -100 26 -23 -309 121 158 -177 -88 165 -51 -2
6000 -2 86 4 94 11 -155 183 -84 -195 -47 -42 -266 -250 226 -33 -145 18 -193 -190 191 -172 -70 155 -82 -187
6024 -187 83 -51 -220 -154 32 192 46 -129 164 -117 62 176 -27 -209 83 101 -66 144 71 200 369
6045 369 -222 -275 -122 117 59 -124 -161 201 -156 104 142 115 -57 -256 -84 90 -89 86 -210 -47 93 80
6067 80 -106 -142 -322 74 -12 -73 -99 86 159 139 -111 -156 -80 -7 68 -118 309 -186 -119 -222 64 118 -73 -27 -191
6092 -191 -254 6 -175 13 -2 -285 -225 -155 150 -35 252 -209 -57 -56 56 -89 -3 -52 -67 -154 1 170 142 -38
$$ packed form
5931fj66M1J26k92M83J7k11m8n4J64N9k42L12l24k2L61j06k11K22o8j36K26k16
5954i1J74J16j0k60O3K0R9J49l2n44L24r2K81l96L85l13J27O8J11O8m02J21Q1
5977D7O1j77R4J04j25o2K49J0j21m58Q0N33l35J26m9k86M30L7l35Q9K53k16M9
6000bQ8q2R0q3j66L38k67j11J48Nk24J6M76k59j12J63k11LL81l63J02K25k37j05
6024a87K70j34j69O6J86J60j46j75K93k81J79J14k03j82K92J8j67K10p3J29J69
6045C69n91n3J53K39n8j83l7L62l57K60L8k7j72j99J72J74j79J75k96J63J40j3
6067H0j86l6j80L96q6o1k6J85P3k0k50m5P6P3P5j86M27m95O7j03K86N4j91M6j64
6092a91o3K60j81J88j5k83O0P0L05j85K87m61J52JJ12j45Q6m9j5q7J55J69k8j80
$$ plain form
6116 -38 -77 222 -50 -29 127 33 11 63 143 27 112 267 -340 92 86 136 -119 98 -196 211 -105 129 189 -149
6140 -149 -179 -210 -70 -8 -11 141 125 139 -76 -204 226 -4 -133 -85 203 -40 178 193 34 418 -152 165 -26
6163 -26 237 -147 -37 -129 55 112 55 212 -294 109 -163 6 -102 244 -100 32 33 -172 -17 59 43 -38 -294
6186 -294 -288 -34 93 257 169 -229 -20 -55 53 -36 26 -74 81 -50 -405 314 -28 -264 -107 -231 -83 -195
6208 -195 13 1 170 109 -86 -48 -165 96 118 144 15 -165 -56 70 91 86 72 -83 -149 -91 0 103 30 -56 104
6233 104 -77 -358 -147 -3 -377 -246 -32 195 -130 -298 -20 196 -17 -212 -56 -151 -145 86 -48 -16 116
6254 116 -224 -5 94 -170 104 132 311 -121 68 -270 -181 140 -140 215 126 -198 320 -39 75 -60 22 -78
6276 -78 -66 -102 255 -121 -167 117 250 98 -76 137 -95 130 59 -82 240 -150 -65 137 -55 247 -157 71
$$ packed form
6116c8l9K99k72K1J56r4k2N2Q0j16Q5J55o07M32oN0k55K17k94M07l16K34O0l38
6140a49l0l1J40O2lJ52j6J4k15j28M30k30j29M8K88k43K18J5j59L84n70L17j91
6163b6K63l84J10r2J84N7n7J57n06M03k72J69j08L46l44J32Jk05J55P6j6q1k56
6186b94OK54J27J64q8l98K09l5J08q9O2j00J55j31l55P19l42k36J57j24J48j12
6208a95K08j2J69o1j95L8j17K61K2K6j29j80J09J26K1nj4j55o6N8R1J03p3q6J60
6233A04j81k81K11J44l74J31K14K27l25j68K78K16k13j95J56r5OK31j34L2J32
6254A16l40K19R9k64K74K8J79m32J89l38Q9L21k80L55q9l24N18l59J14j35Q2j00
6276g8J2l6L57l76m6K84J33j52j74K13k32K25p1j41L22l90Q5K02j92L02m04K28
$$ plain form
6298 71 -110 -115 254 -88 54 277 -77 51 -82 -28 -103 46 197 -117 -61 -13 -53 -18 -379 47 -87 15 -415
6321 -415 145 -122 356 134 -98 87 -7 35 169 174 51 149 -95 -227 -3 226 -29 210 113 202 -73 -150 -102
6344 -102 74 -124 -374 74 -173 -81 -4 154 81 130 45 -95 152 241 -352 -96 83 -277 136 16 187 39
6366 39 -81 60 12 -210 226 52 -4 -13 -77 -155 -53 -26 10 -133 -136 47 124 -39 2 -256 -105 79 73 136 48 -95
6392 -95 -137 101 4 194 -62 -188 -25 -33 -180 9 -65 -195 183 -175 9 -166 57 -41 11 148 43 -63 58
6415 58 228 151 -158 172 -19 -71 -220 -11 304 -197 2 -147 80 -37 55 352 -17 105 90 17 201 167
6437 167 -220 88 221 -51 -249 -32 201 199 -220 -119 -69 -23 198 168 27 69 -119 77 221 -25 -48 155
6459 155 77 157 109 -113 -271 -20 79 93 145 -278 -324 -282 25 91 -117 -120 -75 214 21 40 10 116 73 -416 295
$$ packed form
6298G1j81nL69l42J42K23l54J28j33N4p5J49J51l14N6M8m0L5l61M26j34J02m30
6321d15N60k67M78k22k32J85r4M2J34Nj23R8k44j32K24K29k55K39r7Q9k75p7M8
6344a02J76j98k50M48k47R2P7J58p3M9q5j40K47Q9n93K56J79l60M13j20J71j48
6366C9j20J41m8k22M36j74n6ro4p8J02K7L6j43lJ83P7j63M1k58J51J84oO3q8j43
6392i5m2K38r7J90k56j26J63qj47J89p4j30L78l58J84j75K23r8N2J37j05j06J21
6415E8J70p7l09L30j91n2j49K09L15n01J99j49K27j17R2K97l69J22j5p3J84l4
6437A67l87L08J33k72j98K17K33km19J01N0M6K21l0j41M2j88J96J44k46k3K03
6459A55p8Q0m8k22j58K51R9J4N2m23m6M2L07O6k08lM5K89j93J9l0J06m3m89P11
$$ plain form
6484 295 -36 -30 -84 -52 -129 68 -41 -167 -2 91 50 242 53 8 -43 -91 42 69 -148 -126 20 11 7 315 20
6509 20 -332 317 -98 -118 51 -13 48 -148 109 -40 84 -67 -76 -155 -33 -34 -4 243 65 41 -170 124 57 6
6533 6 -78 -94 -170 -18 139 87 55 3 -29 -156 78 -16 158 55 -224 18 83 -175 39 -89 113 -51 -59 -138 98
6558 98 -139 107 94 -88 31 -78 -107 26 46 -203 -127 56 142 -127 -22 119 58 -212 66 10 37 157 -12
6581 -12 57 83 -22 -55 100 -64 166 -117 -32 -99 -284 100 -177 -10 -7 130 15 10 63 -45 -38 279 -129 22
6605 22 -115 -96 -2 -68 75 68 73 28 -42 -139 166 -130 -20 148 -107 -121 208 -93 -32 22 185 77 86 86 52 203
6631 203 15 -188 44 46 98 363 -182 9 168 -174 -75 -15 91 -322 -141 14 127 -21 -165 -65 54 144
6653 144 321 102 -66 -152 -21 -82 -202 313 -84 103 -147 60 -147 92 -263 -121 -97 -226 155 166 8
$$ packed form
6484B95l31On4L2p7J97j09j26J65R3m1J92j89m5n1m8J33K7k17K2J46rmL08k95
6509B0l52O49m15k0J69o4O1j96K57j49J24j51rp9J22jL0K47j78k4k11K94o7n1
6533Fq4j6p6J52J57n2l2n2l2j27K34r4J74j03k79K42O5k58K14j28K02j64qp9K36
6558I8k37K46j3j82J19j09k9J33K0k49P6J83Q6k69J05J41o1k70K78n6K7J20j69
6581a2O9K6j05l3J55j64K30k83Q5o7j85L84k77J67LJ37j15nN3j08PL17m08J51
6605B2j37J9R4o6J43pNm5p0r7L05k96J10J68k55j4L29l01O1N4J63j08R%l4J51
6631B03j88k03K32KN2K65n45J91J59l42R9O0J06m13J81J55J13j48j44J00J19R0
6653A44J77k19j68q6J31o1j20N15l97J87k50K07k07K39l55J42K4j29L81J1j58
$$ plain form
6674 8 211 264 6 -25 -198 -21 120 258 -150 -194 -29 150 -97 -51 -116 3 23 -9 -77 175 -142 107 431
6697 431 -28 35 225 -33 66 66 -143 196 -105 -42 -50 -158 206 119 206 -95 127 98 -47 95 148 107 50 23 29
6722 29 204 -64 -252 -109 159 122 286 8 -105 55 168 205 161 130 34 33 -127 67 120 56 -200 109 -114
6745 -114 -151 22 84 199 95 250 -225 147 -148 -158 124 209 -85 -36 144 132 290 167 -27 -150 231 262
6767 262 486 85 -170 73 -24 -147 -45 -225 212 -29 -34 -110 -88 -131 -84 13 -197 251 45 91 121 241 288 -121
6791 -121 -90 38 75 -119 -87 82 -236 20 -120 -46 266 -225 201 44 -118 -153 -69 55 -181 -348 -139 -94
6813 -94 7 115 113 268 -138 89 230 25 -140 -213 -110 152 -124 -10 241 224 -189 234 -229 32 -12 22
6835 22 36 -267 57 165 196 -122 -81 88 25 68 139 -117 -73 220 93 156 259 -82 -18 31 78 -60 -49 69
$$ packed form
6674HK03N3k58l1j73J77J41J38m08m4J65J79k47M6o5J19K0l2o8K52l17K49L24
6697D31m59O3J90k58R9%k09L39l01O3qj08L64q7Q7l01K22k9j45J42N3m1n7k7O
6722B9J75k68j88J43K68l7J64k78j13J60J13L7m4l1r6jj60J94N3o4k56L09k23
6745a14l7J73O2J15j04J55m75L72k95j0K82Q5k94M9J80j2J58j23j94j23L81L1
6767B62K24m01k55K43r7j23J02j80M37k41np6K2m3M7R7k10M48k06M6L0J20M7m09
6791a21L1J28L7j94L2J69l18K56j40P4L12m91M26j57j62l5Q4J24k36j67K09M5
6813i4J01J08kJ55m06K27J41k05j65p3J03K62k76J14K51j7m13M23m63K61m4L4
6835B2J4l03L24J08L1l18M1J69o3M3P1k56M4K93j27O3J03l41O4M9M7j38J1J18
$$ plain form
6859 69 48 -7 172 58 272 15 54 -21 -101 119 -169 -17 -25 -40 5 -111 -124 80 145 34 43 -207 157 188 -29
6884 -29 -18 206 164 243 -236 39 22 21 64 -17 68 136 -347 -72 215 -65 31 157 171 -7 -23 -35 -104 41 115 151
6910 151 -32 120 -144 -95 19 -273 -117 -293 -108 24 -176 -26 48 -277 -308 -216 60 204 224 73 -105 -4
6932 -4 95 45 -148 -17 -132 -120 -144 -158 51 155 337 -74 -21 -32 244 128 19 -18 86 131 17 -111 -283 10
6956 10 374 -2 35 -143 -55 -176 57 46 211 -55 -51 14 194 -117 -111 -248 72 -207 65 113 -50 298 -202
6979 -202 252 43 317 -31 437 166 15 -42 177 28 -61 13 33 -221 86 12 110 79 18 -35 236 -84 -45
7002 -45 -79 261 21 47 219 -206 -28 -97 6 279 -145 -197 116 -55 25 31 25 -83 136 -205 -172 -228 -26 -4
7026 -4 51 126 19 -125 198 207 155 55 -112 -53 12 122 -197 -37 165 -29 -108 103 293 59 -48 -129 -364 414
$$ packed form
6859F9k1n5J79j14K14k57L9p5q0K20k88J52qj5M5j16j3K04O5j11Rk50L64L1k17
6884b9J1K24m2P9m79K75j7jM3q1Q5O8m83K75K87k80R6J26J4j78j6j2o9J45P4L6
6910A51j83J52k64M9J14k92J56j76J85J32k00J50P4l25l1R2K76J44K0j51j78J01
6932dR9n0j93J31j15J2k4j4K09J04J82m11N3j1K76j16j09l7J04M5j14j28j72K93
6956A0L64l76L7j78Q8j21K33j1J65k66MO5J80l11Oj37L20k79K72M8j63L48n00
6979b02M54k09K74l48M68k71j51n7K19j49q9P4K0k54L07p4R8l1o1n3K71l20L9
7002d5l4L40k40K6J72m25J78o9J03K73m24n2L13j71Q0Ooj08K19l41L3n6K02K2
7026dN5P5j07j44L23Rn2j00j67N9O5J10l19J60K02j94p9K11J90k34j07q1k35P78
$$ plain form
7050 414 123 -30 -83 33 253 -327 -42 -294 -60 38 -47 60 -86 64 -53 -58 103 205 -200 -20 -37 86
7072 86 -53 144 -45 50 -110 -99 -198 9 28 -171 138 35 83 16 33 -52 -278 46 -20 207 -172 76 -283
7095 -283 -87 5 -25 -28 114 -112 67 -42 146 -11 169 165 190 69 109 -57 -25 -21 -223 243 68 -142 -172 91
7119 91 -185 -71 211 126 -116 15 -202 -127 -175 43 -111 157 29 -108 175 -95 -43 -8 -25 4 283 20 127
7142 127 -36 -56 -313 425 -173 -185 -90 -32 83 -20 71 -142 -122 -193 7 257 171 -48 -197 28 240 102 201
7165 201 -55 78 137 168 7 205 118 -37 -156 -35 -30 189 20 -50 -246 226 21 14 -240 -98 -110 175 -88
7188 -88 83 -69 -149 -1 52 120 -11 -65 -27 108 164 -74 -104 49 -382 72 -216 -42 -88 -28 -82 -71 31 202
7212 202 39 -241 -119 21 71 409 34 -173 -52 -90 -112 -156 -89 109 -209 97 -21 -19 30 -94 -104 -69 -135 -213
$$ packed form
7050D14k91j53n3J16K20n80K85k52K34R8q5J07j46J50j17nJ61J02m05J80j7J23
7072H6j39J97j89R5j60J1r9K07J9j99L09j03M8o7J7q5k26L24o6K27l79K48l59
7095b83J96R2l0lJ42k26J79j09J88j57J80mK5j21M0j66L2Mk02M66j75k10l0K63
7119I1k76J14K82q5k42J31k17P5m8K18j54K68j28j37K83k70N2L5j7K9K79k63J07
7142A27j63k0k57P38n98j2R5N8J15j03R1k13K0p1K00K50q6k19j49K25K12j38R9
7165B01k56J33N9L1j61J98q7j55j19J21NK19j69p0j96M72k05pk54J42j2K85k63
7188h8J71j52q0J48N3O8j31n4L8J35N6k38l0J53m31M54k88J74m6O0n4J1J02J71
7212B02j63k80J22J40N0L38l75k07J21l8k2m4O7J98l18L06j18KM9j24j0L5o6p8
$$ plain form
7236 -213 -85 -31 56 34 169 295 248 -37 65 198 -136 -62 -69 54 -152 80 47 22 21 61 -159 -116 -27 -211 -90
7261 -90 -131 28 -107 189 -39 136 226 92 -69 137 120 -71 80 -89 -145 62 33 -15 -87 -3 -160 -393 -16
7284 -16 -144 91 -96 26 74 -125 113 106 20 -74 221 95 226 28 -215 -76 -191 -54 -21 -124 216 -202
7306 -202 -14 96 -194 -113 107 132 -171 106 -7 -49 49 -234 122 -42 -19 -138 98 -15 -259 -75 -57 -136
7328 -136 -161 139 -150 -89 -237 1 -165 277 -9 157 17 43 -125 -101 97 -33 191 177 182 -49 32 32 -149
7351 -149 -56 -224 208 -110 11 229 -132 36 119 91 -32 82 -69 224 164 -120 -35 -59 378 -30 161 -76
7373 -76 -95 -74 -182 -146 29 90 186 209 147 -173 -58 -29 58 53 85 -27 195 312 66 6 140 -15 -2 58 90 -14
7399 -14 122 -167 113 -114 138 20 17 126 138 -13 -90 75 -203 71 71 0 -24 35 -43 27 -151 -110 -69 -33 -224
$$ packed form
7236b13J28N4Q7k2J35J26m7k85J02J33l34P4pJ23k06K32l3k5jM0k20M3Q9j84J21
7261i0m1J59j35K96k28J75R0j34j61K06j7j91J51j69n6K07k9m8p2Q4j57k33L77
7284a6j28K35j87J22M8j99K38pq6r4K95j26J31j98k43J39j15J37L3j03L40m18
7306b02J88J10k90Q1K20K5l03K77j13m2R8k83L56j64K3j19K36j13k44J84J8p9
7328a36k5L00k89O1j48K38j66M42k86J66j40K6j68K4J98j30K24j4Nk31Q1%j81
7351a49R3j68M32l18J21K18l61J68Q3k8j23J14j51K93o0k84Q5k4M37m08J91k37
7373g6j9K1j08L6J75O1R6K3o2l20J15K9Q7nL2j12K22J17k46o0J34j55J3O0L2j04
7399a4J36k89K80k27K52j18lJ09J2j51p7J65k78K74%p1k4N9p8P0j78M1M1L6j91
$$ plain form
7424 -224 31 62 -53 -52 -22 349 -34 -363 -232 -152 -137 147 155 97 316 -163 82 -85 218 54 32 -109 -69 -163
7448 -163 40 -115 -1 104 -94 -38 -190 -322 6 -264 31 370 -120 83 53 -80 -120 -199 -43 171 265 127
7470 127 169 41 68 -250 -48 242 -184 -23 -34 -5 298 -57 -48 13 71 299 10 53 165 107 106 185 266 78 127
7495 127 -245 -141 -50 24 -138 34 318 106 11 -89 -49 130 -73 101 73 32 -406 344 292 -235 277 -233
7517 -233 70 13 -25 -141 114 25 -63 -75 -36 87 30 -100 -113 -234 108 130 89 -125 243 -47 -15 -171 -127 251
7541 251 193 38 -58 6 81 233 -31 -34 -161 -57 72 -255 18 -18 -8 8 81 -100 -356 87 187 2 -41 -33
7565 -33 94 37 -61 -62 -55 -194 201 98 62 -124 -49 -151 169 -102 213 -62 4 -427 -251 -275 -313 129 72 -133
7589 -133 -86 81 -199 -21 150 80 -331 160 -13 246 -89 158 -103 10 -55 160 -71 -20 -23 57 4 -80 30
$$ packed form
7424b24K55L1j15JL0L71l83l29J31Q0J5K84Qn8K19m79K45j67L03j64k2j41M0r4
7448a63K03j55J14J05j98N6j52j32L28k70K95L39m90K03l0j33m0p9J56K14R4j38
7470A27M2j28K7l18K02K90m26J61j1K9L03l55RO1N8K28k89M3J12n8jP9Q1j88M9
7495A27l72J04R1P4j62J72K84k12r5j00M0J79k03J74k8m1m38P50n2n27N12n10
7517b33L03n7l8j16K55q9q8j2L9J23n7j30j3j21L42K2m1k14L68k90L2j56M4L78
7541B51n8j55r6O4P5J52k64lj27J04J29l27K73l6J0J6P3j81k56M43J00j85m3Q
7565c3J27n7r8jPj39L95j03l6j86P5j02L20k71L15k75O6m31J76k4l8M42n7k05
7589a33M7J67k80J78J71p0m11M91j73K59l35K47k61J13o5K15k31N1lQ0n3q4J10
$$ plain form
7612 30 102 184 101 264 -126 -18 39 -14 82 -100 -167 38 87 -141 86 -67 254 -225 -181 25 241 25 -50 23
7636 23 -137 214 2 -165 -119 70 -14 86 -42 -135 295 -79 195 75 97 42 198 134 -4 197 140 -88 137
7659 137 98 -15 -45 18 54 -74 -122 68 59 -149 273 -199 90 125 -218 203 -66 66 -190 -113 -28 -56 -147 -269
7683 -269 -81 274 117 -110 207 -202 48 55 222 55 -307 -73 30 -45 185 171 -66 -274 -80 -22 47 172
7705 172 94 151 -9 88 352 -246 139 287 62 -65 109 -133 91 -116 314 -92 -141 -5 -76 32 -51 158
7727 158 57 -88 -122 217 -105 215 129 43 -8 104 85 116 22 -278 -43 -30 12 24 -32 -89 124 115 129 -177 -103
7752 -103 -242 6 245 -90 119 -18 -289 -170 -136 -25 27 93 -194 -128 -128 156 168 -121 206 131 -56 87 -70
7775 -70 -83 -161 -37 344 102 -94 -217 172 24 -33 143 -57 -134 192 -38 -195 61 273 -109 57 -175 -243
$$ packed form
7612C0P2Q2q3J63l90J08N7n3R6j82o7K05M9k28K27j53L21m79M4K06K16k16p5P3
7636B3j60L51k12j67M6J89q4J00j28r3M30l74K74j20K2n5J56o4j38K01n7k28K25
7659A37l9j13l0O3L6j28m8J90rk08M22m72K89L5l43M21k69J32k56P7Q5k8r1j22
7683b69J88L55j57k27L17m09K50PJ67j67l62K34J03p5K30j4k37k08J94N8O9J25
7705A72p8N7j60R7K64n98L85J48k25j27J74k42K24k07M30m06m9J36p1J08q3K09
7727A58j01j45l4L39l22L20q6q6n1J12j9L1r4l00K35J3M2J2n6n7K13rJ4l06P4
7752a03j39K48K39l35K09j37k71J19L4J11N2O6k87O6%K84J2k89L27p5j87J43j57
7775g0j3p8J24L81k42j96j23L89j48n7J76k00p7L26k30j57K56K12l82J66k32o8
$$ plain form
7797 -243 129 81 -78 -15 122 -11 -78 -125 -44 -249 9 100 -47 14 -236 223 263 6 33 193 105 -195 46
7820 46 -11 36 -117 -296 38 -62 157 -104 -220 101 -35 -1 101 -2 -314 22 214 51 277 -116 307
7841 307 70 -449 -92 60 102 75 -100 -125 5 -312 38 136 -276 -211 15 -72 -122 182 84 -38 76 -60 128
7864 128 87 -180 13 -273 -208 -73 -235 -68 206 53 -39 -38 -248 -272 27 -167 -144 246 79 -250 11 -47 171
7887 171 178 -50 -117 -126 81 -122 -75 -163 -159 -97 208 248 -66 26 42 35 -216 -320 45 317 -73 -23 153 48 76 25
7913 25 338 -217 -64 28 185 32 112 101 -96 196 66 56 20 -239 30 -250 65 -166 -103 27 -135 -321
7935 -321 -222 -217 125 -250 47 -57 -122 6 116 -130 -26 -235 -148 325 182 84 67 -115 -12 -38 27 -83 -61
7958 -61 278 -78 32 -176 -91 185 -117 -59 -143 -162 -128 83 135 41 22 235 -6 172 82 258 35 18 184 -283
$$ packed form
7797b43L72m8j59O3J37j33o7m7Q1k05K58R1j47O1k50M59M0k57K7J60q8l00K41
7820D6n7M7j53j79L34j00K19k61j16L21j36L4J02j03l12L36J92j63K26l93M23
7841C07k37n19L57J52M2k7j75k5J30l17L50R8m12O5K26q7n0L04r8j22J14j36J88
7864A28m1k67J93k86O5J35j62J67K74j53r2Jk10k4K99j94K3L90j67l29K61n8K18
7887A71Pk28o7rK07k03M7q8MO2L05M0l14R2J6pk51j04L65K72l90N0J76j05K8n1
7913B5L13n55J53R2J57j53Q0j1j97K92j30j0l6k59K69k80L15k31O3J30j62j86
7935c21R9NL42l75K97j04o5J28J10k46J04k09Q7M73j43r8j7j82J03k6O5j10K2
7958f1L39l56J10k08Q5K76l02N8q4j9L4K11N2r4j9K13k41J78r0J76k23j7J66m67
$$ plain form
7982 -283 162 -58 63 182 -265 -28 -199 -7 -314 -120 221 -37 62 77 -61 -61 -319 48 37 122 -69 -53
8004 -53 -223 -239 -79 -92 -280 -108 44 -233 -71 419 -25 -153 -138 -338 -27 292 23 260 174 62 -124 -360
8026 -360 -112 -110 349 -218 -49 -118 -55 -109 -138 28 52 -46 -15 106 -356 -36 249 101 -263 342 -108 223 92
8049 92 -156 53 -20 -113 -24 0 -84 276 -61 149 -26 -36 -43 91 -269 -111 -60 -61 315 -11 -149 312 14 111
8073 111 -173 -154 -47 -164 -45 49 47 -168 -1 -28 42 -31 168 -13 -47 -155 -48 -217 -61 -47 247 -280 -221
8096 -221 49 -41 10 -187 -49 44 178 -335 127 -18 7 -47 -430 172 14 -225 92 -52 62 51 -61 -191
8118 -191 173 -83 -34 58 -421 -201 86 42 -120 -250 150 95 184 49 -110 229 -67 -177 -43 -98 -174 53
8140 53 218 261 -385 -61 -84 22 208 108 89 -220 77 197 -169 75 -141 129 -184 -7 -56 25 186 211
$$ packed form
7982b83M45k20J21J19m47K37j71J92l07J94L41k58R9J5j38%k58L67j1Q5j91J6
8004e3j70j6J60j3j88J72J52k77J62M90m44j28J5k00L11L19k69K37q6j12j86k36
8026c60K48KM59n67J69o9O3n4k9J66K4r8L1J21m62L20K85j48l64O05m50L31j31
8049I2k48K09p3r3Q9K4q4L60l37K10j75j0pJ34l60J58N1jL76l26j38M61k98R7
8073A11k84J9J07j17J19R4kk15J67k7P0p3J99j81l4j08J07j69J56J4K94n27N9
8096b21K70r0N1j97J38R3J34n13M62j45K5n4l83O02j58k39L17j44J14j1j12j30
8118a91L64k56M9R2m79K20K87m4j62j30M00n5Q9j35j59L39k96j10J34n5p6K27
8140E3J65M3o46L24k3J06J86j00j9l09K97J20l66K44k16K70l13J77m9Q1J61K5
$$ plain form
8162 211 -36 -6 90 -269 114 193 -275 45 5 67 -25 -338 -126 -74 2 23 123 -210 -146 164 175 141 139 -35 68
8187 68 212 126 -178 -79
$$ packed form
8162B11k47L0R6l59L83P9m68L20m0O2r2l13K12N2P6K1J00l33O4L10J1l4kj74J03
8187F8J44q6l04R9
8191g9
$$ Imaginary data points
##PAGE= N=2
##DATA TABLE= (X++(I..I)), XYDATA
$$ plain form
0 0 0 0 0 0 0 0 0 0 0 0 0 0 0 0 0 -8 8 -8 8 -8 9 -16 16 -17 24 -25 32 -35 41 -48 56 -63 71 -81 89 -101 114
37 114 -128 143 -159 178 -196 219 -243 268 -294 325 -359 397 -436 481 -529 585 -643 712 -788
56 -788 874 -974 1090 -1225 1390 -1591 1845 -2175 2629 -3288 4344 -6316 11288 -57126 -54589
71 -54589 37543 30294 8941 -6497 9189 14190 22863 13692 -10618 -35384 -14719 21999 26969
84 26969 -6116 -17948 5129 31249 28361 7685 -20422 -39708 -32891 1963 22202 3390 -23100
97 -23100 -10286 22972 30009 4000 -17300 -16999 -4559 7000 11734 787 -16050 -12677 15626
110 15626 33667 15919 -14637 -21984 -6491 5953 3463 -6774 -15710 -12504 8071 27227 18369
123 18369 -9544 -20209 -1374 15093 7071 -11441 -17207 -6779 8566 18944 14592 -3528 -15633
$$ packed form
0@%%%%%%%%%%%%%%%qJ6j6J6j6J7k5L2l3M1m9N7o7P6q9J04j19J34j52J70j90K15
37A14k42K71l02L37l74M15m62N11n62O19o84P56q33R17j010J114j228J355j500
56g88J662j848K064k315K615k981L436m020M804n917P632j0660J7604o8414K537
71e4589R2132p249k1353j5438J5686N001Q673r171k4310k4766K0665L6718M970
84B6969l3085j1832K3077K6120k888k0676k8107j9286O817L4854K0239j8812k6490
97b3100J2814L3258P037k6009k1300L01J2440J1559M734j0947j6837L373K8303
110A5626J8041j7748l0556p347J5493J2444k490j0237q936L206K0575J9156q858
123A8369k7913j0665J8835J6467q022j8512n766J0428J5345J0378m352j8120j2105
$$ plain form
136 -15633 -7301 9103 8198 -9755 -20982 -11059 7361 17123 11525 -1870 -9367 -2250 11314 12044
150 12044 -3970 -17881 -12074 6899 17218 9402 -4077 -8966 -1623 7846 7321 -4754 -17270
163 -17270 -15019 1431 13978 9009 -5356 -9759 -153 11080 9830 -3021 -13389 -10499 3005
176 3005 12893 8631 -3630 -8656 287 10718 9954 -2695 -12840 -10232 1370 9218 5394 -4904
190 -4904 -8910 -1841 8510 9729 -516 -10794 -9332 1874 9334 4797 -5368 -8225 -970 8864
204 8864 9635 990 -8718 -8010 1497 8658 3872 -5966 -9208 -1582 8050 9161 811 -7447 -6190 1954
220 1954 7654 3303 -5909 -8907 -2047 7329 8270 458 -7000 -5485 1849 6825 2533 -5543 -8447
235 -8447 -2711 5713 7644 857 -5945 -4454 2411 6958 3106 -4689 -7415 -2391 5156 6996 1328
$$ packed form
136a5633Q332J6404r05j7953j1227R923J8420R762n598j3395p497P117J3564P30
150A2044j6014j3911N807J8973J0319p816j3479m889P343R469n25j2075j2516
163a7270K251J6450J2547m969j4365m403R606J1233j250j2851j0368K890J3504
176C005R888m262j2261n026Q943J0431p64j2649j0145K608J1602P848l824j0298
190d904m006P069J0351J219j0245j0278J462J1206P460m537j0165k857P255R834
204H864P71q645r708P08R507P161m786r838l242P626R632J111q350q258J257Q144
220A954N700m351r212k998O860R376R41p812p458J515P334M976m292q076k904
235h447N736Q424J931o787o802J491O865M547l852p795k726N024P547J840n668
$$ plain form
250 1328 -4738 -4030 2949 7077 3213 -4783 -7977 -3033 3987 5345 -132 -5630 -4733 2311 6624 2871
266 2871 -4139 -7219 -2563 3849 5172 542 -4285 -2462 3604 7039 3761 -2836 -5985 -2340 3203
281 3203 4224 -614 -4906 -3372 2199 5406 2621 -2707 -5908 -2657 2271 3326 -579 -4334 -3117
296 -3117 2643 6240 4198 -1407 -4306 -1389 2630 3705 -569 -4335 -3223 2007 5290 3316 -1955
311 -1955 -4510 -2109 2036 2460 -1435 -4846 -2960 1751 5023 2866 -1088 -3275 -1042 2515 2640 -656
327 -656 -4524 -2872 1401 4563 2904 -863 -2977 -942 2344 2344 -958 -3971 -3120 936 3919 2918
343 2918 -788 -2283 -638 2358 2416 -746 -3773 -3108 341 3291 2389 -998 -2666 -849 2340 2001
359 2001 -871 -3876 -3111 328 3169 2103 -633 -1518 190 2363 2556 -138 -2743 -2299 341 2257
$$ packed form
250A328o066P08O979M128l864p996l194M944P020J358n477n498Q97P044M313l753
266B871p010l080M656O412J323m630m827J823O066L435l278o597l149L645N543
281C203J021m838m292J534N571L207k785n328l201L251M928J055l905l755J217
296c117N760L597k042n605k899K917M019J075m274l766J112N230L283j974n271
311a955k555K401M145M24l895l411J886M711L272k157l954k187K233L557J25l296
327f56l868J652M273L162j659l767k114K035L286%l302l013Q51M056K983j001
343B918l706j495J645K996N8l162l027O65L449K950r02l387j668J817L189l39
359B001k872l005P65L439K841j066k736q85J708K173J93k694k605M44K640J916
$$ plain form
375 2257 1478 -960 -1803 -514 1920 2177 -296 -2741 -2803 -237 2030 1113 -880 -1520 -282 2035 2479
392 2479 343 -2128 -2514 -279 2277 1452 -694 -1563 -75 2059 2332 -53 -1910 -2217 -143 1359
408 1359 1253 -905 -1730 -8 1903 2117 -13 -1719 -1534 116 943 947 -1119 -1581 -559 1544 2031 580
426 580 -1106 -1258 59 1256 826 -472 -1338 -550 1387 1930 865 -1117 -1216 172 973 396 -1035 -1515
444 -1515 -570 872 1606 579 -938 -1055 -250 1076 285 -736 -1367 -3 892 1534 644 -534 -796 15
462 15 1127 631 -1117 -1392 -244 1210 840 -83 -443 -373 374 706 611 -559 -1405 -717 488 867 260
481 260 -456 -605 -118 350 382 -785 -1051 -646 350 1137 321 -962 -375 771 768 694 -180 -573 -471 345 1004
502 1004 424 -849 -608 310 974 -176 -765 -810 -354 129 582 -76 -222 -555 116 563 388 -185 -476 427
$$ packed form
375B257p79k438q43J289K434K57k473k445o2K566K267r17j993o40J238K317M44
392B479k136k471l86K235K556q25k146q69J488K134K73k385j857l07K074J502
408A359j06k158q25J722J911K14k130j706J85J650Q27Mk066m62J022K103M87j451
426E80j686j52J317J197m30j298q66P88J937N43j065j982r9J388Q01n77j431m80
444a515R45J442P34j027j517j17Q05J326p91j021o31J364Q95O42q90j178k62Q11
462A5J112m96j748k75J148J454l70r23l60P0P47L32r5j170q46O88J205L79o07
481B60p16j49M87M68L2j167k66M05R96P87q16j283N87J146lp4q74l93J02Q16O59
502A004n80j273K41R18O64j150n89m5M56M83M53o58j46l33O71M47j75n73k91R03
$$ plain form
522 427 591 180 191 -156 -307 -119 587 680 -39 -763 -110 269 -54 -414 -500 -543 56 306 597 -1 -339 -367
544 -367 384 196 -131 -705 -245 168 365 243 193 56 -232 310 189 -27 -530 -501 108 575 497 -109 167
565 167 76 274 -17 206 -503 -315 25 82 -51 -9 -101 -259 70 68 77 -160 -283 -187 327 192 -44 35 305 45
589 45 155 -33 -226 -494 -130 177 -23 87 -408 -55 -158 -113 63 -462 -74 -48 327 351 15 -201 366 200
611 200 258 91 71 150 113 -87 130 -187 145 145 185 71 10 37 -69 -220 -29 -90 -143 41 52 285 372 -122 -145
636 -145 -74 -32 77 -207 27 -397 -185 -60 110 251 -24 -195 86 -84 -43 -263 27 78 468 254 271 98
658 98 -60 204 -124 -39 -478 -126 -20 -157 123 344 -34 -186 -2 -111 -90 -258 -178 231 369 -29 122 322
680 322 -8 -29 -70 -60 12 -109 28 15 119 99 78 123 4 153 -287 95 4 -231 -113 95 106 -122 107 -203
$$ packed form
522D27J64m11J1l47j51J88P06R3p19p24O53L79l23l60q6m3N99K50K91n98l38k8
544c67P51j88l27n74M60M13J97j22n0j37k88N42j21k16n03K9O09M67p8o06K76
565A67r1J98k91K23p09J88L40N7j33M2r2j58L29kRk37j23R6N14j35k36P9K70k60
589D5J10j88j93k68L64L07k00J10m95L53j03M5J76n25L88K6L75K4l36k16N67j66
611B00N8j67k0P9l7k00K17l17L32%M0j14o1K7j06j51J91o1n3J84J1K33Q7m94k3
636a45P1M2J09k84K34m24K12J25J70J41k75j71K81j70M1k20K90N1L90k14J7j73
658I8j58K64l28Q5m39L52J06j37K80K21l78j52J84j09K1j68Q0M09J38l98J51K00
680C22l30k1m1J0P2j21J37j3J04k0k1M5j19J49m40L82r1k35J18K08J1k28K29l10
$$ plain form
704 -203 -25 -136 115 -35 -75 -171 -221 87 22 -111 12 -70 -147 -156 167 215 -198 78 -155 -6 46 -113 135 44
728 44 -236 62 95 -217 -25 85 367 62 187 148 -51 215 -128 65 -147 390 -232 132 210 -109 -35 -160
750 -160 42 -126 -109 109 -109 250 80 -33 186 -32 258 -64 39 -43 44 308 14 111 10 -81 -65 121
772 121 -11 8 101 -96 -242 -233 -95 -305 -159 91 422 178 102 6 43 -70 80 -76 -119 -320 -148 46 -248
795 -248 -49 -93 35 -13 288 -220 28 75 -20 34 27 109 163 204 58 -240 -61 -49 -139 -71 150 120 -104 127 285
820 285 61 -295 16 -92 -352 -151 82 403 -197 9 -58 178 2 37 -133 188 279 -35 -4 83 -18 251
842 251 175 -152 -258 -11 -100 -33 -80 205 52 98 -41 127 27 -220 -174 60 -22 104 -32 -159 -26 -61 -50
865 -50 167 -222 79 91 -136 270 121 -89 124 32 260 68 89 170 315 108 -298 4 -4 146 -147 -95 -175
$$ packed form
704b03J78j11K51j50m0r6n0L08o5j33J23q2p7rL23M8m13K76k33J49N2j59K48r1
728D4k80K98L3l12J92J10K82l05J25l9j99K66l43J93k12N37o22L64P8l19P4j25
750a60K02j68J7K18k18L59j70j13K19k18K90l22J03q2Q7K64k94R7j01r1J6J86
772A21j32J9R3j97j46RJ38k10J46K50L31k44p6r6L7j13J50j56m3k01J72J94k94
795b48J99m4J28m8L01n08K48M7r5N4pQ2N4M1j46k98J79J2r0O8K21l0k24K31J58
820B85k24l56L11j08k60K01K33L21o00K06o7K36j76L5j70L21R1l14L1Q7j01K69
842B51p6l27j06K47q9O7m7K85j53M6j39J68j00k47M6K34q2J26j36j27J33l5J1
865e0K17l89L01J2k27M06j49k10K13r2K28j92K1Q1J45k07m06L02qJ50k93N2q0
$$ plain form
888 -175 -280 -148 -157 58 47 -130 -248 -61 248 -97 117 -116 106 -43 191 -97 -17 53 161 6 86 198
910 198 -35 -102 169 31 -131 86 -50 -112 223 -49 -146 98 -60 -189 55 89 -47 19 73 380 322 163 -23
933 -23 157 235 -200 318 -71 -6 67 -217 46 311 147 154 -27 72 -203 81 -46 34 -112 -274 91 70 -122
956 -122 -204 -156 106 4 86 -290 84 -152 -57 -117 -10 165 215 -30 -82 -111 -72 333 7 -13 71 -111 -341 99
980 99 167 80 52 -16 117 48 -113 147 84 -91 43 273 132 -65 -40 244 -102 8 -225 -22 -51 267 41
1003 41 211 110 0 -35 455 -136 -143 58 -88 -206 -268 257 -23 83 28 220 -9 69 11 46 149 11 -5
1026 -5 178 -28 39 221 -125 254 116 19 -203 -222 4 60 30 72 223 -61 120 -315 15 -94 -92 238 -54
1049 -54 -172 -71 83 237 -275 -337 -1 -24 -21 -5 -20 -128 -76 74 -41 111 -60 200 269 -358 20 -124 104
$$ packed form
888a75j05J32rK15j1j77j18J87L09l45K14k33K22j49K34k88Q0P0J08j55Q0J12
910A98k33o7K71j38j62K17j36o2L35k72r7K44j58j29K44L4j36O6N4L07n8j59j86
933b3J80P8m35N18l89O5P3k84K63K65j64Pj81R9k75K84j27Q0j46j62L65k1j92
956a22q2M8K62j02Q2l76L74k36R5o0J07J75N0k45n2k9L9M05l26k0Q4j82k30M40
980I9O8q7k8o8J33o9j61K60o3j75J34K30j41j97K5K84l46J10k33K03k9L18k26
1003D1J70j01j10l5M90n91pK01j46j18o2N25k80J06n5J92k29P8n8L5J03j38j6
1026eJ83k06O7J82l46L79j38r7k22j9K26N6l0M2J51k84J81m35L30j09KL30k92
1049e4j18J01J54J54n12o2L36k3LJ6j5j08N2J50j15J52j71K60O9o27L78j44K28
$$ plain form
1072 104 -103 61 168 176 -124 -183 -112 96 28 66 0 -63 75 -103 -36 57 19 -88 10 -40 41 23 -233 205 114
1097 114 -99 -116 -125 112 64 34 42 84 -107 -130 168 192 76 70 155 -28 22 116 -16 -98 -186 222 2 44 241 -96
1123 -96 117 -161 -77 -200 123 -108 138 -208 165 -22 -12 -111 -114 -258 102 77 -112 -150 17 119 52 -38 -116 -37
1147 -37 -8 107 -106 -143 2 219 67 189 71 -133 56 -95 -88 90 -5 36 -114 -33 140 -97 -117 90 -23
1170 -23 195 -97 -51 106 63 -105 -86 140 -209 26 -275 192 244 -40 -37 -208 -72 83 -97 -7 124 -95 -118
1193 -118 -79 110 6 -9 142 -155 -27 119 -119 352 -201 28 141 -86 256 322 -33 14 36 -137 20 15
1215 15 124 -21 220 -125 -198 50 36 -76 -221 -86 -360 88 -7 68 126 -91 -31 36 -131 -222 107 -91 290
1238 290 94 -130 -76 -124 9 234 -27 -261 -37 -15 -24 -193 62 -21 -225 20 65 -8 47 117 -107 201 80
$$ packed form
1072A04k07J64J07Ql00n9P1K08o8L8o6o3J38j78O7R3l8j07R8n0Q1j8k56M38r1
1097A14k13j7rK37m8l0QM2j91k3K98K4j16oQ5j83N0R4j32q2q8M08k20M2J97l37
1123i6K13k78Q4j23L23k31K46l46L73j87J0r9lj44L60k5j89l8J67J02o7r0p8P9
1147c7K9J15k13l7J45K17j52J22j18k04J89j51PJ78r5M1j50Q1J73k37k0K07j13
1170b3K18k92M6J57m3j68J9K26l49K35l01M67N2k84Lj71J36J55j80R0J31k19k3
1193a18L9J89j04j5J51k97J28J46k38M71n53K29J13k27L42O6l55M7K2j73J57n
1215A5J09j45K41l45p3K48j4j12j45J35k74M48r5P5N8k17O0O7j67r1L29j98L81
1238B90j96k24N4m8J33K25k61k34K24K2rj69K55q3k04K45M5p3N5P0k24L08j21
$$ plain form
1261 80 24 -129 -235 51 -206 120 -111 165 -88 -11 -371 -39 -19 -161 47 14 -149 -142 46 -21 162 -213 -12
1284 -12 -264 -93 -63 101 54 -77 -200 18 -232 31 119 -122 77 12 -181 189 57 73 145 -91 42 -119
1306 -119 21 54 62 442 -184 21 67 180 12 74 34 -50 170 -64 -47 -102 -81 -101 176 108 -167 37 -93 87
1330 87 10 -114 38 153 -300 -200 214 24 207 119 -31 -132 -202 50 43 -111 -135 91 131 -38 8 173 -422
1353 -422 42 61 -35 21 -236 -188 -179 327 233 -38 -205 -104 2 -174 -125 336 -5 -88 271 -150 -151 340 89 20
1377 20 99 71 35 -90 170 160 7 10 -187 -7 140 135 -84 268 184 94 -106 -170 -86 -195 -46 -42 -212 238 -95
1402 -95 184 -156 90 -27 18 96 80 31 17 17 17 213 -255 134 -47 -390 235 247 126 -348 135 136 -258 -235 -219
1427 -219 309 -216 106 154 -68 94 -37 210 186 192 161 44 55 174 -2 -72 -128 322 212 -134 89 -88 -20
$$ packed form
1261H0n6j53j06K86k57L26k31K76k53P7l60L32K0j42K08l3j63PJ88o7J83l75K01
1284a2k52J71L0J64m7j31j23K18k50K63Q8k41J99o5j93L70j32J6P2k36J33j61
1306a19J40L3QL80o26K05M6J13j68O2m0q4K20k34J7n5K1k0K77o8k75K04j30J80
1330H7p7j24J52J15m53J00M14j90J83q8j50j01p0K52pj54k4K26M0j69M6J65n95
1353d22M64J9r6N6k57M8RN06r4k71j67J01J06j76M9M61l41q3L59m21jM91k51o9
1377B0P9k8l6j25K60j0j53Lj97J80J47nk19L52q4r0k00o4Q4j09J49Mj70M50l33
1402i5K79l40K46j17M5P8j6m9j4%%J96m68L89j81l43O25J2j21m74M83Jl94K3J6
1427b19N28n25L22M8k22J62j31K47k4Ol1j17J1J19j76p0n6M50j10l46K23j77O8
$$ plain form
1450 -20 -13 -89 -35 62 164 64 130 -195 -107 44 129 -34 29 255 157 -94 -26 -186 -75 149 -10 179 -37 -53
1474 -53 -141 -72 -6 -174 -168 -97 -15 176 -187 -218 47 -76 -24 -121 -34 -140 -246 64 30 -197 -307 112 -69 -19 67
1499 67 36 -67 -11 20 -212 -88 -134 99 -61 129 -69 -22 -170 -40 199 -386 -261 -11 -180 -99 15 111 -131
1522 -131 69 -35 -10 -120 -155 117 -134 -442 167 -9 43 113 39 -23 -32 37 -211 24 162 187 -133 -14 -127
1545 -127 59 27 -16 86 257 -138 195 -239 41 337 191 -23 24 50 -94 -46 374 220 -281 -165 -100 86
1567 86 141 -5 49 81 -22 18 -84 -146 -73 165 210 126 -203 -94 -25 -24 -341 54 108 54 35 -205 188 -147 65
1592 65 196 192 -111 151 168 -88 262 16 -157 37 81 51 -218 123 35 20 -229 28 57 98 27 -130 41 194
1616 194 36 201 165 232 241 -93 294 -152 102 -2 -85 26 144 196 -38 -17 104 -78 170 129 -364 137 -230
$$ packed form
1450b0Pp6N4R7J02j00O6l25Q8J51Q5j63O3K26r8k51O8j60J11K24j59J89k16j6
1474e3q8O9O6j68OP1Q2J91l63l1K65j23N2r7Q7j06j06L10l4k27j10M19j81N0Q6
1499F7l1j03N6L1k32J24m6K33j60J90j98M7j48J30K39n85J25K50j69Q1J14R6k42
1522a31K00j04K5j10l5K72k51l08O09j76N2P0p4o2rO9k48K35J38K5l20J19j13
1545a27J86l2m3J02J71l95L33m34K80K96j46k14M7K6j44M8M20j54n01J16O5J86
1567H6N5j46N4L2j03M0j02o2P3K38M5q4l29J09O9Jl17L95N4n4j9k40L93l35K12
1592F5J31ml03K62J7k56L50k46j73J94M4l0k69L41q8j5k49K57K9M1p1j57J71J53
1616A94j58J65l6O7Rl34L87m46K54j04q3J11J18N2k34K1J21j82K48m1m93N01l67
$$ plain form
1639 -230 -6 -257 29 66 -61 -4 68 -103 -228 213 53 -97 235 162 -475 77 -80 100 88 -194 329 -365
1661 -365 -292 195 209 -17 41 -153 24 -105 -74 63 -61 35 5 76 50 21 -183 -108 -131 -105 355 36 36 -122 -153
1686 -153 -76 30 -164 -138 61 172 -287 -18 5 -125 -27 155 9 -16 157 -10 -58 -35 -102 -30 -273 -30 -249
1709 -249 208 174 33 156 4 70 -144 -16 -83 -39 -58 4 152 -68 -104 263 44 64 135 -17 167 161 -195 -109
1733 -109 71 117 -12 -124 -43 34 -39 219 -225 -15 125 73 23 -156 -289 -12 -5 -7 -118 -236 -80 59 -21 -17
1757 -17 -25 43 -165 195 -220 199 49 112 6 32 64 -175 154 -135 166 -25 51 202 70 78 -243 -115 78
1780 78 218 -125 -139 78 -1 36 36 -150 286 -46 -27 -73 191 -107 -47 -2 -38 82 37 252 61 -96 251 -248
1804 -248 -45 284 75 -178 -318 43 47 -27 181 -10 -23 60 -280 -216 74 -37 103 117 -176 62 -22 -62 93
$$ packed form
1639b30K24k51K86L7j27N7P2j71j25M41j60j50L32p3o37N52j57J80j2k82N23o94
1661c65P3M87J4k26N8j94J77j29L1J37j24R6l0P1k6k9k04P5k3K6M60l19%j58l1
1686a53P7J06j94K6J99J11m59K69K3j30R8J82j46k5J73j67m8K3o7P2k43K43k19
1709b49M57l4j41J23j52O6k14J28o7M4j9O2J48k20l6L67k19K0P1j52J84ol56Q6
1733a09J80M6j29j12Q1P7p3K58m44K10J40n2n0j79j33K77Pkj11j18J56J39q0M
1757a7qO8k08L60m15M19j50O3j06K6L2k39L29k89L01j91P6J51j32Ql21J28J93
1780G8J40l43j4K17p9L7%j86M36l32J9m6K64k98O0M5l6J20m5K15j91j57L47m99
1804b48K03L29k09k53j40L61Mp4K08j91j3Q3l40O4K90j11J40J4k93K38q4m0J55
$$ plain form
1827 93 -28 215 -453 -131 116 255 -58 216 142 16 35 -58 40 188 -192 -74 291 -270 130 -60 -184 -188
1849 -188 132 -5 160 -138 -60 77 -92 123 -18 -230 152 -1 -109 154 17 26 52 -212 129 253 -88
1870 -88 -25 -20 -31 217 8 12 -14 317 14 -60 -143 163 -65 127 -10 -142 519 138 132 -1 -232 -143 -137 -39 -149
1895 -149 -61 -62 -132 81 -64 201 -49 -16 -23 137 85 -187 58 -224 -12 -117 -373 -17 -315 108 41 98 164 -197
1919 -197 28 55 -12 208 -118 138 133 -5 35 -102 -216 -238 156 79 106 -57 196 39 -212 76 -121 -76 -65
1942 -65 50 58 -88 -152 -346 -184 123 -109 274 85 -197 -25 -219 -143 -64 58 115 -25 113 -167 123 211 99
1965 99 -53 252 -185 27 68 -126 -83 139 119 -460 278 92 -251 -61 212 315 19 197 -147 -79 102 -101
1987 -101 -20 -148 -56 30 -166 -80 38 57 -42 -110 90 -38 299 12 30 -22 14 -75 74 -95 -71 -62 16 -74 54
$$ packed form
1827I3j21K43o68L22K47J39l13K74p4j26J9r3R8J48l80J18L65n61M00j90j24m
1849a88L20j37J65k98P8J37j69K15j41k12L82j53j08K63j37RK6k64L41J24l41
1870h8O3Nj1K48k09Mk6L31l03p4q3L06k28J92j37j32O61l81oj33k31Q9OR8j10
1895a49Q8jp0K13j45K65k50L3pJ60n2k72K45k82K12j05k56L56k98M23o7N7O6l61
1919a97K25K7o7K20l26K56nj38M0j37j14k2L94p7K7j63K53j57k51K88j97M5J1
1942f5J15Qj46o4j94J62L07k32L83j89k82J72j94P6P9J22N7j40J38k80K90Q8j12
1965I9j52L05m37K12M1j94M3K22k0n79P38j86l43J90K73J03k96J78l44O8J81k03
1987a01Q1j28R2Q6j96Q6J18J9r9o8K00j28L37k87J8n2L6q9J49j69K4RP8r0J28
$$ plain form
2012 54 -155 -56 357 -130 -82 -308 -24 18 63 -175 -39 -233 -25 -62 -132 -100 -28 -267 16 17 -191 -30 -157 35
2036 35 36 264 -5 -59 -86 14 106 -179 273 -58 1 76 -45 3 284 141 -195 -66 32 3 209 29 -118 95
2060 95 -69 -59 -47 -169 61 28 -41 163 87 11 199 -44 -46 -114 37 20 -64 87 -88 -161 293 63 -229 -150 27
2085 27 213 203 237 31 -120 -165 -156 -85 290 23 -19 -49 -45 109 0 -19 110 245 110 70 47 202 151 -154 -15
2110 -15 124 6 95 -202 -22 247 176 115 -193 75 165 116 217 117 -138 64 17 -24 -46 175 -104 209 127
2133 127 -32 40 33 31 -226 43 187 -89 -162 -91 -194 -210 -71 -128 118 -134 10 225 59 49 91 360 233 9
2157 9 -285 -84 -207 -31 219 8 119 -36 -53 -1 -41 210 -140 -408 -64 -23 -253 51 50 -9 -3 0 -73 -131 -139 -22
2183 -22 307 65 91 -90 58 333 31 202 -136 32 -103 37 -103 -10 171 -10 -100 129 66 -34 33 181
$$ packed form
2012E4k09R9M13m87M8k26K84M2M5k38J36j94K08l7p0L2P2k39K83Jk08J61j27J92
2036C5JK28k69n4k7J00R2k85M52l31N9P5j21M8K81j43l36J29R8k9K06j80j47K13
2060I5j64J0J2j22K30l3o9K04p6p6J88k43ko8J51j7q4J51j75p3M54k30k92P9J77
2085B7J86j0L4k06j51m5RP1L75k67m2l0MJ54j09j9J29J35j35m0k3J55n1l05J39
2110a5J39j18Q9k97J80K69p1o1l08K68R0m9J01j00k55K02m7m1k2K21k79L13q2
2133A27j59P2pkk57K69J44k76p3P1j03j6J39n7K46k52J44K15j66j0M2K69j27k24
2157Ik94K01j23J76K50k11J11j55j7N2m0K51l50k68L44M1k30L04jn9OLp3n8qJ17
2183b2L29k42K6j81J48K75l02J71l38J68j35J40j40R3J81j81r0K29o3j00O7J48
$$ plain form
2205 181 73 -60 247 -65 -161 -133 286 19 -70 -132 -29 47 13 58 70 167 -73 33 -41 -135 -6 -510 111 149
2229 149 -12 -18 -63 181 -165 156 -39 15 92 71 88 20 152 -52 -246 -204 -105 -159 -126 94 -278 103 15 195
2253 195 69 -97 -36 -54 -260 -270 -50 -86 -105 98 -178 -242 -283 65 143 -14 -297 -194 2 298 198 -196 178
2276 178 -184 -62 180 3 162 31 -267 61 106 -198 -21 -28 125 21 107 46 -37 -153 290 181 33 -186
2298 -186 -33 288 8 -156 -52 320 16 222 -223 -78 -45 -186 125 35 71 -63 -190 -328 70 104 -77
2319 -77 -63 -142 131 8 -46 -268 -140 30 141 186 -141 -128 40 159 214 64 -36 -35 40 174 -341 -24 41 148
2343 148 160 200 50 -141 -160 62 35 -38 -82 386 -21 40 148 47 165 179 -132 13 -94 -54 -64 -124 128 30
2367 30 63 -12 -135 63 192 -49 35 -152 219 41 -70 364 154 -106 25 -25 -98 31 220 36 78 58 -26
$$ packed form
2205A81j08j33L07l12r6K8M19k67q9o2J03P6l4M5J2R7k40J06p4r4J29n04O21L8
2229A49j61om5K44l46L21j95N4P7k1J7o8J32k04j94M2R9n4L3K20l72L81q8J80
2253A95j26j66O1j8k06j0K20l6j9K03k76o4m1L48P8j57k83J03J96K96j00l94L74
2276A78l62J22K42j77J59j31k98L28M5l04J77pJ53j04Q6o1q3j16M43j09j48k19
2298a86J53L21k80j64J04L72l04K06m45J45L3j41L11r0L6j34j27j38L98L4j81
2319g7J4p9K73j23n4k22J28J70J11M5l27J3J68J19N5j50j00JP5J34n15L17O5J07
2343A48J2M0j50j91j9K22k7p3m4M68m07O1J08j01J18J4l11J45j07M0j0o0K52r8
2367C0L3p5j23J98J29k41Q4j87L71j78j11M34k10k60J31n0p3J29J89j84M2k0q4
$$ plain form
2390 -26 138 -115 -232 80 -21 88 -228 -254 51 -224 -124 -282 63 -157 36 69 -79 -56 -141 -108 113 108 29
2413 29 -299 -57 94 187 200 41 21 77 45 19 -126 -24 -71 -128 116 128 252 6 -46 -150 -103 135 -98 92
2437 92 41 132 -157 89 -115 -352 41 -313 85 -247 -219 -78 -96 63 -29 114 -50 201 -133 205 12 -123
2459 -123 377 124 14 -155 139 162 102 -82 38 -43 0 -118 22 30 -62 -307 -110 61 16 -122 20 -215 79
2482 79 -165 -172 -62 230 -53 258 26 111 -41 7 226 83 109 51 -56 42 -255 148 -138 213 147 158 250 -117
2506 -117 163 212 -128 -67 63 74 98 -38 10 -21 41 97 -30 -184 68 -182 132 -152 -100 31 205 185 29
2529 29 38 21 -171 -99 -188 207 -89 -303 150 -9 -228 -95 152 -7 -140 -12 367 217 -27 -158 -75 -185
2551 -185 -122 -16 4 80 5 13 19 207 -122 -182 -129 -51 90 122 -26 431 -174 265 -71 58 70 -19 112 -164 -20
$$ packed form
2390b6J64k53j17L12j01J09l16k6L05k75J00j58L45k20J93L3j48K3q5L3K21np9
2413B9l28K42J51R3J3j59k0N6l2k6j45J02m7n7K44J2J24k46n2j04M7K38k33J90
2437I2n1R1k89K46k04k37L93l54L98l32K8J41j8J59r2J43j64K51l34L38j93j35
2459a23N00k53j10j69K94K3o0j84J20q1M3j18J40Qr2k45J97J71m5j38J42k35K94
2482G9k44pJ10K92k83L11k32Q5j52M8K19j43K6n8j07R8k97M03k86L51o6J1R2l67
2506a17K80M9l40O1J30J1K4j36M8l1O2N6j27j54K52k50L14k84N2J31J74k0j56
2529B9Rj7j92P2q9L95k96k14M53j59k19J33K47j59j33J28L79j50k44j31Q3j10
2551a85O3J06K0P6p5QOJ88l29o0N3P8J41L2j48M57o05M39l36J29J2q9J31k76J44
$$ plain form
2576 -20 101 137 109 -30 -18 -73 135 96 22 14 -84 55 -94 -224 -283 -122 92 244 -108 107 93 -154 244 143
2600 143 -116 -90 -303 -79 -235 -222 70 167 -78 -213 -11 280 -76 115 78 187 -15 50 132 202 -150 64
2622 64 32 -212 146 140 295 46 -87 86 -1 -19 -16 24 204 -99 118 -186 331 -58 -142 256 74 -4 38 107
2646 107 85 129 150 231 38 -79 -70 218 -191 86 79 160 73 -114 47 -72 172 44 113 -168 287 68 180 275
2670 275 100 -106 34 -30 71 4 88 39 118 105 -97 154 6 30 -180 -102 184 382 -97 -151 -79 31 -31 83
2694 83 -9 1 -117 23 147 257 -36 78 168 33 56 -111 -122 -60 -104 152 70 334 -166 28 -46 -179 94
2717 94 -83 -406 -234 105 118 59 56 -24 30 229 -186 164 -218 -267 -146 -341 15 -206 266 -89 -151 -138 54
2740 54 49 351 38 -169 14 233 12 75 -219 115 75 -132 79 -246 -51 -57 311 -80 63 207 -44 -238
$$ packed form
2576b0J21L6k8j39J2n5K08l9p4qr8J39j49j30n9J61K14J52l52K15j4k47L98j01
2600A43k59K6k13K24j56J3K92R7k45j35K02K91l56J91l7J09k02O5Q2P0l52K14
2622F4l2k44L58oJ55k49j33J73q7j8LM0J80l03K17l04N17l89q4L98j82p8M2O9
2646A07k2M4K1Q1j93j17RK88m09K77pQ1q7j87J61j19K44j28O9k81M55k19J12R5
2670B75j75k06J40o4J01o7Q4m9P9j3k02K51j48K4k10P8K86J98m79n4P2J10o2J14
2694H3r2J0j18J40J24J10k93J14R0j35K3j67j1O2m4K56q2K64n00J94p4j33K73
2717I4j77l23J72L39J3n9lq0N4J99m15L50l82m9J21j95L56k21M72l55o2J3J92
2740E4nL02l13k07J83K19k21O3k94L34m0k07K11l25J95oL68l91J43J44k51j94
$$ plain form
2762 -238 -54 126 -247 195 249 -154 284 -33 2 -92 39 -134 31 -4 75 -377 -266 -156 158 353 -277 152
2784 152 66 -45 338 218 -72 -173 -7 -64 20 -150 -35 -219 16 282 -212 34 -127 -62 -49 -16 117 -70
2806 -70 60 98 -68 4 60 -128 54 5 -18 -72 50 -154 114 -47 251 -45 -123 18 -278 -363 80 7 -277
2829 -277 146 -182 -261 40 -238 -231 -95 92 -117 -141 -48 113 -156 20 -57 -126 133 -140 -156 124 198 61 -29
2852 -29 -5 -26 -371 49 200 133 83 59 -231 -250 135 110 -38 -117 -148 11 -65 -67 122 -141 -88 -29 88 80 -214 -70
2878 -70 5 -24 -119 -35 65 -19 -18 -45 152 176 -191 143 -163 247 235 82 -4 -481 129 119 106 287 -188 15 -16
2903 -16 -215 74 -60 -201 -30 58 106 250 115 -157 -259 -80 -58 -91 -177 4 119 267 -58 379 34 -97
2925 -97 55 -70 -110 -231 20 170 107 265 172 265 -57 -255 114 296 36 -44 -100 232 -26 -62 123 -167 -28
$$ packed form
2762b38J84J80l73M42N4m03M38l17L5r4J31j73J65l5P9m52J11J10L14J95o30M29
2784A52q6j11L83j20k90j01J66n7Q4j70J15j84K35K66m94K46j61O5J3L3J33j87
2806g0J30L8j66P2N6j88J82m9k3n4J22k04K68j61K98k96p8J41k96q5M43p3k84
2829b77M23l28p9L01k78PJ36J87k09k4R3J61k69J76p7o9K59k73j6K80P4j37r0
2852b9K4k1l45M20J51o7n0k4k90j9L85k5j48p9l1J59p6kJ89k63N3N9J17qk94J44
2878g0P5k9r5Q4J00q4Jk7J97K4l67L34l06M10j2j53q6m77O10j0j3J81m75K03l1
2903a6j99K89j34j41J71Q8M8J44j35k72j02J79K2l3q6J81J15J48l25M37l45j31
2925i7J52j25m0j21K51J50o3J58r3R3l22j98L69J82k60q0n6L32k58l6J85k90J39
$$ plain form
2948 -28 -173 -67 -71 -177 -303 1 104 -45 106 13 -185 141 286 65 87 55 162 285 -81 -56 41 30 -41
2971 -41 -113 265 -122 -240 62 -245 -171 -113 51 114 169 66 111 37 45 -208 -161 -271 -62 -18 -17 -177 -43 91 -234
2996 -234 -240 -130 -191 47 143 -13 126 81 -37 -271 69 -85 158 99 -118 -84 -35 31 -67 84 38 -52 82 -15
3020 -15 -30 12 26 172 -106 213 -19 -137 -118 57 41 -92 58 328 -198 -32 -226 -31 -155 -422 5 -116
3042 -116 -37 44 -178 83 -40 -163 -68 -49 44 -94 -174 -88 -178 68 115 165 161 -52 259 -18 -292 -100 208 -195
3066 -195 -81 123 80 148 166 300 365 -152 58 -361 28 389 -33 -21 209 -45 25 206 -67 -92 -43 108 39
3089 39 17 -83 273 -182 -252 -90 -253 -46 -37 -68 -16 -244 99 -49 31 146 -1 143 121 4 384 -44 49
3112 49 -219 -31 -18 188 -167 -67 16 133 58 -346 -61 -101 -303 -60 -198 50 -177 -66 69 -22 11 7 -59
$$ packed form
2948b8j45J06mj06j26L04J03j49J51r3j98L26J45k21K2l2J07J23l66K5R7j1p1
2971d1p2L78l87j18L02l07P4N8J64O3N5j03M5p4Qk53M7j10K09M4Jj60J34J34l25
2996b34oJ10o1K38R6j56J39m5j18k34L40j54K43n9k17L4M9O6r8J51m6r0J34r7
3020a5j5M2J4J46k78L19k32j18J9J75j6j33J50K70n26J66j94J95j24k67M27j21
3042a16P9Q1k22K61j23j23R5J9R3j38q0Q6r0K46M7N0mk13L11k77k74J92L08m03
3066a95J14K04m3O8J8J34O5n17K10m19L89L61m22J2K30k54P0J81k73k5M9J51o9
3089C9k2j00L56m55p0J62j63K07Rl1N2k28L43j48Q0J15j47J44k2j17L80m28R3
3112D9k68J88J3K06l55J00Q3J17p5m04K85m0k02K43j38K48k27J11J35r1L3mo6
$$ plain form
3135 -59 -32 68 -20 6 157 -82 91 -45 -31 -21 -16 -59 618 -58 -149 27 111 -230 -179 145 116 181 -21 -80 -209
3160 -209 -88 -45 281 -29 -80 -285 -18 145 82 -244 110 115 195 30 -85 37 -108 147 -80 -179 164 61
3182 61 47 169 -40 -30 144 14 6 299 -87 198 -50 204 -145 -55 -7 128 4 197 247 113 -179 73 -82
3205 -82 27 -193 -28 -134 16 117 -35 10 85 71 -52 26 -88 348 118 49 -40 189 -74 -153 146 -67 55
3228 55 -112 -96 -148 -279 60 -186 70 -324 -12 -57 68 -109 -32 -125 10 -84 -160 -163 -5 113 -44 -17 -340 287
3252 287 27 211 19 -305 -168 36 259 144 -128 13 72 -139 -72 -49 43 16 -184 88 18 281 77 15
3274 15 229 -158 68 25 202 110 0 -180 -207 93 89 -80 -281 336 273 -47 -193 321 49 -53 91 109 -35
3297 -35 -391 92 278 12 -178 -40 137 4 -54 116 -71 -16 -93 125 -139 -124 -92 -104 221 297 95 -202 78
$$ packed form
3135e9K7J00q8K6J51k39J73j36J4J0Nm3O77o76r1J76Q4l41N1L24k9O5k02n9j29
3160b09J21M3L26l10n1k05K67J63o3l26L54NQ0j65j15J22j45K55k27r9L43j03
3182F1j4J22k09J0J74j30qK93l86K85k48K54l49R0M8J35j24J93N0j34k92K52j55
3205h2J09k20J65j06J50J01j52M5P5j4j23P8j14M36k30o9q9K29k63p9K99k13J22
3228E5j67J6n2j31L39k46K56l94L12m5J25j77P7r3J35r4p6lJ58J18j57K7l23O27
3252B87k60J84j92l24J37K04K23j15k72J41N9k11O7K3R2k7k00K72p0K63k04o2
3274A5K14l87K26m3J77r2j10j80k7L00mj69k01O17o3l20j46N14k72j02J44J8j44
3297c5l56M83J86k66j90J38J77j33n8J70j87N5p7K18k64J5L2j2L25P6k02k97K80
$$ plain form
3320 78 24 -44 -117 351 33 103 48 -18 -121 151 181 -136 -46 206 86 239 -101 -308 -214 -89 166 99 66 3
3344 3 27 116 -284 -109 -34 81 63 126 195 -280 149 22 -174 -82 -58 50 100 -141 -62 349 33 -68 -12 10 98
3369 98 -154 138 -117 -179 -121 118 72 -78 243 142 146 -50 178 83 50 -87 15 303 6 183 38 113 85
3392 85 46 62 -132 -94 -263 -71 -143 72 -1 25 -25 109 -45 108 -19 91 -236 -89 -80 -161 142 1 229 200
3416 200 -266 187 -136 162 117 244 27 -126 -147 -22 135 181 -183 -154 24 -51 -55 -182 -344 30 -5 71 -158
3439 -158 173 -283 -82 25 -57 -62 -59 36 183 265 -101 -9 -175 -48 -273 -39 77 26 -93 -75 33 -76 218
3462 218 -207 -65 -197 176 -77 -257 133 -96 -105 -35 113 172 275 196 111 89 -2 -76 44 134 85 62 -33 137
3486 137 -35 9 135 41 -164 240 -34 -61 17 -8 43 -199 -94 -213 -272 54 164 -20 -217 42 -26 -242 -1
$$ packed form
3320G8n4o8p3M68l18P0n5o6j03K72L0l17R0K52j20J53l40k07R4J25K55o7l3o3
3344CK4Q9m00J75P5J15j8O3O9m75M29j27j96R2K4J08N0k41P9M11l16j01N6K2Q8
3369I8k52K92k55o2N8K39m6j50L21j01Mj96K28r5l3j37J02K88k97J77j45P5k8
3392H5l9J6j94L8j69J92p2K15p3K6n0J34j54J53j27J10l27J47Rq1L03j41K28k9
3416B00m66M53l23K98m5J27k17j53k1J25J57M6l64K9J78p5mj27j62L74l5P6k29
3439a58L31m56K01J07q2nLR5J47Q2l66R2j66J27k25K34J16n1j19J8J08j09K94
3462B18m25J42j32L73k53j80L90k29rP0J48N9J03p9q5k2r1p4J20R0m9k3r5J70
3486A37j72M4J26r4k05M04k74k7P8k5N1k42J05j19n9L26J10j84j97K59o8k16K41
$$ plain form
3509 -1 -200 13 56 191 112 -220 -134 105 -7 -16 88 6 -73 221 -91 210 -254 -6 32 -178 113 68 69 -109
3533 -109 -182 -66 -130 133 248 -94 97 -193 -190 -127 64 -102 226 176 39 174 65 247 -141 130 81 234
3555 234 -11 -60 91 0 -84 31 296 -184 -164 -171 -3 -159 -126 209 -270 352 41 106 54 94 -155 -107 109 99
3579 99 42 -111 -62 261 -78 41 141 -7 -120 11 -20 100 26 -30 -150 -116 77 -20 -59 -60 306 98 -57 -79
3603 -79 -65 469 -204 66 -66 -60 163 -294 81 127 124 164 78 30 -109 89 -112 -235 200 54 -222 89 119 142
3627 142 -228 99 -62 -365 -42 -397 -153 163 -55 13 -25 -185 -192 -60 160 57 -213 -101 -48 -39 56 158 -121
3650 -121 104 1 146 97 -401 -124 -136 -187 129 -58 119 -247 -252 26 -10 108 -34 -76 -147 79 127 -78 -43
3673 -43 92 -5 30 96 -64 -210 -132 149 50 -340 -76 22 -79 -33 38 -126 226 -302 114 -62 -154 -134 -122 60
$$ packed form
3509aj99K13M3J35p9l32Q6K39j12rJ04q2p9K94l12L01m64K48L8k10K91m5Jj78
3533a09p3J16o4K63J15l42J91k90LO3J91j66L28n0j37J35j09J82l88K71m9J53
3555B34k45m9J51r1q4J15K65m80K0pJ68j56L3L35m79O22l11O5n2M0k49M8K16j0
3579I9n7j53M9L23l39J19J00j48j13J31l1J20p4n6j20L4J93r7l9jL66k08j55k2
3603g9J4N34o73K70j32OK23m57L75M6lM0q6m8j39J98k01j23M35j46k76L11L0K3
3627A42l70L27j61l03L23l55K44L16k18O8l8j60pJ32K20j03k70J12N3RR5J02k79
3650a21K25j03J45m9m98K77j2n1L16j87J77l66nK78l6J18j42m2p1K26M8k05L5
3673d3J35r7L5O6j60j46P8K81r9l90K64R8j01M6P1j64L52n28M16j76r2K0J2J82
$$ plain form
3697 60 17 -143 10 -41 -269 226 29 -114 339 -53 22 141 -89 -3 108 -64 -149 17 -147 131 -77 189
3719 189 60 84 -126 157 -104 -132 146 -106 19 -27 88 2 97 121 -10 -135 -256 -106 -102 -377 198 -78 74
3742 74 164 -78 39 131 145 78 67 -164 89 187 -152 -87 -95 19 135 170 247 199 -90 -167 45 205 -201 2 70
3767 70 35 -56 -6 -46 -232 42 76 -262 -321 27 -41 104 112 106 271 -130 -95 5 126 65 -265 111 -7 35 14
3792 14 -107 175 -4 279 -24 214 140 8 139 -188 109 136 61 220 -168 -38 -280 -310 -71 -346 -67 90
3814 90 155 -249 122 101 188 104 70 -13 -51 -46 -33 -84 114 20 13 -37 208 47 81 -56 -37 -220 -109 -268 -22 40
3840 40 -67 152 49 -73 -62 50 42 76 43 -277 -143 -16 -159 7 11 -77 76 121 144 -75 -35 147 -370 61
3864 61 60 10 -71 -137 38 -275 -32 341 4 -320 195 -121 -192 19 133 86 -9 89 10 144 -172 -179 -253 -102 178
$$ packed form
3697F0m3j60J53n1k28M95j97j43M53l92P5J19k30Q6J11j72q5J66j64K78k08K66
3719A89j29K4k10K83k61k8K78k52J25m6J15q6R5K4j31j25j21J50Mk75N75k76J52
3742G4R0k42J17R2J4o7j1k31K53R8l39O5qJ14J16L5P7m8k89p7K12J60m06K03O8
3767G0l5r1N0m0j86K74L4l38n9L48o8J45QoJ65m01L5J00J21o1l30L76j18M2k1
3792A4j21K82j79K83l03K38p4j32J31l27K97K7p5J59l88J30k42l0K39k75K79J57
3814I0O5m04L71k1Q7q4l4q3l8NJ3n1J98r4pn0K45j61L4j37J9j83J11j59K46O2
3840D0j07K19j03j22J1J12qL4l3l20J34J27j43J66Mq8J53M5K3k19M0J82n17M31
3864F1jn0q1o6J75l13K43L73l37l24N15l16p1K11J14m7r5R8p9J34l16pp4J51K80
$$ plain form
3889 178 146 -16 -91 -53 -183 -50 -134 -185 -179 138 -321 -160 137 73 50 -46 -67 77 -94 53 99 -72 77 95
3913 95 -236 309 13 90 275 31 11 12 171 -142 -57 -10 36 -200 140 -65 -22 -80 243 72 428 -118 260
3936 260 -36 -111 3 -204 31 84 -41 51 -12 -1 -290 -62 -140 -212 11 138 39 -8 46 259 88 -62 -243
3959 -243 9 28 -6 -11 -172 -15 136 84 -266 -38 23 -69 90 -201 -62 -325 -157 382 11 -86 -20 8 -121
3982 -121 25 -138 -322 -8 -38 -153 -4 54 104 101 -12 48 -108 220 43 217 129 26 3 46 18 13 -142 30
4006 30 -110 6 -197 -18 -18 -168 201 -274 10 149 207 -62 -113 275 -83 -137 79 50 219 -218 85 -30
4028 -30 205 -102 56 152 -89 91 137 216 95 20 -433 -184 53 55 126 -125 110 -50 -67 86 -280 47 -59
4051 -59 71 -11 177 -280 157 -14 -37 192 -343 100 212 286 -105 -145 163 -191 -161 -313 -239 -180 -15 -1 -138
$$ packed form
3889A78l2j62p5L8j30J33q4n1OL17m59J61K97o4k3r6k1J44j71J47M6j71J49J8
3913I5l31N45k96P7J85k44k0JJ59l13Q5M7M6k36L40k05M3n8L23j71L56n46L78
3936B60k96p5J14k07K35N3j25R2o3J1k89K28p8p2K23J27r9m7N4K13j71j50j81
3959b43K52J9l4nj61J57J51n2l50K28O1r2J59k91J39k63J68N39l71r7O6K8j29
3982a21J46j63j84L14l0j15J49N8N0lj13O0j56L28j77J74q8j03k3M3k8nj55J72
4006C0j40J16k03J79%j50L69m75K84J39N8k69n1L88l58n4K16k9J69m37L03j15
4028c0K35l07J58R6k41J80M6P9j21p5m53K49K37KP1k51K35j60j7J53l66L27j06
4051e9J30q2J88m57M37j71k3K29n35M43J12P4l91m0L08l54L0j52P4N9J65J4j37
$$ plain form
4074 -138 18 253 68 -275 181 -136 -119 101 187 -173 88 -100 -152 143 89 175 22 -110 95 37 212 -124
4096 -124 -56 -66 39 -102 -176 -155 -162 -40 297 58 255 -157 195 93 -97 75 50 -11 229 93 -124 -86 206
4119 206 63 -19 183 -82 -212 -196 -16 198 46 -95 52 -206 -35 182 -9 -178 222 -263 294 -81 270
4140 270 40 75 -106 -115 144 145 111 144 -86 -335 50 -88 -244 -306 157 34 -73 246 155 88 -39 -106 110 -47
4164 -47 -79 69 -299 -160 143 -26 14 -79 187 -48 60 12 -164 202 91 -144 38 186 -243 -30 -75 60
4186 60 -8 -4 -79 211 -5 -231 -291 -14 -98 39 -56 -114 50 66 11 2 -104 -6 171 189 83 101 65 46 -38 -243
4212 -243 -23 -43 -174 -79 197 -246 158 -142 -57 11 -87 52 -115 -59 -148 186 195 -5 120 -101 -215 -196 182
4235 182 -19 75 -6 72 -94 97 -31 -172 347 128 -19 -68 -146 -59 -7 26 10 -42 -181 -120 -10 -37 -139 -133 -36
$$ packed form
4074a38J56K35j85l43M56l17J7K20Q6l60K61j88n2K95n4Q6j53j32K05n8J75l36
4096a24O8j0J05j41p4K1pJ22L37k39J97m12L52j02j90J72k5o1K40j36k17L8K92
4119B06j43q2K02k65j30J6J80K14j52j41J47k58J71K17j91j69M00m85N57l75L51
4140B70k30L5j81rK59Jl4L3k30k49L85j38j56o2M63j23j07L19r1o7j27o7K16j57
4164d7l2J48l68J39L03j69M0r3K66k35J08m8j76L66j11k35J82J48m29K13m5J35
4186F0o8Mp5K90k16k26o0K77q4J37r5n8J64J6n5rj06R8J77J8j06J8l6j9q4k05
4212b43K20k0j31R5K76m43M04l00Q5O8r8J39j67N6q9L34Rk00J25k21j14J9L78
4235A82k01R4q1P8j66J91j28j41N19k19j47m9p8Q7N2L3j6n2j39O1J10k7j02OR7
$$ plain form
4260 -36 151 -144 -174 104 72 207 39 48 177 -82 -163 319 80 -177 33 -164 105 -100 -138 -215 126 -157 -183
4283 -183 -13 -3 -43 -29 -61 68 10 21 93 25 245 -97 -105 4 239 267 105 -12 -68 -17 -142 103 127 113 -234
4308 -234 -273 -322 -174 79 39 70 -77 -41 -75 -199 4 -139 171 -22 -34 61 -152 120 160 -105 99 4 95 170
4332 170 165 93 -261 -199 80 166 86 149 7 72 -60 -106 35 151 193 254 180 202 -149 169 76 -82 -74 101 -86
4357 -86 -82 213 104 100 135 185 98 -265 4 -139 -138 -180 -38 151 -9 212 -41 -65 93 324 83 -77 222 -98
4381 -98 20 -117 61 121 204 59 -14 95 -14 265 81 -121 123 67 -168 -110 -7 -78 46 -24 43 6 -102
4404 -102 -145 -149 317 326 -214 -84 -96 77 -165 -60 190 -70 107 115 -171 -228 -42 -338 260 -11 46 -140 173
4427 173 -23 -28 -37 0 -200 10 85 -148 -65 -123 89 51 175 31 129 82 -9 -181 33 -27 61 -214 -28 76 262
$$ packed form
4260c6J87k95l0K78l2J35j68RJ29k59q1M82k39k57K10j97K69k05l8p7L41k83k6
4283a83J70J0m0J4l2J29n8J1P2o8K20l42qJ09K35K8j62j17n6N1j25K45K4j4l47
4308b34l9m9J48K53m0L1j47L6l4j24K03j43L10j93j2R5k13K72M0k65K04r5R1P5
4332A70np2l54O2K79Q6q0O3j42O5j32m6J41J16M2O1p4K2l51L18r3j58QJ75j87
4357h6MK95j09mL5N0q7l63K69j43Jm2J42J89j60K21k53k4J58K31k41j60K99l20
4381i8J18j37J78O0Q3j45p3J09j09K79j84k02K44n6k35N8J03p1J24p0O7l7j08
4404a02m3mM66Rn40J30j2J73k42J05K50k60J77Qk86n7J86k96N98k71N7j86L13
4427A73j96nrL7k00K10P5k33Q3n8K12l8J24j44R8m7r1j72K14o0Q8k75J86J04J86
$$ plain form
4452 262 108 -169 -36 197 -44 167 -74 -63 -207 32 -1 -152 -12 -151 239 -17 -88 -242 -126 -154 -169 335
4474 335 46 -290 -16 284 30 174 85 9 -50 -78 54 -41 80 43 -40 -146 -185 3 404 -77 220 100 54
4497 54 185 226 42 60 -113 -9 39 85 -147 48 183 315 -47 -243 96 -208 152 154 130 113 -44 -109 -83 -8
4521 -8 -194 83 -222 -174 -136 -261 -71 48 -47 78 -91 86 20 12 -90 88 -71 -94 101 97 -50 167 -203 130
4545 130 148 -126 122 18 -175 204 109 21 -382 115 -3 114 -127 -97 -210 83 -91 45 -231 30 40 42
4567 42 8 313 32 163 -187 -31 -77 25 98 200 40 -136 -124 24 236 -163 217 -29 20 53 -89 -328
4589 -328 165 -8 -122 -280 10 226 258 -83 3 -162 240 57 124 179 -36 94 98 -99 -101 154 8 -55 341
4612 341 -37 63 -16 9 174 -1 -1 146 52 -171 134 128 120 -110 115 -329 89 124 63 107 249 38 117 45 -242
$$ packed form
4452B62j54k77J33K33k41K11k41J1j44K39l3j51J40j39L90k56p1j54J16k8j5N04
4474C35k89l36K74L00k54J44q9p6n9k8J32r5J21l7q3j06l9J88M01m81K97j20m6
4497E4J31M1j84J8j73J04M8M6k32J95J35J32l62j96L39l04L60Kk4j7j57o5K6P5
4521hj86K77l05M8L8j25J90J19r5J25j69J77o6qj02J78j59k3J95mj47K17l70L33
4545A30J8k74K48j04j93L79r5q8m03M97j18J17k41L0j13K93j74J36k76K61J0K
4567D2l4L05k81J31l50J56m6J02P3J02j60j76J2J48K12l99L80k46M9L3j42k39
4589c28M93j73j14j58K90K16L2l41Q6j65M02j83O7N5k15J30Mj97kK55j46o3L96
4612C41l78J00p9K5J65j75%J47r4k23L05oqk30K25m44M18L5o1M4J42k11P9p2k87
$$ plain form
4637 -242 -41 155 -50 -73 -172 34 68 157 -132 -17 23 -116 11 47 -108 79 109 44 -96 -70 58 -89 54
4660 54 78 187 -151 -46 20 17 105 46 -236 65 -9 -86 -295 -246 -139 -230 227 -70 -27 -40 -17 116 49 -272 -15
4685 -15 25 -2 -174 -137 237 -74 56 -410 -31 -161 -86 20 71 212 -24 -167 -95 72 -45 -86 -72 -94 222
4708 222 177 -177 -63 212 98 -39 -168 -169 115 -208 20 -189 66 161 22 -22 -279 98 -104 63 24 -311
4730 -311 21 117 3 -2 -15 256 -196 139 156 -256 141 -158 -142 79 116 -103 -149 142 -108 105 -217 -123 -134
4753 -134 -175 -11 -137 -9 71 239 203 213 146 50 197 -36 -41 -47 -52 83 175 17 -114 -216 108 -264 31 -50 374
4778 374 -132 15 59 260 -22 261 15 -130 -102 45 143 103 -288 227 -97 326 -105 -96 -47 -268 -219 150 89
4801 89 -53 -94 225 -105 449 -249 -215 141 -33 197 -254 8 204 -5 -67 -113 29 -152 -18 -9 -27 -86 -102
$$ packed form
4637b42K01J96k05k3r9K06L4Q9k89J15M0j39J27L6j55J87L0o5j40K6J28j47J43
4660E4K4J09l38J05O6lQ8n9k82L01p4p7k09M9J07r1M57k97M3j3K3J33o7l21K57
4685a5M0k7j72L7L74l11J30m66L79j30P5J06N1J41k36j43P2J67j17m1J4k2L16
4708B22m5l54J14K75j14j37j29jK84l23K28k09K55R5j39m4k57L77k02J67l9l35
4730c11L32R6j14nj3K71m52L35J7m12L97k99J6K21L7k19m6K91k50K13l22R4j1
4753a34m1J64j26J28Q0J68l6J0o7r6J47k33nonJ35R2j58j31j02L24l72K95q1M24
4778C74n06J47M4K01k82K83k46j45K8J47R8m0l91N15l24M23m31RM9k21M9L69o1
4801H9j42m1L19l30N54o98L4L56j74K30m51K62J96k09o2m6J42j81J34Rj8n9j6
$$ plain form
4824 -102 21 -48 234 183 6 -269 -112 109 256 -78 142 134 -360 -162 128 77 -147 46 -110 29 -75 -40
4846 -40 -186 160 22 -107 80 73 65 171 -199 -58 -72 -87 -135 -187 229 -25 131 99 96 -106 82 26 52 28 107
4871 107 13 154 81 259 27 -44 122 -3 -29 -120 238 -27 43 22 123 -117 45 -42 471 120 207 162 -164
4894 -164 -93 7 -219 -107 -55 212 -133 -13 -161 144 182 52 -38 -52 -145 122 -62 -9 312 -459 215 5
4916 5 -256 40 -18 -262 166 24 -103 265 19 110 180 -78 -101 -78 -88 -41 -169 -155 -3 -158 98 -242 -126
4939 -126 30 -77 82 125 231 279 -6 9 9 -45 269 -54 -204 192 -52 -172 170 -91 -65 -276 117 60 111
4962 111 77 247 42 63 133 -256 135 -42 -134 50 161 -156 -96 -46 2 99 -152 -73 354 31 -39 -63 331 -258
4986 -258 213 -324 175 -174 72 137 251 -36 278 331 -29 114 122 108 -54 -92 -192 5 167 -70 -155 287
$$ packed form
4824a02J23o9K82n1j77k75J57K21J47l34K20qm94J98K90n1k24J93j56J39j04L5
4846d0j46L46j38j29J87pqJ06l70J41j4j5m8n2M16k54J56l2lk02J88n6K6k4P9
4871A07r4J41p3J78k32p1J66j25k6r1L58k65P0k1J01k40J62q7N13l51Q7m5l26
4894a64P1J00k26J12N2K67l45J20j48L05L8j30r0j4r3K67j84N3L21p71O74k10
4916Ek61K96n8k44M28j42j27L68k46R1P0k58k3K3j0M7j28J4J52j55K56l40J16
4939a26J56j07J59M3J06M8k85J5%n4L14l23j50L96k44j20L42k61K6k11L93n7N1
4962A11l4J70k05K1P0l89L91j77r2J84J11l17O0N0M8R7k51P9M27l23p0k4L94n89
4986b58M71n37M99l49K46O5J14k87L14N3l60J43Qj4j62l8j00J97J62k37q5M42
$$ plain form
5008 287 -112 -60 61 111 159 50 -1 -255 -45 -331 140 -58 112 -84 31 239 69 31 37 52 -3 29 152
5031 152 14 -119 -9 -74 -38 94 -189 58 25 216 44 -95 -26 -173 45 203 -24 -23 -68 37 45 -32 403
5054 403 27 222 108 -73 59 -100 -18 62 296 -76 41 119 68 233 40 134 23 61 152 156 -221 -55 291
5077 291 240 68 109 95 -68 405 79 119 -173 -196 199 7 -284 303 -91 179 8 108 25 243 -47 -294
5099 -294 21 -121 -39 -137 199 -186 2 -162 43 -223 88 41 -149 -164 129 -55 84 128 -173 -219 -42 -241
5121 -241 -144 -141 192 34 85 -54 -74 -268 102 -15 152 -321 -171 -18 -219 -38 -187 375 215 -104 43 51
5143 51 141 -30 -53 130 -262 -95 91 -266 -273 -161 -39 26 -72 210 72 -63 -219 -85 49 -179 246 -5
5165 -5 -64 152 -195 68 19 207 11 -90 -165 83 -133 27 108 164 116 -87 200 7 161 -173 -109 106 42
$$ packed form
5008B87l99N2J21N0M8j09n1k54K10k86M71j98J70j96J15K08j70l8OJ5n5L2J23
5031A52j38j33J10o5L6J32k83K47l3J91j72j39O9j47K18J58k27Jm5J05Qp7M35
5054D03l76J95j14j81J32j59Q2Q0K34l72J17P8n1J65j93R4j11L8R1Ml77J66L46
5077B91n1j72M1j4j63M73l26M0k92k3L95j92k91N87l94K70j71J00q3K18k90k47
5099b94L15j42Q2r8L36l85J88j64K05k66L11m7j90j5K93j84J39M4l01m6J77j99
5121b41R7LL33j58N1j39k0j94L70j17J67m73J50J53k01J81j49N62j60l19J47Q
5143E1R0j71k3J83l92J67J86l57pJ12J22O5r8K82j38j35j56J34J34k28M25k51
5165en9K16l47K63m9J88j96j01p5K48k16J60Q1N6m8k03K87j93J54l34O4K15o4
$$ plain form
5188 42 -36 51 -87 5 -107 96 -103 169 -215 -124 -66 230 -300 145 45 5 -41 -36 -306 -148 107 -99 130
5211 130 -61 -47 -81 -107 -142 336 208 -147 -92 173 -51 -132 -146 -114 91 -49 -30 20 -163 -137 -202 -105 3 108
5235 108 45 267 -305 -162 133 158 50 95 -54 73 146 58 -84 0 32 -85 92 182 -68 70 -42 -242 -112
5258 -112 106 -130 11 180 150 -230 200 -199 -212 190 -169 -29 -234 103 -5 -434 115 -264 23 149 227
5279 227 -178 131 -161 -28 -69 24 -393 -309 172 42 -127 -317 163 73 63 213 124 81 117 73 106 -50 134
5302 134 -81 -85 19 147 -105 39 -18 -128 85 -260 179 213 31 -38 228 -316 92 99 438 -70 -123 1 12
5325 12 180 123 -106 349 -6 -19 1 -240 -135 22 -259 -199 -99 -84 -25 -26 42 -59 -203 238 260 -113 138 -159
5349 -159 140 74 -128 44 198 -41 71 16 160 -13 -1 -87 15 -213 38 -39 35 -62 -77 125 -246 -111 -262
$$ packed form
5188D2p8Q7j38R2j12K03j99K72l84R1N8K96n30M45j00m0m6Nk70J58K55k06K29
5211A30j91J4l4k6l5M78j28l55N5K65k24q1j4L2K05j40J9N0j83K6o5R7J08J05
5235A08o3K22n72J43K95K5j08M5j49J27P3q8j42Q4L2j17J77R0k50J38j12k00J30
5258a12K18k36J41J69l0l80M30l99j3M02l59J40k05L37j08m29N49l79K87J26P8
5279B27m05L09k92J33m1R3m17Q4M81j30j69j90M80r0j0J50q9m3L6m4L3j56J84
5302A34k15mJ04J28k52J44n7j10K13l45M39L4j82o9K66n44M08PL39n08n3J24J1
5325A2J68n7k29M55l55j3K0k41J05J57k81O0J00J5N9jO8j01j44M41K2l73K51k97
5349a59K99o6k02J72J54k39J12n5J44j73J2q6J02k28K51p7P4r7j5K02l71J35j51
$$ plain form
5372 -262 -49 384 -171 9 -19 -129 -13 -53 -96 51 -57 -23 64 2 81 -41 242 -61 104 -173 57 -59
5394 -59 -79 203 71 -250 -116 -127 -165 48 5 30 73 -193 48 -128 235 32 -182 61 179 -135 -24 -47 30
5417 30 129 -199 7 -135 -101 -36 410 140 -76 -150 -148 281 -115 -91 -90 -38 28 260 -22 140 16 210 24 43
5441 43 92 315 -31 17 -57 -114 -108 11 60 -156 182 -111 -30 -65 63 -172 -10 -23 -5 78 -44 181 -4 50 130
5466 130 -238 8 -98 25 193 -33 29 -198 109 51 -80 -60 -88 -79 -46 60 63 -5 -14 -71 54 87 42 148 -24
5491 -24 327 55 -78 90 -152 -177 124 -125 108 -72 104 30 -154 57 -28 -24 56 -139 -70 156 73 303 -25
5514 -25 -78 119 59 144 198 4 5 -102 62 -31 60 -23 95 163 2 -85 144 220 -226 -61 278 -273 -2 -56 -129
5539 -129 -238 -144 93 -104 17 -113 142 62 221 75 -15 -101 48 88 141 105 -139 -306 -16 -12 -198 -130 148
$$ packed form
5372b62K13M33n55J80k8j10J16m0m3J47j08L4Q7o2P9j22K83l03J65k77K30j16
5394e9k0K82j32l21J34j1l8K13m3K5M3k66K41j76L63k03k14K43J18l14J11k3P7
5417C0R9l28K06j42L4O5M46k70k16p4KM29l96K4JN2O6K32k82J62j24J94j86J9
5441D3M9K23l46M8p4n7OJ19M9k16L38k93Q1l5J28k35J62j3J8Q3j22K25j85N4Q0
5466A30l68K46j06J23J68k26O2k27L07n8j31K0k8RL3J06Lo8rn7J25L3m5J06j72
5491b4L51k72j33J68k42k5L01k49K33j80J76p4j84K11q5MQ0j95O9K26q3K30l28
5514b5n3J97o0Q5N4j94Jj07J64r3R1q3J18O8j61q7K29P6m46J65L39n51K71n4p3
5539a29j09R4K37j97J21j30K55q0J59j46r0q6J49M0N3l6k44j67K90Mj86O8K78
$$ plain form
5562 148 -2 -165 -201 92 -16 37 -44 31 33 42 27 -203 -166 -81 -90 -11 -304 -134 -146 -120 -116 -179 -67 -92 -27 -224 -52
5589 -52 -231 118 85 -86 -71 -344 -204 -134 -6 132 -196 160 -35 43 -86 29 47 -83 -63 -70 -51 -111 85 135
5613 135 -66 -203 126 -94 150 -191 52 -172 117 77 -166 -116 -125 -3 126 -91 -56 26 -181 -83 -174 -13 -185
5636 -185 -37 30 -200 376 -138 -159 211 -47 31 29 -79 37 -180 -49 29 103 75 6 106 179 -4 -106 -31 118
5660 118 2 -5 -16 -2 -12 -72 79 -200 -107 274 44 310 -70 -97 124 161 -223 -145 123 -118 -167 82 -37 174
5684 174 226 179 -231 -138 125 -40 -164 -18 233 49 175 68 42 -109 33 -54 -162 183 71 174 -42 -75
5706 -75 64 130 55 7 40 -19 83 108 -46 -139 19 -109 -171 -33 98 86 -78 -174 121 -215 65 107 24 93 -6
5731 -6 46 -98 18 232 -188 206 111 -121 -18 -37 -75 -4 -1 -34 65 115 64 59 -189 194 125 71 -64 39 -17 72
$$ packed form
5562A48j50j63l6K93j08N3q1P5KRj5k30L7Q5rP9k93J70j2K6Mo3J12k5O5j97J72
5589e2j79L49l3j71J5k73J40P0J28J38l28L56j95P8j29J15J8j30K0pJ9o0J96N0
5613A35k01j37L29k20K44l41K43k24K89m0k43N0rJ22J29k17L5Q2k07R8r1J61j72
5636a85J48O7k30N76n14k1L70k58P8kj08J16k17J31P8P4k8o9J00P3j83j02P5J49
5660A18j16pj1J4j0o0J51k79R3L81k30K66l80k7K21L7l84P8K68k41m9K49j19K11
5684A74N2m7m10R3K63j65j24J46K51j84J26j07k6j51J42q7j08L45j12J03k16l3
5706g5J39O6p5m8L3n9J02K5j54r3J58j28o2J38J31j2j64r6K95l36K80M2q3O9r9
5731fN2j44J16K14m20L94r5k32J03j9l8P1Ll3R9N0n1nk48L83o9n4j35J03n6Q9
$$ plain form
5757 72 105 -187 -35 -14 -91 -123 -83 -50 -46 40 82 -258 -59 180 -105 30 159 102 -148 37 -44 91 283 27
5781 27 45 232 121 262 42 132 -84 10 45 60 -122 -102 -56 72 181 -94 -19 -22 11 -207 -166 40 138 -165 -221
5806 -221 -46 -82 152 73 -107 14 -161 81 -190 229 -58 84 98 31 84 -89 -102 -150 -147 -54 -304 114 155 160
5830 160 192 36 -125 -2 -96 -126 306 9 39 102 -68 80 -207 -38 98 -46 135 85 132 44 -265 41 170
5853 170 -282 90 -147 -93 -149 73 357 7 30 -241 20 72 246 269 -109 -137 54 -53 18 204 -133 33
5875 33 -177 -132 -132 -151 -102 -120 -53 67 111 -29 -290 -24 -42 306 69 273 128 -158 -119 -211 98 -16 141 53
5899 53 159 -18 165 199 -49 117 55 313 210 -403 22 229 29 -89 50 41 -324 142 -126 164 -105 141
5921 141 -125 -324 -83 -105 -184 -23 109 28 -1 -287 -185 69 -47 -157 42 -37 40 166 12 -2 72 3 230
$$ packed form
5757G2L3k92J52K1p7l2M0L3MQ6M2l40J99K39k85J35J29n7k50J85q1J35J92k56
5781B7J8J87j11J41k20R0k16R4L5J5j82K0M6J28J09k75P5lL3k18M1K06R8l03n6
5806b21J75l6K34p9j80J21j75K42k71M19k87J42J4o7N3j73j3m8LR3k50M18M1N
5830A60L2j56j61J23r4l0M32k97L0O3j70J48k87J69J36j44J81n0M7q8l09L06J29
5853A70m52L72k37N4n6K22K84l50K3k71K61N2J74K3l78k8J91j07P1J86l37J66
5875C3k10M5%j9M9j8O7J20M4j40k61K66j8L48k37K04j45k86L9r2L09j14J57q8
5899E3J06j77J83L4k48J66o2K58j03o13M25K07k00j18J39rl65M66k68K90k69K46
5921A41k66j99K41k2p9J61J32q1k9k86J02K54j16j10J99p9P7J26j54j4P4o9K27
$$ plain form
5944 230 47 -32 218 -214 139 49 -88 101 -49 -44 168 -102 174 -151 30 130 103 314 252 0 -72 74
5966 74 -59 65 81 -124 -68 226 215 -111 27 6 -44 227 58 -182 -136 -1 -51 -339 19 185 63 88 -88
5989 -88 42 -155 74 -36 137 84 304 -54 36 -102 114 22 -357 -22 64 -210 278 54 262 -250 129 22
6011 22 -121 89 45 75 -22 -47 -54 72 14 23 -144 -1 -32 -5 75 -37 345 -1 58 -68 -53 17 65 -207 99 -235
6037 -235 33 -279 165 373 -152 -66 -48 -97 -177 27 99 280 -131 160 76 332 228 -53 81 157 -67 97
6059 97 -4 25 -187 -148 -97 -118 -49 -29 155 -219 56 -209 -101 36 36 28 -37 -131 -134 10 -181 53 71 -71 95
6084 95 -31 -24 -10 213 198 -16 -67 -58 6 -62 -188 125 97 57 34 -102 -197 53 -120 7 -159 -57 -149 52 -134
6109 -134 23 87 347 169 73 -257 16 27 -168 181 216 118 -2 -111 -11 -8 -24 -109 25 242 203 -4 -203
$$ packed form
5944B30j83p9K50m32L53r0j37J89j50NK12k70K76l25J81J00k7K11o2k52p2J46
5966G4j33J24J6k05N6K94j1l26J38k1n0K71j69k40M6J35n0k88L58J66j22K5j76
5989h8J30j97K29j10J73n3K20l58R0j38K16r2l79L35Q6k74M88k24K08n12L79j07
6011B2j43K10m4L0r7k5pJ26n8Rj67J43l1K7Q0j12L82l46N9j26J5P0M8k72L06l34
6037b35K68l12M44K08n25Q6J8m9q0K04P2J81m11K91q4K56j04k81J34P6k24J64
6059I7j01K9k12L9N1k1O9K0J84l74K75k65J08J37%qo5r4lJ44j91K34J8j42J66
6084I5j26PJ4K23j5k14n1RO4o8j26L13k8m0k3j36r5K50j73J27j66J02r2K01j86
6109a34J57O4K60j78r6l30K73J1j95L49L5r8j20j09J00Lj6q5J34K17l9k07j99
$$ plain form
6132 -203 -166 47 -55 -13 62 201 27 -20 -17 257 31 -224 -316 -3 6 -3 -68 246 -38 74 -206 26 16 -224
6156 -224 14 228 -188 20 152 274 140 170 94 156 235 116 127 70 92 212 67 -95 156 20 76 27 195
6179 195 90 71 23 25 271 -114 -160 -31 -359 210 -145 -123 115 -30 4 -69 -51 6 104 -180 -126 26 7 -56 177
6204 177 118 149 -18 186 164 -62 -49 -224 15 -252 90 45 -256 -99 124 48 109 129 -18 -37 -59 -30 -92 -117
6228 -117 73 9 -274 -254 -55 -61 21 -147 -42 172 258 -146 69 -345 -233 -148 221 -150 -15 23 84 8 -245
6251 -245 -94 -37 -100 81 28 96 349 -69 9 130 19 131 -5 138 -46 84 106 166 194 48 -160 56 -23
6274 -23 131 46 -114 172 -135 85 122 -133 101 -86 121 145 -368 20 -11 72 319 63 -117 -198 204 69
6296 69 -220 -105 -119 -20 111 -186 39 123 46 326 197 -34 -60 -42 29 79 -277 -113 -138 -57 57 -182 -165 -206
$$ packed form
6132b03L7K13j02M2P5J39j74m7LK74k26k55r2L13Rro5L14k84J12k80K32j0k40
6156b24K38K14m16K08J32J22j34L0p6O2P9j19J1n7K2J20j45j62K51j36N6m9J68
6179A95j05j9m8KK46l85m6J29l28N69l55K2K38j45L4p3J8N7R8k84N4J52j9o3K33
6204A77n9L1j67K04k2k26J3j75K39k67L42m5l01J57K23p6O1K0j47j9k2K9o2k5
6228a17J90o4k83K0J99oQ2j68J05K14Q6m04K15m14J12Q5L69l71J35L8O1p6k53
6251b45J51N7o3J81n3O8K53m18P8J21j11J12j36J43j84J30K2O0K8j46k08K16p9
6274b3J54q5j60K86l07K20L7k55K34j87K07K4n13L88l1Q3K47k56j80q1M02j35
6296F9k89J15j4R9J31k97K25Q4p7K80j29k31k6J8P1N0l56J64k5Q1J14k39J7m1
$$ plain form
6320 -206 290 -258 -33 15 101 126 -129 76 261 40 -153 -11 -92 -162 29 -30 -94 6 -2 -66 139 -84 241
6343 241 133 36 -88 -143 148 -169 7 -170 246 -207 -93 124 -129 -65 168 83 -138 65 -391 51 -53
6364 -53 -94 257 65 -329 -133 98 201 -115 -52 -193 -53 -96 -52 214 0 -57 -233 226 251 18 278 95
6386 95 95 -40 -15 -105 239 -136 182 31 -190 -165 66 47 108 -84 -92 -194 363 276 50 -78 349 -92 71 -132
6410 -132 -136 -51 251 159 52 89 13 199 -56 -5 33 136 -71 27 209 -185 215 -167 230 -34 156 13 -2
$$ packed form
6320b06M96n48K25M8Q6K5k55K05J85k21j93J42q1p0J91n9o4J00qo4K05k23L25
6343B41j08r7j24n5K91l17J76j77M16m53J14K17k53O4K33q5k21K03m56M42j04
6364e3m1L51j92l94J96K31J03l16O3j41J40m3M4K66k14n7j76M59K5k33K60j83
6386I5%j35K5r0L44l75L18j51k21K5K31j9O1j92qj02N57q7k26j28M27m41J63k03
6410a32mQ5L02r2j07L7p6J86k55N1L8J03k07R8J82l94M00l82L97k64J90j43j5
$$ [...]
8191a35
##END NTUPLES=NMR FID
##END=
