##TITLE=1H_DE-20HM2
 CDCl3
 8 sc, 
 25.10.2023
##JCAMPDX= 6.0         $$ Bruker NMR JCAMP-DX V2.0
##DATA TYPE= NMR FID
##DATA CLASS= NTUPLES
##ORIGIN= UXNMR, Bruker Analytische Messtechnik GmbH
##OWNER= root
$$ XWIN-NMR		Version 3.5
$$ Wed Oct 25 14:56:18 2023 Russian Standard Time (UT+4h)  she@DPX200
##.OBSERVE FREQUENCY= 200.13135
##.OBSERVE NUCLEUS= ^1H
##.DELAY= (6, 6)
##.ACQUISITION MODE= SIMULTANEOUS
##.ACQUISITION SCHEME= undefined
##.AVERAGES= 8
##.DIGITISER RES= 18
##SPECTROMETER/DATA SYSTEM= spect
##.PULSE SEQUENCE= zg30
##.SOLVENT NAME= D2O
##.SHIFT REFERENCE= (INTERNAL, D2O, 0, 15.7039)
##AUDIT TRAIL= $$ (NUMBER, WHEN, WHO, WHERE, WHAT)
$$ ##TITLE= Audit trail, XWIN-NMR		Version 3.5
$$ ##JCAMPDX= 5.01
$$ ##ORIGIN= Bruker BioSpin GmbH
$$ ##OWNER= she
$$ F:/spectra/data/she/nmr/H-F/1/audita.txt
$$ ##AUDIT TRAIL=  $$ (NUMBER, WHEN, WHO, WHERE, WHAT)
(   1,<2023-10-25 14:54:17.96 +0400>,<she>,<DPX200>,
      <created by zg, POWCHK disabled, PULCHK disabled
       configuration hash MD5:
       00 E9 B6 7A A2 85 ED C7 34 08 36 98 17 FE 4E 26
       data hash MD5: 16K
       7D 8D 4C 29 39 58 3C FE D0 8A F0 16 36 6F 06 D9>)
$$ ##END=
$$ 
$$ hash MD5
$$ 4F 96 0A 56 E1 2B C0 6C A3 EC 12 3B 6C AF EC 6B
##$RELAX= 
##$RELAX= 
##$RELAX= 
##$RELAX= 
##$RELAX= 
##$RELAX= 
$$ Bruker specific parameters
$$ --------------------------
##$DU= <F:/spectra>
##$EXPNO= 1
##$NAME= <H-F>
##$PROCNO= 1
##$TYPE= <nmr>
##$USER= <she>
##$AMP= (0..31)
100 100 100 100 100 100 100 100 100 100 100 100 100 100 100 100 100 100 
100 100 100 100 100 100 100 100 100 100 100 100 100 100 
##$AQSEQ= 0
##$AQ_mod= 1
##$AUNM= <au_zg>
##$AUTOPOS= <>
##$BF1= 200.13
##$BF2= 200.13
##$BF3= 200.13
##$BF4= 200.13
##$BF5= 200.13
##$BF6= 200.13
##$BF7= 200.13
##$BF8= 200.13
##$BYTORDA= 1
##$CFDGTYP= 0
##$CFRGTYP= 5
##$CHEMSTR= <none>
##$CNST= (0..31)
1 1 145 1 1 1 1 1 1 1 1 1 1 1 1 1 1 1 1 1 1 1 1 1 1 1 1 1 1 1 1 1 
##$CPDPRG= <>
##$CPDPRG1= <>
##$CPDPRG2= <>
##$CPDPRG3= <>
##$CPDPRG4= <mlev>
##$CPDPRG5= <mlev>
##$CPDPRG6= <mlev>
##$CPDPRG7= <mlev>
##$CPDPRG8= <mlev>
##$CPDPRGB= <>
##$CPDPRGT= <>
##$D= (0..31)
0 1.2 0 0 0 0 0 0 0 0.06 0 0.03 0 0 0 0 0.0002 0 0 0 0 0 0 0 0 0 0 0 0 
0 0 0 
##$DATE= 1698231257
##$DBL= (0..7)
120 120 120 120 120 120 120 120 
##$DBP= (0..7)
150 150 150 150 150 150 150 150 
##$DBP07= 0
##$DBPNAM0= <>
##$DBPNAM1= <>
##$DBPNAM2= <>
##$DBPNAM3= <>
##$DBPNAM4= <>
##$DBPNAM5= <>
##$DBPNAM6= <>
##$DBPNAM7= <>
##$DBPOAL= (0..7)
0.5 0.5 0.5 0.5 0.5 0.5 0.5 0.5 
##$DBPOFFS= (0..7)
0 0 0 0 0 0 0 0 
##$DE= 6
##$DECBNUC= <off>
##$DECIM= 32
##$DECNUC= <off>
##$DECSTAT= 4
##$DIGMOD= 1
##$DIGTYP= 9
##$DL= (0..7)
0 120 120 120 120 120 120 120 
##$DP= (0..7)
150 150 150 150 150 150 150 150 
##$DP07= 0
##$DPNAME0= <>
##$DPNAME1= <>
##$DPNAME2= <>
##$DPNAME3= <>
##$DPNAME4= <>
##$DPNAME5= <>
##$DPNAME6= <>
##$DPNAME7= <>
##$DPOAL= (0..7)
0.5 0.5 0.5 0.5 0.5 0.5 0.5 0.5 
##$DPOFFS= (0..7)
0 0 0 0 0 0 0 0 
##$DQDMODE= 0
##$DR= 18
##$DS= 0
##$DSLIST= <SSSSSSSSSSSSSSS>
$$ [...]
##$SUBNAM2= <"">
##$SUBNAM3= <"">
##$SUBNAM4= <"">
##$SUBNAM5= <"">
##$SUBNAM6= <"">
##$SUBNAM7= <"">
##$SUBNAM8= <"">
##$SUBNAM9= <"">
##$SW= 18.05172834244
##$SWIBOX= (0..15)
0 0 2 0 0 0 0 0 0 0 0 0 0 0 0 0 
##$SW_h= 3612.71676300578
##$TD= 16384
##$TD0= 1
##$TE= 0
##$TE2= 300
##$TE3= 300
##$TEG= 300
##$TL= (0..7)
0 120 120 120 120 120 120 120 
##$TP= (0..7)
150 150 150 150 150 150 150 150 
##$TP07= 0
##$TPNAME0= <>
##$TPNAME1= <>
##$TPNAME2= <>
##$TPNAME3= <>
##$TPNAME4= <>
##$TPNAME5= <>
##$TPNAME6= <>
##$TPNAME7= <>
##$TPOAL= (0..7)
0.5 0.5 0.5 0.5 0.5 0.5 0.5 0.5 
##$TPOFFS= (0..7)
0 0 0 0 0 0 0 0 
##$TUNHIN= 0
##$TUNHOUT= 0
##$TUNXOUT= 0
##$USERA1= <user>
##$USERA2= <user>
##$USERA3= <user>
##$USERA4= <user>
##$USERA5= <user>
##$V9= 5
##$VALIST= <valist>
##$VCLIST= <CCCCCCCCCCCCCCC>
##$VD= 0
##$VDLIST= <DDDDDDDDDDDDDDD>
##$VPLIST= <PPPPPPPPPPPPPPP>
##$VTLIST= <TTTTTTTTTTTTTTT>
##$WBST= 1024
##$WBSW= 4
##$XGAIN= (0..3)
0 0 0 0 
##$XL= 0
##$YL= 0
##$YMAX_a= 42432
##$YMIN_a= -57803
##$ZGOPTNS= <>
##$ZL1= 120
##$ZL2= 120
##$ZL3= 120
##$ZL4= 120
##$ABSF1= 10
##$ABSF2= 0
##$ABSG= 5
##$ABSL= 3
##$ALPHA= 0
##$AQORDER= 0
##$ASSFAC= 0
##$ASSFACI= 0
##$ASSFACX= 0
##$ASSWID= 0
##$AUNMP= <proc_1d>
##$AZFE= 0.1
##$AZFW= 0.1
##$BCFW= 1
##$BC_mod= 2
##$BYTORDP= 1
##$COROFFS= 0
##$CY= 11.3945322036743
##$DATMOD= 1
##$DC= 2
##$DFILT= <>
##$DTYPP= 0
##$F1P= 15.7292609196834
##$F2P= 12.9074282941183
##$FCOR= 0.5
##$FTSIZE= 0
##$FT_mod= 4
##$GAMMA= 1
##$GB= 0.15
##$INTBC= 1
##$INTSCL= 1
##$ISEN= 128
##$LB= 0.24
##$LEV0= 0
##$LPBIN= 0
##$MAXI= 10000
##$MC2= 0
##$MEAN= 0
##$ME_mod= 0
##$MI= 1.114404
##$NCOEF= 0
##$NC_proc= 0
##$NLEV= 6
##$NOISF1= 3.799351
##$NOISF2= 2.8
##$NSP= 1
##$NTH_PI= 0
##$NZP= 0
##$OFFSET= 15.70392
##$PC= 1
##$PHC0= -23516.23
##$PHC1= 17.65272
##$PH_mod= 1
##$PKNL= yes
##$PPARMOD= 0
##$PSCAL= 0
##$PSIGN= 0
##$REVERSE= no
##$SF= 200.130013532006
##$SI= 16384
##$SIGF1= 3
##$SIGF2= 2
##$SINO= 400
##$SIOLD= 16384
##$SREGLST= <1H.CDCl3>
##$SSB= 0
##$STSI= 0
##$STSR= 0
##$SW_p= 3612.71676300578
##$SYMM= 0
##$S_DEV= 0
##$TDeff= 0
##$TDoff= 0
##$TI= <>
##$TILT= no
##$TM1= 0
##$TM2= 0
##$TOPLEV= 0
##$USERP1= <user>
##$USERP2= <user>
##$USERP3= <user>
##$USERP4= <user>
##$USERP5= <user>
##$WDW= 1
##$XDIM= 8192
##$YMAX_p= 0
##$YMIN_p= 0
$$ End of Bruker specific parameters
$$ ---------------------------------
##NTUPLES= NMR FID
##VAR_NAME=  TIME,          FID/REAL,        FID/IMAG
##SYMBOL=    X,             R,               I
##VAR_TYPE=  INDEPENDENT,   DEPENDENT,       DEPENDENT
##VAR_FORM=  AFFN,          ASDF,            ASDF
##VAR_DIM=   8192,          8192,            8192
##UNITS=     SECONDS,       ARBITRARY UNITS, ARBITRARY UNITS
##FACTOR=    0.0002768,     1,               1
##FIRST=     0,             0,               0
##LAST=      2.2672688,     0,               0
##MIN=       0,             -57803,          0
##MAX=       2.2672688,     42432,           0
$$ Real data points
##PAGE= N=1
##DATA TABLE= (X++(R..R)), XYDATA
$$ plain form
0 0 0 0 0 0 0 0 0 0 0 0 0 0 0 0 0 0 0 0 0 0 0 0 0 -2 6 -8 8 -8 8 -8 8 -10 13 -16 16 -17 20 -23 25 -27 30 -34 37 -42 45
45 45 -51 55 -62 68 -73 82 -91 99 -109 123 -136 152 -169 192 -217 247 -286 337 -406 504 -655
66 -655 914 -1438 2917 -14738 -57803 -27733 -20612 -15546 29713 42432 21637 21220 -2286 -40166
80 -40166 -37067 -20151 -6680 23348 36477 28802 18689 -9633 -35798 -32553 -24326 -6918 27590
93 27590 37925 27154 16716 -13867 -38726 -29233 -18480 -3633 28711 36295 21136 11488 -11451
106 -11451 -35194 -28893 -17183 -1616 27459 34147 20542 10988 -13268 -35795 -26495 -15907 -1840
119 -1840 30660 36272 15425 7593 -11942 -37585 -26770 -9257 1430 28169 35680 12679 2021
132 2021 -10640 -32988 -27196 -7959 3268 25098 35330 15585 -1146 -14355 -31243 -25487 -7071
$$ packed form
0@%%%%%%%%%%%%%%%%%%%%%%%kQj4J6j6J6j6J6j8K3k9L2l3L7m3M8n2N7o4P1p9Q7
45D5r6J06j17J30j41J55j73J90k08K32k59K88l21L61m09M64n33O23p43R10j159
66f55J569k352M355j7655m3065L0070P121N066M5259J2719k0795m17k3506l7880
80d0166L099J6916J3471L0028J3129p675j0113k8322k6165L245Q227J7408L4508
93B7590J0335j0771j0438l0583k4859R493J0753J4847L2344P584j5159r648k2939
106a1451k3743O301J1710J5567K9075O688j3605r554k4256k2527R300J0588J4067
119a840L2500N612k0847p832j9535k5643J0815J7513J0687K6739P511k3001j0658
132B021j2661k2348N792J9237J1227K1830J0232j9745j6731j3209j6888N756J8416
$$ plain form
145 -7071 6596 26121 32504 13992 -2110 -16927 -31855 -22199 -2836 7430 24227 30616 11842
158 11842 -3734 -15592 -30371 -22428 -1793 9725 23984 29925 11119 -6360 -16937 -29083
170 -29083 -20839 524 11754 23252 27780 9313 -8647 -17733 -27280 -19508 1969 13414 22218
183 22218 25536 8712 -9745 -18440 -25393 -17902 2567 15141 22262 23377 7652 -10770 -20060
196 -20060 -24975 -15658 4192 15965 22067 21407 5626 -11583 -19423 -23720 -14497 5883 16791 21506
210 21506 20319 4074 -12801 -19243 -22493 -13392 6855 18206 20958 18694 2266 -14745 -19720
223 -19720 -20287 -11751 7778 18971 20183 16634 1799 -15340 -20394 -18469 -10067 8001 19979 19994
237 19994 14539 221 -15923 -20812 -17667 -7996 8896 20073 19774 12849 -1075 -16502 -20680 -16336
$$ packed form
145g071J3667J9525O383j8512j6102j4817j4928R656J9363J0266J6797O389j8774
158A1842j5576j1858j4779P943K0635J1518J4259N941j8806j7479j0577j2146
170b9083Q244K1363J1230J1498M528j8467j7960r086r547P772K1477J1445Q804
183B2218L318j6824j8457q695o953P491K0469J2574P121J115j5725j8422r290
196b0060m915R317J9850J1773O102o60j5781j7209p840m297R223K0380J0908M715
210B1506j187j6245j6875o442l250R101K0247J1351K752k264j6428j7011m975
223a9720n67Q536J9529J1193J212l549j4835j7139n054J925Q402J8068J1978J5
237A9994n455j4318j6144m889L145R671J6892J1177k99o925j3924j5427m178M344
$$ plain form
251 -16336 -6013 9910 20439 19376 10974 -2218 -16621 -20718 -15449 -4231 10929 20177 18490
264 18490 9809 -3959 -17136 -20195 -14417 -2593 11848 20356 17482 8585 -5287 -17282 -19757
277 -19757 -13358 -1162 12736 20407 16772 7042 -6022 -18000 -19323 -12071 87 13566 20298
290 20298 15993 5584 -7534 -18488 -19034 -10328 1385 13772 20059 15406 3824 -8803 -18088
303 -18088 -18389 -9361 2693 14259 19515 14289 2682 -9543 -18053 -17595 -8354 3845 14861 19066
317 19066 13223 994 -10939 -17914 -16815 -6864 5056 15241 18837 12621 138 -11928 -18064
330 -18064 -15584 -5927 6618 15759 17899 11070 -744 -12561 -18288 -14953 -4533 7586 16310 17211
344 17211 10087 -1819 -13213 -17899 -14097 -3304 8724 16266 16768 9281 -3168 -13728 -17722 -13147
$$ packed form
251a6336J0323J5923J0529j063q402j3192j4403m097N269J1218J5160R248j687
264A8490q681j3768j3177l059N778J1824J4441Q508k874q897j3872j1995k475
277a9757O399J2196J3898P671l635r730j3064j1978j323P252J2158J3479O732
290B0298m305j0409j3118j0954n46Q706J1713J2387O287m653j1582j2627r285
303a8088l01R028J2054J1566N256n226j1607j2225q510M58R241J2199J1016M205
317A9066n843j2229j1933o975J099R951J1920J0185L596o216j2483j2066o136
330a8064K480R657J2545R141K140o829j1814j1817n727L335J0420J2119Q724R01
344A7211p124j1906j1394m686L802J0793J2028P542N02p487j2449j0560l994M575
$$ plain form
358 -13147 -2131 9677 16366 15283 7779 -3744 -14274 -17674 -12342 -729 10363 16725 15280
371 15280 6328 -5121 -14626 -17182 -11312 -15 11461 16853 14254 5234 -6177 -14985 -16821 -10266
385 -10266 1135 11792 17081 13516 3901 -7160 -14905 -15916 -9432 2065 12550 16883 12845 2608
399 2608 -8583 -15050 -15276 -8426 3181 13235 16426 11603 1801 -9230 -15253 -14378 -7275 3907
413 3907 13921 16549 10995 657 -9904 -15572 -13759 -5947 5092 13844 16213 10487 -905 -11012
427 -11012 -15857 -12778 -4467 6087 14182 15476 9684 -1433 -11697 -15888 -12176 -3267 6964 14465
441 14465 14903 8494 -2241 -12377 -15777 -11479 -2474 7715 14435 14159 7593 -3241 -13196 -15722
455 -15722 -10514 -1385 8647 14773 13479 6331 -3547 -12828 -15638 -10057 -8 9457 14664 12739
$$ packed form
358a3147J1016J1808O689j083p504j1523j0530l400N332J1613J1092O362j445
371A5280q952j1449r505k556N870J1297J1476N392k599r020j1411q808j836O555
385a0266J1401J0657N289l565r615j1061p745j011O484J1497J0485M333m038j0237
399B608j1191o467k26O850J1607J0054L191m823r802j1031o023Q75P103J1182
413C907J0014K628n554j0338j0561n668J813P812J1039Q752K369n726j1392j0107
427a1012m845L079Q311J0554Q095J294n792j1117j0264m191L712Q909J0231P501
441A4465M38o409j0735j0136l400M298R005J0189O720k76o566j0834r955k526
455a5722N208R129J0032O126j294p148r878r281k810N581J0049R465N207j925
$$ plain form
469 12739 5457 -5076 -13161 -14932 -9438 272 10659 15240 12019 4404 -5345 -13653 -14705 -8079
483 -8079 1223 10821 15356 11202 3100 -5532 -13667 -14950 -7158 2342 10701 15553 10863 1153 -6674
498 -6674 -13624 -14437 -6320 3244 11457 15307 10424 -152 -7573 -13169 -13588 -5495 4514 11302 14632
513 14632 10011 -416 -8813 -13188 -12773 -5194 5089 12055 14163 9129 -984 -9631 -13734 -11827
527 -11827 -3535 5773 12883 13880 7946 -2228 -10123 -13930 -11176 -2204 5938 12145 13894 6969 -3071
542 -3071 -10101 -13909 -11463 -1184 7274 12289 13721 6297 -4790 -10674 -13208 -10418 -438 8946 11841
557 11841 12379 6393 -5419 -11319 -12251 -9826 -61 9401 12057 11455 5718 -5866 -12450 -12435 -8899 951
573 951 10872 12563 10165 4589 -6405 -12571 -11992 -7714 1570 10605 12680 9900 3262 -6577 -12545
$$ packed form
469A2739p282j0533q085j771N494R710J0387M581l221p615r749q308j052O626
483h079R302R598M535m154q102q632q135j283P792R500Q359M852m690r710p827
498f674o950q13Q117R564Q213L850m883j0576p421n596m19Q093J0009O788L330
513A4632m621j0427q397m375M15P579J0283O966K108n034j0113q647m103J907
527a1827Q292R308P110R97n934j0174p895l807K754Q972Q142O207J749o925j0040
542c071p030l808K446J0279Q458N015J432p424j1087n884k534K790R980R384K895
557A1841N38n986j1812n900r32K425R765R462K656o02n737j1584o584J5L536R850
573I51R921J691k398n576j0994o166N79M278R284R035K075k780o638r839n968
$$ plain form
588 -12545 -11745 -7203 2303 11128 12644 9484 2520 -7582 -13001 -11111 -6248 3145 11645 12344 8365
603 8365 1622 -8216 -12935 -10443 -5218 3895 11961 12072 7755 855 -8543 -12944 -9893 -4412 4107
618 4107 12536 12159 7090 -71 -9333 -13164 -9375 -3382 4920 12482 11574 5778 -905 -9547 -13265 -8804
634 -8804 -2416 5249 13252 11381 5122 -1383 -9988 -13229 -8158 -1165 5889 13078 11311 3874 -2447
649 -2447 -10065 -13454 -7318 -103 6323 12511 10959 3262 -3018 -9763 -13091 -7005 1010 6894 12597
664 12597 10903 2593 -4421 -10007 -12756 -6950 1760 7843 12327 10474 2166 -5705 -10566 -11805 -5909
679 -5909 2198 8045 12057 9344 1163 -5935 -10788 -11743 -5194 3181 8881 12099 8884 450 -6465
694 -6465 -10998 -11409 -4293 3499 8840 12053 8553 -636 -6981 -10575 -11029 -3422 4783 8668 11552 8220
$$ packed form
588a2545Q00M542R506Q825J516l160o964j0102n419J890M863R393Q500O99l979
603H365o743r838m719K492N225R113Q066J11m317o900r398m401L051N481Q519
618D107Q429l77n069p161r262l831L789N993Q302P562r08n796o683q642l718M461
634h804O388P665Q003j871o259o505q605l241N071O993P054P189j767p437o321
649b447p618l389O136P215O426O188j552p697o280o745l328O086Q015N884N703
664A2597j694q310p014n586k749N806Q710O083M484j853q308p871m861j239N896
679e909Q107N847M012k713q181p098m853r55O549Q375N700L218l215q434o915
694f465m533m11P116P792N341L213l500r189o345l594m54P607Q205L885K884l332
$$ plain form
710 8220 -1232 -7665 -10831 -10593 -2911 5849 9051 10439 7216 -1877 -8416 -10479 -9881 -2505 6192 10035
726 10035 9896 6929 -2392 -9064 -10430 -8866 -1974 6503 10458 9601 5814 -2673 -9256 -10599 -8032
741 -8032 -1027 6986 10429 9184 4916 -3309 -9569 -10246 -7557 -359 7550 10892 8748 3740 -3885
756 -3885 -9743 -10281 -6995 -82 8104 10549 8460 3314 -4550 -9907 -9631 -6202 864 8389 10524 7803
772 7803 2457 -5295 -10022 -9002 -5793 1204 8843 10768 7463 1696 -5786 -10601 -8710 -4543 1854
787 1854 8789 10307 6833 1089 -6425 -10496 -8556 -3589 2613 8886 10587 6333 -45 -6478 -10565
802 -10565 -8465 -3036 3120 9257 10081 5636 -249 -7062 -10455 -7944 -2290 3893 9127 9770 5193
817 5193 -1299 -7355 -10528 -7541 -1320 4483 9158 9406 4812 -1938 -7671 -10507 -7175 -650 5390
$$ packed form
710H220r452o433l166K38P682Q760L202J388l223r093o539k063N98P376Q697L843
726A0035j39k967r321o672j366J564O892Q477L955q57l787q487o583j343K567
741h032P005Q013L443j245m268q225o260o77K689P198P909L342k144n008p625
756c885n858n38L286O913Q186K445k089n146p864n357K76L429P066P525K135k721
772G803n346p752m727J020L209O997P639J925l305n767p482m815J891M167O397
787A854O935J518l474n744p514m071J940M967O202O273J701m254o378o433m087
802a0565K100N429O156O137Q24m445n885o813l393K511N654O183N234O43m577
817E193o492o056l173K987O221N803M675K48m594o750n733k836L332O525O040
$$ plain form
832 5390 9069 9052 4282 -2531 -8098 -9977 -6711 -216 5898 9279 8427 3283 -2846 -8107 -10064 -6251
848 -6251 650 6394 9367 8224 2353 -3880 -8193 -9325 -5752 722 6797 9469 7824 1783 -4309
863 -4309 -8754 -9056 -5169 1567 7176 9602 7305 1476 -4793 -8660 -8920 -4713 2260 7688 9397 6982
879 6982 694 -5419 -8610 -8448 -4110 2511 7763 9058 6438 117 -5710 -8744 -7912 -3449 3178 7948
895 7948 9040 5743 -318 -6328 -8900 -7821 -2762 3778 7837 8915 5215 -1035 -6619 -9107 -6996
910 -6996 -2061 4098 8337 8569 5011 -1508 -7232 -8978 -6837 -1126 4644 8264 7952 4210 -1730 -7382
926 -7382 -9174 -6331 -646 5202 8665 7980 3663 -2724 -7758 -8783 -5666 -14 5671 8556 7609 3016
942 3016 -2931 -7691 -8576 -5058 869 5903 8695 7092 2115 -3711 -8015 -8627 -4891 977 6660 8639
$$ packed form
832E390L679j7m770o813n567j879L266O495O114L381q52n144o129n261j957L813
848f251O901N744K973j143n871o233m313j132L573O474O075K672j645o041o092
863d309m445l02L887O736N609K426k297n829o269l867k60M207O973N428J709k415
879F982o288o113l191J62M338O621N252J295k620o321n827l034Q32M463O627M770
895G948J092l297o061o010k572J079N059O540M059J078l700o250n584k488K111
910f996M935O159M239K32l558o519n724j746K141N711N770L620l12l742n940n652
926g382j792K843N685N848L463o85m317o387n034j025L117N652N685K885r47m593
942C016n947m760q85L518N927N034K792j603m977n826m304o12L736N868N683J979
$$ plain form
958 8639 6744 1618 -4194 -7953 -7973 -4476 1751 6807 8380 6257 1303 -4590 -7975 -7995 -3824 2239
974 2239 6974 8224 5597 681 -4849 -8144 -7618 -3131 2617 7163 8212 5252 -6 -5234 -8176
989 -8176 -6939 -2603 2984 7373 8165 4963 -584 -5586 -8247 -6891 -2042 3452 7366 7921 4959 -1298
1005 -1298 -5860 -7875 -6462 -1645 4183 7262 7548 3980 -1743 -6581 -8017 -5839 -1151 4606 7869
1020 7869 7211 3351 -1939 -6909 -8227 -5426 -440 4976 8085 7103 2718 -2834 -6820 -8281 -4775
1035 -4775 4 5209 8032 6837 2509 -3110 -7105 -7882 -4630 724 5524 7927 6550 1788 -3670
1050 -3670 -7185 -7538 -4166 1273 6086 7830 6213 1364 -4199 -7415 -7047 -3905 1667 6026 7271
1065 7271 5735 879 -4488 -7410 -6945 -3266 2324 6451 7498 5258 492 -4822 -7521 -6515 -2574
$$ packed form
958H639j895n126n812l759k0L497O227N056J573k123m954n893l385k0M171O063
974B239M735J250k627m916n530l295N26M487N748M546J049k960n258n228k942
989h176J237M336N587M389P92l202n547n002k661J356M849N494L914N55k962o257
1005a298m562k015J413M817N828L079K86l568n723m838j436K178M688N757L263
1020G869o58l860n290m970j318K801M986N416L109r82m385n552l986j461L506
1035d775M779N205K823j195m328n619l995p77L252N354M800K403j377m762n458
1050c670l515l53L372N439M813J744j617m849n563l216L68L142N572M359J245
1065G271j536m856n367k922M65L679N590M127J047k240m766n314k699J006L941
$$ plain form
1080 -2574 2578 6787 7274 4705 -68 -5039 -7376 -6010 -2150 2911 6999 7181 4480 -564 -5583
1095 -5583 -7588 -5883 -1660 3464 7152 7001 3803 -912 -5511 -7410 -5562 -1148 4029 7046 6665
1110 6665 3242 -1497 -5723 -6950 -5593 -584 4429 7126 6688 3085 -2214 -6363 -7403 -4968 -398
1125 -398 4949 7029 5773 2648 -2737 -6590 -7066 -4871 -114 5199 7318 5873 1963 -2725 -6821
1140 -6821 -6689 -3803 492 5469 7711 5296 1359 -3040 -7120 -6877 -3196 1004 5313 7608 5168
1155 5168 647 -3730 -6976 -6834 -2949 1807 5717 7194 5096 219 -3986 -6815 -6091 -2648 2138
1170 2138 5586 7292 4846 -145 -4387 -7191 -5846 -2319 2457 5925 6966 3945 -391 -4600 -7298
1185 -7298 -5511 -1434 2846 6177 6915 3722 -948 -4664 -6961 -5504 -989 3320 6228 6874 3293
$$ packed form
1080b574N152M209M87k569m773m971k337J366L860N061M088J82k701n044n019
1095e583k005J705M223N124L688j51l198m715m599j899J848M414N177L017l81
1110F665l423m739m226j227J357N009N013K697m38l603n299m149j040K435M570
1125c98N347K080j256l125n385l853m76K195M757N313K119j445l910m688m096
1140f821J32K886M295M977K242k415l937m399m080K43L681M200M309K295k440
1155E168m521m377l246J42L885M756L910J477k098m877m205k829P24L443M786
1170B138L448J706k446m991m242k804J345L527M776L468J041l021m336m209k698
1185g298J787M077M280L331P38l193m670l716k297J457M515M309K908O46l581
$$ plain form
1200 3293 -1287 -5254 -7321 -5222 -410 3718 6078 6535 2945 -2011 -5089 -6865 -4979 183 4483
1215 4483 6425 6072 2274 -2440 -5588 -6773 -4731 124 4765 6319 5547 2329 -2899 -5650 -6319 -4139
1231 -4139 584 4924 6540 5323 1724 -3088 -5933 -6186 -4045 949 5228 6361 4958 1498 -3406
1246 -3406 -5943 -5933 -3131 1214 5101 6587 4603 711 -3725 -5827 -5788 -2692 1586 5523 6263 4738
1262 4738 408 -4246 -6212 -5645 -2431 2246 5824 6219 3807 -14 -4499 -6180 -5008 -2377 2570
1277 2570 5609 5967 3733 -432 -4862 -6153 -4784 -1679 2836 6159 5699 3471 -503 -4980 -6561
1292 -6561 -4514 -1207 3054 6067 5629 2886 -867 -5186 -6300 -4163 -673 3433 6384 5366 2349
1307 2349 -1368 -5524 -6321 -3778 -340 3504 6142 5508 1948 -2006 -5374 -6215 -3431 203 4060 6052
$$ packed form
1200C293m580l967k067K099M812M128K360M57l590m956l078j776J886N162M300
1215D483J942l53l798m714l148j185K042M855M641J554p72l218n228k751o69K180
1231d139M723M340J616j217l599m812k845k53K141M994M279J133j403l460m904
1246c406k537J0K802M345L887J486j984l892m436k102L9L096M278L937P40j525
1262D738m330m654j966N67L214M677L578L95k412l821m485j681J172K631M947
1277B570L039L58k234m165m430j291J369L105M515L323m60k228l974m477j581
1292f561K047L307M261L013m38k743l753m319j114K137L490M106K951j018l017
1307B349l717m156p97K543L438L844K638o34l560l954l368q41K784L634L857J992
$$ plain form
1323 6052 5125 1628 -2195 -5457 -5863 -3360 880 4267 5830 4791 1133 -2640 -5693 -5674 -3019 804
1339 804 4546 6069 4530 897 -2982 -5569 -5344 -2530 1320 4848 6274 4141 396 -3355 -5791
1354 -5791 -5340 -2176 1658 4801 6330 3984 -306 -3584 -5737 -5338 -1806 1905 4931 5771 3863 -756
1370 -756 -3967 -5602 -5140 -1362 2487 4693 5665 3255 -806 -4264 -5576 -4686 -884 2753 5164 5270
1386 5270 2875 -1090 -4450 -5512 -4515 -993 3145 5539 5089 2749 -1244 -4634 -5609 -4037 -485 3178
1402 3178 5337 5049 2141 -1800 -4829 -5483 -3751 347 3510 5164 4755 1833 -1960 -5028 -5451 -3287
1418 -3287 382 3809 5389 4610 1368 -2342 -5349 -5227 -3186 674 4185 5520 4330 1084 -2678
1433 -2678 -5027 -4901 -2739 921 3993 5522 4005 763 -2823 -5200 -4817 -2307 1293 4503 5154 3688
$$ packed form
1323F052r27l497l823l262m06K503M240L387J563j039l658l773l053J9K655L823
1339H04L742J523j539l633l879k587K25K814L850L528J426k133l745l751k436
1354e791M51L164L834L143J529k346m290l278k153L99L532L711L026Q40j908m619
1370g56l211j635M62L778L849K206R72k410m061l458j312Q90L802L637K411J06
1386E270k395l965l360j062R97L522M138K394m50k340l993l390r75J572L552L663
1402C178K159k88k908l941l029o54J732M098L163J654m09k922l793l068m23K164
1418c287L669L427J580p79l242l710l007J22K041L860L511J335j190l246l762
1433b678k349J26K162L660L072J529j517l242l586k377L83K510L600L210O51j466
$$ plain form
1449 3688 379 -3240 -5293 -4801 -1994 1742 4512 5162 3495 82 -3534 -5331 -4588 -1489 2014 4943
1465 4943 5097 3184 -261 -3522 -5428 -4177 -1411 2213 4785 5033 3052 -680 -3933 -5195 -4020
1480 -4020 -969 2572 4995 4795 2506 -1125 -4118 -5073 -3774 -511 2778 4956 4679 2211 -1585 -4384
1496 -4384 -5051 -3822 -481 3122 4946 4468 1793 -1817 -4463 -5144 -3414 230 3434 5277 4283 1722
1512 1722 -2047 -4503 -4911 -3026 319 3681 5050 3874 1119 -2377 -4467 -4756 -2431 645 3903
1527 3903 5162 3838 763 -2621 -4617 -4763 -2271 1019 3619 4675 3728 596 -2824 -4799 -4405 -2103
1543 -2103 1184 4044 4980 3480 95 -3163 -4804 -4263 -1648 1542 4287 4857 3302 -1 -3418 -4836
1559 -4836 -4076 -1305 2011 4354 4549 2922 -457 -3506 -4865 -3989 -881 2465 4250 4459 2598 -724
$$ packed form
1449C688l309l619k053M92K807L736K770O50j667l413l616j797P43L099L503K929
1465D943J54j913l445l261j906J251K766L624K572K48j981l732l253j262J175
1480d020L051L541K423k00k289l631k993r55J299L263L289K178k77k468l796k799
1496d384o67J229L341L603J824m78k675l610k646o81J730L644L204J843r94k561
1512A722l769k456m08J885L345L362J369j176k755l496k090k89K325L076L258
1527C903J259j324l075l384j996j46K492L290K600J056r47l132l420j975L94K302
1543b103L287K860R36j500l385l258j641N41K615L190K745N70j555l303l417j418
1559d836P60K771L316K343J95j627l379l049j359Q76L108L346J785K09j861l322
$$ plain form
1575 -724 -3910 -5050 -3590 -587 2516 4430 4269 2157 -982 -3826 -4714 -3237 -448 2865 4720 4102
1591 4102 1637 -1204 -3705 -4906 -3250 -64 3098 4851 4068 1573 -1552 -3997 -4492 -3022 337
1606 337 3282 4364 3913 1074 -2211 -4094 -4551 -2958 503 3225 4546 3791 1136 -2265 -4277 -4053
1622 -4053 -2414 747 3582 4597 3508 770 -2553 -4311 -4187 -2363 1180 3844 4408 2984 317
1637 317 -2859 -4590 -3874 -1947 1256 3850 4671 2936 46 -2948 -4741 -3837 -1242 1738 3910 4472
1653 4472 2702 -156 -2983 -4454 -3735 -1052 2002 4043 4435 2490 -617 -3183 -4373 -3524 -817 2093
1669 2093 4178 4366 2330 -920 -3250 -4298 -3169 -697 2380 4145 3880 2071 -997 -3657 -4276 -3112
1685 -3112 -365 2497 4460 3929 1445 -1299 -3796 -4287 -2600 31 2733 4371 3812 1153 -1458 -3700
$$ packed form
1575g24l186j140J460L003L103J914j61k112l139k844q88J477K789L313J855o18
1591D102k465k841k501j201J656L186L162J753p83k495l125k445m95J470L359
1606C37K945J082m51k839l285j883m57J593L461K722J321p55k655l401k012K24
1622d053J639L161K835J015j089k738l323j758J24J824L543K664N64j424k667
1637C17l176j731P16J927L203K594Q21j735k890k994j793R04K595K980K172N62
1653D472j770k858k827j471P19K683L054K041L92j945l107k566j190Q49K707K910
1669B093K085J88k036l250k330j048J129K472L077J765k65j809l068k660o19J164
1685c112K747K862J963n31k484k744k497m91J687K631K702J638n59k659k611k242
$$ plain form
1701 -3700 -4274 -2485 114 2767 4442 3344 1043 -1745 -3851 -4181 -2204 811 3032 4409 3322
1716 3322 798 -2106 -3820 -4048 -2214 841 3391 4212 3314 337 -2570 -3927 -3550 -2020 1067 3486
1732 3486 3836 3045 527 -2570 -3961 -3783 -1794 1392 3646 4138 2639 99 -2643 -3948 -3499 -1286
1748 -1286 1486 3764 4141 2614 -341 -2812 -4044 -3428 -896 2003 3776 4139 2263 -409 -3151 -3813
1764 -3813 -3198 -817 2019 3709 3569 2065 -642 -3124 -3963 -3101 -513 2222 3784 3711 1898 -900
1780 -900 -3454 -3907 -2837 -220 2574 3770 3352 1466 -1616 -3527 -3872 -2471 -130 2396 4018 3068
1796 3068 1200 -1399 -3584 -3871 -2241 264 2804 4105 2959 938 -1653 -3761 -3840 -2031 457 2955
1812 2955 3827 2914 403 -1883 -3793 -3671 -1871 741 3041 3694 2941 561 -2083 -3643 -3488 -1431
$$ packed form
1701c700n74J789K599K653J675j098k301k788k106l30J977L015K221J377j087
1716C322k524k904j714k28J834L055K550Q21q98k977k907j357L77J530L087K419
1732C486L50p91k518l097j391J78J989L186K254M92j499k540k742j305M49K213
1748a286K772K278L77j527k955k471j232O16K532K899J773L63j876k672k742o62
1764c813O15K381K836J690j40j504k707k482q39Q62K588K735J562p3j813k798
1780i00k554m53J070K617K794J196m18j886l082j911l45J401K341K526J622r50
1796C068j868k599k185k87J630K505K540J301j146k021k591k108p9J809K488K498
1812B955Q72r13k511k286j910J22J800K612K300O53p53k380k644j560J55K057
$$ plain form
1828 -1431 1175 3235 3751 2649 272 -2517 -3803 -3459 -1382 987 3310 3975 2381 -45 -2516 -3913
1844 -3913 -3288 -1070 1350 3517 3928 1937 -316 -2518 -3713 -2910 -1038 1885 3608 3663 1854 -441
1860 -441 -2471 -3858 -2959 -565 1488 3260 3362 1728 -829 -2613 -3787 -2857 -264 2173 3705 3222
1876 3222 1324 -1009 -2873 -3863 -2269 177 2569 3357 3329 1211 -1392 -3089 -3314 -2188 315 2363
1892 2363 3413 3135 1015 -1740 -3213 -3272 -2185 520 2768 3701 2900 829 -1671 -3261 -3594 -1845
1908 -1845 791 2720 3433 2573 565 -1847 -3355 -3469 -1616 931 2893 3698 2751 238 -2227 -3161
1924 -3161 -3299 -1338 1137 2859 3550 2274 30 -2316 -3285 -2795 -1265 1234 2997 3251 2244 -185
1940 -185 -2345 -3501 -2839 -747 1638 3183 3147 2043 -553 -2833 -3439 -2527 -567 1568 3281 3188 1696
$$ packed form
1828a431K606K060N16j102k377k789j286L44K077K369K323O65j594k426k471j397
1844c913O25K218K420K167M11j991k253k202j195Q03J872K923J723N5j809k295
1860d41k030j387Q99K394K053J772J02j634k557j784j174R30K593K437J532m83
1876C222j898k333j864r90J594K446K392P88k8k118k603j697k25J126K503K048
1892B363J050k78k120k755j473n9J087K705K248R33q01k071k500j590l33J749
1908a845K636J929P13q60k008k412j508j14J853K547J962Q05r47k513k465r34
1924c161j38J961K475J722O91j276k244k346r69M90J530K499J763K54j007k429
1940a85k160j156O62K092K385J545l6j104k596k280o06R12J960K135J713r3j492
$$ plain form
1957 1696 -720 -2756 -3202 -2386 -268 1862 3385 3228 1639 -1035 -2838 -3303 -2295 -426 1845 3297
1973 3297 2864 1383 -1001 -2684 -3570 -2216 212 2154 3204 2790 1006 -1259 -3074 -3411 -1879 146
1989 146 2251 3161 2492 853 -1369 -3002 -2807 -1815 644 2478 3217 2492 623 -1421 -3091 -2707 -1626
2006 -1626 522 2481 3347 2240 431 -1923 -3091 -2950 -1329 947 2868 3419 2268 276 -2073 -3148
2022 -3148 -2969 -1405 1033 2763 3107 2368 -68 -2162 -3090 -2551 -911 1017 2835 3152 1760 -329
2038 -329 -2281 -3093 -2667 -1066 1419 2706 3040 1503 -330 -2386 -3264 -2592 -491 1518 2786 2990 1389
2055 1389 -765 -2566 -3240 -2288 -455 1821 2982 2814 1146 -836 -2480 -3054 -2029 -186 1912 2924
2071 2924 2889 1005 -922 -2502 -3103 -2219 -44 2165 3092 2744 1240 -1375 -2790 -2899 -2055 246 2226
$$ packed form
1957A696k416k036m46Q16K118K130J523j57j589k674j803m65J008J869K271J452
1973C297m33j481k384j683q86J354K428J942J050m14j784k265j815l37J532K025
1989A46K105R10o69j639k222j633J95R92K459J834P39p25j869k044j670L84J081
2006a626K148J959Q66j107j809k354j168J41J621K276J921N51j151j992k349j075
2022c148J79J564K438J730L44p39k436k094r28N39J640J928J818L17j392k089
2038c29j952q12M26J601K485J287L34j537j833k056q78O72K101K009J268K04j601
2055A389k154j801o74R52J833K276J161j68j668j982j644n74J025J843K098J012
2071B924l5j884j927j580o01Q84K175K209R27l48j504k615j415j09Q44K301J980
$$ plain form
2088 2226 3178 2367 462 -1551 -2864 -2934 -1751 579 2344 3152 2560 619 -1476 -2686 -2712 -1409 751
2105 751 2301 3297 1989 225 -1743 -2736 -2598 -1393 698 2457 2971 1927 228 -1965 -2828 -2564 -998
2122 -998 926 2619 2991 1735 -66 -2048 -3188 -2539 -910 1008 2753 3001 1624 -273 -2314 -2899
2138 -2899 -2219 -527 1147 2791 2741 1561 -477 -2300 -2901 -2020 -487 1515 2752 2733 1282 -788 -2348
2155 -2348 -2796 -2259 -490 1557 2586 2476 1121 -710 -2187 -2980 -1967 28 1814 2796 2376 957
2171 957 -964 -2523 -2850 -1931 263 2061 2913 2533 886 -1299 -2650 -2633 -1648 81 2191 2917 2027
2188 2027 851 -1219 -2719 -2569 -1642 252 2113 2616 2165 321 -1257 -2694 -2524 -1272 652 2020
2204 2020 2630 1552 120 -1493 -2624 -2496 -1328 865 2076 2926 1802 162 -1699 -2851 -2571 -921
$$ packed form
2088B226R52q11j905k013j313p0J183K330J765Q08n92j941k095j210k6J303K160
2105G51J550R96j308j764j968r93J38J205K091J759N14j044j699k193q63K64J566
2122i98J924J693L72j256j801j982j140O49J629J918J745K48j377j897k041n85
2138b899O80J692J674J644n0j180k038j823o01Q81J533K002J237j9j451k070j560
2155b348m48N37J769K047J029j10j355j831j477p93J013J995J786R82m20j419
2171I57j921j559l27R19K194J798Q52l80j647k185j351J7R85J729K110P26q90
2188B027j176k070j500J50R27J894J861N03m51j844j578j437J70J252J924J368
2204B020O10j078j432j613j131J28J168K193J211Q50j124j640j861j152K80J650
$$ plain form
2220 -921 898 2516 2553 1646 -370 -1746 -2395 -2436 -903 1058 2739 2515 1458 -243 -1838 -2726 -2151
2237 -2151 -678 1191 2557 2579 1401 -499 -2175 -2769 -2159 -426 1491 2429 2454 1341 -839 -2193 -2705
2254 -2705 -1739 -127 1489 2578 2435 939 -672 -2100 -2842 -1703 86 2038 2377 2381 786 -1104 -2293
2271 -2293 -2479 -1587 182 1798 2554 2150 753 -1208 -2149 -2531 -1285 445 1965 2559 2330 436 -1464
2288 -1464 -2703 -2467 -1248 493 2098 2531 1802 532 -1296 -2466 -2174 -911 765 2133 2730 1524
2304 1524 93 -1301 -2557 -2193 -728 756 2095 2260 1554 6 -1597 -2491 -2218 -780 1023 2178
2320 2178 2524 1677 -181 -1794 -2646 -2052 -732 1083 2177 2308 1226 -445 -1804 -2508 -2087 -477 1193
2337 1193 2472 2305 1085 -373 -1970 -2479 -1954 -289 1451 2404 1929 863 -512 -2101 -2192 -1768 -154
$$ packed form
2220i21J819J618L7r07k016j376o49m1J533J961J681k24j057j701j595q88N75
2237b151J473J869J366K2j178j900j676n94O10J733J917R38K5j113k180j354n12
2254b705R66J612J616J089j43j496j611j428p42J139J789J952L39Mj595j890j189
2271b293j86Q92J769J616P56m04j397j961r41l82J246J730J520N94k29j894j900
2288a464j239K36J219J741J605M33p29j270j828j170K92J263J676J368N97j206
2304A524j431j394j256L64J465J484J339J65p06j548j603q94K73J438J803J155
2320B178L46q47j858j613q52N94J320J815J094J31j082j671j359p04M21J610J670
2337A193J279j67j220j458j597n09N25J665J740R53m75j066j375j589r1M24J614
$$ plain form
2354 -154 1766 2440 2019 839 -819 -2344 -2295 -1591 -132 1633 2593 1903 641 -973 -2233 -2380 -1348
2371 -1348 9 1800 2596 2154 743 -1020 -2330 -2439 -1362 536 1901 2473 1915 342 -1146 -2212
2387 -2212 -2228 -1252 618 1843 2395 1507 365 -1443 -2424 -2359 -999 610 2007 2364 1603 308 -1478
2404 -1478 -2260 -1974 -665 1032 2153 2234 1375 112 -1172 -2517 -1929 -510 1254 2050 2459 1253 -278
2421 -278 -1713 -2117 -1900 -489 1115 2167 2287 1543 -374 -1578 -2187 -2052 -387 1370 2238 2306 1018
2438 1018 -618 -1841 -2130 -1734 -274 1528 2387 2003 958 -431 -2021 -2283 -1491 -52 1458 2218 1891
2455 1891 951 -773 -1948 -2142 -1562 60 1476 2161 1899 452 -717 -1866 -2174 -1439 148 1842 2278
2472 2278 1667 620 -1010 -2007 -2020 -1151 367 1756 2188 1927 366 -1302 -2164 -2002 -869 412 2056
$$ packed form
2354a54J920O74m21j180j658j525M9P04J459J765R60o90j262j614j260j47J032
2371a348J357J791P96m42j411j763j310j09J077J898J365N72n58j573j488j066
2387b212j6R76J870J225N52q88j142j808r81O5J360J609J397L57p61j295j786
2404a478p82K86J309J697J121Q1q59j263j284j345N88J419J764P96M09j206j531
2421b78j435m04K17J411J604J052J20p44j917j204o09J35J665J757Q68O8j288
2438A018j636j223k89L96J460J802Q59l84j045j389j590k62P92J439J510P60l27
2455A891r40j724j175j94N80J622J416O85k62j447j169j149l08P35J587J694M36
2472B278o11j047j630r97j3Q69J518J389M32k61j561j668q62J62J133J281J644
$$ plain form
2489 2056 2287 1471 351 -1158 -2104 -1965 -1029 460 1777 2347 1485 321 -1375 -2017 -1884 -619 701
2506 701 1857 1968 1228 -146 -1596 -1913 -1883 -611 828 1987 2206 922 -63 -1606 -2250 -1845 -645
2523 -645 1054 2115 2219 1176 -477 -1605 -2120 -1692 -269 1026 2116 1905 942 -619 -1931 -1827 -1369
2540 -1369 -142 1334 2178 1881 806 -756 -1600 -1961 -1328 -42 1065 2016 1757 454 -963 -1863 -2095
2557 -2095 -1293 37 1459 2007 1631 600 -979 -1724 -2133 -1358 162 1540 2278 1241 278 -1082 -2025
2574 -2025 -1786 -1146 456 1822 2210 1373 402 -1211 -1639 -1867 -1093 562 1670 2028 1381 188 -1235
2591 -1235 -2016 -1983 -730 764 1608 1993 1288 -30 -1362 -1824 -1817 -852 855 1862 1828 1109 -44 -1291
2609 -1291 -2024 -1648 -467 914 2020 1795 1057 -476 -1423 -2043 -1387 -504 870 2209 1803 851 -320
$$ packed form
2489B056K31q16j120j509r46J39R36J489J317N70q62j164j696o42J33J265J320
2506G01J156J11p40j374j450l17L0J272J439J159K19j284r85j543o44M05J200
2523f45J699J061J04j043j653j128n15M28J423J295J090k11r63j561j312J04M58
2540a369J227J476Q44k97j075j562q44l61O33J286J107R51k59j303j417r00k32
2557b095Q02J330J422N48l76j031j579p45m09P75J520J378P38j037r63j360r43
2574b025K39O40J602J366L88q37r71j613m28k28P74J655J108L58o47j193j423
2591a235p81L3J253J494Q44L85p05j318j332m62PR65J707J007l4p19j153j247
2609a291p33L76J181J381J106k25p38j533r47o20O56Q83J374J339m06r52j171
$$ plain form
2626 -320 -1700 -2104 -1459 -146 1163 1628 1691 843 -368 -1293 -2044 -1227 -248 1257 2006 1691 825 -604
2644 -604 -1922 -1947 -1336 32 1270 1790 1485 602 -651 -1684 -1983 -999 55 1165 1948 1606 525 -999
2662 -999 -1747 -1957 -1056 301 1416 1857 1517 332 -920 -2044 -1669 -878 353 1457 1934 1460 382
2679 382 -1092 -1965 -1551 -745 296 1456 1892 1077 36 -923 -1869 -1635 -850 503 1806 2076 1426 124
2697 124 -1460 -1923 -1465 -581 886 1914 1870 1376 -75 -1165 -1670 -1486 -483 751 1672 1656 1064 -259
2715 -259 -1320 -1972 -1391 -474 892 1557 1644 1121 -403 -1370 -1736 -1444 -213 1120 1708 1632 796 -469 -1497
2734 -1497 -1729 -1219 -219 1005 1750 1672 661 -626 -1775 -1734 -1060 137 1161 1829 1395 404 -799 -1572
2752 -1572 -1653 -879 -74 1288 1969 1479 545 -773 -1660 -1706 -1101 132 1399 1867 1260 12 -932 -1474 -1747
$$ packed form
2626c20j380m04O45J313J309M65O3q48j211r25p51Q17R79J505P49l15q66j429
2644f04j318k5O11J368J238N20l05q83j253j033k99R84J054J110P83l42j081j524
2662i99p48k10R01J357J115M41l40j185j252j124L75P91J231J104M77m74j078
2679C82j474q73M14Q06J041J160M36q15j041r59r46K34P85J353J303K70o50j302
2697A24j584m63M58Q84J467J028m4m94j451j090n05J84J003J234R21j6n92j323
2715b59j061o52N81R17J366O65Q7n23j524r67l66K92J231J333N88p6q36j265j028
2734a497k32N10J000J224P45p8j011j287j149M1O74J197J024O68m34r91j203p73
2752a572q1P74Q05J362O81m90r34j318q87m6O05J233J267M68o07j248r44n42k73
$$ plain form
2771 -1747 -889 478 1425 1764 1143 86 -1057 -1576 -1545 -547 473 1445 1444 1354 293 -848 -1778 -1536 -724
2790 -724 548 1448 1691 1166 -96 -1290 -1675 -1377 -578 916 1530 1488 1037 -48 -1332 -1926 -1402 -312
2808 -312 593 1587 1712 861 -334 -1163 -1612 -1403 -169 954 1657 1653 744 -420 -1212 -1510 -1278 -224 984
2827 984 1619 1356 840 -516 -1304 -1602 -1157 -77 1047 1390 1491 868 -338 -1252 -1641 -1075 82 1328
2845 1328 1362 1408 690 -296 -1423 -1415 -860 30 1208 1518 1322 351 -879 -1427 -1617 -884 255 1380 1689
2864 1689 1450 283 -728 -1236 -1288 -737 299 1348 1468 1214 123 -778 -1483 -1404 -587 280 1289 1501
2882 1501 1228 298 -1014 -1556 -1529 -445 359 1358 1553 826 -36 -1149 -1343 -1249 -562 712 1407 1594 667
2901 667 9 -1092 -1573 -1425 -145 548 1495 1478 849 -334 -1394 -1493 -1132 -200 731 1566 1690 633 -236
$$ packed form
2771a747Q58J367R47L39o21j057j143n19L1R98J020R72jr0j061j141r30K42Q12
2790g24J272R00K43n25j262j194l85K98P99J494O14m2m51j085j284n94N24J090
2808c12R05R94J25q51j195q29m49K09J234J123P03mr09j164p92k98K32J054J208
2827I84O35k63n16j356p88k98M45J080J124L43J01o23j206r14l89N66J157J246
2845A328L4M6p18r86j127QN55Q90J178L10j96r71j230n48j90P33J139J125L09
2864A689k39j167j011n08n2N51J036J049J20k54j091r01p05P9Q17Q67J009K12
2882A501k73r30j312n42K7J084Q04R99J95p27q62j113j94R4O87J274O95J87r27
2901F67o58j101m81J48J280O93R47j7o29j183j060r9L61R32R31Q35J24j057q69
$$ plain form
2920 -236 -1107 -1515 -1253 -209 756 1385 1537 614 -506 -1342 -1616 -1179 -55 840 1474 1404 637 -532 -1404
2939 -1404 -1380 -835 -66 1070 1498 1402 352 -722 -1443 -1469 -910 287 1299 1510 1223 449 -566 -1471 -1566
2958 -1566 -751 289 1287 1598 1241 375 -759 -1504 -1402 -651 347 1157 1464 1156 98 -782 -1464 -1606 -410
2977 -410 401 1294 1375 1090 281 -789 -1331 -1334 -695 509 1240 1349 1069 -50 -1081 -1543 -1207 -587 560
2996 560 1193 1381 1083 -200 -1086 -1599 -1077 -352 742 1380 1222 672 -101 -1248 -1382 -1307 -271 959 1169
3015 1169 1354 659 -226 -1183 -1424 -902 -246 845 1252 1354 604 -642 -1197 -1682 -928 -98 881 1324 964
3034 964 588 -386 -1133 -1505 -826 92 1152 1427 1137 353 -640 -1301 -1319 -948 198 1037 1283 1211 280 -525
3054 -525 -1502 -1491 -516 59 1058 1486 1033 169 -492 -1387 -1574 -739 340 1065 1375 903 288 -588 -1515 -1234
$$ packed form
2920b36q71m08K62J044R65O29J52r23j120q36k74M37J124Q95O34p0p67j169q72
2939a404K4N45P69J136M28r6j050j074p21k6N59J197J012K11k87p74j015r05r5
2958a566Q15J040R98L11l57q66j134p45J02P51R98Q10L07l08j058q80o82j42J196
2977d10Q11Q93Q1k85q09j070n42lO39J204P31J09k80j119j031m62L36O20J147
2996E60O33J88k98j283q86n13N22P25J094O38j58n50p73j147j34P5J036J230K10
3015A169J85o95q85r57k41N22O56J091M07J02p50j246n55m85P54Q30R79M43l60
3034I64l76r74p47l72O79R18J060K75k90p84r93o61j8L71J146Q39K46p2r31q05
3054e25r77J1R75N75R99M28m53q64o61q95j87Q35J079P25L10m72o15q76r27K81
$$ plain form
3074 -1234 -572 391 1250 1388 824 112 -1107 -1407 -1116 -555 207 1178 1360 785 -31 -1079 -1276 -1033 -311
3093 -311 521 1343 1382 925 -342 -1143 -1526 -1032 -372 633 1375 1241 717 109 -1027 -1271 -1016 -102 1041
3112 1041 1415 1174 421 -176 -877 -1383 -999 -234 860 1391 1187 587 -436 -1165 -1444 -955 0 698 1331
3131 1331 1261 539 -449 -1061 -1228 -800 -66 914 1298 1163 212 -427 -1202 -1004 -649 246 1006 1354 1103 154
3151 154 -845 -1120 -1391 -503 106 970 1270 1002 94 -686 -1336 -939 -653 330 1144 1383 994 -45 -425 -1357
3171 -1357 -1039 -623 452 1278 1063 683 335 -906 -1155 -952 -318 534 1166 1003 605 63 -851 -1321 -1066
3190 -1066 -209 546 936 1245 678 -100 -1074 -1091 -1014 -311 734 1216 1034 742 -216 -1075 -1052 -951 -137 540
3210 540 1012 1137 685 -452 -838 -1061 -802 -90 826 1236 980 526 -301 -1234 -1358 -939 108 835 1205
$$ packed form
3074a234O62R63Q59J38n64p12j219l00K91N61P62R71J82n75q16j048j97K43P22
3093c11Q32Q22L9m57j267q01l83M94O60J005P42j34n24o08j136k44K55R14J143
3112A041L74k41p53n97p01n06L84P65J094N31k04o00j023p29k79M89R55O98O33
3131A331p0p22r88o12j67M28P34R80L84j35r51o39p75J98L55Q95P60L48k51r49
3151A54r99k75k71Q88O09Q64L00k68r08p80o50L97K86R83Q14K39l89j039l80r32
3171a357L18M16J075Q26k15l80l48j241k49K03O34Q52O32j63l98n42r14m70K55
3190a066Q57P55L90L09n67p78r74j7P7P03J045M82j82k92r58q59K3J01Q14O77
3210E40M72J25m52j137l86k23K59P12R16M10k56m54q27r33j24M19J047P27L70
$$ plain form
3229 1205 1086 244 -334 -977 -1349 -706 -211 970 1329 927 387 -473 -1120 -1104 -727 167 925 1192 932 50
3249 50 -374 -1066 -1191 -381 205 1063 1176 956 226 -628 -1304 -1315 -624 232 970 1166 1027 151 -662 -1338 -964
3270 -964 -333 348 853 1239 639 185 -475 -1098 -1058 -511 566 1076 931 815 -120 -1218 -991 -852 -446 462
3290 462 1217 1063 641 6 -830 -1121 -792 -146 587 1298 935 593 -130 -777 -1200 -745 -215 594 1192 1091
3310 1091 536 -335 -966 -911 -900 -96 717 1212 938 508 -394 -1140 -882 -639 153 662 942 883 473 -533
3330 -533 -1234 -1172 -431 29 851 1121 1076 165 -421 -1065 -1063 -495 -89 834 930 773 377 -698 -1083 -930 -515
3351 -515 293 1032 1040 857 217 -687 -1109 -1280 -670 274 867 1215 698 142 -636 -1137 -1021 -431 349 970 1267
3372 1267 497 -19 -656 -1001 -874 -300 523 967 1027 849 -88 -810 -990 -958 -221 470 980 898 527 -246 -690
$$ packed form
3229A205j19q42n78o43l72O43M95J181L59m02n40q60o47J6L77Q94P58K67k60q82
3249E0m24o92j25Q10N86Q58J13k20p30q54o76j1O91Q56P38J96j39q76q13o76L74
3270i64O31O81N05L86o00m54o60o23M0N47J077N10j45j16r35j098K27J39M06R08
3290D62P55j54m22o35q36k91L29O46P33P11l63l42p23o47m23M55N30Q09N98j01
3310A091n55q71o31N5J1Q04Q13M95k74m30r02p46K58K43P92N09K80n9m10j006
3330e33p01O2P41M60Q22K70m5r11n86o44KN68M06R23R6j57l96j075l85J53M15
3351e15Q08P39Qj83o40r04m22j71O10R44N93L48n17n56p78n01J16N90P80O21K97
3372A267p70n16o37l45J27N74Q23M44O0j78r37p22j80L2P37O91N10q2l71p73m44
$$ plain form
3393 -690 -1018 -871 -135 668 990 1155 350 -345 -966 -1151 -967 -356 398 1004 939 420 -57 -961 -1192 -658
3413 -658 -142 696 1092 933 233 -544 -778 -1124 -548 -24 713 968 1169 394 -490 -975 -1151 -858 62 723
3433 723 1230 1077 141 -476 -1140 -794 -516 74 979 922 766 292 -408 -771 -965 -784 184 879 1018 767
3453 767 254 -417 -908 -756 -561 236 789 1034 601 89 -639 -993 -859 -445 372 963 1004 726 304 -954
3473 -954 -1021 -755 -281 389 768 914 515 123 -681 -1204 -830 -145 329 1133 1030 372 -163 -777 -971 -988 -137
3494 -137 309 756 780 460 -194 -871 -956 -440 15 443 849 1016 339 -82 -1052 -912 -721 -238 887 906 966
3515 966 301 -122 -837 -1036 -676 -62 751 1173 1117 271 -577 -1117 -1060 -909 320 668 919 1055 356 -494
3535 -494 -653 -978 -562 87 763 973 987 248 -510 -920 -1089 -420 344 964 802 955 207 -537 -797 -1042
$$ packed form
3393f90l28J47P36Q03L22J65q05o95o21j85J84O11P54O06o5n19m77r04k31N34
3413f58N16Q38L96j59p00p77k34l46N76N24P37K55K01p75q84m85j76K93R20O61
3433G23N07j53r36o17o64L46K78N90R05n7j56m74p00l63j94J81R68O95J39k51
3453G67n13o71m91J52J95P97N53K45m33n12p28l54J34M14Q17N91M1k78m22j258
3473i54o7K66M74O70L79J46l99l92q04n23L74O85M74Q04j03o58n35o14j94j7Q51
3494a37M46M47K4l20o54o77q5N16M55M28M06J67o77m21r70J40J91M83J125J9O0
3515I66o65m23p15j99L60O14Q13M22n6q46q48n40N7J51J229L48K51J36o99q50
3535d94j59l25M16O49O76K10J4p39p58m10j69O69P64O20j62J53p48p44k60k45
$$ plain form
3555 -1042 -338 380 959 741 780 108 -540 -916 -634 -570 443 1010 961 827 54 -609 -949 -754 -437 474
3575 474 797 740 357 -320 -703 -899 -1050 -150 265 1006 742 438 -143 -629 -931 -602 -119 293 832 1033
3595 1033 563 -272 -827 -825 -688 -49 565 778 707 519 -187 -742 -950 -672 60 608 1083 777 416 -315 -798
3616 -798 -898 -452 41 507 821 870 294 -346 -938 -800 -298 -52 859 903 830 301 -436 -924 -829 -636 359
3637 359 748 619 581 255 -605 -693 -938 -683 323 576 846 542 81 -850 -814 -768 -323 551 636 1021 710
3658 710 212 -575 -957 -684 -277 341 888 841 617 -48 -543 -730 -848 -227 386 731 1079 616 -126 -788
3678 -788 -914 -603 -52 427 989 858 557 -305 -782 -885 -439 -198 459 834 665 542 -363 -605 -1220 -712
3698 -712 38 392 834 853 441 -156 -530 -947 -699 -44 626 1040 721 457 -222 -909 -584 -608 -49 664 793
$$ packed form
3555a042P04P18N79k18L9o72o48l76K82O4J013N67m9j34p73o63l40J95L17R11
3575D74L23n7l83o77l83j96j51R00M15P41k64l04n81m86l02L29M83M12N39K01
3595A033m70q35n55KJ37O39O14K13p1j88p06n55k08K78P32N48M75l06l61p31m83
3616g98j00M46M93M66L14M9n76o40n92J38N02K46R11M4p3n29p37m88R5J93R95
3637C59L89j29l8l26q60q8k45K55J006K53K70l04m61r31L6M6M45Q74Q5L85l11
3658G10m98p87l82K73M07O18N47m7k24o65m95j87j18O21O13L45L48m63p42o62
3678g88j26L11N51M79N62j31l01q62m77j03M46K41O57L75j69j23r05k42o15N08
3698g12P50L54M42J9m12n97l74m17K48O55O70M14l19k64o79o87L25k4N59P13J29
$$ plain form
3719 793 654 326 -425 -784 -898 -756 160 584 1034 767 121 -444 -786 -755 -268 254 766 894 888 299 -460
3740 -460 -975 -746 -540 293 696 1120 511 -53 -586 -720 -769 -355 335 952 731 577 -45 -348 -767 -660
3760 -660 -345 121 671 900 335 -421 -614 -809 -875 -409 394 841 927 568 -151 -543 -648 -785 -69 146 809
3781 809 609 433 -167 -729 -650 -496 -222 344 735 924 431 -59 -762 -951 -550 -280 482 915 885 481 -265
3802 -265 -669 -910 -624 -90 283 741 745 245 -152 -674 -635 -499 181 388 980 485 165 -346 -674 -738 -345
3823 -345 362 633 953 762 148 -319 -408 -695 -422 39 610 826 702 243 -342 -566 -853 -109 328 705
3843 705 725 554 25 -501 -813 -867 -522 311 450 789 398 18 -456 -420 -799 -574 394 702 977 542 -91
3864 -91 -426 -1100 -595 -215 282 765 780 331 -39 -397 -551 -509 -15 451 772 735 428 -248 -750 -691 -642 -104
$$ packed form
3719G93j39l28p51l59j14J42R16M24M50k67o46n65l42L1M87N22N12J28on89p59
3740d60n15K29K06Q33M03M24o09n64n33j34m9M14O90O17k21j54o22l03m19J07
3760f60L15M66N50K29n65p56j93j95o6M66Q03M47Q6l59p19l92j05j37P16K15O63
3781H09k00j76o00n62P9J54K74N66L91J89m93m90p03j89M01K70P62M33l0m04p46
3802b65m04k41K86N34L73M58Mn00l97n22L9J36O80K07N92m95l20n11l28o4L93
3823c45P07K71L20j91o14m67q9k87K73M61N71K16j24m59n85k24k87P44M37L77
3843G05K0j71n29n26l12n4L45Q33J39L39l91l80m74L6l79K25R68L08K75m35o33
3864i1l35o74N05L80M97M83J5m49l70l58j54M2M94M66L21l7l07o76n02N9M9N38
$$ plain form
3886 -104 407 637 592 522 -203 -594 -507 -732 -82 629 606 693 329 -400 -695 -611 -268 -188 519 517 766 260 -347
3909 -347 -665 -938 -519 -65 471 618 814 188 -220 -604 -920 -357 231 383 730 465 434 -397 -580 -823
3929 -823 -495 -139 391 856 775 301 -141 -630 -718 -383 232 644 793 739 103 -229 -712 -601 -298 127 553
3950 553 885 501 202 -372 -668 -917 -383 269 480 567 452 101 -778 -694 -411 -134 414 513 711 378 66
3971 66 -645 -572 -696 -176 217 511 672 192 -347 -821 -863 -501 -149 214 475 705 418 -87 -663 -713 -309
3992 -309 24 421 532 651 358 66 -536 -584 -488 25 484 501 727 252 -329 -754 -843 -570 -19 299 725
4013 725 769 60 -168 -580 -643 -571 95 534 445 718 304 -67 -739 -651 -263 45 694 747 634 298 -348 -714
4035 -714 -673 -268 40 584 436 628 108 -191 -629 -613 -313 -2 525 480 550 144 -343 -738 -670 -434 244 521
$$ packed form
3886a04N11K30m5p0p25l91Q7k25O50P11k3Q7l64p29k95Q4L43Q0P07kK49n06o07
3909c47l18k73M19M54N36J47J96o26m08l84l16N63N88J52L47k65l1q31j83k43
3929h23L28L56N30M65q1m74m42m89q8L35O15M12J49n4o36l32m83J11L03M25M26
3950E53L32l84k99n74k96k49N34O52K11Q7j15l51q79Q4K83K77N48R9J98l33l12
3971F6p11P3j24N20L93K94J61m80n39m74m2L62L52L63K61K30k87n05n76n0M04
3992c09L33L97J11J19k93k92o02m8R6N13M59J7K26m75n81m25q9K73N51L18M26
4013G25M4p09k28m12o3P2O66M39q9K73m14l71o72Q8L88L08O49N3j13l36o46l66
4035g14M1M05L08N44j48J92n20k99m38J6L00L11N27m5P0m06m87l95O8K36O78K77
$$ plain form
4057 521 821 404 150 -98 -764 -612 -280 361 734 534 378 -61 -493 -716 -336 -149 251 711 684 595 175
4078 175 -576 -447 -514 -320 372 816 631 346 -105 -598 -750 -525 -205 257 419 738 350 217 -377 -729
4098 -729 -162 -89 427 621 670 198 -136 -526 -602 -581 202 458 709 576 221 -182 -554 -755 -107 -7 464
4119 464 728 470 468 -236 -487 -706 -497 -43 475 620 463 -9 -244 -585 -610 -325 301 384 681 448 212
4140 212 -256 -472 -385 -359 84 394 571 503 1 -375 -788 -515 -107 -17 373 772 408 -100 -260 -668 -445
4161 -445 -181 222 803 755 345 90 -499 -491 -694 -404 103 688 545 533 219 -377 -577 -524 40 411 604 671
4183 671 454 -47 -619 -528 -645 -5 201 454 537 237 -360 -497 -772 -560 6 264 523 474 527 -168 -293
4204 -293 -522 -474 -155 221 732 479 99 -431 -641 -616 -370 126 511 580 545 150 -365 -520 -476 -262 15 354
$$ packed form
4057E21L00m17k54k48o66J52L32O41L73k00j56m39m32k23L80J87M00M60k7q9m20
4078A75p51J29o7J94O92M44j85k85m51m93j52K25L20M62J62L19l88j33n94l52
4098g29N67P3N16J94M9m72l34l90p6K1P83K56K51j33l55m03l72k01O48J00M71
4119D64K64k58kp04k51k19K09M54N18J45j57m72k35l41k5K85O26Q3K97k33k36
4140B12m68k16Q7K6M43L10J77o8n02l76m13K73M08R0L90L99l64n08j60m08K23
4161d45K64M03N81m8m10k55n89Qk03K90N07N85j43j2l14n96k00N3N64L71J93O7
4183F71k17n01n72R1j17O40K06K53Q3l00n97j37k75K12N66K58K59m9N3o95j25
4204b93k29M8L19L76N11k53l80n30k10K5K46M96L85O9l5l95n15j55M4K14K77L39
$$ plain form
4226 354 636 220 -18 -523 -710 -561 -148 51 548 489 377 56 -277 -481 -463 -396 325 112 758 181 -23
4247 -23 -469 -611 -473 -286 246 583 611 365 3 -297 -302 -498 -285 128 470 677 573 -126 -209 -549 -290 -135
4269 -135 202 446 778 490 120 -623 -650 -537 -226 47 266 419 297 -391 -350 -817 -317 14 350 573 678
4290 678 502 -21 -528 -552 -450 -107 229 504 483 154 -9 -329 -780 -401 -164 158 594 468 340 -235 -631
4311 -631 -486 -262 -36 490 712 433 352 -94 -528 -629 -225 99 505 496 451 210 -469 -565 -435 -242 76 200
4333 200 552 557 161 -410 -283 -569 -332 93 263 362 385 87 -194 -636 -222 -523 296 658 351 255 90 24
4355 24 -262 -376 -381 259 273 463 320 160 -571 -531 -501 -228 47 420 616 345 138 -294 -665 -382 -183 255
4377 255 570 711 252 -145 -371 -562 -495 -91 84 461 430 535 -55 -375 -631 -320 -203 353 507 442 318
$$ packed form
4226C54K82m16k38n05j87J49M13J99M97n9j12l21l33k04J8O7P21k13O46n77k04
4247b3m46j42J38J87N32L37K8k46l62l00nj96K13M13L42K07j04o99q3l40K59J55
4269a35L37K44L32k88l70p43k7J13L11K73K19J53j22o88M1m67N00L31L36K23J05
4290F78j76n23n07k4J02L43L36K75k1l29j63l20m51L79K37L22M36j26j28n75l96
4311f31J45K24K26N26K22k79q1m46m34j01M04L24M06rm5k41o79r6J30J93L18J24
4333B00L52Nl96n71J27k86K37M25J70R9K3k98k81m42M14l01Q19L62l07r6j65o6
4355B4k86j14nO40J4J90j43j60p31M0L0K73K75L73J96k71k07m32l71K83J99M38
4377B55L15J41m59l97k26j91O7M04J75L77l1J05n90l20k56L11J17N56J54o5j24
$$ plain form
4398 318 -230 -559 -351 -267 -65 293 287 476 190 -232 -296 -521 -353 168 229 387 500 84 -244 -641 -498 -186
4420 -186 -192 301 195 397 -9 -345 -359 -326 -217 -223 384 621 305 49 -391 -450 -562 -134 319 409 567 525 113
4443 113 -198 -507 -526 -221 238 275 390 259 -51 -227 -589 -604 -130 367 440 306 243 221 -540 -374 -353 -111
4465 -111 244 609 415 353 118 -327 -474 -414 -303 545 580 481 100 -64 -418 -561 -323 -160 375 516 534 191
4487 191 -27 -401 -474 -214 1 296 369 431 285 -177 -651 -259 -244 8 225 560 640 219 -33 -632 -597 -343
4509 -343 -221 230 486 516 165 -69 -460 -697 -388 38 273 534 397 168 -164 -766 -333 -267 53 489 617
4530 617 185 146 -284 -393 -268 -438 155 452 495 494 118 -139 -485 -496 -223 56 440 469 245 132 -332 -750
4552 -750 -574 -249 137 146 547 260 55 -198 -394 -369 -191 101 319 471 265 -67 -151 -535 -530 25 -7 332
$$ packed form
4398C18n48l29K08Q4K02L58oJ89k86m22o4k25J68N21O1J58J13m16l28l97J43L12
4420a86oM93j06K02m06l36j4L3J09oO07K37l16k56m40n9j12M28M53R0J58m2m12
4443A13l11l09j9L05M59L7J15j31l10j76l62j5M74M97P3j34o3k2p61J66K1K42
4465a11L55L65j94o2k35m45j47O0J11Q48L5r9l81j64l54j43K38J63N35J41J8l43
4487A91k18l74p3K60K15K95P3O2j46m62m74L92J5K52K17L35Q0m21k52n99L5K54
4509c43J22M51K56L0l51k34l91k37L09M26K35K61j37k29l32o02M33O6L20M36J28
4530F17m32l9m30j09J25j70N93K97M3jl76k57l46j1K73K79L84K9k24j13m64m18
4552g50J76L25L86RM01k87k05k53j96K5J78K92K18J52k06l32q4l84NN55l2L39
$$ plain form
4574 332 353 134 99 -231 -608 -282 50 250 534 509 260 -11 -284 -462 -306 -57 466 460 594 -68 65 -157
4596 -157 -542 -388 -33 508 430 532 10 -190 -501 -594 -302 -141 401 525 421 -45 -156 -369 -422 -449 180
4617 180 371 515 542 -82 -190 -339 -552 -429 166 203 537 135 -230 -372 -445 -363 -50 106 342 454 254
4638 254 232 -119 -526 -365 -109 -95 280 547 424 148 -462 -521 -302 -41 235 137 413 17 132 -280 -608
4659 -608 -542 -44 49 348 509 337 -15 -275 -260 -412 -145 -114 372 287 267 145 -381 -399 -499 29 223 414
4681 414 333 517 22 -481 -642 -198 85 266 471 70 353 -243 -464 -418 -418 -2 270 360 335 85 -1 -554
4703 -554 -640 -359 -192 329 491 407 339 -145 -360 -492 -246 -27 277 250 183 392 -43 -398 -382 -425 204 372
4725 372 597 520 191 -62 -571 -498 -170 57 358 394 46 163 -120 -357 -415 -308 366 408 483 289 -9 -102
$$ packed form
4574C32K1k19l5l30l77L26L32K00K84k5k49k71k73j78J56K49N23oJ34o62J33k22
4596a57l85J54L55N41p8J02n22k00l11r3K92J61N42J24j04m66j11k13n3k7O29
4617A80J91J44K7o24j08j49k13J23N95L7L34m02l65j42p3Q2L13J56K36J12k00
4638B54k2l51m07J61K56J4L75K67j23k76o10n9K19K61K76r8K76l96J15m12l28
4659f08O6M98R3K99J61j72l52k60J5j52K67L1M86q5k0j22n26j8j00N28J94J91
4681D14q1J84m95n03j61M44K83J81K05m01K83n96k21M6%M16K72R0k5k50q6n53
4703e54q6K81J67N21J62q4o8m84k15j32K46K19L04k7o7K09m35l55J6m3O29J68
4725C72K25p7l29k53n09P3L28K27L01L6l48J17k83k37n8J07O74M2P5j94k98r3
$$ plain form
4747 -102 -333 -412 -144 226 161 531 366 104 -37 -490 -380 -126 174 245 326 33 20 -270 -520 -201 42 273
4769 273 459 320 60 40 -329 -390 -431 80 191 516 543 293 -18 -231 -346 20 14 343 225 380 16 -144
4791 -144 -264 -499 -502 -221 495 157 445 159 -145 -231 -375 -411 -3 344 351 668 77 -223 -400 -222 -293 -183
4813 -183 108 408 378 146 -112 -249 -606 -327 -17 284 365 388 187 -293 -373 -440 -146 107 361 562 268 64
4835 64 -218 -385 -458 -31 103 490 302 376 -59 -247 -466 -389 -244 -221 530 373 283 -199 -116 -369 -638 156
4857 156 -169 211 410 289 -216 -301 -516 -387 -99 -13 317 263 317 24 -296 -494 -234 -110 55 248 352
4878 352 413 178 -342 -254 -281 -92 287 341 359 163 -172 -611 -505 -253 -147 154 370 642 61 -179 -319 -355
4900 -355 -196 232 -16 355 273 255 -215 -304 -441 -147 87 200 448 339 176 -217 -347 -279 -254 -136 335 594
$$ packed form
4747a02k31p9K68L70o5L70j65k62j41m53J10K54L00P1Q1k93j3k90k50L19K43K31
4769B73J86j39k60k0l69o1m1N11J11L25K7k50l11k13j15L66oL29j18J55l64j60
4791a44j20k35lK81P16l38K88k86l04q6j44l6M08L47PL17n91l00j77J78p1J10
4813a83K91L00l0k32k58j37l57K79L10L01Q1K3k01m80q0o7K94K53K54K01k94k04
4835F4k82j67p3M27J34L87j88P4m35j88k19P7J45K3P51j57r0m82Q3k53k69P94
4857A56l25L80J99j21n05q5k15J29K88Q6L30n4N4k93l20j98K60J24J65J93J04
4878C52O1k35n20Q8k7J89L79N4J8j96l35m39J06K52J06L01K16K72n81k40j40l6
4900c55J59M28k48L71q2j8m70q9j37K94K34J13K48j09j63l93j30O8K5J18M71K59
$$ plain form
4922 594 361 141 -248 -367 -622 -493 -53 433 534 62 182 -316 -221 -279 -383 -40 214 305 342 -13 -504
4943 -504 -225 -285 -267 33 208 331 134 -63 -289 -326 -285 -163 79 312 513 90 66 -244 -414 -45 -122 230
4965 230 397 162 160 155 -347 -686 -420 141 160 494 173 296 179 -161 -536 -397 -200 96 653 372 131 -33
4987 -33 -227 -399 -512 -103 229 229 443 179 -411 -287 -546 -281 -84 225 440 574 194 -200 -197 -211 -157 -120 330
5010 330 235 172 -256 -73 -206 -528 -241 103 500 472 6 235 -146 -427 -374 -10 39 157 297 283 157 -73
5032 -73 -336 -292 -211 88 363 366 424 -65 -163 -225 -584 -276 -11 392 483 387 43 -228 -374 -557 -223 -97 442
5055 442 596 339 234 -320 -478 -217 -226 286 480 313 216 193 -175 -324 -252 1 128 460 538 266 -26 -135
5077 -135 -634 -347 51 -31 360 205 336 -55 -357 -266 -158 53 179 204 212 157 -120 -352 -280 -189 -34 275 329
$$ packed form
4922E94k33k20l89j19k55J29M40M86J01m72J20m98R5n8j04L43K54R1L7l55m91
4943e04K79o0J8L00J75J23j97j97k26l7M1J22K42K33K01m23k4l10j70L69p7L52
4965B30J67k35knn02l39K66N61J9L34l21J23j17l40l75J39J97K96N57k81k41j64
4987c3j94j72j13M09L32%K14k64n90J24k59K65J97L09K15J34l80l94Lj4N4L7M50
5010C30r5o3m28J83j33l22K87L44L97k8m66K29l81k81N3L64M9J18J40j4j26k30
5032g3k63M4Q1K99K75LN8m89r8o2l59L08K65M03R1r6l44k71j46j83L34J26N39
5055D42J54k57j05n54j58K61rN12J94j67r7k3l68j49P2K53J27L32P8k72k92j09
5077a35m99K87L98q2L91j55J31l91l02R1J08K11J26K5Qn5k77k32P2R1J55L09N4
$$ plain form
5100 329 242 331 -205 -158 -434 -251 -4 309 426 543 129 -93 -409 -236 -397 -86 200 330 334 199 -68 -429
5122 -429 -342 -448 61 259 278 473 150 -208 -349 -127 -117 74 319 555 98 41 -109 -293 -379 26 512 349
5144 349 584 295 -44 -230 -253 -445 -301 88 318 292 296 20 -194 -111 -269 -123 -41 297 464 186 78 -229
5166 -229 -163 -237 -187 259 383 190 184 130 -229 -138 -229 -100 107 352 460 282 73 -234 -127 -228 -118 289 363
5189 363 485 191 -45 -417 -475 -223 -166 264 541 -116 29 -143 -489 -336 -317 211 244 353 267 74 -92 -364
5211 -364 -200 -369 -97 111 458 437 339 -97 -306 -425 -254 137 268 403 355 45 65 -366 -107 -103 -38 494
5233 494 422 212 -47 -258 -316 -335 -220 104 320 352 433 83 -300 -68 -488 -263 175 319 250 274 96 -51
5255 -51 -379 -474 77 271 417 338 201 -48 -236 -239 -173 -134 249 495 335 329 104 -101 -146 -319 -154 212 322
$$ packed form
5100C29q7Q9n36M7k76J83K47L13J17J17m14k22l16J73j61L11K86J30Mj35k67l61
5122d29Q7j06N09J98J9J95l23l58j41K22J0J91K45K36m57n7j50j84q6M05M86j63
5144C49K35k89l39j86k3j92J44L89K30k6Mk76k14Q3j58J46Q2L38J67k78j08l07
5166b29O6p4N0M46J24j93on4l59R1r1J29K07K45J08j78k09l07J07j01J10M07P4
5189C63J22k94k36l72n8K52N7M30K77o57J45j72l46J53J9N28L3J09q6j93j66k72
5211c64J64j69K72K08L47k1r8m36k09j19J71L91J31J35m8l10K0m31K59MO5N32
5233D94p2k10k59k11n8j9J15L24K16L2Q1l50l83K32m20K25M38J44o9K4j78j47
5255e1l28r5N51J94J46p9j37k49j88lO6L9L83K46j60ok25k05m5j73J65L66J10
$$ plain form
5278 322 231 305 89 -164 -167 -607 -93 248 205 175 -183 221 -200 -444 -391 -186 101 311 614 238 7 -274
5300 -274 -451 -105 -289 171 293 425 336 47 -211 -339 -287 23 225 427 318 11 -457 -406 -265 -384 -49
5321 -49 147 225 414 -30 1 -301 -161 138 -43 149 333 225 3 -281 -386 -434 -171 93 504 252 263 304
5343 304 99 -407 -440 -90 213 224 379 358 -162 -319 -180 -336 -332 276 420 245 175 254 -343 -157 -227 -19 74
5366 74 121 609 67 147 -311 -396 -489 -114 143 340 144 46 -168 46 -274 -348 -44 94 427 258 116 20 -109
5389 -109 -315 -323 -131 201 523 414 -27 -77 -147 -282 -375 -14 110 196 318 73 -134 -285 -163 -318 157 93
5411 93 253 132 -145 -138 -242 -402 -298 95 251 419 248 -22 -4 -27 -173 -147 183 599 170 262 -128 -101 -275
5434 -275 -169 -319 56 412 333 441 -14 -62 -345 -325 -181 11 348 261 74 -19 -215 -350 -144 -123 -46 191
$$ packed form
5278C22r1P4k16k53lm40N14L41m3l0l58M04m21k44N3K05K87K10L03l76k31k81
5300b74j77L46j84M60J22J32q9k89k58j28N2L10K02K02j09l07m68N1J41j19L35
5321d9J96P8J89m44L1l02J40K99j81J92J84j08k22k84j05m8K63K64M11k52J1M1
5343C04k05n06l3L50L03J1J55k1n20j57J39j56MO08J44j75p0P9n97J86p0K08R3
5366G4M7M88n42Q0m58q5r3L75K57J97j96r8k14K14l20p4L04J38L33j69j42r6j29
5389a09k06qJ92L32L22j09m41n0p0j35r3L61J24Q6J22k45k07j51J22j55M75o4
5411I3J60j21k77Pj04j60J04L93J56J68j71k70J8k3j46K6L30M16m29R2l90K7j74
5434b75J06j50L75L56p9J08m55m8k83K0J44J92L37q7j87r3j96j35K06K1P7K37
$$ plain form
5456 191 388 289 -72 -133 -529 -369 25 147 167 224 48 22 -193 -15 -299 -218 171 261 309 60 87 -364 -205
5479 -205 -379 85 161 179 208 148 -85 -380 -548 -247 -56 271 424 236 255 3 -170 -148 -173 -16 150 155 308
5502 308 25 -196 -324 -557 -215 -68 162 383 219 -94 -148 -220 -305 -328 -19 373 475 335 81 59 -316 -472
5524 -472 -132 161 171 252 174 200 -352 -324 -225 -230 11 316 321 274 -16 -177 -215 68 -266 63 232 125 245 -113
5548 -113 -111 -109 -348 14 113 146 149 -76 116 -109 -221 -333 39 155 365 269 408 142 -170 -195 -173 -136 184 466
5572 466 286 160 85 -160 -141 -288 -8 367 226 296 151 -29 -59 -375 -351 -226 83 483 274 108 -256 -267
5594 -267 -178 -124 91 91 462 271 76 -22 -242 -245 -79 -163 168 161 337 -29 -306 148 -303 -252 126 168 347 229
5618 229 238 -74 -89 -182 -208 41 160 564 25 75 -35 -329 -248 69 38 222 220 40 -93 59 -173 -216 -25 8
$$ packed form
5456A91J97r9l61o1l96J60L94J22K0N7j76k6k15J78k84Q1L89R0M8k49K7m51J59
5479b05j74M64P6J8K9o0k33k95j68L01J91L27J53j88J9k52j73K2k5J57J66NJ53
5502C08k83k21j28k33L42J47K30K21j64l13n4p2q5k3L09L92J02j40k54k2l75j56
5524d72L40K93J0Q1p8K6n52K8R9nK41L05Nm7k90j61l8K83l34L29J69j07J20l58
5548a13KKk39L62R9L3Lk25J92k25j12j12L72J16K10r6J39k66l12k5K2L7L20K82
5572D66j80j26p5k45J9j47K80L75j41P0j45j80l0l16K4J25L09M00k09j66l64j1
5594b67Q9N4K15%L71j91j95r8k20lJ66q4L31pJ76l66k77M54m51N1L78M2J79j18
5618B29Rl12j5r3k6K49J19M04n39N0j10k94Q1L17l1J84kj80j33J52k32m3J91L3
$$ plain form
5642 8 326 569 413 -43 -50 -220 -227 88 44 62 441 243 -3 -382 -246 -202 -196 173 172 366 49 129 -63 -354 -233
5667 -233 -80 8 248 168 139 69 46 -341 -153 44 34 399 118 388 40 -387 -172 -307 -131 108 329 226
5689 226 150 -19 -134 -408 -270 -175 269 349 172 -7 211 -291 -104 -108 197 128 94 267 132 -128 -251 -227 -250
5712 -250 87 89 305 141 31 63 -308 -378 -163 208 234 428 328 44 -194 -335 -141 -162 106 205 207 520 62
5735 62 -198 -256 -144 -196 208 197 280 270 84 -64 -273 -342 -45 -92 125 152 256 173 -257 -239 57 -110 139 193
5759 193 271 226 152 -181 -281 -118 -121 -2 339 191 -97 70 -192 -365 -68 -125 115 164 189 39 -65 -356 -291
5782 -291 -325 -154 -46 212 278 292 -170 -191 -191 -205 -37 326 210 146 264 -176 14 -154 -203 10 257 350 396 76
5806 76 -164 -361 -390 -66 91 317 302 333 203 -314 -113 24 -211 110 179 325 249 210 -252 -120 -191 -46 -93
$$ packed form
5642HL18K43j56m56pj70pL15m4J8L79j98k46l79J36M4OL69jJ94l17Q0j92k91J21
5667b33J53Q8K40q0k9p0k3l87J88J97j0L65k81K70l48m27K15j35J76K39K21j03
5689B26p6j69j15k74J38R5M44Q0j77j79K18n02J87mL05o9l4J73j35k60j23K4k3
5712b50L37KK16j64j10L2l71p0K15L71K6J94j00k84k38j41J94k1K68R9KL13m58
5735F2k60n8J12n2M04j1Q3j0j86j48k09o9K97m7K17K7J04q3m30J8K96j67K49N4
5759A93P8m5p4l33j00J63lJ19L41j48k88J67k62j73K97n7K40M9K5j50j04k91O5
5782b91l4J71J08K58O6J4m62k1%j4J68L63j16o4J18m40J90j68m9K13K47R3M6l20
5806G6k40j97k9L24J57K26j5L1j30n17K01J37k35L21O9J46p6l9m62J32p1J45m7
$$ plain form
5829 -93 174 307 126 -13 -6 -89 -231 -171 -11 82 297 136 159 -68 -663 -54 -79 259 236 321 278 -225 -122 -130
5853 -130 0 -232 59 266 378 16 59 50 -400 -237 -9 141 258 337 130 -122 -261 -330 -130 -117 280 384
5875 384 298 154 10 -220 -281 -104 -266 171 207 190 178 -96 -290 -69 -356 79 31 111 90 -47 -9 -439 -288
5898 -288 -463 -126 106 73 144 258 32 -247 -411 -164 -11 184 348 154 153 -220 -36 23 -364 49 253 82
5920 82 148 73 -41 -261 -141 99 52 164 152 92 42 -421 -478 -336 -200 40 258 365 160 -84 -430 -275 -207
5943 -207 -134 -177 224 447 330 127 -420 -401 -148 -39 273 252 168 211 96 -370 -166 -165 108 161 112 108 167 29
5967 29 -300 -181 -221 -126 35 283 10 78 -172 -464 -334 -30 -220 -27 286 439 220 27 -99 -259 -217 13
5989 13 419 543 91 112 -174 -36 -386 -51 145 -23 155 193 13 -75 -210 -319 -213 62 36 93 276 181
$$ packed form
5829i3K67J33j81j39Pq3j42O0J60R3K15j61K3k27n95O09k5L38k3Q5m3n03J03q
5853a30J30k32K91K07J12l62M3rm50J63K28J50J17P9k07k52j39o9K00J3L97J04
5875C84q6j44j44k30o1J77j62M37L6j7j2k74j94K21k87M35m8Q0k1j37L8m30J51
5898b88j75L37K32l3P1J14k26k79j64K47J53J95J64j94jl73J84N9l87M13K04j71
5920H2O6p5j14k20J20K40m7J12j2o0n0m63n7J42J36K40K18J07k05k44l46J55O8
5943b07P3m3M01K23j17k03n47J9K53J09L12k1q4M3j15m66K04JK73N3m9mN9j38
5967B9l29J19m0R5J61K48k73O8k50k92J30L04j90J93L13J53k19j93j26j60M2K30
5989A3M06J24m52K1k86J38l50L35J96j68J78L8j80q8j35j09J06K75k6N7J83r5
$$ plain form
6011 181 -45 -330 -218 -346 -50 383 389 174 74 -113 -408 -285 -230 -136 184 320 194 76 -217 -261 -196 -98
6033 -98 189 -31 191 231 310 -226 -233 -269 -136 154 200 305 77 -168 -99 -187 -268 -131 128 316 241 185 131 -218
6057 -218 -282 -129 -22 110 270 277 1 -55 -100 -282 -258 -191 191 39 213 115 18 -61 -280 -17 255 -56 171
6080 171 251 167 147 -191 -169 -63 -179 229 203 354 197 48 -103 -28 -331 84 351 193 463 150 -235 -138
6102 -138 -132 -192 123 236 157 409 -16 -207 -96 -169 -210 -97 163 54 116 146 168 -290 -422 -250 80 130 358
6125 358 298 22 87 -228 -181 -133 26 85 249 152 279 -31 -68 -347 -12 131 187 239 243 34 -339 -439 17 -178
6149 -178 168 166 284 310 -63 -230 -200 -325 47 274 153 369 140 -112 139 -257 -55 1 145 89 186 64
6171 64 -42 -103 -284 -422 7 280 433 250 83 1 -149 -156 -31 -64 111 322 203 124 -202 -103 -242 -142 56
$$ packed form
6011A81k26k85J12j28K96M33Ok15j00j87k95J23N5R4L20J36j26j18k93m4O5R8
6033i8K87k20K22M0P9n36pl6J33K90M6J05k28k45O9q8q1J37K59J88p5n6n4l49
6057b18o4J53J07J32J60Pk76n6m5j82K4O7L82j52J74r8r7p9k19K63K72l11K27
6080A71Q0q4k0l38K2J06j16M08k6J51j57j49j51P5l03M15K67j58K70l13l85R7
6102a38Oo0L15J13p9K52m25j91J11p3m1J13K60j09O2L0K2m58j32J72L30N0K28
6125C58o0k76O5l15M7M8J59N9J64r7J27l10l7k79L35J43N6N2Mk09l73j00M56j95
6149a78L46kJ18K6l73j67L0j25L72K27j21K16k29k52K51l96K02N6J44n6R7j22
6171F4j06o1j81j38M29K73J53j83j67q2j50pJ25l3J75K11j19p9l26R9j39J00J98
$$ plain form
6194 56 48 380 374 328 -52 -248 -341 -13 215 235 284 125 157 -8 -314 -259 -128 -35 211 111 301 -129 54 -185
6218 -185 -128 51 31 148 276 280 107 147 -388 -94 -257 59 350 582 187 -52 -38 -320 -228 -139 124 100 260
6241 260 93 214 12 -196 60 8 105 134 32 72 115 20 -117 -298 32 129 183 375 309 103 -126 -375 -253
6264 -253 -249 -140 185 209 174 107 -100 -356 -285 41 -37 58 -88 352 -14 -342 -258 -151 -5 27 130 72 231 -163
6288 -163 19 -208 -325 -332 89 387 50 228 -257 -141 -324 -297 -2 177 261 349 11 -95 -131 -263 81 98
6310 98 235 -57 199 -82 -146 -338 -397 -20 -15 201 127 226 100 146 -98 -309 -126 -60 277 -29 352 110 -82
6333 -82 0 -94 -424 162 237 200 305 -111 -12 -259 -112 -154 387 85 160 2 234 41 84 -260 -190 141 269
6356 269 131 70 210 -343 -260 -350 10 184 252 68 165 96 -319 -12 -60 -95 -3 360 292 -39 -30 -50 85 -242
$$ packed form
6194E6qL32om6l80j96r3L28K28K0M9j59L2j65l06N5J31R3K46j00J90m30J83k39
6218a85N7J79k0J17J28Mj73M0n35K94j63L16K91K32l95k39J4k82R2Q9K63k4J60
6241B60j67J21k02k08K56n2R7K9j02M0M3r5j37j81L30R7N4J92o6k06k29k49J22
6264b53MJ09L25K4l5o7k07k56P1L26p8R5j46M40l66l28Q4J07J46L2J03n8J59l94
6288a63J82k27j17pM21K98l37J78m85J16j83K7K95J79Q4Q8l38j06l6j32L44J7
6310I8J37k92K56k81o4j92n9L77NK16p4R9j26M6k44k11J83O6L37l06L81k42j92
6333h2Q2r4l30N86P5l7J05m16R9k47J47m2N41l02P5j58K32j93M3l44P0L31J28
6356B69j38o1J40n53Q3r0L60J74O8j84R7o9m15L07m8l5R2L63o8l31Rk0J35l27
$$ plain form
6380 -242 55 292 264 250 250 69 -264 -35 -206 -257 64 392 161 194 -87 -99 -62 -23 -53 273 286 145 26 -45
6404 -45 -146 -134 -220 -26 182 73 27 -7 33 -289 -201 -144 59 111 327 74 -51 111 -79 -245 -213 1 52 219
6428 219 98 166 -103 -278 -243 54 -83 -55 -20 188 43 -252 -63 -127 126 9 284 231 -54 -28 -146 -57 -153
6451 -153 -244 32 82 226 148 251 -169 -148 -135 -75 247 -20 129 61 -78 -144 -28 -192 4 126 203 170 -86
6474 -86 2 148 -150 -127 51 372 189 327 160 -98 -178 -186 -188 148 300 334 87 -87 120 -246 -176 74 38 172
6498 172 478 54 41 14 -437 -79 20 -11 404 238 321 99 -115 112 -260 48 309 331 21 185 70 -106
6520 -106 -162 -280 -144 -123 187 149 195 -14 -283 -137 -227 -77 -67 78 132 305 20 121 -39 -230 26 2 261
6543 261 242 173 64 -136 -157 -210 -83 158 319 353 235 -119 -157 -258 58 -143 -8 223 285 122 -232 -225 -67
$$ packed form
6380b42K97K37k8j4%j81l33K29j71n1L21L28k31L3k81j2L7L9l0L26J3j41j19p1
6404d5j01J2q6J94K08j09m6l4M0l22Q8N7K03N2K16k53j25J62j90j66L2K14N1J67
6428B19j21O8k69j75L5K97j37K8L5K08j45k95J89o4K53j17K75n3k85K6j18Q9r6
6451a53r1K76N0J44p8J03m20K1J3O0L22k67J49o8j39o6J16j64J96J22P7l3k56
6474h6Q8J46k98K3J78L21j83J38j67k58q0qkL36J52L4k47j74K07l66P0K50l6J34
6498A72L06m24j3k7m51L58R9l1M15j66Q3k22k14K27l72L08K61K2l10J64j15j76
6520a06n6j18J36K1L10l8M6k09k69J46r0J50J0J45N4J73k85J01j60j91K56k4K59
6543B61j9o9j09k00k1n3J27K41J61L4j18l54l8j01L16k01J35K31O2j63l54PJ58
$$ plain form
6566 -67 -207 18 -41 115 346 18 -41 -125 -450 -273 82 106 263 274 244 -326 -192 -248 99 -4 198 296 79
6589 79 170 83 -44 -109 -173 28 153 180 79 -38 47 -174 -187 -130 100 128 270 57 47 -19 -446 -264 -157 -34
6613 -34 -98 138 306 242 57 -35 -346 40 7 243 454 28 116 -80 -188 -193 -215 -238 257 275 118 -58 -248 -343
6637 -343 -152 -103 25 205 198 66 -42 -125 95 -224 -228 36 281 369 204 -69 -64 -203 -96 327 -22 240 426
6660 426 -13 58 -91 -315 -249 -96 25 393 225 221 169 -187 -259 -171 -82 186 288 168 9 -98 -434 -281 -323
6683 -323 122 58 118 -91 83 -393 -72 -216 -48 -174 68 168 3 -82 21 -286 -178 -42 16 264 186 350
6705 350 -167 -262 -261 28 111 172 139 408 239 -277 -231 20 -104 -42 132 140 -119 202 -33 53 20 49 68 177 310
6730 310 379 -80 -185 -146 -517 -29 -98 -127 27 144 354 -37 -84 -335 -334 37 128 292 152 191 14 184 -241
$$ packed form
6566f7j40K25n9J56K31l28n9q4l25J77L55K4J57J1l0n70J34n6L47j03K02R8k17
6589G9R1q7j27o5o4K01J25K7j01j17Q5k21j3N7K30K8J42k13j0o6m27J82J07J23
6613c4o4K36J68o4j85r2l11L86l3K36K11m26Q8j96j08nk2k3M95J8j57j76j90r5
6637c43J91M9J28J80pj32j08q3K20l19mK64K45Q8j65k73Nj39J07M23l49K62J86
6660D26m39P1j49k24O6J53J21L68j68mn2l56p2Q8Q9K68J02j20j59j07l36J53m2
6683c23M45o4O0k09J74m76L21j44J68j26K42J00j65q5J03l07J08J36N8K48p8J64
6705C50n17r5JK89Q3O1l3K69j69n16M6K51j24O2J74Qk59L21k35Q6l3K9J9J09J33
6730C10O9m59j05L9l71M88o9k9J54J17K10l91m7k51JL71R1J64j40L9j77J70m25
$$ plain form
6753 -241 -130 -11 58 104 156 233 -153 -250 -134 -316 -60 -31 515 259 51 64 24 47 -303 -139 319 257 90
6776 90 181 91 -308 -242 -122 -196 318 -58 271 -20 -235 -216 -149 -196 92 100 -60 153 -19 -7 -98 -273 2 -128
6800 -128 99 89 87 -50 40 -148 -205 -97 -56 127 25 64 278 -78 -93 -239 -10 -55 203 -37 120 374 -175
6823 -175 -138 26 -145 -34 252 484 163 150 -192 -2 -57 -49 153 240 212 122 186 -172 11 -76 -23 144 251 212
6847 212 374 45 -5 -91 -159 -103 -33 254 150 -14 81 -105 -137 34 -99 216 -40 87 321 149 -278 -364 -317
6870 -317 21 -25 33 12 308 -21 -93 -36 -201 66 270 215 -16 14 -108 -344 -139 -237 120 217 129 85 78 17 44
6895 44 -91 -86 148 79 55 24 -1 -34 -162 -76 -291 172 4 247 116 -252 -115 -250 -82 -166 -73 149 46 215
6919 215 -105 -94 28 -64 -176 -74 23 42 208 -178 77 -27 -238 28 171 222 4 189 92 -53 -142 -237 -69
$$ packed form
6753b41J11J19O9M6N2P7l86r7J16j82K56K9N46k56k08J3m0K3l50J64M58o2j67
6776I0R1r0l99O6J20p4N14l76L29k91k15J9O7m7K88Qj60K13j72J2r1j75K75j30
6800a28K27j0kj37R0j88n7J08M1J83j02L9K14l56j5j46K29m5K58k40J57K54n49
6823a75L7J64j71J11K86K32l21j3l42J90n5QK02Q7k8r0O4l58J83q7N3J67J07l9
6847B12J62l29n0q6o8N6P0K87j04j64R5j86l2J71j33L15k56J27K34j72m27q6M7
6870c17L38m6N8k1K96l29p2N7j65K67K04n5k31L0j22k36K05r8L57R7q8m4po1K7
6895D4j35NK34o9k4l1k5l3j28Q6k15M63j68K43j31l68J37j35J68q4R3K22j03J69
6919B15l20J1J22r2j12J02R7J9J66l86K55j04k11K66J43N1k18J85r7j45q9r5J68
$$ plain form
6942 -69 163 166 284 106 63 -217 -290 -100 63 -106 223 327 -59 86 -151 -81 -185 -155 -77 125 40 185 -5
6965 -5 -203 -195 -397 47 -60 246 -49 55 144 -311 -288 -132 -157 237 191 222 248 76 -188 -49 -191 5 154
6988 154 182 52 96 -285 -139 -354 -161 251 200 212 -3 14 102 -155 -86 269 -223 -11 291 180 -68 -114 73
7011 73 211 36 83 48 51 321 -109 61 -67 -379 -143 97 -61 169 107 173 68 -113 -256 -255 -37 302 297 23
7035 23 47 -100 -181 -150 -40 70 273 249 203 -28 -392 6 -116 7 -43 239 292 181 13 -145 -85 -327 134
7058 134 144 80 198 119 123 -162 -263 -151 134 39 92 135 35 137 -100 -201 -232 183 -115 237 243 206 -73 20
7082 20 -13 -69 48 165 114 228 8 9 -320 -236 -98 -35 94 287 202 -81 73 -110 -295 24 -63 189 300
7105 300 -81 210 95 -239 -15 279 224 385 400 -2 22 -134 -194 49 -38 -82 155 88 206 87 15 -9 14
$$ packed form
6942f9K32LJ18j78m3k80p3J90J63j69L29J04l86J45k37P0j04L0P8K02q5J45j90
6965ej98Qk02M44j07L06k95J04Q9m55K3J56k5L94m6L1K6j72k64J39j42J96J49
6988A54K8j30M4l81J46k15J93M12n1J2k15J7Q8k57O9L55m92K12L02j11k48m6J87
7011G3J38j75M7l5LK70m30J70j28l12K36K40j58K30o2O6j05j81j43JK18L39nk74
7035B3K4j47q1L1J10J10K03k4m6k31l64L98j22J23n0K82N3j11j68j58O0k42M61
7058A34J0o4J18p9Mk85j01J12K85r5N3M3j00J02k37j01l1M15k98L52Ol7k79R3
7082B0l3n6J17J17n1J14k20Jl29Q4J38O3J29J93q5k83J54j83j85L19q7K52J11
7105C00l81K91j15l34K24K94n5J61J5m02K4j56o0K43q7m4K37o7J18j19p2k4K3
$$ plain form
7128 14 121 139 121 -33 61 10 -262 2 -176 -85 -1 99 84 -5 148 -106 -263 -105 -5 92 -2 87 65 -7 -226
7153 -226 30 -115 79 174 71 256 136 82 -32 -213 34 -129 78 -35 221 242 -167 -141 20 115 -12 127
7175 127 331 149 95 -122 -166 -205 -204 -160 147 102 152 206 -80 -49 61 -37 18 262 329 269 55 -198 -176 11 -302
7200 -302 -112 168 294 178 -52 -14 -231 -244 112 170 290 57 140 99 -124 -165 -116 5 164 -38 110 -90
7222 -90 220 23 -203 -161 -61 154 39 253 206 42 -198 158 -284 -116 190 240 -64 135 28 25 -168 -193
7244 -193 -48 -239 18 319 188 90 -59 -152 -197 97 115 209 -46 137 -51 -285 24 -100 164 107 97 4 169
7267 169 205 15 -127 -205 43 205 -50 -29 186 -141 -203 -326 149 -51 233 83 166 -149 -246 -158 -101 -125 -42
7290 -42 384 313 53 -80 -31 40 36 -201 -8 116 92 -17 273 -23 -62 -306 -107 -118 60 -4 217 -84 -189
$$ packed form
7128A4J07J8j8j54R4n1k72K64j78R1Q4J00j5q9J53k54j57J58J00R7r4Q9k2p2k19
7153b26K56j45J94R5j03J85j20n4j14j81K47j63K07j13K56K1m09K6J61R5j27J39
7175A27K04j82n4k17m4l9JM4L07m5N0N4k86L1J10r8N5K44O7o0k14k53K2J87l13
7200c02J90K80J26j16k30L8k17j3L56N8J20k33Q3m1k23m1M9J21J59k02J48k00
7222i0L10j97k26M2J00K15j15K14m7j64k40L56m42J68L06N0l04J99j07lj93k5
7244a93J45j91K57L01j31r8j49r3m5K94J8R4k55J83j88k34L09j24K64n7j0r3J65
7267A69L6j90j42p8K48J62k55K1K15l27o2j23M75k00K84j50Q3l15r7Q8N7k4Q3
7290d2M26p1k60j33M9P1mk37J93J24k4j09K90k96l9k44J99j1J78o4K21l01j05
$$ plain form
7313 -189 -285 -177 38 -25 34 202 50 -122 -44 -293 -127 4 46 -2 121 142 -109 -90 -268 -195 10 12 -95 418
7337 418 153 -1 -67 -68 -299 -35 169 221 10 147 -206 -12 -74 -182 -112 -6 209 144 210 -83 -95 -101 -219 -149
7361 -149 159 279 191 216 60 -137 -178 4 -58 43 237 325 69 -247 -340 -100 131 2 103 303 26 -165
7383 -165 -231 33 -187 -334 -104 164 167 61 -68 -53 -47 -246 -107 137 53 226 -9 96 -3 -192 -129 -146 174
7406 174 -95 169 296 177 -103 -18 -116 27 -194 143 139 118 84 -107 -163 -62 -173 18 35 30 254 -125 -39 -100
7430 -100 -112 -103 32 128 93 -32 -155 -229 -215 11 149 -50 169 171 96 -55 -150 -155 -79 -143 -55 179 134 -128 61 -220
7456 -220 -274 12 -228 112 183 -258 -89 66 -172 -142 -100 -155 61 -122 -167 -62 -96 -108 -150 -54 140 -11 119
7479 119 3 261 -178 -55 -149 -27 -162 193 269 78 144 -175 -381 -131 -314 22 -1 127 324 -2 48 -21
$$ packed form
7313a89r6J08K15o3N9J68j52j72P8k49J66J31M2m8J23K1k51J9j78P3K05Kj07N13
7337D18k65j54o6jk31K64K04N2k11J37l53J94o2j08P0J06K15o5O6k93j2oj18P0
7361a49L08J20q8K5j56j97m1J82o2J01J94Q8k56l16r3K40K31j29J01K00k77j91
7383a65o6K64k20j47K30K68Lj06j29J5Oj99J39K44q4J73k35J05r9j89O3j7L20
7406A74k69K64J27j19k80Q5r8J43k21L37mk1l4j91n6J01j11J91J7nK24l79Q6o1
7430a00j2RJ35R6l5j25j23p4J4K26J38j99K19Kp5j51r5nP6o4Q8K34m5k62J89k81
7456b20n4K86k40L40P1m41J69J55k38L0M2n5K16j83m5J05l4j2m2R6J94j51J30
7479A19j16K58m39J23r4J22j35L55P6j91O6l19k06K50j83L36k3J28J97l26N0o9
$$ plain form
7501 -21 -71 117 266 -29 146 242 170 -99 -124 -254 210 25 93 229 -172 99 -139 -69 12 -25 84 -29 -86
7524 -86 33 -237 -172 -298 -318 -22 197 119 -19 15 54 -181 186 -22 -175 108 118 41 285 -82 -80 -157 13 96
7548 96 -183 13 305 -108 -106 -292 -10 -200 -89 304 105 304 -31 24 -145 -213 -62 -16 100 253 58 103
7570 103 167 -206 -174 -221 -193 208 73 182 134 76 99 -41 -196 55 216 97 98 31 -92 147 -80 -93 -45 221
7594 221 -40 146 -12 -94 -219 -368 141 -121 57 186 -60 39 -66 -112 -212 -14 -1 13 -106 213 205 33
7616 33 -184 -52 -101 149 35 168 192 -86 -94 -250 -63 -105 -27 201 148 -70 199 -50 -9 135 -29 136 290
7639 290 164 -51 -129 -168 22 39 -9 161 60 336 167 -103 -145 -30 97 -33 322 251 98 205 127 -217
7661 -217 -31 90 -102 -107 -31 167 -22 -119 -375 -142 -137 14 -72 26 53 45 -80 167 20 -125 -185 -39 108 368
$$ packed form
7501b1n0J88J49k95J75R6p2k69k5j30M64j85O8J36m01K71k38P0Q1l7J09j13n7
7524h6J19k70O5j26k0K96K19p8j38L4L9k35L67k08j53K83J0p7K44l67Kp7J70Q3
7548I6k79J96K92m13Kj86K82j90J11L93j99J99l35N5j69o8J51M6J16J53j95M5
7570A03O4l73L2m7K8M01j35J09m8n8K3j40j55K51J61j19Jo7j23K39k27j3M8K66
7594B21k61J86j58q2j25j49N09k62J78J29k46R9j05m6j00J98J3J4j19L19qj72
7616C3k17J32m9K50j14J33K4k78qj56J87m2P8K28n3k18K69k49M1J44j64J65J54
7639B90j26k15p8l9J90J7m8J70j01K76j69k70m2J15J27j30L55p1j53J07p8l44
7661b17J86J21j92nP6J98j89r7k56K33NJ51q6R8K7qj25K47j47j45o0J46J47K60
$$ plain form
7685 368 118 -147 -244 -163 -292 -63 142 125 0 198 64 -162 49 -57 100 74 274 200 79 -120 -195 -173
7707 -173 89 -122 196 259 22 119 153 -82 -137 107 30 -41 78 96 -23 -67 -172 -259 -213 -36 137 278 12
7730 12 -101 -112 -229 -21 18 -128 202 167 130 -95 67 159 -52 63 -193 306 65 188 -38 -53 -128 -97 118
7753 118 -268 211 63 87 -1 -72 -110 -220 -240 97 18 69 -242 37 -59 -118 -355 -318 314 155 113 17 -152 -54
7777 -54 -103 24 108 9 -119 106 113 101 -230 -38 -11 186 76 147 115 -144 27 -32 -110 -242 192 86 122 22
7801 22 0 17 -98 9 -411 134 375 -120 169 178 57 -383 -144 -75 125 -71 264 68 76 -186 181 -262 -164
7824 -164 27 276 69 349 128 43 -118 -188 -99 -40 19 61 -102 -118 -41 31 -78 132 178 -14 145 86 -79 -69
7848 -69 -283 -263 -88 64 291 258 29 -19 62 -22 63 -15 373 82 256 -85 166 37 -193 101 105 -82 144
$$ packed form
7685C68k50k65r7Q1j29K29K05j7j25J98j34k26K11j06J57k6K00p4j21j99p5K2
7707a73K62k11L18O3k37R7L4k35n5K44p7p1J19J8j19m4j05q7M6J77J73J41k66
7730A2j13j1j17K08L9j46L30l5l7k25J62R2k11J15k56M99k41J23k26j5p5L1K15
7753A18l86M79j48K4q8p1l8j10k0L37p9N1l11K79r6n9k37L7O32j59m2r6j69R8
7777e4m9J27Q4r9j28K25Pj2l31J92K7J97j10P1l2k59J71n9p8j32M34j06L6j00
7801B2k2J7j15J07m20N45K41m95K89Rj21m40K39O9K00j96L35j96Qk62L67m43R8
7824a64J91K49k07K80k21q5j61p0Q9N9N9M2j63j6P7P2j09K10M6j92J59n9j65J0
7848f9k14K0J75J52K27l3k29m8Q1q4Q5p8L88k91J74l41K51j29k30K94Mj87K26
$$ plain form
7871 144 174 38 -151 -262 112 -165 -30 -15 72 229 -60 261 -33 -82 -242 95 -55 11 -193 135 118 -312
7893 -312 -158 161 -5 105 187 -109 -286 -88 -371 -158 70 110 -19 104 174 -211 -221 -202 -48 -268 -117 20
7915 20 167 160 199 -133 -30 -107 125 -25 249 170 -118 -13 -20 -111 -139 -43 -14 -27 -21 204 -1 -128 -52 -284 -181
7940 -181 -137 85 86 103 -66 -208 -35 75 33 135 -101 249 99 130 -41 -347 -182 10 19 15 83 -11 -78 78
7964 78 -100 -279 -25 10 43 299 123 -95 255 -120 -185 219 165 236 -80 -166 -135 10 -97 -34 78 38 196
7987 196 214 -196 -261 -251 21 6 240 50 16 -255 -307 -187 -71 -152 45 152 108 68 131 -79 -412 -9 152
8010 152 74 -24 84 237 45 194 -212 -195 -70 -169 210 -66 138 -98 17 -77 -119 -40 -153 225 78 29 -62
8033 -62 183 -74 -96 -90 120 22 -20 36 -9 97 4 1 -206 77 -136 11 -76 56 -29 -35 -56 -152 -236 -18 94 123
$$ packed form
7871A44L0j36j89j11L74k77J35J5Q7J57k89L21k94m9j60L37j50O6k04L28j7m30
7893c12J54L19j66J10Q2k96j77J98k83K13K28M0j29J23P0l85j0J9J54k20J51J37
7915B0J47pL9l32J03p7K32j50K74p9k88J05pr1k8R6K9j3OK25k05j27P6k32J03
7940a81M4K22JJ7j69j42J73J10m2J02k36L50j50L1j71l06J65J92RmO8r4o7J56
7964G8j78j79K54L5L3K56j76k18L50l75o5M04n4P1l16q6L1J45j07O3J12m0J58
7987A96J8m10o5J0K72j5K34j90l4k71n2J20J16q1J97J07m4m0O3k10l33M03J61
8010A52p8r8J08J53j92J49m06J7J25r9L79k76K04k36J15r4m2P9j13L78j47m9r1
8033f2K45k57k2OK10r8m2N6m5J06r3lk07K83k13J47q7J32q5ok1r6q4K18J12K9
$$ plain form
8059 123 -162 -20 -99 -85 -47 -164 84 81 286 202 -62 -14 32 -74 -89 274 39 149 -179 -29 -30 -62 -117 -204 -261
8084 -261 -87 66 -100 35 23 -46 155 84 57 -70 177 48 -121 31 -198 -122 101 228 167 -24 170 42
8106 42 -221 -137 -63 82 66 180 90 113 -111 -141 212 34 -113 95 158 151 280 -234 57 -395 -40 41 158 351
8130 351 221 92 9 53 -20 367 5 278 82 346 -30 3 -34 -64 200 -4 64 -121 77 -184 -35 -153
8152 -153 36 87 -72 -10 4 24 32 -282 -182 -162 359 155 185 -51 -214 142 -228 -186 100 150 206 121 -224 82
8176 82 54 -62 44 -47 40 149 208 85 -147 30 26 6 -30 22 245
$$ packed form
8059A23k85J42p9J4L8j17K48lK05q4k64M8M6j06j5L63k35J10l28J50jl2n5q7n7
8084b61J74J53j66J35j2o9K01p1k7j27K47j29j69J52k29P6K23J27o1j91J94j28
8106D2k63Q4P4J45j6J14r0K3k24l0L53j78j47K08O3pJ29n14K91m52L55Q1J17J93
8130C51j30j29q3M4p3L87l62K73j96K64l76L3l7l0K64k04O8j85J98k61J49j18
8152a53J89N1j59O2J4K0Ql14J00K0N21k04L0k36j63L56l70M2K86N0N6q5l45L06
8176H2k8j16J06r1Q7J09N9j23k32J77mk0l6N2K23
8191B45
$$ Imaginary data points
##PAGE= N=2
##DATA TABLE= (X++(I..I)), XYDATA
$$ plain form
0 0 0 0 0 0 0 0 0 0 0 0 0 0 0 0 0 0 1 -8 8 -8 8 -8 12 -16 16 -17 24 -24 31 -33 40 -46 49 -57 65 -73 81 -93 104
39 104 -113 128 -143 158 -174 194 -213 235 -259 285 -316 347 -383 422 -463 514 -566 629 -702 785
59 785 -883 1001 -1145 1325 -1563 1883 -2349 3091 -4453 7831 -38978 -25270 24603 11283
73 11283 42102 39218 -475 -17379 -21910 -45924 -23772 11752 24732 34442 33623 4981 -14098
86 -14098 -31045 -40213 -18957 8122 21419 39166 32503 1656 -17192 -32007 -40583 -13500 12991
99 12991 22051 35932 29787 -3289 -19043 -27102 -34580 -13388 12791 22344 34175 26536 -3125
112 -3125 -18264 -27820 -34578 -10911 14142 21445 34635 27047 -8583 -21881 -24339 -32958 -10939
125 -10939 19231 23349 29072 23952 -9335 -24867 -21408 -26737 -11309 17769 24205 26219 22461 -6415
$$ packed form
0@%%%%%%%%%%%%%%%%JrJ6j6J6j6K0k8L2l3M1m8N5o4P3q6R5j06J22j38J54j74J97
39A04k17K41k71L01l32L68m07M48m94N44o01O63p30Q05q85R77j080J195j331J487
59G85j668J884k146K470k888L446m232N440p544J2284m6809J3708M9873j3320
73A1283L0819k884l9693j6904m531k4014K2152L5524J2980R710q19k8642j9079
86a4098j6947r168K1256K7079J3297J7747o663l0847j8848j4815q576K7083K6491
99A2991R060J3881o145l3076j5754q059p478K1192K6179R553J1831p639k9661
112c125j5139r556o758K3667K5053P303J3190p588l5630j3298k458q619K2019
125a0939L0170M118N723n120l3287j5532L459n329J5428K9078O436K014l758k8876
$$ plain form
139 -6415 -26603 -24727 -23386 -7872 18045 25406 25898 18329 -8298 -25478 -24950 -22048 -3736 20364
153 20364 24194 22295 16385 -8775 -25691 -22714 -20300 -4427 20511 25188 20592 14276 -9583 -26387
167 -26387 -22640 -17224 -2338 21363 25516 18918 11183 -10295 -26810 -21895 -14492 -676 21202
180 21202 25231 16683 8273 -10902 -26518 -21857 -12303 1123 20985 25117 15981 5924 -11604
193 -11604 -25409 -21633 -10952 3858 21859 24253 14621 3781 -13035 -24749 -19926 -9976 4693
206 4693 22067 23867 12854 2052 -13788 -24715 -18457 -7354 5834 22185 23755 11949 10
219 10 -14469 -25012 -17518 -4499 7049 21365 23306 10114 -2076 -14774 -24496 -17277 -2955
232 -2955 8489 20383 22628 9550 -3884 -15593 -23244 -16239 -1656 10377 20637 21462 8361
$$ packed form
139f415k0188J876J341J5514K5917P361M92p569k6627j7180N28K902J8312K4100
153B0364L830j899n910k5160j6916K977K414J5873K4938M677m596o316k3859j6804
167b6387L747N416J4886K3701M153o598p735k1478j6515M915P403J3816K1878
180B1202M029q548q410j9175j5616M661R554J3426J9862M132r136j0057j7528
193a1604j3805L776J0681J4810J8001K394r632j0840j6816j1714M823R950J4669
206D693J7374J800j1013j0802j5840j0927O258J1103J3188J6351J570j1806j1939
219A0j4479j0543P494J3019J1548J4316J941j3192j2190j2698r722P219J4322
232b955J1444J1894K245j3078j3434j1709p651P005J4583J2033J0260Q25j3101
$$ plain form
245 8361 -5585 -16359 -22533 -15124 -479 11696 20066 20074 7245 -6895 -17090 -21419 -13855 626
259 626 12721 20365 18617 5989 -7882 -17577 -20547 -12566 1921 13827 20297 17499 4758 -9076
273 -9076 -17973 -19942 -11295 2999 14581 20237 16254 3174 -10079 -18028 -19333 -9951 4294 15216
287 15216 19714 15522 2019 -11156 -18048 -18125 -9020 5545 15813 19076 14055 1082 -12233 -18727
301 -18727 -17087 -7517 6604 16364 18551 12976 84 -12955 -18446 -15918 -6058 7453 16672 18134
315 18134 11684 -1151 -13875 -18743 -14787 -4880 8068 16917 17480 10348 -2252 -14178 -18505 -14002
329 -14002 -3045 9170 17255 16952 8842 -3629 -14157 -18164 -13652 -2009 10455 17450 16005 7414
343 7414 -4802 -14556 -18030 -12324 -785 11294 17563 15275 6215 -5732 -15099 -17483 -11045 545
$$ packed form
245H361j3946j0774o174P409J4645J2175Q370Qj2829j4140j0195m329P564J4481
259F26J2095P644j748j2628j3871r695k970P981J4487J1906O470k798j2741j3834
273i076q897j969Q647J4294J1582N656l983j3080j3253p949j305R382J4245J0922
287A5216M498m192j3503j3175o892p7R105J4565J0268L263n021j2973j3315o494
301a8727J640R570J4121R760K187n575j2892j3039n491K528R860J3511R219J462
315A8134o450j2835j2724m868L956R907J2948Q849N63p132j2600j1926m327M503
329a4002J0957J2215Q085l03q110j2471j0528m007M512J1643J2464O995j445q591
343G414j2216r754l474N706J1539J2079O269k288r060j1947r367k384O438J1590
$$ plain form
357 545 11933 17862 14614 4739 -6713 -15149 -17384 -10299 1628 12452 17186 13771 3767 -8085
371 -8085 -15694 -16068 -9167 2347 13028 17532 13102 2425 -8774 -15877 -15756 -8144 3761 13607
385 13607 16972 12324 1219 -10024 -16166 -14774 -6846 4546 13777 16827 11264 415 -10823 -16416
399 -16416 -13734 -5347 5431 14186 16393 10129 -876 -11324 -16597 -13324 -4275 6640 14452 15758
413 15758 9536 -2084 -12211 -16192 -12619 -3027 7661 14770 15521 8566 -2808 -12746 -16429 -11992
427 -11992 -1524 8761 14819 14700 6628 -3739 -12859 -16055 -11093 -743 9597 14894 14029 6265
441 6265 -4755 -12866 -15911 -10570 360 10390 15331 13238 4999 -5556 -13619 -15499 -9615 1755
455 1755 10838 14905 12371 3771 -6627 -13447 -14670 -9085 1980 11735 15370 11670 2951 -7218
$$ packed form
357E45J1388N929l248r875j1452q436k235P085J1927J0824M734l415j0004j1852
371h085p609l74O901J1514J0681M504m430j0677j1199p103J21P612J1905R846
385A3607L365m648j1105j1243o142J392P928J1392R231L050n563j0849j1238n593
399a6416K682Q387J0778Q755K207o264j1005j0448n273L273R049J0915P812J306
413A5758o222j1620j0127l981L573R592J0688P109P51o955j1374r938l683M437
427a1992J0468J0285O058j19q072j0367r120l196M962J0350J0340N297q65p764
441F265j1020q111l045N341J0930J0030M941k093q239j0555q063j880N884J1370
455A755R083M067k534q600j0398o820j223N585J1065R755L635l700q719j0169
$$ plain form
469 -7218 -13885 -14321 -7820 2974 11908 15315 11439 1157 -8326 -13910 -14062 -6848 4119 12226 14476
484 14476 10639 585 -9283 -13126 -12831 -6671 4938 13046 13938 10086 279 -10520 -13798 -11798 -5616
499 -5616 5559 13493 13660 8871 -1022 -11413 -13946 -10451 -4033 6162 13782 13173 7854 -1113 -11317
514 -11317 -14482 -10215 -3031 6722 14042 13192 6965 -2429 -11750 -14870 -9870 -1585 7669 13868 12513
529 12513 5972 -3631 -11965 -13692 -8933 -751 8970 13288 11674 5748 -4092 -12747 -13406 -8419 -683
544 -683 9806 14439 10513 4521 -4467 -13639 -13084 -6592 393 9778 14534 9864 2789 -4657 -13240
559 -13240 -13408 -5932 1184 9898 14291 9458 1665 -5473 -13413 -13365 -5397 2530 10306 14709 9349 184
575 184 -6635 -13170 -12839 -4559 4003 10450 13960 8842 -479 -7437 -12893 -11913 -4158 4156 10812 13661
$$ packed form
469g218o667m36O501J0794Q934L407l876j0282r483n584j52P214J0967Q107K250
484A4476l837j0054r868l843K95O160J1609Q108Q92l852r807j0799l278K000O182
499e616J1175P934J67m789r893j0391k533L495O418J0195P620o09n319q967j0204
514a1317l165M267P184R753P320q50o227r394r321l120N000Q285R254O199j355
529A2513o541r603q334j727M759Q182R721M318j614n926r840q655o59M987P736
544f83J0489M633l926n992q988r172N55O492O985R385M756m670p075p446q583
559a3240j68P476P116Q714M393m833p793p138p940M8P968P927P776M403n360r165
575A84o819o535L31Q280Q562O447L510n118r321o958n456R80P755Q314O656K849
$$ plain form
591 13661 7954 -1217 -7992 -13310 -11586 -2956 5235 10996 13626 7282 -2340 -8686 -12868 -10946 -1815
606 -1815 5901 11265 12920 6667 -2860 -9072 -12881 -10433 -1419 6542 11493 12697 5939 -3908 -9491
621 -9491 -12687 -10074 -129 7630 11235 12148 5190 -4529 -10062 -12178 -9350 277 8367 11132 11315 4576
637 4576 -5802 -10275 -11610 -8581 1225 8907 10731 11229 4117 -6479 -10959 -11170 -8123 1876 9826
652 9826 10946 9887 3213 -6852 -11062 -10525 -7220 2337 10337 10996 8800 2629 -7546 -11605 -9814
667 -9814 -6299 2699 10805 11588 8294 1744 -7599 -12157 -9655 -4742 3560 10400 11015 7388 847 -8056
683 -8056 -11796 -9737 -4579 4026 10887 10976 6822 -207 -8875 -11757 -8886 -3391 4984 11255 10534 6603
699 6603 -793 -9637 -11642 -8209 -2729 5714 11734 9771 5410 -842 -9677 -12015 -7433 -1800 5928
$$ packed form
591A3661n707r171o775n318J724Q630Q191N761K630o344r622o346m182J922R131
606a815P716N364J655o253r527o212l809K448R014P961M951J204o758r847n583
621i491l196K613R945P759L605R13o958r719n533k116K828R627Q090K765J83o739
637D576j0378m473j335L029R806P682J824M98p112j0596m480k11L047R999P950
652I826J120j059o674j0065m210N37L305R557Q000O59k196o171j0175m059J791
667i814L515Q998Q106P83l294o550r343m558K502M913Q302O840O15l627o541q903
683h056l740K059N158Q605O861Q9m154p029q668k882K871N495Q375O271p21l931
699F603p396q844k005L433N480Q443O020j963m361o252q835k338M582N633P728
$$ plain form
714 5928 12154 9481 4177 -1678 -9551 -11789 -6971 -1235 6174 11952 9770 3142 -2736 -9576 -11907
729 -11907 -6353 267 6401 11758 9466 2456 -3594 -9767 -11232 -6200 930 7562 11741 8872 1635
744 1635 -4465 -9658 -11129 -5457 1844 7789 11481 8511 1225 -5224 -9990 -10318 -4941 2135 8319
759 8319 11301 7907 581 -5858 -10090 -10043 -4042 2803 8311 11161 7353 -374 -6205 -10075 -9738 -3398
775 -3398 3618 8300 10896 7188 -706 -6867 -10166 -9022 -2485 4522 8795 10578 6459 -1612 -7168
790 -7168 -10211 -8991 -1870 5383 8912 9670 5735 -2131 -7883 -9882 -8092 -1619 5799 9136 9620 4973
806 4973 -2557 -7981 -10043 -7487 -696 6445 9425 8805 4557 -3212 -8568 -9638 -7042 -417 6870
821 6870 9465 8660 3753 -3711 -8674 -9322 -6395 342 7252 9783 7842 3065 -3815 -8882 -9470 -5834
$$ packed form
714E928O226k673n304n855p873k238M818N736P409N778k182o628n878o840k331
729a1907N554O620O134N357k292p010o050o173j465N032P130O632M179k869p237
744A635o100n193j471N672P301N945L692k970p286o449m766l28N377P076O184
759H319K982l394p326o439m232M7O001O845N508K850l808p727n831l870L37O340
775c398P016M682K596l708p894o161l299J144O537P007M273J783m119q071n556
790g168l043J220P121P253L529P58l935p866n752j999J790O473P418L337M84m647
806D973p530n424k062K556O791P141K980o20m248p769n356j070K596O625P287
821F870K595q05m907p464m963o48K927O737O910K531j941m777o880n067n88L636
$$ plain form
837 -5834 969 7481 9712 7613 2249 -4739 -8874 -9089 -5443 1342 7963 9847 7083 1503 -5274
852 -5274 -9326 -8302 -4367 1969 8104 9846 6690 566 -5857 -9544 -8202 -3883 2426 8434 9439
867 9439 6335 154 -6296 -9179 -7829 -3270 3421 8468 9192 5698 -458 -6436 -9550 -7245 -2519
882 -2519 3545 8560 9055 5031 -1084 -6944 -9594 -7116 -1405 4187 8551 8888 4365 -1798 -7349 -9323
898 -9323 -6719 -940 4764 8727 8099 4127 -2089 -7617 -9222 -6060 -330 5211 8577 7958 3499 -2628
914 -2628 -7517 -9214 -5748 197 6180 8944 7459 2779 -3351 -7944 -8679 -5323 936 6602 8842
929 8842 7328 1833 -4008 -8181 -8492 -4615 1274 6675 8697 6810 1436 -4406 -8113 -8250 -4267 1873
945 1873 7073 8601 6418 924 -4872 -8129 -8158 -3684 2344 7432 8795 5876 209 -5400 -8402 -7382
$$ packed form
837e834O803O512K231k099n364o988m135k15L646O785O621J884k764n580o777
852e274m052J024L935O336O135J742l156o124o423l687J342M319O309O008J005
867I439l104o181o450k883J350M559O691N047P24l494o156n978l114K305M726
882b519O064N015M95m024o115n860k650K478N711N592M364L37m523o163n551j974
898i323K604N779N704L963o28l972o216n528j605L162N730N541L366o19m459o127
914b628m889j697L466N945N983K764j485m680o130m593p35L356O259N666K240
929H842j514n495n841m173l11L877N889N401K022j887n374n842l707j37L983O140
945A873N200J528k183n494n796l257k9M474O028N088J363k919n667n609l002J020
$$ plain form
961 -7382 -3141 2674 7617 8781 5277 -263 -5491 -8532 -7345 -2438 3388 7590 8432 4921 -968
976 -968 -6066 -8435 -7048 -1994 3950 7674 8017 4424 -1564 -6368 -8084 -6582 -1272 4386 7710 7729
992 7729 4164 -1898 -6895 -8195 -5817 -917 4714 7964 7219 3320 -2405 -7227 -8159 -5407 -257 4964
1008 4964 8150 7024 2690 -2694 -7058 -8188 -4918 495 5279 8148 6749 2085 -3384 -7027 -7955
1023 -7955 -4571 1022 5562 7767 6680 1554 -4139 -7272 -7341 -4156 1322 6293 7671 6113 1369
1038 1369 -4393 -7774 -7451 -3754 1856 6803 7907 5270 822 -4807 -7663 -6904 -3119 2294 6832
1053 6832 8054 4967 189 -4954 -7993 -6598 -2161 2672 6800 7575 4636 -122 -5404 -7888 -6507
1068 -6507 -2139 3396 6979 7480 4151 -803 -5500 -7850 -6087 -1340 3640 7332 7257 3786 -1426 -5948
$$ packed form
961g382M241N815M943J164l504n540n228l041J187M907N826M202Q42l511n889
976i68n098k369J387N054N944L724L43l593n988m804j716J502N310N658L324J9
992G729l565o062m997j300K378M900N631L250p45l899n725m822r32K752N150N221
1008D964L186j126m334n384m364j130L270N413M784K869j399m664n469l643r28
1023g955L384N593M540K205j087n126n693l133o9L185N478M971J378j558m744
1038A369n762l381L23L697N610M947J104k637m448n629k856P59L785N413M538
1053F832J222l087m778n143l039J395M437M833M128P75k939m758n282k484J381
1068f507M368N535L583N01l329m954m697k350J763M747M980L692p5l471n212m522
$$ plain form
1084 -5948 -7611 -5537 -725 4059 7100 6804 3400 -1811 -6020 -7689 -5412 -421 4556 7318 6780
1099 6780 2753 -2493 -6529 -7572 -4968 -5 4652 7097 6284 2113 -2602 -6351 -7190 -4386 320
1114 320 5194 7388 6076 1596 -3228 -6680 -7101 -3960 1012 5436 7551 5599 815 -3666 -6431
1129 -6431 -7062 -3388 1698 5475 7173 5403 666 -4168 -6756 -6629 -3222 2203 5571 6923 5375
1144 5375 49 -4481 -6703 -6539 -2768 2587 6139 6958 5135 -48 -5088 -6893 -5608 -2387 2781
1159 2781 6414 6704 4162 -500 -5218 -7030 -5429 -1659 3401 6176 6388 3863 -1021 -5439 -7006
1174 -7006 -5307 -1003 3938 6440 6458 3421 -1579 -5668 -6858 -4916 -786 4239 6581 5943 2947 -1815
1190 -1815 -5863 -6781 -4621 -312 4779 6804 5708 2934 -2489 -6320 -6368 -4395 -73 5085 6740 5101
$$ packed form
1084e948j663K074M812M784L041k96l404n211m209j669K277M991M977K762n38
1099F780m027n246m036j043K604M963M657K445q13m171m715l749q39K804M706
1114C20M874K194j312m480m824l452m21L141M972M424K115j952m784m481k765
1129f431o31L674N086L777J698j770m737m834k588J27L407N425L368J352j548
1144E375n326m530k222J64L771N355L552Q19j823n183n040j805J285L221N168
1159B781L633K90k542m662m718j812J601L770N060K775K12k525m884m418j567
1174g006J699M304M941K502J8l037n000m089j190J942M130N025K342o38k996m762
1190a815m048r18K160M309N091K025j096k774n423l831m8J973M322N158J655j639
$$ plain form
1206 5101 2063 -2613 -6257 -6297 -3961 -93 5002 7155 4934 1674 -2714 -6515 -6129 -3068 687 5099
1222 5099 6986 4894 888 -3263 -6641 -6060 -2713 1172 5456 6956 4535 345 -3729 -6413 -6154
1237 -6154 -2341 1704 5652 6899 4233 23 -4120 -6630 -5519 -2089 2359 5504 6512 3761 -487
1252 -487 -4489 -6806 -5097 -1575 2448 5759 6486 3686 -750 -4785 -6619 -5019 -1046 2979 6060
1267 6060 6181 3124 -963 -5026 -6509 -4663 -355 2917 5883 6143 2531 -1627 -4870 -6495 -4303
1282 -4303 -93 3647 5974 5861 2260 -1942 -4816 -6428 -4365 263 4029 5693 5535 1995 -2508
1297 -2508 -5138 -6179 -4459 616 4524 5874 5384 1451 -3061 -5350 -5820 -3917 1050 4626 6027
1312 6027 4743 1348 -3462 -5761 -5692 -3204 1567 4900 5936 4490 658 -3536 -5552 -5776 -2812 1592
$$ packed form
1206E101l038m676l644m0K336L868N095K153k221l260m388l801L86L061L755M412
1222E099J887k092m006m151l378N81L347L885M284J500k421m190m074k684K59
1237f154L813M045L948J247k666m210m143k510J111L430M448L145J008k751m248
1252d87m002k317J709L522M023L311P27k800m436m035j834J600L973M025L081
1267F060J21l057m087m063j483J846M308L272K966K60l612m158l243j625K192
1282d303M210L740K327j13l601m202k874j612K063M628L766J664j58l540m503
1297b508k630j041J720N075L908J350m90l933m512k289m70J903M967L576J401
1312F027j284l395m810k299O9K488M771L333J036j446l832m194k016k24K964M404
$$ plain form
1328 1592 5114 5878 4264 400 -3532 -5973 -5283 -2439 2043 4977 5782 3980 84 -4140 -5683 -4922
1344 -4922 -1805 2267 5194 5593 3461 -416 -4346 -6063 -4969 -1589 2597 5552 5302 3336 -757
1359 -757 -4488 -5712 -4439 -1211 2736 5383 5204 2734 -1066 -5006 -6061 -3937 -1002 3053 5612
1374 5612 5065 2496 -1388 -4762 -5603 -3650 -367 3278 5728 4957 2011 -1751 -4823 -5842 -3728 105
1390 105 3676 5640 4526 1587 -2027 -5265 -5459 -3273 512 3941 5590 4620 1292 -2297 -5125 -5480
1406 -5480 -2998 584 4505 5694 4081 902 -2699 -5119 -5114 -2481 1308 4230 5449 4016 518 -3148
1422 -3148 -5428 -4840 -2110 1625 4611 5511 3668 312 -3433 -5306 -4555 -1967 1929 4709 5418 3508
1438 3508 -157 -3556 -5388 -4638 -1321 2043 4824 5270 3288 -367 -3917 -5121 -4479 -1219 2538 4819
$$ packed form
1328A592L522P64j614l864l932k441O90K844M482K934Q05j802l896m224j543P61
1344d922L117M072K927L99k132l877l930j717J094L380M186K955k50j966m093
1359g57l731j224J273L228L947K647j79k470l800l940j055K124K935M055K559
1374E612n47k569l884l374q41J953L283L645K450p71k946l762l072j019K114L833
1390A05L571J964j114k939l614l238j94K186L785L429J649r70l328l589k828l55
1406e480K482L582L921J189j613l179l601k420NK633L789K922J219j433l498l666
1422c148k280N88K730L735K986R00j843l356l745j873P51K588L896K780P09j910
1438C508l665l399j832P50L317L364K781M46j982l655l550j204O42L260L757K281
$$ plain form
1454 4819 5155 2817 -1087 -3782 -5436 -4052 -849 2790 4987 4849 2506 -1086 -4181 -5016 -3835 -623
1470 -623 3131 5218 4806 2032 -1446 -4296 -5306 -3544 -130 3256 5246 4790 1769 -1930 -4584 -5100
1486 -5100 -3349 271 3753 5079 4351 1551 -1999 -4967 -5057 -2877 680 3656 5156 3838 1036 -2319
1502 -2319 -4889 -4810 -2679 1206 3996 5153 3992 694 -2829 -4663 -4491 -2076 1047 4129 5137 3560
1518 3560 603 -2862 -4729 -4377 -1830 1527 4233 5071 3455 -126 -3292 -4873 -4302 -1458 1750 4645
1534 4645 4908 3157 -222 -3270 -4982 -4181 -1343 2146 4317 4527 2685 -458 -3840 -5081 -3869 -929
1550 -929 2384 4698 4433 2604 -780 -3694 -5062 -3740 -726 2731 4700 4325 2333 -1185 -4043 -4798
1566 -4798 -3488 -463 2718 4603 4193 1740 -1658 -4082 -4807 -3057 385 3225 4809 4145 1477 -1584
$$ packed form
1454D819L36k338l904k695j654J384L203L639K197j38k343l592l095q35J181L212
1470f23L754K087m12k774l478k850j010J762L414L386J990m56l021l699k654n16
1486e100J751L620L482J326p28k800l550k968r0K180L557K976J500j318k802l355
1502b319k570P9K131L885K790J157j161l298l523j834J72K415L123L082J008j577
1518C560k957l465j867L52K547L357K706Q38j616l581l166j581N71K844L208K895
1534D645K63j751l379l048j712Q01K838L489K171K10j842l143l382j241J212K940
1550i29L313K314k65j829l384k914j368J322L014L457J969l75j992l518k858p55
1566d798J310L025L181J885m10k453l398k424p25J750L442K840J584o64k668l061
$$ plain form
1582 -1584 -4209 -4670 -3013 339 3337 4881 3885 1250 -2268 -4285 -4436 -2610 774 3485 4587 3653
1598 3653 781 -2707 -4285 -4394 -2330 1108 3657 4673 3546 433 -2717 -4427 -4193 -1868 1220
1613 1220 3959 4661 3094 300 -2779 -4560 -4059 -1450 1351 4010 4591 3075 -154 -3000 -4623 -3891
1629 -3891 -1230 1796 3792 4371 2777 -379 -3219 -4644 -3738 -1086 2099 3829 4228 2293 -834 -3574
1645 -3574 -4547 -3551 -660 2417 4286 4081 2208 -968 -3912 -4720 -3317 -434 2492 4508 4123 1912
1661 1912 -1059 -3664 -4386 -3128 -381 2895 4476 3752 1612 -1464 -3932 -4572 -2955 85 3028 4491
1677 4491 3610 1241 -1477 -3793 -4410 -2663 602 3269 4305 3654 805 -2162 -3696 -3935 -2266 781
1693 781 3457 4430 3306 669 -2223 -3897 -3979 -1934 1155 3477 4320 2984 311 -2401 -4157 -3973
$$ packed form
1582a584k625m61J657L352K998J544r96k635l518k017j51J826L384K711J102r34
1598C653k872l488j578j09K064L438K549J016j127l113l150j710K34K325L088
1613A220K739P02j567k794l079j781N01K609K801K659N81j516l229k846j623P32
1629c891K661L026J996N79j594l156k840j425R06K652L185J730L99j935l127k740
1645c574r73R96K891L077J869k05j873l176k944q08J403K883K926K016l85k211
1661A912k971k605p22J258K747L276J581p24k140l076k468o40J617L040K943J463
1677D491q81k369k718k316o17J747L265K667J036o51k849k967j534k39J669L047
1693G81K676R73j124k637k892j674q2K045L089K322Q43j336k673k712j756J84
$$ plain form
1709 -3973 -1628 1213 3777 4409 2957 288 -2750 -4196 -3562 -1645 1206 3625 4310 2768 -237 -3049
1725 -3049 -4381 -3282 -1195 1528 3871 3926 2272 -420 -2825 -4080 -3361 -821 1654 3829 4134 2093
1741 2093 -703 -3158 -4002 -3204 -672 2056 3917 3902 2073 -919 -3559 -3997 -2943 -154 2260 3914
1757 3914 3662 1901 -1371 -3407 -3981 -2780 -96 2531 4054 3410 1377 -1375 -3870 -3919 -2490 48
1773 48 2653 3851 3203 1263 -1468 -3621 -3923 -2233 529 3027 3995 2942 612 -1649 -3517 -3867
1789 -3867 -1904 563 3183 3918 3049 330 -2141 -3564 -3603 -1969 1128 3253 3683 2934 533 -2468
1805 -2468 -3665 -3555 -1706 1368 3138 3922 2510 -124 -2406 -3807 -3411 -1263 1674 3337 3651 2467
1821 2467 -321 -2923 -3850 -3241 -1070 1688 3542 3776 2102 -568 -2737 -3713 -3136 -679 1985 3668
$$ packed form
1709c973K345K841K564O32j452k669l038j446O34J917K851K419O85j542l005k812
1725c049j332J099K087K723K343N5j654k692k405j255P19K540K475K175L05k041
1741B093k796k455q44P98K532K728J861j5j829k992k640m38J054K789K414J654
1757C914k52j761l272k036n74J201K684K627J523o44k033k752k495m9J429K538
1773D8K605J198o48j940k731k153l02J690K762K498R68j053k330k261j868l50
1789c867J963K467K620P35q69k719k471j423l9J634L097K125M30p49k401l001
1805b468j197J10J849L074J770P84j412k634k282j401L96K148K937J663L14j184
1821B467k788k602r27O09K171K758J854K34j674k670k169r76N77K457K664J683
$$ plain form
1837 3668 3747 1857 -775 -2971 -3975 -2660 -727 2245 3534 3482 1901 -1084 -2970 -3672 -2899 -339
1853 -339 2459 3783 3375 1494 -1109 -3565 -3624 -2432 -176 2624 3344 2992 1323 -1353 -3417 -3414 -2268
1870 -2268 69 2711 3761 2866 1087 -1617 -3732 -3656 -2065 230 2829 3692 2712 687 -1855 -3391
1886 -3391 -3193 -1755 500 2821 3477 2568 427 -1787 -3387 -3277 -1517 1063 3091 3874 2560 -48
1902 -48 -2048 -3696 -3157 -1230 1186 3168 3448 2079 45 -2543 -3558 -3079 -1021 1430 3087 3267
1918 3267 1899 -255 -2279 -3590 -2897 -867 1303 3078 3310 1764 -461 -2573 -3787 -2588 -615
1933 -615 1721 3474 3001 1419 -635 -2643 -3444 -2669 -550 1894 3423 3280 1372 -1073 -2702 -3303
1949 -3303 -2606 -236 2179 3306 3274 1165 -1207 -2951 -3374 -2370 91 2294 3597 2985 1110 -1280
$$ packed form
1837C668P9j890k632k196j004J315J933K972J289n2j581k985j886p02P73K560
1853c39K798J324m08j881k603k456n9J192K256K800P20l52j669k676k064LJ146
1870b268K337K642J050q95j779k704k115P6J591K295K599Q63r80k025k542j536
1886c391J98J438K255K321O56r09k141k214j600J10J760K580K028P83j314k608
1902d8k000j648N39J927K416J982K80j369k034k588j015M79K058K451J657J80
1918C267j368k154k024j311O93K030K170J775K32j546k225k112j214J199J973
1933f15K336J753m73j582k054k008q01P75K119K444J529j43j908k445j629o01
1949c303O97K370K415J127l2k109k372j744m23J004K461K203J303o12j875k390
$$ plain form
1965 -1280 -2846 -3163 -1960 242 2578 3357 2709 754 -1557 -3214 -3026 -1642 645 2655 3216 2558
1981 2558 518 -1961 -3330 -2901 -1545 725 2613 3445 2419 340 -2088 -3230 -3056 -1219 773 2756
1997 2756 3297 2252 86 -1850 -3197 -2784 -1236 1350 2762 3116 1964 -68 -2202 -2971 -2695 -863
2013 -863 1259 2786 3223 1906 -325 -2385 -3302 -2585 -451 1428 2937 2822 1518 -475 -2522 -3355
2029 -3355 -2675 -555 1849 3190 2792 1600 -581 -2414 -3083 -2480 -147 1867 3089 3007 1493 -950
2045 -950 -2700 -3012 -2013 -36 2194 3007 2722 1124 -1245 -2961 -3122 -2061 114 2118 3177 2529 896
2062 896 -1137 -2982 -2995 -2019 307 2196 3033 2408 239 -1224 -2792 -2830 -1492 409 2395 3236 2419
2079 2419 344 -1621 -2873 -2847 -1252 833 2611 3307 2212 284 -1834 -3002 -2665 -1368 922 2684
$$ packed form
1965a280j566l17J203K202K336P79o48j955k311j657J88J384K287K010N61o58
1981B558k040k479j369M29J356K270J888Q32j026k079k428j142J74J837J992J983
1997B756N41j045k166j936j347M13J548K586J412L54j152k032k134p69K76J832
2013h63K122J527M37j317k231k060r17P17K134J879J509j15j304j993k047q33
2029c355O80K120K404J341l98j192k181j833o69O03K333K014J222q2j514k443
2045i50j750l12R99J977K230Q13k85j598k369j716j61J061K175K004J059o48j633
2062H96k033j845j3R76K326J889Q37o25k169j463j568l8J338J901J986Q41q17
2079B419k075j965j252K6J595K085J778O96j095j928k118j168L37J297K290J762
$$ plain form
2095 2684 2972 1865 -18 -2017 -2884 -2532 -953 1197 2702 2918 2002 -193 -2201 -3009 -2421 -828 1393
2112 1393 2804 3000 1922 -500 -2125 -2901 -2431 -617 1340 2857 2842 1399 -869 -2294 -3020 -2043 -537
2129 -537 1589 2664 2738 1252 -723 -2313 -3027 -2118 -72 1807 2927 2745 992 -1029 -2486 -2877 -1761
2146 -1761 -129 1599 2973 2463 900 -1071 -2657 -2772 -1721 277 1897 2841 2647 731 -1000 -2911
$$ packed form
2095B684K88j107j883j999q67L52J579K150J505K16r16k195k008q08N88J593K221
2112A393J411J96j078k422j625p76M70J814J957J517j5j443k268j425p26R77J506
2129e37K126J075P4j486j975j590p14R09K046J879J120j82j753k021j457l91J116
2146a761J632J728J374n10j563j971j586j15J051J998J620R44j94j916j731j911
$$ [...]
8191e1
##END NTUPLES=NMR FID
##END=
