##TITLE=1H_DE-20HM
 D2O
 8 sc, 
 24.10.2023
##JCAMPDX= 6.0         $$ Bruker NMR JCAMP-DX V2.0
##DATA TYPE= NMR FID
##DATA CLASS= NTUPLES
##ORIGIN= UXNMR, Bruker Analytische Messtechnik GmbH
##OWNER= root
$$ XWIN-NMR		Version 3.5
$$ Tue Oct 24 16:38:17 2023 Russian Standard Time (UT+4h)  she@DPX200
##.OBSERVE FREQUENCY= 200.13135
##.OBSERVE NUCLEUS= ^1H
##.DELAY= (6, 6)
##.ACQUISITION MODE= SIMULTANEOUS
##.ACQUISITION SCHEME= undefined
##.AVERAGES= 8
##.DIGITISER RES= 18
##SPECTROMETER/DATA SYSTEM= spect
##.PULSE SEQUENCE= zg30
##.SOLVENT NAME= D2O
##.SHIFT REFERENCE= (INTERNAL, D2O, 0, 15.7039)
##AUDIT TRAIL= $$ (NUMBER, WHEN, WHO, WHERE, WHAT)
$$ ##TITLE= Audit trail, XWIN-NMR		Version 3.5
$$ ##JCAMPDX= 5.01
$$ ##ORIGIN= Bruker BioSpin GmbH
$$ ##OWNER= she
$$ F:/spectra/data/she/nmr/H-F/1/audita.txt
$$ ##AUDIT TRAIL=  $$ (NUMBER, WHEN, WHO, WHERE, WHAT)
(   1,<2023-10-24 16:37:20.50 +0400>,<she>,<DPX200>,
      <created by zg, POWCHK disabled, PULCHK disabled
       configuration hash MD5:
       00 E9 B6 7A A2 85 ED C7 34 08 36 98 17 FE 4E 26
       data hash MD5: 16K
       22 AB B7 E6 EC 08 2A A7 21 80 D3 7D CB 81 99 51>)
$$ ##END=
$$ 
$$ hash MD5
$$ 6A 78 3A 75 AE DB B1 BE CB 81 99 8F B8 C7 6A B8
##$RELAX= 
##$RELAX= 
##$RELAX= 
##$RELAX= 
##$RELAX= 
##$RELAX= 
$$ Bruker specific parameters
$$ --------------------------
##$DU= <F:/spectra>
##$EXPNO= 1
##$NAME= <H-F>
##$PROCNO= 1
##$TYPE= <nmr>
##$USER= <she>
##$AMP= (0..31)
100 100 100 100 100 100 100 100 100 100 100 100 100 100 100 100 100 100 
100 100 100 100 100 100 100 100 100 100 100 100 100 100 
##$AQSEQ= 0
##$AQ_mod= 1
##$AUNM= <au_zg>
##$AUTOPOS= <>
##$BF1= 200.13
##$BF2= 200.13
##$BF3= 200.13
##$BF4= 200.13
##$BF5= 200.13
##$BF6= 200.13
##$BF7= 200.13
##$BF8= 200.13
##$BYTORDA= 1
##$CFDGTYP= 0
##$CFRGTYP= 5
##$CHEMSTR= <none>
##$CNST= (0..31)
1 1 145 1 1 1 1 1 1 1 1 1 1 1 1 1 1 1 1 1 1 1 1 1 1 1 1 1 1 1 1 1 
##$CPDPRG= <>
##$CPDPRG1= <>
##$CPDPRG2= <>
##$CPDPRG3= <>
##$CPDPRG4= <mlev>
##$CPDPRG5= <mlev>
##$CPDPRG6= <mlev>
##$CPDPRG7= <mlev>
##$CPDPRG8= <mlev>
##$CPDPRGB= <>
##$CPDPRGT= <>
##$D= (0..31)
0 1.2 0 0 0 0 0 0 0 0.06 0 0.03 0 0 0 0 0.0002 0 0 0 0 0 0 0 0 0 0 0 0 
0 0 0 
##$DATE= 1698151039
##$DBL= (0..7)
120 120 120 120 120 120 120 120 
##$DBP= (0..7)
150 150 150 150 150 150 150 150 
##$DBP07= 0
##$DBPNAM0= <>
##$DBPNAM1= <>
##$DBPNAM2= <>
##$DBPNAM3= <>
##$DBPNAM4= <>
##$DBPNAM5= <>
##$DBPNAM6= <>
##$DBPNAM7= <>
##$DBPOAL= (0..7)
0.5 0.5 0.5 0.5 0.5 0.5 0.5 0.5 
##$DBPOFFS= (0..7)
0 0 0 0 0 0 0 0 
##$DE= 6
##$DECBNUC= <off>
##$DECIM= 32
##$DECNUC= <off>
##$DECSTAT= 4
##$DIGMOD= 1
##$DIGTYP= 9
##$DL= (0..7)
0 120 120 120 120 120 120 120 
##$DP= (0..7)
150 150 150 150 150 150 150 150 
##$DP07= 0
##$DPNAME0= <>
##$DPNAME1= <>
##$DPNAME2= <>
##$DPNAME3= <>
##$DPNAME4= <>
##$DPNAME5= <>
##$DPNAME6= <>
##$DPNAME7= <>
##$DPOAL= (0..7)
0.5 0.5 0.5 0.5 0.5 0.5 0.5 0.5 
##$DPOFFS= (0..7)
0 0 0 0 0 0 0 0 
##$DQDMODE= 0
##$DR= 18
##$DS= 0
##$DSLIST= <SSSSSSSSSSSSSSS>
##$DSPFIRM= 0
$$ [...]
##$SUBNAM2= <"">
##$SUBNAM3= <"">
##$SUBNAM4= <"">
##$SUBNAM5= <"">
##$SUBNAM6= <"">
##$SUBNAM7= <"">
##$SUBNAM8= <"">
##$SUBNAM9= <"">
##$SW= 18.05172834244
##$SWIBOX= (0..15)
0 0 2 0 0 0 0 0 0 0 0 0 0 0 0 0 
##$SW_h= 3612.71676300578
##$TD= 16384
##$TD0= 1
##$TE= 0
##$TE2= 300
##$TE3= 300
##$TEG= 300
##$TL= (0..7)
0 120 120 120 120 120 120 120 
##$TP= (0..7)
150 150 150 150 150 150 150 150 
##$TP07= 0
##$TPNAME0= <>
##$TPNAME1= <>
##$TPNAME2= <>
##$TPNAME3= <>
##$TPNAME4= <>
##$TPNAME5= <>
##$TPNAME6= <>
##$TPNAME7= <>
##$TPOAL= (0..7)
0.5 0.5 0.5 0.5 0.5 0.5 0.5 0.5 
##$TPOFFS= (0..7)
0 0 0 0 0 0 0 0 
##$TUNHIN= 0
##$TUNHOUT= 0
##$TUNXOUT= 0
##$USERA1= <user>
##$USERA2= <user>
##$USERA3= <user>
##$USERA4= <user>
##$USERA5= <user>
##$V9= 5
##$VALIST= <valist>
##$VCLIST= <CCCCCCCCCCCCCCC>
##$VD= 0
##$VDLIST= <DDDDDDDDDDDDDDD>
##$VPLIST= <PPPPPPPPPPPPPPP>
##$VTLIST= <TTTTTTTTTTTTTTT>
##$WBST= 1024
##$WBSW= 4
##$XGAIN= (0..3)
0 0 0 0 
##$XL= 0
##$YL= 0
##$YMAX_a= 23750
##$YMIN_a= -20735
##$ZGOPTNS= <>
##$ZL1= 120
##$ZL2= 120
##$ZL3= 120
##$ZL4= 120
##$ABSF1= 10
##$ABSF2= 0
##$ABSG= 5
##$ABSL= 3
##$ALPHA= 0
##$AQORDER= 0
##$ASSFAC= 0
##$ASSFACI= 0
##$ASSFACX= 0
##$ASSWID= 0
##$AUNMP= <proc_1d>
##$AZFE= 0.1
##$AZFW= 0.1
##$BCFW= 1
##$BC_mod= 2
##$BYTORDP= 1
##$COROFFS= 0
##$CY= 11.3945322036743
##$DATMOD= 1
##$DC= 2
##$DFILT= <>
##$DTYPP= 0
##$F1P= 15.7292609196834
##$F2P= 12.9074282941183
##$FCOR= 0.5
##$FTSIZE= 0
##$FT_mod= 4
##$GAMMA= 1
##$GB= 0.15
##$INTBC= 1
##$INTSCL= 1
##$ISEN= 128
##$LB= 0.24
##$LEV0= 0
##$LPBIN= 0
##$MAXI= 10000
##$MC2= 0
##$MEAN= 0
##$ME_mod= 0
##$MI= 1.114404
##$NCOEF= 0
##$NC_proc= 0
##$NLEV= 6
##$NOISF1= 3.799351
##$NOISF2= 2.8
##$NSP= 1
##$NTH_PI= 0
##$NZP= 0
##$OFFSET= 15.70392
##$PC= 1
##$PHC0= -23307.25
##$PHC1= 5.452701
##$PH_mod= 1
##$PKNL= yes
##$PPARMOD= 0
##$PSCAL= 0
##$PSIGN= 0
##$REVERSE= no
##$SF= 200.130013532006
##$SI= 16384
##$SIGF1= 3
##$SIGF2= 2
##$SINO= 400
##$SIOLD= 16384
##$SREGLST= <1H.CDCl3>
##$SSB= 0
##$STSI= 0
##$STSR= 0
##$SW_p= 3612.71676300578
##$SYMM= 0
##$S_DEV= 0
##$TDeff= 0
##$TDoff= 0
##$TI= <>
##$TILT= no
##$TM1= 0
##$TM2= 0
##$TOPLEV= 0
##$USERP1= <user>
##$USERP2= <user>
##$USERP3= <user>
##$USERP4= <user>
##$USERP5= <user>
##$WDW= 1
##$XDIM= 8192
##$YMAX_p= 0
##$YMIN_p= 0
$$ End of Bruker specific parameters
$$ ---------------------------------
##NTUPLES= NMR FID
##VAR_NAME=  TIME,          FID/REAL,        FID/IMAG
##SYMBOL=    X,             R,               I
##VAR_TYPE=  INDEPENDENT,   DEPENDENT,       DEPENDENT
##VAR_FORM=  AFFN,          ASDF,            ASDF
##VAR_DIM=   8192,          8192,            8192
##UNITS=     SECONDS,       ARBITRARY UNITS, ARBITRARY UNITS
##FACTOR=    0.0002768,     1,               1
##FIRST=     0,             0,               0
##LAST=      2.2672688,     0,               0
##MIN=       0,             -20735,          0
##MAX=       2.2672688,     23750,           0
$$ Real data points
##PAGE= N=1
##DATA TABLE= (X++(R..R)), XYDATA
0@%%%%%%%%%%%%%%%%%%%%%%%%%%%%%%%%JmJ0j5J6j6J6j6J6j6J8k4L0l2L2l4L9
$$ 0 0 0 0 0 0 0 0 0 0 0 0 0 0 0 0 0 0 0 0 0 0 0 0 0 0 0 0 0 0 0 0 0 1 -3 7 -8 8 -8 8 -8 8 -8 10 -14 16 -16 16 -18 21
49B1m4M9n4N9o5P0p7Q6r4J05j18J30j44J60j79K01k24K43k34Q5J262K2512j0256
$$ 21 -23 26 -28 31 -34 36 -41 45 -49 56 -62 68 -76 84 -95 106 -118 125 -109 -24 1238 23750 13494
72A3494p620P739k1546j0140J3757m332j318K1478L590p113K053j0949j5353L071
$$ 13494 5874 13613 -7933 -18073 -4316 -8648 -9966 11512 15102 7989 10042 -907 -16260 -13189
86a3189M721N441J3310L872n020k588q690j0564j028M164Q425J1375M084k828
$$ -13189 -8468 -3027 10283 14155 9135 6547 -2143 -12707 -13735 -9571 -1146 10229 14313 11485
100A1485p334j1347n557K077M027Q399O890P77J064m643j2109m308k41n5J2554
$$ 11485 4151 -7196 -12753 -10676 -6649 1750 8640 9417 10481 5838 -6271 -10579 -10820 -10875 1679
115A679J1505l295o33l301j6123k994P671k521O865J5012l149m946M27j4028q392
$$ 1679 13184 9889 9256 5955 -10168 -13162 -5491 -8012 -1147 13865 10716 5770 6197 -7831 -16223
130a6223J0332K416K217J3405j34q531M4p911j0319O099O129K214J0555L362q214
$$ -16223 -5891 -3475 -1258 12147 12013 3482 3526 -4385 -14704 -8605 -2476 -262 10293 13655 5441
145E441m956o745p373M888P767M148O517Q25o161m008n811o277L034O272N629
$$ 5441 485 -6260 -13633 -8745 -978 3170 9687 10512 4351 343 -5468 -11745 -8711 -2439 3190
160C190P444M91o981n408n900m071M331N679M672O293K10n915m926o724m135N052
$$ 3190 10634 11125 4144 -1264 -7164 -11235 -6904 -1225 3447 9740 9950 4035 -891 -7615 -11750 -6698
176f698O399M846N783j327o795l930n029m037M762O021M104N991m41p615m771
$$ -6698 -299 4547 10330 9003 2208 -1722 -6751 -10788 -6026 -5 4099 10090 9649 2034 -2737
191b737m616l464N407O853L441M446p56p372m368l457l464M442P188L866M041
$$ -2737 -7353 -10817 -5410 1443 4884 9330 8574 1202 -3166 -6623 -10087 -5645 1543 5409 9450
206I450r50p882n032k538k159M385O885L331L123n48p174n736k549j654M688P427
$$ 9450 8500 618 -4414 -6952 -9111 -4726 2159 5490 8613 8065 891 -4845 -7394 -9048 -4360 3067
222C067L257J748j012o853n393j849j081L921P283L597J186j148o446o110j895
$$ 3067 6324 8072 7060 207 -5186 -7035 -8116 -4195 3088 6685 7871 6723 277 -5833 -7728
237g728L01M203O676L627M66j970n791n502j988O13M415O389L441N22k604o042
$$ -7728 -7427 -3224 3452 7079 7545 5575 -216 -5718 -7706 -7093 -2678 3711 7152 7674 5070 -972
253i72n071j525J092M514N867L192K82k737o070m943j177J371M649O012K829l71
$$ -972 -6043 -7568 -6476 -1962 3905 7097 7379 4642 -1428 -6371 -7548 -6177 -1528 4484 7313 6942
269F942k966n851m629q25J758M527N766K629o45l294n713m406m76K085M599N520
$$ 6942 3976 -1875 -6504 -7329 -5571 -1044 4722 7351 6706 3412 -2301 -6707 -7183 -5098 -499 5021
285E021K373j160l368n435m306k45K576M525N295K176j631l636n016m033j55L000
$$ 5021 7394 6234 2866 -2569 -6875 -7120 -4544 -19 5276 7452 5821 2185 -2831 -6864 -7019 -4019
301d019M600M718K034j702l951m959l589N6L235M728M406J590j817m128m881l260
$$ -4019 581 5299 7333 5631 1680 -3279 -6868 -6812 -3577 1151 5557 7147 5330 1202 -3679 -6939
317f939M39L417M690M075J304k061m182m696k974N57L824M677L613J028k233m377
$$ -6939 -6500 -3083 1607 5682 6986 4925 743 -3953 -6927 -6370 -2546 2131 5744 6772 4539 162
333A62m328k586O80L789M786L588N31k545m451m211k079J104L722M605L272M06
$$ 162 -4166 -6752 -6072 -2283 2503 6091 6622 4077 -374 -4585 -6664 -5560 -1838 2767 6039 6445
349F445k703m512m057j784J306L963M654K858K0k980m516l694j272J256L852M766
$$ 6445 3742 -770 -4827 -6611 -5305 -1342 3312 6170 6190 3210 -1306 -5000 -6272 -5016 -1164 3602
365C602K835n28l111m491l615r24J917L702M409K548o90l234m360l546q23K220
$$ 3602 6437 5909 2798 -1693 -5308 -6232 -4315 -613 3796 6344 5654 2420 -1940 -5486 -6309 -4089
381d089L995M169K273r65l585m130l193n00K421L957L665K214r52l807m244k879
$$ -4089 -94 4075 6348 5383 1798 -2332 -5525 -6025 -3604 353 4018 6232 5280 1473 -2771 -5650
397e650l91K825M396L159J499p66l908m427k232j94K468M601L498Q00j108l618
$$ -5650 -6041 -3216 1180 4339 5838 5072 1164 -3263 -5495 -5689 -3221 1380 4878 5678 4570 952
413I52m674k072Q12K333L925L727P63j735l304m380k602J115L287L720L224O94
$$ 952 -3722 -5794 -4982 -2649 1276 5003 5766 4031 727 -3653 -6255 -5140 -1853 1867 5091 5785
429E785k386l470l332k442O34L606L821K779R34k426m249l260j669P59L803L971
$$ 5785 3399 -71 -3403 -5845 -5211 -1605 2216 4995 5929 3503 -746 -4006 -5675 -4916 -1113 2858
445B858J953M49j845m268l415j187N29L745M816J755o47j896m127l469j67J017
$$ 2858 4811 5260 3415 -853 -4268 -5455 -4926 -1181 3635 5390 4743 2847 -1280 -4749 -4916 -3899
461c899K521M655K398j160j882l622m191n44K345K901L929K445j497k890k891
$$ -3899 -1378 3277 5675 4515 2633 -989 -5180 -5724 -3379 -478 3451 5896 4399 1509 -1382
476a382l241r67K319L187L320K525q12l690l615k354n16K172L738K976J324m91
$$ -1382 -4623 -5590 -3271 -84 3236 5761 4949 1259 -2356 -4710 -5226 -3054 684 3660 4984 4493
492D493l052l915k356j52J586L999L964Q40j416l006m335j900J384J604K612L863
$$ 4493 1441 -2474 -4830 -4982 -3396 603 4567 5407 3991 985 -3350 -5250 -3866 -2262 350 4213
508D213R80j745k139l939l358J274L061K752L555R31k931k564k540k913Q16L214
$$ 4213 5193 3448 1309 -2630 -5988 -4714 -1653 1099 4654 5585 2654 90 -2450 -5363 -4547 -1333
524a333K261L218K002k985l841k466k385R48M273K517J419J181j809l603k240
$$ -1333 928 4146 6148 3163 -678 -3144 -5529 -4581 -308 2209 3628 4809 3000 -603 -2843
539b843j890k92L681M177J893K30k163m150k836l22J247K463L199K023j12j796
$$ -2843 -4733 -5025 -1344 2833 4726 4956 2793 -1357 -4193 -4515 -3268 -805 2394 4417 4305 2509
555B509k998l634j542K198L306L008K201q28l141k193k192j801J820L209K285
$$ 2509 -489 -4123 -5665 -3467 -161 2847 5048 4220 1079 -1114 -3306 -5107 -3287 -78 2207
570B207K800L05m146l346j633j537K307M502J495Q61N90l320l278r35j575P90
$$ 2207 5007 5312 1166 -2180 -3813 -5350 -3043 1459 2954 3815 4405 1085 -2193 -3128 -4703 -3913
586c913M803K799O71J57l513m359n77J49Q17M026K602Q3J07k303m504j610N27
$$ -3913 890 3689 4360 4517 1004 -3355 -3932 -3783 -2966 1060 3662 3745 3852 1549 -2955 -4565 -4038
603d038J411L876L298l58j473k201l186j589P29J465K695L169J122j587l199l200
$$ -4038 -2627 1249 4547 4189 2716 515 -2671 -4260 -3531 -2066 629 3798 4920 3333 134 -3066
619c066j776P46L102L183J388M06j077l276k479q66m60K335M241J669J04j109
$$ -3066 -4842 -4096 -994 2189 3577 3983 2906 -370 -2849 -3715 -4175 -1840 2401 4070 4174 3065
635C065m031l055L40M65J801L951J378o50l01l269l973J14J080J613M424J867
$$ 3065 -966 -4021 -3681 -3216 -1415 2536 3914 3264 2963 -306 -4279 -4165 -3085 -1472 2952 4819
651D819j829j105k428l570J91J686J041L411K707j522j822k114l677m54K650J816
$$ 4819 2990 1885 -543 -4113 -3922 -2236 -1195 2216 4923 3401 1579 -535 -4212 -4666 -2016 -200
667b00K538K441j341k683j801k522r40K204K680K080J894o25k895k681j776m15
$$ -200 2338 4779 3438 755 -1046 -3568 -4508 -2304 376 2456 4350 3725 830 -1851 -3627 -4042
683d042J709L001K379Q61p02k158l068j973L21J439K780L037O04j514j955k915
$$ -4042 -2333 668 3047 3908 3206 1048 -2020 -3993 -3672 -2233 547 3584 4188 2674 719 -2196
699b196k092J013J934J784K842R45j882j694k482k866R93K859J834K397J045k599
$$ -2196 -4288 -3275 -1341 443 3285 4230 2348 654 -1828 -4694 -3701 -842 992 3389 4434 1835
715A835k218j387k306M16K977J810J940J521k287l227j349j605J97L320K313R36
$$ 1835 -383 -1770 -4076 -3660 -683 1127 3067 4588 2301 -926 -2275 -3880 -3683 -363 1950 2886
731B886J036j551l326j677q93l0K835L086J096N1j539l010j999m41O10K191K884
$$ 2886 3922 2371 -955 -2632 -3525 -3555 -720 2366 3462 3513 1974 -1036 -3035 -3476 -2866 -675 2209
748B209J444k51j727k695k140n42J180K386K406J356l08k098k393j804q53J378
$$ 2209 3653 3402 1675 -1020 -3160 -3702 -2522 -136 2270 3626 3318 1220 -1173 -2977 -3830 -2452
764b452K698K049J326j75k568k624j205n88J180K876J853J029k7k480k961j114
$$ -2452 246 2295 3621 3446 878 -1746 -2951 -3539 -2359 517 2370 3399 3372 892 -2069 -3183
780c183k09J215K983J960M09j54k120l052j173J96J103K879K168K10n32k006k972
$$ -3183 -3392 -2177 806 2766 3175 3021 901 -2151 -3324 -3128 -2025 854 3022 3232 2700 694 -2278
797b278j149N11J311K458K276K57j045j983k615j270N68J758K375J858K81j152
$$ -2278 -3427 -2916 -1605 853 3129 3386 2341 358 -2257 -3527 -2959 -1201 1174 3032 3313 2161
813B161k098k431j057N81J731K548J754Jj207k227k328q28P40J857K384J696k27
$$ 2161 63 -2368 -3425 -2844 -1113 1435 3189 3190 1983 -244 -2572 -3400 -2660 -803 1581 3277 3050
830C050j305k095k215r04R17K021K349J512l42j526k134j965o34Q69J982K384
$$ 3050 1745 -350 -2565 -3469 -2552 -531 1818 3330 2988 1462 -672 -2637 -3271 -2402 -420 1964
846A964J423m66j623k226j896l60J039J947K296J237n57j733k083j781m65J349
$$ 1964 3387 2921 1298 -928 -2824 -3184 -2145 -198 2098 3335 2778 1045 -1038 -2819 -3284 -1935
862a935K050K037J134n32j924k138j547k28J286K058K011R92p33j906k123j466
$$ -1935 115 2152 3286 2754 830 -1308 -2855 -3083 -1797 261 2272 3264 2531 625 -1498 -2964
878b964mJ387K049J930Q35q42j922k095j360J35J526J978J792P13q77k031k113
$$ -2964 -2968 -1581 468 2398 3233 2391 469 -1626 -2986 -2851 -1325 653 2445 3158 2281 250 -1863
895a863j221K73J691K024J723M70j088j989j961j118M23J728J936J594M90j178
$$ -1863 -3084 -2811 -1120 904 2627 3097 2009 20 -1941 -3059 -2636 -908 1028 2622 3112 1934
911A934k212j786j043M86J962K084J144K66j068k172j734p87L55J909K324J172
$$ 1934 -278 -2064 -3107 -2621 -659 1425 2569 2835 1767 -405 -2139 -2926 -2571 -662 1662 2834
927B834r3j209k160j808l78O86J616K177J087j78j082k046k055m26J074J666K087
$$ 2834 2741 1532 -628 -2436 -2814 -2128 -512 1665 2752 2574 1492 -554 -2609 -3035 -1961 -295 1792
944A792J235p08j433j539j769n49J198J633J751J485m36j945j792j329n93J438
$$ 1792 3027 2319 886 -653 -2422 -2971 -1773 -140 1611 3096 2660 715 -1077 -2406 -2999 -1561
960a561K129J215Q65p8j936j906r23o27R42K417J677M24k54j799k360p64K56P21
$$ -1561 568 1783 2648 2570 634 -1272 -2195 -2822 -1880 537 2214 2638 2384 585 -1775 -2539 -2283 -1562
978a562K040J900J42n18j281k355j233M73J110J784K125K17j364j205j806j309
$$ -1562 478 2378 2520 2002 721 -1634 -2867 -2394 -1284 500 2625 2842 1478 273 -1533 -2842
994b842O23J401J273J804P91j421j687j556j404N54K102J493R32O53j211k005
$$ -2842 -2219 -818 455 2259 3050 1629 -58 -1614 -3018 -2464 -362 1131 2063 2716 1505 -500
1010e00r73r52j84J951K028Q88N19r90k608j492M3J89J507K270O07k29m28k018
$$ -500 -1473 -2425 -2609 -658 1370 2258 2777 1787 -821 -2313 -2270 -2081 -574 1696 2303 2074 1646 -372
1028c72k036j36P12J200K344J287j051j083j329j905j29J184R10J549J693m23
$$ -372 -2408 -2544 -1832 -632 1712 2999 1948 865 -464 -2369 -2498 -1314 -404 1145 2838 2415
1044B415j596j325j869o99J714J813J118J018m32j847j165r18q81R68J974J335
$$ 2415 819 -506 -2375 -3074 -1360 453 1571 2589 2157 310 -855 -1773 -2654 -1686 288 1623
1060A623R54p5k023k089o95j4J016J997J164P2K7j163k084j097J0P70K159J969
$$ 1623 2577 2502 479 -1610 -2305 -2319 -1303 694 1858 1930 1957 794 -1290 -2387 -2377 -1607 552 2521
1078B521k6j038j242j822q01P55Q07J024J754O33r14j279j754j584O86J869J413
$$ 2521 2495 1457 215 -1607 -2408 -1653 -846 178 1932 2565 1651 372 -1382 -2966 -2280 -411 1002
1095A002J118L63j340j429q20j196LJ671J602J041O99j195k177j148m36K61J675
$$ 1002 2120 2483 1143 -286 -1106 -2302 -2299 -628 974 2015 2714 1519 -658 -1806 -2242 -1981 -306
1112c06J587N02K79n27j905j447m98J78J609K171P36l33r92j822j213LM20J181
$$ -306 1281 1783 2062 1535 -370 -1817 -2315 -2137 -528 1643 2379 2046 1054 -768 -1981 -1978 -1558 -377
1130c77J660R60k55q37j649j700k78J002J437J569R09n83j331j230j115m77Q62
$$ -377 1283 2243 1988 1151 -498 -2198 -2476 -1474 -37 1532 2441 1858 527 -703 -1818 -2295 -1433
1147a433J492J372R38j35j757j682q17j83R06J884J021L01o8j222j805o85j35
$$ -1433 59 1431 2369 2234 477 -1205 -2022 -2205 -1299 585 1606 1907 1839 617 -1188 -1873 -2008
1164b008M65J891J706J15l69j370j932p79N80P79J308J510J48n34j045j721j127
$$ -2008 -1543 348 2054 2169 1800 430 -1502 -2281 -1701 -922 386 1896 2044 1510 465 -1256 -2383
1181b383N02J029J418J489J76j016j182j384q33L61J148J320J208M01r54j464
$$ -2383 -1881 -852 566 2055 2231 1215 33 -1351 -2184 -1823 -675 645 1853 2254 1300 -164
1197a64j395o89M26J505J349P75J37p57j429j287n78K78J194J835R63l47p33j409
$$ -164 -1559 -2248 -1822 -317 1032 1807 1944 1187 -242 -1529 -2107 -1829 -635 1200 2163 1816 1083 -326
1215c26j552j50O25R37J537J142m34r03j113j616m82J121J084J262J157m51j307
$$ -326 -1878 -2028 -1403 -466 1071 2213 1779 876 -237 -1853 -2335 -1214 -130 1132 2289 1838 531
1232E31j035j097o38R33J378J109R98j91j537j337q09m06Q18J592J059N88j89
$$ 531 -504 -1601 -2239 -1306 72 1181 2179 1988 451 -886 -1695 -2101 -1283 309 1368 1956 1767
1249A767j286j429q09j79P69J412J323M31l90j173j467r40J58Q34J303J331M25
$$ 1767 481 -948 -1757 -1936 -1167 245 1568 1999 1609 436 -1031 -1971 -1813 -979 324 1655 2080
1266B080o49j200j258r98J88J167J118J064O16p89j330j101q12m4J324J306P92
$$ 2080 1431 231 -1027 -2025 -1837 -670 448 1512 2128 1339 9 -1092 -1904 -1948 -624 682 1474
1283A474N93o70j657r97n81k6J374J449N65K98m97j572j196l34P2J193J582O95
$$ 1474 2067 1397 -260 -1257 -1838 -1864 -490 959 1524 1822 1325 -247 -1443 -1777 -1705 -512 1070 1765
1301A765m4n86j389j260k90L40J029J463Q09j37p78j263j231l56N96J154J248
$$ 1765 1721 1135 -254 -1514 -1804 -1464 -435 1028 1837 1700 922 -341 -1572 -1928 -1332 -178 1070
1318A070P32j09r33j260j001m06N54J315J221N87j21r96j355q38k05M82J269J303
$$ 1070 1802 1693 760 -500 -1501 -1907 -1353 -38 1183 1770 1649 653 -702 -1540 -1745 -1263 6 1309
1336A309M36k06r90j391q22q5O46J240J250L99l02r84j369q52O3O75J250J219
$$ 1309 1745 1539 549 -842 -1664 -1749 -1103 137 1387 1786 1484 500 -869 -1721 -1658 -983 267 1486
1354A486K98m87r31j370p16R8P48J206J171K81n32j041j244p72K37Q31J181J054
$$ 1486 1784 1297 366 -1004 -1720 -1622 -874 332 1503 1784 1252 211 -1033 -1805 -1568 -737 444 1498
1372A498K51o43j025j180o82K82R17J182J002J33o95j058j066o86L44R59J168
$$ 1498 1749 1106 81 -1099 -1781 -1499 -582 600 1602 1735 1040 -18 -1084 -1770 -1426 -467 701
1389G01Q88J23p79j169j015n08L97R73J221P72J03q09j160j070l93M35J016J232
$$ 701 1589 1712 933 -236 -1251 -1759 -1362 -389 832 1604 1707 898 -262 -1332 -1725 -1290 -274 958
1407I58O27n5p53j096j039l46N19R90J162P59j94q59j078j044k72O97R62R82P74
$$ 958 1585 1530 777 -319 -1358 -1704 -1185 -195 967 1726 1532 673 -405 -1449 -1721 -1024 -62 920 1694
1426A694k19j012r66q83l89P96J147Q50O60j82j204r71o89k76O84J224Q64M64
$$ 1694 1475 463 -503 -1386 -1775 -979 168 1018 1678 1496 292 -679 -1368 -1644 -960 264 1128 1592
1444A592j37j096j263n94J3N99J230R24K18k67q65j211p06J34O40J115J069K23
$$ 1592 1455 359 -904 -1498 -1485 -886 344 1268 1486 1219 354 -857 -1563 -1429 -789 326 1395 1618
1462A618o17q18j135p17L39Q12Q43R42L73n98r80r61p80K01J143R74O39K26n96
$$ 1618 1001 183 -952 -1669 -1330 -518 325 1267 1640 1042 62 -899 -1679 -1478 -335 639 1278 1504 908
1481I08j081p32n61L8J052J041O45L16o06j325q88k61J90R60J241M09j25l26j101
$$ 908 -173 -905 -1466 -1428 -376 665 1310 1626 1020 -305 -1193 -1454 -1264 -304 937 1346 1221 895 -206
1500b06j049k12K79P64J387O61l73o11r73j037p1O02N99R27R09k55q45q10r97
$$ -206 -1255 -1467 -1188 -424 963 1624 1251 640 -333 -1370 -1441 -839 -240 687 1596 1341 496 -314 -1311
1519a311m03P72J067P50O45j80j096p92n12m79N87J070P90M92O3j049j217m91
$$ -1311 -1714 -942 125 875 1520 1340 244 -548 -1060 -1539 -952 118 908 1400 1463 414 -803 -1294
1537a294j48N31J254P63M9k4p07j284l94JK25J235J153K6l62p12j335n27N41M09
$$ -1294 -1442 -911 343 1106 1155 1131 424 -860 -1254 -1253 -1028 207 1360 1386 1024 312 -1023 -1550 -1009 -600
1557f00P56J033J32m65n00r91j066L64R47P66R59K86r77q19m79p02P0R64O79O23
$$ -600 156 1189 1321 856 356 -635 -1701 -1337 -390 376 1335 1621 644 -175 -654 -1356 -1286 -322 357 980
1577I80O18n56j379o92l51M8J213J011J39J13k26j103p77j48j63P40J475M23j93
$$ 980 1598 1042 -337 -1029 -1380 -1332 -119 892 1031 1144 918 -185 -962 -1110 -1273 -533 942 1365 1172
1596A172l48j140j094K30M44L73J154N70l97k80p51j253k45Q45N72R49Q31n39
$$ 1172 824 -316 -1410 -1180 -736 -363 791 1361 964 684 -67 -1320 -1565 -720 -148 801 1632 1093
1614A093r32l91q11m61P88P49M70Q97O1j203p89n11n14P54J280L86K16J69r90
$$ 1093 161 -230 -1041 -1502 -714 35 505 1402 1463 260 -529 -1040 -1554 -800 480 866 1082 1251 261
1633B61r97j45k74J27J212R60J4k8p83j311l33L44K70Q73R88o5k77l89j098p87
$$ 261 -736 -881 -1155 -1028 184 1144 1158 1130 347 -964 -1297 -953 -683 190 1178 1113 836 447 -651 -1438
1653a438M06N05P26J089J63p87o81n73q19L52Q12M56P41M59o48q80n98o74J57
$$ -1438 -1032 -527 199 1288 1451 664 -17 -590 -1409 -1057 -245 211 952 1411 763 -117 -715 -1389 -1232
1672a232J124P03L36L05m65j059n03k22k02Q40J121L04J53l71j127q00M3J10O03
$$ -1232 -108 595 931 1236 771 -288 -791 -1013 -1215 -375 746 1050 1203 832 -295 -1095 -1052 -942 -339
1691c39J134L16j78k35q25r94m6L35N29J047O04l44n53o99p91k08N87O17O00O82
$$ -339 795 1111 933 698 -127 -1121 -1167 -832 -303 744 1348 1004 451 -248 -1039 -1247 -660 -43 557 1239
1711A239j69p24o81o98k50N35R00O50L89j70p46p57l94j90L49Q78O69L28j81p09
$$ 1239 1070 346 -335 -1033 -1283 -748 152 802 1191 1021 275 -482 -876 -1066 -717 161 830 1158 977 268
1731B68q97m98L9M90Q39P06J37k54n80q88m84J37M50P49Q05J32l40p37p81m13
$$ 268 -629 -1127 -1088 -598 241 947 1084 830 250 -638 -1122 -985 -535 214 1019 1151 811 74 -707 -1120
1751a120J00O11P02P13J74m30p14p70m84K29O35P74N61J16m99o22p48l54K53N44
$$ -1120 -1020 -409 293 1006 1180 750 36 -734 -1218 -989 -354 420 981 1097 598 -24 -772 -1126 -873 -329
1771c29P92N91M6n26o93o78l38K83O58O43N42J23n75p10o28l67K92P80O38M29
$$ -329 463 1054 1100 574 -119 -797 -1135 -852 -194 449 991 1114 539 -171 -799 -1166 -874 -94 544 973
1791I73J22o15p89n54k14J72Q75P16K81L1n20q42n36j17K62P09P97K95j54m93
$$ 973 1095 480 -309 -863 -1077 -905 -30 686 967 998 478 -364 -900 -1017 -755 -46 751 1046 892 399
1811C99q06n91m3M32O35O92L56k45n60o38o00p4M71P04N87L90k63p35o40m19p8
$$ 399 -407 -998 -1041 -609 26 718 1074 829 269 -369 -969 -1043 -572 132 719 1109 846 111 -529 -948 -1026
1832a026N67O96M94L01k21o70o90l92o4N41Q36M38J38k28p06p10k83M5N10P99
$$ -1026 -459 237 731 1032 811 141 -549 -941 -1005 -464 372 810 948 720 14 -696 -979 -934 -424 375
1852C75N40L0k45p02p23k17J63M29P07N46O8l38o17p76k61J92N71P14N41p5l78
$$ 375 915 945 700 -2 -725 -942 -779 -350 357 903 971 633 16 -760 -1021 -829 -258 456 997 922 544
1873E44o78o34j89K03N49O82M19N1m65p03n85j41K32N96O55M02m0n11o00n94j43
$$ 544 -134 -768 -957 -754 -205 477 896 947 482 -221 -806 -947 -715 -119 536 938 898 387 -213 -807 -950
1894i50L39N18O70L86q6n42o28n04j83L75O59N51L73k12n20o27m44r0L50O68N85
$$ -950 -611 -93 577 963 877 335 -293 -797 -980 -605 54 605 978 766 246 -381 -825 -915 -565 103 688
1915F88K12j03n50p34l88qM37O07O04J60j99n01p38m23J16L28O50O41J37l25m66
$$ 688 900 797 247 -487 -875 -883 -446 161 765 925 726 225 -513 -936 -820 -492 158 799 936 611 145
1936A45o75l85R8M96N38N35K52m09n86n13m67J18O51M88M79K10m51o26l81l17
$$ 145 -530 -915 -817 -321 217 752 1004 595 9 -504 -971 -853 -202 286 765 975 524 -102 -483 -800
1956h00n0O41N56L60K02l85o39n18k61Q7O08P17J80N7k27o53n56j01Q7N07O75
$$ -800 -850 -209 347 707 909 524 -115 -633 -894 -807 -199 518 698 755 528 -125 -681 -782 -695 -188 487
1977D87M27j99k89n63o55p1L57L81N53M55q5m78m55n78l03M97N59N01M13j52o34
$$ 487 914 715 426 -137 -792 -863 -506 -125 428 883 798 320 -135 -713 -1016 -519 40 541 954 802 168
1998A68m52l78j57L00N98L87L44N8o32o36l40j58K69P70M14J16Qm33p14k43mJ39
$$ 168 -284 -662 -819 -519 79 466 810 868 236 -400 -740 -898 -629 141 555 671 679 246 -468 -711 -715 -576
2020e76O86N90J35j62m49p97l28K77K92M42O06R6k68l11o36m85J80M33M38O41
$$ -576 110 700 835 673 224 -573 -901 -624 -332 110 716 812 544 233 -403 -888 -708 -275 163 804
2040H04J14m83n35l37m13J65N65L37L66L48l46o73m13l19M2O21N88J67J40k41
$$ 804 918 435 -100 -437 -850 -685 -120 217 583 931 585 -88 -501 -820 -778 -157 431 598 738 497
2060D97o62l99n8r4M14P93K69r6j59o84n45k1K59L48N92L28j65k74l44o56j70
$$ 497 -165 -564 -622 -716 -302 491 760 664 505 -179 -724 -745 -486 -138 454 782 617 343 -1 -657 -827
2081h27L48L42N58M81k04n40l44m77j53M24M09L39M47r0m89m39m05k06L00P40
$$ -827 -479 -137 421 902 698 158 -186 -663 -816 -392 17 356 803 713 224 -215 -620 -826 -526 214
2101B14L50J24j8n24n05j92j21R8O59N16J03l7m33p24k02J37J48N53N69o6k64
$$ 214 564 688 670 146 -359 -551 -672 -574 85 601 704 667 234 -490 -692 -555 -407 146 715 649 385
2122C85j53o11m04J19L41L84O16J66m20m50l06m30J71M50K73M15K53l20m97l74
$$ 385 232 -379 -783 -664 -323 61 677 843 423 -27 -333 -763 -592 -142 131 546 799 479 -18 -392
2142c92l75l5O39M96K59J51l54n63k86j12p9M46N63K10J20j15p66m62j1J33L63
$$ -392 -767 -802 -163 333 592 743 389 -174 -460 -572 -651 -205 358 568 688 573 -193 -655 -666 -533 -170
2163a70O04K50j53j32m20n51j49K85K43N33M88k36l42l57m72j73M37L19K61M58
$$ -170 434 684 531 399 -21 -572 -721 -436 -193 340 828 592 250 -107 -579 -752 -315 4 265 723
2183G23j22m07l75l95k28L37N36K84L43l1m94m84k33r4J78N80L33J56l0l86n39
$$ 723 601 194 -181 -576 -804 -467 69 353 696 665 171 -313 -546 -640 -462 118 451 607 577 191 -348
2204c48k88L3J78N98M02j4l7l74m82l04NK41M53N44R7k26l69n33k27J33K72L84
$$ -348 -636 -603 -425 173 575 561 524 150 -332 -636 -631 -390 63 607 704 478 109 -424 -651 -518 -246 138
2226A38M14J05k62l10m62l52J22M06L79L90J07l20m14l12k25l3M86L62K85J85
$$ 138 552 657 395 85 -377 -729 -607 -201 178 568 675 355 -59 -371 -596 -629 -143 219 504 689
2246F89k12n37m16j27O9M09M84J76K1k14l71m64j20J00L92M88K54q4k57l97l65
$$ 689 477 -60 -476 -603 -534 -125 359 535 556 342 -29 -493 -613 -513 -121 367 621 537 280 -117 -482
2267d82j12J67K94M97K59j16k08m38n03K7K12L57M03K48j00l04l38l84j19K77
$$ -482 -594 -427 -133 364 623 507 299 -139 -642 -615 -403 -46 357 605 505 201 -137 -521 -640 -363
2287c63L86L61K19q3m01l58k75j00K83M41K85J37J3m99l54j94qJ60M40L35J32
$$ -363 23 384 603 520 119 -239 -514 -614 -331 110 395 532 545 46 -308 -502 -510 -350 90 425 557
2308E57q5l03m91k55O1K34M89L19L9j41l50l92l05J06K73M49K79J35k23l21m41
$$ 557 472 169 -322 -577 -516 -282 207 526 565 424 74 -318 -623 -517 -244 205 484 619 396 75 -366
2329c66k61J39L13L17L84J24l87k75l80j91R7L86L35K53R3k77l98l07j23M4L73
$$ -366 -627 -488 -175 142 526 650 263 -12 -392 -583 -486 -100 235 488 581 304 -94 -401 -524 -480 -107
2350a07L54K42M1k22m60l13p0M0L88M39K37j22k05l45m04k8J25L23M34K36j13
$$ -107 247 489 530 308 -152 -465 -535 -495 -107 332 569 447 242 -103 -507 -535 -410 -87 347 583 470
2371D70k99l14l13r2K00L48L41K21r4l12l57k80m9K13L66L02K09o5l35l91k70
$$ 470 171 -143 -456 -548 -348 0 341 562 468 156 -201 -481 -530 -317 49 351 560 495 160 -231 -501
2392e01m6K89L39L12J33j20k73m16k13J2J92M01L21J19j63l65l24k32N7K34L49
$$ -501 -547 -258 81 393 526 406 133 -283 -496 -484 -292 109 430 549 386 21 -303 -535 -478 -244 105
2413A05L49P4j89k48l78k29Q4K24L59K94O3j45l77l39j67J18K41L68K39L1j61
$$ 105 454 528 339 91 -287 -516 -432 -208 151 445 508 363 -14 -353 -520 -402 -161 207 446 477 316
2434C16l70l01j43L3K80M46K34m5j70l13l64j55J79L17K40L04n2k17l15l32j21
$$ 316 -54 -355 -498 -465 -185 261 495 450 280 -33 -397 -552 -373 -56 184 488 436 219 -96 -428 -549
2455e49J91K54L71K39j00k36k87k58j17J28L34L29K28r4k97k78k63j22K00L35
$$ -549 -358 -104 267 506 406 170 -117 -375 -492 -364 -30 299 527 433 136 -142 -405 -527 -327 8
2475HK53K38r0k46l92k28j8J98L37K66R0Pl33l32j75j5J21L28M13N3r0l06l96
$$ 8 261 499 409 163 -229 -457 -475 -277 60 326 416 423 90 -242 -417 -432 -311 17 430 483 393 87 -309
2498c09k42J40K47K44L59Rj34k32l16k59N4K57K57L29J47k52l16k44k33M4K92
$$ -309 -551 -411 -164 80 439 448 314 82 -234 -493 -439 -182 75 404 551 299 -17 -261 -494 -450 -158
2519a58K32K80J57j61l79k51j89J0L02L91J06J13j67l78j27j52n1K44M32J44M6
$$ -158 74 354 511 350 -29 -280 -469 -459 -157 234 340 453 286 -92 -219 -371 -422 -178 254 398 444
2540D44j14m30l21M7N5K31L29K13j01l9l79l62n8K21J80L10K97j08k72k40k79
$$ 444 330 -100 -421 -374 -319 -88 241 454 353 314 -65 -427 -485 -264 -84 226 523 415 143 -97 -376
2561c76q4K57K03J95K41k4k92k17k55j53K25L69J50K30p3l25l14o3j33J41L63
$$ -376 -460 -203 0 195 436 412 120 -97 -352 -505 -280 89 239 469 396 71 -243 -306 -439 -298 65
2582F5J72J17N4k33m70j16%J17M23K67n2o5j48l56k00Q5J08K08L91Q3k09j94k88
$$ 65 237 354 408 175 -295 -411 -411 -294 129 396 344 279 131 -225 -425 -340 -232 -24 367 450 241 47 -241
2605b41k36J42K45Q6L30J43j45k83j76k91k8L41K62K04J19k18l76j26j01l8K39
$$ -241 -477 -335 -90 -4 326 469 324 41 -135 -426 -454 -113 149 353 472 254 -122 -248 -349 -387 -148
2626a48L00J60R4p9m27j81j46N5K79L59O4k0r3k06l87jR1J22M12J57k5k01k97
$$ -148 152 312 406 327 -100 -281 -427 -372 -93 266 330 310 217 11 -376 -377 -286 -164 248 405 380 179 -118
2649a18k39r5K28K08J47K77j05j81j57l19j30K18K48K44J89k5l13j87j54j41J84
$$ -118 -357 -452 -224 -16 131 408 303 122 -35 -354 -484 -266 -18 226 415 390 77 -110 -264 -405 -221
2670b21K23K42J06J7k13k99j49j00J21L76K24J9j10j59k65j43j3R8K61K91M8r0
$$ -221 2 244 350 367 154 -145 -294 -394 -273 103 327 346 236 77 -188 -331 -344 -246 15 306 354 264
2692B64k11l03j97J07K06J72K80N9j71r0l20k10M0K59J56K55J25j99k57j64j27
$$ 264 53 -250 -447 -340 -134 38 318 377 206 116 -204 -414 -374 -115 41 296 421 222 -35 -199 -326
2713c26LK81J78J63K9j01k44k18o9o4K59L15J22n1k9l26j80r6N6K11K29J84N5
$$ -326 -323 -42 136 299 328 227 -17 -235 -304 -368 -109 206 328 277 248 -78 -258 -354 -298 -87 142 326 381
2736C81j51l03k47o2J74J04K37J83m7j30j84k70l2O9J99K82J27Pk62j16j99j05
$$ 381 230 -73 -320 -382 -208 -104 133 316 269 139 -45 -315 -347 -278 -79 203 330 337 75 -41 -240 -345
2758c45J94J53J35K09m6j92j92j68j13J14K89J72O8k3j77k17j15q2P6K85K37M9
$$ -345 -151 2 137 346 300 108 -84 -252 -365 -251 38 210 278 255 78 -139 -254 -336 -260 25 262 311
2780C11m4k17k57j41M0J97K17J69P8j06j55k88j64K4J72K13J70J46r3k50j76j04
$$ 311 267 50 -207 -348 -308 -111 106 275 353 247 92 -196 -360 -336 -164 49 219 365 272 22 -154 -258
2802b58o1J68K24K20J01j24l00j47j63J1K54J60J80P4j35k07k07j03N4J60K58
$$ -258 -319 -151 73 293 394 270 -30 -177 -340 -329 -75 85 265 339 204 -3 -210 -313 -259 -99 159
2823A59J19J5j27k18k04o2O2K02J94J76l9j30k63k03J7L8K47J93R4J6j56k24j59
$$ 159 278 293 166 -52 -256 -318 -256 -54 140 316 277 147 -116 -319 -302 -264 -17 176 270 286 130 -94 -253
2846b53r6J56J49K18J61m2k07k01j02q4P9K28K20O8j6j54k85j46K2N7K77K07K7
$$ -253 -349 -193 -44 174 335 293 86 -115 -217 -301 -222 6 226 294 278 124 -161 -307 -285 -228 49 256 283
2869B83j2j37k50k43O4J36K30J73O4n6j73j74k05N4J04J88J41J09q6j43k64p1
$$ 283 271 134 -116 -359 -295 -159 71 244 308 252 79 -95 -300 -246 -142 46 187 296 210 67 -197 -268
2891b68jJ45J98J65M6r1j85k40m5k6J98K31J01R1j88j91j33q6K8J56J73J48K8
$$ -268 -269 -124 74 239 285 194 9 -231 -276 -302 -104 127 228 319 131 -60 -193 -279 -251 -95 78 226 254
2914B54j09j54k46m2O3J11K35J30M0j24j72j81p3P7J54K07J30n4r6j88j48j13
$$ 254 145 -9 -255 -297 -234 -123 112 242 282 158 -14 -195 -268 -191 -37 170 300 246 150 -38 -186 -299
2936b99R0J59K04J42oj75k24j38K0l0K16J85J41k9j39j76j80n8J28J67J26J11
$$ -299 -209 -50 154 296 290 115 -109 -247 -227 -257 -41 144 285 256 117 -59 -239 -297 -169 -2 124 235
2958B35mj61j80j54m8J92J50J71L0rj22k35j25j7P3K04K63pj04j39j75j37P4P9
$$ 235 231 70 -110 -264 -312 -120 30 201 231 222 100 -135 -260 -277 -204 0 263 256 152 13 -162 -299 -225 -146
2982a46J86K19Pj30j34j57j21N0R4J28J98O5j29q4j77j50M5K06J39Q0Q1o9k38
$$ -146 40 259 266 136 2 -155 -276 -226 -132 -4 194 259 130 46 -131 -281 -236 -30 109 189 270 201 -37
3005c7q9j50M9J28J70J43M7o8j96j82m9K5J86J01J46J2m9k47j56k7L6J87J37J32
$$ -37 -126 -276 -227 -99 71 214 261 193 -3 -185 -234 -209 -23 78 224 236 187 -60 -216 -243 -207 -20 117 249
3029B49m5j03j79k17N5Q6J13J99O9l7q1j29j71r5R5J93P4J36K4k04j50o4l9M3
$$ 249 204 101 -78 -295 -240 -154 -41 158 227 190 109 -20 -191 -286 -191 2 76 212 236 32 -118 -182 -221 -178
3053a78K35N1P5P6j80k01o7o8P5K10J13O0l6q0j91j21L0J1K11J69L4r2m3k65p5
$$ -178 57 108 183 259 79 -122 -189 -257 -182 28 141 201 165 85 -106 -227 -197 -186 25 194 228 136 93 -172 -247
3078b47P9N6J37J58O2q9j25j48j74J4J90J13J42J23j14k06l1j44j2K05M6J17J42
$$ -247 -168 -112 25 183 245 156 31 -117 -291 -277 -87 26 168 291 177 -29 -60 -204 -216 -11 35 152 294
3101B94j15j48j74j04K5J54J99Q0m7j2j87j42j7K0J28J60J23l4k5k21j51l6Q3
$$ 294 179 31 -143 -247 -222 -68 131 211 164 152 -35 -177 -194 -174 -46 114 237 203 178 -43 -194 -230 -147
3124a47J04J28J29q6p8m8k22J0O2J54R7J50J1k02j32q3q5J16P0K08O0Qp8k22j01
$$ -147 -43 85 214 128 50 2 -220 -210 -148 6 103 253 264 62 -70 -153 -238 -122 -52 156 216 224 146 -76 -177
3149a77l4L2J89J35O8m2j24j70r4M9M9J57J00L2M4j16k81m7N9L1J25J98J4q9q2
$$ -177 -211 -179 10 145 213 171 47 -123 -217 -168 -119 38 138 170 214 98 -183 -230 -171 -140 -15 183 197 108 26
3174B6q4j96R2N1R9J95R5j32j02q0j88N3J39O9J21N4j04j34q5r9J9J06J98L6L5
$$ 26 -58 -254 -162 -111 -12 183 278 146 44 -36 -224 -171 -32 37 158 212 108 -26 -111 -210 -191 -85 113 149 184
3199A84n0j64j28l0M0M8J92K6M5l3j66j64L6k6O4K32J00%j18q0j82m0O3J16R0
$$ 184 134 -30 -158 -188 -148 -100 92 118 163 130 -36 -200 -164 -190 -126 106 206 206 88 8 -174 -214 -151 -35 55
3224E5J41j1j02p6j47r4J16J37O7R7Lj01j15j19n5Q0J57P0J07m9p9j85l0m3N9
$$ 55 196 185 83 7 -140 -234 -118 19 86 183 186 85 -30 -149 -204 -124 33 103 210 161 82 -103 -133 -176 -117
3249a17J66R6Mj1q7j55m2jj7J73J41O2j20oj31j23nP5J32J13K2m1j24p8r7%O9
$$ -117 49 145 149 138 51 -104 -146 -147 -164 9 150 212 92 86 -45 -168 -173 -98 34 147 169 128 4 -74 -171 -171 -102
3276a02J54Q9K6%j56q1o1j0LJ76J23M8p0j19j59j6JJ21J06OQ8n3q6j40k3K0Q5
$$ -102 52 141 167 167 11 -70 -131 -141 -138 38 161 209 139 20 -139 -155 -154 -33 73 79 167 114 28 -112 -135 -115 -30
3303c0J16P3J7q4r5j47JJ5Q5J05J48pj20q7q8p2L3J11J14O0K5j14p0p6q8nJ52
$$ -30 86 159 176 92 -3 -150 -149 -134 -49 56 204 197 77 -10 -98 -170 -137 -26 88 148 173 59 -11 -87 -175 -180 -28
3330b8Q5J47k8j37r5r3m9K6J08J95L0l8p7j38r9QJ61MJ02J15q4o4n9j61m9J49
$$ -28 57 204 176 39 -56 -149 -198 -172 -64 131 161 123 46 -92 -191 -183 -22 -18 84 199 115 51 -8 -169 -218 -69
3356f9J05O9K3l8l9j17n8l2Q0J09N6O6l4j65K1j11K5j7J61Q5j2J3j16r6q8J6P5
$$ -69 36 105 128 90 51 -66 -124 -156 -76 33 89 155 121 -44 -23 -134 -109 -126 35 120 108 121 5 -91 -179 -163 -88
3383h8J06K8J33j28o1o3j21jJ04J29Q2M9p5o0j43k8L5R4L4J18K1q9r4o6k9J1J27
$$ -88 18 46 179 51 -10 -73 -194 -195 -91 38 120 169 94 34 -109 -137 -102 -8 26 144 165 76 -18 -84 -113 -102 25
3410B5O3N7o4J1j53r9pN9R4Q1%O7n4j05j04O9p1J30J01L0L1j32l7j05j1L5J08
$$ 25 88 145 81 92 -61 -160 -167 -108 -14 67 67 134 80 -25 -129 -60 -131 -1 100 130 161 29 -8 -113 -124 -89 19
3437A9L7J08k7r6p3r3jP6M5J40Ll9m8q5j00nR8O1R2N3o1p0j17n9l1J38J9J00N7
$$ 19 56 164 137 41 -32 -125 -126 -50 -5 135 138 99 51 -34 -134 -139 -41 20 112 165 104 34 -83 -142 -173 -35 -16 84 141
3466A41m1j27or6k5O5J13J8J03j6j26k5q3j8J06P0L0R1l9j15j01k0l7N0J14J16
$$ 141 100 -27 -33 -129 -154 -89 24 42 145 129 3 -22 -105 -123 -17 53 83 174 135 20 -81 -101 -138 -88 26 142
3492A42J4q2q3n7k0l1L8J28R4p1l0p9l9o9R0JP0R8J1j12r1K5r2J7J05O7P4Qj27
$$ 142 156 74 -9 -66 -86 -117 -79 49 143 72 42 -37 -76 -145 -55 -54 16 114 125 13 -78 -53 -145 -128 -23 44 118 126 -1
3521al4p1L3m1J54K6P3l8p8o1m3ml7J29O7O0k9j23k4n7lM5O4P0rK0l4j21o6K3
$$ -1 -35 -106 -73 -114 40 66 139 101 23 -38 -81 -85 -122 7 74 134 105 -18 -42 -99 -102 -57 7 77 68 88 54 -67 -133 -110
3551a10J7Q6J04J4j9m4n0j34L1M1L9J17j0j3p6n2q8K9J31j3M4J08p7r4n4K8j16
$$ -110 -93 -7 97 111 92 48 -2 -136 -105 -64 -25 92 82 69 -7 -59 -147 -118 13 0 44 152 75 -19 -73 -45 -161
3578a61J10J12m7Q3Rj70m3K7l1O1Q4N3n9K6m6o6m9NQ1M3R0l0o7lj38PL3M6O0R3
$$ -161 -51 61 14 97 106 -64 -107 -80 -111 -50 34 87 28 54 8 -58 -107 -102 -21 22 112 82 15 12 -126 -119 -86 -40 20 113
3608A13J1m1q1r7NkQ2M9L0Q2p4j20n1n1N1J58M3m4K9q0o0j5l5N0M5K8K4K2Pj17
$$ 113 124 83 2 -95 -90 -92 -10 39 69 151 77 -43 -94 -145 -94 64 107 63 92 12 -48 -63 -98 -48 -3 25 49 71 78 -39
3638c9k9K0k0K6J29k5n6K8p2j1Kk5N3J21j3j9q9qq5L8L7JJ31M5p4q5l9j1J8j3
$$ -39 -68 -48 -68 -42 87 62 6 34 -38 -49 -47 -72 -19 102 89 70 -19 -27 -112 -74 -37 -36 95 140 66 -19 -58 -69 -51 -64
3668f4P9O4J6Mm9j12l9j8N9O9Q0L5m2q7o6j2K5L9O2M2jlq5l5o2P0K9J6J06k9K8
$$ -64 15 79 95 99 50 -62 -101 -119 -60 9 89 124 82 -5 -71 -83 -58 -19 43 85 84 81 -4 -39 -101 -31 -2 14 120 91 119
3699A19j62pl6J7J7J03M4K0j27J5q6%P0j7Q5rM2n0n8p5N3m6J10M5j0j1l0m8m6
$$ 119 -43 -50 -86 -69 -52 51 95 115 -12 3 -83 -83 -13 -30 55 46 88 38 -20 -95 -42 -88 22 67 57 46 16 -32 -78
3728g8n9O6P6J03l0J6j9q8l6k0NL4J19j7L4m7m0q3j3N8J8N6RL9r9j8j09K9R4k0
$$ -78 -137 -71 5 108 78 94 75 -13 -49 -69 -64 -30 89 72 106 59 19 -64 -77 -19 -1 55 64 103 4 -14 -123 -94 0 -20
3758b0R9J1l4o9l3m3j4M7N6N7LJ8r0o5J1K8J9N0N7j3l6k4n6k5j4Q4K7Q2j3l8l7
$$ -20 79 90 56 -13 -46 -89 -103 -56 0 57 60 78 -12 -77 -66 -38 -19 31 88 75 39 15 -41 -66 -80 4 31 113 100 62 25
3789B5l9rj1P1M9O2r4k0j7l3r3N6N3oJ11l1Ln7o9j4K0K1R3k6J5o2J7o2JpM6K2
$$ 25 -14 -23 -34 37 86 148 54 34 17 -16 -109 -53 0 -6 105 74 77 20 -49 -63 -43 -22 71 45 60 -2 15 -47 -46 -53 -7 15
3821A5J9J5k7jp5m2R5PL0lL0o9j9K3n9QK6O4M8Jj03j8m7O1m2R1J8K0q7M5l2o6
$$ 15 34 49 22 21 -54 -96 -1 6 36 33 63 -6 -25 -2 -61 -53 -27 37 85 86 -17 -35 -82 -21 -63 28 46 66 -21 24 -8 -74
3853g4J1K7O3K6M5n3j8l6m8KQ5j3J05j8q9m1ln0K4K2M8N0o3J8k8jn9NL2R7J7n1
$$ -74 -63 -36 27 53 98 45 27 -9 -57 -55 30 17 122 104 15 -26 -29 -79 -55 -33 15 65 2 20 -8 -9 -68 -63 -31 66 83 32
3885C2ko3J0m7J9O4K5ll5L5j8m3l6N9qR7Mm3qp3J4o3O0Q1j9M3k3l2n7m0QJ0M5
$$ 32 30 -33 -23 -70 -51 13 38 35 0 35 17 -26 -62 -3 -11 86 90 47 39 -34 -20 -83 -23 58 39 82 59 27 -30 -70 -62 -52 -7
3918gL3R1o1j1n9k1l1J9N6O7l1J5o0j8o8J1K8N9L7J9rl4o7N4n3J6NO0K0k2L7p5
$$ -7 26 117 56 45 -14 -35 -66 -47 9 76 45 60 0 -18 -86 -75 -47 12 49 68 59 25 -42 12 -41 -25 -20 40 60 38 75 0
3950@k4jL4L8j1L5k8o1n2M2jJ9K4Q1m4J1Jn5o8MN4M3j6J3L6l7p8K8k4M1NL4j5
$$ 0 -24 -25 9 47 36 71 43 -18 -70 -28 -29 -10 14 95 51 62 63 8 -60 -56 -2 41 25 38 74 37 -41 -13 -37 4 9 43 28
3983B8rk2K0o8nL9J6M0J7j4m4l5k5J6L8O2lM0m1m0l1l8N6j6J1L8l1Pk2k9n3Q2
$$ 28 19 -3 17 -51 -56 -17 -1 39 56 42 -2 -37 -62 -46 -8 54 51 91 50 10 -21 -59 -3 -19 -8 30 -1 6 -16 -45 -98 -16
4015a6j1L2O4k7Mm3o2K2j0L9L8L3r7O0p5J1L3%N1p5J00l3m4M3o0m3RJ7Q0j6L7
$$ -16 -27 5 69 42 46 3 -59 -37 -47 -8 30 63 -34 26 -49 -38 -5 -5 46 -29 71 38 -6 37 -23 -66 -57 -40 40 24 61
4046F1J2j02Oj9M1L5n8R6j8m4l3L8m6KL9K3PJ5p1K5Op7O7j5Q5l3L1l8r4K4K7K8
$$ 61 73 -29 -23 -42 -1 34 -24 72 54 10 -23 15 -31 -29 10 33 40 55 -16 9 15 -62 5 -10 75 42 73 35 -59 -35 -8 20
4078B0k2N7j1Jo0k0M2l5J2P0j2J9j0n0No3K2NO7j1qNj7J4k7l0l4Q6K0l8M4n4r
$$ 20 -2 55 44 45 -15 -35 7 -28 -16 54 42 61 51 1 6 -57 -35 -30 37 26 18 23 6 20 -7 -37 -71 15 35 -3 41 -13 -22
4111b2nn5L4Q3J3j7Pr1oK6K7LO1m5P5q0o5jM3n2Q1N6j5j7kq8L2k5L2j0M9L0o5
$$ -22 -27 -82 -48 35 48 31 38 -53 -59 -33 -6 -3 58 13 88 8 -57 -58 -15 -67 14 70 55 38 36 -52 -20 -45 -13 -23 26 56 -9
4144iQ5p8Lr4M2L9lL1Om6j4J7j7oN4rN9k7m4K1m5M9nn9PJ16o9J5k1rm0L0J0M0
$$ -9 76 -2 1 -93 -51 -12 -15 16 22 -24 -38 -21 -38 -44 10 1 60 33 -11 10 -35 14 9 -50 -43 73 4 19 -2 -11 -51 -21 -11 29
4178B9O5l0rq8QM3q7PJ17q3K6k0L0m7N5m5L8K1n8N3Ll2j2j5N0nk5M0mj3l9j3j
$$ 29 94 64 55 -33 -25 18 -69 -62 55 -28 -2 -22 8 -39 16 -29 9 30 -28 25 28 -4 -16 -31 19 14 -11 29 25 12 -27 -40 -41
4211d1l2J17k8KRl9L4%j6k2P8n6k0J4J3j6M6n8M8K4L4o2k0lo1N5Mk2N9M0l6rk1
$$ -41 -73 44 16 18 27 -12 22 22 6 -16 62 6 -14 0 13 -3 43 -15 33 57 91 29 9 6 -55 0 4 -18 41 81 45 36 15
4244A5Ko7lM7M7j6PN6n0j16O3nJNJ8k2M6n0L2j1k3J2j4N3k1kk2l1M7j9j5O1K3
$$ 15 17 -50 -53 -6 41 25 32 88 38 -78 -15 -20 -19 -14 4 -18 28 -22 10 -1 -24 -12 -26 27 6 4 -18 -49 -2 -21 -36 25 48
4277D8n7qkml5O2l7N3Kk1L1o6M6j6l2N7m1K3M8k8j0j1l6M8k6QL3J2k5k4kk5oP5
$$ 48 -9 -17 -19 -23 -58 4 -33 20 22 1 32 -34 12 -4 -36 21 -20 3 51 23 13 2 -34 14 -12 -4 29 41 16 -8 -10 -35 -41 34
4311C4pk7J2j5Oj1k9P3n1KL0K3r6N1pnNJ4K3Mj3l5O8n9Mk5QN9n4O0k5l9k6L0N2
$$ 34 27 0 12 -3 3 -8 -37 36 -15 -13 17 40 -56 -5 -12 -17 -12 2 25 29 16 -19 49 -10 -6 -31 -23 36 -18 42 17 -22 -48 -18 34
4346C4kk0oL5l7J8p3M1l7P1j4O6p1J9k7J7j8J1L7pj4No6K4K8k7J8K1l6J4P0j27
$$ 34 32 12 6 41 4 22 -51 -10 -47 24 10 76 5 24 -3 14 -4 7 44 37 23 28 -38 -14 14 -13 5 26 -10 4 74 -53
4378e3L9j8M1K7q0P0k5M7q6J3K4MqOPjNpo6L7K1J1J0K1j7Qo6M5l2jK9k0L5j9k5
$$ -53 -14 -32 9 36 -44 26 1 48 -38 -25 -1 3 -5 1 8 7 12 5 -61 -24 -3 8 18 39 22 30 -36 9 -23 -24 5 -15 20 1 -24
4413b4M3o6L1J2L4n0P1m5K8l9J1l4KO5k2l0N7J4p8MrM3l5j6L1k5M4l1k8K7RO1
$$ -24 19 -47 -16 -4 30 -20 51 6 34 -5 6 -28 -26 39 17 -13 44 58 -20 -16 -25 18 -17 -33 -2 -27 17 -14 -42 -15 -6 55
4445E5oj2Mo8J5K9o9P6p0P7m2J8k5k8K9j4M3m5oO1n1M6M8o2l9L3P3k0oqNl9l3
$$ 55 49 37 41 -27 -12 17 -52 24 -46 31 -11 7 -18 -46 -17 -31 12 -33 -39 22 -29 17 65 3 -36 -3 70 50 44 36 41 2 -31
4478c1M7k7PL5Rll7o1N7j9j0P7pl0koJLJ2j1J5k3J6k4Rl7mN7j6J5nOk6Rl2J4K9
$$ -31 16 -11 -4 31 40 37 0 -61 -4 -23 -33 44 37 7 5 -1 0 3 15 4 19 -4 12 -12 -3 -40 -44 13 -3 12 7 13 -13 -4 -36 -22 7
4515GJ7K1J2Rl3k5lJ9j9OkM1p8K6j7k1J4M8m6L2K7o0K9jo7O4j5K0Ml1P8m0k0Q
$$ 7 24 45 57 66 33 8 5 24 5 11 9 50 -28 -2 -19 -40 -26 22 -24 8 35 -25 4 3 -64 0 -15 5 9 -22 56 16 -4 4
4549DJK9m1K6J2m6lqJ8om5N0Q9m2Ro1j0j5qQ7m0k5K9L2n9l6M6k7P7m7RQJ5n3Q5
$$ 4 5 34 -7 19 31 -15 -18 -26 -8 -14 -59 -9 80 38 47 -14 -24 -39 -47 40 0 -25 4 36 -23 -59 -13 -40 37 -10 -1 7 22 -31 54
4584E4p6MJ1J8O6p6M3mn4K5M9n0m7N6j5K2j5k6J8J0K1k7j6J8%m1Kj6K9KK7m2K1
$$ 54 -22 -18 -7 11 77 1 44 40 -14 11 60 10 -37 19 4 26 11 -15 3 13 34 7 -9 9 9 -32 -30 -46 -17 -15 12 -30 -9
4617iMk4L8m5qL5J8k1K2j0j6K5l7K4K2j0J1q2P3k0Jk4M6l2M0l9K8Nj1l6J7R1o8
$$ -9 -5 -29 9 -36 -44 -9 9 -12 10 0 -16 9 -28 -4 18 8 19 -63 10 -10 -9 -33 13 -19 21 -18 10 15 4 -32 -15 76 8
4650HJ0J6o0M3k9nN3p5N8o3N0PPm4J4k0pJ4L4l5J6P4n8k0n1N3J7K2pJ5J6o0o2
$$ 8 18 34 -26 17 -12 -17 36 -39 19 -44 6 13 20 -24 -10 -30 -37 -23 11 -24 -8 66 8 -12 -63 -10 7 29 22 37 53 -7 -69
4683f9M2j2P2L1m6L6m8k0J9L1k5k2N5m5n7M3j5K4k9P5j1l4Qj%no7K6K1M3k5M6
$$ -69 -27 -39 33 64 18 54 6 -14 5 36 11 -11 44 -1 -58 -15 -30 -6 -35 40 29 -5 3 2 2 -3 -70 -44 -23 20 -5 41
4715D1j2q1%oL9L5l1K6M3o1K8Ll3Q7q3L1Jk4N5k6j3k5pj1KqN7n3J3j4O8n1J2m
$$ 41 29 -52 -52 -58 -19 16 -15 11 54 -7 21 24 -9 78 -5 26 27 3 58 32 19 -6 -13 -24 -22 -30 27 -26 -13 -27 41 -10 2 -2
4749bJ8k3j5N3l7l3k0L9J0k7O2rkjMm0M7qQrQk7RLNnPj9pRJ1L0j7l0K1J6k6j9
$$ -2 16 -7 -22 31 -6 -39 -59 -20 -10 -37 25 16 14 13 17 -23 24 16 24 15 23 -4 5 8 13 8 15 -4 -11 -2 9 39 22 -8 13 29 3 -16
4787a6J8K3m0J4K2%j0K0k9j0m0N7n8K0M1m4N3j6JM5k6l6l0j1J37q7L0l5m3L6L0
$$ -16 2 25 -15 -1 21 21 11 31 2 -8 -48 9 -49 -29 12 -32 21 5 6 51 25 -11 -41 -52 85 -2 28 -7 -50 -14 16
4818A6l7jQ6k2j8p7R0k9Lm2K6mj0M0k9J5k0l6PO5k0J1k0l0QN9k1J0j2M9n3nk4
$$ 16 -21 -22 64 42 24 -53 37 8 11 -31 -5 -9 -19 21 -8 7 -13 -49 -42 23 3 14 -6 -36 -28 31 10 20 8 57 4 -1 -25
4851b5K1J7l5J6M4nrk6N0n6J8k1l8J03o0J0J1k9j2K6k5K4m4LR0m2K1l3lj4l1Q1
$$ -25 -4 13 -22 -6 38 33 24 -2 48 -8 10 -11 -49 54 -6 4 15 -14 -26 0 -25 -1 -45 -42 48 6 27 -6 -9 -23 -54 27
4883B7jk9K3%q5P8j3j1P7q8J3Q4n8l5L5j6m0O3J7j2m9N9l8j5J4J4Mm9J47r4J6
$$ 27 26 -3 20 20 -65 13 0 -11 66 -22 -9 75 17 -18 17 1 -39 24 41 29 -20 39 1 -14 0 14 18 -31 116 22 38
4914C8n9k1N3l0L3JRK2n0j3%J8jJ8mj6j6l7K8K3k8N2p3K6K7jnlK3n9L3K8j9L4
$$ 38 -21 -42 11 -19 14 15 24 46 -4 -17 -17 1 0 18 14 -2 -18 -55 -27 -4 -32 20 -53 -27 0 -1 -6 -9 14 -45 -12 16 -3 31
4948C1Kk2%m2M5Ro4Q5k0m1rRl1J3M7J0M5n6ql1O2o4J9K9K4j0k9k8J2J2ll2N4J7
$$ 31 33 11 11 -31 14 23 -41 44 24 -17 -26 -17 -48 -35 12 22 67 11 3 -28 34 -30 -11 18 42 32 3 -25 -13 -1 -4 -36 18 35
4982C5Pjm9jJ2%kM3o3k4R3l5n1k1RM6M8j0k0m1J6k7L6lk5J9k4QK9mj3j3M7l3k9
$$ 35 42 41 -8 -9 3 3 1 44 -19 -43 50 15 -36 -57 -48 -2 46 36 16 -25 -9 -36 0 -3 -28 -9 -33 -25 4 0 -13 -26 21 -12 -41
5017d1K1Q2km8j5%L8j1L3Qo6M0k7l7M9j7N0j9k1Mk3J1J4k5KJ1KLMj9kK7m1J9k2
$$ -41 -20 62 60 12 -3 -3 35 24 57 65 -1 39 12 -25 24 7 57 38 17 21 -2 9 23 -2 0 11 13 16 20 1 -1 26 -15 4 -18
5052a8O8m1L1rn1PNL3p0j9R1n8L3%K3L0o9N7l4j6JKl9M4j4k4R2m2qPl3M9m5j8
$$ -18 50 9 40 31 -20 -13 -8 25 -45 -64 27 -31 2 2 25 55 -14 43 9 -7 -6 -4 -43 1 -13 -37 55 13 5 12 -21 28 -17 -35
5086c5L3l7N7k0K6j0o0l5O5J1j8O2o4j8K1%p4P3M0m8J3N3j32L4M5j2L6MN0m9K
$$ -35 -2 -39 18 -2 24 14 -46 -81 -16 -5 -23 39 -25 -43 -22 -22 -96 -23 17 -31 -18 35 -97 -63 -18 -30 6 10 60 11 13
5117A3j3k2L4l7K9JJpk4O1jr9O0NM%k8JP2l5o1N1J5pOqQrj4J3m4J6KJ5QRLj3J8
$$ 13 0 -22 12 -25 4 5 6 -1 -25 36 35 -64 -4 1 5 5 -23 -22 50 15 -46 5 20 13 19 11 19 10 -4 9 -35 -19 -17 -2 6 15 18 5 23
5156B3o5J8%J8lJ2J5m3K5m0K6L3J0Jkk9L0pq1J6K6oK2k0pK8l0J7J5j0l6O5k1%
$$ 23 -42 -24 -24 -6 -9 3 18 -25 0 -40 -14 19 29 30 28 -1 29 22 -59 -43 -17 -23 -1 -21 -28 0 -30 -13 2 -8 -44 21 0 0
5190@Ol6N2Oo6O6K7j04N5J8k3m7K3j2K5O1j4l3K8k7l2K5L2j9K8k4r7J14p3j6N3
$$ 0 6 -30 22 28 -38 28 55 -49 6 24 1 -46 -23 -35 -10 51 37 4 32 5 -27 -2 30 11 39 15 -82 32 -41 -57 -4
5221dj2J6RK3n6m0N6J0J2rm9N4j2L1n5L3j6m0O7j0J1K8n3k4O6j3k7K5om4N3m3
$$ -4 -16 0 9 32 -24 -64 -8 2 14 5 -44 10 -2 29 -26 7 -9 -49 18 8 19 47 -6 -30 36 23 -4 21 15 -29 24 -19
5253a9O0o6pK3n7Q4j2Lm6k4J3k5J09q8N9JKJ3m7K6K2n0O2L5m4Nm9lOnL0K1k9J3
$$ -19 41 -25 -32 -9 -66 18 6 9 -37 -61 -48 -73 36 -52 7 8 10 23 -24 2 24 -26 36 71 27 32 -17 -20 -14 -19 11 32 3 16
5287A6L1qn1j0L9j06N1N3K4k0l3nJ3kL7J3m4J4p2N0j8J8k3N3J2l2J5n3L5J3K1
$$ 16 47 39 -12 -22 17 -89 -38 15 39 19 -14 -19 -6 -8 29 42 -2 12 -60 -10 -28 -10 -33 20 32 0 15 -38 -3 10 31
5318C1m2k9M7j0J9k5J1L8k7J5l3O1Nq0J0K6j5Jl4J6M1rJ7Mk7o4jN7j5K8M7j02
$$ 31 -11 -40 7 -3 16 -9 2 40 13 28 -5 56 61 -19 -9 17 2 3 -31 -15 26 17 34 38 11 -53 -54 3 -12 16 63 -39
5350c9M2m4N6q7N9pL0Nl5N8m4M3l3J5Mk0plJ4m2N5k1L6po4N3L7n8jm2%L1PlJ14
$$ -39 3 -41 15 -72 -13 -20 10 15 -20 38 -6 37 4 19 23 3 -4 -7 7 -35 20 -1 35 28 -36 17 54 -4 -5 -47 -47 -16 -9 -12 102
5385A02j26L2Qn5J9M8l2j5N2j7o0OqM3K0k8O7k8qJ6j4rl3L3KJ6J6o4L8k6m8P3
$$ 102 -24 8 16 -39 -20 28 -4 -19 33 16 -44 -38 -46 -3 17 -11 56 28 20 36 22 13 -20 13 15 31 47 -17 21 -5 -53 20
5417B0J5lJ5o1j5O6o9O9l2K0n1M2K6J5j09L4j5pO5k7j6LNQm4K8k7j3J16p8%K3
$$ 20 35 32 47 -14 -29 37 -32 37 5 25 -26 16 42 57 -52 -18 -33 -40 25 -2 -18 -15 -10 -2 -46 -18 -45 -58 58 -20 -20 3
5449Cl2K9ml6N8J0%J8m9o8J00j8l9M1j%Kk2m8N2k5PoP6n2L6m9l1K4mJ13j16M8
$$ 3 -29 0 -4 -40 18 28 28 46 -3 -71 29 11 -28 13 12 12 14 -8 -56 -4 -29 -22 -28 48 -4 32 -17 -48 -24 -28 85 -31 17
5482A7n8O9m5Qj8rN3n4J03o6L0n5K8LL0j8k7R8j14Q0k5l1J1j9K9mN2n4j5j8j1
$$ 17 -41 28 -17 -9 -27 -36 17 -37 66 0 30 -25 3 6 36 18 -9 89 -25 55 30 -1 10 -9 20 16 68 14 -1 -19 -30
5513c0L4j0k0N2%k0jL0k4Nl3K5j6L1Jj5j1K9o6L4kQJ9k0Rj9M3n0O1p4J03q1k6
$$ -30 4 -6 -26 26 26 6 5 35 11 16 -17 8 -8 23 24 9 -2 27 -39 -5 -7 1 20 0 9 -10 33 -17 44 -30 73 -8 -34
5546c4L5K1l5J4N1k5L7j03L1K4kl9j4J8l%M6j7PJ3o0M3Om3P8p3j8K0L7o1M8k4
$$ -34 1 22 -13 1 52 27 64 -39 -8 16 14 -25 -39 -21 -24 -24 22 5 12 25 -35 8 14 -29 49 -24 -42 -22 15 -46 2 -22
5578b2N3Mj6J5ol2j0K8K0l3k2M5n7Q1rp3J0L3l8L3k1k3J1O7j16O5MPK3l1k3J6
$$ -22 31 35 19 34 28 -4 -14 14 34 1 -21 24 -33 48 39 -34 -24 9 -29 4 -17 -40 -29 38 -78 -13 -9 -2 21 -10 -33 -17
5610a7K8ql8Q1j7j8j6J6l6K9jl9P6n7M8l0L6M1n3mLm7J1K5m%l7M8mJ6Ok5K2j8
$$ -17 11 3 -35 46 29 11 -5 11 -25 4 3 -36 40 -17 31 1 37 78 25 21 24 -23 -12 13 9 9 -28 20 16 32 38 13 35 17
5644A7o0O3m5J5j4N8p9L4OL4q8N3K6j7pL1MoL8p7%M7m6J1K3j9K1l6Ok1oP0Rp1
$$ 17 -43 20 -25 -10 -24 34 -45 -11 -5 29 -59 -6 20 3 -4 27 31 25 63 -14 -14 33 -13 -2 21 2 23 -13 -7 -28 -34 36 45 -26
5678b6%K1J7n6L2j4M6m8J5J3L6o1O5k7J1j0l0P7n4j8kK1m5rP6j4j1J8k4m0L7k2
$$ -26 -26 -5 12 -44 -12 -26 20 -28 -13 0 36 -25 40 13 24 14 -16 61 7 -11 -13 8 -37 -46 30 16 5 23 -1 -41 -4 -26
5710b6k0O4M8l1kj1k2Rk6L3mm2LL8J8n7nNO5p6N2j0l9PL8l0%J3QNJj6l1N3k0l2
$$ -26 -46 18 66 35 33 22 0 9 -17 16 12 -30 -27 11 29 -28 -33 -28 37 -39 13 3 -36 -29 9 -21 -21 -8 0 5 6 -10 -41 12 -8 -40
5746d0KM7NJ1j3J9m4M4k6J5nJ7J5l2Oo6O2p2P4k9K0J7ko3M0Lq0P6j2J0k0MK6n
$$ -40 -38 9 14 25 12 31 -13 31 5 20 15 32 47 15 21 -45 17 -55 19 -10 10 27 25 -38 2 5 -75 1 -11 -1 -21 -17 9 4
5780DJ0M5j04M0L6nMK2k9m4L2l9M2NRM0j02L2OqK7m1j2Q4K1o0Ol8J5L7l1j3J9
$$ 4 14 59 -45 -5 31 26 30 52 23 -21 11 -28 14 19 28 68 -34 -2 4 -4 23 -18 -30 54 75 15 21 -17 -2 35 4 -9 10
5813A0k6L8MJ1k2n3N9J0lk0l3K7Om3%KO8j2Lnrn2L1RL7jm5k8N8N6j14K9O4j8n
$$ 10 -16 22 26 37 15 -38 21 31 28 8 -25 2 8 -35 -35 -33 35 23 26 21 12 -40 -9 0 37 36 -9 -37 21 77 -37 -8 56 38 33
5848C3n1j6K8kJ7Ll9N4ol1J2Nk1k8N2m8R9k8n0L9o0M0L2j2l4K1L5n3L1Rm7olo
$$ 33 -18 -34 -6 -8 9 12 -27 27 21 -10 2 7 -14 -42 10 -38 61 33 -17 22 -38 2 34 22 -12 9 44 -9 22 31 -16 -22 -25 -31
5882c1P7K2Lm3K5m8q8R4k5OL3o7L4L7l3k3L0l4N3l8L8k5J5qmj4KJ8L0k3m9MK0
$$ -31 46 68 71 28 53 5 -83 11 -14 -8 25 -42 -8 29 -4 -27 3 -31 22 -16 22 -3 12 4 0 -14 -12 6 36 13 -36 -32 -12
5915a2M3q0M6J4jk2RK1m5J5L2J3kj8L4j21R2j5j9L8k4L6k8Qm0M6kj8k6J7rk9Q1
$$ -12 31 -49 -3 11 10 -12 -3 18 -27 -12 20 33 31 13 47 -74 18 3 -16 22 -2 34 6 14 -26 20 18 0 -26 -9 -18 -47 34
5948C4r0M4l1RJ7j4O8p2P2l6nJkPJ0k2K7jJ0m0k1K8k7NJ8O2q0O0k3m8Q7k6rN6
$$ 34 -56 -12 -43 -34 -17 -31 37 -35 37 1 -4 -3 -5 2 12 -10 17 16 26 -14 -35 -7 -34 -29 -11 51 -29 31 8 -40 47 21 12 68
5982F8m5m5Q0p2o1Q4j6J9%j8j0j5K2L4j7m9N1jj6m8M8k3K7k7M9m1L0k3n4J16%
$$ 68 23 -22 58 -14 -75 9 -7 12 12 -6 -16 -31 -9 25 8 -41 10 9 -7 -55 -7 -30 -3 -30 19 -22 8 -15 -69 47 47
6013D7m1k7J6M6m5K6O7q3n0QLJ7K0pjK5m8L6j8k7R2p8J7L4%rl0L7k3J5K7n8N0
$$ 47 6 -21 -5 41 -4 22 89 6 -44 -36 -33 -16 4 -3 -4 21 -27 9 -9 -36 56 -22 -5 29 29 20 -10 27 4 19 46 -12 38
6046C8k2l5oM5k4LK3j7k4K4Kj6J2qJ7N7m6J1m3K7l1j8O6l1jj0k4L0J0rMj6L8j8
$$ 38 16 -19 -25 20 -4 -1 22 5 -19 5 7 -9 3 -5 12 69 23 34 -9 18 -13 -31 35 4 3 -7 -31 -1 9 0 4 -12 26 8
6080Hm9L2k3J8NK6j4kQk0L0j1J7m2j5J1J08o0n2O5r4M8Pm9P2l7K0J2j10Q8l5N8
$$ 8 -41 -9 -32 -14 -9 17 3 1 9 -11 19 8 25 -17 -32 -21 87 27 -25 40 -54 -6 1 -48 24 -13 7 19 -91 -3 -38 20
6112B0ln7K7N6k5qK4m4K5m8M9n6L1L2J8o1L3mQ1r9l2O1k6k6O4m9J3O1n2j0N1o7
$$ 20 17 -40 -13 43 18 10 34 -10 15 -33 16 -40 -9 23 41 -20 13 9 90 -9 -41 20 -6 -32 32 -17 -4 57 5 -5 46 -21
6144b1J4j5M0j3L7m6J1k8j2L8j3J4j5j0Q4p0m4J7j1K4N5m4K0K9p8L4J8k4k7M6
$$ -21 -7 -22 18 5 42 -4 7 -21 -33 5 -8 6 -9 -19 65 -5 -49 -32 -43 -19 36 -8 12 41 -37 -3 15 -9 -36 10
6174A0j3j6L3Rj7K2k1k5L3j4OM1K2n1Kk6Pl0N1j1nL0o3K0l2nO8k6j3N1k8J9k4
$$ 10 -3 -19 14 23 6 28 7 -18 15 1 7 48 70 19 21 -5 2 -28 23 12 7 37 -26 -6 -38 -43 25 -1 -14 37 9 28 4
6207Dm1L5j5K7J6mk1K5k1K9n6KM8l7J9N5p9L5nPJ0Km9NjK4Pj3l1l2N6l1M9j1L
$$ 4 -37 -2 -17 10 26 22 1 26 5 34 -22 -20 28 -9 10 65 -14 21 16 23 33 35 -14 -9 -10 14 21 8 -23 -55 1 -30 19 8 11
6242A1L0o1k1P6m5RJ3l3nJ6J1k8K5k7K9K2k6JJ6j8K0k2j1L7Qm6KQ6m7n9M1M9m9
$$ 11 41 -20 -41 35 -10 -1 12 -21 -26 -10 1 -27 -2 -29 0 22 -4 -3 13 -5 15 -7 -18 19 27 -19 -17 69 22 -37 4 53 4
6275DL8k1k3l3K0k1L5n0nM6O0p7JL9n7L2M1QJ6l1k5o4P6ko2K7O4n1J4O1m3Ok5
$$ 4 42 21 -2 -35 -15 -36 -1 -51 -56 -10 50 -27 -26 13 -44 -12 29 37 53 22 -3 -67 9 7 -55 -28 36 -15 -1 60 17 23 -2
6308bnpJ9K7J4p0L7n4P7j5k0j0J8j2l7Q3n8N6l6Oj5Jj4jK4on5L1K9j4Oj5J6oj0
$$ -2 -7 -14 5 32 46 -24 13 -41 36 21 1 -9 9 -3 -40 43 -15 41 5 11 -4 -3 -17 -18 6 0 -55 -24 5 -9 -3 -18 -2 -8 -18
6343a8JK4j0J0K0k2Qk8N4j6n9O8j6K6l7jJ9m1nm2P8k6J5ok2J6M4Lj02N7mL6l5
$$ -18 -17 7 -3 7 27 5 13 -15 39 23 -36 32 16 42 5 4 23 -18 -23 -65 13 -13 2 -4 -26 -10 34 37 -65 -8 -12 24 -11
6376a1O4k0n6L7l2M0K6p0N1l3m5P6m7M3J4l9O6j6l9j6j2L5j1M9l0oo6K2J0K8k9
$$ -11 53 33 -23 14 -18 22 48 -22 29 -4 -49 27 -20 23 37 -2 64 48 9 -7 -19 16 5 54 24 18 -48 -26 -16 12 -17
6407a7j2M1l3j0M2NJJ7m9MK0M6p0K2k4k0K4lJ7k8L1J1l0k1M7k4jll0N9NJ5l7j7
$$ -17 -29 12 -21 -31 11 16 17 34 -15 -11 9 55 -15 7 -17 -37 -13 -16 1 -27 4 15 -15 -36 11 -13 -14 -17 -47 12 17 32 -5 -22
6441b2M2k1onj6N6l9K7L9o4N1r9L2L5L9n3K0Mq3O7J0j2oK0ol9pN1j1Pl1J3k6L6
$$ -22 20 -1 -7 -12 -28 28 -11 16 55 -9 42 -57 -25 10 49 -4 16 20 -63 4 14 2 -4 16 10 -29 -36 15 4 11 -20 -7 -33 3
6475CPj6n2M1KjP0o9K7m3N7o8kK7K5l1j8K5K1n5N9J6m7LO2l7j8k4J8N6l7k3N4
$$ 3 10 -6 -58 -17 -15 -16 54 -15 12 -31 26 -42 -44 -17 8 -23 -41 -16 5 -50 9 25 -22 -19 43 6 -12 -36 -18 38 1 -22 32
6508C2J8r4R7k9L6p6pP8p4k1K5M6o1L1l3L9oM2l3LKJ9Ko3O1l2Jq3O6M4%oRk4l7
$$ 32 50 -44 53 24 60 -16 -23 55 -19 -40 -15 31 -30 1 -32 7 1 43 10 13 15 34 36 -27 34 2 3 -80 -14 30 30 24 33 9 -28
6543b8J8Nj4O4l7K1j3k7j7K4Oj2J0l5QP2rl4L8k4m3J3J0K9o8M6k6L8j1k4K0J0
$$ -28 -10 -5 -19 45 8 29 16 -11 -28 -4 2 -10 0 -35 -27 45 36 2 40 16 -27 -14 -4 25 -43 3 -23 15 4 -20 0 10
6575A0JJ7K4q1K1J6N5n1k4l3K7M3j5j9jj4L5q1O4kj0K6J4j3pJ3Mm1Q1q4k0M0N
$$ 10 11 28 52 -29 -8 8 63 12 -12 -45 -18 25 10 -9 -10 -24 11 -70 -6 -8 -18 8 22 9 2 15 19 -22 59 -25 -45 -5 0
6608@JqMl1K9jN5j4pj9k2k2j7P0L8q4Q%J4q7J10kk4l0K6L0m4K0j2JP7q6M0p8L9
$$ 0 1 -7 -3 -34 -5 -6 49 35 28 9 -13 -35 -52 18 56 -28 -20 -20 -6 -93 17 15 -9 -39 -13 17 -27 -7 -19 -18 59 -27 13 -65 -26
6643b6N9m2L9m2rJ1M8k7kK4p3N6k4K4n6M6L5K2n3l6J6PJ2l4L5k5J7j7JMm1M6j
$$ -26 33 -9 30 -12 -21 -10 38 11 9 33 -40 16 -8 16 -40 6 41 63 10 -26 -10 -3 9 -25 10 -15 2 -15 -14 -10 -51 -5 -6
6676fM1m9k3O4J3k7m1j0K3M1n9J4L0m6N8K2k7o0J0J3j2L9nk5N3om4O8k3l1Q2p5
$$ -6 35 -14 -37 27 40 13 -28 -38 -15 26 -33 -19 11 -35 23 45 18 -42 -32 -19 -31 8 3 -22 31 25 -19 49 26 -5 77 2
6708Blk9J5K3J3l1P9m2n0M0k3J1J8k4K2l7N1J6q9J8O9m2L6k1l2k8OL4l5L7K2l1
$$ 2 -1 -30 -15 8 21 -10 69 27 -23 17 -6 5 23 -1 21 -16 35 51 -38 -20 49 7 43 22 -10 -38 -32 2 -33 4 26 -5
6740eR%jj4j5K2L2K6m6JM8m2k5J7m5K0P6p2j7M5k4k6J0K7K4k1k0N1q5M3J7j8P2
$$ -5 4 4 3 -11 -26 -4 28 54 8 9 57 15 -10 7 -38 -18 58 -14 -31 14 -10 -36 -26 1 25 4 -16 35 -50 -7 10 -8 64
6773F4r6O2K0J4j05O4j0J3k6L0m5jL7%j3j2K8Ln1K6N1r9N2j3k6k9O2K1J1o2O5
$$ 64 -32 30 50 64 -41 23 13 26 0 30 -15 -16 21 21 8 -4 24 27 -24 2 53 -46 6 -7 -33 -62 0 21 32 -30 35
6804C5m4K3m2M1Kk3M4rm4QL9k2J1n8J08%q1jl7P6m5N7j4l9kL1l8K6K2m6KpM3n9
$$ 35 -9 14 -28 13 15 -8 36 27 -17 -9 30 8 19 -39 69 69 -12 -13 -50 26 -19 38 24 -15 -17 14 -24 2 24 -22 -20 -27 16 -43
6838d3M0n5O7q7L7N3K6k7rkjl4O1k0ONo1K7N5qn9O8p2N1o5N4K4j1Jn0P3rn0N5
$$ -43 -3 -58 9 -78 -41 12 38 11 2 0 -1 -35 26 6 12 17 -44 -17 38 30 -29 39 -33 18 -47 7 31 20 21 -29 44 35 -15 40
6872D0m4J5K9l2K5%l5nJ6Pm9%J4K3k6lRkQj6O1o9J7pk9K8jM3N0n1J2mm1J9j3N5
$$ 40 -4 11 40 8 33 33 -2 -7 9 16 -33 -33 -19 4 -22 -25 -16 -18 -10 -26 35 -34 -17 -24 -53 -25 -26 17 67 16 28 24 -17 2 -11 44
6908D4l2j2joNj1jOj7J9l1M3k3P5q0J8K1k2K5l6J0K4m3PK1lJ6rj4l7K7j8K2l5
$$ 44 12 0 -1 -7 -2 -13 -14 -8 -25 -6 -37 6 -17 58 -22 -4 17 -5 20 -16 -6 18 -25 -18 3 0 16 7 -7 -44 -17 -35 -13 -48
6942d8L8L5kl0j5l8N4Oj4K6L7m5Lk8K6Qn4O1j2k8M2O3j08j6K7O3m4l8N8m4O2%
$$ -48 -10 25 23 -7 -22 -60 -6 0 -14 12 49 4 7 -21 5 13 -41 20 8 -20 22 85 -23 -39 -12 51 7 -31 27 -17 45 45
6974D5r2PK7Q6o8j1K5m3J10j14nQ1m1j7L4n3N5p6J8P3o7N5k5O3j02N0K1n4N1l4
$$ 45 -47 -40 -13 73 5 -6 19 -24 86 -28 -33 48 7 -10 24 -29 26 -50 -32 41 -26 29 4 67 -35 15 36 -18 33 -1
7004al3O8k1pJk1O7m1j8K3J0Nn9Pm2M8j2J9J1j3N3l9m1K4n2O5K1k9P0l3kk2J7
$$ -1 -34 34 13 6 7 -14 53 12 -6 17 27 32 -27 -20 -62 -14 -26 -7 4 -9 44 5 -36 -12 -64 1 22 -7 63 30 28 6 23
7037B3r4P8JL0n1M7k2K8n4j7O0p8M6K5l8J0j5J2K4m1kM9k3k6K3kj8j5M3%l2J7
$$ 23 -71 7 8 38 -13 34 12 40 -14 -31 29 -49 -3 22 -16 -6 -21 -9 15 -26 -28 21 -2 -28 -5 -7 -25 -40 3 3 -29 -12
7069a2L5l0J4J0k6j3J5kL4J4Nm1k3J9lqL3J6r5M2j7jL9j7l2P0m2K4J6l3J2j0L5
$$ -12 23 -7 7 17 -9 -22 -7 -9 25 39 44 3 -20 -1 -4 -12 21 37 -58 -16 -33 -34 5 -12 -44 26 -16 8 24 -9 3 -7 28
7102B8l9L5%n2N0NOo2j4jL0J5kk3O8k6l8L6oOJ1p8J00o5K3j9J8n0N1M7m8J0K5
$$ 28 -11 24 24 -28 22 27 33 -29 -43 -44 -14 1 -1 -24 44 18 -20 16 10 16 27 -51 49 -16 7 -12 6 -44 7 54 6 16 41
7135D1n8M7j6m0K4pM3k3m5pj3M9m9M6l1P1m7k3J8J6KJ1PnJ5k0j2j1J6k9M4J0m1
$$ 41 -17 30 14 -26 -2 -9 34 11 -34 -41 -54 -5 -54 -8 -39 32 -15 -38 -20 -4 -2 9 16 11 26 6 -6 -17 -1 -30 14 24 -17
7168a7N3m1J9n1K3K5PN5rm2l9L4j7K2l8M8o3M5Om6M8l9L5j0l0L5kK5p1J8Kl4N4
$$ -17 36 -5 14 -37 -14 11 18 73 64 22 -17 17 0 22 -16 32 -31 14 20 -26 22 -17 18 8 -22 13 11 36 -35 -17 -15 -49 5
7201El8NL0k9M9k6%j4L7Mk1N6j5j15J06k9j8N7j8l1j8J8L7p7RQ5n5j8L6l7J3m9
$$ 5 -33 -28 2 -27 22 -4 -4 -18 19 23 2 58 43 -72 34 5 -13 44 26 -5 -23 -5 32 -45 -36 49 -6 -24 12 -25 -12 -61
7233f1O7J2l6K2Jj4qm1M7MKMLJ6m6P7n5l5L5L3K4l4K4l8ONl8N4j12N3k1R4o4N4
$$ -61 6 18 -18 4 5 -9 -17 -58 -11 -7 -5 -1 2 18 -28 49 -6 -41 -6 27 51 17 41 3 9 14 -24 30 -82 -29 -50 44 -20 34
7267C4m3%Mkk9M9k2M1Jm9L7l3lrk9J9M0OlJ1n4M1l2M1lJ8k2m2P4o9N6j9J8m0L4
$$ 34 -9 -9 -5 -7 -36 13 -9 32 33 -16 21 -12 -15 -24 -53 -34 6 12 9 20 -34 7 -25 16 13 31 9 -33 41 -28 28 9 27 -13 21
7302B1l3J8M2r1L4N1p4Q6n8N3p5K6JnJ0l7P7n2Nj2k0N6l8M5m0nN8o7N5j9K5m7
$$ 21 -12 6 48 -43 -9 42 -32 54 -4 49 -26 0 1 -4 6 -31 46 -6 -1 -13 -33 23 -15 30 -10 -15 43 -24 31 12 37 -10
7334a0JK7Oj0Jk6NK4m3nL8jM4j17N0RM1l6l2K3K5j8m1NL1Kl4M7pRJ3m9%J6Jj8
$$ -10 -9 18 24 14 15 -11 -6 18 -25 -30 8 7 51 -66 -16 -7 34 -2 -34 -11 14 -4 -45 -40 -9 -7 -41 6 -1 8 21 -28 -28 -12 -11 -29
7370b9jP7n1j9PJ2m1O6mk6QMKL6p0k2N5m3O1K5m1J6p6P7ql0N3l3l8J1L1J2l5N9
$$ -29 -30 47 -4 -23 -16 -4 -45 21 17 -9 -1 3 5 41 -29 -51 4 -39 22 47 6 22 -54 23 15 -15 38 5 -33 -22 9 21 -14 45
7404D5q3K2J0k0O3n0K2j8n2M7M2j1om6P5j9j1k7j7J06n1l9K3k8RO2l2m3L0o0N1
$$ 45 -38 -16 -6 -26 37 -13 9 -9 -61 -14 28 17 11 -35 40 21 10 -17 -34 72 21 -18 5 -23 -14 48 16 -27 3 -57 -6
7435fNj8l4L2k1J6l3M0J5l0PK2k0k5P7m1L7K1o1K7k6kM0k9N0n9j1L2qM9n8KK1
$$ -6 -1 -19 -53 -21 -42 -26 -59 -19 -4 -34 -27 -5 -25 -50 27 -14 23 44 -17 10 -16 -18 22 -7 43 -16 -27 5 -3 46 -12 -10 11
7468A1J4pj7J5m8N8k1m6OM7J5K3o6j8J3LJJ6l4J7PM1o0pO8l2m6K1Lk1P4l6jo4
$$ 11 25 18 1 16 -32 26 5 -41 -35 12 27 50 -16 -34 -21 -18 -17 -1 -35 -18 -11 30 -30 -37 31 -1 -47 -26 -23 -44 30 -6 -7 -71
7502g1O3%RnmL0n1L5Lj8N2m5m5L8RK1j5ok3J4L1l7J9K1%j3J0o6L6L6J5n3k4j1
$$ -71 -8 -8 1 -4 -8 22 -29 6 9 -9 43 -2 -47 -9 0 21 6 0 -23 -9 22 -15 4 25 25 12 22 -44 -8 28 43 -10 -34 -45
7536d5K1K1j3j2L3J8Mk4JPJ5NJ2Qm4M5j3l9jk9M0k2N8l2j9rpM9l5K7qlok9K6j3
$$ -45 -24 -3 -16 -28 5 23 27 3 4 11 26 31 43 51 7 52 39 0 -1 -30 10 -12 46 14 -5 -14 -21 28 -7 20 12 9 3 -26 0 -13
7572a3l3OP8K6p5j5M2qj8J9k7%m3L6K5m2O8n5L0qj8M6m7K0O8p7j3K6K5k1Mlj9
$$ -13 -46 -40 38 64 -11 -26 16 8 -10 9 -18 -18 -61 -25 0 -42 26 -29 1 -7 -25 21 -26 -6 62 -15 -28 -2 23 2 6 3 -16
7605a6M9n1L4j7J9K8o4J2JKl5N0K7o7KJMQJ1jNj3k8L3k1Q0k4Jm7jk7R1n7L5j2
$$ -16 33 -18 16 -1 18 46 -18 -6 -5 -3 -38 12 39 -28 -26 -25 -21 -13 -2 -3 2 -11 -39 -6 -27 53 29 30 -17 -18 -45 46 -11 24 12
7640A2l3N0k3LRj8O0j3n1m4K7qPJ0L6o0K1J1J8No3lM7k2K4N6j11P3j3Kj7Mj2M8
$$ 12 -21 29 6 9 18 0 60 47 -4 -48 -21 -29 -22 -12 24 -36 -15 -4 14 19 -44 -47 0 -22 2 58 -53 20 7 9 -8 -4 -16 32
7674C2k0J9l3j7N5l9ql1O9n0K1On7N5j7oRQk2L9k9k1J0kM6J8Jl7j3j1j1N7KkJ1
$$ 32 12 31 -2 -19 36 -3 -11 -42 27 -23 -2 4 -53 2 -15 -21 -12 -4 -26 13 -16 -37 -27 -29 17 35 36 -1 -14 -25 -36 21 23 21 32
7709C2Nl7j8M5o3L2l4N6qk0K8n8O3j2K5m8J1K2j6MK5l3LK6j9k0J8rK6K9k5nn0
$$ 32 37 0 -18 27 -36 -4 -38 18 10 -10 18 -40 23 11 36 -12 -1 21 5 9 34 1 4 30 11 -9 9 0 26 55 30 25 -25
7742b5m3M8K8k9k4O5kk0j2j5PK4jJ9Mn8K7K7n7M0oL2J8k6Lj4K6l8pL6J3m0%m4
$$ -25 -68 -20 8 -21 -45 20 18 -2 -14 -29 -22 2 1 20 24 -34 -7 20 -37 3 -3 29 47 21 24 10 36 -2 -9 27 40 0 0 -44
7776d4L0K1Kj6qR6p0k3k5L4l6j2O1K9n7K6N0p7l3M6nl4K9j7L6RM4o6N0l2k1J8
$$ -44 -14 7 9 -7 -15 81 11 -12 -37 -3 -39 -51 10 39 -18 8 58 -19 -52 -6 -11 -45 -16 -33 3 12 56 -10 40 8 -13 5
7808ELK3o5L6ml3L2n4P5M8q8J4Jk6RM1J7Rn6J0J6l5j6L8j4K2j4l3RkM6qOl5M8
$$ 5 8 31 -34 2 -2 -35 -3 -57 18 66 -22 -8 -7 -33 -24 17 34 43 -13 -3 13 -22 -38 0 -14 8 -6 -39 -30 -32 14 6 12 -23 25
7843B5l3K9j8k5L4k1OK9l0oJ3J5k0N4p8J4J8K7j4Jl4M1k5m1qkM6k1PK2j7oj2N8
$$ 25 -8 21 3 -22 12 -9 -3 26 -4 -10 3 18 -2 52 -26 -12 6 33 19 20 -14 27 2 -39 -47 -49 -3 -24 -17 5 -12 -18 -30 28
7877B8n2L9Kl4N7l8K0K2l4Mj6ljj1J7KJ1k0nK2j8M3n6J0LRk3O3m5j7P3p5J4K3
$$ 28 -24 15 17 -17 40 2 22 44 10 14 -2 -5 -6 -17 0 2 13 -7 -12 10 -8 35 -21 -11 -8 1 -22 41 -4 -21 52 -23 -9 14
7911A4Pk1l4K7K2m2OM7m2m5O9J7l3lL2l3J5Nj2J8J6l7L0mJ6n5kJP6m4j0K2m4J1
$$ 14 21 0 -34 -7 15 -27 -21 26 -16 -61 8 25 -8 -11 21 -12 3 8 -4 14 30 -7 23 19 35 -20 -22 -21 55 11 1 23 -21 -10
7945a0K1j2l4L0M2p4j1N5k0J7j5k6Q2j02N4l1NJK1Pm7M0KK5l7J2K8m6J05r6O9
$$ -10 11 -1 -35 -5 37 -37 -48 7 -13 4 -11 -37 45 -57 -3 -34 -29 -28 -7 0 -47 -7 -5 20 -17 -5 23 -23 82 -14 55
7976E5m7nRk7NJ9k6L0M9j8n6qN6j8j4K0n2O2J5l2QM3p4L3k0J6J6nk8k6J5K8l1
$$ 55 8 3 12 -15 -10 9 -17 13 62 44 -12 -20 36 18 4 24 -28 34 49 17 25 68 -6 27 7 23 39 34 6 -20 -5 23 -8
8009h%m7M5M8p1Q1r6Q5m3pLN3m0nl3O6m2K0Pm9J00k4j9Ol6lPj0K8NL4n4m8QO4
$$ -8 -8 -55 -10 38 -33 48 -48 37 -6 -13 -10 43 3 -2 -35 31 -11 9 16 -33 67 43 24 30 -6 -9 -2 -12 16 21 55 1 -47 -39 25
8044B5m2J5k9k8M1j9M3oM3J0m6k7j5K0J8qK5k6l1N0M5o0K1l0K7n4N1PK2m8m4Q1
$$ 25 -17 -2 -31 -59 -18 -37 6 0 43 53 7 -20 -35 -15 3 -5 20 -6 -37 13 58 -2 19 -11 16 -38 13 20 42 -6 -50 31
8076C1n0N3l4j1MJ2J2K6J7l3p0N4j4OJ9q0N4M4Om9j0K2m7k4Q3j8J1LN8r1MM8o9
$$ 31 -19 34 0 -11 -7 5 17 43 60 27 -43 11 -3 3 22 -58 -4 40 46 -3 -13 9 -38 -62 21 3 14 17 75 -16 -12 36 -33
8109c3K3K6j2j9O2m9J2pl1N3jrJK5n7j5M3K2o7j0M3K1j9Mm8J6L2MK0k4j5j0N7
$$ -33 -10 16 4 -15 47 -2 10 3 -28 25 24 15 16 41 -16 -31 12 34 -33 -43 0 21 2 6 -42 -26 6 10 30 6 -9 -19 38
8142C8K1r8M9Ok0L4J2l8j6K9o0N2lJ0o6L6M9p2O2n5P0j9JqLJ0m1L2kp6P2RMPJ0
$$ 38 59 -39 10 16 -4 30 42 4 -12 17 -43 9 6 16 -50 -14 35 -37 25 -30 40 21 22 14 17 27 -14 18 16 -60 12 21 25 32 42
8177D2o9nPK8K0m6Q0n9K2o4L6K5M2l1
$$ 42 -27 -32 -25 3 23 -23 57 -2 20 -44 -8 17 59 28
8191B8
$$ Imaginary data points
##PAGE= N=2
##DATA TABLE= (X++(I..I)), XYDATA
0@%%%%%%%%%%%%%%%%%%%%lJ1j6J6j6J6j6K4l2L2l2M0m8M9n7O5p3Q3r1J04j17J28
$$ 0 0 0 0 0 0 0 0 0 0 0 0 0 0 0 0 0 0 0 0 0 -3 8 -8 8 -8 8 -8 16 -16 16 -16 24 -24 25 -32 33 -40 43 -48 56 -61 67
42F7j41J56j73J92k13K35k60K85l12L45l82M21m64N13n68O33p09P96q98J023j179
$$ 67 -74 82 -91 101 -112 123 -137 148 -164 181 -201 220 -244 269 -299 334 -375 421 -477 546 -633
63f33J380j652K038k628L670o036K1952L38k8972J0822j3274p740J9623P125o793
$$ -633 747 -905 1133 -1495 2175 -3861 18091 18429 -10543 279 -12995 -20735 -1112 6013 -780
78g80J6705O40j7110l866l897j0626J0302J2995L997N926j309j2831n847m389
$$ -780 15925 16565 -545 -4411 -8308 -18934 -8632 4363 8360 14286 12977 146 -5701 -10090
92a0090m398O092J0813P288N342l631j0176q793o281R58R394P617N647K365n302
$$ -10090 -14488 -8396 2417 9705 15047 11416 1240 -7553 -13834 -12876 -3482 4135 9782 12147 6845
107F845n589n081q742J62Q512M739Q817P191r920r029k278r661L24J4985K776
$$ 6845 1256 -3825 -12567 -12405 -3893 846 9663 16854 6934 -2095 -4373 -14034 -13710 1275 4051
122D051J314J0067o709j3352p8o083m418J5330Q209k834O411k670j4358j718o54
$$ 4051 5365 15432 8723 -4629 -4707 -10790 -15208 122 8331 5497 11908 9238 -5120 -6838 -7492
137g492n224R743J1151p25K749p94j2670o381J11p51Q452J0435P81o44l226r205
$$ -7492 -12716 -2973 8178 7453 10202 9408 -3262 -9643 -9532 -10283 -1831 8604 9385 8741 5515 -3690
153c690m298l15n70O799Q927K530M88m271j0054m805J32J626P560P304J129K0
$$ -3690 -7988 -8303 -8873 -2074 6853 9383 9871 5600 -4454 -9259 -9127 -7501 59 7363 8492 8512
169H512l929q769m274o92J338Q358P756O91q09m859q991k716R01Q67P284P232
$$ 8512 4583 -4186 -8460 -9152 -7814 544 8300 8991 8182 3323 -5668 -8384 -7483 -6616 668 7900
185G900L90m92m104r431l606J624J872P338P393n23k069l853q332l093K247J718
$$ 7900 8290 7798 3694 -5737 -9343 -7719 -5847 1491 8884 8361 6292 2439 -5893 -8986 -6739 -5021
201e021O240P337Q4k469m246q245l325L197K811N564O520l17k939l642p368l778
$$ -5021 1219 8556 8640 6171 1925 -6320 -9645 -6448 -3637 1927 8447 8130 5191 1549 -5819 -9597
217i597K882L524N720O373n99m161l876o353l102L184L779M771N875q5m383m117
$$ -9597 -6715 -3191 2529 8902 8303 4142 266 -6087 -9189 -6005 -2226 2545 8420 8335 3952 -165
233a65n829l380L116M958M925M613k87m495m666m853k469K652M816N100M187o32
$$ -165 -5994 -9374 -6258 -1300 3625 8238 7951 3456 -1210 -6063 -8532 -5880 -1064 4036 8223 7591
249G591m451m863m922j779L167M846M862L546j007m229m771m750j453L356M976
$$ 7591 3140 -1723 -6645 -8424 -5257 -411 4451 7997 6990 2761 -2010 -6760 -8213 -4857 119
264A19M661L228j209m677m790m176j064L572M922M353K990j473m791m743l882
$$ 119 4780 8008 6799 2122 -2668 -6844 -7908 -4336 586 4939 7929 6456 1665 -3078 -6960
279f960o55L738N036M104K443j690m938m611l279n89L864N204L871K050j831n140
$$ -6960 -7615 -3877 1159 5263 7706 6016 1078 -3533 -6812 -7401 -3537 1667 5538 7588 5757 617
295F17m625k812j30L735N376L702J348k052m820m769k446M00L741N158L699Q88
$$ 617 -4008 -6820 -6950 -3215 2161 5863 7211 5159 339 -4430 -6876 -6476 -2735 2423 6122 7010
311G010k295m814m466k417P53L961N169L293N40k525m750m304k024R81M114N037
$$ 7010 4715 -99 -4565 -6982 -6229 -2268 2901 6194 6734 4209 -541 -4845 -6869 -5888 -1774 3263
327C263L129P0k818m566m232j661J488M003M769L093j28l161m694l970j318J833
$$ 3263 6392 6462 3644 -922 -5154 -6815 -5327 -1324 3445 6538 6410 3249 -1445 -5415 -6733 -4900
343d900M104M505K700l71l115m733l760r69K012M137M473K527q09l503m529l475
$$ -4900 -796 3709 6409 6038 2923 -1810 -5570 -6539 -4527 -390 4083 6610 5801 2298 -2231 -5706
359e706o77K420L967M111K474q81l918m480l106m61K619M309L736J817r13l898
$$ -5706 -6383 -3963 4 4115 6589 5708 1790 -2690 -5796 -6257 -3638 671 4407 6224 5311 1413
375A413m442k777k20K644M437L785J439j347l916m449k532K82K810M314L545R62
$$ 1413 -3029 -5806 -6026 -3382 1055 4840 6279 4932 1016 -3433 -5965 -5683 -2873 1441 4986 5948
391E948j388l662m522k518O39L017M355L532M33j988l372m206k459J077L125L850
$$ 5948 4560 898 -3624 -6142 -5503 -2486 1869 5401 5834 3846 474 -3732 -6191 -5114 -1989 1861
407A861L528Q11k726l756l568k385J055L996L636K502R09k368m190l310j977P56
$$ 1861 5389 6200 3474 -282 -3850 -6235 -5180 -1184 2452 4954 5863 3495 -695 -4005 -5982 -5226
423e226M048M409K180n9k290m286l232r61R96L191M466K399m49k368m021l797
$$ -5226 -1178 3231 5411 5352 3062 -1224 -4456 -5417 -4421 -1230 3236 5635 5186 2818 -1203 -5000
439e000p27J926L158M060K406j009k807l265l473j063K139L291L741K851j191
$$ -5000 -5727 -3801 -643 3417 5823 4814 2007 -1258 -4731 -5794 -3655 -364 3377 6228 5037
454E037l831l187k787r71K751L506K523K488l43m011l533k132j276K258M739K860
$$ 5037 1206 -1981 -4768 -5739 -2988 518 3041 5529 5186 1175 -2358 -4490 -5766 -3508 1231 4091
470D091J241n28l888m085j458k15J713M192L232Q13p44l157m484k154O86K441
$$ 4091 5332 4804 916 -3169 -4627 -4842 -3129 1063 4295 5108 4364 1207 -3277 -5431 -4745 -2304
486b304L635L156O76j725k842l437k487M91K826L265L139J485k235l929l148k084
$$ -2304 1331 4487 5163 3438 596 -2841 -5328 -4837 -2011 1254 4393 5878 3643 -286 -3434 -5518
502e518P56L998L085J301J347j378m114k686j568m80L712M607J447L66j551m599
$$ -5518 -4762 -764 2321 3622 4969 3591 -523 -3209 -4777 -5257 -1545 3062 4509 4875 3324 -1275
518a275k745k52J37K618M478J460n5p85m468l972k9J184K728M641J419j578j363
$$ -1275 -4020 -4272 -4135 -1517 2961 4421 4366 3581 -887 -4859 -4888 -3704 -976 3665 5084 3506 2143
535B143k859l464l56J188K024M080K939j104k764l363l183n34K576L173K515J460
$$ 2143 -716 -4180 -4536 -3348 -1324 2756 5695 4591 1827 -1536 -4719 -5253 -2677 496 3011 4471
551D471l73k529l158k297j065J260M153L610P29p81k800m035j420N68O67L123
$$ 4471 4098 1569 -1589 -3886 -4951 -3691 462 4072 4801 4020 1220 -2815 -4235 -3667 -3000 123
567A23L668O01n26j826m872k603J436J531L135M189j59k384j274l258k729J416
$$ 123 3791 4392 3866 2040 -2832 -5435 -3999 -2468 667 4856 4697 2313 1039 -2219 -4948 -3532
583c532J525J910M260J330k627k260l279k982J829L074J677K876J166k583k277
$$ -3532 -2007 -97 4163 5493 2866 606 -2673 -5655 -3826 -752 925 3801 4967 2384 107
598A07k146k987N32L501K564K498J166k807l556j873j238N48K871K621J738Q96
$$ 107 -2039 -5026 -4494 -993 1571 4069 5235 2428 -1128 -3001 -4239 -3691 -820 1801 3539 4435
614D435j335l476l212j262J090L004L579J841j019j988k294k767r85J603J876
$$ 4435 3100 -376 -3588 -4850 -3760 -756 2823 4664 3645 1657 -637 -3404 -4389 -2786 -910
629i10K695L084m65k824k413l005j345K802K803J622K373m02l146j769k120k182
$$ -910 1785 4869 4404 1580 -833 -3838 -5183 -2381 422 2044 4417 4015 869 -900 -3020 -5202
645e202K315L576J681K191o8m104k540q68j477J863L794J274J195P48l405l419
$$ -5202 -2887 689 2370 4561 4493 389 -2151 -3019 -4496 -2633 1161 2435 3630 4378 973 -2446
661b446q93j017J446M336J922K08J15k895l626o85P1R47L470K666J43o61k275
$$ -2446 -3339 -4356 -2910 1426 3348 3556 3671 776 -2850 -3535 -3464 -2517 953 3619 3762 3101 826
678H26l451j586P13J790K796K486M80j495k432k439j618J80K399K810J909R16
$$ 826 -2625 -4211 -3498 -1708 1088 3574 4054 2559 127 -2312 -3930 -3750 -1351 1459 3368 4284
694D284j465l354k212j068J45K704L105R04O69r33l381k182o97l96K580L957J041
$$ 4284 2819 -535 -2747 -3815 -3670 -966 2139 3043 3712 2779 -602 -2784 -3481 -3877 -1297 2660 3701
711C701k19r02l664k454M36J72J671L738J314p05o36l142l283M45J016J577L537
$$ 3701 3482 2580 -1084 -3538 -3102 -2930 -1259 2479 3793 3088 2452 -690 -3973 -3528 -2512 -935 2602
728B602J515j331j203k219k978j87J631J605K852K083j149k170k233k306k89J777
$$ 2602 4117 2786 1583 -636 -3614 -3801 -2170 -565 2287 4370 3221 1051 -1182 -3488 -3777 -2000
744b000K091K244J537o94k179k552j857k98J586K553K425Q00p75k036k723j602
$$ -2000 91 2335 3872 3178 999 -1553 -3410 -3708 -2122 431 2856 3656 2881 845 -1878 -3480
760c480K28J303K445K565O40j015j932k862j717P35J589K167K462N11j293j739
$$ -3480 -3252 -1949 496 3061 3701 2686 754 -2108 -3825 -3090 -1501 666 3128 3639 2346 607
776F07k579k002P81K042K003K332N14j701j883k056j853O71K197J975K028P39
$$ 607 -1972 -3974 -3193 -1151 852 3184 3698 1997 114 -1942 -3795 -3124 -927 1048 3076 3815
792C815j880k214j845j575N74K597J998J505N51j614k457j866j071N06K391K374
$$ 3815 1935 -279 -2124 -3699 -3125 -528 1470 2975 3526 1912 -545 -2411 -3482 -2976 -585 1789
808A789J491L8j597k396j938q10P42K234K268J472l8j819k342j758p75J024K295
$$ 1789 3280 3318 1721 -675 -2613 -3423 -2681 -447 1821 3293 3255 1436 -906 -2664 -3439 -2415 -120
825a20K105J334k45j842k358j556o32R38K412K177J114l83k015k310j475l05J115
$$ -120 1985 3319 3074 1232 -1126 -2682 -3314 -2376 36 2213 3327 2944 929 -1381 -2856 -3161 -2046
842b046K266K038J123n34k089k278j425k14J388K304J785R80n56k162k302j204
$$ -2046 220 2258 3381 2847 758 -1520 -2945 -3159 -1771 533 2318 3298 2742 580 -1722 -2926
858b926j20J351K421J858O19p72k016k262j246K37J480K210J793M96q19k075k231
$$ -2926 -3046 -1695 726 2584 3203 2431 415 -1847 -3093 -2856 -1376 834 2627 3123 2304 229 -2002
875b002j072K67J658K228J562M09r06k139k115j005M71J693K218J506K08j088
$$ -2002 -3074 -2807 -1149 1079 2641 3050 2144 5 -2110 -3115 -2644 -951 1267 2773 2981 1893
891A893k061k107q33N82J801K185J402J05j243k087j950o93O62J724K266J182
$$ 1893 -168 -2275 -3108 -2526 -725 1460 2862 2967 1724 -363 -2313 -3006 -2344 -620 1646 2828
907B828p2j162k149j973m86Q32J774K282J202n80j415j719j861m66R86J673K128
$$ 2828 2756 1594 -555 -2528 -3014 -2182 -408 1874 3076 2496 1081 -638 -2499 -2965 -1979 -306 1822
924A822J350m72j778j902j633l79J272J926J622J056l64j729j847j380n86J154
$$ 1822 3172 2700 922 -980 -2613 -2992 -1720 206 1828 2884 2520 791 -1056 -2436 -3022 -1868
940a868K339J679P72m76j965k057q66j93R25K149J808M77k99j739k451j029L31
$$ -1868 471 2150 2922 2446 481 -1576 -2442 -2635 -1710 439 2247 2724 2425 686 -1765 -2794 -2463
957b463J019K073J981P7r18j192k171j286N54J099J579K229N38j416j564j843
$$ -2463 -1444 629 2610 2687 1769 577 -1594 -2880 -2326 -1227 352 2581 3119 1703 139 -1704
973a704j374O47J866J393J408P14j349j812j296j262J02K039J846J085O33j217
$$ -1704 -3078 -2431 -565 828 2236 2950 1601 -211 -1507 -2769 -2667 -628 1218 2303 2936 1719
989A719k394j358l93J05J792K085O73K00o00k289j887k09L63J595K450Q95o56
$$ 1719 -675 -2033 -2426 -2321 -529 1556 2229 2429 1829 -460 -2347 -2556 -2193 -598 1852 2747 2091
1006B091q79j746j822n9P87R32K069J554o29j226j605k018m46J708J480J302J279
$$ 2091 1212 -534 -2356 -2415 -1628 -696 1373 2927 2298 1072 -533 -2551 -2997 -1289 191 1493 2772
1023B772n41j724j192j270j033J317K001J183J217j15k263j833n62m57J003K163
$$ 2772 2231 507 -685 -1955 -2988 -1671 330 1513 2730 2615 352 -1481 -2043 -2500 -1497 666
1039F66J074L50K83j531k327p99j56P19K433J771j30o54j220k106p12M96N39J533
$$ 666 1740 2090 2373 842 -1485 -2284 -2440 -1721 712 2483 2353 1699 479 -1627 -2339 -1843 -1304 229
1057B29J980L27p66j191k141j452Q89J488J442J497J63j229j141j177j437J88
$$ 229 2209 2536 1770 579 -1562 -3014 -2125 -637 805 2302 2465 1236 95 -1082 -2519 -2331
1073b331J573J466J564O59j419k107j206n94L75J805J337N92N18n54j897j512
$$ -2331 -758 708 2272 2931 1512 -595 -1801 -2395 -2020 -215 1122 1714 2232 1678 -219 -1731
1089a731o58K8J682K467O74m29q05j927j438J80L98Q41J975J243m51p89j660k085
$$ -1731 -2389 -2361 -679 1788 2462 2033 1228 -699 -2137 -1957 -1559 -718 1257 2500 2049 1260 -400 -2485
1107b485j2J169J169J626R67o83j019j065j627n56J080J290J561J323n22j812
$$ -2485 -2497 -1328 -159 1467 2434 1751 732 -333 -1960 -2516 -1436 -146 1415 2738 2216 404
1123D04j403j197j36J239J428J036P79j41j483j405j107m80J083J909J324M73
$$ 404 -999 -2196 -2332 -1093 335 1371 2150 2009 526 -879 -1986 -2466 -1383 526 1850 2323
1139B323m36j541j693o79J08P28J559J429L93m55j187j936j117N57J091J457J487
$$ 2323 1887 346 -1347 -2026 -1918 -1190 369 1798 2191 1736 549 -1387 -2504 -1947 -856 601 2088
1156B088J88j061j081j246j218L47J277J155J428P06j166j578j237j028L67J789
$$ 2088 2276 1215 134 -1112 -2330 -1983 -706 449 1877 2583 1417 -161 -1398 -2426 -2059 -270
1172b70J267P50M67r53j582r77p84j9J627J600Q33K37r31j811j094l98L08J396
$$ -270 997 1747 2214 1261 -321 -1298 -2082 -2101 -474 1126 1959 2196 1265 -546 -1640 -2038 -1730 -334
1190c34J529P15O1p60j706j377l54O21J404J619P09l84r68j269j195m18P18J264
$$ -334 1195 1910 1971 1211 -495 -1872 -2226 -1605 -201 1418 2127 1743 775 -494 -1689 -2107 -1389 -125
1208a25J282J077j56j474j394r55m84R11J642J023N46P2j407j549o53m30N75J863
$$ -125 1157 2234 2078 604 -790 -1745 -2229 -1318 324 1347 1893 1965 558 -991 -1644 -2074 -1499 364
1226C64J321K26j17j283j765n50Q7M54J538J477K23l85j025j734r81M37P59J303
$$ 364 1685 1911 1794 511 -1254 -1804 -1717 -1263 275 1752 1975 1590 565 -1169 -2150 -1713 -954 349
1244C49J488K14o73j090j471r20M29R42J209J228L58p49j221j332q00K39J163
$$ 349 1837 2051 1378 288 -1183 -2103 -1674 -732 477 1705 2063 1314 93 -1239 -2039 -1800 -637
1261f37J396Q97L45o73j521j229n44K37J134J604P60Jn03j415j443k72L36R19
$$ -637 759 1656 2001 1328 -193 -1422 -1966 -1729 -595 1009 1769 1770 1267 -148 -1591 -1863 -1527 -608
1279f08J646R22k82o01j241j557l05P97Q76J394J042m50q44j012j420m25Q42J056
$$ -608 1038 1960 1678 1077 -164 -1721 -2026 -1229 -353 1041 2083 1633 789 -223 -1643 -2068 -1226 -170
1297a70J207R88k84j129j113j018n10Q37J251J059P82j56j170j229r74l11P38
$$ -170 1037 2025 1741 612 -501 -1519 -2029 -1192 59 1118 1900 1744 574 -655 -1629 -1940 -1202
1314a202J403J090N92l12j103j262q59q6O58J271J249M77m73j019j322q93N7Q54
$$ -1202 201 1291 1883 1571 468 -794 -1653 -1739 -1081 190 1439 1916 1443 424 -898 -1791 -1734 -880
1332h80J131J183N37o26j070j221r20J88R36J146J032M27n65j209j095p57J00
$$ -880 251 1434 1971 1345 275 -946 -1866 -1678 -742 404 1436 1863 1298 89 -1006 -1763 -1663
1349a663J036J207R13L76o68j262j035o95J90J090J204P90K98n95j376j027n28
$$ -1663 -627 580 1493 1869 1201 -61 -1096 -1791 -1601 -511 693 1483 1781 1186 -190 -1217 -1745
1366a745J72J153J194P57K32p58j305r94m74L68J082J256O07O5o73j315j013l46
$$ -1745 -1573 -420 774 1531 1763 1005 -300 -1294 -1768 -1400 -318 938 1545 1610 937 -378 -1391 -1737
1384a737L81J157J243N35l3p70j242r83k48M59J122J183O37k21q35j198r47k19
$$ -1737 -1356 -199 1044 1579 1546 776 -466 -1449 -1697 -1238 -116 1067 1704 1483 648 -550 -1497 -1716
1402a716O39J146R96O63k98r48j094p97k37O21J202R34N18j57j044j250o82j18
$$ -1716 -1077 69 1065 1728 1430 482 -612 -1409 -1646 -1025 177 1111 1629 1472 428 -822 -1504 -1622
1420a622O54J308R46L23k21j010j275o55M3N87J253J083J67l75r10j273o45K43
$$ -1622 -968 340 1286 1609 1388 378 -897 -1552 -1509 -922 331 1414 1581 1206 296 -977 -1622 -1379
1438a379O84R72J150J94n61q77j128p74K88R18J032R19K59p88r57q79o64J93R64
$$ -1379 -695 277 1427 1621 1060 183 -945 -1719 -1431 -513 519 1438 1697 909 -48 -927 -1591 -1398 -434
1457d34J027Q10K36o21j248q49m09J89R46J138N68J41n09j258r83k54K23Q97J376
$$ -434 593 1403 1639 1018 -230 -1079 -1488 -1299 -353 785 1353 1494 985 -273 -1256 -1510 -1287 -390 986
1476I86N59j97n88j116r55j71M36O88J160P49j77o80r62j186j84P17Q52R86O78
$$ 986 1545 1348 760 -356 -1311 -1482 -1046 -358 802 1551 1374 694 -268 -1454 -1638 -921 -69 917 1595
1495A595k85r42p53q11m61O74J034Q55P25j04j195j069n13k53O32J130P17L65
$$ 1595 1310 368 -385 -1196 -1657 -983 51 906 1631 1527 332 -737 -1250 -1503 -871 259 976 1341
1513A341pr07j161n77j45M76J292J013J00l56p77j218n35K87M26Q83J118J54m45
$$ 1341 1334 427 -734 -1311 -1456 -980 312 1325 1425 1069 292 -926 -1461 -1174 -748 135 1253 1407 962
1532I62n57j238q59L91P83Q72R66J81p97o48p35p96K00R17O50Q69O21q06j100
$$ 962 405 -833 -1692 -1301 -518 354 1320 1501 704 56 -679 -1475 -1275 -358 292 1161 1782 976 -124
1551a24p83o15J72J218Q72K51L55m42j110o35m69j87J047J334L91Q0m48j292q87
$$ -124 -907 -1522 -1350 -132 740 991 1346 904 -206 -841 -1310 -1497 -450 884 1275 1355 907 -385 -1272
1570a272J33J89N45J174N10j63k18r37j354r0O03O74J119P09o21p28m25r53l53
$$ -1272 -1139 -950 -405 769 1279 1116 898 -39 -1393 -1483 -880 -206 913 1622 1001 273 -152 -1105 -1458
1589a458O89O54P73J015l01j160p04o43m57Q75J086L99M60M0j018p89l41n60L61
$$ -1458 -769 -115 658 1673 1372 212 -492 -1135 -1592 -717 369 768 1228 1268 250 -539 -880 -1440 -1079
1608a079J395O88K11N6r73j302m2O2R9J129Q53m9j0m45j441o24M13L23R64J219
$$ -1079 316 1004 1215 1271 298 -1004 -1046 -984 -885 244 1097 1048 1038 593 -848 -1472 -1059 -736 228 1447
1628A447j25o86m22q81q01N27N62M15J051M76q06p38o59r49L40J122N88M72M90
$$ 1447 1322 636 214 -667 -1468 -941 -379 36 1087 1563 757 19 -640 -1589 -1249 -127 461 933 1423
1647A423o61j028l75n30j75J041R97L26L10l56j393n92mj1P11J122K71q4j28j012
$$ 1423 762 -266 -641 -1171 -1346 -305 692 1018 1328 972 -421 -1013 -1017 -1028 -317 805 1076 992 864 -148
1667a48j003k8J92O22J256M67m70l19p62r61q0N48M61Q51P80l67o71n73r22l22
$$ -148 -1151 -1179 -987 -365 891 1358 888 569 -193 -1154 -1234 -686 -225 626 1406 1039 368 -205 -1127 -1449
1687a449P79Q00N42O17j78r37n67n36l79M71J013N85M43m6r23q60l97r1L88J065
$$ -1449 -670 130 672 1289 1111 174 -393 -929 -1308 -837 176 761 1204 1158 235 -625 -1022 -1113 -725 340
1707C40N90K16k00n82r27n93J06L16R36R22J28m42o60q59m57K10N29O44O65K84
$$ 340 930 1146 946 364 -563 -1156 -1050 -734 202 1124 1252 810 150 -709 -1166 -956 -427 217 882 1166
1727A166l19p14p95n43J28P11P70O15K09n29p59o52m18J17O24Q22N73J94n06q43
$$ 1166 847 133 -662 -1205 -1077 -366 404 1019 1228 699 -60 -712 -1130 -1013 -389 433 1006 1200 694 -149
1747a49o43l35K25O33P47N29Q9m40q23o99k54K30P00Q04M81n9n34q01n77k01K83
$$ -149 -792 -1127 -902 -269 478 1007 1096 656 -167 -866 -1120 -890 -190 614 1095 1036 502 -299 -876 -1077 -794
1768g94O17Q06L88K9n40q54o10j70L38P68P18L23q0m16r18n93j8K27P95Q17K69
$$ -794 -177 629 1017 1046 506 -348 -958 -1128 -790 -22 696 1019 939 523 -395 -988 -1006 -779 16 833 1102
1789A102k67n15p76n70K9L92O12Q01L09k87o06o45o00nN28O49N94L83l04o80o93
$$ 1102 835 320 -456 -1026 -997 -605 7 808 1117 830 224 -421 -1021 -1026 -498 151 745 1128 824 144 -549
1810e49m14p7N64P50O08J50k66o44p51k84o0M98P70N92J89l36o91p39l52K16N35
$$ -549 -963 -1040 -476 274 882 1032 766 122 -629 -913 -973 -475 295 887 1076 740 49 -690 -1042 -826 -291
1831b91O64N84ol44n37p88l15K28M70Q00N13k4m07o27o23l61L03N81N65O24pn15
$$ -291 373 957 951 607 70 -718 -1033 -805 -335 465 978 954 547 -80 -703 -1064 -761 -180 385 1009 1002 487
1853D87o78n84l01K95P18N82M23J1m74p13n40k44L18O36O21M42j07n12p17m79
$$ 487 -191 -775 -1076 -781 -63 519 942 953 479 -234 -774 -1018 -700 -64 557 999 892 380 -337 -816
1873h16j30L20O58N90L52j23n35o83m97j18M25O65N62L07j48n97o23m84q3L82
$$ -816 -946 -626 32 622 974 851 316 -367 -864 -982 -557 108 670 977 829 232 -391 -875 -958 -576
1893e76O88O34K42j91o09o63m46PM05O90O05J63j86n74p63l39j1N25O21N46K24
$$ -576 112 746 988 797 188 -475 -921 -914 -509 181 786 949 763 189 -574 -913 -924 -399 222 768 992
1914I92l43n54o61l05RM93O32N29J80l77o23n64l56L2O45O14M34J50l32o95n70
$$ 992 649 95 -566 -871 -862 -369 263 792 972 595 -28 -592 -948 -916 -271 343 777 927 595 -100 -670
1935f70j74Q3N72O79K56J18k94p20n47j79J51M93P86L17q3k99o47o02p4K65L66
$$ -670 -844 -761 -189 490 746 864 570 -150 -697 -876 -725 -232 554 871 788 489 -158 -760 -834 -569 -203
1956b03O79L89j53k89o02n99j79L97N02O11L90j92m80m89m40k82M23N38M40M32
$$ -203 476 865 712 423 -179 -778 -957 -560 -58 553 943 751 271 -218 -658 -940 -517 21 461 893
1976H93o0o03n72l31k33L53P47L83J95M5n89o86k79o5K18P43N88K6l6n07p27k97
$$ 893 833 230 -342 -673 -906 -553 194 577 772 817 228 -458 -737 -802 -584 159 747 773 737 230 -497 -794
1998g94J43J69O09N81J03k49l43o55m82J55M39N11O35J16m75m21m59m70J34M86
$$ -794 -651 -482 127 708 811 562 219 -436 -918 -763 -324 187 822 938 463 42 -417 -887 -753 -267
2018b67L89N43K95m40n75m78l61Q9O72N07K67J99l29o16m09k11n6M94O91K97P2
$$ -267 122 665 960 520 -55 -533 -894 -805 -133 374 641 840 511 -105 -514 -725 -781 -287 404 701 773
2039G73k54p21n80K7J87L73O61K71j01j22o23o06j02K69L69N85N17k87l84l82
$$ 773 519 -202 -782 -755 -568 -195 466 737 636 514 -109 -715 -817 -548 -179 406 923 636 252 -130
2059a30m96k05M35K98M24N48r2n70m22m59j88L60P01K80K39l7n13m69k14k91J79
$$ -130 -626 -831 -396 -98 326 874 782 212 -210 -669 -857 -497 204 484 723 686 173 -296 -510 -801 -622
2080f22O95L87L41J3o51p13j49N1J75O32M51j1K1l39o74l70J02K08N64O39K5l29
$$ -622 73 460 801 814 163 -550 -699 -648 -473 159 610 599 620 281 -393 -763 -661 -453 111 750 775 446
2102D46k97n79l36J87L77K31N65K91l56m68m48m73M0P42L43L13K00l91n31k01
$$ 446 149 -430 -766 -579 -202 29 594 885 529 61 -387 -860 -820 -78 265 578 778 387 -144 -345
2122c45l48m2M63N98K66J87k34p35m85mJ37M06N28J98j5j32m88n78o5J10L34O93
$$ -345 -693 -735 -272 326 592 779 545 -190 -675 -679 -542 -136 392 590 575 443 -45 -623 -688 -578 -244 449
2144D49L45k28k91m40m74m8K83K81M42M37q6l69m18n31j75L75N21K71L65o7n29
$$ 449 794 566 275 -165 -639 -687 -404 -123 319 756 670 301 -117 -648 -823 -448 73 344 709 642 113
2165A13l06l58j83K32N89L77K60j1n21n87k18J1J54O16M11k2K3l15o24k61L1J20
$$ 113 -193 -551 -734 -502 87 464 724 713 192 -395 -613 -602 -448 168 579 557 580 265 -359 -620 -589 -469
2187d69N56N39J5j10l36o10k67J55K41L30N42J43l49k81m27m32J50L79M23L80
$$ -469 87 626 641 531 195 -415 -682 -527 -286 44 586 729 380 99 -328 -760 -610 -231 192 572
2207E72J59l70m05k68l55J12L55M25K82J83k09o16l28j24l9M95M60J95J48k24
$$ 572 731 361 -44 -312 -667 -555 -200 225 507 690 481 -135 -463 -587 -626 -131 329 524 672 448
2227D48n36m00r1N5L17O27K01n2j92n03m79l5J80K87N06L42j03k61l93m66j04
$$ 448 -88 -488 -579 -524 -207 420 621 569 377 -126 -605 -640 -460 -173 333 675 572 311 -82 -548 -652
2248f52K41L22M05L44j07l34l67m06j58L59L62L62K71r8l84l40l55q8K49M99L01
$$ -652 -411 -89 316 660 553 219 -148 -554 -712 -353 9 371 642 544 160 -180 -535 -623 -374 125 426
2269D26J49Mm55m59j98p1K31N58K81Q6m6l72m28k53L2J41N12L76L9r8l15m85k42
$$ 426 575 579 124 -335 -533 -604 -373 185 466 552 506 134 -294 -547 -515 -374 138 514 553 455 140 -345 -587
2292e87J02J42N16L88J6k07k88m52k43J40K06M02M17Q9k50l78l15k91J23K87L66
$$ -587 -485 -343 173 561 577 370 82 -370 -613 -473 -267 135 552 641 391 13 -302 -593 -470 -183 183
2313A83K83J43k83l80k71k35K9M23L90K35O3k73m13l51r9Q8L60M17K07O7l09l95
$$ 183 466 609 326 -54 -325 -560 -531 -108 282 517 580 307 -106 -457 -556 -468 -108 309 516 583 274 -121
2335a21l02j56J42L41M67K14o0k63m17l30q2J63L52M03K95j97k38m11l04p8K43
$$ -121 -423 -579 -437 -96 371 585 525 262 -155 -485 -567 -404 -52 351 646 449 211 -200 -504 -582 -339
2356c39L79L91J14n1l59k76l57o0K53M08L10J04Jl99l60k78l9K88K79L90J79j57
$$ -339 40 431 545 494 135 -141 -498 -558 -305 103 413 517 518 119 -241 -519 -558 -270 9 399 578 421
2378D21l03m12k60K4K87L22L18J65j72l36l72k14O2K02L97L20J13k38l09l14k58
$$ 421 118 -294 -554 -530 -243 79 397 562 390 54 -318 -532 -470 -268 129 449 562 324 15 -299 -557
2399e57J18K74L59L25M5k38l34l32j99N5L25L86K57K2k15k97l77j58J27K93L39
$$ -557 -439 -165 194 519 564 326 -8 -340 -539 -484 -159 227 484 506 291 -6 -383 -541 -414 -121 218
2420B18K59L7k76l36k83j70J66K84M05J82n4j31m05l07r1R8L74L41J64Kk29l55
$$ 218 477 514 238 -98 -381 -551 -385 -101 304 486 432 301 -104 -411 -502 -404 -30 311 475 477 248 -107
2442a07l02p5J89L18K54J99jk97l16k90j30K46L94K62J34o6k50l43j91q2J55L50
$$ -107 -409 -484 -295 23 277 476 475 178 -138 -428 -558 -312 82 344 478 412 162 -181 -372 -454 -299 51
2464E1L13J53j11k99m17j36K9K19L44K46P0j80j93l08k58qK80L28L06J22k52k52
$$ 51 364 517 406 107 -310 -446 -417 -198 146 392 462 282 89 -219 -477 -485 -205 123 429 551 299 47
2486D7l24j90N7K36K81K63J96k25k76l86k17J12K78L31K03J05j75l51k09j26n3
$$ 47 -277 -467 -410 -174 107 370 566 341 65 -321 -538 -426 -148 183 386 491 316 -35 -244 -370 -423
2507d23K65L59K37L2j47l83k71j29J07K62L28K17q4p5l46l16j04J06K72L28L19
$$ -423 -158 201 438 470 323 -60 -331 -460 -353 -91 237 454 370 295 -51 -367 -471 -365 -93 235 554
2528E54j86k01k48l04r2J97K42K72J99M6k98l04k61j25K56K59K86J47ql13k72
$$ 554 368 167 -81 -385 -477 -280 -38 234 433 479 181 -123 -384 -509 -253 6 292 439 431 118 -154
2549a54k02r3J13L72K41J49j0l42l10j25n1J35L59K34P1l1k19m18j23PN4L21M31
$$ -154 -356 -449 -336 36 277 426 416 74 -236 -361 -412 -277 82 316 387 356 137 -281 -404 -397 -343 -22 409
2572D09L5j12k27l60j80J17J49J85L15J37k32j79k46k97Q8K59K08L16J03k55l01
$$ 409 444 332 105 -255 -435 -318 -169 16 331 468 236 57 -189 -486 -398 -139 69 385 488 233 -68
2593f8j33k19N9K86K36J62J99k15m01j72j61K0L13L64R5j0m8l26l13l4N0J25M32
$$ -68 -201 -420 -361 -75 161 323 522 307 -94 -266 -427 -407 -94 270 365 355 307 -19 -332 -366 -316 -191 241
2616B41K20q3k08k50l22NJ54J90K41K81j47j11k30l50r5K22J87L35J69j39k55
$$ 241 461 378 170 -80 -402 -397 -243 -53 188 469 322 211 -19 -369 -464 -242 -55 280 449 310 55
2637E5j12k41q1J69K18J27K43O2l15k87j44j28J54L82J86O7Pk70l19r2m0O2L36
$$ 55 -57 -298 -379 -210 8 135 378 440 125 -162 -306 -434 -280 102 288 355 362 92 -227 -319 -359 -297 39
2660C9L16N2j10j88l27j64L3J91J93L46Pj48j40k92k63O4K61K12K99J2j86j72
$$ 39 355 407 297 109 -218 -382 -349 -158 35 381 388 240 100 -192 -455 -391 -130 82 381 393 207 35
2682C5k15k44P7K36K23K12P5r3k97k21j75j6K76K69J90N3j39k82k08p2m4K67L58
$$ 35 -180 -424 -347 -111 112 324 399 306 9 -212 -387 -403 -127 142 332 385 246 -36 -244 -316 -360 -93 265
2705B65Q6kq8l13k77l8R4K63K58J04k8j47k26k68m6Q7J75K99J75r8j26k86k05
$$ 265 351 349 261 -52 -329 -367 -273 -10 248 352 324 177 -49 -317 -363 -276 -101 198 373 275 149 -137 -342
2728c42pJ36K35J71J43O4k52k53k21n5J70K25K13R2L7k68k59j34p5J31K79K37
$$ -342 -349 -213 22 193 336 400 148 -105 -326 -381 -211 14 227 319 356 88 -171 -305 -380 -249 30 267
2750B67J09p0k05k87j76P0J14K34K52L0m3k24k76j22L2P7K80K11J18j74j48k58
$$ 267 376 306 101 -186 -362 -292 -178 56 308 338 295 71 -205 -327 -295 -218 62 273 391 217 69 -189
2772a89j86O2J96K24J66Q9q7k31j98k07Q4J44K58J67O3j58k31j77q1j5J46K65
$$ -189 -375 -313 -117 107 273 362 275 44 -154 -361 -277 -133 125 292 355 197 -34 -211 -292 -307 -161 104
2794A04K08m8l3k64k43n4L2K00K42J29J4j49k02k10q1R3J79K23K19j7j65k06k64
$$ 104 312 264 231 -33 -276 -330 -298 -98 144 273 287 138 -64 -274 -355 -262 -83 140 359 342 177 -29 -293
2817b93j7J02J34K15J64j2j61j98j92r5J85K00J80P2%j50k53r5j11J29K64J13
$$ -293 -310 -208 -74 141 305 293 132 -66 -258 -353 -168 32 212 284 284 134 -119 -214 -325 -196 68 181
2839A81J13j6j29k96j41n9J22K44K74K3o8j79k17j40l0J47K03K07R6j58q6k04
$$ 181 294 278 149 -147 -288 -347 -225 19 293 316 248 69 -148 -288 -318 -171 32 239 335 177 91 -113
2861a13k06JJ95K07J14J03j04j71j85j10J4J02K64J03Q0j56j60j74j42P2J67K69
$$ -113 -319 -318 -123 84 198 301 197 26 -159 -269 -255 -153 111 214 294 138 -22 -196 -338 -266 -99 170
2883A70N3Q1n3j88k86m9M1J55K49R2l8k5j92k17r5P8J64J99J90p2j16j79k42k5
$$ 170 223 304 251 63 -223 -272 -231 -76 173 265 227 202 10 -207 -302 -224 -60 139 329 257 141 -38 -280 -305
2907c05J17J32K17J11mp2k90j30p0R4J72J70R8J6j72j58j33j28J82J17K66M7n8
$$ -305 -188 -56 161 272 268 196 -94 -224 -294 -200 -28 142 240 256 84 -74 -207 -335 -153 -36 230 277 219
2930B19j60j57j36n7R9K42J81jP2k43j84r9p3J46K01J80O3k5j82k74o9M9Q1J73
$$ 219 59 -98 -234 -291 -192 50 231 230 302 59 -125 -224 -297 -151 50 230 293 268 86 -188 -257 -208 -127 46
2954D6J54P1k5j73j77j77N6J33J45J75J7q7j52j57j30N7J51J46J59K5q6j88j24
$$ 46 200 271 246 73 -104 -281 -225 -92 53 228 245 158 6 -151 -281 -224 -73 73 232 257 171 -17 -141
2977a41j08QJ68J55R3J40j27k28j02j34O0J27K48Q8O9j77j31j91J4k6J25J98J10
$$ -141 -249 -241 -73 82 175 315 188 -40 -142 -276 -216 -89 159 247 316 139 8 -183 -169 -195 -70 128 238
3000B38K4j21j95j94O3K0R7J92J39m8n9k26j62q7K06O5J90J46kk08j49r1r7O4
$$ 238 262 141 -54 -248 -185 -165 -68 124 263 215 156 -70 -232 -319 -113 -48 142 288 286 78 -71 -162 -259 -195
3024a95J98J57O0J3j72j38j00m7R5J79J51pMr3k66l6o4J15J63R4J15j9j48j68
$$ -195 3 160 220 233 61 -77 -177 -224 -129 50 201 194 198 105 -161 -197 -261 -146 17 111 226 207 59 -109
3048a09j60O4Q7J04J66O2%j37k05j39N9J07J36J26M2n2j27j29j05lJ28J49J48
$$ -109 -269 -205 -118 -14 152 214 214 77 -128 -267 -208 -101 35 161 203 151 24 -105 -210 -213 -85 64 212
3071B12L8j18j69j37p5K7K05J16J09j4j1j70k29K9q7J79K12R9M4j17j77j33l1
$$ 212 250 132 -37 -174 -249 -222 -17 99 208 194 183 13 -216 -187 -274 -95 117 216 260 143 -34 -167 -198
3094a98L9Q3J61J43k3q9j24j65j04P2J55J56J55p2r2j41j45o5J14K01j6J50O0
$$ -198 -159 -76 85 228 205 116 -8 -173 -277 -205 -50 106 261 189 97 -44 -189 -254 -140 61 45 195 255
3117B55k36p7q9q1Q7J73J60K4l2j35j05n2o4M7J17J38J02K9j88k31r4R6O4J37
$$ 255 19 -58 -147 -228 -141 32 192 216 184 49 -56 -108 -172 -125 -8 130 232 261 73 -158 -252 -156 -92 45
3141D5J33k8j3q9j44j29N2O5J13J92P6j46p7j78r9K6J62L0J16J33p8j37j12j94
$$ 45 178 150 137 48 -96 -225 -173 -108 5 197 273 127 50 -128 -227 -201 -39 -9 107 240 162 25 -87 -281
3165b81P3J68J26Q8L4p1j89o4o9K0Q9K06N8LKk11j48j7K0J02J29J28n8J0j71j13
$$ -281 -208 -40 86 174 208 137 -52 -116 -185 -165 -76 130 188 191 193 -18 -166 -183 -163 -61 68 196 138 148 -23 -136
3191a36j00J04M7K16K8J7j06o5j42n9Q9R9P2J55oj36p1j83r9J47J25J22R2lj44
$$ -136 -236 -132 -85 131 159 176 70 5 -137 -196 -107 -8 64 219 213 77 6 -177 -276 -129 -4 118 210 207 63
3216F3j28j09p3R7J47J48K3N0j12j82r0l0R4J03Q3P9Pj05j89o8N6l4J72J49Q3
$$ 63 -65 -174 -247 -150 -3 145 168 218 106 -76 -166 -196 -102 1 84 163 170 65 -124 -192 -136 -170 2 151 234
3241B34q6j05j04j05K6QJ88J30J1o2p3j50q4pR8J48J16K2r8j74j6o5j8P9J54O0
$$ 234 148 43 -61 -166 -140 -132 56 186 197 135 62 -88 -172 -179 -81 67 183 205 107 -67 -83 -148 -166 -87 67 127
3267A27M2l4j49j11m5L2R6R7J04k1kj08j63j5J4J07J16Q5j3j04j14q7n6Q9M4J51
$$ 127 169 135 -14 -125 -170 -138 -42 55 159 138 136 28 -135 -150 -136 -29 87 172 159 55 -59 -146 -202 -113 -69 82
3293H2N5L4p8j24j17p0J39L7J44M0O2o2k16o9j21J23J14J13P2o6k9j08p4o9N6
$$ 82 137 171 93 -31 -148 -218 -79 -42 102 142 204 142 -74 -143 -264 -141 -27 86 158 92 63 -45 -119 -188 -132
3318a32J18J22L1qj18q3q9J2M8J33N1Q7k6j51m3r3k0R2N1J59kK6j65j21k1RN0
$$ -132 -14 108 139 131 13 -70 -159 -147 -99 34 85 172 146 -5 -48 -141 -161 -69 -18 141 139 165 0 -121 -142 -133 -83
3345h3J02R8J2jj15j06p9J6J08R5P4J0Kp8j76q9Q1J04L8J85m1p6q9j38r3J27R3
$$ -83 19 117 129 128 13 -93 -172 -156 -48 47 121 131 133 55 -121 -210 -129 -25 13 198 157 81 -8 -146 -239 -112 -19
3372a9M4J10m0m8o1j00p2P2P4J21O4Q4j60j08m3o5M7O9R3M8j4Pj63j03RQ8L0J26
$$ -19 25 135 95 47 -14 -114 -186 -114 -40 81 145 229 69 -39 -82 -147 -100 -31 62 110 96 103 -60 -163 -154 -66 -36 90
3400I0L3k1j1j67k0m8O4L1J07J12k8j13m3j21j0R1Q1O5K5Rr4o8p6m4M1J25J24
$$ 90 123 102 91 -76 -96 -144 -80 -49 58 170 142 29 -14 -135 -145 -54 27 92 117 126 32 -36 -112 -156 -115 10 134
3427A34M4p3j18n4r5RO5J10N2N0jr1j20n1JJ08J16LR2j27n5m1j30P0J9Q7R9L0
$$ 134 178 105 -13 -67 -162 -153 -88 22 74 124 123 32 -88 -139 -138 -30 86 89 181 54 -1 -42 -172 -102 -83 4 103 133
3455A33l7m9j19m7lR8N3J18m3k3o0j04m8l2R8J06Q3k7k7o2j06k1JP2M6R0M5j13
$$ 133 96 47 -72 -119 -122 -24 29 147 104 81 21 -83 -131 -163 -65 41 124 97 70 8 -98 -119 -118 -46 0 90 135 22
3483B2j7r3p4P9O8Q4N6k2kj66Kq9O5N1Q7R0Qo2j63k0l6K0Q3P9P9J6o6j00m8j5
$$ 22 5 -88 -162 -83 -15 69 125 103 101 -65 -63 -152 -87 -36 51 141 149 87 -76 -96 -132 -112 -29 50 129 145 79 -21 -69 -84
3513h4N3k2J48J5k3o5r9l5Pj4Q9P8J8NJ1j23o1o1J18NJ16M8q4k4q0m3n8J21N9
$$ -84 -31 -53 95 110 87 22 -77 -112 -105 -119 -30 48 66 71 82 -41 -102 -163 -45 -40 76 124 40 16 -64 -107 -165 -44 15
3542A5M9N4q1n8l3j8j7N6O8Q4Rl1j08n8o9j4J49M5M6N9l4o4j72j6O4O0L8J48j08
$$ 15 64 118 37 -21 -54 -72 -89 -33 35 119 128 97 -11 -69 -138 -152 -3 42 88 147 113 49 -123 -139 -75 -15 23 171 63
3571F3qn7j01l0L5P9J24n3K6mp7j05oN5nQ7R2m7n7qr0l0L6R8J7Q5j6l4j04p8J8
$$ 63 55 -2 -103 -133 -98 -19 105 52 78 74 -3 -108 -114 -59 -64 23 115 68 11 3 -87 -117 -81 17 34 119 103 69 -35 -113 -95
3602i5pJ60J4O2n4l8j26m4J7K2J51oM9p9O0j40n1qM8P9L3M6l6j7q2p1JM5R3O6
$$ -95 -102 58 72 134 80 42 -84 -128 -111 -89 62 56 105 26 86 -54 -105 -113 -65 14 47 93 57 40 -42 -113 -112 -67 26 92
3632I2K8l1q9%q6l5P2N8R3M2j02m8j7m5q6P7J06L1N5l5n5p4p7kJ47J0Q5n2J1r4
$$ 92 120 89 0 0 -86 -121 -49 9 102 144 42 -6 -23 -68 -154 -77 29 60 115 80 25 -49 -126 -128 19 29 114 62 73 -21
3662b1n8OM5k9Q8P7J0p7p6l6K2k2J03K3K3Nq9M1l4j34J15MP7Q0m8j05j3J4p5J5
$$ -21 -79 -73 -28 -57 31 108 118 41 -35 -71 -49 -71 32 55 78 83 -6 35 1 -133 -18 -14 63 143 95 -10 -23 -9 -84 -69
3692f9L1O5N7%o6m3k9k0l1J08L5M8k7p9l3k7m5M6M5J04k3M0l2o0j18O2k7J31O6
$$ -69 -38 27 84 84 18 -25 -54 -74 -105 3 38 86 59 -20 -53 -80 -125 -79 -34 70 47 87 55 -5 -123 -61 -88 43 109
3721A09lk4l2p4j3l8J8R5N4j4n1n2k0k7k0Q9K5K4Q6l8m7q4p9J2M9J04J7j1J6n6
$$ 109 106 82 50 -24 -37 -75 -57 38 92 78 27 -25 -45 -72 -92 -3 22 46 132 94 47 -37 -116 -104 -55 49 66 55 71 15
3751A5r9J1m9J08N0kM4m1m3l3j28J14N4J4O0N6j14j5o7J1QK3J9N6j4Pl2m4k9J9
$$ 15 -84 -73 -122 -14 36 34 78 37 -6 -39 -167 -53 1 15 75 131 17 2 -65 -54 -46 -23 -4 52 38 45 13 -31 -60 -41
3781d1M1J2N9Qk1n4j03j0K9P2J6O2mqo4p1LO1K7N3Pl8L9j19%jOK2P5J2o3N9n8
$$ -41 0 12 71 79 58 4 -99 -109 -80 -8 8 70 66 58 -6 -77 -74 -13 14 67 74 36 75 -44 -44 -45 -39 -17 58 70 7 66 8
3814Hq2M5n1J01M5P1r5j5m7r2N0M8O1L2l1L8o0p1K4o4R4l0O4L7n2j6r7kM6M1p
$$ 8 -74 -29 -80 21 66 137 42 27 -20 -112 -62 -14 47 79 48 86 26 -45 -21 -85 9 -21 43 80 28 12 -85 -87 -41 0 -7
3845gP0Mln8n4j9l2M4J01N7k8J9q2j3n7K4m4M9J44m4Oo3n9l0%L9P3J9j1qJ9q1
$$ -7 63 67 64 6 -48 -67 -99 -55 46 103 75 94 12 -1 -58 -34 -78 -29 115 71 77 14 -45 -75 -75 -36 37 56 45 37 56 -25
3877b5o0J5O1J01j0M5r6m1l8j6j3L5O7K4Rl1k2o2jk0O2P7nJj8q3kk5N3K9k5P0
$$ -25 -85 -70 -9 92 82 127 31 -10 -48 -64 -77 -42 25 49 58 27 5 -57 -58 -78 -16 61 56 57 39 -44 -46 -71 -18 11 -14 56
3909E6N8j08n1KMjJ1O6Nm9OK9m5k0QO0L6p8O8l8l8J7q2R2jK2M6n6j1m7k8Rj5P7
$$ 56 114 6 -45 -43 -39 -40 -29 37 42 -7 -1 28 -17 -37 -29 31 67 -11 57 19 -19 -2 -84 8 7 29 75 19 8 -39 -67 -58 -73 4
3943DL2K8nm2m0r9R2J3O8j0J5k5k1n6lM4JK3M1n1L0l6K2m9p0Q0J7M0J9o1j0m3
$$ 4 36 64 59 17 -23 -122 -30 -17 51 41 56 31 10 -46 -49 -5 -4 19 60 9 39 3 25 -24 -94 -14 3 43 62 1 -9 -52
3975e2n3J00kO9O8q6K9r9j7J2L9JPM2K6n6q7K6l6M3j4O8K3qj9j0Mj17N4O4L1%
$$ -52 -105 -5 -7 62 130 44 73 -26 -43 -31 8 9 16 58 84 28 -59 -33 -69 -26 -40 28 51 43 24 14 18 -99 -45 19 50 50
4007E0Kp0J1m8kM5rLP0l2MLj08L0k8Q4J3N6Pp8m0n5O5L2k1Q8m5no2M2q5N3O9l6
$$ 50 52 -18 -7 -55 -57 -12 -21 -18 52 20 24 27 -81 -51 -79 5 18 74 81 3 -37 -92 -27 5 -16 72 27 22 -40 2 -83 -30 39 3
4041CL5J8l3l1Mn0k8Q6J6LO1m4qo9l2M8J5M4J3m8M3o8j2k0M1QK8j1Q5o3j8j5p0
$$ 3 38 56 23 -8 -4 -54 -82 4 20 23 84 40 32 -37 -69 -21 -6 38 51 3 46 -22 -34 -54 -13 -5 23 12 97 34 16 1 -69
4074f9O4K7n1P0j8Ol5jn1j1O1M4J6o3M4j6k3l3%ON2L3n5M5k8q8NM2L0O4l9oM9
$$ -69 -5 22 -29 41 23 29 -6 -7 -58 -69 -8 36 52 -11 33 17 -6 -39 -39 -33 19 52 -3 42 14 -74 -69 -27 3 67 28 22 71
4107G1q3J0j8L0j3O0m8m2O9k5n3J6j1J3j4Q2M7p1k2n7K9M5L5j0k7l1N5j09J9M6
$$ 71 -12 -2 -20 10 -3 57 9 -33 36 11 -42 -26 -37 -24 -38 44 91 20 -2 -59 -30 15 50 40 13 -18 37 -72 -53 -7
4137gk1O0K8l0M3q1k5J8J3K6rk1j7K4jm6L8j6k0Q2k3l2M3Rm9m5L0qJ3K9j8N5o8
$$ -7 -28 32 60 30 73 -8 -33 -15 -2 24 15 -6 -23 1 0 -46 -8 -24 -44 38 15 -17 26 35 -14 -59 -29 -37 -24 5 -13 42 -26
4170b6j6l3M7lL0K6L2r0oj1k5J3oL2K6L5j7j0l3l6P3Mm7K4L2k3J3m5K9j4K2Q6
$$ -26 -42 -75 -28 -31 -1 25 57 -33 -39 -50 -75 -62 -68 -36 -10 25 8 -2 -35 -71 2 6 -41 -17 15 -8 5 -40 -11 -25 -3 83
4202H3k5m6J7m2Rm9M0ML0qL6p2M1o3qrM0J3Q8n1J8mj06K3M6OL1K3n4l9K3n7M8
$$ 83 58 12 29 -13 -4 -53 -13 -9 21 13 49 -23 18 -45 -53 -62 -22 -9 79 28 46 42 -64 -41 5 11 42 65 11 -28 -5 -62 -14
4235a4m3O3J9Pok7J3o5L4lN0m5O4o4J0k2lj5M4l2J0J3M2j9k2l2K6J0N0r8Q4l2
$$ -14 -57 6 25 32 26 -1 12 -53 -19 -22 28 -17 47 -17 -7 -29 -32 -47 -3 -35 -25 -12 30 11 -11 -43 -17 -7 43 -55 29 -3
4267cJ8j8l8J3RMK3P3o0m6RM4j2J7m3L8J3n2L1QOq4P8m5M6J4o7KkmN4q2L2N8k7
$$ -3 15 -3 -41 -28 -19 -15 8 81 21 -25 -16 28 16 33 -10 28 41 -11 20 28 34 -50 28 -17 29 43 -24 -22 -24 -28 26 -56 -24 34 7
4302GK8j1l1l9rP0J8k1k5L9j07J01j4j9J8j2M2l7J8k5L9j27J10j7L6l0P7m7k3
$$ 7 35 24 -7 -46 -55 15 33 12 -13 26 -81 20 6 -13 5 -7 35 -2 16 -9 30 -97 13 -4 32 2 79 32 9
4331Io1j6N9l3K5N8k5J4m0m9OL1O5l4J9k0K5m0Pnl8M1N6o8L9Km3n6O5J7k1N3m5
$$ 9 -52 -68 -9 -42 -17 41 16 30 -10 -59 -53 -22 43 9 28 8 33 -7 0 -5 -43 -2 54 -14 25 27 -16 -72 -7 10 -11 42 -3
4364cK7k1L9q3l4Q4m0M7QJ1l6l0K6m4N6pJ6k2P6q1L2q4O9J5o6M0K6m1K7m0Nj2
$$ -3 24 3 42 -41 -75 9 -31 16 24 35 -1 -31 -5 -49 7 0 16 -6 70 -11 21 -63 6 21 -45 -5 21 -20 7 -33 -28 -40
4396d0j6J00r1R1n0k7J3JJ9oNN2L1p0Pl1J1qj7L9l7L3QM2q0l9P0k2L2J5L8p2j2
$$ -40 -56 44 -47 44 -6 -33 -20 -19 0 -6 -1 51 82 12 19 -12 -1 -9 -26 13 -24 9 17 59 -21 -60 10 -12 20 35 73 1 -11
4429a1Qn0K0P5q9O6j3m2k7K7J3k9N1J5O5m3k2j8l4k0L4j7mM0NoQK0n7K7J0QL2
$$ -11 -3 -53 -33 42 -47 19 6 -36 -63 -36 -23 -52 -1 14 79 36 14 -4 -38 -58 -24 -41 -45 -5 0 -6 2 22 -35 -8 2 10 42
4462D2l8j4L0p9P5l3J7K1j8mjk2M8o0Rj6N0K0K0l5pl9rP3kj6k5M2l0K0k6l1K1
$$ 42 4 -10 20 -59 16 -17 0 21 3 -1 -2 -24 24 -36 -27 -43 7 27 47 12 5 -34 -43 30 28 12 -13 29 -1 19 -7 -38 -17
4495a7K6k8K2K7m2JMK5n8OK2L7Kj4j9m4N4m0M0N4m1l0k6O9n0j7M5K2o4L8pK6k4
$$ -17 9 -19 3 30 -12 -11 -7 18 -40 -34 -12 25 27 13 -6 -50 4 -36 4 58 17 -13 -39 30 -20 -37 8 30 -34 4 -3 23 -1
4528am1L3mK5l7L0L1Nq7O7k1k5J8L4K9o9J0J4l0j5J2N4J0l7l8J6l1J1K5o1M4O9
$$ -1 -42 -9 -13 12 -25 5 36 41 -46 21 0 -25 -7 27 56 -13 -3 11 -19 -34 -22 32 42 5 -33 -17 -48 -37 -12 -73 -29 40
4560D0j8qj1k9J8Jl6L7J4l5L5K0np5M0j0O3m9L5lrj7mK1n2k2O6%J4n3RN4o5M0
$$ 40 22 14 3 -26 -8 -7 -43 -6 8 -27 8 28 23 -52 -12 -22 41 -8 27 24 15 -2 -6 15 -37 -59 7 7 21 -32 -23 31 -34 6
4594Fl9RJ1m1J3QL8k4oK4l9L8Rj7o4P7m3L8l7L9K5l6pn5P2J2j8N7n7k2L9KJ0n8
$$ 6 -33 -24 -13 -54 -41 -33 5 -19 -25 -1 -40 -2 7 -10 -74 3 -40 -2 -39 0 25 -11 -18 -73 -1 11 -7 50 -7 -29 10 12 22 -36
4628c6N7RK0m8j4J5j1QOn6Q5K1o8K9L4m2l1j9P0J5m4K4j7n0K1k0qO5K1n5J4J1
$$ -36 21 30 50 2 -12 3 -8 0 6 -50 35 56 -12 17 51 9 -22 -41 29 44 0 24 7 -43 -22 -42 -50 15 36 -19 -5 6
4660Fl3J9lj2%N1m0L0J1k9k4M9lNK1j5jp4N6k0j4n7K7Q4J6m0l9j8P2n2LK7j4J7
$$ 6 -27 -8 -11 -23 -23 28 -12 18 29 0 -24 25 22 27 48 33 32 -42 14 -6 -20 -77 -50 34 50 10 -29 -47 25 -27 -24 3 -11 6
$$ [...]
8191d5
##END NTUPLES=NMR FID
##END=
