##TITLE=1H_DE-20HK2HCl
 D2O
 8 sc, 
 27.10.2023
##JCAMPDX= 6.0         $$ Bruker NMR JCAMP-DX V2.0
##DATA TYPE= NMR FID
##DATA CLASS= NTUPLES
##ORIGIN= UXNMR, Bruker Analytische Messtechnik GmbH
##OWNER= root
$$ XWIN-NMR		Version 3.5
$$ Fri Oct 27 16:27:53 2023 Russian Standard Time (UT+4h)  she@DPX200
##.OBSERVE FREQUENCY= 200.13135
##.OBSERVE NUCLEUS= ^1H
##.DELAY= (6, 6)
##.ACQUISITION MODE= SIMULTANEOUS
##.ACQUISITION SCHEME= undefined
##.AVERAGES= 8
##.DIGITISER RES= 18
##SPECTROMETER/DATA SYSTEM= spect
##.PULSE SEQUENCE= zg30
##.SOLVENT NAME= D2O
##.SHIFT REFERENCE= (INTERNAL, D2O, 0, 15.7039)
##AUDIT TRAIL= $$ (NUMBER, WHEN, WHO, WHERE, WHAT)
$$ ##TITLE= Audit trail, XWIN-NMR		Version 3.5
$$ ##JCAMPDX= 5.01
$$ ##ORIGIN= Bruker BioSpin GmbH
$$ ##OWNER= she
$$ F:/spectra/data/she/nmr/H-F/1/audita.txt
$$ ##AUDIT TRAIL=  $$ (NUMBER, WHEN, WHO, WHERE, WHAT)
(   1,<2023-10-27 16:26:52.25 +0400>,<she>,<DPX200>,
      <created by zg, POWCHK disabled, PULCHK disabled
       configuration hash MD5:
       00 E9 B6 7A A2 85 ED C7 34 08 36 98 17 FE 4E 26
       data hash MD5: 16K
       4D 0F 59 2D 43 40 7E 2D B1 B6 D8 10 22 32 30 D5>)
$$ ##END=
$$ 
$$ hash MD5
$$ 1E A0 E0 F4 23 05 91 74 14 0A 50 15 85 A2 B9 40
##$RELAX= 
##$RELAX= 
##$RELAX= 
##$RELAX= 
##$RELAX= 
##$RELAX= 
$$ Bruker specific parameters
$$ --------------------------
##$DU= <F:/spectra>
##$EXPNO= 1
##$NAME= <H-F>
##$PROCNO= 1
##$TYPE= <nmr>
##$USER= <she>
##$AMP= (0..31)
100 100 100 100 100 100 100 100 100 100 100 100 100 100 100 100 100 100 
100 100 100 100 100 100 100 100 100 100 100 100 100 100 
##$AQSEQ= 0
##$AQ_mod= 1
##$AUNM= <au_zg>
##$AUTOPOS= <>
##$BF1= 200.13
##$BF2= 200.13
##$BF3= 200.13
##$BF4= 200.13
##$BF5= 200.13
##$BF6= 200.13
##$BF7= 200.13
##$BF8= 200.13
##$BYTORDA= 1
##$CFDGTYP= 0
##$CFRGTYP= 5
##$CHEMSTR= <none>
##$CNST= (0..31)
1 1 145 1 1 1 1 1 1 1 1 1 1 1 1 1 1 1 1 1 1 1 1 1 1 1 1 1 1 1 1 1 
##$CPDPRG= <>
##$CPDPRG1= <>
##$CPDPRG2= <>
##$CPDPRG3= <>
##$CPDPRG4= <mlev>
##$CPDPRG5= <mlev>
##$CPDPRG6= <mlev>
##$CPDPRG7= <mlev>
##$CPDPRG8= <mlev>
##$CPDPRGB= <>
##$CPDPRGT= <>
##$D= (0..31)
0 1.2 0 0 0 0 0 0 0 0.06 0 0.03 0 0 0 0 0.0002 0 0 0 0 0 0 0 0 0 0 0 0 
0 0 0 
##$DATE= 1698409611
##$DBL= (0..7)
120 120 120 120 120 120 120 120 
##$DBP= (0..7)
150 150 150 150 150 150 150 150 
##$DBP07= 0
##$DBPNAM0= <>
##$DBPNAM1= <>
##$DBPNAM2= <>
##$DBPNAM3= <>
##$DBPNAM4= <>
##$DBPNAM5= <>
##$DBPNAM6= <>
##$DBPNAM7= <>
##$DBPOAL= (0..7)
0.5 0.5 0.5 0.5 0.5 0.5 0.5 0.5 
##$DBPOFFS= (0..7)
0 0 0 0 0 0 0 0 
##$DE= 6
##$DECBNUC= <off>
##$DECIM= 32
##$DECNUC= <off>
##$DECSTAT= 4
##$DIGMOD= 1
##$DIGTYP= 9
##$DL= (0..7)
0 120 120 120 120 120 120 120 
##$DP= (0..7)
150 150 150 150 150 150 150 150 
##$DP07= 0
##$DPNAME0= <>
##$DPNAME1= <>
##$DPNAME2= <>
##$DPNAME3= <>
##$DPNAME4= <>
##$DPNAME5= <>
##$DPNAME6= <>
##$DPNAME7= <>
##$DPOAL= (0..7)
0.5 0.5 0.5 0.5 0.5 0.5 0.5 0.5 
##$DPOFFS= (0..7)
0 0 0 0 0 0 0 0 
##$DQDMODE= 0
##$DR= 18
##$DS= 0
##$DSLIST= <SSSSSSSSSSSSSSS>
$$ [...]
##$SUBNAM2= <"">
##$SUBNAM3= <"">
##$SUBNAM4= <"">
##$SUBNAM5= <"">
##$SUBNAM6= <"">
##$SUBNAM7= <"">
##$SUBNAM8= <"">
##$SUBNAM9= <"">
##$SW= 18.05172834244
##$SWIBOX= (0..15)
0 0 2 0 0 0 0 0 0 0 0 0 0 0 0 0 
##$SW_h= 3612.71676300578
##$TD= 16384
##$TD0= 1
##$TE= 0
##$TE2= 300
##$TE3= 300
##$TEG= 300
##$TL= (0..7)
0 120 120 120 120 120 120 120 
##$TP= (0..7)
150 150 150 150 150 150 150 150 
##$TP07= 0
##$TPNAME0= <>
##$TPNAME1= <>
##$TPNAME2= <>
##$TPNAME3= <>
##$TPNAME4= <>
##$TPNAME5= <>
##$TPNAME6= <>
##$TPNAME7= <>
##$TPOAL= (0..7)
0.5 0.5 0.5 0.5 0.5 0.5 0.5 0.5 
##$TPOFFS= (0..7)
0 0 0 0 0 0 0 0 
##$TUNHIN= 0
##$TUNHOUT= 0
##$TUNXOUT= 0
##$USERA1= <user>
##$USERA2= <user>
##$USERA3= <user>
##$USERA4= <user>
##$USERA5= <user>
##$V9= 5
##$VALIST= <valist>
##$VCLIST= <CCCCCCCCCCCCCCC>
##$VD= 0
##$VDLIST= <DDDDDDDDDDDDDDD>
##$VPLIST= <PPPPPPPPPPPPPPP>
##$VTLIST= <TTTTTTTTTTTTTTT>
##$WBST= 1024
##$WBSW= 4
##$XGAIN= (0..3)
0 0 0 0 
##$XL= 0
##$YL= 0
##$YMAX_a= 764240
##$YMIN_a= -762643
##$ZGOPTNS= <>
##$ZL1= 120
##$ZL2= 120
##$ZL3= 120
##$ZL4= 120
##$ABSF1= 10
##$ABSF2= 0
##$ABSG= 5
##$ABSL= 3
##$ALPHA= 0
##$AQORDER= 0
##$ASSFAC= 0
##$ASSFACI= 0
##$ASSFACX= 0
##$ASSWID= 0
##$AUNMP= <proc_1d>
##$AZFE= 0.1
##$AZFW= 0.1
##$BCFW= 1
##$BC_mod= 2
##$BYTORDP= 1
##$COROFFS= 0
##$CY= 11.3945322036743
##$DATMOD= 1
##$DC= 2
##$DFILT= <>
##$DTYPP= 0
##$F1P= 15.7292609196834
##$F2P= 12.9074282941183
##$FCOR= 0.5
##$FTSIZE= 0
##$FT_mod= 4
##$GAMMA= 1
##$GB= 0.15
##$INTBC= 1
##$INTSCL= 1
##$ISEN= 128
##$LB= 0.24
##$LEV0= 0
##$LPBIN= 0
##$MAXI= 10000
##$MC2= 0
##$MEAN= 0
##$ME_mod= 0
##$MI= 1.114404
##$NCOEF= 0
##$NC_proc= 0
##$NLEV= 6
##$NOISF1= 3.799351
##$NOISF2= 2.8
##$NSP= 1
##$NTH_PI= 0
##$NZP= 0
##$OFFSET= 15.70392
##$PC= 1
##$PHC0= -23884
##$PHC1= 17.85273
##$PH_mod= 1
##$PKNL= yes
##$PPARMOD= 0
##$PSCAL= 0
##$PSIGN= 0
##$REVERSE= no
##$SF= 200.130013532006
##$SI= 16384
##$SIGF1= 3
##$SIGF2= 2
##$SINO= 400
##$SIOLD= 16384
##$SREGLST= <1H.CDCl3>
##$SSB= 0
##$STSI= 0
##$STSR= 0
##$SW_p= 3612.71676300578
##$SYMM= 0
##$S_DEV= 0
##$TDeff= 0
##$TDoff= 0
##$TI= <>
##$TILT= no
##$TM1= 0
##$TM2= 0
##$TOPLEV= 0
##$USERP1= <user>
##$USERP2= <user>
##$USERP3= <user>
##$USERP4= <user>
##$USERP5= <user>
##$WDW= 1
##$XDIM= 8192
##$YMAX_p= 0
##$YMIN_p= 0
$$ End of Bruker specific parameters
$$ ---------------------------------
##NTUPLES= NMR FID
##VAR_NAME=  TIME,          FID/REAL,        FID/IMAG
##SYMBOL=    X,             R,               I
##VAR_TYPE=  INDEPENDENT,   DEPENDENT,       DEPENDENT
##VAR_FORM=  AFFN,          ASDF,            ASDF
##VAR_DIM=   8192,          8192,            8192
##UNITS=     SECONDS,       ARBITRARY UNITS, ARBITRARY UNITS
##FACTOR=    0.0002768,     1,               1
##FIRST=     0,             0,               0
##LAST=      2.2672688,     0,               0
##MIN=       0,             -762643,         0
##MAX=       2.2672688,     764240,          0
$$ Real data points
##PAGE= N=1
##DATA TABLE= (X++(R..R)), XYDATA
$$ [...]
3083b219o037j602K050N482O572M744Q76l617o238o042l547P11M697O243N351
3098G424K291j960n116o468m934r95L485O012O097L535m68m338o271n587k197
3113i490J564N031O333N072J134l099n739o123l872L93M028N859N820K494j372
3128H033n341o239m772j014K835N738O075L600k05m035n892n592k556J466M982
3143b917O031M855J348k472o058o040l532J14L886N561N398K748j107m587o019
3158b791m921j208K100N611N735L967K26l689n900n220k919J141M672N757M837
3173G398J616k122n449n996l643l26L428N562N600K437o93m541n631m813j521
3188h694K123N051N613L946M52l095n665n359l137R93M268N493M792J849k131
$$ y = [-2219, -8256, -9858, -7808, -2326, 4246, 8990, 9866, 6249, 11, -6031, -9578, -8867, -4170, 2073, 7424, 9715, 7755, 2639, -3829, -8763, -9758, -6273, -261, 5836, 9371, 8903, 4565, -1706, -7293, -9490, -7926, -2895, 3438, 8510, 9644, 6545, 806, -5317, -9189, -8796, -4768, 1091, 6911, 9405, 8033, 2692, -3547, -8319, -9333, -6498, -760, 5315, 8915, 8710, 4675, -1217, -6809, -9365, -7899, -2917, 3114, 7969, 9317, 6845, 787, -5253, -8785, -8671, -4785, 776, 6174, 8922, 7815, 3228, -2791, -7712, -8920, -6820, -1209, 4526, 8493, 8719, 5030, -870, -6090, -9009, -7868, -3196, 2561, 7398, 9014, 6892, 1443, -4553, -8196, -8522, -5094, 468, 6068, 8505, 7812, 3271, -2360, -7173, -8694, -6571, -1520, 4093, 8039, 8491, 5396, -269, -5628, -8765, -7772, -3504, 1989, 6781, 8630, 6499]
3203F499m733n427l950q23L282M988N719K801q27l717n503m836j879J804M356
3218b246N858L961O90l055n341m930l148M77L813N547M730J934j405m773n588
3233c476l874p60K645N004N317L133l70l680n321m712j914J190M619N384M031
3248G216P19k412m807n458l149M24L439N170M839K091j443m564m841l977j126
3263g879K297M707N314L217n3l256n403m648k199J194M148N364L748J084k074
3278E561m638n056l296J5L322M884M874J933q85m171n167m175r37K180M604M931
3294C979L235K40l158m973m469k528P24M069M834M320J199j681m456m826l526
3309g017k90K849M781M520K408m86l559n270m105j098J802M483M377L306N61k838
$$ y = [6499, 1766, -3661, -7611, -8434, -5152, -164, 5555, 8356, 7529, 3812, -1691, -6527, -8406, -6602, -2246, 3612, 7573, 8263, 5208, -133, -5063, -8211, -7734, -3921, 1626, 6356, 8290, 6885, 2112, -3476, -7350, -8110, -5465, -461, 4856, 7989, 7619, 3939, -1382, -6094, -8008, -6818, -2199, 3185, 7216, 7935, 5523, 716, -4742, -7891, -7467, -4028, 1142, 5981, 8072, 6629, 2065, -2776, -6753, -7879, -5582, -875, 4439, 7656, 7603, 4347, -1056, -5704, -7903, -6709, -2561, 2803, 6551, 7635, 5561, 923, -4133, -7429, -7414, -4092, 792, 5666, 7599, 6714, 2543, -2624, -6799, -7736, -5556, -952, 3979, 7214, 7454, 4296, -677, -5146, -7674, -6950, -2881, 1953, 6273, 7472, 5791, 1335, -3491, -7017, -7307, -4458, 323, 4843, 7251, 6765, 3206, -2064, -6169, -7267, -5465, -982, 3395, 6701, 7262, 4424]
3325D424m757m369k540O64L626M934L634J495j464l980m750l504m36K555M413
3340e5M756K431p01l239m863m043j553J476M026M947L283M58k282m428m611k597
3356f995O87K854M701M141J503j125l924m610l415p42J975M614M565K686m70l013
3372C432m580l960j668J054L617M558L386R67k106m176m319k715N2L002M478L709
3388D731K112j139l329m857l410p33J940M101M187K668j21k606m296l957k002
3403f711J245L140M502L542O86j696l733m197k983N0K621M052L749K186r47k997
3419B509m248l687j109J714M128L983K644L31k444m289l567k088Q27K768M136
3434A608L372J606j814l559m010l010k72K217M030L975J886m80k995l981l461
$$ y = [4424, -333, -4702, -7242, -6578, -2952, 1982, 5616, 7111, 5647, 1667, -3083, -6587, -7023, -4468, -55, 4701, 7132, 6431, 3192, -1671, -5714, -7267, -5791, -1765, 3182, 6465, 6923, 4641, 213, -4398, -6995, -6308, -3454, 1247, 5388, 6891, 5766, 1842, -2768, -6183, -6925, -4950, -336, 4229, 6915, 6445, 3432, -1148, -5108, -6776, -5722, -2105, 2453, 5839, 6806, 4700, 524, -3795, -6510, -6458, -3456, 1022, 4731, 6843, 5704, 2375, -2482, -5892, -6625, -4685, -584, 3603, 6271, 6150, 3544, -752, -4709, -6711, -5466, -2326, 2176, 5718, 6404, 4708, 975, -3222, -6205, -6155, -3534, 518, 4267, 6453, 5506, 2509, -1739, -5426, -6535, -4821, -693, 3290, 5934, 6265, 3821, -468, -4035, -6123, -5296, -2528, 1608, 4980, 6586, 4772, 1213, -2797, -5807, -6079, -3862, 168, 4143, 6029, 5549, 2554, -1427, -4888]
3449d888j224J334L298M423K677K71j898m169l665k189J11L032M356L348J302
3464F119j371l236m096k789o55K135L849L802K215m15k723m175l053j710J250
3479d853L167L991L007M59j925l368l670k523M14K580L736L162J770r45l188l958
3495b144l056o76J943L345L786K481k70k491l767l058k087J284K806L913K724
3510D733O87j225l481l646k551o8K498L643L398J654p92k799l770k931j104J807
3526c947L082L966J916N28k310l649l303j865P94K639L602L048J063j492l090
3541I82l675k468j17K063L568L176K091j021k341l621l080p75J314K644L682K388
3557D810J96j611l430l359j883L92K414L940K894O71r57k889l319k566k80J590
$$ y = [-4888, -6112, -4778, -1480, 2943, 5620, 5891, 3993, -176, -3841, -6030, -5919, -2887, 1469, 4817, 6119, 4748, 1512, -2584, -5373, -6028, -3893, -44, 3758, 5973, 5558, 2835, -1340, -4393, -6103, -4853, -1686, 2305, 5312, 5771, 3846, 478, -3192, -5715, -5301, -2721, 1015, 4177, 5947, 5002, 1814, -2144, -5200, -5876, -3933, -588, 3198, 5679, 5409, 2918, -849, -3907, -5994, -4710, -1904, 2009, 4733, 5420, 4195, 714, -2932, -5483, -5551, -3053, 590, 3988, 5642, 4850, 2051, -1719, -4650, -5754, -3947, -865, 3101, 5017, 5545, 3235, -414, -3717, -5582, -4788, -2149, 1453, 4501, 5564, 4072, 982, -2693, -5161, -5278, -3215, 353, 3529, 5620, 4599, 2258, -1363, -4443, -5218, -3904, -1260, 2422, 4810, 5006, 3395, -35, -3394, -5277, -4885, -2471, 1469, 4363, 5034, 4077, 1188, -2131, -4697, -4977, -3387]
3573c387L336L198J801o6k504l479k864j239R31L084L281K461M62j624l077l200
3589b886j982Q1K364L266L139R02q05k726l417k717k91J636L188K921K166pk268
3606B564l236k881j265O44K648L385K371N34j251l180l196j870m2K282K782L396
3622C685J089n15k590l353k465m74J115K878L275J870J58k067k977k700j636N61
3638d146K516L072K441R51j263l005k947k056n1J977K819K760J509l26k759k908
3654a416k538p96J251K511L145K164J85j498l103k884j275Q6K480K816K564R34
3670D626r90k821k961j960j82J389K845K903J447Lk298k776k936q10Q25K645L072
3687B021K069L15j502k764k921j474J09J966L100K373R74o80k236l224k117l29
$$ y = [-3387, -51, 3147, 4948, 4882, 2378, -1101, -3965, -5204, -4273, -1189, 2092, 4553, 5015, 3391, 314, -2886, -4868, -4787, -2423, 843, 3982, 4884, 4079, 1353, -2064, -4781, -5072, -3436, -248, 2673, 4839, 4832, 2564, -672, -3553, -4818, -4174, -1526, 1859, 4230, 4764, 3513, 333, -2863, -4733, -4775, -2493, 289, 3685, 4774, 4259, 1669, -1684, -4149, -4623, -3508, -630, 2645, 4515, 4673, 2606, -371, -3071, -4707, -4146, -1630, 1442, 3883, 4834, 3571, 566, -2381, -4437, -4488, -2511, 308, 3068, 4577, 4251, 1492, -1416, -3954, -4750, -3499, -988, 2157, 4321, 4506, 3008, -95, -2979, -4254, -4168, -1688, 1128, 3692, 4626, 3636, 815, -2146, -4106, -4288, -2899, -54, 2849, 4296, 4299, 2001, -775, -3711, -4521, -3696, -1051, 2021, 4090, 4405, 2903, 139, -2782, -4256, -4147, -2181, 919, 3292, 4266, 3586, 1350, -1874, -3991, -4320]
3703d320J452K662K780J483Nk027k880k562p30P01K002K966J943P07j386k337
3719D59k904j661L00J701K837K335J406p52k230l047j857o10R45K698K562J739
3735C921J08j954k441k604j103M30K018K971K086O44j152k163l012j601k50J746
3751b356K526K553J459m06k318k635j965p23R04K373K524J615N25j542k651k299
3767b416j494Q5K068K755K281N33n47k308k746j687j18J228K253K720J363l04
3783C666j908k826j983p48O57K287K577J868K26j454k027k780j353L0K134K297
3799F63K201R25q02j796k637j837k22R73K319K509J139J08j551k632k000j215
3815c855R13J859K481J698O43j048k422k171j472k0J509K272K337R78m09j943
$$ y = [-4320, -2868, -206, 2574, 4057, 4062, 2035, -845, -3407, -4137, -3436, -1434, 1532, 3475, 4182, 2796, 459, -2445, -4106, -3806, -2105, 732, 3067, 4473, 3721, 1491, -1556, -3413, -4023, -3078, -380, 2182, 3921, 4029, 2075, -366, -2970, -4073, -3643, -1625, 1346, 3432, 4076, 2924, 761, -2251, -3852, -4102, -2356, 170, 2723, 4182, 3776, 1458, -1177, -3142, -3865, -2961, -588, 1936, 3551, 4076, 2534, -117, -2416, -3910, -3825, -1757, 998, 3279, 3812, 3265, 957, -1789, -3476, -3594, -2366, -113, 2607, 3970, 3666, 1758, -1068, -3051, -3799, -3142, -855, 1722, 3590, 3816, 2362, 335, -2445, -3798, -3768, -1634, 663, 2864, 3789, 2987, 1191, -1446, -3283, -3505, -2532, -213, 2296, 3435, 3543, 1992, -640, -2640, -3855, -2942, -1083, 1398, 3096, 3739, 2691, 269, -1902, -3374, -3394, -1885, 387, 2724, 3702, 3293, 1350]
3831A350k386k158l42Q51K082K407J703K12j578k373k249j290N99J963K209J997
3847B997M65p97j943k659j523PJ347K322K149J188m90j688k157j904p94O12K273
3864e95K147J439J60j116k145k203j074L88J598K258J692J011q52j839k042j902
3880c075l84J293K135K009J307m9j939j843j854r76P69J625K271J682L17j254
3896B034j960k265j009K90J424K325J763O32n53j762k025j705l27Q08K381J850
3912A901J295l67j257k055j846r19M78J765K207J530M03p73j952k111j080m63
3928c244J569J806J947R31m02j368k315j273o93Q12J789K159J337O4j519j873
3944b73j805r89L26J596J990J400P10p58j620j843j575pQ46K055J896R15j68j590
$$ y = [1350, -1036, -3194, -3536, -2685, -603, 1804, 3507, 3719, 2141, -232, -2481, -3771, -3172, -1209, 1000, 2997, 3462, 2665, 722, -1937, -3460, -3453, -2106, 216, 2365, 3553, 3063, 1375, -782, -2686, -3480, -2868, -595, 1552, 2991, 3151, 2035, -110, -2313, -3387, -2999, -1401, 857, 2549, 3560, 2708, 869, -1173, -3075, -3459, -2166, -31, 1978, 3285, 3236, 1297, -546, -2400, -3376, -2607, -982, 1289, 2971, 3288, 2034, 74, -2191, -3200, -2910, -1486, 839, 2602, 3234, 2681, 919, -1106, -2811, -3138, -2330, 51, 1901, 3196, 2829, 1572, -483, -2329, -3248, -2770, -1005, 1202, 2732, 3135, 2362, 410, -1701, -2781, -3244, -1675, 131, 2078, 3009, 2607, 1239, -1076, -2349, -3042, -2230, -441, 1718, 3055, 3119, 1600, -273, -2078, -3067, -2741, -1145, 845, 2245, 2955, 2197, 577, -1266, -2841, -2848, -2002, 53, 1949, 2864, 2696, 1106]
3962A106j714j562o38M53J859J813J391K9q89j717k005j247K15J653K000J666
3978B413N06n02j643k117j045m59J214J402J900Q18N9j101j772j798q75P78J530
3995f92J732J285K99q40j638j672j040m7J318J496J871R51l80j665j996j159n83
4012b760Q81J543J691J173j4r15k007j485o45Q1J603J805J330K66o14j634j635
4029a336j179K7R32J922J600O94m92j050j927j282m95L36J834J593J150L1p31
4046A627j512j784r57J94J460J357J650O23q41j107j986j196N2P54J567J474R31
4063B306k45q93j696j331n99K68J284J932J253L16r61j411j642q67oJ044J506
4080B58J628N28k43j302j729j090n34N86J516J603J033J49j118j461j466o15J86
$$ y = [1106, -608, -2170, -2808, -2355, -496, 1317, 2708, 2737, 1848, 131, -1874, -3121, -2906, -1253, 747, 2413, 2919, 2417, 774, -1343, -2388, -2847, -1633, -231, 1669, 2487, 2546, 1445, -327, -2125, -3000, -2222, -692, 1040, 2325, 2624, 1784, 146, -1526, -2566, -2613, -1295, 201, 2072, 3023, 2643, 978, -1018, -2177, -2760, -1879, -336, 1355, 2528, 2514, 1599, -408, -1893, -2538, -2457, -854, 951, 2281, 2547, 1933, 299, -1336, -2515, -2488, -1556, 366, 1966, 2660, 2168, 1118, -809, -2091, -2586, -2250, -416, 1177, 2327, 2358, 1627, 115, -1669, -2626, -2432, -972, 385, 2035, 2658, 1817, 710, -1276, -2472, -2420, -1666, -99, 1375, 2306, 2061, 1168, -528, -1859, -2458, -2190, -906, 1026, 2279, 2595, 1634, 223, -1419, -2286, -2292, -1248, 258, 1886, 2414, 2171, 869, -860, -1950, -2484, -1898, -382, 1221, 2254, 2403, 1285, -176, -1642, -2257, -2071]
4097b071J229J680J031L37n48j406j686o00QP17J583J355O40l91j102j272j785
4114b281m7L14J617J545Q90K03p76j558j468m04o6Q31J463J473M91n05j082j585
4132i45j228P8O67J712J112J014m15r68j549j235n22K67J449J498J019J79n62
4149A571j394j445n71j26R69J301J234O07l88j302j320q40o59R32J284J249J061
4166B163j76q16j480j305o40L76J317J189J096J72l45j231j215j103q1Q41J544
4183C06J000O44o4j094j475j130l54M12J352J361R47J15n03j794r96n86o3R92
4201i30J373J296L86m61j247j450n87l23P89J152J190P53k04o91j617j095l57
4218b023L54J146J098J223P6n38j141j444n65k2R22J226J320L65k45j093j214
$$ y = [-2071, -842, 838, 1869, 2206, 1658, 252, -1434, -2034, -2026, -1309, 274, 1629, 2269, 1878, 776, -496, -2281, -2328, -2014, -397, 1148, 2038, 2241, 1465, -93, -1561, -1965, -2031, -1200, 263, 1736, 2227, 1722, 640, -945, -2173, -2095, -1428, 284, 1396, 2410, 1995, 1027, -522, -1757, -2279, -2012, -563, 935, 1954, 2133, 1571, 177, -1268, -1839, -1965, -996, 305, 1539, 2146, 1758, 456, -864, -1704, -2363, -1431, -147, 1102, 2163, 1987, 1171, -309, -1614, -2254, -1878, -561, 628, 1724, 1896, 1551, 320, -895, -1998, -2079, -1238, 306, 1306, 1950, 1886, 792, -683, -1813, -2167, -1755, -403, 958, 1905, 2020, 1517, -277, -1273, -1859, -1922, -930, 443, 1739, 2125, 1664, 417, -1033, -1620, -1943, -1154, -2, 1188, 1941, 1737, 1046, -571, -1666, -2023, -1669, -523, 575, 1798, 1874, 1336, 195, -1249, -1814, -1836, -914, 312, 1632, 1997, 1752, 659, -555]
4235e55j243q3M89Q85J579P83n8p45j258j088p47L55O62J714R98L01m92j130j129
4254g62j158K46P10R35J176P62r9j082j342r40k95L84J238J187Q50M8n38j267
4272E3j411o64K94R71J139P61Q40p19q11j537o21j52P58J049R77Q40j98n46j519
4291d96q25n04M76R18J434Q11J18q51r42j181p52J16R33J135Q14N75k70p96j276
4310e63p88n14O75J192P88R49J9q66j006q82q05K19J027J209O23N75n48j053j068
4329h17n51j25L16J144J280L80k51n18j186j058m69M06J066J106R27K42r37q38
4347A17j221o44M9Q91J149R67M91m63p17j503p35p0O62R89Q63Q97l00n14j164
4366b56j028l73J85P91J331P62M00p24r14j170n23L2O04J162J041N71l37r30j129
$$ y = [-555, -1798, -1881, -1392, -507, 1072, 1855, 1797, 1052, -206, -1294, -2041, -1686, -1024, 690, 1688, 1989, 1497, 367, -762, -1920, -1674, -964, -29, 1147, 1909, 1810, 728, -614, -1554, -1849, -1465, -227, 960, 1810, 1858, 1320, 53, -1358, -2022, -1728, -757, 382, 1143, 1983, 1264, 453, -1084, -1705, -1857, -1099, -50, 927, 1767, 1569, 1023, -496, -1321, -1825, -1349, -431, 1003, 1814, 1932, 1081, 139, -1042, -1794, -1678, -745, 390, 1204, 1779, 1509, 713, -563, -1351, -1865, -1190, 2, 790, 1739, 1758, 892, -114, -996, -1801, -1582, -555, 654, 1277, 1852, 1304, 251, -817, -1368, -1493, -1177, -33, 1247, 1627, 1376, 858, -328, -1386, -1855, -1449, -383, 723, 1650, 1892, 955, 117, -1104, -1748, -1699, -808, 341, 1308, 1799, 1336, 619, -884, -1619, -1689, -1027, -38, 825, 1722, 1422, 908, -256, -1284, -1657, -1472, -681, 650, 1412, 1812, 1088, 174, -996, -1519, -1487, -883, 279, 1320, 1891, 1554, 624, -505]
4385e05o39n63L61J146Q51P24K52n51j245q42p45J35J034Q53J078J75k96j046
4403A77j014q62R8L73J165J132O58l36o29j163o71p57M22J528O53P18J50o33r95
4422A4j047q07O58N35J113Q90M06n07n18j354q47j74M82J117R64O30K6p21j296
4441d36n65n43k7J069R91Q44J20m27n96j218o87j28O52J103P73Q06m15p75r39
4460c98r67l24O65O20J046P24L43r07q79j057k32O7P87Q82Q94P7Q8j150r32o80
4480a333k05N70J092Q96N51j81p86p86j101m86M87R04J003O88K95o02j020p64
4498g78o33j21P87R63Q53M31j30j000q01o62k88L08P08J053R88j99o29j214o89
4517a053m31J07Q77R48P84J93k96p17j141q20J2N98J064R67M11Rq08j170p27k16
$$ y = [-505, -1144, -1707, -1346, -200, 651, 1375, 1627, 1076, -169, -1011, -1756, -1621, -587, 266, 1344, 1519, 1223, 177, -837, -1699, -1601, -1228, -63, 1069, 1727, 1391, 762, -401, -1072, -1829, -1407, 121, 774, 1492, 1642, 1009, 14, -1033, -1840, -1182, -647, 466, 1356, 1762, 1255, 737, -617, -1464, -1638, -1156, -39, 925, 1555, 1581, 860, -436, -1001, -1544, -1571, -502, 489, 1333, 1453, 1026, 430, -788, -1475, -1603, -951, 152, 925, 1731, 1316, 541, -398, -1365, -1689, -1024, -404, 642, 1366, 1709, 802, -77, -1134, -1366, -1299, -512, 370, 1264, 1341, 1429, 279, -653, -1333, -1538, -968, 124, 1020, 1571, 1390, 604, -182, -1283, -1769, -1282, -378, 625, 1313, 1608, 1006, -14, -778, -1411, -1532, -745, 218, 1071, 1502, 1372, 372, -429, -1091, -1379, -1071, -363, 690, 1678, 1479, 850, -364, -1053, -1484, -1377, -500, 448, 1232, 1425, 1129, 412, -729, -1549, -1537, -939, 125, 1092, 1503, 1512, 704, -466, -1193, -1409]
4537a409J72R84R49N53L86o62r70j046n79J98P87R70Q04K03k50q62p98o12l77
4556a559M36R54J146M22j47l73j049r30n34K99R07J050M66L11l58o28j194l99
4574a180k21P28Q43J099N7O1r75r71m87m28M09J027O81R20j4p44p33j004l01N9
4594a174P59Q45P88K64m73r26n43q69j13O92Q00P55O92k52q03o22j007j66M16
4613i37O47Q15L68M95m92j061p18k88l50P64Q72R46L41l51o28r91o62k13M03Q14
4633b26J014N67j2o43p89j015k03K8P34R55O91J94l73o94r93n84m7M57J034N40
4653F35P92j20p36j056n56n11O94O89M92R78pn35q37p26o94J79O24R50R44L81
4673A580n20q77r61m90ML50R28O66N71J81q77r02q72m3J68O10J077P98J41n05
$$ y = [-1409, -1237, -253, 696, 1249, 1635, 973, 3, -1043, -1622, -1424, -637, 333, 1137, 1340, 1090, 228, -570, -1182, -1559, -1123, -169, 977, 1399, 1252, 879, -170, -1100, -1634, -1335, -428, 622, 1088, 1399, 1041, 413, -781, -1180, -1401, -673, 170, 1269, 1326, 1387, 412, -559, -1046, -1474, -1065, -38, 643, 1563, 1549, 805, 72, -932, -1233, -1174, -415, 430, 1218, 1482, 1009, 83, -460, -1329, -1442, -750, 50, 805, 1497, 1245, 442, -180, -1187, -1353, -937, -290, 525, 893, 1388, 896, -165, -883, -1171, -1521, -757, 115, 1061, 1402, 1051, 423, -568, -1230, -1443, -1040, -226, 788, 1355, 1343, 700, -89, -1104, -1307, -1279, -545, 410, 1101, 1295, 922, 228, -765, -1349, -1396, -939, 95, 635, 1427, 1307, 571, -485, -1041, -1552, -858, -169, 323, 1301, 1294, 759, -78, -804, -1498, -1319, -695, 255, 1199, 1580, 1060, 183, -778, -1268, -1264, -914, 14, 680, 1251, 1432, 555, -347, -1219, -1262, -1094, -484, 593, 1391, 1532, 1027]
4693A027r23q70o34J12O98Q49Q21M09k33r73p01n21l49K85Q06R27N68n3n42n30
4713A73j078l88Q2R23O22P90K85k09j042o79p65l27Q91P20Q77M69k21p53o20o79
4733i29l71J97Q20Q73M37L54n85p68q16q35K61N90J021R98N5j98n44j176p29K3
4753a322L43Q27R46N72l1o49r34p56m80K53P33J080P75J55l43r51p52q21r0Q74
4773e71P06P66N12j59p50r43p34l76N66R69P16O55L4n73r70q56m09L29O55Q15
4793C82Q13J57j41q00j255m49j21L52J296J035K15n0p64q94p54n70M73Q90Q34
4812F49M20M74o48p33r89p22K74Q27R75O56N0j70q02r09n36k99O55Q75P46Q75
4832A668k97n40j023r59j97K02R00P97O62K7k11q69j063l11j00N64Q61R15M46
$$ y = [1027, 104, -766, -1400, -1288, -590, 259, 1080, 1489, 1256, 283, -418, -939, -1288, -1003, -197, 730, 1298, 1245, 703, 173, -905, -1293, -1211, -288, 334, 1124, 1409, 1200, 158, -521, -1286, -1613, -722, -2, 875, 1344, 1123, 370, -250, -929, -1300, -1103, -283, 590, 1027, 1381, 796, 28, -788, -1623, -1362, -772, 249, 1247, 1302, 1104, 560, -616, -1345, -1322, -979, -152, 794, 1366, 1335, 686, -248, -1004, -1484, -1231, -498, 582, 1357, 1512, 1169, 218, -534, -1355, -1445, -571, 135, 901, 1413, 1254, 504, -439, -1173, -1549, -983, -14, 702, 1357, 1391, 818, -152, -1008, -1417, -1088, -433, 382, 1195, 1352, 1211, 411, -844, -1293, -1414, -1062, 234, 1269, 1484, 1434, 670, -224, -978, -1548, -1075, -185, 649, 1069, 1543, 895, 162, -827, -1549, -1275, -448, 527, 1183, 1233, 1063, 261, -648, -1184, -1483, -828, 47, 793, 1668, 1371, 831, -192, -1151, -1348, -1146, -246, 551, 1213, 1240, 1029, 160, -903, -1214, -1314, -750, 111, 1026, 1472]
4851A472k58n81j011r73J21M15P20P98N73K18o21j120q89k59L11L72J243N73K64
4870A368k65j031p39q58Q9O34R92P10N46l02n24p22j325K05K53M70J399P25j97
4889A428p04o07j214j16k60P03J205Q65O2k34p21j172n18j51M71Q14J060M05j02
4908A214m72j119n38n21O0P15J214P16M10p04p63j028n57lN29J245O71K58qo87
4928F32j134p33j87N37O32O92J100Pq96q32r23l82J74O37J291N28J58l53r01r23
4948h76l85r6O57Q21R45M69n35o96p83q06k93L42J078Q13O02J98o28j015p87l09
4968a284j17R52R21Q74K19n05o55r78q18k2O84Q96N74Q07l44o70r38q83j40K17
4988a210R41P92O81L71n98q43j047o57J35N76J149O41O65o62m37j217n17k46O74
$$ y = [1472, 1214, 633, -378, -1351, -1230, -815, -95, 703, 1276, 1494, 873, -247, -1136, -1395, -1084, -712, 531, 1104, 1368, 1103, 72, -667, -1525, -1436, -802, 190, 900, 1446, 1144, 620, -102, -1427, -1222, -969, -499, 900, 1625, 1428, 724, 117, -1097, -1213, -1473, -770, 435, 1300, 1362, 1128, 407, -765, -1283, -1434, -963, -149, 911, 1316, 1214, 742, -377, -915, -1436, -1376, -661, 553, 1269, 1679, 975, 212, -816, -1373, -1376, -847, 398, 1069, 1327, 1319, 632, -502, -1235, -1422, -885, -253, 439, 1539, 1546, 650, -182, -1105, -1487, -1313, -676, 615, 1143, 1301, 948, 47, -876, -1261, -1357, -700, 121, 1066, 1535, 1000, 304, -479, -1285, -1578, -1236, -158, 655, 1257, 1455, 827, -188, -975, -1284, -1401, -449, 472, 1346, 1565, 1060, 405, -573, -1391, -1413, -729, 167, 741, 1548, 1204, 534, -404, -1287, -1427, -1210, -269, 523, 1204, 1575, 977, 134, -913, -1570, -1435, -859, 290, 931, 1596, 934, 497, -720, -1237, -1483, -809]
5007h09Q41Q18M70R7o76j012r15n19L70J004J061L22K87k16q83r81o51k03P95
5026h00R84J206K39l67p37r26q57k67M77R14Q65P12J58p76q85j076n71K69Q74
5045e64J270O22O9l51q57q01n76m79P70J156P05N40J35j094j063p03k48M19Q39
5064b11J052N59j6l79j019q81n83J5O99J404P32L02o19q82q76p35j51M74J317
5083B02P72O97k56r74p04r92k70M05P31J040Q21Q3p04r68p77o26K17M74J265P53
5103A189L52k18p93r49j031O5K92Q38R97P21j70n28q40j006n23N32O78R36O44
5122A186M02l23j047j028o17k8Q47O44J104L43k38m73j269q51k41N82Q53R14Q18
5141A578J07r28q18j093l46L58N92Q89Q72K62k83q98q95q51J05M65R58J022O82
$$ y = [-809, 32, 850, 1320, 1417, 741, -271, -1186, -1705, -1335, -331, 730, 1052, 1339, 1123, 240, -741, -1392, -1595, -800, 184, 1390, 1629, 1262, 525, -401, -1258, -1525, -1048, -134, 731, 1443, 1601, 825, -60, -1136, -1707, -1438, -564, 706, 1328, 1397, 1046, 189, -612, -1188, -1667, -897, 259, 964, 1504, 1639, 545, -518, -1221, -1469, -1050, -211, 841, 1400, 1384, 1005, -14, -895, -1478, -1463, -764, 640, 1372, 1674, 1055, 173, -703, -1438, -1589, -1115, 202, 974, 1671, 1415, 441, -263, -1255, -1525, -1120, -389, 651, 1472, 1555, 851, -117, -894, -1520, -1303, -829, 436, 1189, 1541, 1323, 530, -419, -1450, -1385, -1093, -255, 742, 1463, 1293, 765, -75, -1081, -1604, -1072, -394, 542, 1186, 1588, 1265, 218, -810, -1427, -1455, -608, 36, 1140, 1483, 1245, 772, -497, -1348, -1589, -1007, -154, 760, 1578, 1685, 757, -61, -1154, -1500, -1142, -550, 339, 1211, 1473, 1190, 292, -603, -1454, -1349, -884, 74, 1096, 1778]
5160A778m31o39j236m80l19K84M85J238R34l33k06j203j009l20J66P30R51Q20
5178A210L12k88q77j038o28m45P94J000O05J049j76p05j003j158k11L17Q99J127
5196G84P47k1n70r84j016o01J77N28J235Q07L47j62r21r24q29k96P51Q41R28O82
5216A503n2q24q77r27l54K04Q25R58J003l0k75r84j132m89J64L53J149J150m8
5235A317q3o72j084p79l73N81J065R24P32J2q60r65p96m84L24N67J100Q67K13
5254A606n44q81q58p56k29P45J271P75L30j24n72j364p38j91K90P83J270O99M8
5273A560p67q03j160m34K70O17J252Q51J74l61q38r20p86j63N85P63J433M94k01
5292A566q05j386o87l48J34J118Q99Q96J53m24j234r13n98K19P28J034Q43N28
$$ y = [1778, 1347, 708, -528, -1008, -1327, -1043, -558, 680, 1614, 1281, 1075, -128, -1137, -1457, -1291, -561, 390, 1210, 1522, 1234, 357, -681, -1309, -1754, -960, 40, 645, 1694, 1518, 813, -190, -1348, -1559, -1242, -343, 784, 1531, 1510, 940, -44, -1060, -1661, -1484, -956, 279, 1086, 1433, 1271, 350, -574, -1403, -1699, -948, -107, 821, 1503, 1451, 627, -250, -1177, -1531, -1327, -502, 456, 1459, 1429, 1154, 170, -962, -1451, -1287, -934, 215, 1365, 1317, 1234, 562, -522, -1301, -1674, -1093, -28, 896, 1628, 1640, 780, -185, -981, -1465, -1141, -574, 526, 1393, 1606, 1062, 181, -677, -1433, -1662, -917, 354, 1129, 1459, 1335, 763, -601, -1339, -1530, -1240, -457, 813, 1512, 1560, 793, -10, -1170, -1604, -1334, -717, 535, 1386, 1560, 1199, 361, -559, -1345, -1508, -923, -160, 1273, 1767, 1566, 761, -625, -1312, -1660, -1526, -408, 491, 1387, 1540, 1116, -118, -1031, -1629, -1410, -682, 352, 1195, 1723]
5310A723m36j042q01n40m97M71J096J185M46j98p46j044o61m83K40P96J178P16
5328A403J54o02q69r56p09oO40J044Q34O92l81o04j250o86l54M13P13J358P86
5347A620l08k50j320q80n95L88P48J257R70k23o9j105r85q00j03P02J052Q94Q35
5366A828m29m67j343q95m26N02R80Q88Q22j79k52j399o26o82J89O19J357P34L04
5385A525l20p57j151j046K75P03P56J182N09l85p16j004q60l12M35P72J056Q03
5403A465K71p98q38j249m21K44N49R64J355n2k43q35j149o48l46Q53R00J251N24
5422A797m13o75j227n75p40O72R14Q36R70K15q26j014p36o65j36R53J072Q47M68
5441A737o49p62j057p23J2L82Q33J407M18l3p83j119q62m06J78Q37J123R04O4
$$ y = [1723, 1287, 245, -556, -1096, -1593, -1122, -26, 1159, 1605, 1407, 661, -383, -1044, -1527, -1287, -491, 687, 1403, 1557, 955, 86, -870, -1579, -1585, -945, 99, 933, 1625, 1244, 640, -610, -1296, -1650, -1237, -524, 834, 1620, 1312, 1062, -258, -1138, -1733, -1345, -597, 660, 1630, 1407, 1338, 233, -752, -1552, -1655, -953, 99, 993, 1828, 1399, 932, -411, -1306, -1732, -1230, -250, 638, 1460, 1281, 1029, -370, -996, -1678, -1489, -870, 487, 1221, 1525, 1205, 448, -703, -1749, -1474, -771, -15, 1167, 1676, 1291, 575, -429, -1289, -1601, -1166, -394, 662, 1465, 1736, 938, 100, -1149, -1570, -1326, -777, 187, 1542, 1490, 1247, 412, -737, -1385, -1731, -878, 22, 1273, 1797, 1384, 709, -518, -1093, -1833, -1161, -247, 589, 1559, 1774, 948, -66, -802, -1467, -1603, -650, 422, 1269, 1737, 1088, 326, -731, -1454, -1442, -1060, -227, 1180, 1598, 1565, 782, -337, -1199, -1605, -1427, -590, 533, 1437, 1501]
5460A501n9j485o64q54j1O54R61J032L82l4p90j305q23j6M68Q50Q68P25K55o73
5480I82j040j203l50J66R16R86R60K64k35j405r37o16j48O93J087J144L96k94
5498A366p26j263q30r4K56R41J169Q30j09n70j094r77n78K05P57J064J031J29
5516A507m41o16j318k67m53O64J041R04O20k43p22j163r47l28O37Q60R26P36O6
5535A463p62p61r65n28J01Q15J078P93K39Jp34j427p86j99O16J058J004N51M0
5554A597r15j071p07m12L58L46J588O25K40m26j004j239q55L29P60J046R50N76
5572A786l55p00j354p50l23M99J015J029R46l3r11j267p95m72K40P93J148J118
5590A614M1n65r99j008n32j68N64J313R07M46jj088j104p38k77K95J394O53O21
$$ y = [1501, 1442, -43, -707, -1561, -1572, -918, 43, 1075, 1457, 1423, 633, -672, -1495, -1511, -1043, -193, 675, 1400, 1655, 982, -58, -1261, -1611, -1445, -529, 457, 1417, 1681, 1446, 41, -896, -1512, -1660, -967, 120, 1264, 1660, 1366, 640, -623, -1453, -1547, -1291, -350, 819, 1649, 1540, 970, -124, -1101, -1679, -1474, -717, 347, 1378, 1507, 1066, 450, -868, -1135, -1588, -924, 117, 1021, 1641, 1398, 676, -487, -1434, -1762, -1125, -265, 661, 1397, 1463, 701, -60, -1025, -1553, -1452, -637, 441, 1234, 1473, 1474, 740, -687, -1473, -1672, -1056, 2, 1006, 1557, 1597, 682, -389, -1096, -1508, -1150, -804, 784, 1409, 1649, 1223, 219, -1020, -1875, -1546, -786, 260, 1210, 1786, 1431, 731, -623, -1373, -1696, -1197, -182, 847, 1793, 1760, 849, -418, -1213, -1685, -1445, -652, 496, 1614, 1655, 1090, 91, -917, -1449, -1617, -1053, 260, 1167, 1613, 1612, 524, -580, -1318, -1595, -1300, 94, 747, 1368]
5609A368L62q35r62j030l79j85J095R29J026L24p42n26j262p46J0Q28J020Q69
5627A164M58j75o10j265j092l08M45R73J147Q71L90r35j176p74r51M44N51J038
5645A95J251J31l12p46j135p27k58N94J085R20P75j40o84j204r58m02K60Q93J053
5664E91R59j16j12j267r66q68M42O16R85R13N20k60q18j156q57l03P15Q42J014
5683H74P93k89m87q96j393l61L37Q23J201J109p3m24q76j196o42p9O04J130R91
5702A146O22l06q13j273q26l56N63J074J145N92K33q35j234q39o90j7J091J165
5720D42J015M49n85j069j058q62J22Q54Q45J014N41k38q33j104q31k76L70R11
5738b93J158Q60o0l18j308j046n72NQ85J201P69L88l82r65r94q70k75Q03J143
$$ y = [1368, 1730, 895, -67, -1097, -1476, -1661, -566, 363, 1389, 1713, 971, 445, -817, -1563, -1553, -725, 295, 1164, 1622, 1447, 837, -428, -1520, -1828, -1383, -410, 737, 1608, 1998, 1063, -113, -887, -1838, -1394, -843, 195, 1446, 1577, 1265, 519, -616, -1343, -1601, -1007, 78, 998, 1773, 1633, 949, -255, -1213, -1615, -1355, -462, 591, 1550, 1434, 1322, 55, -911, -1779, -1337, -721, 264, 1177, 1697, 1437, 619, -537, -1394, -1697, -982, -140, 874, 1667, 1378, 891, -5, -1398, -1759, -1422, -599, 602, 1711, 1638, 1214, 338, -858, -1500, -1579, -975, 155, 1146, 1768, 1462, 649, -624, -1450, -1806, -1243, -169, 976, 1568, 1801, 966, -268, -1107, -1797, -1814, -723, 442, 1457, 1906, 1321, 252, -806, -1668, -1546, -692, 153, 1167, 1708, 1470, 637, -467, -1298, -1574, -1204, -293, 865, 1725, 1665, 1347, 39, -1007, -1579, -1574, -689, 512, 1281, 1669, 1287, 322, -672, -1542, -1817, -1014, 129]
5757A29P11O23J18j040p51r95o25N05J029R94Q12P4o06r29j154k30j22O68J217
5776D28Q95M28k63r50j215p72k38N41J052J066O22j02n69j191q32o44L25R56J046
5795E83R03pk81j214j037m33m6P78J035R44N18n75q25p79j085p7K35J019J517
5814A173M40j55m55j222p64p29L41P23J320J023m3o49p13r11r49n7P62J087Q77
5833A099N95l7j192r38q77k41K98J060R78O19L51r32j077p81n82R7R75J122Q28
5852A365L52l02r92j308m63n6M09J153J050K92pj008r51q51l28M85R47J162M56
5871A405J98o88j060r60o28N27L47J391Q76J49j92j067j022p54j99M22J319J136
5889A200L12K3o40j273r36k35J56J145R05P13O2l32j089j034o76L12P98R83J061
$$ y = [129, 840, 1463, 1581, 541, -210, -1205, -1830, -1325, -296, 698, 1510, 1584, 978, 49, -1105, -1335, -1457, -789, 428, 1323, 1751, 1488, 538, -677, -1449, -1687, -1146, -94, 972, 1594, 1492, 923, -268, -1100, -1744, -1419, -463, 583, 1486, 1479, 1198, -16, -1053, -1486, -1532, -754, 281, 1225, 1743, 1168, 343, -436, -1521, -1598, -1363, -344, 1173, 1613, 1458, 1003, -219, -983, -1712, -1371, -648, 672, 1695, 1652, 1003, 290, -621, -1570, -1627, -865, 222, 1099, 1694, 1657, 465, -473, -1350, -1591, -1293, -233, 745, 1364, 1715, 783, -294, -1075, -1657, -1560, -585, 537, 1365, 1717, 1415, 423, -885, -1348, -1404, -995, 158, 1208, 1500, 1493, 485, -466, -1317, -1645, -1160, -213, 949, 1405, 1603, 915, -145, -1105, -1733, -1206, -859, 532, 1408, 1557, 1365, 298, -724, -1478, -1677, -1255, 64, 1200, 1512, 1535, 895, -378, -1314, -1549, -1393, -248, 657, 1370, 1432, 1100, 11, -1023, -1699, -1387, -589, 394, 1455]
5908A455L41n83p75j042q92l45Q42J098P73Q63j64r79r26r87k16K14Q87J187P89
5927A540J00l00j059j134q39j58R83J111Q65L82k53n73j238q49l24M73Q74J387
5945I88O66o2l62j347q76o41J52Q91J504M32L72m91q52j279o20n6P54R17R24N74
5965A588P8r03r91j136k07M48R82R66P66k08p18p33r96m96l5Q44J145R53K53j98
5985A402j044r76r16j22O24J118R14O75L4q15j333r09m37P15Q75J039N70K22o78
6004I58q87j162l02j00P04J085Q93M48n67q25j066o80k7K63J080J269N02k17m95
6023H74j356r22N4r7R87J265P67lm48j052q90q25Q5P69R83R84M64j95j062j157
6043g75l03m14N23O43J190N90k8m97j261q48l57J14J106R95Q40J9n72o86j122
$$ y = [1455, 1796, 1213, 438, -604, -1496, -1841, -999, 99, 872, 1735, 1571, 592, -334, -1321, -1537, -1323, -436, 751, 1540, 1640, 1340, 281, -853, -1692, -1850, -867, 244, 1109, 1491, 1238, 665, -573, -1422, -1746, -1273, -399, 988, 1654, 1592, 1230, -117, -993, -1634, -1482, -591, 913, 1345, 1717, 1226, 374, -905, -1525, -1581, -827, 90, 1014, 1588, 1666, 763, -228, -1364, -1571, -1123, -141, 825, 1591, 1383, 665, -68, -1064, -1560, -1595, -751, 394, 1347, 1600, 1402, 358, -618, -1534, -1656, -1032, 86, 1000, 1675, 1709, 894, -439, -1348, -1785, -1070, -195, 844, 1414, 1636, 958, 71, -1091, -1393, -1493, -789, 296, 1189, 1637, 1070, 245, -821, -1501, -1528, -1265, -185, 1084, 1586, 1369, 874, -482, -1404, -1350, -1447, -460, 805, 1572, 1569, 1121, 69, -821, -1646, -1561, -792, 191, 1175, 1639, 1444, 382, -775, -1078, -1492, -969, -326, 864, 1454, 1426, 929, -332, -1180, -1537, -1423, -317, 678, 1518, 1537, 965, 279, -843]
6062h43q68p5R25Q80J231O06j86j357p70j105pL50J027R35Q14j50n14j083j128
6081a318k97K42Q81J017R19R4n37o78j232n46p7M91J170J114K04l5q47j040r68
6100a443L1L81P90J056P31M6m12j112j328k90N7J070Q04J232m7l23q24r74j071
6119a626K19L41J108J125N02m7r56j081r36l07M56O71J186P85J31n54j172j024
6137a179m48Q0Q29J135Q21M93n35r38q69p58m3K55J187Q98M78M2p67r32p32o03
6157a586L74Q42J008Q46K6n10j122j020l12p3N91J132J184Q1j1j042j221p38j47
6176a698O77Q33J282O22k58o09j203r35l34L31Q86J011P70K04k54r05j239o50
6194a469l21J006J234O53L08o1o78j204q06j99N96R50J057L22J20m45j245r21
$$ y = [-843, -1711, -1786, -861, 19, 1250, 1856, 1670, 313, -457, -1562, -1569, -1219, -192, 743, 1557, 1407, 893, -190, -1318, -1615, -1373, -492, 525, 1444, 1538, 1001, 323, -909, -1455, -1532, -1041, 129, 1243, 1447, 1412, 565, -475, -1443, -1412, -1031, -241, 815, 1546, 1592, 1180, 68, -1260, -1550, -1493, -423, 381, 1613, 1566, 1243, 419, -555, -1626, -1407, -1066, 42, 1167, 1669, 1622, 666, -415, -1351, -1658, -1202, -531, 655, 1440, 1571, 1017, -155, -1179, -1627, -1547, -718, 417, 1238, 1731, 1196, 258, -611, -1369, -1412, -1157, 30, 928, 1406, 1448, 681, -251, -983, -1586, -1212, -370, 638, 1484, 1510, 1000, -122, -1142, -1454, -1527, -936, 196, 1380, 1461, 1450, 408, -813, -1551, -1698, -1021, -188, 1094, 1716, 1458, 849, -354, -1289, -1623, -1292, -406, 605, 1375, 1579, 1325, 420, -819, -1469, -1790, -784, 450, 1103, 1411, 1350, 672, -532, -1338, -1537, -941, 9, 1066, 1388, 1508, 1063, -182, -1103]
6212a103m47K4R59J031Q23L22m88p16j319m20l0M78P24J136O82m30o43r06r52
6231a275m15O39R10R69P20l02k66q63j143n78J65P89J142R31l0k89q59j084o36
6250a475nL04J349J092L03p1p00j188q54k17K81Q69Q03Q67L35o71j045r05n99
6269a527J78L01J492P21M41k54p82j294n67l42N91J196R28M41j17n07j410o73
6287a184m61M38N80J368N38K84k66j160j229l73L0P40J000P75M48k89o77j339
6305g77n48k32P03P58R42O10j47o65q01q71n84K83P98Q85J064K27o72j125o18
6324g70o79j4O43Q55J104N03j62r59r61q54k48N00Q20R42P32p3n75r64j105l94
6344a659K68P53J074O71N25n23p80j072o83j62N50R73J219J19K26q33j287o95
$$ y = [-1103, -1550, -1526, -567, 464, 1287, 1609, 1121, 405, -914, -1334, -1364, -886, -162, 974, 1656, 1226, 583, -323, -1275, -1690, -1051, -141, 828, 1548, 1246, 980, 117, -1026, -1604, -1439, -650, 492, 1423, 1393, 1104, 245, -839, -1475, -1480, -1176, 173, 1265, 1568, 1497, 797, -391, -1245, -1462, -1181, -312, 491, 1358, 1693, 1022, -23, -928, -1527, -1349, -1048, 444, 1165, 1606, 1352, 570, -724, -1291, -1633, -1042, 154, 1082, 1523, 1406, 899, -511, -1184, -1645, -1207, -627, 741, 1279, 1563, 1297, 137, -1092, -1465, -1435, -695, 305, 1080, 1528, 1239, 562, -777, -1325, -1557, -854, -96, 846, 1456, 1309, 644, -157, -1028, -1612, -1329, -531, 354, 1418, 1645, 973, -152, -770, -1449, -1463, -820, 35, 1139, 1642, 1480, 521, -440, -1294, -1542, -1042, -222, 720, 1452, 1379, 804, -160, -1265, -1659, -1391, -638, 436, 1107, 1632, 1109, 329, -743, -1426, -1588, -1038, -65, 1154, 1273, 1499, 666, -621, -1316]
6362a316j95K63R34J315M26P5q19n66j195n38n2P39J416J090j20k27p30j194n91
6381a285n51P77R14J194N27K4j082j056q32l08J80J186P25J315k51l37j165j104
6399a129k59oO54J001Q66M18o2r24j010q76k18M68J166Q29N46rp48j189n73n78
6419a633M07N23J156J056j18k45j218q28o09Q6L87J351O71O36m14r90p63r34j49
6438a628N61R81R84N51K51q01j038r51n40J08J156J069M65K26l55p68r06q96o1
6457a592P53J130O16O65j70p20j019r76k27N71P42J024O73l32k40j090r95j94
6475a381J2J006O67Q46N08l61j004j065p32l1M66J328Q44K06J58r39j042r78j59
6494a651L59J119Q32N67K37o28q86j080m53K11N48R76J253L51o78n65j379m70
$$ y = [-1316, -1511, -1248, -314, 1001, 1427, 1502, 683, 117, -1078, -1616, -1668, -929, 487, 1577, 1457, 1230, 500, -694, -1285, -1836, -1059, -145, 1049, 1576, 1600, 518, -538, -1370, -1678, -1498, -312, 413, 1728, 1477, 1140, -25, -1129, -1388, -1394, -740, 261, 1127, 1545, 1483, 559, -451, -1327, -1545, -1077, 89, 918, 1464, 1455, 707, -482, -1055, -1633, -1226, -703, 453, 1509, 1391, 1146, -72, -900, -1509, -1423, -1036, 315, 986, 1622, 1208, 218, -545, -1479, -1628, -1067, -86, 898, 1449, 1700, 899, -139, -1090, -1630, -1522, -366, 703, 1168, 1394, 1039, 271, -635, -1531, -1592, -839, 291, 907, 1572, 1402, 682, -337, -1313, -1540, -969, -227, 797, 1470, 1138, 898, -192, -1187, -1381, -1369, -363, 304, 1150, 1658, 1297, 293, -772, -1504, -1535, -1069, 259, 1103, 1309, 1467, 528, -514, -1492, -1651, -1292, -173, 659, 1226, 1463, 835, -51, -1131, -1584, -1373, -825, 151, 1404, 1755, 1077, 512, -867, -1337]
6512a337j53M12J208J010O18l03p93j041q60m11K80R61J169P32q6n10q92r72l04
6531a272j10N41J076R07L96m30o33j051q17J14L78Q53J112O70l79n36j069p81
6549a031n18J49Q15J351L60M27m13j001j025n35k39J020O45J158O87q60o59r48
6567f17n97l60L93P49J245P35j70p83j022o45l48J26J003J153O24K00m13j165
6585A08q70p70k4P62J008R31N49l50q53r54p58l53M85R36Q89J014l64n71j002
6604a87q50n07M2Q68J260N56K81k57q93j069q79j15P82J153P92N24j32m60j321
6623d12q31l36M12J018J088M81m3m96p56j175m66m0R07J098O92M41n69q80n96
6642d63q75P7M79P14Q99P78l53o07r79r32j27J54R36Q99R85j5n68q71j140k96
$$ y = [-1337, -1490, -1078, 130, 1140, 1758, 1455, 662, -379, -1239, -1650, -1370, -409, 760, 1492, 1406, 896, 4, -968, -1272, -1382, -841, 235, 1142, 1538, 1108, 475, -576, -1393, -1279, -901, -48, 1064, 1734, 1355, 819, -250, -1031, -1549, -1400, -585, 766, 1126, 1553, 1140, 139, -886, -1421, -1660, -640, 5, 1163, 1850, 990, 331, -617, -1214, -1574, -1181, -432, 813, 1548, 1378, 595, -427, -1072, -1420, -1294, -291, 862, 1486, 1686, 1273, 108, -762, -1532, -1556, -794, 214, 1145, 1694, 1344, 491, -463, -1221, -1574, -1089, -153, 736, 1750, 1386, 815, -187, -1037, -1544, -1502, -634, 626, 1182, 1463, 1206, 313, -756, -1635, -1750, -968, 185, 977, 1501, 1369, 909, -412, -1243, -1579, -1167, -149, 939, 1420, 1377, 881, 125, -1050, -1516, -1556, -649, 449, 1141, 1582, 1013, 133, -463, -1338, -1261, -782, -68, 831, 1609, 1256, 649, -330, -1262, -1389, -1235, -299, 600, 1585, 1570, 1002, 131, -1009, -1305]
6662a305k06O85J124J046pn1q81q58r09j69N78J034Q52L22J19q96p41j016j56
6681a435J04Q34J142R16lm98r56j069l90k21O56J251P92M91l30q08r20q85j54
6700a483M80Q21J132M99Mn73j177q02l34J80R25J073P76k72n24l77j065o21Q5
6719a253L53J082Q72N46j32q15j322p15r5K87R18J127K14N0l21j059o81m98J03
6738a339P04J088P92Q7j75q15j073n66k70O15R94Q83Q15l78q22p84j110j1M73
6757h92N18J271L90K05m59r41r86m55r7R16P87P71K92k8j098j108m21o4M94Q46
6777e9R14N80k95n83o03j009n04K52R42J059M77K77l78q74r65o97J44O60J051
6796C89P56M83m17q27j220m79l04N96Q17J008Q57j88r03q28o99m53J41J140M97
$$ y = [-1305, -1511, -826, 298, 1344, 1337, 1286, 405, -453, -1362, -1531, -953, 81, 933, 1255, 1374, 478, -263, -1279, -1435, -1331, -497, 645, 1561, 1558, 1060, 104, -965, -1355, -1576, -920, 331, 1123, 1614, 1284, 476, -444, -1329, -1483, -1003, -182, 950, 1449, 1453, 880, -297, -1099, -1433, -1253, -328, 745, 1521, 1249, 725, 348, -717, -1338, -1253, -900, 182, 1054, 1600, 1468, 653, -669, -1384, -1479, -1192, -274, 853, 1067, 1117, 796, -263, -944, -1442, -1339, -635, 453, 1245, 1332, 1157, 342, -731, -1297, -1567, -952, 42, 925, 1740, 1362, 540, -244, -1354, -1365, -892, -374, 897, 1287, 1492, 1033, 92, -894, -1349, -1446, -530, 257, 1028, 1320, 1292, 194, -914, -1335, -1399, -905, -59, 855, 1435, 1140, 557, -46, -1055, -1559, -1307, -365, 694, 1171, 1448, 1070, 196, -769, -1466, -1322, -662, 389, 1145, 1628, 1211, 384, -836, -1315, -1619, -1023, -206, 802, 1659, 1471, 568, -260, -959, -1412, -1271, -131, 366]
6815C66R81L31n79q92q73r19J49N53J214O11O50o50o91q71o02m61N78J146P57
6834G98P13M3p89r30m82p74J58O74J097P27J71k48p44j111o64l4P68N29J409K2
6854A333m0q06r49p92j69M28Q88P52P40L94j108o77j318Q3J26O24O87Q00M24m73
6874I47q69q93n25L4N11P91R51M17j89o83r55p82q7J49J058P27P77N7m47r22j086
6895a019l38J19P58Q32P96k51L73j164p16p63l39P33J035J040L14m2p00p87r78
6914a097m23O32L87J107R11o8m59r54p50m59m9N62R24Q41M63j15j051j037p65
6933a400o0L42Q97R95M75L6p27j086n50l50K59Q06J002P13j04m43o99r69n57O2
6953a358P74R09P32O44n54q97n89j018j41O48N09R92R25l44l41j055j040j17K22
$$ y = [366, 1347, 1678, 1099, 207, -666, -1585, -1436, -883, 331, 942, 1592, 942, 251, -620, -1222, -1683, -1105, 41, 798, 1511, 1554, 765, -165, -647, -1421, -1263, -589, 508, 1235, 1406, 1158, 414, -697, -1361, -1395, -627, -98, 1311, 1333, 1293, 487, -462, -1254, -1423, -995, -107, 645, 1385, 1779, 671, -6, -1324, -1241, -1115, -491, 196, 996, 1420, 947, 78, -815, -1340, -1306, -795, -4, 947, 1364, 1175, 492, -463, -1245, -1332, -1183, -125, 602, 1379, 1436, 989, 67, -1019, -1357, -1238, -480, 352, 1148, 897, 1270, 106, -610, -1373, -1712, -979, 56, 1096, 1410, 1368, 668, -119, -1097, -1520, -888, -501, 606, 1517, 1449, 990, 36, -714, -1173, -1222, -660, 264, 1105, 1568, 1453, 402, -635, -1400, -1460, -1118, -221, 774, 1249, 1285, 558, -528, -1078, -1428, -1169, -363, 639, 1352, 1248, 805, 106, -863, -1420, -1358, -584, 325, 1057, 1701, 1147, 250, -339, -1357, -1498, -850, -341, 651, 1576, 1232, 891, -164, -1204, -1321, -1099]
6972a099P81Q62O95Q9m01q88q57m67N4N39J099N70K38j42o65r39l58n15J81Q82
6992c41J002M93J38o64o32r76m24P0R91J003O47K04l13q51j119n40k7L00R76J050
7012I87M36j78p61o91j061M4m5R63R30N75J55o57o51r36l48N4P20O74R93M26m45
7033A184q75r86o48j22N25Q58J117K81j19n93q69p59m01K47Q23R28O69p8k68p68
7053A46o90r82K56P15P15R38L03m17p33q05p68k4K99R49O84Q74j99n37r55o28
7073h59o29N32M98J087M69K61n47o51o89r61K56N09J089N17K62L7q70r34p72j5
7093a410M06R16Q47M28J89n75j064o05n56K52P01R15O47L09n44p66p80m73k09
7112a372P37P82R61P2r4n43j235l14l77K74J066J010L28j66k07j013p57l10L2
$$ y = [-1099, -318, 544, 1239, 1328, 927, 39, -818, -1285, -1231, -692, 407, 977, 1215, 1073, 408, -531, -889, -1404, -1223, -341, 661, 1154, 1292, 628, -4, -980, -1404, -1334, -343, 660, 1307, 1511, 1198, 347, -772, -1312, -1339, -1039, -63, 987, 1423, 1245, 484, -207, -1268, -1224, -1269, -306, 624, 1199, 1354, 697, 46, -890, -1238, -1184, -464, 210, 1203, 1629, 1184, 309, -677, -1325, -1447, -922, -64, 1053, 1334, 1215, 622, -247, -1006, -1407, -1160, -337, 591, 1260, 1182, 914, 146, -544, -1526, -1270, -555, 160, 1098, 1401, 984, 251, -554, -1322, -1346, -1047, -98, 586, 1460, 1261, 724, -231, -859, -1488, -956, -458, 629, 1098, 1359, 812, 161, -528, -1489, -1233, -724, 365, 882, 1144, 1181, 311, -623, -1395, -1410, -1004, -88, 759, 1187, 1376, 801, -263, -868, -1424, -1172, -471, 444, 1091, 1400, 856, 90, -690, -1163, -1372, -635, 147, 1108, 1180, 1086, 543, -692, -1006, -1383, -1109, -43, 967, 1295, 1129, 922, -91, -848, -1158, -1126]
7131a126O46R75N06N38n39p46j096l55j29P28N96Q60M86j06p36r25n97k93N9P58
7151d96Q83Q30j6m86n18q58n19qL10J000P82L50k6q06j140o59P6N68M48R82N85
7172A282K02q42r66q42j74M18N56R91N41L45o95o73j055n01L06N27Q73O89M07
7191A389m71q11o53q69K34K99P81Q45M59m2m68o31j014k09n9R46R17L35N29r18
7211E89o36p18n39J88M23J030O82L97k45q55o44p73o3K80O74J000M96P0o01q81
7231a26q43l66K34P93Q78N09K60l44q39q20l59m08P54Q15P98L96j55r86p27n24
7251a060k82K44J043Q29L35q5m03p20q84l25J22O20P54P49K49j08r46o84m89k04
7271a245M19Q12O18O09K8o15j096n36k40K45Q93O46P11nn94q04p82n31J32R20
$$ y = [-1126, -480, 495, 1001, 1539, 1000, 254, -842, -1197, -1326, -598, -2, 858, 1344, 1238, 502, -423, -1020, -1313, -1254, -496, 387, 1217, 1201, 715, 197, -661, -1180, -1188, -878, 122, 904, 1254, 1228, 422, -718, -1377, -1301, -733, -285, 697, 1282, 1484, 642, -324, -1166, -1340, -922, -366, 625, 1166, 1511, 816, 143, -912, -1413, -1107, -580, 293, 982, 1389, 918, 107, -546, -1415, -1181, -882, -101, 744, 1203, 1161, 693, 62, -952, -1161, -1220, -274, 643, 978, 1507, 589, -47, -765, -1304, -1116, -693, 337, 1019, 1416, 1171, 316, -328, -1101, -1164, -884, -210, 790, 1286, 1356, 755, -126, -969, -1335, -1101, -308, 570, 1079, 1339, 995, 156, -664, -1023, -1431, -677, 138, 936, 1332, 1177, 191, -536, -1060, -1342, -1098, -55, 774, 1109, 1024, 621, -99, -983, -1308, -1186, -566, 188, 937, 1186, 1078, 132, -552, -1041, -1245, -826, -14, 604, 1213, 1241, 626, -470, -1006, -1246, -1001, -108, 538, 1249, 1244, 650, -154, -936, -1467, -1335, -415]
7291d15P50P63K99k74q58r13o19R4M78O29O47N02J39m73j146o32j31R3O22Q50
7311D05O42N0l48m34j092m31L0N64J108M37J59l44k94j116m65m9K71Q54Q64L12
7331A123j9m55q35p58l06J90M95R97P32j5k39p95q83o09J83N19J002L59N31l07
7351I10o02p89o68k56M99Q42O40M97J29p66p45q19k80K55N86Q53Q16K28m01o01
7371C28r93o04Q9M13Q13Q62L98p6p17r38q72L4L67P31P23O57r0l04q66o49n44
7392a238L51L99Q58N55L28o9j036p72m18k06K40J200Q28K55l35l05j081n57l1
7411a034J90O00N88R11j6l23q73q67k88R8M95Q11P30K9j04p18q13m82j31L62Q86
7432E1P82L64k88p3j157q77K1r1R97R46M19J88n55o92q16m27j49P17J000O42K34
$$ y = [-415, 335, 1098, 1397, 1123, 265, -648, -1267, -1173, -695, -66, 581, 1083, 1222, 749, -397, -1029, -1160, -1067, -445, 405, 1047, 1097, 749, 315, -777, -1208, -1178, -614, 494, 931, 1090, 746, 452, -664, -1129, -1178, -907, -53, 811, 1123, 1104, 649, -186, -944, -1250, -1060, -565, 432, 1164, 1149, 910, 115, -768, -1377, -1194, -675, 327, 686, 1217, 910, 308, -481, -1149, -1405, -906, -64, 576, 1073, 1202, 436, -309, -1128, -1408, -1153, -567, 286, 1102, 1330, 929, 328, -665, -1269, -1180, -767, 46, 908, 1306, 1230, 513, -425, -1297, -1263, -896, -165, 558, 1215, 1125, 821, -45, -694, -1238, -887, -488, 370, 925, 1253, 1184, 148, -624, -1042, -1248, -1008, 192, 1020, 1275, 940, 635, -446, -1003, -1034, -844, -244, 344, 1255, 1239, 916, 43, -824, -1112, -1014, -519, 292, 1022, 1051, 947, 229, -584, -1066, -1197, -835, 51, 833, 1197, 909, 836, -321, -1198, -1177, -1268, -271, 675, 1094, 1282, 727, 35, -781, -1208, -1357, -640, 360, 1002, 1236]
7453A236k43m91q03r05nL48P59O94O86K6p26p14r26j73J75P22N31Q28K60n49o29
7474A01q72m59K54N11O55Q15O0N9r75o60n23m63O48Q17Q37J79j03j37q67n82m91
7495a196K35L72J117O82j99r3q98n67m19m9L73R96M61N61l57n42p97o16m49N44
7515h41O87P99M57M18p42r39o24m81J21O42Q35P08L19m95m85j088j99k65L59P70
7535d4O34M18j28m07o51n51n87N03Q78L43Q31j79o36m65p16l40k2P65P47M03N52
7556A348o04m46o80o61p3J69J021P03L60o7n88o18q06l59M95L68Q90O22J21n19
7576F76n55j015j43N4L51J096P32r5j24o44q64l74k47K58Q06P96M22J5o25n82
7596f2q91l02L48N11R61O62l15j83o00q49l90J19L63Q86P34K32k15n15j107j87
$$ y = [1236, 993, 502, -301, -1206, -1211, -863, -104, 590, 1276, 1302, 576, -138, -1064, -1237, -1062, -340, 191, 1019, 1279, 730, 101, -771, -1230, -976, -465, 190, 1005, 1065, 1124, 149, -511, -1034, -1497, -849, -32, 805, 984, 881, 744, -123, -705, -1196, -961, -589, 528, 1210, 1011, 918, 20, -547, -966, -1015, -642, 354, 815, 1376, 1019, 477, -320, -936, -1385, -841, -154, 645, 1102, 1520, 778, -161, -785, -1266, -1145, -503, 332, 1040, 1359, 864, 379, -709, -908, -1173, -814, -44, 590, 1008, 880, 473, -178, -729, -1316, -813, 65, 408, 1239, 1060, 424, -41, -757, -1097, -1119, -354, 393, 796, 1348, 744, 298, -382, -1043, -1116, -947, 74, 777, 1137, 1070, 482, -136, -942, -1301, -806, -438, 452, 1074, 1195, 676, 121, -894, -1037, -983, -632, 464, 1196, 1101, 977, 333, -531, -905, -1152, -894, -88, 708, 1130, 1145, 520, -62, -953, -1255, -907, -396, 565, 1227, 912, 729, 129, -720, -1110, -991, -628, 258, 992, 1224, 1009, 494, -613, -800]
7616h00l79M27O47P61M44j81j04j029n71m93M17K55R89P73Nk78n69q68m50O5L25
7637f14Q38N71L49mo80r60n40M3L70N11P14M29L8n78m90o83l78O2N91Q84M28J46
7659A047k77n58n68o32k78P06N76N75L31L90q44r91m57j15K22O24N45O37o8k65
7679F00o47o59l72J80M42R72M13J16m90k90o36p29K27R6Q04P18L25k01k47q09
7699a87o20m04kJ098N17M70K42l54o51p19l07R3K90P55Q62J07j34p32p60l00m52
7720a188L23R25N99M53l36j19o04r99k23L47M25P52O74J22m25q11n75m58J28M30
7740e60P62M48M01m11l48p56l26j55L3O78P26O71j85m94n18m99k73L5M32O98L46
7761G05M29l81n74q70l04M7M05M78Q41J76K91q54r33m01j22L97N96M73N87N6p02
$$ y = [-800, -1179, -752, -105, 656, 1100, 919, 815, -214, -785, -1278, -861, -606, 383, 1156, 1161, 883, 314, -554, -1004, -939, -614, 224, 795, 1144, 1140, 460, -500, -1040, -997, -627, -116, 598, 1027, 1065, 487, -3, -686, -1064, -1002, -411, 473, 901, 1047, 770, 212, -356, -988, -1266, -560, 16, 591, 922, 1312, 468, -523, -980, -1095, -873, -249, 296, 933, 865, 600, -47, -706, -1078, -898, -456, 516, 929, 1045, 555, 265, -371, -1100, -873, -777, 27, 745, 1070, 869, 622, -187, -807, -1211, -1213, -115, 402, 872, 1114, 760, 109, -610, -917, -824, -534, 221, 1083, 1190, 1056, 324, -436, -736, -1188, -865, 60, 659, 1112, 776, 657, 53, -946, -1169, -822, -397, 355, 1029, 1151, 726, -85, -660, -1118, -990, -560, 202, 650, 1051, 640, 292, -464, -790, -945, -912, -234, 492, 1163, 978, 484, -34, -533, -806, -771, -339, 359, 705, 1134, 753, 179, -691, -995, -948, -543, -65, 776, 952, 1243, 389, -544, -945, -1067, -670, -74, 399, 986, 1042, 340]
7782C40l32n16n33O4L84Q32N81J65l98k74p28o51j2N50Q77K32M37l9o02q31k35
7803f89l75K90N61O12O72J66n70m24p96m78m4O22O36M26L69j94m66o50n67j58
7823a057J21Q44N92M47Q6o08o22q57P7P0O06Q98J15N47p32m62o72m86K08K64J007
7844C86M49K48m6n68q63k85n25N88N19P26N96l40n29p41k14n08J98O90M98N35
7864H14L20m30q09o18l99RQ02N06L98K38k4m08q71m95j18M33N87L91N84J63n68
7885E05q35m99j83J77N65M86N83J35k75n92m18n48q2L50Q24M14M41n7q50k62n42
7906f63k15J69M51P45M22k7l23o35p80j72J82M12R39Q1L36k47m72r05k12R1L15
7927e08N61P22L67m78m57l34p05j70L05N64N08M56J07j44q85n92k4rK47N04P64
$$ y = [340, 8, -508, -1041, -977, -593, 239, 820, 985, 587, 313, -415, -1066, -1078, -528, 349, 581, 1018, 979, 377, -454, -689, -1064, -774, -213, 399, 1071, 1237, 667, 243, -553, -1031, -1075, -453, 183, 609, 978, 784, 318, -332, -899, -1057, -936, -92, 500, 947, 1033, 425, -197, -1054, -977, -907, -301, 597, 712, 1259, 527, 65, -607, -1093, -885, -621, 386, 835, 1083, 1037, 469, -394, -679, -1204, -616, -97, 629, 1225, 885, 356, -385, -599, -1107, -909, -219, 279, 814, 1134, 704, -105, -723, -1122, -1113, -311, 195, 593, 831, 807, 399, -472, -967, -1085, -652, -65, 326, 910, 1073, 505, -330, -829, -1012, -835, -270, 216, 799, 934, 659, 67, -351, -899, -981, -631, 193, 607, 1048, 991, 141, -121, -663, -878, -709, -258, 487, 909, 882, 559, -76, -856, -1028, -846, -434, 505, 586, 922, 675, 203, -702, -914, -823, -508, 53, 775, 1142, 664, 207, -127, -832, -1002, -697, -133, 375, 831, 938, 794, -91, -683, -707, -716, -469, 35, 799]
7948G99L67l51m82j019%K4j28Q44L97M97m5n07o41m82j32J02N79M57M10J69Ro86
7970A81n23n37R9K50R20N95Ok73m40n50o86Q8K59N97N89N50k56n04m95o06j82
7991i18J59K60P06M38J35m5n41q31m66L08M69M15L43O07l58l27o66o09j23L66
8011f78O70M34M63q0n11j37r98j82K24O29L16P44P6l85l77q69l98L50L23M68M75
8032E57L34m3n17o08o15N7P0P71M87M90j44k83p40p14J25K0N08N32M08K61l97
8053E59l67l57p06p7O18M81O73j47J18m76p42l19k18K57M81O16N61l00l2n41r19
8074h37j84K41K47O88N23L00n17j21p13m85Q0J96N36N66N25k73m07l68p76j97
8094i76K46L25J068n2L58n17l01q57l13K87K66P04N22QJ7o14m68n28K3J71O46
$$ y = [799, 1166, 815, 333, -686, -686, -662, -790, 54, 451, 948, 903, 396, -245, -727, -859, -757, -178, 279, 689, 858, 867, 181, -342, -879, -780, -530, 390, 985, 991, 718, 278, -272, -958, -870, -611, -14, 575, 1125, 869, 365, -130, -736, -918, -759, -499, 207, 645, 780, 735, 194, -637, -1103, -795, -326, 89, 432, 1039, 681, 354, -312, -921, -1044, -678, -8, 426, 889, 809, 298, 161, -837, -1019, -795, -166, 150, 894, 970, 585, 208, -661, -1059, -709, -386, 82, 557, 891, 848, 331, -277, -892, -835, -765, 6, 493, 983, 839, 556, -184, -898, -773, -753, -245, 287, 695, 956, 559, 192, -165, -871, -948, -330, 151, 824, 677, 795, 319, -423, -742, -960, -703, -222, 394, 955, 655, 623, 82, -837, -1021, -780, -533, 155, 678, 978, 461, 340, -373, -858, -778, -582, -46, 520, 1045, 772, 365, -3, -779, -976, -730, -405, 663, 611, 969, 452, 151, -706, -1019, -732, -466, 238, 760, 768, 785, 171, -297, -825, -802, -631, 15]
8115A5M97N70m0q99k92n07p4J78K54M58M19J24j79o91m13k47L5L49N17M71L83
8136I28k21m36m57o98P4J80N60O09K67K0k85q94k11l30N84J5O19N17R1j4p91o36
8158e09j23k80N72L70N95M47l68l83m90n08p2J26M97P46K25O2l98n46n89j27p
8179g60M21Q50J09K83j36o10m66m66p4L67P54M11
$$ y = [15, 512, 1082, 1042, 143, -149, -656, -730, -552, -298, 160, 579, 703, 524, -167, -580, -827, -792, -443, 74, 545, 928, 707, 271, -186, -884, -810, -630, -70, 539, 806, 826, 541, -353, -564, -894, -310, -295, 324, 841, 932, 918, 127, -509, -632, -912, -340, 30, 625, 1072, 704, 321, -169, -677, -749, -623, -126, 620, 845, 907, 509, -37, -626, -753, -760, -339, 511, 620, 903, 767, 157, -309, -775, -849, -482, 272, 683]
8191F83
$$ Imaginary data points
##PAGE= N=2
##DATA TABLE= (X++(I..I)), XYDATA
0@%%%%%%%%%qJ6j6K4l2M0m8N6p2Q8j12J36j60J92k22K60l03L52m14M74n45O26
31C32p11Q11r20J042j175J320j483J658j851K064k293K547k823L124l455L810
47A997m202M634n107N629o199O833p537Q320r206J0206j1350J2672j4219J6065
61H536j8304K1093k4679K9486l6313M6840o5406J07945l89465j08033N92573K87560
73D51833L12407j43323l84696m59583l76409j62872K60815M00544M71358L15137
83F85211j8401k84720m06265m70297k01890R8112L19357M85029L82959O1917j32578
94E18434l84625m90647k46814j2306J77400M69306M37195J56726n1746l00826
104B72097m53100l14439j35469J14139L96761M15978K68491N8251k55572l90323
$$ y = [0, 0, 0, 0, 0, 0, 0, 0, 0, 0, -8, 8, -8, 16, -16, 24, -24, 32, -40, 48, -64, 72, -88, 104, -118, 142, -161, 191, -223, 251, -294, 332, -379, 432, -488, 554, -621, 699, -784, 874, -977, 1087, -1206, 1341, -1482, 1642, -1813, 1997, -2205, 2429, -2678, 2951, -3248, 3585, -3952, 4368, -4838, 5368, -5982, 6690, -7529, 8536, -9768, 11325, -13354, 16132, -20181, 26659, -38747, 69198, -320267, -428300, 164273, 451833, 764240, 620917, 236221, -223362, -599771, -762643, -501828, -101284, 370074, 685211, 666810, 382090, -24175, -494472, -696362, -598250, -278893, 206136, 589095, 651012, 518434, 133809, -356838, -603652, -615958, -438558, 30748, 467943, 624669, 572923, 272097, -181003, -495442, -630911, -516772, -120011, 295967, 564458, 622709, 367137, -23186]
114b3186l34661k45393L3802L25355L69122L39673J64147j77806l31368l43680
124b23995l12913m6315K30338L24279L76169K35388p4478k52731l55009l48909
134d48176j07735J20326K69037L91172K78872K8764j61381l47390l64765j60594
144e01870J4041K04974L82418L04586J15008o9120l02953l63440k22950p0652
154e09958J48045L32958L11531K03626R166k48695l29714k70490j55447R0486
164d18492K78238K98415K63474Q4969j74966k84593l02799k20433K6155K10854
174b39178K79424K99034J45938r0770k31209l14194k60796m6702J32441K58500
184f7512L13920J86598k386j65404l09614k83538j12311N0372K22593L13516K19046
$$ y = [-23186, -357847, -603240, -569438, -244083, 125039, 464712, 628859, 451053, 119685, -223995, -536908, -583223, -352885, -28606, 347563, 582951, 508473, 255742, -99267, -448176, -555911, -435585, -166548, 224624, 503496, 532260, 370879, 23489, -341276, -501870, -487829, -282855, 99563, 404149, 519157, 450037, 147084, -216356, -439306, -509958, -361913, -28955, 282576, 486202, 495368, 246673, -83041, -353531, -508978, -418492, -140254, 158161, 421635, 506604, 331638, 47045, -255754, -476187, -450032, -239178, 40246, 339280, 485218, 394448, 163239, -150955, -411751, -458453, -326012, -67512, 246408, 433006, 430620, 265216, -44398, -327936, -440247, -389875, -167282, 146234, 365280]
195C65280P3999r8960k78942k90316j73314k3711J76553K91099K44582J39481
205D25751l8429k29358k79292k24404r0319J21485K52466K59202J94340J8713
215D10155j71209k54092k58559j46481N9107K01493K62213K35375P2612j07027
225C03587k19573k73185j91009p345J45227K50811K57626J24694l8423j80478
235A71932k71866k18497p2487Q1412K26458K66159J68360K6807j32703k52549
245f974k37171j30868K1975J87869K54585K05291Q9824q1867k21512k40876j77560
256c37284l8071J37396K34185K29248J40300k4511j73848k38150k14497q7656
266c72888Q1381J96210K40242J84504K9699j22907k17328k34052j37684K1264
$$ y = [365280, 439279, 340319, 61377, -228939, -402253, -425964, -249411, 41688, 286270, 425751, 387322, 157964, -121328, -345732, -436051, -314566, -62100, 197102, 391442, 410155, 238946, -15146, -273705, -420186, -361079, -159586, 102627, 338002, 410614, 303587, 84014, -189171, -380180, -387525, -242298, 8513, 266139, 390833, 352410, 171932, -99934, -318431, -390918, -309506, -83048, 183111, 351471, 378278, 245575, -6974, -244145, -375013, -353038, -165169, 89416, 294707, 384531, 302664, 81152, -159724, -337284, -375355, -237959, -3774, 225474, 365774, 341263, 167415, -70735, -285232, -372888, -291507, -95297, 144945, 329449, 359148, 236241, 18913, -215139, -352823, -331559]
276c31559J58509K34791K07918Q6215o2374j91123k41938j71682l6274J06581
286b40936K16270K27323J32005q750j48952k28547k03125r4035N9425J88267K23758
297A22703J69906N0689j03354k10435k16158j37321K337J46015K19251J98145
307B41778R3400n2876j71956k20112j77458m7639J01553J97552K11181J37015
317C12438p86j34355k09682j97717r6983M7120J68900K16826J67416M7597q7913
328B32861j88227k08898j37506o495J29519K08489J90992R2693m0738j57366k07728
339i2404j68115n6259Q2918J86271K04715J33624P255j21931j95691j85520j00053
350c05190L0904J54971K08179J63974N1503p6645j73931j98340j34499j3838J11923
$$ y = [-331559, -173050, 61741, 269659, 355874, 293500, 102377, -139561, -311243, -347517, -240936, -24666, 202657, 334662, 325912, 176960, -51587, -254712, -348747, -289322, -101055, 122703, 292609, 343298, 239944, 29509, -186649, -323970, -321633, -175618, 43633, 241778, 335178, 282302, 110346, -109766, -287224, -334863, -233310, -35758, 175423, 312438, 311652, 177297, -32385, -230102, -327085, -279965, -111065, 105761, 273177, 320774, 232861, 44634, -164264, -301770, -308265, -178746, 29743, 220735, 313428, 272690, 115324, -92404, -260519, -316778, -233860, -47589, 157126, 290750, 298005, 176074, -19617, -205137, -305190, -274286, -119315, 88864, 252838, 304341, 227696, 53765, -144575, -279074, -292912, -180989]
361a80989J91924J89863R8420l4954j46976j92729j60901o2121O7300J70887J97761
372A37485J34994J3994j08738j83604j80437r8883K3031J35055J92408J67271
382B32576O1981p0510j63996j84754j32252k4163R8848J79442J80254J03660k0700
393B60386j35863j87633j55885o1731N6754J52721J86992J38212K4991r9911j75317
404C716j73215r8763J5507J23413J80126J60328O8460n4908j54682j83914j29195
415b43127k2785Q7494J63451J74484J05206j1352j23248j80264j55084o3448N1304
426b17369J43293J74254J33037L4255q4356j68528j71038r9282J0863J15482J68392
437C9003J52052P3707m2729j43007j75866j32297l0882Q3777J55217J61173J05687
$$ y = [-180989, 10935, 200798, 299218, 264264, 117288, -75441, -236342, -298463, -231163, -60276, 137485, 272479, 286473, 177735, -5869, -186306, -285189, -262158, -127103, 65305, 232576, 294557, 224047, 60051, -124703, -256955, -281118, -182270, -2828, 177426, 281086, 260386, 124523, -63110, -218995, -280726, -223972, -71251, 115741, 253953, 278944, 179033, 3716, -169499, -268262, -252755, -129342, 50784, 211112, 279572, 224664, 69982, -113932, -243127, -265912, -178418, -14967, 159517, 264723, 253371, 130123, -50141, -205225, -268673, -217369, -74076, 100178, 233215, 267470, 183114, 14586, -156452, -255734, -244871, -129389, 39003, 191055, 264762, 222033, 79026, -96840, -229137, -260019, -176242, -21025, 140148, 245835]
448B45835J018j09441j70112j56307p0071M4475J32719J66629J31627L6832o9789
459A83415j50090j70365j06776M019J03706J62032J49875P1000k9872j23204j71730
470g7990j34275l8107O8105J48742J60792J01546P927r3238j58970j51424q0632
481b47524K9986J29089J59918J25870M7029o1888j40539j55511j13654j2076R9798
492a39502J52862J44485Q0610k7841j15646j52333j35634n1235O2274J37224J56641
503A11905J07055P949q4351j43945j50090q0835K0538J10149J60835J29745M1053
514B30008m9234j28599j55944j04052j9715P7275J52958J45427P4308j4008j07435
525A00989j51698j23144n5547M3254J33244J49418J06923K2253q2798j38966j35085
$$ y = [245835, 246853, 137412, -32700, -189007, -259078, -214603, -81884, 84745, 216372, 253204, 183415, 33325, -137040, -243816, -239797, -136091, 25941, 175816, 246816, 216944, 93740, -77990, -212265, -250372, -182267, -33525, 127267, 228813, 236740, 143502, -15468, -166892, -247524, -217538, -88449, 71469, 197339, 244368, 182480, 41941, -113570, -227224, -239300, -139502, 13360, 157845, 238455, 210614, 94968, -57365, -192999, -244234, -181960, -44736, 111905, 218960, 226909, 142558, -1387, -151477, -232312, -211774, -101625, 59210, 188955, 230008, 180774, 52175, -103769, -207821, -227536, -150261, 2697, 148124, 222432, 208424, 100989, -50709, -173853, -229400, -186146, -52902, 96516, 203439, 225692, 142894, 3928, -131157]
536a31157q8018J0405J05800J43159J31543N7198n2090j20186j40635j13161k1995
547b19137P2826J30163J46531Q6593j6347r3320j41566j31930m9863L7237J09740
558f9073J51486J09976K0995o3182j34327j40721p6776J50Q6794J47056J23494
569A55872N6603k8443j18793j43073j00838l3127O1224J31006J30527Q9892L775
580B04625r6671j33706j19514o7227L4701J10998J29987J13734L5464o6402j19463
591B6526j32916r2944N247Q3377J24410J31093O1868l3038r7408j38621j11992
602a74398k5842N1766J15217J38722Q2273M124p1735j36554j23982n4449J7004
613a77854R9898J39015R9790L7663m3715j23129j28724q2731j5455P8801J28548
$$ y = [-131157, -219175, -208770, -102970, 40189, 171732, 228930, 176840, 56654, -83981, -197142, -219137, -146311, -16148, 130383, 216976, 200629, 107309, -34257, -166187, -216050, -178813, -69073, 82413, 192389, 213384, 150202, 15875, -124846, -201622, -201472, -114678, 32378, 155872, 212475, 184032, 65239, -77834, -178672, -211799, -150575, -19569, 110958, 200850, 204625, 107954, -25752, -145266, -212493, -177792, -66794, 63193, 176927, 212391, 145989, 26526, -106390, -199334, -194087, -110710, 13700, 144793, 206661, 173623, 76215, -62406, -174398, -200240, -148474, -33257, 105465, 187738, 191862, 120127, -16427, -140409, -194858, -177854, -77956, 61059, 160849, 198512, 154797, 31668, -97056, -179787, -195242, -116441, 12107]
624A2107J13210O9847j6547j02810j24108j06660m5925N3318J10615J20988R6318
635A80353J0267p6080j13508j23361p1945K4410Q7402J22132J15348L7047m5280
646A46785r9777j30628r0995p962O0250J18458J24874O0850j0561q1486j31639
657d1831j03599l8853L0445J06859J27041Q1915K2791n9992j22789j11331o7197
668a76541J741Q9088J20981R9188N2670l5293j06268j14759r0868k3371O4751
679a18681J07578J13035P7242j1523q1436j11202j10850m6858L9380Q9028J18095
690F3808R5633J5671n3711j03293j21884o7514R698O8305J16772J07878M1398
701A72761k5005q9333j22891q5981k2235M8298J09290J09938O5817O782p3355
$$ y = [12107, 125317, 195164, 178617, 75807, -48301, -154961, -200886, -147568, -36953, 84035, 180353, 190620, 114540, 1032, -122329, -194274, -169864, -82462, 39670, 155018, 192065, 146785, 47008, -83620, -174615, -182577, -122327, -3869, 121005, 181855, 171294, 89808, -41831, -145430, -184283, -153838, -46979, 80062, 161977, 184768, 124776, 1987, -109344, -176541, -174800, -85712, 35269, 134457, 187127, 151834, 45566, -69193, -160061, -183432, -118681, -11103, 101932, 179174, 167651, 86215, -24987, -135837, -182695, -143315, -54287, 63808, 159441, 175112, 121401, 18108, -103776, -171290, -161592, -93287, 23485, 131363, 172761, 147756, 58423, -64468, -150449, -172684, -124386, -15096, 94842, 160659, 167441, 94086]
712I4086j17573r7104n1753K2992R5685J09142Q5488L3363n1595j03316j04365
723h4950p7512k858P6262J03983R8940N5890k5190q4294j08167r4940k6048M8754
735a20130R2963J11113P3491j219o0484j02985j07138n0078K0655P9595J13242
746D9025Q6420K4957l4974r5099j11156o8374q907N8977J09325R7611M9003j2322
758A44486p9594j06150q5450l7694L8332R8334J00879P1677J2558o2224r8306
769c152r4608n9875J2699P9061J02517Q9750L2842l9662q4269j01158p7400j0093
781a53348N5028R5425J02549N3969j6006o8462j00624q9211l2730K9330Q4214
792c9866J06999P1572R862m9057r6514r6305n1741M988O6310J03585Q7340L5329
$$ y = [94086, -23487, -120591, -172344, -149352, -53667, 55475, 140963, 174326, 122731, 19415, -84950, -162462, -165320, -89058, 14925, 113865, 169755, 144565, 60271, -47896, -142836, -168884, -120130, -27167, 83946, 157437, 156218, 95734, -7251, -114389, -164467, -143812, -64217, 49025, 135445, 160402, 125428, 30329, -80827, -149201, -158108, -99131, 10194, 107805, 156808, 144486, 64892, -41258, -126708, -164402, -126070, -27736, 73143, 144820, 157378, 95154, -3152, -97760, -157635, -144936, -65875, 36642, 126392, 159234, 119572, 35303, -65855, -143255, -153348, -98320, -2895, 99654, 153623, 137617, 69155, -31469, -120680, -153410, -124080, -39866, 67133, 138705, 148567, 99510, 2996, -93309, -145050, -140062, -73752, 29833, 117173, 152502]
804A52502l0411q4766r7039p0963j9102M9730R3190R3432N9888o154p1193r5324
816b6210q3240l9643K7260P8862R6722P7355J6747m9933q7947r2980n8223O020
828a35210O1150R2519Q8883M0322k5531p7565r7618p1612j6654M0025Q5653R4566
840G8928N8121l2n9856r6368q4384l7026K0432P2268R4040P3159K3737m0076q7438
853A5505r0590n7322j258N7423Q9036Q2634M4926j7728p2833r3007p3563k2163
865a38940L8737P9911Q7812O1286N033n4119q8722q5144m2830J8094O7648Q8724
877C7490P3053K5528l2669p8613r1412o0314l311N1361Q5549Q1628M2979j1504
889A19765o3796r0634p4270k5578L3030P6979Q6070N8939Q170m7174q3936q2808
$$ y = [152502, 122091, 37325, -59714, -130677, -149779, -100049, -6859, 86573, 146461, 140307, 69114, -26210, -109450, -149093, -121833, -42971, 53751, 131106, 147853, 97920, 9973, -83007, -141230, -135210, -74060, 18459, 107342, 147664, 122133, 44568, -53050, -124662, -141316, -101291, -15638, 78928, 137049, 137017, 77161, -19207, -103591, -140617, -120185, -47917, 46123, 119282, 143019, 102943, 15505, -75085, -132407, -133665, -76242, 12794, 95428, 140354, 122626, 49793, -43214, -116777, -138940, -100203, -20292, 67520, 128806, 133839, 79720, -9002, -94146, -136976, -118882, -51234, 37490, 110543, 136071, 103402, 24789, -66623, -126937, -130248, -78887, 6662, 88290, 131269, 119765, 55969, -34665, -108935, -134513, -101483, -24504, 61566, 120505, 128675, 81501, -2435, -85243]
901h5243m5797J2173O4676Q6191P1427K7035k8814p2512q6306o2557q826M8198
913h0355Q1336P9994M5155r589n9210q3887p3624l0169K8172P2794Q4587N9113
925A14317R960m2373p8163q0588m7169P085N8246Q3851P1971K8562k4774o8014
937C2911q2087o1873j3962M1412P8335P9199M6135n225n4671q0710p1385l2163
949a24084K1665O6616Q3007O1302J3405l9237p3600p7467m8537K197N2645P9838
961A7750P2035L2141k1355o3998p9449o0816j6313L5493P2843P8205M8468k210
973A12794n0906p7038o9958l3618J7607O1674P9768O1577J6515l4268p0784p6075
985f2712m8603k76M7938P5482P0630L5141j7067o0768p6786o0635j8913L2229
$$ y = [-85243, -131040, -118867, -54191, 32000, 103427, 130462, 101648, 29136, -57170, -119727, -128553, -80355, 981, 80975, 126130, 116541, 57331, -26556, -100180, -130349, -102177, -29383, 55204, 114317, 124277, 81904, 3741, -76847, -124016, -116931, -58685, 25166, 97137, 125699, 100925, 32911, -49176, -111049, -125011, -83599, -5264, 73935, 120070, 114845, 60174, -20536, -91921, -124084, -102419, -35803, 47204, 108506, 121911, 82674, 9074, -68393, -116930, -114733, -62088, 17750, 89785, 121926, 100571, 36573, -42876, -103692, -120005, -84512, -11669, 66536, 115004, 112794, 61888, -15150, -85108, -118726, -101119, -39445, 40323, 101900, 118415, 84147, 13363, -62712, -111315, -111591, -63653, 11829, 82459, 117600, 100533, 39765, -37021, -97656, -116569, -84340]
997h4340O8557P5022M9714J968m6640p3938o9015l5786J4772N7616P5413O1502
1009I4845K0258l0404o6351p4144n0203l430M3945P1589O9261L6529j2114n5517
1021D4264p5025o0487k1198K6701O4849P3962M9423N390m0330p1070o9219l6451
1033a09191J0088N3085P3361O0776K2955k5419o3288p1464n0097q553L9832O9483
1045A568O7434L7858q193n1515p1266o1020k3964K4127N9584P1186N1948P933
1057A05680l8029o5591o7590l9373P351M8525P0288O0987K4323k1455n7924p0781
1069d3589n0603r089L3714O5104O8073L8536n327m6950o9340n9292k5366J8677
1081h5452N7130O9028N0698J2219l3872o5309o4400l9090K366M6201O6826N9668
$$ y = [-84340, -15783, 59239, 108953, 110921, 64281, -9657, -78672, -114458, -99686, -42070, 33343, 94845, 115103, 84699, 18348, -55796, -105999, -109429, -65484, 6105, 75366, 111895, 99781, 44264, -30761, -91248, -112446, -85745, -20896, 53066, 102489, 107879, 67549, -3521, -72740, -109191, -99103, -46018, 27343, 88119, 111074, 85655, 22367, -49097, -99194, -107747, -67915, 1568, 69002, 106860, 98667, 47152, -24114, -85134, -109098, -84971, -25387, 45799, 97747, 105680, 67651, 2060, -65530, -104903, -97552, -49027, 21261, 82248, 106571, 85116, 27192, -43589, -94192, -103281, -69567, -4463, 63610, 102146, 96819, 49869, -19471, -78763, -104129, -85452, -28322, 40706, 91404, 103623, 69751, 4442, -59958, -99048, -96682, -50481, 16345, 76013]
1093G6013K8032j9163n6085o6271n1850j2194L2922O0142O4509M2623l289m4120
1105E1269o4818o0411k6969J7508N1473O6122N2430J3274k9153n9533o6785l9560
1117i5153J671L9889O4500N9401K7836j2259n1776o7447m9788j5112K6654N9667
1129a1917O2266M0317M567l9625o4980n7686l0228J2523N0742O2604N0548J9020
1141I8151k6326n6860o2162m4258k311L9901N9331N8210L1851j1885m5940o2577
1153b4875n4907j6185K5372N2840O3423M2289K123l2847n8988o1355l0744R999
1165h3855M5299O3679N0191J7319j9184n4041o2855m1048p341L3723O1788N5710
1177E9385L0415n685m4672o0689n0423k3125K1355N5165N8188M2602Q027l3979
$$ y = [76013, 104045, 84882, 28797, -37474, -89324, -101518, -68596, -8454, 56055, 98678, 95389, 51269, -13549, -73960, -100929, -83421, -31948, 34174, 86604, 99878, 70725, 11192, -55593, -95153, -93482, -53593, 10907, 70308, 98144, 85885, 34109, -33338, -83126, -98238, -71584, -11917, 50349, 90666, 95233, 55608, -9372, -67058, -97286, -84763, -34021, 28583, 79131, 98151, 71825, 14965, -47197, -91455, -93766, -53865, 5466, 63676, 95527, 83642, 37702, -24875, -79782, -95967, -70595, -17755, 45668, 87957, 90080, 57233, -1755, -63110, -93854, -83855, -38556, 25123, 75314, 92633, 73449, 19408, -43447, -84495, -91836, -58113, 3675, 59385, 89800, 84115, 39443, -21246, -71669, -94794, -73439, -18274, 39914, 82516, 90543, 56564]
1189E6564n5623n5810l5432O589M3352N9011N3216J9831k1521m7175n8721m6120
1201h1839p328L0583N4621N9766L1842p031l7773n9083n2491j9546J4765M7693
1213b5821O2546M2456P531k7433n4863n5196l2803kL9191N9969M9470K3270j4284
1226G4031m9966n6288m1808j3766K7402N3545N4511L6960k151m0206n3534m9882
1238f1152k6307J5066M4803N5525M7101J1744k7496m9761n6009l5044K262L2775
1250d6493N4239N4128K3603j3829m2407n7604m3565j0725K1281M9460N6535L4092
1262G8715J838l3002n6990m9045k3203R003M2361N5345M3193J6305k2260n1638
1274A0622n2000l5094l703L4172N1500M8316K8995r773m2585n2812m4995j5247
$$ y = [56564, 941, -54869, -90301, -83712, -40360, 18651, 71867, 91698, 70177, 23002, -35719, -81839, -89167, -58584, -3963, 55803, 87645, 80614, 42841, -16242, -68733, -88279, -73514, -25821, 36725, 79181, 86712, 59279, 4416, -50780, -83583, -83585, -44394, 15575, 65045, 88315, 74031, 24065, -32223, -74031, -87797, -60395, -6850, 47661, 84621, 82470, 42264, -11270, -61152, -87459, -72393, -27590, 27935, 75036, 86780, 59284, 9523, -46486, -81530, -79268, -46493, 7746, 61874, 85477, 71648, 29241, -28363, -71928, -82653, -61372, -11912, 44623, 78715, 80553, 47551, -9439, -58484, -81687, -72684, -30323, 25022, 68215, 84520, 62260, 10622, -41378, -76472, -80175, -46003, 5497, 53813, 82808, 73035, 30450, -22362, -67357, -82604]
1286h2604K3080M5249N1688L8611K843l1097n0363n1664k6408J0373L7346N3095
1298B0149M5134J4355j7337m5150n5473l5703k691K7373N1063M9608K5499m601
1310G2226l7315n4464m3197j6541J6699M6547N0725L5294P706k7449n0206m8235
1322d8210k8728M997L8176N0171M2808J9526j7039m2962n0025l9012o744K8211
1334d8831M6471M8671K8851n316l3822m8980m6180j8081J5772M0726N0946L7584
1346F7811O507k3401m6067m9693k8346K926L2687N0633M3499J7789j1949m0329
1358B2067n0668l6456r714K2949M7101M7298K8514q81l2530m8424m2443k1532
1370g4719J2101M0386M8197L7796J0313k3211m3797m6545l0780J203L1123M6267
$$ y = [-82604, -59524, -14275, 37413, 76024, 78867, 47770, -2593, -54257, -80665, -70292, -32946, 20149, 65283, 79638, 62301, 17151, -38322, -74025, -76716, -49343, 1720, 51328, 76827, 72226, 34911, -19553, -62750, -79291, -62592, -16045, 34680, 69974, 77680, 50231, 25, -48210, -76938, -71941, -33765, 16406, 59214, 78740, 61701, 18739, -31286, -70298, -77042, -48831, -2360, 46311, 75162, 69846, 36024, -12956, -59136, -77217, -61445, -20719, 30227, 67811, 74318, 50917, 4850, -44843, -73189, -70263, -37576, 13057, 56556, 74345, 62396, 22067, -28601, -65057, -74771, -51822, -4721, 42577, 71091, 70210, 37680, -10744, -53187, -74719, -62618, -22232, 25965, 63761, 74074, 50863, 7066, -39479, -70259, -69056, -37933, 8334]
1382H334M4307K0721j2221l7032m7855l8341r977K0040M2884M7472L0313n89k8394
1395C9662m6538m3703k0484Q997L6380M8192L7339J1474j8804m2658m6066k9917
1407f6126k387K8262M5664M2487K2191p768l6077m6534l7279j3201J8397M0942
1419a1429M5026L1379K568k6730m3817m2890k3287P754L4010M5286L8542J3091
1431F9503j6722l9218m5430l1464l291K4869M3120M3307K2615o144l2290m4992
1443a6137l7875j4269J5186L8572M4716L1055M858k3493m2566m2137k3507M059
1455f1538L1674M4881L7510J4863j4310l7061m3690l2012o268K3042M1488M1671
1467D0250K4654m127l0464m2920l7702j5949J3091L5727M3874L2359N897k1938
$$ y = [8334, 52641, 73362, 61141, 24109, -23746, -62087, -72064, -52024, -9140, 38332, 68645, 68056, 39662, -6876, -50579, -71063, -62066, -25686, 22506, 59845, 71319, 52515, 9857, -36209, -66126, -68513, -40251, 5413, 47900, 70091, 62323, 26246, -20288, -57567, -70768, -52371, -11429, 33597, 64976, 67544, 40814, -3003, -45893, -69180, -61426, -27416, 17870, 56412, 69503, 52781, 13563, -31867, -63331, -66622, -41753, 1367, 44674, 67289, 61145, 28855, -16137, -54012, -68281, -53095, -14523, 30193, 61248, 66106, 42613, 47, -42090, -65597, -61538, -29864, 15017, 52527, 67390, 53080, 16019, -27671, -59683, -65951, -42909, -1421, 40250, 64904, 60777, 30313, -12607, -50309, -66258, -53167, -17440, 26434, 58793, 64690, 42752]
1479D2752l9751m1280k4761K589K8469M3122L7864J5992j1421l5406m3046l1477
1491e6354p211J9340L9455M1466K5506k368k7645m1662l7094j7256J0277L4020
1503a9526M2020L2499Q808j9503l8850m0334k5100Q10K5677M0798L7743J8366
1515F3408j0044l2957m1256l2049r397J7631L6713M0354K6711N36k5173m0640
1527f163l7242j8214Q477L0913M0463L2891J1118j6821l6488m0269k6057j422
1539e8814K4016L8931L6700J9751o419l0817m0645l2958j0413J5477L5189L8712
1551B8710K6967L275k3108l8926l6851j9715O972K9327L8902L2037J2309j3919
1563D5980l4068l9656k7404k623K2066L7445L5803K0242m491k8168l9175l3274
$$ y = [42752, 3001, -38279, -63040, -60451, -31982, 11140, 49004, 64996, 53575, 18169, -24877, -56354, -63565, -44225, -4770, 36696, 62202, 59834, 32189, -9473, -46567, -63823, -53546, -19526, 22494, 54993, 63801, 44298, 5448, -34886, -59986, -59176, -33499, 7299, 45042, 63408, 53364, 20407, -20849, -52898, -62295, -44664, -7951, 32403, 59114, 59650, 34477, -6163, -43405, -61619, -53142, -22229, 18234, 51125, 62243, 45422, 8934, -31335, -57392, -58814, -34798, 4133, 40833, 60584, 54165, 23348, -17297, -50255, -60668, -45191, -10002, 28710, 55677, 58952, 35844, -3082, -39933, -59648, -52676, -23349, 15553, 47590, 59899, 45980, 11912, -27744, -55148, -57771, -35705, 1740, 37543, 57785, 53294, 25126, -14049, -47323]
1575d7323j2021J3780L3220L8380K6714M201j9825l6623l7016k0892M663K7192
1587b5550L8255L2330J2627j1361l1846l8363k8029n242K0126L6170L5512K0908
1599E5537l219k5162l7452l3108j4228J1274L1498L7263K7824N513j8570l3614
1611C556l5779k2516K009K4914L7399L2452J3791j0020k9131l7073k8180o833
1623e5411J6953L4078L6260K1290j784k3182l5499l2765j5310Q659K9094L7117
1635A9500K7727P336j6127l2878l4571k2410o29K2703L5765L2573J5718q644k8084
1648A7979l5193k8120q986J5380L1985L4879K3430nk2487l3700l1775j6758P087
1661d6284K6746L5424K9018Q617j4587l1012l4414k2782j282K0117L3270L2915
$$ y = [-47323, -59344, -45564, -12344, 26036, 52750, 56951, 37126, 503, -36513, -57405, -52742, -25550, 12705, 45035, 57662, 46301, 14455, -23908, -51937, -57179, -37053, -883, 34629, 55537, 52318, 27156, -10296, -43404, -57632, -46358, -14860, 22403, 50227, 55740, 37170, 3556, -32223, -54739, -52730, -27816, 9583, 42035, 55826, 45806, 16675, -20398, -48578, -55411, -38458, -4380, 31880, 53170, 51386, 28204, -7295, -40060, -55370, -46711, -17617, 19500, 47227, 54563, 38436, 5558, -29013, -51423, -52052, -29349, 6416, 38989, 54707, 46063, 17979, -17214, -45334, -54320, -38940, -6955, 27924, 51354, 51349, 28862, -4838, -36613, -53371, -46284, -19538, 15886, 44904, 53521, 38934, 7922, -26492, -49274, -50556, -30439, 2831, 35746]
1673C5746J6852o581k5900l5034k7635r227J2423K9818L4340K3316K960k0255
1685C0823l3499l1413j6488M243K5199L4039K8133J0957j2249k9936l3171k3300
1697d6662l454J9459L1327L1327J8684m483k4714l3192k8370j1043J2216K7547
1709a1358L3123K3838L815j7587l0953l2639j7236L925K2485L2553K8862J0998
1721D9826r696k7526l3640k3360l873J6150L0620L1087J7831j753k1796l3165
1733i295k8049j1736R162K6955L1842K3812N874j5683l0266l0406j9389J683K2054
1746b3442L0784K8312J3005q974k5463l1505k4871n542J5282K8355L0631J9620
1758D6192j614j9994l0556k8892j2744P930K4408L2016K3766O165j3272k8158
$$ y = [35746, 52598, 46017, 20117, -14917, -42552, -51779, -39356, -9538, 24802, 48118, 51078, 30823, -2676, -34089, -50577, -46334, -21135, 12904, 41037, 51994, 39745, 9809, -23362, -46662, -50116, -30657, 670, 31997, 50681, 46198, 21484, -11708, -40078, -51121, -38905, -11358, 21765, 45603, 49418, 31831, 878, -31761, -48997, -45072, -22587, 9966, 38828, 49826, 40130, 12604, -21036, -44396, -48269, -32119, -1499, 29588, 47419, 45666, 23870, -9295, -37344, -49080, -39918, -12963, 18879, 42691, 48565, 32882, 2616, -27790, -47179, -45496, -23442, 7342, 35654, 48659, 39685, 14222, -17283, -42154, -47696, -32414, -4059, 26572, 46192, 44578, 24584, -5972, -34864, -47608, -39678, -15270, 16746, 40512, 46677, 33405, 5247]
1770E247l0997j8391k95J8968L0776K7625J3235n927k4424l1065k3441p802J2538
1783c3953K8327K9350J9521J368j9244k9445k6837j5114N851K3755K9701K4790
1795C8070Q482j2797k6665k8856k0835j431J8209K8156K8103J4493n633k1582
1807A7714l0016k4931p761J1176K5441K9952J9884J689j5925k8659k7911j4165
1819d3512L772K1507K9560K3946R125r798k5807k9277j9324l298J5811K8244K6487
1832B7436J5281k873k1149k8610k3895j0350J0101K4511K7669K0917L855j5836
1844B7057k6292k7002j6505L711J9494K7936K4868R923r134k2708k8434k1347
1856c8433l336J3997K5953K7430J5329k013j8373k7945k4278j0112O744K3352
$$ y = [5247, -25750, -44141, -44436, -25468, 5308, 32933, 46168, 40241, 15817, -15248, -38689, -46491, -33953, -5626, 23724, 43245, 44613, 25369, -4076, -30913, -46027, -40176, -16421, 13280, 38070, 46552, 33755, 7090, -21766, -42601, -44032, -25823, 2333, 30436, 44929, 39296, 17714, -12302, -37233, -44994, -33818, -8377, 21575, 41459, 43148, 27223, -1436, -29347, -43512, -39740, -18233, 11327, 35273, 44398, 34600, 8793, -20484, -39808, -43106, -27295, 949, 27436, 42717, 39844, 18695, -9915, -33810, -44160, -34059, -9548, 18121, 39038, 42893, 27057, 765, -26237, -42742, -39031, -19537, 8399, 33267, 43190, 34056, 11348, -17086, -38433, -41769, -27772, -1819, 25611, 40940, 38927, 20554, -7391, -31669, -41781, -35037, -11685]
1868a1685K8182K0097M482j2827k5587k6269j6197N52J8547K7132K3920J1456
1880D1803p291k2252k6738k0804o306J3044K5025K6144J6882p96j7691k5814k4188
1893b8982j2317O673K1209K6845K1831M845j1439k3888k6313j6529r1J5909K5978
1906C731K4828J1453n553k0486k6620k0457o735J0224K4075K6183J6530J097j6023
1919B2247k5661k3109j2504M199K0026K6107K1117P400j0870k3016k4933j6998
1931c5995k031J5256K4570K4039J3148m248j9672k5379k1092p156R654K1340K5122
1944A7556J8375J297j4311k4028k4083j2347L609J8134K4955K1127P909q322k2122
1957G749k5157j7022k212J3053K3808K3204J3497k259j8070k5195k0822q259Q025
$$ y = [-11685, 16497, 36594, 41076, 28249, 2662, -23607, -39804, -39252, -20705, 6427, 30347, 41803, 34512, 12260, -14478, -35282, -41588, -28544, -3519, 22625, 39507, 38711, 21020, -4794, -28982, -41299, -34626, -13417, 13428, 35259, 40104, 28665, 4777, -21536, -38065, -38156, -22247, 3731, 28559, 40012, 34459, 13973, -12647, -33104, -39839, -29615, -5540, 20643, 37173, 38270, 22247, -3414, -26523, -39027, -34828, -14802, 11305, 32422, 39822, 28952, 5936, -18997, -35995, -38026, -22770, 1800, 25839, 38987, 34739, 15067, -10312, -31404, -38560, -28906, -7566, 17556, 35931, 37228, 22917, -1111, -25194, -37541, -33932, -15798, 9157, 30284, 38193, 29871, 7749, -17408, -34430, -36642, -23589, 219, 23423, 36920, 34661, 16591, -8604, -29426, -37685, -29660]
1970b9660K1025K4160J7725L967j3406k3111k3456j3454K574J6912K3651K0927
1982B7854R319p439j9942k4476j8231l405J2425K2168K3148J3586j499j5476k3995
1995e963k1539q901O628J9475K3763J8092M092j0813k2084k3438j4119J329J5636
2008a7842K3118K0902R075n295j8858k3469j8592m446J0847K1634K2157J4289
2020C3520l28j4742k2350k1183j0228N533J8654K2759J7801N107r965k0122k2551
2033a8095j4806j9J3983K2389K0768R973m676j7175k2815j8222n848R497K0317
2046d729K2432J4063Q25j3496k1520k0664j0484L726J7168K2717J8181N657q844
2059B5032j9609k1549j4959j351J2675K1346K0697J0899l683j6287k1641j8426
$$ y = [-29660, -8635, 15525, 33250, 37217, 23811, 700, -22756, -36210, -33636, -16724, 6927, 27854, 37173, 29734, 9792, -14684, -32915, -36320, -23895, -1727, 21421, 35007, 33508, 18032, -5963, -27502, -36403, -29775, -10300, 13463, 31555, 35647, 24834, 2750, -20688, -34807, -33478, -17842, 5276, 26178, 35253, 29958, 11100, -12369, -30961, -35407, -24560, -2926, 19231, 33520, 33192, 18450, -3900, -25083, -35311, -29778, -11124, 11635, 29436, 34543, 24578, 4456, -18095, -32901, -32920, -18937, 3452, 24220, 34193, 29517, 12342, -10473, -28695, -34543, -25046, -4729, 17703, 31766, 32591, 19095, -2425, -23089, -33573, -29847, -12679, 10038, 28219, 33876, 25032, 5423, -16126, -31085, -32436, -19761, 1585, 22282, 33181, 29498, 13211, -8430, -26856]
2071b6856o621P961J8985K1764J5107J433j2076k0586k0121j0992K607J5312K1695
2084G612J8381P082p812j8243k1196j4968k466J1094K0387K0205J1706k420j5286
2097A4076k0885j7846p313O580J7525K1161J5098K789j0398j9973j9604j1803
2109c0593J410J4280K0524J8188Q025o138j7274k0651j5342l451J0310J8887J9758
2122A7933J2031r97j3797k0516j7760p723N330J6271K0682J5164M015r593j8538
2135B502j9715j2243J101J2734J9686J7986Q406m797j5932k0497j5208l809Q781
2148b1005J7920J9184J2318J50j2611j9209j8013q790M857J5435J9367J5245M808
2161B9656q223j7575j9520j2063m00J1880J9071J7500Q806l715j4940j9175j5482
$$ y = [-26856, -33477, -25516, -6531, 15233, 30340, 31773, 19697, -889, -21010, -32002, -29395, -14083, 7612, 25993, 33075, 25263, 7020, -14176, -29144, -31610, -20516, -129, 20076, 31782, 29362, 14076, -6809, -24655, -31968, -25388, -7863, 13298, 28396, 31185, 20787, 814, -18790, -30593, -29183, -14903, 5621, 23809, 31834, 25696, 8422, -12229, -27571, -31022, -20712, -1825, 17933, 29964, 28967, 15170, -5346, -23106, -30829, -25499, -9228, 11454, 26618, 30633, 21040, 2502, -17213, -29456, -28355, -15621, 4065, 22051, 30457, 25660, 9728, -10769, -25977, -29786, -21005, -3085, 16099, 28417, 28567, 15956, -3253, -21266, -30056, -25199, -9764, 9603, 24848, 29656, 21433, 3858, -15662, -27725, -28125, -16245, 2826, 20326, 29132, 25417, 10477, -8698, -24180]
2174b4180n100Q119J6828J8791J2565O34j0950j8739j7509q906L127J4227J9132
2187H039J5295N430p294j6219j8583j2834j378J0459J8079J7496R471k922j3478
2200A1561j8767j5245n806O646J5908J8294J2931K014j0307j7460j7195r923K105
2213b5244J3318J8293J5217O267o057j5311j8179j3211j926R373J7041J7124R974
2226B6679j397j2763j8023j5762n846N497J4545J8104J3141K533q853j6749j7295
2239a6189j0110J683J1889J7744J5320O680m993j4512j7942j3063l175Q709J6299
2252a660J6746J0382p49j1618j7082j5507o893M366J4364J6910J3520L368p995
2265A8152j5729j6516j1065P15J0838J6789J5549P099l747j3448j7490j3340l492
$$ y = [-24180, -29280, -21161, -4333, 14458, 27023, 27657, 16707, -2032, -19541, -28447, -25320, -11093, 8039, 23334, 28764, 21470, 5251, -13332, -26166, -27544, -17085, 994, 18490, 27961, 25039, 11561, -7206, -22451, -28257, -21611, -5703, 12591, 25522, 27536, 17229, -231, -17426, -27349, -25244, -11926, 6367, 21584, 27851, 21794, 6483, -11696, -24907, -26833, -17460, -419, 16705, 26679, 25282, 12519, -5504, -21266, -27112, -21615, -7070, 11034, 24175, 26708, 17855, 1106, -16189, -26299, -24616, -12727, 5017, 20337, 27017, 22024, 7512, -10430, -23493, -26668, -17959, -1660, 15086, 25468, 24719, 13101, -3981, -19488, -26381, -22015, -7651, 9259, 22779, 26147, 18152, 2423, -14093, -25158, -24443, -13605, 3184, 18733, 25832, 22085, 8637, -8853, -22193, -25685]
2278b5685P332J5411J6580J0605L0j0222j6382j5678p494L353J3133J6986J3365
2291B1334M114o928j5042j6178j1062n37J0427J5955J5113P618k978j2674j6143
2304f981j3712m600O715J4451J6305J1132N31r419j5217j5619q138K750J1870
2317i932J6369J3695M605o017j3765j6371j0768j350Q392J5557J5618Q115k231
2330B1917j1607j5932j3312n239N133J3784J5989J1268J626q652j4898j4891q705
2343b3519J531J1462J5526J3583N532n302j3164j5627j1148k580Q658J4255J4908
2356A4115R079j534j0624j5406j3487n521M361J2472J5822J1582K223p461j4127
2369A494j5347q472R88R828J5231J3650N998m087j2601j5149j1380k625O729J3684
$$ y = [-25685, -18353, -2942, 13638, 24243, 24273, 14051, -2331, -18009, -25503, -22150, -9017, 7969, 21334, 25448, 18520, 3478, -12700, -23762, -24299, -13872, 2083, 17196, 24814, 21836, 9162, -6981, -20693, -25293, -18578, -4127, 12178, 23310, 23841, 14422, -795, -16414, -24552, -21802, -9932, 6437, 20132, 24737, 18720, 4955, -11416, -22184, -23534, -15142, 415, 16033, 24148, 21917, 10310, -5622, -18934, -24173, -19040, -5256, 10733, 22001, 23627, 14975, 77, -14814, -23519, -21988, -10526, 5000, 18583, 24115, 18813, 5649, -9978, -21126, -23706, -15048, -793, 14115, 23194, 21660, 11036, -4370, -17857, -23378, -19017, -6545, 9277, 20859, 23082, 15621, 1494, -13853, -22325, -21337, -11509, 3722, 17372, 23370, 19283, 6682, -8467, -19847, -22472, -15743, -2059]
2383b059J4706Q947J69r828j5153j3212o142L666J1705J4810J1536L715p045j3468
2397B347j4325r557L30R407J4096J3409O671l205j1400j4703j2170l085O439J2548
2411c198J4435R374M21q690j4007j3893o152K953J0860J4435J1372L788n183j2688
2425C827j4904r215p13Q449J4136J2788O695j743j0986j4209j1718m084N397J2634
2439c646J3600R517J444q083j3455j3134p190K051J0434J3659J1768M233n299
2452A5899j1276j4003j0086r90P696J3034J3053P179k019r387j3687j1772m482
2465b0841M333J1505J4023R625J462p021j2774j3091p240R17R592J3683J1577
2478A5750M603m081j0862j3548r770k242O598J2753J2732P854j227r010j2959
$$ y = [-2059, 12647, 21594, 21763, 11935, -3218, -16430, -22572, -18906, -7201, 7609, 19145, 22860, 15815, 2347, -11978, -21535, -21205, -11798, 2298, 15707, 22378, 19173, 7773, -6930, -19100, -22185, -15746, -3198, 11237, 20611, 21032, 12342, -1665, -15558, -21710, -18757, -7897, 6538, 17910, 21698, 16515, 3827, -11077, -20292, -21005, -12556, 1580, 14368, 21063, 19320, 8334, -5875, -17593, -21677, -16280, -3646, 9954, 19471, 20915, 12832, -623, -13757, -20947, -18896, -8462, 5197, 16965, 21198, 15899, 4623, -9380, -19466, -20456, -12760, 274, 13327, 20506, 18487, 9100, -4587, -16359, -20841, -16508, -5003, 9020, 18645, 20107, 13086, 312, -12779, -20019, -19102, -9510, 4173, 15750, 20353, 16272, 5410, -8138, -17908, -20150, -13552, -799, 11933, 19787, 18560, 9550, -3409]
2491c409j1485n521L966J0632J3181J0250K291o420j1873j2815p711J31Q595J2827
2505B639J1951N142l224j0172j3141r814k935N454J1886J2779Q077n3q204j2862
2519b477j1286n566K780J0137J2794R999K862n541j1377j2370q076j50P622J2605
2533A956J1382N779k596r886j2470j0031l343N394J1019J2450Q184K03p383j1990
2547a332j1398o009K429R166J2586J0070L278m923j0662j2114q554n84P050J1929
2561I32J1240N881j870q874j2269j0068l508M700J0038J2361Q349R10o624j1531
2575c33j1478o321J604Q952J1676J0276L855m076j0315j1729q460j549O544J1181
2589a73J1314O403j130q250j1838j0188l958L624R833J1650Q681J523n797j1100
$$ y = [-3409, -14894, -20415, -16449, -5817, 7364, 17614, 19905, 13485, 1612, -11203, -18914, -18783, -10188, 2639, 14590, 19732, 16508, 6336, -6805, -16619, -19554, -14100, -2214, 10565, 18642, 18589, 10385, -2477, -13763, -19329, -16549, -6412, 6382, 16381, 19243, 13702, 2325, -10045, -18121, -18271, -10649, 1956, 13338, 19117, 16521, 6635, -5835, -15866, -19209, -13815, -2796, 9654, 17838, 18041, 10658, -1332, -12730, -18739, -16310, -7144, 5442, 15512, 18790, 13867, 3205, -8909, -17463, -18047, -10997, 932, 12172, 18053, 16183, 7309, -4960, -15028, -18536, -13836, -3798, 8563, 16912, 17822, 11198, -333, -11811, -18132, -16528, -7576, 4100, 14376, 18231, 14155, 3840, -7889, -16349, -17898, -11354, -173, 11141, 17544, 16414, 8164, -3674, -13862, -17820, -14196, -4363, 7287, 15968, 17491, 11694, 594]
2603E94j1334o275P11P685J1895J0021M055l002r713j1546q541j944N491J0701
2617a202J1434O620o77p738j1024j0520m189L154R132J1367Q679J980n523j0105
2631A388j1072o611N2P441J1107J0062M545k563q943j1234q940k024M956R875
2645a961J0980P069M0p047j1023j0320m382K337Q758J0894Q534K912m729r871
2659B191j1061o741j93O541J0610R600N513k101q510j0763q894k690M550R453
2673b495J0647O746O94o157j0388r921m965J550Q008J0773Q593K916l641r260
2687C100j0892o847q87N989J0044R799N345j626p364j0453q974l073L729Q805
2701c305J0176P180J191n493r781j0014n452J272P528J0424Q545L266l302q602
$$ y = [594, -10740, -17015, -16304, -8619, 3276, 13297, 17352, 14350, 4637, -6909, -15450, -17394, -11903, -1202, 10232, 16852, 16175, 8437, -2587, -13107, -17296, -14142, -5010, 6357, 15036, 17016, 11493, 1388, -9684, -16295, -16243, -8802, 2305, 12367, 16912, 14349, 5406, -5828, -14768, -16792, -11836, -1961, 9019, 16088, 16128, 9081, -1942, -12262, -16644, -14307, -5549, 5345, 13879, 16791, 12062, 2191, -8870, -15611, -15804, -9263, 1347, 10947, 16460, 14359, 5849, -4914, -13808, -16498, -11948, -2495, 8152, 14898, 15592, 9435, -953, -10874, -15839, -14289, -6281, 4492, 13085, 16001, 12360, 3100, -7792, -14639, -15526, -9537, 507, 10306, 15651, 14025, 6661, -3792, -12766, -15839, -12110, -3305, 6871, 14051, 15242, 9749, -32, -10046, -15498, -14226, -6698, 3726, 12271, 15537, 12235, 3633]
2715C633j0276p413j253N561R529R875N539j235o915r801q924l824L474Q362R901
2730F233P277J305m917r259r497n800M00O861J0232Q510L751k789q218r783p441
2745a3135j883M849R264R532N836q98o202r702q359m261K942P573R714P231K215
2760A4716m513r083r164n864O9O069R705Q580M086k262p687r443p284k341M031
2775a0385Q722R265N964R8o018q894q805m153J964P160R534P637K097l758q430
2790A998r203n937m66N459R083Q731M131j493p055r037p610k788L620Q251R088
2805F772O090O42n564q640q434m449J275P115Q385Q052K508l235p806r143n946
2820a2378j069N362Q253Q504M664j054o401r136p793k608L174P542Q746O554O94
$$ y = [3633, -6643, -14056, -15309, -9748, -219, 9656, 15195, 13960, 7045, -2756, -11680, -15504, -12030, -3668, 6233, 13510, 14815, 9898, 639, -8858, -14658, -14258, -7397, 2835, 11345, 15096, 12307, 4089, -5694, -13135, -15018, -10169, -905, 8627, 14463, 13565, 7363, -2339, -10698, -14959, -12017, -4444, 5270, 12501, 14716, 10203, 1120, -8044, -13908, -13839, -7770, 1935, 10515, 14601, 12339, 4652, -4791, -12075, -14416, -10385, -1663, 7602, 13566, 13664, 7646, -1248, -10053, -14206, -12242, -5082, 4452, 12089, 14186, 10428, 1998, -7205, -13142, -13608, -8149, 934, 9665, 13796, 12303, 5248, -3789, -11399, -14187, -10567, -2316, 6772, 12862, 13504, 7940, -700, -9134, -13583, -12308, -5193, 3192, 11244, 13752, 10517, 2711, -6432, -12378, -13447, -8085, 168, 8672, 13336, 12282, 5881, -3255, -11048, -13656, -10482, -2940, 5806, 12360, 13054]
2835A3054m508q513q323m870J137O104Q864P225L057k496p525q633o207j242M337
2850h539Q076Q408M838n29n891q706p626l102K448O976Q741O332J109l859p981
2865F95q229m840N65N361Q525P421L369k250o736q544o684j140L684P764P977
2880F938N011l10n116q273p371l680K201O359Q380O644J652l536p812p574n386
2895a1873O1M977Q501P118L564j823o266p950o835j898L362P425P921N058M85
2910A1827n098p723p293l903J752N869Q328O408K066l258p024p815n553m11N034
2925f794P461P549L923j540n989p599o952k032K953O997P633N303P21m602p288
2940b56p555l761J130N575P755O512K409k717o748p712n312r76M573P222P257
$$ y = [13054, 8546, 33, -8290, -13160, -12023, -5919, 2945, 10170, 13227, 10731, 3206, -5427, -11634, -12876, -8539, -463, 7945, 12783, 12254, 6363, -2343, -9969, -13071, -10623, -3647, 5094, 11426, 12535, 8676, 695, -7534, -12374, -11809, -6448, 2077, 9498, 12867, 10617, 3881, -4663, -11347, -12487, -8803, -1039, 6938, 11949, 11639, 6523, -1750, -9121, -12801, -10600, -4241, 4139, 10783, 12435, 8899, 1087, -6487, -11873, -11812, -6835, 1666, 8784, 12348, 10525, 4259, -3691, -10526, -12424, -9062, -1637, 6284, 11342, 11827, 6729, -994, -8287, -12190, -10438, -4569, 3759, 10167, 12233, 8975, 1951, -5864, -11417, -11828, -6794, 667, 8216, 12139, 10599, 4610, -2989, -9941, -11973, -9020, -2023, 5610, 10913, 11634, 7032, -256, -7811, -11572, -10442, -4867, 2888, 9400, 11809, 9092, 2344, -5368, -10680, -11656, -7083, 139, 7396]
2955G396M011q55n544p722o473k570K779O453P528N317Q46l595p250p478m109
2970a1266R65N002P582O420K715k406n930p524n580j065L662O849P234M293l84
2985A0567n166p305o534k785K015O303O928N587J466l474o575p363m128L63M344
3000e757P497O234K996j675o141o971n793j491L326O767P034M565k41m880o933
3015a463o276l092J664N710P219N366J882l293o601o896m246r1M232O974O456
3030G545K894j223n503p053n590j859L225O078O939M471J51m314o566o295l314
3045a0414J333M981P050N846J779k749o260o707m334l00L713O384O495L303q37
3060I283n360o753n635j417K026N671O874M594M76l461o646o119l415J017M784
$$ y = [7396, 11407, 10552, 5008, -2714, -9187, -11757, -8978, -2525, 5003, 10320, 11166, 7571, 321, -7157, -11266, -10301, -5299, 2283, 8703, 11418, 9012, 3082, -4442, -10022, -11087, -7425, -576, 6658, 10951, 10567, 5401, -1904, -8438, -11223, -9208, -2905, 4023, 9610, 11076, 7602, 1027, -6336, -10464, -10101, -5757, 1740, 7974, 10970, 9295, 3154, -3817, -9610, -11101, -7775, -1008, 6026, 10591, 10350, 5470, -1463, -7739, -10831, -9167, -3457, 3762, 9128, 11010, 7717, 1116, -5780, -10026, -10117, -5885, 1089, 7545, 10439, 9216, 3713, -3340, -8930, -10789, -7564, -1486, 5453, 9924, 10075, 5761, -805, -7100, -10414, -9081, -4100, 2950, 8796, 10575, 7826, 1566, -5141, -9475, -9775, -6062, 322, 6817, 10120, 9283, 3923, -2830, -8465, -9882, -7856, -2185, 4689, 9283, 9759, 6298, -348, -6467, -9882, -8865, -4081]
3075d081O472N366K335k380n565o339m957o36L656O304O194L451j112m578o370
3090b240n417k294K108N518O450M567R10l396n992o062l727P15M300O432N768
3105G640K125j895n237o413m875q07L081O017N888L730m14l865o360n823k418
3120i626J718N417O195M600J064k899n695o201l375j7M038O196N563K439j660
3135G757m615o491m673j310K850N539N943L788m5l853n976n477k732J526M848
3150b921N716N395R87k500n437n911l840j82L414O132N281K892j099m883n897
3165b853m704j405K198N642N624L927J29l212o046n443k675Q25M579N950M659
3180G195J494k034n074n656m123l8L225N405N253L011q80m382n679m618j437J742
$$ y = [-4081, 2391, 7757, 10092, 7712, 2147, -4192, -9149, -9785, -6129, 175, 6369, 9820, 8708, 4130, -2240, -7657, -9951, -7843, -2325, 4125, 8692, 9602, 6206, 214, -5848, -9575, -8860, -4560, 1872, 7640, 9765, 7870, 2633, -3780, -8655, -9462, -6381, -364, 5524, 9254, 8840, 4975, -1385, -7208, -9626, -7908, -2491, 3704, 8304, 9368, 6469, 774, -5427, -8802, -8819, -4781, 1415, 6978, 9417, 7757, 3142, -3349, -8022, -9332, -6482, -943, 5000, 8788, 8743, 4890, -1086, -6563, -9295, -7769, -2921, 2795, 8190, 9177, 6677, 1240, -4671, -8511, -8693, -5279, 853, 6134, 9026, 7927, 3044, -2853, -7557, -8962, -6764, -1122, 4502, 8429, 8558, 5346, -700, -6143, -8818, -7993, -3414, 2536, 7195, 8689, 6655, 1581, -4075, -8198, -8236, -5011, 394, 5647, 8658, 7778, 3396, -2283, -6901, -8338, -6596]
3196f596M993N811L690M86l087n441n334k713L12M234N679M979J620k165m622
3211A846n527l945o18K953N402N272L053q54m029n449m641j820J621M746N330
3226C340M219P58k761n479n201k953O26L253N516M950J963j538m561n518l834
3241g220p54K503M925N311L092k01l657n050m880k312J738M087N302M093J125
3256H102k520n024m978l159J87L373N334M624J876j334m144n052m162j186K449
3271e614M938M846L372J4l222n231m527k237R29M083N137L923J438k219m658m900
3287c928l201k98L077N115M401K528j187l445n446m014j269K211M340M776L395
3302G055L19l151m481m882k215Q45L576M930M212J119j549m490m840l496j08K690
$$ y = [-6596, -1603, 4208, 7898, 8384, 5297, -144, -5478, -8191, -7879, -3645, 2034, 7013, 8633, 6468, 1846, -3681, -7626, -8244, -5291, 111, 5383, 8436, 7582, 3553, -1896, -6537, -8357, -6736, -1990, 3340, 7559, 8317, 5556, 77, -5124, -8077, -7451, -4198, 1318, 6268, 8231, 6693, 2132, -3386, -7220, -7974, -5471, -546, 4765, 7857, 7656, 3999, -1051, -5931, -8243, -6505, -2418, 2884, 6977, 8102, 5582, 558, -4420, -7579, -7392, -4019, 1315, 5939, 7815, 6481, 2337, -2715, -6877, -8063, -5614, -676, 4170, 7542, 7556, 4334, -897, -5424, -7661, -6732, -2649, 2488, 6411, 7849, 5630, 972, -3928, -7129, -7427, -4350, 765, 5166, 7694, 6507, 3062, -2384, -6398, -7667, -5456, -1116, 3660, 7055, 7374, 4223, -258, -5140, -7355, -6510, -2934, 1996, 6208, 7327, 5778, 1288, -3552, -7048, -7156, -4466]
3318d466M668M654K119k56l543n042l860j974K165L865M767L693L39k367m684
3333G8m690k561P52L266M763M040J552j617m003m604l434m86K196M758M639K065
3349F714k16l140m855m071j516J539L753M604L234Q42k203m353m383k835L90L117
3365c379M404M070J740j201l758m647l294q85K453M143M479K667m69l180m482
3380a339l899j677J292L374M671L254R47j958m155m132k790j3L008M276L926J958
3396F743j147l414m269l351j216J869M025M285K507L8k360m351l964j800O78L442
3412b285M307L391J112j773l773m352k594k67K309M347M166J852q94l219m151
3427a824l371j144J683L554M284K664L20k492l991l958j806L98L025M207L493
$$ y = [-4466, 202, 4856, 6975, 6719, 3176, -1866, -5726, -7700, -5535, -1670, 3097, 6790, 7129, 4762, 78, -4612, -7173, -6421, -3155, 1608, 5648, 7200, 5583, 1580, -3024, -6458, -6944, -4748, 10, 4649, 6714, 6498, 3358, -1497, -5568, -7084, -5545, -1792, 2812, 6046, 6888, 4685, 332, -4051, -6886, -6496, -3379, 1025, 5095, 6835, 5634, 1876, -2771, -6065, -6950, -4497, -354, 4125, 6792, 6323, 3143, -1339, -5238, -6915, -5623, -2249, 2422, 5676, 6623, 4665, 510, -3622, -6412, -6425, -3417, 859, 4785, 6743, 5596, 2182, -2087, -5438, -6654, -4785, -760, 3525, 6032, 6070, 3710, -641, -4605, -6405, -5727, -2285, 2022, 5413, 6525, 4752, 979, -3373, -5967, -6234, -3925, 422, 4588, 6440, 5546, 2327, -1824, -5195, -6339, -4656, -1102, 3182, 5846, 6166, 3674, -317, -4275, -6081, -5683, -2658, 1549, 5042]
3442E042J356j777l453m101k650l85K263L678M042K239o45k859m080l198j716
3457f244J551L286M070K865N04k139l834l926k002N06K567M086L348J326j005
3472D959l223m009l132l82J789L562M023K300n19k568l728l574j382J189L082
3487a613M139K546Q11j926l678l517k408M19K215L880L251J663r82k897m042k869
3503e008n44J379L488L870K274r6k319l722l374j430Q60K691L644L095O18j343
3519D083l342l453k727J72K217L598L322J489o59k616l860k683r86J343L464L415
3535B777K532j07j991l559l450j599N82K274M069K873J010j194l331l338k398
3550d850n58K053L692L047K047n26k632l652k994j258J293L211L508K387M73k162
$$ y = [5042, 6398, 4621, 1168, -2933, -5583, -5968, -3705, -27, 4015, 6254, 5609, 2750, -1330, -4528, -6244, -4693, -1407, 2663, 5528, 6032, 3893, 59, -3867, -5869, -5363, -2796, 1290, 4638, 5964, 4959, 1736, -2273, -5405, -5787, -3998, -436, 3587, 5887, 5368, 2800, -928, -4502, -5884, -4695, -1613, 2526, 5072, 5883, 3957, 279, -3238, -5646, -5227, -3012, 868, 4119, 5782, 4800, 1903, -2139, -5008, -5552, -4173, -685, 3185, 5459, 5363, 3044, -678, -4052, -5482, -4622, -1931, 1713, 4808, 5426, 4083, 741, -2712, -5439, -5267, -3050, 548, 3870, 5359, 4700, 2084, -1776, -4459, -5445, -4102, -638, 2777, 5309, 5202, 3211, -348, -3798, -5397, -4815, -2541, 1528, 4401, 5411, 4217, 886, -2452, -4850, -5408, -3355, 337, 3384, 5431, 4905, 2273, -1379, -4373, -5631, -4338, -1127, 2381, 4768, 5241, 3079]
3566C079k894l520k011N62K176L992K678R35r07k855l490k461k77J754L132L202
3582C095J696R7k264l832k702j170Q09K861L482K453O12j615l209l404j711l0
3598d832K298L711K622J337r34k786l198k524p95J695K956L411J854m28j682l233
3614e28k933j652J065K323L290K541Q05j464k867l184k112R5J772L261K816J411
3630D639m38k512l243k491o73J257L050K906K013r5j786k808l258j331M56K344
3646a970L537K537N93j106k547l304k095j34J620K987L024J549n61k329k785k515
3662c499j024J035K355L368J623O75j884k913k722j648O94J928L208K463P46p70
3678C635k560l258j774l62J466K673K817J865l48k402k470k749j266J211K592
$$ y = [3079, 185, -3335, -5346, -4784, -2608, 1384, 4062, 4997, 4090, 1235, -2255, -4716, -4993, -3239, -107, 3095, 4791, 4888, 2624, -1208, -3910, -5080, -4271, -1410, 2072, 4525, 5137, 3522, 313, -3091, -4802, -4832, -2534, 1177, 3799, 5136, 4202, 1416, -1782, -4306, -5101, -3406, -450, 2961, 4815, 4387, 2705, -528, -3461, -5113, -4048, -1725, 1565, 4106, 4911, 3447, 580, -2604, -4716, -4621, -2849, 412, 3228, 4639, 4201, 1689, -1554, -4045, -4718, -3461, -411, 2495, 4508, 4413, 2627, -181, -3439, -4770, -4314, -1970, 1567, 4104, 4697, 3591, 1044, -2260, -4355, -4489, -2869, 118, 3142, 4691, 4130, 1801, -984, -3499, -4523, -3488, -1133, 2235, 3858, 4533, 2649, -264, -2986, -4634, -3940, -2012, 1196, 3659, 4405, 3635, 1075, -2183, -3957, -4319, -2853, -180, 2637, 4502, 4154, 1752, -718, -3467, -4733, -3522, -930]
3693i30K760K163L41j514k856k605j543K53J976K525K741J174r22k309k866k111
3709c723n09J327K873K470J782m51j528k992k260j227O07K364K739K066O49j431
3725B756k365k497j691j7J746K832K112J367n85k250k651j929r05J340K208K514
3741A985J989o6j662k795k462j340M97K359K788J822J103j148k481k462j925j08
$$ y = [-930, 1830, 3993, 4334, 2820, -36, -2641, -4184, -3931, -1955, 570, 3311, 4485, 3563, 1254, -1612, -3723, -4232, -2905, -32, 2438, 4220, 3769, 2241, -751, -3011, -4238, -3631, -1267, 1472, 3538, 4187, 2756, 391, -2106, -3797, -3814, -2068, 764, 2876, 4243, 3658, 1408, -1243, -3172, -4077, -2737, -529, 1985, 3974, 3908, 2246, -549, -3011, -4351, -3854, -1495, 1293, 3115, 4218, 3070, 589, -1873, -3798, -3906]
$$ [...]
8191F71
##END NTUPLES=NMR FID
##END=
