##TITLE=1H_DE-20HK
 D2O
 8 sc, 
 24.10.2023
##JCAMPDX= 6.0         $$ Bruker NMR JCAMP-DX V2.0
##DATA TYPE= NMR FID
##DATA CLASS= NTUPLES
##ORIGIN= UXNMR, Bruker Analytische Messtechnik GmbH
##OWNER= root
$$ XWIN-NMR		Version 3.5
$$ Tue Oct 24 16:28:57 2023 Russian Standard Time (UT+4h)  she@DPX200
##.OBSERVE FREQUENCY= 200.13135
##.OBSERVE NUCLEUS= ^1H
##.DELAY= (6, 6)
##.ACQUISITION MODE= SIMULTANEOUS
##.ACQUISITION SCHEME= undefined
##.AVERAGES= 8
##.DIGITISER RES= 18
##SPECTROMETER/DATA SYSTEM= spect
##.PULSE SEQUENCE= zg30
##.SOLVENT NAME= D2O
##.SHIFT REFERENCE= (INTERNAL, D2O, 0, 15.7039)
##AUDIT TRAIL= $$ (NUMBER, WHEN, WHO, WHERE, WHAT)
$$ ##TITLE= Audit trail, XWIN-NMR		Version 3.5
$$ ##JCAMPDX= 5.01
$$ ##ORIGIN= Bruker BioSpin GmbH
$$ ##OWNER= she
$$ F:/spectra/data/she/nmr/H-F/1/audita.txt
$$ ##AUDIT TRAIL=  $$ (NUMBER, WHEN, WHO, WHERE, WHAT)
(   1,<2023-10-24 16:27:50.71 +0400>,<she>,<DPX200>,
      <created by zg, POWCHK disabled, PULCHK disabled
       configuration hash MD5:
       00 E9 B6 7A A2 85 ED C7 34 08 36 98 17 FE 4E 26
       data hash MD5: 16K
       83 59 8D AD A5 3D 36 4B 0C 41 67 37 16 11 2E 47>)
$$ ##END=
$$ 
$$ hash MD5
$$ E7 27 CF 8F 5F D7 E5 B9 7C E4 7F 19 AE 2E F4 D2
##$RELAX= 
##$RELAX= 
##$RELAX= 
##$RELAX= 
##$RELAX= 
##$RELAX= 
$$ Bruker specific parameters
$$ --------------------------
##$DU= <F:/spectra>
##$EXPNO= 1
##$NAME= <H-F>
##$PROCNO= 1
##$TYPE= <nmr>
##$USER= <she>
##$AMP= (0..31)
100 100 100 100 100 100 100 100 100 100 100 100 100 100 100 100 100 100 
100 100 100 100 100 100 100 100 100 100 100 100 100 100 
##$AQSEQ= 0
##$AQ_mod= 1
##$AUNM= <au_zg>
##$AUTOPOS= <>
##$BF1= 200.13
##$BF2= 200.13
##$BF3= 200.13
##$BF4= 200.13
##$BF5= 200.13
##$BF6= 200.13
##$BF7= 200.13
##$BF8= 200.13
##$BYTORDA= 1
##$CFDGTYP= 0
##$CFRGTYP= 5
##$CHEMSTR= <none>
##$CNST= (0..31)
1 1 145 1 1 1 1 1 1 1 1 1 1 1 1 1 1 1 1 1 1 1 1 1 1 1 1 1 1 1 1 1 
##$CPDPRG= <>
##$CPDPRG1= <>
##$CPDPRG2= <>
##$CPDPRG3= <>
##$CPDPRG4= <mlev>
##$CPDPRG5= <mlev>
##$CPDPRG6= <mlev>
##$CPDPRG7= <mlev>
##$CPDPRG8= <mlev>
##$CPDPRGB= <>
##$CPDPRGT= <>
##$D= (0..31)
0 1.2 0 0 0 0 0 0 0 0.06 0 0.03 0 0 0 0 0.0002 0 0 0 0 0 0 0 0 0 0 0 0 
0 0 0 
##$DATE= 1698150470
##$DBL= (0..7)
120 120 120 120 120 120 120 120 
##$DBP= (0..7)
150 150 150 150 150 150 150 150 
##$DBP07= 0
##$DBPNAM0= <>
##$DBPNAM1= <>
##$DBPNAM2= <>
##$DBPNAM3= <>
##$DBPNAM4= <>
##$DBPNAM5= <>
##$DBPNAM6= <>
##$DBPNAM7= <>
##$DBPOAL= (0..7)
0.5 0.5 0.5 0.5 0.5 0.5 0.5 0.5 
##$DBPOFFS= (0..7)
0 0 0 0 0 0 0 0 
##$DE= 6
##$DECBNUC= <off>
##$DECIM= 32
##$DECNUC= <off>
##$DECSTAT= 4
##$DIGMOD= 1
##$DIGTYP= 9
##$DL= (0..7)
0 120 120 120 120 120 120 120 
##$DP= (0..7)
150 150 150 150 150 150 150 150 
##$DP07= 0
##$DPNAME0= <>
##$DPNAME1= <>
##$DPNAME2= <>
##$DPNAME3= <>
##$DPNAME4= <>
##$DPNAME5= <>
##$DPNAME6= <>
##$DPNAME7= <>
##$DPOAL= (0..7)
0.5 0.5 0.5 0.5 0.5 0.5 0.5 0.5 
##$DPOFFS= (0..7)
0 0 0 0 0 0 0 0 
##$DQDMODE= 0
##$DR= 18
##$DS= 0
##$DSLIST= <SSSSSSSSSSSSSSS>
##$DSPFIRM= 0
$$ [...]
##$SUBNAM1= <"">
##$SUBNAM2= <"">
##$SUBNAM3= <"">
##$SUBNAM4= <"">
##$SUBNAM5= <"">
##$SUBNAM6= <"">
##$SUBNAM7= <"">
##$SUBNAM8= <"">
##$SUBNAM9= <"">
##$SW= 18.05172834244
##$SWIBOX= (0..15)
0 0 2 0 0 0 0 0 0 0 0 0 0 0 0 0 
##$SW_h= 3612.71676300578
##$TD= 16384
##$TD0= 1
##$TE= 0
##$TE2= 300
##$TE3= 300
##$TEG= 300
##$TL= (0..7)
0 120 120 120 120 120 120 120 
##$TP= (0..7)
150 150 150 150 150 150 150 150 
##$TP07= 0
##$TPNAME0= <>
##$TPNAME1= <>
##$TPNAME2= <>
##$TPNAME3= <>
##$TPNAME4= <>
##$TPNAME5= <>
##$TPNAME6= <>
##$TPNAME7= <>
##$TPOAL= (0..7)
0.5 0.5 0.5 0.5 0.5 0.5 0.5 0.5 
##$TPOFFS= (0..7)
0 0 0 0 0 0 0 0 
##$TUNHIN= 0
##$TUNHOUT= 0
##$TUNXOUT= 0
##$USERA1= <user>
##$USERA2= <user>
##$USERA3= <user>
##$USERA4= <user>
##$USERA5= <user>
##$V9= 5
##$VALIST= <valist>
##$VCLIST= <CCCCCCCCCCCCCCC>
##$VD= 0
##$VDLIST= <DDDDDDDDDDDDDDD>
##$VPLIST= <PPPPPPPPPPPPPPP>
##$VTLIST= <TTTTTTTTTTTTTTT>
##$WBST= 1024
##$WBSW= 4
##$XGAIN= (0..3)
0 0 0 0 
##$XL= 0
##$YL= 0
##$YMAX_a= 29727
##$YMIN_a= -25672
##$ZGOPTNS= <>
##$ZL1= 120
##$ZL2= 120
##$ZL3= 120
##$ZL4= 120
##$ABSF1= 10
##$ABSF2= 0
##$ABSG= 5
##$ABSL= 3
##$ALPHA= 0
##$AQORDER= 0
##$ASSFAC= 0
##$ASSFACI= 0
##$ASSFACX= 0
##$ASSWID= 0
##$AUNMP= <proc_1d>
##$AZFE= 0.1
##$AZFW= 0.1
##$BCFW= 1
##$BC_mod= 2
##$BYTORDP= 1
##$COROFFS= 0
##$CY= 11.3945322036743
##$DATMOD= 1
##$DC= 2
##$DFILT= <>
##$DTYPP= 0
##$F1P= 15.7292609196834
##$F2P= 12.9074282941183
##$FCOR= 0.5
##$FTSIZE= 0
##$FT_mod= 4
##$GAMMA= 1
##$GB= 0.15
##$INTBC= 1
##$INTSCL= 1
##$ISEN= 128
##$LB= 0.24
##$LEV0= 0
##$LPBIN= 0
##$MAXI= 10000
##$MC2= 0
##$MEAN= 0
##$ME_mod= 0
##$MI= 1.114404
##$NCOEF= 0
##$NC_proc= 0
##$NLEV= 6
##$NOISF1= 3.799351
##$NOISF2= 2.8
##$NSP= 1
##$NTH_PI= 0
##$NZP= 0
##$OFFSET= 15.70392
##$PC= 1
##$PHC0= -23308.15
##$PHC1= 7.6527
##$PH_mod= 1
##$PKNL= yes
##$PPARMOD= 0
##$PSCAL= 0
##$PSIGN= 0
##$REVERSE= no
##$SF= 200.130013532006
##$SI= 16384
##$SIGF1= 3
##$SIGF2= 2
##$SINO= 400
##$SIOLD= 16384
##$SREGLST= <1H.CDCl3>
##$SSB= 0
##$STSI= 0
##$STSR= 0
##$SW_p= 3612.71676300578
##$SYMM= 0
##$S_DEV= 0
##$TDeff= 0
##$TDoff= 0
##$TI= <>
##$TILT= no
##$TM1= 0
##$TM2= 0
##$TOPLEV= 0
##$USERP1= <user>
##$USERP2= <user>
##$USERP3= <user>
##$USERP4= <user>
##$USERP5= <user>
##$WDW= 1
##$XDIM= 8192
##$YMAX_p= 0
##$YMIN_p= 0
$$ End of Bruker specific parameters
$$ ---------------------------------
##NTUPLES= NMR FID
##VAR_NAME=  TIME,          FID/REAL,        FID/IMAG
##SYMBOL=    X,             R,               I
##VAR_TYPE=  INDEPENDENT,   DEPENDENT,       DEPENDENT
##VAR_FORM=  AFFN,          ASDF,            ASDF
##VAR_DIM=   8192,          8192,            8192
##UNITS=     SECONDS,       ARBITRARY UNITS, ARBITRARY UNITS
##FACTOR=    0.0002768,     1,               1
##FIRST=     0,             0,               0
##LAST=      2.2672688,     0,               0
##MIN=       0,             -25672,          0
##MAX=       2.2672688,     29727,           0
$$ Real data points
##PAGE= N=1
##DATA TABLE= (X++(R..R)), XYDATA
0@%%%%%%%%%%%%%%%%%%%%%%%%%%%%%%%jPj4J6j6J6j6J6j6J9k4K9l2L2l5M1m6N0
$$ 0 0 0 0 0 0 0 0 0 0 0 0 0 0 0 0 0 0 0 0 0 0 0 0 0 0 0 0 0 0 0 0 -1 6 -8 8 -8 8 -8 8 -8 11 -13 16 -16 16 -19 22 -24 26
49B6n4O0o7P2q0Q8r6J09j18J28j43J57j76J97k18K42k66K82k57L1J798K8012j6683
$$ 26 -28 32 -35 37 -43 45 -51 58 -60 68 -75 82 -94 103 -115 127 -139 143 -114 -83 1715 29727 13044
72A3044q776J4457k5571j3873J3730o899K828K7782J557q245j99j4486j0314K566
$$ 13044 4268 18725 -6846 -20719 -6989 -13888 -11060 16722 18279 10034 9835 -4651 -14965 -12399
86a2399l388J2234K0184k586k932j91j8907p618N721m915J0666K1719l420m064
$$ -12399 -15787 -3553 16631 14045 11113 10922 -7985 -15603 -9882 -14797 -4131 17588 14168 10104
100A0104O18k0442r713J1913n33M255J7557L80m260j444j7036q139P883r42Q050
$$ 10104 10722 -9720 -19433 -7520 -8053 -3798 13759 14139 9879 8435 -8601 -16740 -8857 -9799 -1749
115a749J7325k825l482j96k0591p980J4550j283K496J9004j338p224J418j7851
$$ -1749 15576 12751 9269 9073 -11518 -19498 -4948 -6231 -3735 15269 13931 6707 8125 -9726
129i726j1247J5587K793n84J7405O18j0863J346j1350j3599J0902P371P30J3087
$$ -9726 -20973 -5386 -2593 -3177 14228 14846 3983 5329 -6021 -19620 -8718 -1347 -617 12470
143A2470K244r686k109j0340j0740R849P520K068J1848K91j0765r31p205j1370
$$ 12470 14714 5028 2919 -7421 -18161 -8312 -792 1276 13124 13415 2650 1719 -5486 -16856
157a6856P467R205K897R719O31j0288k990o253q817O669Q451L867Q930o43j0224
$$ -16856 -9389 -184 2713 12432 13063 2775 -215 -6468 -15285 -8616 -165 3702 12632 11989 1765
172A765k326o031q545P376Q797K978Q731q54j1748k181l732q477O625R608K191
$$ 1765 -561 -6592 -15137 -7761 1036 4014 12745 11891 143 -2038 -5770 -14247 -7622 1986 4177
187D177P395O46j1925m194k343o771N666J0008K701N675J76j1267m672j744n441
$$ 4177 11572 12218 293 -3901 -6244 -13015 -7349 2659 5360 11035 11211 -56 -4728 -6472 -11913
202a1913N417R593K337N045O12j1408n912n88l903M725R727K498L150P68r922
$$ -11913 -6496 3097 5434 10479 11091 -317 -6229 -6817 -10720 -5995 3732 6230 9380 10148 226
217B26o937q92k282M743R419K692K065r4r279o773n39j466M496R178K839R55l09
$$ 226 -6711 -7603 -9885 -5142 4277 6969 9034 8940 -339 -7112 -7651 -9117 -4621 4557 7396 8351 8042
234H042q353p109q97j86M905Q493K764O50j188q225o272n29k11M875Q884K421
$$ 8042 -311 -7420 -8317 -8503 -3598 4895 7659 8309 7121 -1104 -7376 -7905 -8116 -3241 5643 8064
250H064n47j259p472o800j10J215M309P942L083q68k337p109n966j38J360M775
$$ 8064 7517 6258 -1214 -8014 -8124 -6909 -2600 5342 8425 7557 5220 -1889 -7855 -7993 -6633 -1858
266a858P770K656j547k412o709o267M29K489M015P074L277j952l504o165n391
$$ -1858 5912 8568 7021 4609 -2100 -8367 -7938 -5449 -1434 5640 8917 6965 3461 -2704 -8095
281h095k8K927M889O267K413j654l514o519n181R65L181M313O318K384k616l874
$$ -8095 -8123 -5196 -307 5960 8373 6719 3205 -3314 -8495 -7530 -4349 -36 6282 8666 6050 2176
297B176n376n212L66M272N003M892J988k135m217n689m287O30M143N178M812J342
$$ 2176 -3200 -8412 -8046 -3774 1229 6121 8109 5974 1757 -3932 -8219 -7589 -3446 1732 6544 7886
313G886k637m038n303m212Q61M622N164M348R92k916m387m542l733M52M821N708
$$ 7886 5249 1211 -4092 -8304 -7443 -2821 2343 6691 7683 4767 380 -4162 -7895 -7443 -2622 3086
329C086L851L91k881m586m583k873R39M352N531M094J71l801m742l824k355Q18
$$ 3086 6937 7328 4447 -139 -4722 -7595 -6656 -2304 3227 7321 7492 3691 -1051 -4875 -7230 -6412
345f412M401N632L855k75l832m902l742j791J255M409N182L536j00m075n514l488
$$ -6412 -2011 3621 7476 7201 3369 -1533 -5275 -7066 -5811 -1402 3780 7316 7216 3141 -2373 -5861
361e861n70J361L599N534L588r85m250m926l665n97K460L905M304L214l47m367
$$ -5861 -6431 -5070 -1471 4063 7651 6666 2416 -2510 -6175 -6772 -4312 -407 3897 7111 6764 2397
377B397n570l344J20K600L946M119K705o03m343n481l353L85L140M170L674J972
$$ 2397 -3173 -6517 -6397 -3797 149 4268 6973 6370 2027 -3454 -6807 -6422 -3282 888 4562 6534
393F534p31l897n508l381M51L845M388K980J475o39m070n442k841O34L514M893
$$ 6534 5803 1906 -3602 -6983 -6532 -2687 1701 4681 6156 5517 1447 -3995 -6836 -6202 -2688 2205
409B205L286K87j267l297n090l343J210M054M355L097M60k006l467m222l110O56
$$ 2205 5491 5778 4511 1214 -3876 -7219 -6009 -1955 2400 5497 5957 3951 484 -3738 -6848 -6192
425f192M421N040K636j68k401l560l639k506M82M213N153K548m49k504l957l418
$$ -6192 -1771 3269 5905 5737 3336 -224 -3863 -6369 -5887 -1674 3479 6027 5578 3074 -883 -4301
441d301j604M98L769N505K634j182k718l933l229r85N51L294N754K687j692k802
$$ -4301 -5905 -5407 -1638 3867 6501 5319 2601 -1332 -4561 -5546 -4995 -1701 4053 6740 5048 2246
457B246m056l618J34J732K060M854L731j858l727l340l263o31K222L124M065K993
$$ 2246 -1810 -5428 -5294 -3562 -1502 3352 7083 5225 1498 -1842 -5105 -5736 -3514 -390 3675 6668
473F668j348m052m011k712K38K347K689L682K899j135l978m386k818Q06K852K861
$$ 6668 5320 1268 -2743 -5455 -5217 -2870 -181 3501 6400 5265 1287 -3099 -5917 -5111 -2259 602
489F02L274K106j436l469m007k969P53K982L112L290J625j542l274m583l174K099
$$ 602 3876 5982 4546 1077 -2930 -5899 -5146 -2164 948 4238 5863 4321 1047 -3536 -6710 -4611
505d611L563K095L049J703k474k606l234m127J039M954K631K325J591l005l205
$$ -4611 -1048 1047 4096 5799 3325 719 -2515 -6642 -5603 -649 1982 4307 5898 2893 -312
520c12k194l567N45N177K596J642K000k663m279k078k653K32N395L547R10O51
$$ -312 -2506 -6073 -5528 -351 2245 3887 5887 3224 -1055 -3133 -5786 -5554 -159 3388 4298 4949
536D949k438l622j840k278nM624L899J502O11l147m273j626j402N06M576L387
$$ 4949 2511 -1111 -2951 -5229 -5234 -610 3289 4791 5402 2255 -2018 -3644 -5046 -4540 36 3423
552C423J131L29k852l968j648j489P84M529L409J395j15l769l824p21j197O39
$$ 3423 4554 4883 2031 -1937 -3585 -5074 -4290 239 3648 5043 4928 1159 -2665 -3386 -4583 -3944
568c944M528K723J211Q93m065m840m21n29O80N159K626j52Q44l368n232J05J05
$$ -3944 584 3307 4518 5411 1346 -3494 -3915 -4444 -3764 1395 4021 3869 4713 1345 -3887 -3782 -3677
585c677j17M870L323m40M91k993n721k64J172K19M518L341j085Mk051n617r86
$$ -3677 -3794 1076 4399 3959 4450 1457 -4264 -4528 -3356 -3137 1381 4722 3637 3641 1590 -4027 -5013
602e013J785N59M011L825j099j201k000m677j202J871J208L368L207o64j060k408
$$ -5013 -3228 -2669 1342 5167 4068 2867 867 -3810 -5012 -3141 -1933 1435 4642 3978 2918 510
618E10m475j061J604J731M040K554j349j067k373m289l36J724J009L985L055j773
$$ 510 -3965 -5026 -3422 -1691 2349 4903 3554 2487 114 -4175 -4511 -2787 -1778 2207 5262 3489
634C489j224k179m721j46K468R44L782L041k351j462j542m655l90L025Q42L315
$$ 3489 2265 86 -4635 -4781 -2313 -1369 2413 5454 3103 1641 99 -4556 -4946 -1921 -1079 2236
650B236L665k567k468j154m240n45L713R87K257L592k093k935q62l798j222L960
$$ 2236 5901 3334 866 -288 -4528 -5073 -1360 -373 1884 5476 3383 448 -414 -4212 -5434 -1474
666a474J927J631L182j645l634j194k575j192L398K398J668K389j458l179j785
$$ -1474 453 2084 5266 3621 -13 -1207 -3782 -4974 -1576 822 2490 4879 3421 242 -1543
681a543k645m91L471K313J605K065j855l224j180k423p54L480K501J633J865k167
$$ -1543 -4188 -4679 -1208 1105 2710 4775 2920 -304 -1484 -3907 -4661 -1181 1320 2953 4818 2651
697B651l254j191k290l51L789K209J249J954k333l608m62k118j048M226K719O47
$$ 2651 -603 -1794 -4084 -4435 -646 1563 2812 4766 2433 -1175 -1637 -3755 -4803 -577 2142 2789
713B789J856j985m401m94r16j057L541L050M56J492j707m498q87k98q27L347L322
$$ 2789 4645 2660 -1741 -2235 -3151 -4208 -667 2383 2839 4331 2624 -1874 -2761 -3059 -3886 -539 2783
730B783K89P54j415m261j329J66k66K770L068P47O17j877m182j094J93p2L061
$$ 2783 3072 3826 2411 -1850 -3179 -3013 -3279 -509 2559 3306 3923 2046 -2136 -3230 -3037 -3109 -48
747d8K892J76N02j378m384j444P61L77K631K791L64L9j660l898j354N71P57K875
$$ -48 2844 3020 3522 2144 -2240 -3684 -2923 -2546 85 2876 3240 3279 1619 -2279 -3633 -3062 -2305 570
765E70K546j39L7j451l972j382Q29P98K970K632o28l63j003l829j649J151J061
$$ 570 3116 2977 3014 1563 -2409 -3791 -2962 -2164 806 3438 2810 2447 1444 -2385 -4034 -2883 -1822
782a822K755K692n99r56j042l249j716R95J314K813K626r15j219r03k965j811
$$ -1822 933 3625 3026 2070 1028 -2221 -3937 -2942 -1628 1185 3811 2896 1677 774 -2191 -4002
798d002J215J478K538K496n69j695j243k366j563R53J581K663K381p57j858j434
$$ -4002 -2787 -1309 1229 3725 3156 1461 218 -2148 -3711 -2758 -1177 1486 3867 3110 1252 -182
814a82k147j235J110J462K519K409q96k032j438k126j016J477J493J980K503n19
$$ -182 -2329 -3564 -2454 -992 1527 3936 3040 1008 -430 -2556 -3572 -2095 -602 1378 3881 3362
830C362k692j624j523q80J218J885J955J828k67k355k266j566k44J448J472K006
$$ 3362 670 -954 -2477 -3357 -2139 -254 1701 3529 3262 907 -1359 -2925 -3169 -1721 -249 1757
846A757J857n60k398k014j625k91J906J678J404J645l01k521k149j398j40J835
$$ 1757 3614 3054 656 -1358 -2983 -3274 -1368 310 1714 3359 3058 537 -1612 -3010 -3150 -1315
862a315J989J290J188l69k302k218j448P7K000K035J216Q70n54k141k142j346
$$ -1315 674 1964 3152 2783 481 -1737 -3185 -3108 -1108 927 2143 3013 2459 318 -1824 -3170
878c170R2K095K180J129N04o39k081j987j257J66K083K331J114J01p41j968j970
$$ -3170 -3078 -983 1197 2326 2830 2191 110 -1877 -3134 -2968 -885 1446 2560 2661 1920 -48 -2018
895b018j034K44K056K381J101J6j198j878j615j022K09K162K385R81j88j122k060
$$ -2018 -3052 -2808 -752 1629 2730 2746 1548 -330 -1945 -2967 -2758 -596 1789 2770 2582 1460 -600
912f00j642m89L23J769K477J158m50j438j944j348n25N31J718K298J181m94j544
$$ -600 -2242 -2731 -2408 -639 1838 2996 2546 1108 -836 -2184 -2709 -2178 -460 1838 3019 2525 981
929I81k040j428j15P67J612K107J108n67j655j934j303j90R51J669J926J135n61
$$ 981 -1059 -2487 -2602 -1835 -223 1884 2992 2425 770 -1164 -2467 -2657 -1706 -37 1889 3024 2463
946B463j958j914j100p2J163J837J460Q49k98j894k177r94J07J175J946J525N16
$$ 2463 505 -1409 -2509 -2581 -1418 419 1879 2728 2430 536 -1641 -2635 -2528 -1353 593 2118 2634
963B634m95j823k084p94L27J016J853J726J80o81j422k226j181P50J537J525J419
$$ 2634 2139 316 -1768 -2562 -2235 -1219 634 2360 2540 1859 437 -1789 -2970 -2220 -683 842 2261
980B261L04r87j543j691j107N32J511J707J417K32j206j712j421j005M54J898
$$ 2261 2565 1578 35 -1656 -2763 -2231 -720 987 2404 2636 1430 -282 -1703 -2708 -2254 -356
996c56J546R49L07r79j889j562n59L51J821J963P76j32j071j916j252k77L10J547
$$ -356 1190 2139 2446 1467 -422 -1984 -2543 -2192 -371 1592 2368 2236 1165 -751 -2003 -2280 -1970 -423
1014d23K058P93l64q62j811j820j06J067J287J784J092p53j255j376j455l79J119
$$ -423 1635 2428 2064 1202 -609 -2429 -2535 -1468 -181 1603 2695 1942 687 -689 -2144 -2523 -1404
1031a404J404J533J202o21j735j338j155l72J247J726J032P20j23j676j602q66
$$ -1404 0 1533 2735 2114 379 -959 -2114 -2486 -1239 487 1519 2239 2116 440 -1162 -2028
1047b028m34J052K085J202L48l01j676j761n44j6Q56J904J305J98n16j296j832
$$ -2028 -2462 -1410 675 1877 2225 1924 248 -1513 -2057 -2073 -1217 687 1992 2190 1674 378 -1454
1064a454r08K84J153J708J393M6r50j271j422q55L25J156J519J454K87j157j528
$$ -1454 -2362 -2078 -925 783 2176 2222 1272 1 -1421 -2276 -1951 -795 724 2178 2465 1308 -220
1081b20j295p73L09J582J444Q54L29j045j677j059m50o9J477J874P86J58r12k168
$$ -220 -1515 -2288 -1979 -397 1047 1901 2230 1185 -492 -1551 -2001 -2070 -593 1281 2067 2225 1313 -855
1099h55j099J46K15J166J798O97j62o25j841j627K19N86R76J874Q14o01q62j460
$$ -855 -1954 -1808 -1593 -427 1371 2068 1906 1281 -560 -2187 -1968 -1382 -406 1468 2282 1681 819 -641
1117f41j405J33P66R06J497J026m36j101j581j356Q8J190J158J171O26l91j098
$$ -641 -2046 -1913 -1147 -241 1256 2282 1846 745 -836 -2192 -2104 -914 244 1415 2041 1650 552
1134E52j419j196kR79J351J319N56n38j200j491j043K48J051J327J162K28m40
$$ 552 -867 -2063 -2065 -1086 265 1584 2140 1602 402 -1089 -2132 -1884 -833 494 1656 1884 1444
1151A444q81j584j229L77J045J385J454n1j006p53j198j221M95J135J043J433
$$ 1444 563 -1021 -2250 -1873 -828 557 2011 1960 954 201 -997 -2218 -1723 -588 455 1888
1167A888L02j237r13j079j297N22J512J061J126J75j335r82p21j063K45J444J133
$$ 1888 2190 953 40 -1039 -2336 -1814 -302 759 1885 2060 725 -257 -978 -2041 -1796 -352 781
1184G81J118K34j379j339o89o56K81J440J162Q69K34j336j309p35o01M43J333
$$ 781 1899 2133 754 -585 -1274 -1930 -1649 -209 953 1822 2056 720 -589 -1324 -1925 -1482 -149
1201a49J205R26l7j433j313o77k75N28J257Q81R07K33j529j452n94l75P79J414
$$ -149 1056 1982 1945 512 -801 -1478 -1753 -1225 32 913 1820 2053 524 -928 -1522 -1897 -1118 296
1219B96P27P11J67j534j385m49l69P29J618O15M38K73j432j577m36o8O80J615
$$ 296 1023 1734 1901 367 -1018 -1467 -1836 -1107 511 1126 1564 1837 405 -1172 -1608 -1676 -996 619
1237F19O49J82K58j279j695l08j08O98J789P18j44K1j076j596m93J69Q22J565
$$ 619 1268 1450 1708 429 -1266 -1574 -1682 -984 805 1523 1379 1400 324 -1272 -1765 -1596 -774 791
1255G91P23q3j22j136j412m70J41P62J743P26k80l03j058j357l07J53P92J683
$$ 791 1514 1431 1309 173 -1239 -1709 -1568 -806 937 1663 1383 1080 22 -1335 -1642 -1489 -697 986
1273I86P53m11l78j056j303j33K07P21J638P73n10m65r88j314m9L41O19J673Q06
$$ 986 1739 1328 950 -106 -1409 -1542 -1335 -614 1024 1797 1287 822 -166 -1480 -1529 -1188 -569 1104 1910
1292A910o63n69r83j255N8N10N68J467Q57o18o95j036j123J19O02N25J338Q74
$$ 1910 1247 678 -305 -1560 -1502 -992 -424 1043 1900 1282 587 -449 -1572 -1453 -851 -326 1012 1886
1310A886n93r17q52j116k6Q91O98J088P01n39q29j036j029J83R05O04J058P73
$$ 1886 1293 376 -476 -1592 -1618 -727 -29 1059 1760 1221 392 -644 -1673 -1490 -585 19 1077 1850
1328A850o85q55r73j043K21J035P13Q55O40o76r52q99r15K20J060P11Q72M78o84
$$ 1850 1165 310 -663 -1706 -1485 -450 263 1118 1758 1082 130 -769 -1684 -1464 -404 307 1179 1657 973
1347I73r29q72q76K86J141P30P19M68p32j056o86q21J94J238P97O71L96q48j020
$$ 973 44 -828 -1704 -1418 -277 453 1172 1640 908 -148 -834 -1655 -1461 -223 574 1245 1641 793 -227
1366b27o79o14J26J266R03N37K74q67j057n93n40K18J173Q45M69K84q82j155n28
$$ -227 -906 -1520 -1394 -128 775 1312 1586 719 -338 -931 -1471 -1253 -80 765 1234 1518 636 -519 -1047
1385a047m01K63J125R40M26O9q55j043n52l13L06J068R48L64J0q18j144n21j61
$$ -1047 -1448 -1185 -60 880 1306 1375 520 -523 -1075 -1388 -1082 -14 934 1298 1308 490 -654 -1175 -1336
1404a336L52J037R35L93j00q96j086m64j97M65J131Q13J72k1q64j147m34l3M69
$$ -1336 -984 53 988 1381 1281 385 -701 -1165 -1362 -897 234 1047 1219 1198 334 -813 -1247 -1280 -811
1423h11J121P78J50j61p96j132m67J05L78J186Q46N4k75p95j084l62J17N56J089
$$ -811 310 1088 1238 1077 281 -851 -1318 -1213 -835 351 1197 1251 976 181 -903 -1265 -1148 -592 497
1442D97P26j1l20q32r72m85L35N71R71Q01Pn76q22p91l61K35O40R45O74J8n01
$$ 497 1223 1212 892 60 -912 -1397 -1062 -491 480 1281 1288 712 -110 -901 -1262 -1027 -387 558 1232 1250 749
1463G49q64r15k70K75P83Q48N99L0n86q99p64j72K41O81R10N71q4n85q84q48J9
$$ 749 -115 -1030 -1300 -1025 -242 606 1205 1235 649 -250 -1014 -1186 -945 -264 646 1217 1133 548 -336 -1184 -1165
1484a165M07N87Q42O61l11n17p69q62j81O02O68P81N82k86o65p85p25j08O14P38
$$ -1165 -758 -171 671 1332 1021 504 -265 -1127 -1308 -706 -38 743 1325 1039 374 -411 -1136 -1244 -630 108
1504A08O88M38k08p65o74p33j77O61R92N32J90m0p99p98n66qM70R80O99J27k63
$$ 108 796 1234 1026 261 -413 -1146 -1323 -662 330 862 1052 1012 213 -585 -1151 -1159 -689 291 990 1117 854
1525H54o32r31n15K06M87R03O99Ml90n38p81n09O4N59Q52Q02K2n51n89o96m84
$$ 854 222 -709 -1224 -1018 -531 372 1071 1075 685 147 -634 -1143 -1079 -520 332 1134 1156 605 16 -680 -1164
1546a164K12O09P07O50J25n52p24m91m95J01P99P89M71J02o44q51m15k11P4O04
$$ -1164 -952 -343 364 1014 1139 587 -137 -628 -1123 -1022 -223 566 1037 1139 495 -356 -771 -982 -908 -304
1566c04Q05N45R8n41r87n94j2L02N34Q42L81j14m38p93o74n4L29N26Q05O03l12
$$ -304 501 1046 1144 603 -384 -978 -990 -688 -154 688 1069 955 517 -276 -950 -1004 -675 -149 656 1259 947
1587I47o66o58o54l6O48M15N07N36m7p05o67o30k03O91Q21M40K66r2p72o40l57
$$ 947 281 -377 -1031 -1067 -419 -4 503 1039 992 287 -380 -1010 -1213 -522 299 739 1005 913 141 -499 -856
1608h56j25L97Q44M11K59N9o57r97l90Q0N56Q37M41Jk11l81q06m72O3L68Q90P02
$$ -856 -981 -584 260 671 930 989 332 -665 -1055 -975 -419 418 859 860 649 268 -538 -1010 -947 -579 311 1013
1630A013Lm46n01p20l73K09N07O08O37O7m92n09m94o24K07P18O30N04J3n17o74
$$ 1013 1016 570 69 -651 -1024 -815 -308 300 937 1004 512 3 -491 -1115 -908 -190 440 944 957 440 -234
1651b34l30l64P1O14P13L82J47l86q54m92j89J31N75P94L05q8l15p27n41n0J47
$$ -234 -564 -928 -857 -243 470 852 999 613 -241 -733 -922 -791 -216 578 883 795 480 -247 -788 -838 -691
1672f91N51P17N07k69m82o65n71O9L34L44O54M90j58n67n46n46j48M82N53N10
$$ -691 -140 577 1084 815 333 -332 -903 -834 -500 -156 498 988 830 263 -283 -829 -977 -495 58 568
1692E68L94j90n94n47m17j02M33O23L97L22p0o57o74l62m1N14O35M76J39j64n45
$$ 568 962 772 178 -369 -786 -888 -455 168 565 887 817 160 -514 -876 -917 -403 232 708 847 683 138
1713A38o21m16O8M52O53M45J45j98n34p13l67J40N19O06M72L1l30m63n56l53M5
$$ 138 -483 -899 -831 -379 274 719 864 666 132 -581 -948 -808 -289 317 789 820 490 27 -529 -882 -837
1734h37N91O04L91P0k62o18n05k51P2N74O25K99Q9l92n95m69j95O2N64P17K88
$$ -837 -246 358 749 819 557 -61 -566 -817 -745 -171 454 753 842 450 -145 -614 -809 -747 -183 534 822
1755H22r4k90o35n25o3J87M66O34L05l8l94o36m39r9K22M81O11L20j22l90o89
$$ 822 728 438 -197 -722 -785 -598 -132 502 807 769 375 -261 -700 -799 -577 -96 515 835 713 323 -366
1776c66l64NJ86M59O79K34j93l26o56m39N4K51N03O02J83j78m39n64m55M2L96
$$ -366 -730 -725 -539 -80 599 833 640 314 -342 -781 -727 -476 27 629 812 634 195 -369 -824 -782 -386
1797c86M33N76K22k35l99o17m49J29L82N37M43J92l37m30m84m20K00L69M93N10
$$ -386 47 623 845 610 211 -406 -855 -726 -344 193 636 828 491 61 -423 -843 -643 -274 219 729
1817G29O0l74l77n06m01K78L36M60M64N2l35m12m95k50J67L85N01M16M7l68m44
$$ 729 789 415 38 -468 -869 -591 -255 205 669 721 386 -26 -521 -771 -604 -219 282 698 745 377 -67
1838f7m66k95K47M75M13L91P7m49m11m50k61K63M67L69L88N7m84m41l51k85K78
$$ -67 -533 -828 -581 -106 307 698 775 326 -85 -535 -796 -533 -66 303 691 748 264 -177 -528 -813 -535
1859e35N13L43L53M6n22m94l34q9K29N24L81K47J2n10l95l75j08L22N17L65J84
$$ -535 -22 321 674 720 198 -296 -630 -719 -490 34 415 662 674 164 -231 -606 -714 -392 125 490 674
1880F74o2m83m10l18j63M10N39L05J88q3n23m37k28p4K61O24L29M1l4m97m57k32
$$ 674 612 129 -281 -599 -762 -352 187 492 680 597 74 -363 -591 -665 -404 220 549 590 556 59 -398 -630
1902f30j06M01O15K83N6j25n27m04j88OL31N79K89N0k08m38l95k08M3L23N97K96
$$ -630 -736 -335 280 563 619 494 -33 -437 -625 -619 -288 291 580 630 422 -16 -411 -619 -576 -253 344 640
1924F40K4k29n19m13j00O1K91N80L14k9k21m89m28j05J15L10N25K77q7j60m77
$$ 640 664 435 -84 -497 -597 -536 -245 335 649 620 399 -90 -518 -623 -508 -198 327 604 517 357 -120
1945a20m63N1Q3L09M73K85L6l30m97m16J2J89L30M63K09r2k69m17m23k2K80L13
$$ -120 -583 -532 -449 -140 333 618 654 324 -173 -589 -577 -388 -58 405 614 522 253 -164 -587 -609 -329 -16
1967a6M05K62j82k29n02l76j0L89L58K90K31j80k60m30l70RL38M22L65N6j77k59
$$ -16 389 651 469 240 -262 -638 -648 -259 99 389 620 440 180 -250 -620 -611 -273 149 514 570 393 134
1989A34m58l13Q6K76L86M01J4j05l52l57l61J26K50M71L51J7k47l22l00k93J26
$$ 134 -324 -637 -551 -275 111 512 526 421 69 -288 -649 -523 -273 198 549 566 319 -3 -303 -596 -470
2010d70K62L47M27O1l63l50k81k73J54M14K76K77P8k62m14k00k33O6L78M00K84
$$ -470 -208 139 566 627 264 -86 -367 -640 -486 -72 204 481 559 297 -117 -317 -550 -484 -106 294 578
2031E78l8k78m65k05j12O2M17L13K09M7k37m28l87%J17L59M14J75j28k08m01k50
$$ 578 540 262 -203 -408 -520 -458 -41 272 481 528 291 -137 -524 -524 -407 -48 366 541 413 205 -196 -446
2053d46n6K16K15L24L66j00l33m09l21j0K96L51K25J76j7m05k99k56j02K56M68
$$ -446 -502 -286 -71 253 619 519 186 -223 -544 -554 -258 93 318 494 477 72 -227 -483 -585 -329 139
2074A39K62J35p5l80m25j18j5K33L76K26J13n6k18n12k32O9K78L96L06n6j58k75
$$ 139 401 536 461 81 -344 -462 -477 -244 132 358 471 415 197 -315 -547 -478 -200 196 502 446 288 13
2096A3l12k11O9K66L26L69j8k39k44l39k54K01K75K56K53P4k38l41j52k90O7L74
$$ 13 -299 -510 -441 -175 151 520 502 263 19 -320 -574 -373 -98 158 411 485 247 -94 -246 -536 -469 -95
2118i5L75J58Q4k51l98k52n0M5L16L52J25L2j44m05k66j08L5L81M30J52j47j80
$$ -95 280 438 522 271 -127 -379 -429 -384 -68 284 409 441 297 -108 -374 -482 -447 -66 364 516 369 189
2140A89l86k57P0Q2K07L82K07j19k34l36k58n0K54K77K70J09k6k91k71k26q6K01
$$ 189 -197 -454 -384 -302 -95 287 494 375 141 -195 -453 -503 -249 28 298 407 381 90 -181 -407 -493 -292
2162b92L37K81J58j17k98l23j45J6J48L43K94P4j44k40l49j61OK06L36K82kj11
$$ -292 45 326 484 367 69 -254 -399 -383 -235 108 402 476 332 92 -257 -418 -412 -206 130 412 410 299
2184B99k48l84p6Q9J58L14K54K3j22k64l51k05J57K58K10K95L0k39k69k73j39
$$ 299 51 -333 -409 -320 -162 152 406 429 307 43 -308 -513 -356 -98 112 407 437 198 -71 -344 -483
2205d83J28J90L41K40J1j93l13k43j00J18K49K37J98lj98l32j68j00J02K29L41
$$ -483 -355 -165 176 416 427 234 -79 -322 -422 -304 -55 182 380 377 179 -153 -321 -421 -319 -90 251
2226B51J71l2k07l15k25m5J21K68K35J26L5j58l37k88j4J70K27K56J70j26j60
$$ 251 422 390 183 -132 -357 -402 -281 -13 222 348 383 225 -112 -400 -414 -244 -17 239 409 283 123
2247A23k51k64l7K08K38K14J76r4k45k71j76l4J95L24J81J47r5k93k69j33lJ77
$$ 123 -128 -392 -429 -221 17 231 407 313 68 -203 -379 -413 -218 106 287 434 339 46 -223 -356 -359 -182
2269a82L12J94R3j00k95k56q3m8J30L68K13M3j38k42k89q3j6J91K78K21Q1j63
$$ -182 130 324 417 317 22 -234 -317 -365 -235 133 346 389 251 9 -280 -363 -379 -188 90 311 392 229
2291B29k61j97j93R6J79L01K15K1j79k64k39p5K4K71K82J67J4j92k66j79j55J04
$$ 229 -32 -229 -422 -326 -147 154 369 390 211 -53 -292 -367 -343 -72 210 377 391 199 -67 -246 -401 -297
2313b97K37K63J27mj38l19j70q5J27K29J58K32%j98k88k44k0J67K30K01J18m1
$$ -297 -60 203 330 326 188 -131 -301 -386 -259 -30 128 360 360 162 -126 -370 -390 -223 7 208 326 285
2335B85k36j69k20l6K51J62J64J61q1k16j75k15k2J74K27J92Q7p2k11k24j58k
$$ 285 49 -120 -340 -376 -125 37 201 362 281 65 -110 -325 -347 -173 54 246 333 261 50 -174 -332 -334
2357c34J36K72K17J3n8k42j89j18k1J95K24J81L8q9k17k21j21j0K06K85J41M2
$$ -334 -198 74 291 304 246 4 -185 -303 -324 -129 95 276 314 225 8 -213 -334 -344 -138 147 288 330
2379C30j70j59j83j88M6K66K03J69M3j86k34j94k9nK24K37J54L5k19k03j71q4
$$ 330 160 1 -182 -370 -324 -58 145 314 357 171 -63 -257 -286 -291 -67 170 324 359 140 -63 -234 -318
2401c18O9J50L10R6l0j21k90j43k2M4K00K22J41K8k19k25k15L0N4K10J97R9Nj67
$$ -318 -249 -99 211 307 277 156 -134 -277 -299 -255 -55 167 308 336 117 -108 -323 -293 -239 -29 168 267 272 105
2425A05k59j15l7J61J58K31N9l7j51k51q7j11J58K04K11Q1o1j55k22j80L8J19
$$ 105 -154 -269 -306 -145 13 244 303 266 115 -136 -223 -334 -176 28 239 320 259 104 -118 -298 -260 -141
2447a41J95K10J2m3j64k76p1nJ09K52J74L2m7j95k13j13J2J78J93J91n9p0j22
$$ -141 54 264 276 233 69 -207 -278 -283 -174 78 252 284 237 42 -171 -284 -272 -94 99 290 231 161 39
2470C9j56j97O7J32K29K08Jj53k09j97n4K9K00J86J67Mj82j22k27o2P3J77J83
$$ 39 -117 -314 -247 -115 114 322 323 170 -39 -236 -290 -261 -61 125 292 296 114 -8 -235 -297 -224 -47 136
2493A36J82m0j52k51j37l0M8J93K10J65o9j51k04j22j01J22J83J97J25q7j56j48
$$ 136 318 278 126 -125 -262 -292 -244 -51 159 324 255 104 -100 -222 -323 -201 -18 179 304 217 61 -87
2515h7j88J7R1J45K16J25k8k43j90j03j4R2K30J52J36o8k37j84q7j10K30J41J20
$$ -87 -275 -258 -167 -22 194 319 291 48 -142 -245 -259 -167 63 215 351 283 46 -138 -225 -335 -105 36 156
2538A56J48q8j78j16j66J8J27J61J43K2Mk11k32n0J5J96J74J10L8j24j24j75n5
$$ 156 304 216 38 -78 -244 -226 -99 62 205 227 231 20 -212 -262 -247 -51 123 233 271 147 23 -152 -207
2561b07o7J64K02J93k2p3j57j97p2Q2J50J02J79o5j22p4j73j66J20J58J40J34
$$ -207 -274 -110 92 285 263 190 33 -164 -236 -154 -4 98 277 212 90 16 -157 -323 -203 -45 95 229
2583B29jj17j74q3r5PJ97J61Q8Q0j87j89j40k7O3K01J82jQp2k09j47M7J1J45K61
$$ 229 228 111 -63 -146 -241 -234 -37 124 212 292 105 -84 -224 -251 -188 13 195 194 202 130 -79 -226 -179 -168 -23 238
2609B38rpr8k03j78K9J04J39J61L3J4j59j74j22QM8J81J74J29j54j39j65q9M0
$$ 238 229 222 124 -79 -257 -228 -124 15 176 209 223 64 -110 -232 -224 -176 5 179 308 154 15 -150 -239 -199
2633a99J09J32J34L7m5j49j69r7K6J15K54L6N4j08j20j27r7J2M4K25J69J4j25
$$ -199 -90 42 176 213 168 19 -150 -247 -221 -106 148 184 238 130 10 -117 -214 -202 -158 67 236 250 125
2656A25j24j86l0N9J26J24J25K5r0j81j32q5P8J14R3J29O9j40j69r7qM3M8J83
$$ 125 1 -185 -215 -156 -30 94 219 244 154 -27 -159 -244 -166 -52 41 170 239 99 -70 -167 -175 -132 -84 99
2680I9Q7J1j09j15j32j23J41J47J58N5m1k9k46o3j9K1J93N2J40J2j09k30j01j2
$$ 99 186 197 88 -27 -159 -282 -141 6 164 219 178 149 -97 -160 -179 -158 35 87 227 239 130 -100 -201 -213
2704b13J13J13J52N4m7j05j35j12n4J05Q6J98L1k0j52o7j84L0J03J59J39R2j23
$$ -213 -100 13 165 219 172 67 -68 -180 -234 -129 -43 155 186 166 14 -53 -237 -207 -104 55 194 286 163
2727A63j65j14p3l2J70J03J22J1q1j01j19j06O7J0J63K23nj50p5j95j9L3J00J27
$$ 163 -2 -116 -189 -221 -51 52 174 185 104 3 -116 -222 -155 -145 18 241 236 86 11 -184 -203 -170 -70 57
2751E7J46j4m5j89n8l8k4R7J77R4rq3j69l3j27N5J04J42J43l1o0j75q8p2P1O7
$$ 57 203 189 144 -45 -103 -141 -165 -68 109 203 194 111 -58 -91 -218 -163 -59 83 226 195 135 -40 -128 -200 -129 -62
2777f2J96P8m3j16j25j37L5N9J21N9Q7N4j37j54r0K2OJ59J18J1Lq9j01j48N2O7
$$ -62 134 212 169 53 -72 -209 -174 -115 6 65 152 206 69 -85 -175 -153 -147 12 130 141 144 55 -46 -194 -142 -75
2803g5J45N5K6N4j83j29r1k2J83O4J64jl9j31j25p2m7J41J59R7M6l0j17k50J7
$$ -75 70 125 151 205 22 -107 -198 -220 -37 27 191 190 151 20 -105 -177 -224 -83 76 173 219 189 72 -178 -161
2828a61l1J25J66N4K0q0j16j35m7J4J29J22R0j8k9j16j33j4lJ39N8J01O7j05j30
$$ -161 -192 -67 99 153 173 93 -23 -158 -205 -191 -62 60 150 132 103 -13 -146 -160 -163 -24 34 135 202 97 -33
2853c3q3o7K2Q7J34J08L6j05k06m8j9K6J23J28Q3p3k1j64j12JR5N3J54M6M0r4
$$ -33 -116 -183 -161 -74 60 168 204 99 -107 -155 -174 -148 -25 103 186 113 92 -72 -184 -183 -88 -35 119 165 205 111
2879A11j75j24OJ01Q5J36L4o8p6j09r8PQ2N4J63L4pj21j72k1J5J17K6J42O2mj62
$$ 111 -64 -188 -182 -81 4 140 174 106 30 -79 -177 -170 -88 -34 129 163 156 35 -137 -158 -143 -26 0 142 204 200 38
2906C8j27j08j1J45R4J10LMj41r2q3qR7J53jR5l3j37j32l5L2Q2P6P5Ok1j03j17
$$ 38 -89 -197 -208 -63 31 141 144 148 7 -85 -168 -176 -79 74 73 168 135 -2 -134 -169 -137 -55 21 96 102 81 -22 -139
2934a39oPP5J09Q4J2o6p3j39lJ6J24Q7L6L9r5o4j39m0P3Q2J31N7m2j14n5q1K4
$$ -139 -145 -138 -63 46 130 142 76 3 -136 -139 -123 1 88 124 163 68 4 -135 -175 -102 -20 111 168 126 12 -43 -124 -100
2962a00L7P2J05k9P2q5j57q9QO1J31J03M6n5p8j14q2M7L5R3Q9K9l8l5p8j07NN6
$$ -100 -63 9 114 85 157 72 -85 -174 -166 -105 26 129 175 120 42 -72 -154 -107 -72 21 110 139 101 66 -12 -119 -114 -58
2990e8R9Q5O8p2j24m2j00N7K0P5J29N2j03n0r2q0J9O4J19N3Mk4j39q1o5O9R6P4
$$ -58 41 126 194 122 -2 -44 -144 -87 -67 8 137 189 86 36 -56 -136 -117 -53 66 119 123 99 -40 -121 -186 -117 -21 53
3018E3P6K3n0r9n5j05K0J02K6J82m0p4j10p1nL1J1J29O3Qm0n5j29m0R1N8N4O8
$$ 53 129 152 102 3 -52 -157 -137 -35 -9 173 133 59 -51 -122 -127 -96 -85 44 107 115 75 20 -109 -149 -58 0 54 122
3046A22j6l6o1p2q8J6R6Q4J01j5r0j38K1r3Q9M8J23O4k5q8j07n8KMJ23P2M9K9
$$ 122 106 70 9 -63 -151 -135 -39 45 146 131 41 -97 -76 -169 -80 -32 91 155 130 42 -65 -123 -121 -117 6 78 127 156
3074A56o1j39o3j3K5R9R2rN6j39r0o4k8J62L7R7m5K5p5j04qj4P7lJ37M9o0j66
$$ 156 95 -44 -107 -120 -95 4 96 87 143 4 -86 -150 -178 -16 21 118 73 98 23 -81 -89 -103 -26 -29 108 157 97 -69
3102f9Mn6jR3P4J7M4L0j28j06o4M8Q3J15K2j5j7l9j29lM8J2R5J17q4l4j16k2n0
$$ -69 -65 -121 -122 -29 45 62 106 136 8 -98 -162 -114 -31 84 106 91 74 35 -94 -97 -49 -37 58 175 91 57 -59 -81 -131
3131a31K7N8J10O2k7l8q2n4n6%Q2P1O9J7j02n1o4LN2R5jM6L9j27pq9m9J02N0J30
$$ -131 -104 -46 64 126 99 61 -21 -75 -131 -131 -49 22 91 108 6 -45 -109 -106 -54 41 40 86 125 -2 -9 -98 -147 -45 5 135
3161A35qj4o2q5r3N5j7J02O2K3J2o5p7o5n6O8Q9J12j3m7m2r7jo1J03P3K9N2k5
$$ 135 127 113 51 -34 -127 -72 -89 13 75 98 110 45 -32 -97 -153 -85 4 116 103 56 14 -83 -84 -145 -42 31 60 112 87
3190H7r6l3n1m1O3J11L5J0l0p6k1l2o2J11N6J01l8o0k8j43N3K7qJ20K0j4M8j32
$$ 87 -9 -42 -93 -134 -71 40 75 85 55 -21 -42 -74 -136 -25 31 132 94 34 6 -137 -84 -57 -65 55 75 61 109 -23
3218b3o8k4K8J4J49M7pn5r3q5J7qR7O2N9L2r7n8j05pO5N2R3O6n8j08qj9q2P2K2
$$ -23 -91 -115 -87 -73 76 123 116 61 -32 -117 -100 -108 -11 51 110 142 45 -13 -118 -125 -60 -8 85 151 93 -15 -23 -42 -124 -52 -30
3249c0Q2P5l1l9o2o2o5L5R4J27L0p2q1o6o6L7J3O0J20k4K7r5n6o5N1J6N2R7Qn
$$ -30 52 127 96 57 -5 -67 -132 -97 -3 124 154 82 1 -65 -131 -94 -81 -21 99 75 102 7 -49 -114 -63 -47 5 102 110 105
3279A05n2r2j07K8N3J17L0J7J8o6n8r3L0O9K3Q5j7K1j43m4J2j1O0N4M9j3L9j76
$$ 105 53 -39 -146 -118 -65 52 82 99 117 51 -7 -100 -70 -1 22 107 90 111 -32 -76 -64 -75 -15 39 88 75 114 -62
3307f2o2m4K5J46N5Nn4J6r4k9kN8M6N4Q0l0l1q8q5j1J7J19N0K7k2r0J9o9pj1P1
$$ -62 -124 -168 -143 3 58 63 9 25 -69 -98 -100 -42 4 58 138 108 77 -11 -96 -107 -90 29 79 106 84 -6 13 -56 -63 -74 -3
3338cJ12OJ0j03n9n3J7K6J8J01K3l5Mr8o9J3N2L0J11J6l3m6j19j1k4N3J00K9Q
$$ -3 109 115 125 22 -37 -90 -73 -47 -29 72 95 60 64 -34 -103 -90 -38 -8 103 119 86 40 -79 -90 -114 -61 39 68 76
3367G6j4n7n9o5K8P1O5QRM7q3j06k0N7J0R3O1j8q8Qr5rK1K7N6OK4m2Pq8J7oP3
$$ 76 62 5 -54 -119 -91 -20 45 53 62 109 26 -80 -100 -43 -33 60 121 103 15 23 -72 -81 -60 -33 23 29 53 11 18 -70 -53 -59 14
3400A4NJR7p4m2r1j8N4P1O3K5j4o3m5j2p7K5J08O9l9M4n4p2l0r5J00RJ08J0j2
$$ 14 19 20 117 43 1 -90 -108 -54 17 80 105 91 28 -17 -29 -106 -81 27 96 57 101 47 -25 -55 -150 -50 -41 67 77 65
3430F5q1k3nk3mj6J82Kn8n9l1j9Nk5P7J28o2Nn2m8k0J8N7J7M7N0q2p9ol5kJ9O4
$$ 65 -16 -39 -44 -67 -71 -87 95 97 39 -20 -51 -70 -65 -90 -13 115 53 58 6 -42 -62 -44 13 30 77 127 45 -34 -40 -75 -77 -58 6
3463FQ4K5n3p1j4n9j3K7N1J17om3l0k4o9kJ2J35J1Ln4p8j4qj3L1M5L4O5m5p8n7
$$ 6 90 115 62 -9 -23 -82 -95 -68 -17 100 94 51 21 -3 -72 -74 -62 73 84 87 33 -45 -59 -67 -80 -49 -4 30 95 50 -28 -85
3495h5lP1j4P5K6L3n7m3k6j3LkP2K6K9oj39l1j6K0P4kQ3m7m0k0o8o8J27J00j4
$$ -85 -88 -17 -31 44 70 103 46 3 -23 -36 -33 -35 37 63 92 86 -53 -84 -100 -80 -6 -8 75 28 -12 -32 -100 -168 -41 59 45
3526D5O7k7m6p2p3J2K3Q6M4RJ9p6pq4l1Q7O9NPpn3k3k6l1M5J04JNj7m7o9m3P0
$$ 45 112 85 39 -33 -106 -94 -71 15 59 68 87 11 4 -80 -111 -24 45 50 57 50 -3 -26 -52 -83 -38 66 67 72 55 8 -61 -104 -34
3559c4jJ1P5NL5j34p2J2O9k8J17oL6n0K5j28l9L1J33p2N3mM1j07l2Pk8O1P0N8
$$ -34 -35 -24 51 56 91 -43 -115 -103 -34 -62 55 49 85 35 60 -68 -107 -76 57 -15 38 34 75 -32 -64 -57 -85 -24 46 104
3589A04k6L2j35l7J8K6l2J09j0j2k0kj27Q3j7M6jR1m3l9k4r4L2N2K5L5L9Rm8o2
$$ 104 78 110 -25 -62 -44 -18 -50 59 49 37 17 15 -112 -29 -46 0 -1 90 47 8 -16 -110 -78 -26 -1 34 73 82 34 -28
3619b8l6oN1OL5N2M0j06m9LJ0NJ0Q5l8M7n3o6q9J13l3L9P8N6m2q7Kj14O0L2J11
$$ -28 -64 -70 -19 -13 22 74 114 8 -41 -38 -28 -23 -13 72 34 81 28 -38 -127 -14 -47 -8 70 126 84 -3 -1 -115 -55 -23 88
3650H8rqk1m1o7n6K2J36n6J15m6m6Ol9n3L7L5qP1j7Mq4LNk3M4K8O5K6j6j29l7
$$ 88 79 71 50 9 -58 -114 -92 44 -12 103 57 11 17 -22 -75 -38 -3 -11 60 43 47 -37 -34 -29 -52 -8 20 85 111 95 -34 -71
3682g1%L9K3Q1lj0p2j8j3rJ1nP0J0N6q8k0m8l9J7L0N8L9K2n9k6k6j1O3L0K3O0
$$ -71 -71 -32 -9 72 69 59 -13 -31 -44 -53 -42 -47 23 33 89 1 -19 -67 -106 -89 -59 -1 38 60 1 -25 -51 -62 1 31 54 114
3714A14n1p8m8Q6m0j6M2M0j0J3J1p3l7N9l8M4N3m2Jl0j04K6qM1M8J1Q3m8n0k1
$$ 114 63 -15 -63 23 -17 -33 9 49 39 52 63 -10 -47 12 -26 18 71 29 30 0 -104 -78 -86 -45 3 14 97 49 -1 -22
3744b2p6J3M2L8L6j0j9Pl0n9O3j2P6K9Nk9o8k9l6J9R1n0K4M5j4j3l9k2m1P7J2
$$ -22 -98 -85 -43 -5 31 21 2 9 -21 -80 -17 -29 47 76 81 52 -16 -45 -81 -62 29 -21 3 48 34 21 -18 -40 -81 -4 8
3775HP3m5l3m3k8j9O0M4L8J0l7K3p8k4j0L2lN9K0J2k9l5l3PK4J7N1ko1K9r6O7
$$ 8 81 36 3 -40 -68 -87 -27 17 55 65 28 51 -27 -51 -61 -29 -32 27 47 59 30 -5 -38 -31 -7 10 61 59 -2 27 -69 -2
3807bm0l8J17NK4J3n2k4o6L6m2M8M0lJ8o9m2N6k0K3O6N4J2p1o6k7k0N7k2N7J3
$$ -2 -42 -80 37 42 66 79 27 3 -63 -27 -69 -21 19 16 34 -35 -77 -21 -41 -18 48 102 114 43 -23 -50 -70 -13 -35 22 35
3838C5K0kl5k7l6J3ON3O4J2m3l2l7n2J4K0jQ8j3J8p8L5j06QM5O7J0Nl1oj1l3m3
$$ 35 55 53 18 -9 -45 -32 -26 27 91 103 60 28 -9 -61 -47 -27 -28 60 47 65 -13 22 -84 -76 -31 36 46 51 20 14 3 -30 -73
3871g3Q6rJ4%l0j4Oq1O6M4J3O1n9L7j09K4m1J7N3O2l9J5n9n5K3M8j0k3P0K1Mp1
$$ -73 13 4 18 18 -12 -26 -20 -101 -35 9 22 83 24 61 -48 -24 -65 -48 5 67 28 43 -16 -71 -48 0 -10 -33 37 58 62 -9
3903im0Kq7J34jL2Jkj3p5Nl1O8RlM2j2N3j16j5J8M6M6rO9q4l6Qk7k8ML9M7j7M5
$$ -9 -49 -47 -134 0 -1 31 32 30 17 -58 -53 -84 -16 -7 -10 32 20 73 -43 -58 -40 6 52 43 112 28 -8 0 -27 -55 -51 -12 35 18 63
3938F3m8m6on5J04k4L4J1rk4j8j4JK8M5J4N2r5l1k1kl7P0JR2n2k3k2K4n0K9n0
$$ 63 15 -31 -37 -92 12 -12 22 33 24 0 -18 -32 -31 -3 42 56 108 13 -18 -39 -41 -78 -8 -7 85 33 10 -12 12 -38 -9 -59
3970e9J17l3N3m5l3m1j8N7JL0mM1n2j3k2lj4L6k0N8L4j07j6j7Q3m5M6K5l7L0l4
$$ -59 58 25 78 33 0 -41 -59 -2 -1 29 25 66 14 1 -21 -24 -38 -2 -22 36 70 -37 -53 -70 13 -32 14 39 2 32 -2
4001bLo4K8l8R4K6kn2Rl6RK0k7O3PK0n1L3o7m4Q1l5qJ15p0kl8J6q6K8J9L5O2J9
$$ -2 1 -63 -35 -73 21 47 45 -7 2 -34 -25 -5 -32 31 38 58 7 40 -27 -71 10 -25 -33 82 12 10 -28 -12 -98 -70 -51 -16 46 65
4035F5nq7Mk3qL6P0n6N1k4n8K8p1M0%M4N7l6M3o5j8j8L7j8L6m9PO3l3l7j8K8k6
$$ 65 60 -27 -23 -46 -54 -18 52 -4 47 23 -35 -7 -78 -38 -38 6 63 27 70 5 -13 -31 6 -12 24 -25 -18 45 12 -25 -43 -15 -41
4068d1O0M4Ln8oj7l1J4PL3N5j8j5n1k4m8N5lQ5L7n8j9l1J9j9j7k1R8nN5m2j4n4
$$ -41 19 63 66 8 2 -15 -46 -32 -25 8 63 45 30 -21 -45 -93 -38 -41 44 81 23 4 -27 -8 -27 -44 -65 33 28 83 41 27 -27
4101b7j8L2J3L2j6O2m9r1O5n4M0j1K6K6o4N9n2pj4J2N1J2O1j12K4j9q8Q1J4L4
$$ -27 -45 -13 0 32 16 78 29 -62 3 -51 -11 -22 4 30 -34 25 -27 -34 -48 -36 15 27 88 -24 0 -19 -107 -26 -12 22
4131B2M6o7N3k2n3kk2K6%N8J3rl5o5L2J9K5m4J01p3MJ5r3P3j4J5P6p2ROn5k5L0
$$ 22 68 1 54 32 -21 -23 -45 -19 -19 39 52 43 8 -57 -25 -6 19 -25 76 3 7 22 -71 2 -12 3 79 7 16 22 -33 -58 -28
4164b8K0m0R1l9L1m3j1k7k3O6K0K0M6j0Lj02J7rk9N7K4l8M2j9k6L8q6J1J0Q6L6
$$ -28 -8 -48 43 4 35 -8 -19 -46 -69 -3 17 37 83 73 76 -26 -9 -18 -47 10 34 -4 38 19 -7 31 -55 -44 -34 52 88
4195H8m4n5l7Rn2J37m4O7o2k4M0m9k6j9L8O2j1k1qK6n6jL0L9o8J09m0J5l9roK4
$$ 88 44 -11 -48 -39 -91 46 2 69 7 -17 23 -26 -52 -71 -33 29 18 -3 -11 15 -41 -42 -12 27 -41 68 28 43 4 -5 -11 13
4227A3k3j2L8L0P9j63L5j10P5K0N2M4n2K0p6m1M9k7L9RM4K6r3K3j7JJ1j0J9N8
$$ 13 -10 -22 16 46 125 -38 -3 -113 -38 -18 34 78 26 46 -30 -71 -22 -49 -10 -1 43 69 -24 -1 -18 -17 -6 -16 3 61
4257F1k2pk1nrJ5o5J22K0mk8n7l5O0K7l1k8Q3n6jj6k1L3l1K7k0P0o8L2p3j4M2
$$ 61 39 32 11 6 -3 12 -53 69 89 85 57 0 -35 25 52 21 -7 76 20 19 3 -18 15 -16 11 -9 61 -7 25 -48 -62 -20
4289b0rJK3K3Qkp8L5j6K5JL3QK0l2p2J0K2PN8k9M7M0j41l5P4m7M7J1J8K5k9K2
$$ -20 -29 -28 -5 18 26 24 -54 -19 -35 -10 -9 24 32 52 20 -52 -42 -20 -13 45 16 63 103 -38 -73 1 -46 1 12 30 55 26 48
4322D8n9n2J6M8M8k5l2K8m8J6o5LL8J3P4l2L9m9o6M7nj5L3K9J0n6l2K5l9N1L4
$$ 48 -11 -63 -47 1 49 24 -8 20 -28 -12 -77 -74 -36 -23 51 19 58 9 -57 -10 -15 -30 3 32 42 -14 -46 -21 -60 -9 25
4353B5jPK5l3n7K7n3J06o7K2J9M2k4o3L5p7M6L6k8M2OLp9j1QJ5M1LRl7j4M0m0
$$ 25 24 31 56 23 -34 -7 -60 46 -21 1 20 62 38 -25 10 -67 -21 15 -13 29 35 38 -41 -52 -44 -29 12 15 24 -13 -27 13 -27
4386b7qM0k6L7O5n6k5Moj2lj7K1M5K8m4mk3m4O0PM2n1O3r3k2K9L3k5K9o9Q6p4
$$ -27 -35 5 -21 16 81 25 0 4 -2 -14 -17 -34 -13 32 60 16 12 -11 -55 5 12 54 3 66 -27 -49 -20 13 -12 17 -52 34 -40
4419d0J6M1l5pKJ9M0J4M0q3l9Ok2L4jN0M5o0mo3J6J8M9o5O0qK0k4n4J0PK3P%L4
$$ -40 -24 17 -18 -25 -23 -4 36 50 90 7 -32 -26 -48 -14 -15 35 80 20 16 -47 -31 -13 36 -29 31 23 43 19 -35 -25 -18 5 12 12 46
4454D6p2K2j1l0KJQ1n9P9p5p1L0jK5j7Q5m0L6m8rl0J0l8J01mj9L1m4M4j9k3oR4
$$ 46 -26 -4 -15 -45 -43 -42 39 -20 59 -16 -87 -57 -58 -33 -50 35 -5 31 -17 -26 -56 -46 -84 17 13 -6 25 -19 25 6 -17 -23 71
4487G1n4j6K8j6m4j0ppM9N4k4n5O4%r2M4k8J7J02q5MLj1on6J03kj2K8op4K9j5
$$ 71 17 1 29 13 -31 -41 -48 -55 -6 48 24 -31 33 33 -59 -15 -43 -26 76 -9 -5 -2 -13 -19 -75 28 26 14 42 36 -38 -9 -24
4520b4k2Q0n3L9M6ln7k7l1J07j15QM7M8L4m9l8m1L2O1o1M3J1l0M4q0J8k2N4jK2
$$ -24 -46 34 -19 20 66 63 6 -21 -52 55 -60 -52 -5 43 77 28 -10 -51 -19 42 -19 24 35 5 49 -31 -13 -35 19 18 40
4551D0J0qo9J6l8oJ2L5J3L3m0rkn9N7J8nM1rm9K3l5L6l0K0J1K2k1Q0q0o8K5jj6
$$ 40 50 42 -27 -11 -49 -55 -43 -8 5 38 -2 -11 -13 -72 -15 3 -2 39 30 -19 4 -31 5 -25 -5 6 28 7 87 7 -61 -36 -37 -53
4585e3J17n9jm0K4Rk0rK1J5J1Kk5j0K1n5K0M8k8O4n4j5J4j9kNP5l8M3n1J8j4l7
$$ -53 64 5 4 -36 -12 -3 -23 -32 -11 4 15 17 -8 -18 3 -52 -32 16 -12 52 -2 -17 -3 -22 -24 -19 56 18 61 10 28 14 -23
4618b3mJ6L4kM7l2m7j3j0J4nj9P9K2r5Jk7J0L5pJ9kJ1j4J4l7k3K9J8J8K4j8nn7
$$ -23 -27 -11 23 21 68 36 -11 -24 -34 -20 -25 -44 35 57 -38 -37 -64 -54 -19 -26 -7 -9 2 -12 2 -35 -58 -29 -11 7 31 13 8 -49
4652d9M6qJ9k7P0kl0N8j03l4K5l4O2J6L0Nn9l1L9j1m3J01Pj6K4q0J1j9P0j8l3
$$ -49 -3 -11 8 -19 51 49 19 77 -26 -60 -35 -69 -7 9 39 44 -15 -46 -7 -18 -61 40 47 31 55 -25 -14 -33 37 19 -14
4683a4J8N0m2pj8j4KLRL2j8J3qJ7k3L8k2p9O4L5M3r2L1l8J0M1J7k6PJ3q8RJJ7
$$ -14 4 54 12 5 -13 -27 -25 -22 -13 19 1 14 6 23 0 38 16 -63 1 36 79 -13 18 -20 -10 31 48 22 29 42 -46 -37 -36 -19
4717a9J0J8Mk3qj5L6j8J6j2J9L1o0M3o3L3k8J3J6K0Q8q6l2jK8l9K1JJ1JJ8Mj00
$$ -19 -9 9 13 -10 -18 -33 3 -15 1 -11 8 39 -21 22 -41 -8 -36 -23 -7 13 101 15 -17 -18 10 -29 -8 -7 4 5 23 27 -73
4750g3N7m1qJ22j9l8j8Q9j14N5n0j1O6J7J1p9j2J7M1l6K4K4k4Pj7j7M3o1M9l5
$$ -73 -16 -57 -65 57 38 0 -18 71 -43 12 -38 -49 17 34 45 -34 -46 -29 12 -24 0 24 0 7 -10 -27 16 -45 4 -31
4780c1M9J2J6p7J7l9O0l2K6kK0K0m1MJ6j6m2K8jM2J8k2k7Kk3Lj4M2j5P8q5j2J8
$$ -31 18 30 46 -31 -14 -53 7 -25 1 -1 19 39 -2 2 18 2 -40 -12 -13 29 47 25 -2 0 -23 -20 -34 8 -7 71 -14 -26 -8
4813hn5J09q6K7P2l4m3mK0k2J4N8n9M6Moj7o1l1N8O3k1K2k1Rk1J5p1O1rknJ5j6
$$ -8 -63 46 -40 -13 59 25 -18 -22 -2 -24 -10 48 -11 35 39 33 16 -45 -76 -18 45 24 46 25 34 13 28 -43 18 9 7 2 17 1
4847Aj9k8KM5k2O3j9M1o5m7M5k4j9K1L0K7l1M1kn7K6J2rm4O8k2J5m3Qpj1M8j8
$$ 1 -18 -46 -44 1 -21 42 23 64 -1 -48 -3 -27 -46 -25 5 32 1 42 40 -17 9 21 12 -32 36 14 29 -14 -6 -13 -24 24 6
4880FM6o2J6k1m3L8N6j8j9RK3m5k0pM5K0j8P0j05L2L3m2nk6O0k3K5jk1j6JL6k7
$$ 6 52 -10 6 -15 -58 -20 36 18 -1 8 31 -14 -34 -41 4 24 6 76 -29 3 36 -6 -11 -37 23 0 25 24 3 -13 -12 24 -3
4913cK5J8Pl3l8M7n1l9MK5M4M7l7K2m9km2k4P7QL4q4J9L7q1M3j1N5j8P3r3O6p8
$$ -3 22 40 47 14 -24 23 -28 -67 -63 -38 6 53 16 38 -11 -13 -55 -79 -2 6 40 -44 -25 12 -69 -26 -37 18 0 73 -20 46 -32
4946c2j3M0J2N5kmn5J1J3n4N3m5J6J0J3Jj8m4JQK8%ONL3Mm1k0J2Lm0O2pJ7k6m2
$$ -32 -45 -5 7 62 60 56 1 12 25 -29 24 -21 -5 5 18 19 1 -43 -42 -34 -6 -6 0 5 38 42 1 -19 -7 -4 -44 18 11 28 2 -40
4982d0M6j6J5qJ6L6RJ7j23M7M0o3RK9L9m7j6L2m6lJ5L5Qk9K1l0J5n0L9K4J9r1
$$ -40 6 -10 5 -3 13 49 58 75 -48 -1 39 -24 -15 14 53 6 -10 22 -24 -27 -12 23 31 2 23 -7 8 -42 -3 21 40 -51
5014e1R5o0O8mo5l0j6L2J9L1n7M4rl8nO9l1pM7J3m2l3k1K0L5qK7l1K1k4Lo5J8
$$ -51 44 -16 52 48 -17 -47 -63 -31 -12 19 -38 6 -3 -41 -46 23 -8 -15 32 45 3 -30 -51 -31 4 -4 23 -8 13 -11 -8 -73 -55
5047e5J03j0n2K0Rm8M1m0M5k7L7K2p2N4o7pJ5qN2mK5J9p7N6m6J5OJ1n0M2Nom2
$$ -55 48 38 -14 6 15 -33 8 -32 13 -14 23 45 -27 27 -40 -47 -32 -40 12 8 33 52 -25 31 -15 0 6 17 -33 9 14 8 -34
5080c4K5Jk3K8K6M2m0l7rlM6pJkl6J7J8J1o6K4PM8pk6j6J9m3J5j8J8J9O8o6Lm0
$$ -34 -9 -8 -31 -3 23 65 25 -12 -21 -24 22 15 16 14 -22 -5 13 24 -42 -18 -11 37 30 4 -12 7 -36 -21 -39 -21 -2 66 0 3 -37
5115c7PJ6k1%K1O9n8Kk6K5J6k2K3l6K9N1k7mm9l2R5j3k8P1o2Kqm1K3ML4J7J9n0
$$ -37 -30 -14 -35 -35 -14 55 -3 -1 -27 -2 14 -8 15 -21 8 59 32 28 -21 -53 42 29 1 72 10 12 4 -37 -14 -10 24 41 60 10
5149A0j2K2l4j8M5k7N7l2jM7j00M8n6R7k9j5M1K7o3P3r7j7J3M0K4M1n2o7L2JK8
$$ 10 -2 20 -14 -32 13 -14 43 11 10 57 -43 5 -51 46 17 2 43 70 7 80 -17 -34 -21 19 43 84 32 -35 -3 -2 26
5180B6q2J38r7M4k4J1l5m3L5L4Kj6N0k9n6K6J5k3J0J1J7K9%j1r7O5rJ7n2O2N3
$$ 26 -56 82 -15 29 5 16 -19 -62 -27 7 9 -7 43 14 -42 -16 -1 -24 -14 -3 14 43 43 32 -65 0 -9 8 -44 18 71
5211G1k7mo8j2K2j8M7L2o5M9k3n3QL1RJ3oL9l8J2mp1K9%O3Pm1J8k5l4pK7j5L0
$$ 71 44 40 -28 -40 -18 -36 11 43 -22 27 4 -49 -41 -10 -1 12 6 45 7 19 15 -56 -27 -27 36 43 2 20 -5 -39 -46 -19 -34 -4
5245dL8k3N0Po5n5Q7p5M4J7jJ1l1j4K9Jlj9M5l6k9K9j6J2p4R6k1l4M7K1k8L2o7
$$ -4 34 11 61 68 3 -52 35 -40 4 21 20 31 0 -14 15 16 13 -6 39 3 -26 3 -13 -1 -75 21 0 -34 13 34 6 38 -29
5278b9L4M6k2n0K8LK0l7rK8N5n6L3k7J2k8K2k5K7l5kO9l2m5lm4M1J6J9J3J1j7
$$ -29 5 51 29 -21 7 10 30 -7 -16 12 67 11 44 17 29 1 23 -2 25 -10 -12 57 25 -20 -23 -67 -26 -10 9 22 33 16
5310A6q4LO1mj1N8l5M2l9l0M2n2K3M3l3j6L4L8l3o6N4Ln5J1M2J2oJ2qj0oL3o0
$$ 16 -68 -65 -4 -8 -19 39 4 46 7 -23 19 -33 -10 33 0 -16 18 56 23 -43 11 14 -41 -30 12 24 18 30 22 12 6 39 -21
5343b1K3J3l6k9J6OJ8m1P6qM2o1l6N4j9l0L9j2J2J6l2j8qL7k0J7J8l2M1loqn0
$$ -21 2 15 -21 -50 -34 -28 -10 -51 25 17 59 -2 -38 16 -3 -33 6 -6 6 22 -10 -28 -36 1 -19 -2 16 -16 25 22 16 8 -42
5376d2M1J2L0n0J5Rn2mPN4j5mK1Lo0O1l1j3m5N0kR2p9M7n6PLL3j0j5K7m9K7J4
$$ -42 -1 11 41 -9 6 15 -37 -41 -34 20 5 1 22 25 -35 26 -5 -18 -63 -13 -15 77 -2 45 -11 -4 -1 32 22 7 34 -15 12 26
5410B6p2L1j3N2j6K1j9JK4k9rm2P9Mj0m1j6O4k6Mk4N5m3pj3k2K0m1L3JJ7K5Jl2
$$ 26 -46 -15 -28 24 8 29 10 11 35 6 -3 -45 34 38 28 -13 -29 35 9 13 -11 44 1 -6 -19 -41 -21 -62 -29 -28 -11 14 15 -17
5444a7k9J4l5M8K4Pj0k2mk6K3l3J8L0jmK3lj4j4M3l1rN5NLj2l4L5j1n5N7RK0q2
$$ -17 -46 -32 -67 -19 5 12 2 -20 -24 -50 -27 -60 -42 -12 -13 -17 6 3 -11 -25 18 -13 -22 33 38 41 29 -5 30 19 -36 21 30 50 -32
5479c2J5J2k5N8k0j6JO1n9j1k6jK6N6k3nJ7j9l7J8J3m7O0o9P8O5n2oj3m0N9m0
$$ -32 -17 -5 -30 28 8 -8 -7 54 -5 -16 -42 -43 -17 39 16 11 28 9 -28 -10 3 -44 16 -53 25 90 38 32 19 -21 38 -2
5511bRL0Jl1nj7j6L8k2K0M6l6J2k6l2k0rR2m5jL9k3k8JK4J4pjj5OK9r0OL7K1L2
$$ -2 7 37 38 7 2 -15 -31 7 -15 5 51 15 27 1 -31 -51 -60 32 -13 -14 25 2 -26 -25 -1 13 6 5 -10 -4 25 -65 -59 -22 -1 31
5547C1l3OK4nk3K0k0j5jK7k2K9j1l4M8p7L3L2j5L1n1%J2j3JO7o4M8j8L7j00ll6
$$ 31 -2 4 28 23 0 20 0 -15 -16 11 -11 18 7 -27 21 -56 -23 9 -6 25 -26 -26 -14 -27 -26 41 -23 25 7 44 -56 -59 -95
5580i5Q6mqO0l2qml9M7QOK1k9L0jJ1n2J0j2J4j8j1M7L1m3o5K7J7kK1l9Q4j06N2
$$ -95 -9 -13 -21 39 7 -1 -5 -44 3 11 17 38 9 39 38 49 -3 7 -5 9 -9 -20 27 58 15 -50 -23 -6 -8 13 -26 58 -48 4
5614Dk4oK6l3QP6kl4J5n7L4m5L2K2O%J4n3M3n7L5l5M5qkK8m5M0k6j5K5m9Q2J5
$$ 4 -20 -26 0 -33 -25 51 49 15 30 -27 7 -38 -6 16 22 22 36 -17 26 -31 4 -31 14 6 4 32 -13 27 1 -14 11 -38 44 59
5648E9l8M4r0J5J6k4L8l9L8l0JLPl9qO7Jl5%K1n1K2l6R4l3OJ5k6m6J0j4L7O0J3
$$ 59 21 65 -25 -10 6 -18 20 -19 19 -11 -10 -7 0 -39 -47 20 21 -14 -14 7 -44 -22 -58 36 3 9 24 -2 -48 -38 -52 -15 45 58
5682E8l9jj1K4k1r4R8k9M6L4m9l8mkM8j1Pm6N9m0M1p1L6n2O6L0l3qM3o6oO0k3
$$ 58 19 18 7 31 10 -84 14 -15 31 65 16 -22 -26 -28 20 9 16 -30 29 -11 30 -41 -5 -57 9 39 6 -2 41 -25 -31 29 6
5715FQj0L2J2j3L9j06LL0L5j7R9q2k2o1K5k4O3p1P5QL2o4l8N2j3j3j7K2J5kPj9
$$ 6 14 4 36 48 35 74 -32 -29 1 36 19 118 36 14 -47 -22 -46 17 -54 21 29 61 -3 -41 11 -2 -15 -32 -10 5 3 10 -9
5748iJk9M7k8JJ3M0l3L1l5j8L4Rj1mk7K2OK2j5j8K0M0jj5o1jL3k2JK3n6L9l4M
$$ -9 -8 -37 10 -18 -17 -4 36 3 34 -1 -19 15 24 13 9 -18 4 10 32 17 -1 19 59 58 43 -18 -19 14 -8 -7 16 -40 -1 -35 -31
5783c1k0L6p8N7N2l1K2k9MJ4k3l2L0P2k2n9M5j9J1j4P5p6N4J0j3L0n1j0j2Mj3
$$ -31 -51 -15 -93 -36 16 -15 7 -22 -18 -4 -27 -59 -29 43 21 -38 7 -12 -1 -15 60 -16 38 48 35 65 14 4 -8 -4 -17
5814a7R3j5l7np3M5m3j2Q1L0L0l5l0k2n2K6j3M3n1M1J2l8O8q1Q1k%Jj7m8Q2p1
$$ -17 76 61 24 19 -54 -9 -52 -64 17 47 77 42 12 -10 -62 -36 -49 -6 -57 -16 -4 -42 26 -55 26 24 24 25 8 -40 42 -29
5846b9K9k2j6O4mprK1k0k2NN3m5J7L6l2k0OK4l5l8J0O2l2jo5M6Jk5lQ8J2q2P4
$$ -29 0 -22 -38 26 22 15 6 27 7 -15 -10 43 -2 15 51 19 -1 5 29 -6 -44 -34 28 -4 -5 -70 -24 -23 -48 -51 37 49 -33 41
5880D1m9k1K8j8k6Q7j2j0%n3J3L1n4O7k0L0J9o8K3K0n2RN1lk4N5q5j6Q1q4L5J0
$$ 41 -8 -29 -1 -19 -45 42 30 20 20 -33 -20 11 -43 24 4 34 53 -15 8 28 -24 -15 36 33 9 64 -21 -37 44 -40 -5 5
5912Ek4J8kk3K8nk7l1M1J6p3R7Oj3k4K4Rk9J7Rj0Nm6J6J1k6K6%L4J3K6j03K7l1
$$ 5 -19 -1 -3 -26 2 -3 -30 -61 -20 -4 -77 20 26 13 -11 13 22 -7 10 19 9 14 -32 -16 -5 -31 -5 -5 29 42 68 -35 -8 -39
5946c9K6N9l8J9Pl2l2L2J8l6J4Rj5K1l8K9m3N9o0M6J4J6m2l7L2J8JK1J1k2J3L7
$$ -39 -13 46 8 27 34 2 -30 2 20 -16 -2 7 -8 13 -25 4 -39 20 -40 6 20 36 -6 -43 -11 7 8 29 40 18 31 68
5978F8l7l3K5o7K3M4j4qjn9M5J1LK2j4LJ1k4k9k4O0j5l1K3J5K0p2K0n4Q8J8RM
$$ 68 31 -2 23 -44 -21 23 9 1 0 -59 -14 -3 0 22 8 11 22 -2 -31 -55 5 -10 -41 -18 -3 17 -55 -35 -89 -1 17 26 30
6011C0k7M6k3J9m2l6jK4J5J6K3m3L1n9K0L4j8jL1o0L2Jrl8L1j7j4k9L1%M6j5n9
$$ 30 3 49 26 45 3 -33 -34 -10 5 21 44 1 32 -27 -7 27 9 8 39 -21 11 12 3 -35 -4 -21 -35 -64 -33 -33 13 -2 -61
6044f1O0k0J5mjO4k8j3j3j7M7k0N0L5p2m5K7j2K6JRj5N3l9j3l1N6KL4l3k8o9P4
$$ -61 -1 -21 -6 -10 -11 53 25 12 -1 -18 29 9 59 94 22 -23 4 -8 18 19 28 13 66 27 14 -17 39 41 75 42 14 -55 19
6077A9J2n9j7L0N4o5K5j3j2J7J5k9rlK0%kM0j5K3o7nL6PL1j8l8l2M3L7o4P4rk0
$$ 19 31 -28 -45 -15 39 -26 -1 -14 -26 -9 6 -23 -32 -35 -15 -15 -17 23 8 31 -36 -41 -5 2 33 15 -23 -55 -12 25 -39 35 26 6
6111FJ9k5L4J8o7M8J8n7M9o3j2P7m6q0O5J1k2L5l2QJ9j0k2L8J6k2R2r5J0n0K0
$$ 6 25 0 34 52 -15 33 51 -6 43 -20 -32 45 -1 -81 -16 -5 -27 8 -24 -16 3 -7 -29 9 25 3 95 0 10 -40 -20
6142b0L2j4K3OL0p1m1O1n2M2L8m0J4Jq1P4lJ0l4K0nN8l1l9j2L1K2j2%n9JM0L1
$$ -20 12 -2 21 27 57 -14 -55 6 -46 -4 34 -6 8 9 -72 2 -1 9 -25 -5 -10 48 17 -22 -34 -3 19 7 7 -52 -51 -11 20
6175B0%o2J8j3L1L9%J6m0krJ1kj4M9Kj08Q0m0K5j1k5P9Nj8n0L3l2j1M9j0k8L4
$$ 20 20 -42 -24 -37 -6 33 33 49 9 7 -2 9 7 -7 42 44 -64 16 -24 1 -10 -35 44 49 31 -19 14 -18 -29 20 10 -18 16
6208A6k2qJ6p3K5P6jm1N5m7J3k5Nn1O9Ok3M9L5q7M1k0k0l9J03k5k6pL9Jl1L7n4
$$ 16 -6 -14 2 -71 -46 30 29 -12 43 -4 9 -16 -11 -62 7 13 -10 39 74 -13 28 8 -12 -51 52 27 1 -6 33 34 3 40 -14
6241a4O7p6M2Jj1j7kj9K7Lo0O7Jl8L9j7n7Pk8R5K5L0j11L6J7OjK1n8M4nnj7jj7
$$ -14 53 -23 19 20 9 -8 -10 -29 -2 1 -59 8 9 -29 10 -7 -64 -57 -85 10 35 65 -46 -10 7 13 12 33 -25 19 14 9 -8 -9 -26
6276b6QN0oM0o6M8rk6m2M4l3L1l1P6o7m3M7K6p0L2N3o3Q6p5K6jk2K1k5K8L6k0
$$ -26 -18 32 26 66 0 48 39 13 -29 15 -18 13 -18 58 -9 -52 -5 21 -49 -17 36 -27 59 -16 10 9 -13 8 -17 11 47 27
6308B7n5J8M6m6m7N7M2m2pM0n5J5M1Kn1M2j3m1O7n0n8J21k2mK0l6l0lkLk9P4P
$$ 27 -28 -10 36 -10 -57 0 42 0 -7 33 -22 -7 34 36 -15 27 14 -27 40 -10 -68 53 31 27 47 11 -19 -22 -24 -21 -50 24 31
6341C1k5rMPr9M4R3l1L4m7L2nk9j9KLRM8l4M9m5m3O8p2J9RM5Jm0j1J8l2O9m3l8
$$ 31 6 -3 1 8 -91 -47 46 15 49 2 34 29 0 -19 -17 -14 -5 43 9 58 13 -30 38 -34 -15 -6 39 40 0 -11 7 -25 44 1 -37
6376c7J7N8k9MM8m6l9L6J1ml9%J8MJ1k1pl5P7n1L7m3j4Qk0P1k5M9mPk5qo8Q7m0
$$ -37 -20 38 9 13 61 15 -24 12 23 19 -20 -20 -2 2 13 -8 -15 -50 27 -24 13 -30 -44 -36 -56 15 -10 39 35 42 17 9 -59 28 -12
6411a2O2Rm8l3Nj7LL6J1l2MM0k8J6k6m1J5O2j1m3j6L6L4p7Q1k3j8L7Jo7K7qQJ4
$$ -12 50 59 11 -22 -17 -34 -31 5 16 -16 -12 28 0 16 -10 -51 -36 26 15 -28 -44 -8 26 -51 30 7 -11 26 27 -40 -13 -21 -13 1
6445AO3K8q9J9L2r0L3Rj8K2rL3Nk1k7N2o4K3K1m1M9m3NL5o0%j9M7J2m5O8o9P8
$$ 1 64 92 3 22 54 -36 -3 6 -12 10 1 34 39 18 -9 43 -21 2 23 -18 31 -12 -7 28 -32 -32 -51 -4 8 -37 31 -38 40
6478D0r6M9j2M4M6l5p6K4K1l4R0q6L3J5k8OlM2l8J7n6L7j6L6K0l8nm1P5p5pJ08
$$ 40 -56 -7 -19 25 71 36 -40 -16 5 -29 61 -25 8 23 -5 1 -2 40 2 19 -37 0 -16 20 40 2 -3 -44 31 -44 -51 57
6510E7o3P4q5qj0K6L2pqn0K0K8J1%k7L3j7l4O4J9m6n8jK3pN9LJ7l2k7nk9J08m0
$$ 57 -6 68 -17 -25 -35 -9 23 16 8 -42 -22 6 17 17 -10 23 6 -28 36 55 9 -49 -50 -27 -34 25 28 45 13 -14 -19 -48 60 20
6544B0Kj2L5J3m0k7l5K4Pj5L0J0n0L1PL2o8K7j3N3l1l5J0Q7p6kmjN2ln1pK3K2
$$ 20 22 10 45 58 18 -9 -44 -20 -13 -28 2 12 -38 -7 0 32 -36 -9 -22 31 0 -35 -25 62 -14 -16 -20 -21 31 28 -23 -30 -7 15
6578A5k1j1L4m3K5m7P2L4p1N5j0l5L7l7On0L0k6N5j4M0m1J9m2lk8L0M6K1l6kK1
$$ 15 -6 -17 17 -26 -1 -48 24 58 -13 42 32 -3 34 -3 3 -47 -17 -43 12 -2 38 -3 16 -26 -29 -57 -27 19 40 4 2 23
6610B3k1j9n2P8k5RMM8j9p1K3Ml6P1Ol0N6k4o3L9K7j6np8J39n8J2Nn9nN2k7M7
$$ 23 2 -17 -69 9 -16 -7 -3 45 26 -45 -22 -18 -54 17 23 -7 49 25 -38 1 28 12 7 -71 68 10 22 27 -32 -37 15 -12 35
6643C5jl9k5P3o1K4pm0l1J27m4j9l5L5j4J7K1j4nN8p3L4j3n8j3O5J4K6j2m9L1
$$ 35 34 -5 -30 43 -18 6 -1 -41 -72 55 11 -8 -43 -8 -22 -5 16 2 -3 55 -18 16 3 -55 -68 -3 11 37 25 -24 7
6674Gl2J9L7J2j7qmMm5l2%P9nj3k6O9o0j4Kn3N4mN7n5J9j7O0n1oK3J9j8j7J9L5
$$ 7 -25 -6 31 43 26 18 14 18 -27 -59 -59 20 15 2 -24 45 -15 -29 -27 -80 -26 -30 27 -28 -9 -26 34 -17 -23 0 19 1 -16 3 38
6709C8n5k6L9K4L7m5m1Qk5N3k5nj7K5N3m9N2l8L4p1jj7M7L1K2%n0k7l3M5l8N9
$$ 38 -17 -43 -4 20 57 12 -29 -21 -46 7 -18 -23 -40 -15 38 -11 41 3 37 -34 -35 -52 -5 26 48 48 -2 -29 -62 -17 -55 4
6741DL5k3j4L1j1l4m1K1M5l1N3qk0l3j6O7lj6P1p4o0P3rk5qK0M9pMq3N7l4Nj7
$$ 4 39 16 2 33 22 -12 -53 -32 13 -18 35 27 7 -26 -42 25 22 6 77 3 -57 16 7 -18 -26 -6 43 36 40 -43 14 -20 -15 -32
6775c2L0J8rM4o6pK6mj0Jjj2O4l5l7MJ7Qj2L5lKLK9m1l1mk3P4QLn8l4J9m1Q5o2
$$ -32 -2 16 7 51 -15 -22 4 0 -10 -9 -10 -22 42 7 -30 -26 -9 -1 -13 22 19 21 24 53 12 -19 -23 -46 28 36 39 -19 -53 -34 -75 10 -52
6812e2O1pl8L2n9O6k4kN5o2N3j7mo2M8J5n7JR7k8k2K0nk0J3j8N0l0l2M1J6n6q
$$ -52 9 2 -36 -4 -63 3 -21 -23 32 -30 23 6 2 -60 -12 3 -54 -53 44 16 -6 14 9 -11 2 -16 34 4 -28 13 29 -27 -35
6845c5K4N1k7K8pp2N2l5KQj9J4qL2M0n5pj4P7m3j6M9m4L0l4Jk7kK6kP9p3J0K0
$$ -35 -11 40 13 41 34 -38 14 -21 -19 -11 -30 -16 -24 8 48 -7 -14 -28 49 6 -10 39 -5 25 -9 -8 -35 -37 -11 -13 66 -7 3 23
6879B3pl3RQlM2l6rm2kO0m1L2M0Lnj8j9Qm4K4M3l2L2j4k8jl4QN0mKL1o8O6%p0
$$ 23 16 -17 -8 0 -3 39 3 -6 -48 -50 10 -31 1 41 44 39 21 2 10 -34 -10 33 1 33 19 -9 -10 -44 -36 14 10 12 43 -25 41 41 -29
6916b9N9rj5j2J9pNl8J4J9n4N5j5O4r4jM9j6j9M4L0l7j5J2j2n1O5j5l4M5rjL6
$$ -29 30 21 6 -6 13 6 11 -27 -13 6 -48 7 -8 56 -38 -39 10 -6 -25 19 49 12 -3 9 -3 -54 11 -4 -38 7 -2 -3 33
6949C3L9q9k2J7K5P4r6K5L1j7l0M4k8QJ9%j2m6N7o2K4k1%%L3j5JL1m2L6o6R1o
$$ 33 72 -17 -39 -22 3 77 -19 6 37 20 -10 34 6 14 33 33 21 -25 32 -30 -6 -27 -27 -27 6 -9 -8 23 -19 17 -49 42 36
6982C6Lm3jn5M5jM8p7J1oK4kOL5p4M8k0K4jrK5nm1m2J8P8m3J0N7j8m8J3k5mK7
$$ 36 39 -4 -5 -60 -15 -16 32 -45 -34 -40 -16 -18 -12 23 -51 -3 -23 1 0 -9 16 11 -30 -72 -54 24 -19 -9 48 30 -18 -5 -30 -34 -7
7017gK0j8L3m4j9K6oj6J6K9k7l1N3nl4j7N7l4K4L1n2J0j1%K1J2L6p7O0l5M4qn
$$ -7 13 -5 28 -16 -35 -9 -15 -31 -15 14 -13 -44 9 4 -30 -47 10 -24 0 31 -21 -11 -22 -22 -1 11 47 -30 30 -5 39 31 26
7050B6k6K7m1J9Pk8M3l2kK0k9K6J1m8L3K5Qm5l7J01j03M7k8J1jM3p5K0J9j5L2
$$ 26 0 27 -14 5 12 -16 27 -5 -7 13 -16 10 21 -27 6 31 39 -6 -43 58 -45 2 -26 -15 -16 27 -48 -28 -9 -24 8
7081Hkm1OQj2M2k1j4L6k5P4o8J1K2o4P8l9J1ok6L0jLj2o2N7N8l2l8JK4K9n9L0
$$ 8 6 -35 -29 -21 -33 9 -12 -26 10 -15 59 -9 2 24 -40 38 -1 10 4 -22 8 7 10 -2 -64 -7 51 19 -19 -18 6 35 -24 6
7115Fj3kj6JK3k4K3J3K8k7N5m3l4oM9OMl8lRo4L3O9n8oJ4jN1o8k4O6m1l8P2m8
$$ 6 -7 -9 -25 -24 -1 -25 -2 11 39 12 67 24 -10 -16 33 39 43 5 2 11 -53 -20 49 -9 -15 -1 -2 49 -19 -43 23 -18 -56 16 -32
7150c2L1mL9k7K9p2J9K4RJ4k2l3QN3on3N1m0J5kj2j7M9Pl0j2qM9j3j0k4M3lMk1
$$ -32 -1 -5 34 7 36 -36 -17 7 16 30 8 -25 -17 36 30 -23 28 -12 3 1 -11 -28 21 28 -2 -14 -22 27 14 4 -20 23 20 24 3
7185Cl5N2l7M5m6j3M3m5N4J8l9k5N0Ln0K8jk7oQpP9o1NL7o8JM0%L5Mn4M6m3lK8
$$ 3 -32 20 -17 28 -18 -31 12 -33 21 39 0 -25 25 28 -22 6 5 -22 -28 -20 -27 52 -9 -4 33 -35 -34 6 6 41 45 -9 37 -6 -9 19
7221A9k3MJ3J3k6Jm1J1K0jkJ5om7qN4l8N6jm0N4j6m5j6P4m9P6o3J2qRJ4n5M6M1
$$ 19 -4 0 13 26 0 1 -40 -29 -9 -10 -12 3 -3 -50 -58 -4 -42 14 13 -27 27 11 -34 -50 24 -25 51 -12 0 -8 1 15 -40 6 47
7256D7k4l4P8p9L2K1l1pk2k0N0K1m5j7N4l1j0L2j2L0n2N0n8N6p4M6N2o2k9P6j4
$$ 47 23 -11 67 -12 20 41 10 3 -19 -39 11 32 -13 -30 24 -7 -17 15 3 33 -19 31 -27 29 -45 1 53 -9 -38 38 24
7287B4m9J9j1J4Mm1RO5k4J2l2PlK7k%Rm8N6n7PK2k0M1K6q5qO7j9o5N7K5K9o2K7
$$ 24 -25 -6 -17 -3 1 -40 -31 34 10 22 -10 -3 -6 21 19 19 28 -20 36 -21 -14 8 -12 29 55 -30 -38 29 10 -55 2 27 56 -6 21
7322B1Nk5K4j6j9J9k3Po1J07l2j9K7Mm8N2j2k6%J6j1J8rmJ9n3L6M5o6K5KJ2m7
$$ 21 26 1 25 9 -10 9 -14 -7 -68 39 7 -12 15 19 -29 23 11 -15 -15 1 -10 8 -1 -5 14 -39 -3 42 -24 1 3 15 -32
7355c2mM2j0M5p2KoM6J5K2m6l9M4k8J9j7L1rk3N2l5L5j1k0MJ3mqJ1jK8l1j0J9
$$ -32 -36 6 -4 41 -31 -29 -35 11 26 48 2 -37 7 -21 -2 -19 12 3 -20 32 -3 32 21 1 5 18 14 6 17 16 44 13 3 22
7389B2k8Rl7N3Qk7M1k3n8MP0l5k9J4K7J6rl6M2j4OOl5M5m7N6m7j6K7k5L6l4k3
$$ 22 -6 3 -34 19 27 0 41 18 -40 -36 34 -1 -30 -16 11 27 18 -18 24 10 16 22 -13 32 -15 41 -6 -22 5 -20 16 -18 -41
7422d1M7k7j0L7OKk0OM1j0K5o8O8l1J4o2M2l4%oM4k1j5M0jpj8J7k9J8M4q7L7K4
$$ -41 6 -21 -31 6 12 14 -6 0 41 31 56 -12 56 25 39 -23 19 -15 -15 -21 23 2 -13 27 26 19 1 18 -11 7 51 -36 1 25
7456B5J6m7n9O0qRn5K3k8J17k0l5o6P4qJ9QJ6j3ooj4j5K7k0J8KqM6q7l8P1mL2
$$ 25 41 -6 -65 -5 -13 -4 -59 -36 -64 53 33 -2 -68 6 -2 17 25 41 28 22 16 2 -13 14 -6 12 14 6 52 -35 -73 -2 -6 26
7490B6k3k4K6k7rP2l4o6P6o0N5Nk6j0m1N5k7J4N2%Lk7Jj9LrM2K6p3RK3j4L0Ml6
$$ 26 3 -21 5 -22 -31 41 7 -59 17 -43 12 17 -9 -19 -60 -5 -32 -18 34 34 37 10 11 -8 -5 -14 28 54 -19 -10 13 -1 29 33 -3
7525cNMnL2j1k5q0R8k5j0L5m1N6l8k8Q7l9oM5p7M9oj6k9N6k6L7k0K4K0n9qM0o6
$$ -3 2 6 1 33 22 -3 -83 15 -10 -20 15 -26 30 -8 -36 51 12 6 51 -26 23 17 1 -28 28 2 39 19 43 63 4 -4 36 -30
7559c0L3k3lL4k8k6J19n1p6O6L3n1N1n7k7K9NjrM0j3l4l3M4J3m2K6Jl6L9J2K7
$$ -30 3 -20 -23 11 -17 -43 76 25 -51 15 48 -3 48 -9 -36 -7 -2 -3 -12 28 15 -19 -52 -8 5 -37 -11 -10 -46 -7 5 32
7591C2m7Jj1L5L3n5L4J9o3K5p3Q7k3j5O1l2M1p4P4k9J2n7K2K6J3%l0N0o7m3M1
$$ 32 -15 -14 -25 10 43 -12 22 41 -22 3 -70 17 -6 -21 40 8 49 -25 49 20 32 -25 -3 23 36 36 6 56 -11 -54 -13
7622a3K3l4j0o7J39m4K8o7J7K5J0lK8l1k2P0n3M5j6n8Q6m9J1J0m7K5NNn1QM1k0
$$ -13 10 -24 -34 -101 38 -6 22 -45 -28 -3 7 4 32 1 -21 49 -4 41 25 -33 53 4 15 25 -22 3 8 13 -38 -30 11 -9
7654iJ0j9m4R0nMl5K6o6K7K8o1Q7k1J9l1Kj0k4M0m6O0J5Mm2j2N4j3l4LJ5j5Ll3
$$ -9 1 -18 -62 28 23 27 -8 18 -48 -21 7 -54 33 12 31 0 2 -8 -32 8 -38 22 37 41 -1 -13 41 28 -6 -3 12 -3 0 -33
7688c3K9K3jlK6m7K3l5n8Q5K4m5J1Rl6K1K1n2M9j9l7L4mK1k2RO5l3o0N8oJ0l2
$$ -33 -4 19 18 15 41 -6 17 -18 -76 9 33 -12 -1 8 -28 -7 14 -38 11 -8 -45 -11 -15 6 -16 -7 58 25 -35 23 17 27 -5
7721eL0oRpkK5k8n5N8ml7M4Qn4M3k8m4O4k0M8Jo9k2Q5m8Lj7QL6j0k6l4J03q5K6
$$ -5 25 19 28 21 19 44 16 -39 19 15 -22 22 30 -24 19 -9 -53 11 -9 39 40 -29 -51 34 -14 -11 -28 -20 16 6 -20 -54 49 -36 -10
7756a0K1k1j4M9qkj2Rk6L0j3j8O1k1o3P8k0j9J4rM7k9Jj1l9j8P0m8K8k4L1l0M3
$$ -10 11 -10 -24 25 17 15 3 12 -14 16 3 -15 46 25 -38 40 20 1 15 6 53 24 25 14 -25 -43 27 -21 7 -17 14 -16 27
7789B7j3K3k8o3K7N2l6J9k3n0N7K8nK0j2q1K5J7O8j5J1o9nL2m6N5JJ2l3l3N3M3
$$ 27 14 37 9 -54 -27 25 -11 8 -15 -65 -8 20 15 35 23 -58 -33 -16 52 37 48 -21 -26 6 -40 15 16 28 -5 -38 15 58
7821E8Qm9q1Q0m1L1j1K6J3k8L1j8q1M5l2N4o5J17p6qK4jjK5m0j8N6m5jK5Kj8K1
$$ 58 66 17 -64 16 -25 6 -5 21 34 6 37 19 -62 -17 -49 5 -60 57 -19 -27 -3 -4 -5 20 -20 -38 18 -27 -28 -3 -1 -19 2
7854BM5l2L0k6K3j7k7jQj5J4J5n5P9j33J33n3L1Lkk9L5J9n3ml1LL5L8KL8j02J8
$$ 2 47 15 45 19 42 25 -2 -3 5 -10 4 19 -36 43 -90 43 -10 21 24 22 -7 28 47 -6 -10 -41 -38 -3 35 37 75 -27 -9
7887ik6K1J2L4m2j4J2L7qqO0n6M2p3j5O7P7j19Nn6R4j3l6K2j6qJ6j4LL3n0k4O7
$$ -9 -35 -14 -2 32 -10 -24 -12 25 17 9 69 13 55 -18 -33 34 111 -8 -3 -59 35 22 -14 8 -8 -16 0 -14 -11 22 -28 -52 15
7920A5l5mlM3l7K1m4L0J9Rj0O0r7P0N2o9Mqj0Lj9P3p8J1K5j8pk1J4RK6k2J3K5
$$ 15 -20 -24 -27 16 -21 0 -44 -14 5 14 4 64 -33 37 89 20 24 16 6 9 -10 63 -15 -4 21 3 -4 -25 -11 -2 24 2 15 40
7954D0k8l7j0ML5k5L6kj2j9K4p0O7p4M4nM2l5mNN9j9k5Oj1Ql8L5kL8n6M7K4l3
$$ 40 12 -25 -35 -31 4 -21 15 13 1 -18 6 -64 3 -71 -27 -32 10 -25 -29 -24 35 16 -9 -3 -14 -6 -44 -9 -11 27 -29 18 42 9
7988IJ5o2N2lj8L1l2m1K3N8k3J6l7jn3L8mJ0N7m8j1J6J1r2N7J6l1N7Loj6%J7k5
$$ 9 24 -38 14 11 -7 24 -8 -49 -26 32 9 25 -12 -13 -66 -28 -32 -22 35 -13 -24 -8 3 -89 -32 -16 -47 10 13 7 -9 -9 8 -17
8022a7K3MJ7n5OL6mM8m0j1pj1N4k5Om9Rj7J9M2o5Q6m8j9Om1N6n5M3l3L3K7l9K2
$$ -17 6 10 27 -28 -22 14 10 58 18 7 0 -11 43 18 24 -25 -16 -33 -14 28 -37 49 1 -18 -12 -53 3 -52 -9 -42 -9 18 -21 1
8056AJ8J7q6M5L6k5m3N1J5%M3p1N1k1l7R5l9nm6L7p9L0mL4L4o7m8M7L6j6Ol7l
$$ 1 19 36 -50 -5 31 6 -37 14 29 29 72 1 52 31 -6 89 50 45 -1 36 -43 -13 -17 17 51 -16 -64 -17 19 3 9 -28 -31
8089c1K7j8J8K2l6k8M0k6jP0n5MJ6Kk4k5J1QK0mMJ6QNm0M5k3J1K2l4j4j0L8%M
$$ -31 -4 -22 -4 18 -18 -46 -6 -32 -33 37 -18 -14 2 4 -20 -45 -34 -26 -6 -10 -6 10 18 23 -17 28 5 16 38 4 -10 -20 18 18 22
8124B2n1Pk8k2J3N5k0J8K0o4M6l8N6%rk9L1J2j9n3N1l%LJ8j6J2k1L7l0OmK8p8
$$ 22 -29 -22 -50 -72 -59 -4 -24 -6 14 -50 -4 -42 14 14 5 -24 7 19 0 -53 -2 -5 -5 -2 16 0 12 -9 28 -2 4 0 28 -50
8158e0N6L1ko8M4j1MM3m4ml9L8J5l2M6m9mPJ1OK8J4l3j5J4K2n3qL0J2l0J3K
$$ -50 6 37 35 -33 11 0 4 47 3 -1 -40 -2 13 -19 27 -22 -26 -19 -8 -2 26 40 7 -8 6 28 -25 -33 -3 9 -21 -8 -6
8191f
$$ Imaginary data points
##PAGE= N=2
##DATA TABLE= (X++(I..I)), XYDATA
0@%%%%%%%%%%%%%%%%%%%Qj6J6j6J6j6J6k4L2l2L5m3M8n6O4p2Q1q9J04j15J26j42
$$ 0 0 0 0 0 0 0 0 0 0 0 0 0 0 0 0 0 0 0 0 8 -8 8 -8 8 -8 8 -16 16 -16 19 -24 24 -32 32 -40 41 -48 56 -59 67 -75
41g5J58j74J94k16K36k61K90l20L52l87M25m67N17n72O32p01P80q71R78j106J263
$$ -75 83 -91 103 -113 123 -138 152 -168 184 -203 222 -245 272 -300 332 -369 411 -460 518 -588 675
62F75j455J700k034K508l237M513p393K6290j334l5004J8544j6421j3024K2064
$$ 675 -780 920 -1114 1394 -1843 2670 -4723 21567 20233 -14771 3773 -12648 -25672 -3608
76c608Q186m233K2444l415k1480m241n951p040J2953O317Q280J4362q735j6094
$$ -3608 4578 345 22789 19374 -2106 -6347 -12298 -19338 -6385 -68 8212 22574 13839 -2255
90b255j120j1579m329J5863M864M975J6329r212j7127o21j0916n850K0247P825
$$ -2255 -3375 -14954 -19283 -3420 1444 6419 22748 13536 -3591 -4212 -15128 -20978 -731 7094
104G094j614J1100l691j4988l122q988l788J6293O787K101J1293p479j4694q40
$$ 7094 5480 16580 12889 -2099 -5221 -14209 -17997 -1704 5083 7184 18477 10998 -3696 -4536
118d536j0695m206K1589O523m495J1908l888j7425n88o951o700K0638J0529p060
$$ -4536 -15231 -19437 2152 8675 4180 16088 12200 -5225 -5813 -12764 -19464 1174 11703 4643
132D643Q604j021j8466j592j315p758J4666J4094m136L654q60j5480m403j032
$$ 4643 13247 12226 -6240 -7832 -9147 -16905 -2239 11855 7719 11373 10513 -4967 -9370 -10402
146a0402m136J3449J2573k968K483k571j5228k544J456m919J0393J3728j407K13
$$ -10402 -14538 -1089 11484 8516 10999 8428 -6800 -9344 -7888 -12807 -2414 11314 9907 10120
160A0120k778j3754l830J906k300R421J1768o68M1m071j3109k712K135k346R695
$$ 10120 7342 -6412 -10242 -8336 -10636 -1215 10553 9885 9926 5855 -7254 -9966 -7831 -10177 -482
175d82J1738j674n15l761j3634k283M324k184P846J2003j878j838k524j2947m041
$$ -482 11256 9582 9067 5306 -8328 -10611 -6287 -8471 -625 11378 9500 7662 5138 -7809 -11850
190a1850N380j41O526J1236j225l189l012j1530l987N521J030N991J0123j307
$$ -11850 -6470 -6611 -85 11151 9926 6737 3725 -7805 -11792 -6271 -5241 750 10873 9566
204I566l515k699j1058m736O322K574M877R262r98m764k709r101n227N540L967
$$ 9566 6051 3352 -7706 -12442 -6120 -3546 1331 10593 9595 4831 2122 -6979 -12206 -6666 -2699
219b699N085Q065j030n227l245q132m524N482M536M607P263q88n804l537o814
$$ -2699 2386 10451 9421 4194 949 -7183 -11707 -6225 -1689 2918 10181 9293 3489 -48 -6862
234f862m399M786N345N002O145j370n593l960o465l390N187M946M727O127j586
$$ -6862 -11261 -6475 -1130 3872 10017 8647 3054 -906 -7371 -10761 -5574 -628 4099 10226 8640
249H640o576l753n306l517N035O047M092M673j032o268m653m813k396M858N810
$$ 8640 2064 -1689 -6995 -10512 -5477 570 4662 9335 8303 2035 -2618 -7431 -9827 -4969 841
264H41M128M431j417o725m445m111k308N071O447L479L283r83o417n499l357j145
$$ 841 4969 9400 7983 1258 -3187 -7298 -9606 -4535 1912 5391 8674 7691 1274 -4225 -7582 -8727
280h727M428O313M077K510j983n864m885l651q87N247O278L216K165j758o341
$$ -8727 -4299 2014 6091 8601 6618 754 -4131 -7782 -8669 -3422 2856 6072 8237 6479 138
295A38n054k451n97M459O758L733P56k352n474m996k646K54M672O250L637O34
$$ 138 -4916 -7367 -7964 -3505 3253 6986 7742 5390 -84 -5080 -7726 -7472 -2800 3450 7087 7721
311G721k891n682m443k135L53M644O296L602Kl150n632m429j405Q28M108O258
$$ 7721 4830 -852 -5295 -7430 -7077 -2433 3863 7465 7467 4317 -1315 -5744 -7149 -6321 -2213 4045
327D045L740m74l809n326m121j291J516M400N425L423j64m033n814m052l65K001
$$ 4045 7785 7311 3502 -1824 -5945 -7236 -5720 -1320 4105 7528 7364 3331 -2483 -6535 -6900 -4899
343d899L920N241L358o62m245n608l728k71K421M229M757K830q25m019n516m001
$$ -4899 -979 4262 7620 6958 2713 -2895 -6623 -6894 -4473 -244 4513 7343 6518 2499 -3017 -7018
359g018O0L431M104L719K802m45m765n664l155K18L283M706L791J511q78l828
$$ -7018 -6958 -3527 577 4296 7098 6653 1888 -3776 -6931 -6713 -3430 1276 5067 6578 5700 1872
375A872n472l790N99M084M613L335J243j255l879n239l309O37M051M943L246O10
$$ 1872 -3600 -7390 -6791 -2707 1906 5241 6484 5229 1350 -3889 -7198 -6561 -2510 2433 5679 6289
391F289j849l667m613l279N49M316N206L168j30k256l363m378l092R55M378M791
$$ 6289 4440 773 -3840 -7119 -6570 -2254 2952 6120 5990 3734 371 -4007 -7099 -6144 -1766 3025
407C025L271L9l213l856l157k580L51M534N282K639m31k974m150l269j645O96
$$ 3025 6296 6335 3122 -734 -3891 -6471 -6120 -1586 3696 6335 5904 2930 -1220 -4489 -6134 -5438
423e438L845N324L147r30l667m092k989j025J149L470M869L245j041l950m081
$$ -5438 -1593 3731 6878 5948 2281 -1811 -4800 -5825 -4676 -1206 3663 6908 5867 1917 -2164
438b164l015p74J960L320M155L367q82m615m078k492n09K291L399L430L287o01
$$ -2164 -5179 -5953 -3993 -673 3482 6849 5967 1352 -2726 -5218 -5727 -3436 -37 3393 6680 6079
454F079n067m199k127o14L006M195K154K120M70m707n232j541J72K189M322L092
$$ 6079 1012 -3187 -5314 -5928 -2922 1273 3427 5547 6017 1310 -3922 -5463 -5291 -3102 1220 4312
470D312J294m27m102n011k074P93L103L960K326R98l55l809m834k386P60L609
$$ 4312 5606 5179 1077 -3934 -6008 -5215 -2112 1848 4174 5172 4817 1008 -3826 -6212 -5452 -1843
486a843M378J985M45q93l702m181j876M20L420M560K111K90j396l815l753j999
$$ -1843 2535 4520 4965 4072 370 -3811 -5687 -5267 -1847 2713 4824 5114 3718 -97 -3850 -5849
502e849L09M477M866P56j86q21m258l347p03m87L252O052J550j388j178m219l578
$$ -5849 -5540 -1063 3803 4559 4373 3552 -706 -4053 -4756 -5243 -1991 4061 5611 4223 3045 -1174 -4752
519d752J82L12K465N829J699k006r76l567m393K21J340K176N467K375k672k195
$$ -4752 -4570 -4258 -1793 4036 5735 3729 2753 -814 -5207 -4986 -3646 -1470 3997 6372 3700 1505
535A505k945l244J73J241K039M827K570j879k503l745l440P51K066K233M253J891
$$ 1505 -1440 -4684 -4511 -3270 -1231 3596 6166 4287 1784 -1961 -5401 -4650 -2584 -351 3902 5793
551E793k144k492l236l044N78J995K406M177J841k078k767l890k697J728K046
$$ 5793 3649 1157 -2079 -5123 -4545 -2550 -144 4033 5874 3796 1029 -2861 -5558 -3830 -1784
566a784J747M091J405k274j864l814l804K072L048J605M003J304l440j868k690
$$ -1784 -37 4054 5459 3185 1321 -2493 -6297 -4225 -1177 428 4431 5735 2295 427 -2263
581b263l818K029L618Q97L444K090l537k455k259l940J682M592J311K518J762
$$ -2263 -6081 -4052 -434 463 3907 5997 2460 5 -2254 -6194 -4512 80 1391 3909 5671
596E671l658k755j300l627R54M877J742J870J862l465l705j232k268P74M511K160
$$ 5671 2013 -742 -2042 -5669 -4715 162 1904 3774 5636 2171 -1534 -2766 -5034 -4260 251 2411
612B411J425J096k893l326j709k138J168M159K472J714N11l671l023j255j937
$$ 2411 3836 4932 2039 -1287 -2996 -5134 -3966 193 2665 4379 4890 1219 -1804 -3059 -4996
627d996J584M195J581J727R03l824l318q67k009J498M963J381R91J057m114l470
$$ -4996 -3412 783 2364 4091 4994 1170 -2148 -3015 -5024 -3526 1437 2818 3809 4866 752 -2718
643b718q4j802J037N191J437M23J378m009m306K87r45P59N355J570n36J177l149
$$ -2718 -2802 -4604 -3567 1624 3061 3484 4862 853 -3453 -3166 -4111 -3352 2003 3573 3037 4214 1065
660A065m624K70m31L40N215K390j082M13k582m656j56O29O13M281K515q00k84
$$ 1065 -3559 -3289 -3720 -3380 1835 4225 3143 3556 974 -3682 -3838 -3209 -2596 1685 4200 3400 3116
677C116k561l960m83M56J219M354K179j025m55k771l724K2N84R08M220K296j006
$$ 3116 555 -3405 -3888 -3432 -2213 2141 4320 3295 2840 69 -3655 -3633 -3049 -2141 2079 4375 3369
694C369p36k907l659K75Q00J081M375J846j533m60k807l841P74J119L95M272K573
$$ 3369 2633 -274 -3933 -3658 -2858 -1777 2598 4444 2911 2451 -356 -4197 -3423 -2304 -1909 2363 4936
711D936k111r42k275m064O39K202M24L322K648j865j365k024l874L01K643P39
$$ 4936 2825 1883 -392 -4456 -3817 -1615 -1191 2131 4779 2914 1549 -475 -4349 -4048 -1405 -666
727f66K797K672j892j942j712l395k8K888J251K191K112j319j977k164l180M27
$$ -666 2131 4803 2911 969 -743 -4138 -4166 -1278 -27 2164 4276 2957 980 -1184 -4364 -3937
743c937K866J298K238J939j897j992j551l127j3L259J760J674J644j645k223j790
$$ -3937 -1071 227 2465 4404 2507 515 -1036 -4163 -4176 -917 843 2517 4161 2516 293 -1497
759a497k584K03L034J805J841J305k006k139j428k566J72L312J738J755J139k355
$$ -1497 -4081 -3878 -844 961 2802 4107 2101 -38 -1466 -4032 -3860 -548 1190 2945 4084 1729
775A729k290r28k219k40L329K236J326J083k282k724q87j553j20K942K342J396
$$ 1729 -561 -1489 -3708 -3948 -619 1617 2943 4026 1744 -980 -1867 -3420 -3540 -598 1744 3140
791C140P99k411k872o17j196k07K939K479J049N63k107l100r06n75J78K486K326
$$ 3140 3939 1528 -1344 -1961 -3157 -3364 -425 2054 3103 3666 1559 -1541 -2447 -3022 -2844 -358 1968
808A968J294L97k298l097q51m40M48K531K184J003L29k296l172p67k05N91K734
$$ 1968 3262 3659 1361 -1736 -2587 -3027 -2579 -48 2136 3139 3468 1172 -2000 -2767 -2972 -2381 353
825C53J970N08L91j895l483j037N39P09K211K204N91k14j791k991j398L82J496
$$ 353 2323 2831 3222 1327 -2156 -3193 -2654 -1945 266 2470 3061 2847 1056 -1935 -3333 -2951 -1455
842a455K340J525L95L4j979l049j132N19J310K675J613k51j94j504k986j353P55
$$ -1455 885 2410 2805 2839 860 -2189 -3321 -2802 -1492 1183 2796 2545 2351 847 -2139 -3492 -2737
859b737J564K437J619k06p49j499k493j373O65J780K469J483l10r27j657k142
$$ -2737 -1173 1264 2883 2677 1928 429 -2064 -3437 -2772 -992 1477 2960 2650 1723 66 -2076
875b076j137N71J751K501J556n03j213j654j979r39O74J673K469J627o47j552
$$ -2076 -3213 -2642 -891 1610 3166 2663 1450 -204 -2183 -3122 -2448 -775 1694 3321 2674 1122
891A122j647j707q00P51J704K343J547o41j624j929j514m31Q13J558K252J525
$$ 1122 -525 -2232 -3032 -2281 -577 1766 3313 2672 1048 -881 -2395 -2826 -2013 -455 1797 3322
907C322p33j802j750j543l42J118J588J843J462m96k102j986j199j0J160J586
$$ 3322 2589 787 -963 -2506 -2848 -1730 -142 1701 3163 2667 565 -1421 -2620 -2630 -1470 116
923A16J742J246n74j968k002j276M4J337J796J520Q54m61j901k134j100K62J293
$$ 116 1858 3104 2530 562 -1440 -2716 -2672 -1335 461 1981 2835 2374 473 -1661 -2761 -2499 -1206
940a206J825J471O31m67j827k241j091N30J386J833J451K99p67j478k035j277
$$ -1206 619 2090 2721 2254 427 -1814 -2905 -2375 -989 844 2295 2594 1827 349 -1686 -2963
956b963N10J698J728J376L24j115j586j819j074P30J741J548J202M08j241j825
$$ -2963 -2453 -755 973 2349 2673 1558 -28 -1847 -2921 -2191 -450 1098 2300 2708 1467 -358
972c58j339j036L22K010K064P62m7j041j835j513n19M50J593K017R94j24j142
$$ -358 -1697 -2733 -2411 -401 1663 2425 2378 1337 -498 -2011 -2530 -2080 -487 1530 2524 2400 1258
989A258j984j483k61O14J504K119Q40o10j024j526j686l33R10J504J789J168o50
$$ 1258 -726 -2209 -2470 -1856 -352 1767 2607 1997 973 -553 -2239 -2572 -1662 -158 1631 2799 2149
1006B149j537j625j279j76J201J439J356J091m03j712j567j059n17J206K073J216
$$ 2149 612 -1013 -2292 -2468 -1267 172 1528 2619 2216 504 -1063 -2122 -2639 -1433 640 1856
1022A856N13k88j728j802p19q0Q52J953J447L20l53j542k130o89M52P98J808J608
$$ 1856 2369 2081 353 -1449 -2168 -2248 -1396 557 2004 2324 1971 429 -1701 -2390 -1938 -1140 668 2276
1040B276j00o94j078j842j059N03R99J582J712K06j145j387j591r52O79J378J286
$$ 2276 2176 1482 404 -1438 -2497 -1994 -995 587 2299 2505 1360 -27 -1618 -2570 -1891 -513 773
1057G73J325K95j187j437j205r56L53J587J621R23K67j179j733j186m63M87J277
$$ 773 2098 2393 1206 -231 -1436 -2392 -2039 -452 1169 2092 2359 1180 -553 -1739 -2202 -1715 -438
1074d38J556R96J27r95j859j388k32O74J229J722Q97l98r77j527j385j47Q31R84
$$ -438 1118 2114 2241 1246 -613 -2001 -2233 -1559 -330 1392 2289 1891 914 -613 -1998 -2145 -1314 -330
1092c30J511J272l93j391j346j541j79J436J172R14J140k96j535j072j236o30
$$ -330 1181 2453 2060 669 -677 -2218 -2397 -961 211 1125 2265 1969 434 -638 -1874 -2504
1108b504J360J683Q28Q21k10j711j386o91m09J217J644P62N40j05j453j536q99
$$ -2504 -1144 539 1367 2188 1978 267 -1119 -1810 -2219 -1002 642 1404 1944 1839 386 -1150 -2049
1125b049j54J201J845R38J71m97j340j276p37m0J037J677J046K57o89j350j392
$$ -2049 -2203 -1002 843 1781 1952 1455 115 -1161 -1898 -1938 -901 776 1822 2079 1390 40 -1352
1142a352p84J77J340J546R11J48q04j382r80p48r8J377J700Q19K14r53j781q10
$$ -1352 -2136 -1959 -619 927 1838 1986 1182 -200 -1180 -1928 -2026 -649 1051 1870 2084 1131 -650 -1460
1160a460k32j29J347J661N36J49o96j810j025l0l9J195J956N13k33o92j741j043
$$ -1460 -1692 -1821 -474 1187 1723 1872 1176 -634 -1659 -1689 -1728 -533 1423 1936 1703 1011 -730 -1773
1178a773L06M9R81J722O90k32q02j770j192L68N31Q91J577N95l53p31j652j166
$$ -1773 -1467 -1418 -437 1285 1975 1743 941 -829 -2021 -1653 -1122 -231 1346 1941 1588 857 -795 -1961
1196a961K51P02R74J447N43l57r52j687r53L88P37J026J278K89l32p09j712j070
$$ -1961 -1710 -1008 -34 1413 1956 1599 647 -1040 -1993 -1605 -868 158 1436 1725 1393 684 -1028 -2098
1214b098M75P86J132J374P7n75n83j622j115O28Q55J044J332L8p38o35j348j275
$$ -2098 -1623 -837 295 1669 1746 1171 588 -1034 -2149 -1521 -666 378 1710 1748 1010 375 -973 -2248
1232b248O98J057R24J353o3r33n81j154j173N56J200R18J236R4j272p28q34j009
$$ -2248 -1550 -493 431 1784 1721 788 207 -947 -2120 -1564 -364 554 1790 1884 612 -116 -950 -1959
1250a959M06J234J024J042K8j133q10r77p84N30J143R79J122l6j318r05o88p35
$$ -1959 -1553 -319 705 1747 1775 642 -168 -1145 -1929 -1399 -256 723 1845 1809 491 -414 -1102 -1837
1268a837O02J110R26J083j38j343r05o88o32P35J135P63R87k3j424j070n46m74
$$ -1837 -1235 -125 801 1884 1746 403 -502 -1190 -1822 -1087 48 811 1798 1775 351 -719 -1265 -1739
1286a739P15J181O51R56L1j600j005m95l83O68J397N94O12O2j480j119m06l40
$$ -1739 -1024 157 808 1764 1795 195 -810 -1305 -1688 -1020 377 971 1583 1645 165 -954 -1360 -1700
1304a700Q17J393N49M32Q7j397j261l24q3O47J410O30K42p9j233j160m08j53R45
$$ -1700 -883 510 1059 1491 1578 181 -1080 -1404 -1487 -840 570 1200 1442 1363 130 -1030 -1438 -1591 -646
1323f46J391M30K07p7j231j172l44l1Q18J517N28q3k08j137j130k64L1Q59J451
$$ -646 745 1175 1382 1305 74 -1098 -1442 -1473 -655 862 1390 1307 1099 -38 -1168 -1432 -1401 -542 909
1342I09M68q0l23j101j136j43Q6Q88J383N17k40l15j151j061l2J67P43J459N02
$$ 909 1377 1297 974 -127 -1263 -1406 -1320 -432 951 1468 1228 913 -238 -1299 -1331 -1164 -421 1038 1540
1361A540l46l88j162j055L0L70O82J314N41l53n59j031j036J03M40P44J241M88
$$ 1540 1194 806 -356 -1411 -1381 -1011 -329 985 1526 1173 614 -417 -1453 -1350 -910 -166 1075 1563
1379A563l96o56j021r88K17N16O25J223M48l97p65r57r01J76O40O88J114L84m99
$$ 1563 1167 511 -510 -1498 -1281 -765 -140 1083 1531 1134 369 -588 -1489 -1313 -673 15 1129 1513 1014
1398A014p64q88q35J79O60Q56Q79L25m73q18r08o86K67O38Q06R73K07o08o91q74
$$ 1014 250 -638 -1473 -1294 -634 222 1101 1426 953 135 -773 -1459 -1192 -554 252 1225 1432 824 133 -741
1418g41p61K99P56Q05Q51K04o50p37q17o61L00Q76O74P78K79p24r21o56n22K26
$$ -741 -1502 -1203 -447 358 1209 1413 763 26 -791 -1452 -1152 -276 398 1176 1455 731 -190 -846 -1368 -1142
1438a142R22P73O73K04p69r35o47m38K67R52Q03N87O6o73j046o69j96K87R16P60
$$ -1142 -220 553 1226 1430 661 -274 -921 -1359 -1092 -140 663 1250 1316 643 -403 -1072 -1268 -981 -65 695
1458F95N21l2o67r02p21l02N32R29P22M73q4p69r07n84j52N23P74P09N16k00p47
$$ 695 1216 1184 517 -385 -1106 -1408 -876 53 775 1248 1164 395 -512 -1096 -1248 -725 49 758 1274 1074 327
1479C27q36o32j65O75R12N70L07r8p98q40m77k42N81J000O86J94j62q08r22m43
$$ 327 -509 -1141 -1306 -631 281 851 1158 1060 262 -578 -1055 -1297 -716 284 970 1164 1002 194 -728 -1171
1499a171K0N04J024O54L9j83o94r36m54R9N67R40P57l7m83n65q09m52K22M58Q70
$$ -1171 -1151 -647 377 1031 1070 887 193 -743 -1197 -1098 -531 409 1166 1129 646 81 -728 -1180 -958 -500 370
1520C70P46J39n64p46o53m77J05P84Q45N82P3o10q10n66k58m7P83Q45N07J91o37
$$ 370 1116 1255 691 -55 -708 -1185 -1080 -296 549 1131 1204 594 -216 -782 -1040 -1087 -304 541 1048 1239 602
1541F02r55n93j19J67P69P82L21L5m39q54p00k1K12N43R68M90k32n43q66o62J66
$$ 602 -353 -946 -1065 -898 -129 653 974 1009 570 -284 -984 -1005 -793 -250 718 1208 976 433 -433 -1095 -929
1562i29L37N32N97N71r2n51q25p57n4O16P07N30L89j53p12o26n35r2M97P74M69
$$ -929 -592 -60 537 1108 1016 465 -360 -1117 -1171 -555 152 682 1071 918 206 -420 -955 -1047 -550 224 693
1583F93L86r5q22p92m20RN01R25M06K1K0n20r13m55M6L83R27O69o9k75m90p99
$$ 693 1079 984 162 -630 -1050 -1041 -540 385 791 812 832 312 -601 -1056 -1010 -627 300 969 900 625 135 -664
1605f64m36K88M49N98P36L4l80m54p90n18J84O55P41N94p1n62n33m14m93P4P02
$$ -664 -1100 -812 -363 235 971 1005 625 171 -619 -1137 -953 -298 443 1037 966 404 -129 -543 -1036 -962 -260
1626b60O07N99K04o39q14m09k62Q7P66P16K67P6l97q46m56j26J11M89R41L58q1
$$ -260 347 946 1150 511 -303 -712 -974 -887 -121 595 862 938 541 -305 -761 -887 -776 -287 654 1012 931
1647I31m81q11n60N1L36L71P30M45j23n18o58o28r2M87N30N72M70j83o46o10m33
$$ 931 450 -361 -921 -870 -534 -163 567 1012 889 371 -287 -915 -1007 -520 10 582 1052 869 223 -387 -820
1668h20j02L87O49M17M87p7p47o70m12j20N74O86L46K38No02q47k50JL62P38N07
$$ -820 -922 -535 114 531 1018 941 194 -476 -888 -1008 -434 252 598 836 841 239 -608 -858 -857 -495 243 750
1690G50N3j39m79q23k48P4M76O63N11mk71m18p16m70K25M94O55N10L1l51n47n58
$$ 750 803 664 185 -638 -886 -812 -336 327 838 834 563 145 -571 -1041 -816 -322 333 843 874 523 -24 -582
1712e82l37J60N04O41L90Q9l63n97n38l30J83N54P26K93m4l36n99m96j46J71M33
$$ -582 -919 -759 -255 386 776 865 502 -95 -633 -963 -780 -226 500 793 749 413 -186 -682 -828 -657 -224
1733b24O92M23q0m53o01m64j71K77M88O58L72k07l53n51n70n8L19L98N93M32j92
$$ -224 468 891 811 358 -243 -707 -878 -601 -113 545 917 710 357 -194 -764 -822 -503 -105 488 920 728
1754G28m87n47m36q5K96N37N21L40j85n18m85m66n5M48N27M18L26k31m90n19m06
$$ 728 241 -306 -742 -827 -531 6 527 867 682 164 -321 -787 -842 -394 133 551 877 646 156 -363 -769
1775g69k4M27M79M46L18k73n12m72m27jN28N03L92J72j64o39m41l26K8N14M88
$$ -769 -793 -366 113 559 877 604 92 -380 -807 -808 -280 223 615 787 623 -16 -457 -783 -755 -241 247
1796B47M01J02k13o08m56k21l0N93M84L50J47k65o74m49j14ON46N17L04M7k91
$$ 247 648 750 537 -71 -527 -748 -778 -185 299 649 796 531 -143 -592 -706 -700 -154 363 667 714 423
1817D23n84m31j66J70M53N70K50L7l24n98m01q7J19M77N40K70N9m22o28l57l1
$$ 423 -161 -592 -758 -588 -135 435 685 722 398 -200 -601 -688 -569 -92 448 718 777 355 -273 -630 -661
1838f61J03N30M75K35j6l17o37l69n2K12N19M88J16m3k98o57k90K5J42N33N33
$$ -661 -558 -28 447 682 666 349 -288 -657 -709 -497 22 510 626 583 285 -372 -662 -637 -495 38 571
1859E71R1j41l20n64l60J00K14N25M90J33k24l52n52k94N4K97M53N46rj99l65
$$ 571 662 521 201 -363 -723 -623 -409 116 606 739 515 163 -389 -683 -629 -332 121 667 658 459 94
1880I4n28k84J46K71M74M47Mk42l26m98k62J03L04M81M80L2l13l99m90k15J51
$$ 94 -434 -718 -572 -301 173 620 624 382 56 -442 -704 -601 -297 184 664 696 383 -16 -506 -721 -570
1901e70L59M86M05kl30m27m03j99J94K75N08L99n1l56l85m51j56K75K84M31L65
$$ -570 -211 275 680 678 348 -79 -482 -681 -487 -212 296 695 644 288 -97 -548 -704 -429 -145 286 651
1922F51L7m05m52l83j58L01L52L36M11q7l90l65m26j03K81L75L95K94o2m87l39
$$ 651 688 283 -169 -552 -710 -409 -57 279 690 603 213 -152 -578 -681 -400 -25 370 664 602 115 -224
1943b24l31j06L84M01K61K87q7m27l68l29j85M42M89K17K15o5m66l96k43o4K93
$$ -224 -555 -661 -277 124 385 672 585 158 -210 -539 -724 -282 207 424 639 574 108 -288 -531 -595 -302
1964c02M94K98J04n0m25m46k07p9L65M85K40R8j90l27m55j73j3L25M64K81M8j70
$$ -302 192 490 594 544 119 -327 -534 -613 -248 237 477 575 385 58 -397 -570 -583 -258 206 487 535 365
1986C65m06k97j87m9L83M72K69M8k86l55k90k46M3L59M70K60mk55m93k15j33L7
$$ 365 -41 -338 -525 -574 -191 281 550 598 312 -43 -333 -579 -536 -177 293 553 549 294 -199 -414 -547 -510
2008e10L53M43J88Q1k13n31l31K0Q4L78M16J41m3j85n01l49R3L6K98M38L09j22
$$ -510 -157 286 474 555 342 -189 -520 -500 -416 -38 378 519 476 291 -210 -559 -466 -430 -132 306 615 493
2030D93k54m70l13L2K31L66K87K61j83k25l91l71o2K84L82L22J77n5l66l91k64
$$ 493 239 -231 -544 -512 -281 85 372 633 450 225 -166 -537 -599 -315 67 389 566 511 145 -246 -510
2051e10OK53M22J75J29j4k63n04k34L3K53N02J67K3j41k34l67k17P7J78L51L82
$$ -510 -504 -251 171 346 475 461 198 -306 -540 -507 -254 248 415 438 297 63 -304 -521 -444 -266 85 467
2073D67N9j14l84m27k02J35L34L50K96k0k44k02l37k40J01K79M28K50Ol12l51
$$ 467 526 412 28 -399 -601 -466 -132 218 514 494 250 48 -289 -529 -428 -149 279 529 535 223 -128
2094a28j76j39M6L35L10K01N7j97m55k93p8J37K93L93J76q3k19l66k18j01K28
$$ -128 -304 -443 -397 -62 248 449 506 309 -146 -439 -517 -380 -87 306 482 399 180 -186 -404 -505 -277
2115b77J84L69L08j46k17l84k84J5J86K28L47J78r8k65k71k75j10K35K91K94K26
$$ -277 -93 276 584 438 221 -163 -447 -432 -246 -18 329 507 409 144 -127 -402 -512 -277 14 308 534
2136E34j27l49k68k06n1K61K86J26K36m2l34l61j48n2K19M31K21L2p7k87l23j34
$$ 534 407 58 -210 -416 -467 -206 80 206 442 400 66 -295 -443 -495 -276 155 376 408 331 44 -279 -413
2158d13LJ94K94L18J00j52k81l64j99P8K83L13K03K1j64k18k96k07Q0K74K98L05
$$ -413 -410 -216 78 396 496 344 63 -301 -500 -422 -139 174 377 398 234 16 -280 -487 -407 -133 165 470
2180D70Jk63k87k71j81J41L36K35K64Qk48l20k10j07L9L86K56J50J6j53l94k22
$$ 470 471 208 -79 -350 -531 -390 -54 181 445 453 205 -115 -325 -432 -393 -7 249 399 415 262 -132 -354
2202c54j4R4K36K96J47j8k01l55k02r3J86K61L28R7q6j62k81k55j00J75K90K49
$$ -354 -368 -274 -38 258 405 387 186 -169 -371 -464 -278 -17 311 408 322 160 -121 -376 -476 -301 -11 238
2224B38J79m6k84k56k80mK27K68K10J72r7k72k77j85n9J91L07K87J29j54k40l12
$$ 238 417 371 87 -169 -449 -453 -226 42 252 424 327 55 -222 -407 -466 -275 32 319 448 294 54 -258
2246b58o3n5J71L68K13j4m6k80l49p8O8J57K66K64M0j31k22l56o1K9K12K81J97
$$ -258 -321 -376 -205 163 376 362 316 36 -313 -391 -323 -166 100 364 404 273 51 -305 -366 -337 -125 156 353
2269C53Oj40k84j99j52J61J61K03K84l6j65k68k30j47Q5K88K19K27Oj96k93j92
$$ 353 359 219 -65 -264 -416 -255 -94 109 393 357 192 -76 -306 -453 -368 -80 139 366 372 176 -117 -309
2291c09n7M6L05K30J81J3k14k78j93j21J83K37J90J46kk05k32k72k9J37K60K27
$$ -309 -366 -320 -15 215 396 409 195 -83 -276 -397 -214 23 213 359 357 152 -80 -352 -381 -244 16 243
2313B43J06j6k56k22k26MJ31L19J12K02m4k88k41j93L1J10K53K01J54l5k71k67
$$ 243 349 333 77 -145 -371 -367 -236 83 195 397 353 65 -176 -369 -338 -228 25 226 380 345 74 -193
2335a93j46PJ65K74J99P2j15j71l52j34R4J55L13J14L8o0k56k24r7K6Q3L41K00
$$ -193 -339 -332 -167 107 306 378 263 92 -260 -394 -300 -145 168 282 320 260 4 -220 -317 -291 -208 133 333
2358C33%j42j90k91j54J10J50L40J75Lj45j97k70r4P4J89K41K06Jj71k37j42j11
$$ 333 333 191 1 -290 -444 -334 -184 156 331 334 189 -8 -278 -372 -298 -109 132 338 339 168 -69 -211 -322
2381c22J06J29K73J54j8j13k78k48NN6K43J90K00o2j71k65j80n3J22J74K35J31
$$ -322 -216 -87 186 340 322 209 -69 -317 -312 -256 -13 177 377 315 144 -121 -301 -354 -232 -58 177 308
2403C08l7k08j92j81qJ05K17K32J13m4k25j98k20M0J40K17K02O2l0j91k07k32
$$ 308 271 63 -129 -310 -318 -213 4 236 349 305 80 -118 -338 -298 -158 59 261 323 293 102 -105 -337
2425c37N2J68K09J66N7n7j68k62j33K4J81K51J34Ro6k29j88j94N9K29K20J81p
$$ -337 -285 -117 92 258 315 258 90 -172 -305 -281 -100 151 285 294 228 -1 -189 -383 -324 -95 125 306 299
2448B99j68j09k87r8J30J22J99J55P7j00l17j43n2k6K48K11J42L6j80k43o9j00
$$ 299 131 22 -265 -363 -233 -111 88 243 320 220 -97 -240 -292 -318 -70 141 283 319 139 -104 -173 -273
2470b73j3K96J67J30mj63k69r2j00J03J96K36N6m2o9k92o8j25P9K58J90P0o0j16
$$ -273 -286 10 177 307 303 140 -129 -221 -321 -218 -22 214 270 228 159 -133 -201 -326 -247 11 201 271 211 95
2494I5j96j74JP6J45K54O1j9j11k31j84j3J37K04J65O4j7j39k77r1qJ34J85J79
$$ 95 -101 -275 -274 -198 -53 201 262 243 132 -99 -283 -296 -159 45 210 274 257 118 -159 -250 -258 -124 61 240
2518B40L4J3k81j53j13LJ54J28J98M2jk29k40q3O5R0K40J01N7j33j05l20M9J8
$$ 240 274 287 6 -147 -260 -257 -103 25 223 265 264 35 -205 -288 -223 -133 107 208 265 132 27 -293 -244 -226
2542b26M7K01K55k7j47j30j92j32J42K05J64J34m3j38j58j00j21P5J13J75J74
$$ -226 -179 22 277 250 103 -27 -219 -351 -209 -4 160 294 251 113 -45 -145 -266 -191 -78 97 271
2563B71Nj11k21j68j1Q2R1K28O3J0j71j28j63j8M8J42K12Q7qj39j95j59K7J02
$$ 271 276 165 -56 -224 -235 -153 -62 166 229 239 68 -60 -223 -241 -193 -51 161 248 240 101 -94 -253 -226 -124
2587a24J34J59P1k2q2k28j34K9J22J10J83O7r9j01j65j60k8J60J43J36J52j41
$$ -124 10 169 240 218 136 -92 -226 -197 -75 35 218 285 186 85 -80 -240 -268 -108 35 171 323 182
2609A82j84q3j66J2J28J93J13k9J9j63j41j21lJ22K65Q8J4o1j72j78l4N8R9J28
$$ 182 -2 -85 -251 -239 -111 82 195 166 185 22 -119 -240 -243 -121 144 232 246 185 13 -165 -199 -141 -42 86
2633H6J50k0n4j20k02n7M6P6K43Q0Q1k00j45j29m2KJ37J42J59M8k22j31j54%L9
$$ 86 236 216 162 42 -160 -217 -171 -95 148 228 309 109 -36 -165 -207 -205 -68 74 233 281 59 -72 -226 -226 -187
2658a87J55J51L1L2j13j28j33j01J52J60J32J8K2p9k48n5j7Q3J03J73O2m4n4k31
$$ -187 -32 119 150 182 69 -59 -192 -293 -141 19 151 169 191 112 -136 -191 -208 -125 -22 151 213 169 115 -116
2682a16p5k5J21P3K15Q4j16j13j07j45L5O1J07J90Nk6j33j48j11m0J71J41J03
$$ -116 -191 -216 -95 -22 193 277 161 48 -59 -204 -169 -108 -1 189 194 168 35 -113 -224 -264 -93 48 151
2705A51O0k7k01p7j20j4J28Q7J53Q7j13r7j72Jl9J16J92P8l4n5m3j78o9j4R9K55
$$ 151 211 184 -17 -94 -214 -228 -100 -13 140 227 114 17 -155 -154 -193 -77 115 193 159 104 61 -117 -186 -200 -101 154
2731A54L3k6j7j79j24m5L4J18J44J09L8j13j47j19j19Q7K16K1J11K3j63o3j37
$$ 154 187 161 144 -35 -159 -204 -170 -52 92 201 239 126 -21 -140 -259 -172 44 65 176 199 36 -27 -164
2754a64k8O7Q7K07K3oj00j86l4n8N9J39Q2K4N6n7k10o3o6J01J71P8L8Oj38n6j90
$$ -164 -192 -125 -38 169 192 186 86 -100 -134 -192 -133 6 88 112 168 111 -99 -162 -228 -127 44 122 160 166 28 -28 -218
2781b18P3M1J28Q0J00l4j41j40j10K3O8K01O6N5n2q0j94k3m0J27J63P7L0n5r3
$$ -218 -145 -104 24 104 204 170 29 -111 -221 -198 -130 71 137 192 140 60 -134 -157 -197 -70 93 170 200 145 52
2806E2j30j29N5N1J46J68oj10j49m9j05nJ46J44Q5L4q1j20j02k8j8J23J14Q7L8
$$ 52 -78 -207 -152 -101 45 213 207 97 -52 -101 -206 -211 -65 79 164 198 117 -3 -105 -133 -151 -28 86 173 211
2831B11j48j25o6j11J10J44M9J43J3j08j49r8o0J5J74J23O2kj23o8j10k8L4J43
$$ 211 63 -62 -128 -239 -129 15 64 207 220 112 -37 -135 -195 -180 -6 117 179 177 54 -14 -124 -152 -118 25
2855B5Q6Q3j3j31q1j15n9J18P7J15P2k5r8j44j09O0%J42J49K3q4n3p4j20k6J08
$$ 25 111 194 181 50 -31 -146 -205 -87 -10 105 177 152 54 -90 -199 -139 -139 3 152 175 91 38 -36 -156 -182 -74
2881g4J06O9R3p8j74n8k1m3R0J22O4Q7l0j27p6j05J3J05J42K5L5m2j08j45m5K
$$ -74 32 101 194 116 -58 -116 -137 -180 -90 32 96 183 153 26 -50 -155 -142 -37 105 130 165 123 15 -130 -175 -173
2907a73J11J46L8M9q5p5j41j3PP7J27P8M5r5j45p0k8J3J16J14Q1l8q4r7q0l6L3
$$ -173 -62 84 122 171 86 11 -130 -143 -136 -59 68 146 191 96 -49 -119 -147 -134 -18 96 177 139 55 -42 -122 -158 -125
2934a25J15J19N4k8m2j48o3k2O6J6J71J4K8q9j33m8o1L5J03J59M0j2j02j57k2
$$ -125 -10 109 163 135 93 -55 -118 -140 -74 -58 113 127 155 66 -67 -115 -176 -141 -38 121 161 149 47 -110 -132
2959a32m4M7J43P7L5Rj68q9j9l1P2J23J13J3m1j07o7r6qJ12L3J76nn2j02r9j0
$$ -132 -176 -129 14 91 126 135 -33 -122 -141 -172 -100 23 136 149 108 1 -66 -162 -170 -58 -25 151 146 94 -8 -107 -117
2986a17m1Q2J33P0L3m4r5j61l3L6J15J32lL7n6j17p0m2K3P4P7Q6qJ4j56j18l3
$$ -117 -158 -76 57 127 160 116 21 -140 -173 -137 -22 110 107 144 88 -29 -99 -141 -118 -44 33 119 111 125 -31 -149 -182
3013a82O6P6O9J18po8r0p5k3O5QJ24J08qj71n3j40NN9Q8J08J07l7r9q5p0p8R5
$$ -182 -116 -40 29 147 140 72 -18 -93 -116 -51 -43 81 189 181 10 -43 -183 -178 -119 -31 77 184 147 48 -37 -107 -185 -90
3041i0N2J42J9Mq0n9r4j6l7J67J27m5N1j31r1o3JN9P0J80q5J9l7j15l3p9J66P
$$ -90 -38 104 123 127 47 -12 -106 -122 -159 8 135 90 141 10 -81 -144 -143 -84 -14 166 81 100 63 -52 -85 -164 2 9
3069IQ7O3o6p3p2m4rJ02M3R6mm3j16r3%p7J20J17M0N6m1j13q8l4J0O0J09J23o1
$$ 9 96 159 93 20 -52 -96 -105 -3 40 136 132 89 -27 -120 -120 -197 -77 40 80 136 95 -18 -106 -140 -130 -70 39 162 101
3098A01J3j24q1nn3J17J04R6o1m1k3j51k8Q2L4M9J43m4n8j52j4pM2M7Q1L0L8q7
$$ 101 114 -10 -91 -96 -149 -32 72 168 107 66 43 -108 -136 -54 -20 29 172 128 70 -82 -96 -103 -61 -14 67 97 135 48
3126D8p9j21qM1J13N7J9K0m0j52n0K8j9J63N0L3J6p0j29n4M1M7R5O3L1q9j7q5
$$ 48 -31 -152 -160 -119 -6 51 70 90 50 -102 -152 -124 -143 20 70 103 119 49 -80 -134 -93 -46 49 112 143 54 37 -48
3154d8n5JPJ05P9K7k1j03l3r9L5Q5L7Q3K2kj28j5q2o5J34J03L1J2p7m8o3j2l7
$$ -48 -103 -102 -95 10 89 116 95 -8 -41 -140 -105 -20 17 100 122 120 -8 -23 -105 -170 -36 67 98 110 33 -15 -78 -90 -127
3183a27M6J35M7K9j7j67l6rj2L5J54K8pk0o3o7o5M8P7J7J08m7l6o0j38K3M1Q6
$$ -127 -81 54 101 130 113 -54 -90 -99 -111 -76 78 106 99 79 16 -51 -116 -68 9 26 134 87 51 -9 -147 -124 -83 3
3211CQ2K7jj06kq5o1L8Q4P1N1J8q4n5p9JJ11%P1K5%q4n5n5NK3P5O8L9Ln8j48K8
$$ 3 85 112 111 5 3 -82 -143 -105 -21 50 101 119 35 -20 -99 -98 13 13 84 109 109 25 -30 -85 -80 -57 18 86 125 128 70 -78 -50
3244e0n3L0R0O8L8n2k7p4o8N8QN7N7l2O6p9j02m5j9O7M4O0O7l4o9m1p0O3j4J02
$$ -50 -103 -73 17 85 123 71 44 -30 -98 -40 -32 25 82 50 116 37 -65 -110 -129 -62 -18 42 109 75 6 -35 -105 -42 -56 46
3274D6K4K1l6j6p4p5J14n1R9P4%q5p7k0m2OJ18J9j0N2j8p6r1j0M2O1N5O7L1j09
$$ 46 70 91 55 39 -35 -110 4 -47 52 126 126 41 -36 -56 -98 -92 26 45 35 87 69 -7 -98 -108 -66 -5 50 117 148 39
3304C9q2l0o9R1O2N8K4k6m1o2m1m7N1N9R6M0j7j4p7o0J5l3J9J09P0r4l6l4l6L1
$$ 39 -43 -73 -142 -51 11 69 93 67 26 -36 -77 -124 -73 -14 82 122 105 91 14 -46 -31 -64 -45 64 134 40 4 -30 -66 -35
3334c5j1R5nO7j06m7K1q6mP4N1L9J8p2j3l7l6k8P5J01nRqr7J1p2J4Q0L9O7Jm2
$$ -35 -46 49 44 111 5 -42 -21 -107 -111 -37 14 53 71 -1 -14 -51 -87 -115 -40 61 56 65 57 -40 -29 -101 -87 -7 32 99 100 58
3366E8o3o4k4N3J4O0R7o8K4m2j17L8l9M4P1J8M8q8l9r6RK7L3M8Q4K5j32rn4n8
$$ 58 -5 -69 -93 -40 -26 34 131 63 87 45 -72 -34 -73 -29 42 60 108 20 -19 -115 -106 -79 -46 2 86 111 -21 -30 -84 -142
3396a42J19O1j6O4Pl2q2m5m0J6M5O8P4m6o5mn7PJ3J17j3n0Q6q6k1p8P3j4L5N2
$$ -142 -23 38 22 86 93 61 -21 -66 -106 -90 -45 23 97 51 -14 -18 -75 -68 -55 62 49 -1 85 -1 -22 -100 -27 -41 -6 46
3426D6NM1j26Lq8O4jJ9O2J6k7l5l8l4lM7N8J26p9M4n1q0o0MR0P2J0%J3q7l7n5
$$ 46 51 92 -34 -31 -119 -55 -56 -37 25 41 14 -21 -59 -93 -96 -49 9 135 56 100 49 -31 -91 -87 3 75 85 85 98 11 -26 -81
3458h1j7N0O2N8L8q5J7j03nl2N5M9J12n8k8r8L0m6L7N2K1O9j0m3o6k5m8K5N4N9
$$ -81 -98 -48 14 72 110 25 42 -61 -66 -98 -43 6 118 60 32 -66 -36 -82 -45 7 28 97 87 44 -22 -47 -95 -70 -16 43
3488D3N2k7Lo0m8N2m6M3K6N9K0o3r9K2nj0P3N1Mlm3n4p0l0K1Q7R2pL9p4j08m9
$$ 43 95 68 71 11 -37 15 -31 12 38 97 117 54 -45 -23 -28 -38 35 86 90 87 44 -10 -80 -110 -89 -2 90 83 122 48 -60 -109
3520a09L2P2oL5R9n0n8j02KK9L4O3N9pj9n4k9J0q4J00OK7j0N7p2m3k4l6O5N9K0
$$ -109 -77 -5 -11 24 123 73 15 -87 -85 -56 -22 41 100 93 74 20 -9 1 -83 17 23 50 40 97 25 -18 -42 -78 -13 46 66
3551F6L6k7j13J3o3jJ04rN5k7J4j18L4K9o4P3O1J9n8K0o5k0j4rN6M3N2m6Ml3n1
$$ 66 102 75 -38 -25 -88 -89 15 6 61 34 48 -70 -36 -7 -71 2 63 82 24 44 -21 -41 -55 -64 -8 35 87 41 45 12 -39
3582c9J4mN8nJ15n4p7l8j3l2M3J4P8j8K1p2k6%l4L1M5N1k6Nm7j02M5J6J8M6M3
$$ -39 -25 -29 29 24 139 85 8 -30 -43 -75 -32 -18 60 42 63 -9 -35 -35 -69 -38 7 58 32 37 -10 -112 -67 -51 -33 13 56
3613E6K2Lq4k6mj4j3P2R1l8Jk6o5p4N7l5Q3L5rl1n6k4l7R0K8j3K2K2J7q9j9m8
$$ 56 78 81 -3 -29 -33 -47 -60 12 103 65 66 40 -25 -99 -42 -77 6 41 32 1 -55 -79 -116 -26 2 -11 11 33 50 -39 -58 -106
3645a06J9N6N7M7J6l6m8q8P0p6P1K1L8OJ7j1q0%j4P5rN3jk5m5n4l4N4j1J14K4
$$ -106 -87 -31 26 73 89 53 5 -83 -13 -89 -18 3 41 47 64 53 -27 -27 -41 34 25 78 77 52 7 -47 -81 -27 -38 76 100
3676A00l1n6o4j5k7Q5j3Q1m2M1Lj28j0k0M1L7M5L4J9o7n5k0JM1K3Q0j3k4k3p5
$$ 100 69 13 -51 -66 -93 -8 -21 60 18 59 62 -66 -76 -96 -55 -18 27 61 80 13 -42 -62 -61 -20 3 83 70 46 23 -52
3706e2j6L2K6M2L5J6l0o2o0J3j0O4MK9M2L1p0j18kK0j2O7L6K3k4l7p7K2L7L0o
$$ -52 -68 -36 -10 32 67 83 53 -9 -69 -56 -66 -2 2 31 73 104 34 -84 -86 -66 -78 -11 25 48 24 -13 -90 -68 -31 -1 -7
3737gR2l1m3Lo3k5L0M8P3L3j7l4o0k0j7k1K8O4O2p0rp4J6Ql3M0K0N8ml3l3j06
$$ -7 85 54 11 14 -49 -74 -44 4 77 110 93 59 -1 -21 -38 -59 -31 33 95 25 16 -58 -42 -34 -67 -27 -7 51 47 14 -19 -125
3769a25O6O0lnL9j3Qn8k8j2J9Q4oJ5l9N4p0p7M9L1j1O5J6J9m6j1n0J5mL5N0J5
$$ -125 -59 1 -2 -7 32 19 27 -31 -59 -71 -52 32 26 41 2 56 -14 -91 -42 -11 -22 43 59 78 32 21 -29 -14 -18 17 67 82
3801H2J6j30J6k2pK7K7RK2J4o9J2m8K8L8l0O3n5K9n8L0l4JP0K9qK0Qr4l9L3RL
$$ 82 98 -32 -16 -38 -45 -18 9 18 40 54 -15 -3 -51 -23 15 -15 48 -7 22 -36 -6 -40 -39 31 60 52 72 80 -14 -53 -20 -11 -8
3834h%P9L3o5p5J1l8L5N4k7L5Omm3j0%k1K0N2j9J7Pn9J6o3J0P7j1N7K9j41L0j6
$$ -8 -8 71 104 39 -36 -25 -63 -28 26 -1 34 40 36 -7 -17 -17 -38 -18 34 15 32 39 -20 -4 -67 -57 20 9 66 95 -46 -16 -32
3867c2m3J01qj4K7M0k8j15K7K5l9O9MO4J6p8l1l9K3j3P8j1M0l5j3n4l2K5%O7j6
$$ -32 -75 26 18 4 31 71 43 -72 -45 -20 -59 10 14 78 94 16 -15 -54 -31 -44 34 23 63 28 15 -39 -71 -46 -46 21 5
3898EL5j0Or8M3rpJ5Q2N9j38l7mJL3l0J00kMpqn9j7j3P6N0j5l1N4m8rj7n1Q1j1
$$ 5 40 30 36 -62 -19 -28 -35 -20 62 121 -17 -54 -58 -57 -24 -54 46 44 48 41 33 -26 -43 -56 20 70 55 24 78 30 21 4 -47 34 23
3933B3O3Km7k3j3r3N1J7N4J3jm3k3r1J03l8P2rK7Nk5l0l7j1L4L3J4L8k7k4K1l4
$$ 23 86 88 41 18 5 -88 -37 -20 34 47 46 3 -20 -111 -8 -46 26 17 44 49 24 -6 -43 -54 -20 13 27 65 38 14 35 1
3965Am5l1L4M5J15n7n6L4j03J1M7QRK0j2Oj4q4O2OoN5Op1%j5o9L4J4Q9qM1ol1
$$ 1 -44 -75 -41 4 119 62 6 40 -63 -52 -5 3 12 32 20 26 12 -72 -10 -4 -10 45 51 -20 -20 -35 -104 -70 -56 33 25 66 60 29
3999B9l9k3l2M2N4L7%l3k3m5l8K6J22n8j1O5m2k0Rn6p5J04O3m0K5l3j7On7PK9
$$ 29 -10 -33 -65 -23 31 68 68 35 12 -33 -71 -45 77 19 8 73 31 11 20 -36 -111 -7 56 16 41 8 -9 -3 -60 -53 -24
4030b4L1N5k2o1lJ1j5MM2L8L2J2q0j4l7PkL3j1L1Qmn3k6N0j1L3J5K8o8k7%J3l6
$$ -24 7 62 40 -21 -24 -13 -28 -24 18 56 88 100 20 6 -31 -24 -26 7 -4 27 35 31 -22 -48 2 -9 24 39 67 -1 -28 -28 -15 -51
4064e1K7M8j1M7j5m7m4K1m6J5M7M7j9L3m3l3l2P%J8Q2Ko0L7l4n5O7k5J5N1K2k3
$$ -51 -24 24 13 60 45 -2 -46 -25 -71 -56 -9 38 19 52 9 -24 -56 -49 -49 -31 51 53 -7 30 -4 -59 8 -17 -2 49 71 48
4096D8n7rj8J9pK5L9j4k0J0n7L1k2J5N8k8K4k1m0ol2QK3L8OL1j7J1p4Pk9P9M1
$$ 48 -9 -18 -36 -17 -24 1 40 26 6 16 -41 -10 -32 -17 41 13 37 16 -24 -30 -62 -54 -31 7 13 44 27 38 -36 -29 -58 21 62
4129F2oRm4m0L6on7N1k2M8pj1op2MN2j5M2K3k6J5k9j4k0jN3K0J6m7Pn0jqP0L8
$$ 62 56 65 21 -19 17 11 -46 5 -17 31 24 13 7 -65 -61 -9 -24 18 41 15 30 1 -13 -33 -34 19 39 55 8 15 -35 -36 -44 26 64
4164F4l7l6M8pn7K3k1j6J1Q4L3p7JK6q3N1rK1L6o6N8m3k8K8k7Om7J9Q0l1l6M5
$$ 64 27 -9 39 32 -25 -2 -23 -39 -28 56 89 12 13 39 -44 7 -2 19 55 -11 47 4 -24 4 -23 -17 -64 -45 35 4 -32 13
4196A3p1O1k9K7M3l1oj9kj5j3L0RL0rN5p0k8OpJM7K1K4n4JK0n8J4k5J6R4l2Kn7
$$ 13 -58 3 -26 1 44 13 7 -12 -14 -29 -42 -12 -3 27 18 73 3 -25 -19 -26 -25 22 43 67 13 14 34 -24 -10 -35 -19 75 43 45 -12
4231a2k7m7O9M8jk9j9J5Rj3m5M1lJ1K2M9n5J6k3No2K6O4orj3m3L7j1qM8rrM5k8
$$ -12 -39 -86 -17 31 30 1 -18 -3 6 -7 -52 -11 -14 -3 19 68 13 29 6 11 -51 -25 39 33 24 11 -32 5 -6 -14 34 25 16 61 33
4266C3m3n4K9L5j0M8M6rq4K4j51O8J4N5L8k8L7j30M9Nj4l5Q1K6m7K8om9Km8J14
$$ 33 -10 -64 -35 0 -10 38 84 75 -9 15 -136 -68 -54 1 39 11 48 -82 -33 -28 -42 -77 4 30 -17 11 5 -44 -42 -90 24
4297B4MPJ4K4m1K5j02M5L6j6L8m6K6j2m8oj3K7M6l6N9jr9N5k1n1J7M2J1N6o8n9
$$ 24 28 35 49 73 32 57 -45 0 36 20 58 12 38 26 -22 -28 -41 -14 32 -4 55 54 -45 10 -11 -62 -45 -3 8 64 -4 -63
4329f3O6l7J2J7K2j6kL2p8J2K0M5j9j4L0K6J1n9j5Mm4J27m8K3o6K2nl9j1J4k7
$$ -63 3 -34 -22 -5 17 1 -1 31 -47 -35 -15 30 11 -3 27 53 64 5 -10 -6 -50 77 29 52 -14 8 3 -36 -47 -33 -60
4360f0P4ll7k1MRj9L7J0PJ3lm8J2q0M1M6M2JJ4n3J1n9K7Q%M6M4j0m2L7o4j8J7
$$ -60 14 11 -26 -47 -43 -34 -53 -16 -6 1 14 11 -37 -25 -105 -64 -18 24 25 39 -14 -3 -62 -35 -27 -27 19 63 53 11 48 -16 -34 -17
4394a7K8J6J6K5nk9n7Om7N7K3PM9q1J0l7l9L6J7N3L0o3O2n2n5J9JK7k8K0J0L1
$$ -17 11 27 43 68 63 34 -23 -17 -64 -7 16 23 72 -9 1 -36 -75 -39 -22 31 61 -2 60 8 -47 -28 -27 0 -28 -8 2 33
4426C3k1n7M3J2K5J8nj8J9q4k0ON1k3M8jL0o5K0q0L9jj0L4%Qk0kll2K1QN9j8K7
$$ 33 12 -45 -2 10 35 53 48 30 49 -35 -55 -49 2 -21 27 26 56 -9 11 -69 -30 -31 -41 -7 -7 1 -19 -21 -24 -56 -35 -27 32 14 41
4461D1q9K0k7J4Q3km8RN8k8m0L4l5l2J3R5o0Rm7O8n3J2j8K5J5J1n7Rj3k9L5kM5
$$ 41 -48 -28 -55 -41 42 40 -8 1 59 31 -9 25 -10 -42 -29 66 6 15 -32 36 -17 -5 -23 2 17 28 -29 -20 -33 -62 -27 -29 16
4494A6K9J1m0n5m7N2Kk5M5OK4L5m0l8k1M5j2J2L5J0p0N6n7l1M8M8KJ8k8jp4L1
$$ 16 45 56 16 -39 -86 -34 -32 -57 -12 -6 18 53 13 -25 -46 -1 -13 -1 34 44 -26 30 -27 -58 -10 38 40 58 30 29 -45 -14
4526a4kL3kk6nN0j3l0j7J7m2N2l6J1K6Lk5m1K9m2M7L1L5Qo1J9k2kj5J8O0n3J2
$$ -14 -16 17 15 -11 -16 34 21 -9 -26 -9 -51 1 -35 -24 2 5 -20 -61 -32 -74 -27 4 39 47 -14 5 -17 -19 -34 -16 44 -9 3
4559CL2q0N8l5O2k6J3N7l2l8ok7m8Q4pL7o5mL3Ll7K1m5O3j2L2l0K9o2j1jJ5M9
$$ 3 35 -45 13 -22 40 14 27 84 52 14 8 -19 -67 17 10 47 -18 -22 11 14 -23 -2 -47 16 4 36 6 35 -27 -38 -39 -24 25
4592B5K0k1N5q7%J9L9o8N9K2j1rn1l6PL8o0P6K5Kk2j1K4r9L7R5p2M4j01Q8o3K3
$$ 25 45 24 79 -8 -8 11 50 -18 41 63 52 43 -8 -44 -37 1 -59 17 42 44 22 11 35 -64 -27 68 -4 40 -61 27 -36 -13
4624a3p1L4J2M2kK9o7K6NJ7lK7j3jj6pl1J4m6jP1L0O5l5%m5p1J6J9L8k5O6n3j9
$$ -13 -84 -50 -38 4 2 31 -36 -10 -5 12 9 36 23 22 6 -1 -32 -18 -64 -65 6 36 101 66 66 21 -50 -34 -15 23 -2 64 11 -8
4658hL0m4M1j9QL5J2n0n0J0k1JN7L9J4k4n3K2l8KOm5J35l2Lpm5lMj5M2LKJ3Qj3
$$ -8 22 -22 19 0 8 43 55 5 -45 -35 -56 -55 2 41 55 31 -22 0 -38 -36 -30 -75 60 28 31 24 -21 -24 -20 -35 7 10 12 25 33 20
4694B0On5K3L3jn6O7n2j9j6Kn6J19m8N0K3l5o1N5l8K1J7PK5m2j6M7m8k1M0J9j9
$$ 20 26 -29 -6 27 26 -30 37 -15 -34 -50 -48 -104 15 -33 17 40 5 -56 -1 -39 -18 -1 6 31 -11 -27 20 -28 -49 -9 10 -9
4726ik2J7kRQk8M3N7n3Q3o1n0Pl4J4%K0N9p5j1J0L0q2L4PK2J1K5Np0l9M5K1L4
$$ -9 -31 -14 -16 -7 1 -27 16 73 20 103 42 -8 -1 -35 -21 -21 -1 58 -17 -28 -18 12 -70 -36 -29 -7 4 29 34 -36 -75 -30 -9 25
4760B5q6M4Q6l8j7n2PMJ1J8L2j6lpj8n6R4j14O2J14j04L5l8oJ1m4L9M5l5L2j2
$$ 25 -61 -17 69 31 14 -38 -31 -27 -16 2 34 18 15 8 -10 -66 28 -86 -24 90 -14 21 -17 -23 -12 -56 -17 28 -7 25 13
4791A3r4L2M4j9K0L8p0Q3p3L7on2K6j2O0j5%l0L5l5j7j9L9N5pJ6o6J3J9l6m6J01
$$ 13 -81 -49 -5 -24 -4 34 -36 47 -26 11 5 -47 -21 -33 27 12 12 -18 17 -18 -35 -54 -15 40 33 49 -17 -4 15 -21 -67 34
4823C4k1J6K3Op6Kl0N9L8o0PJ7N7n5q8M8m2Q6m5K0k8k6K4Pk2M0M3K3m4K9l4J7
$$ 34 13 29 52 58 -18 -16 -46 13 51 -9 -2 15 72 17 -71 -23 -65 21 -24 -4 -32 -58 -34 -27 -49 -9 34 57 13 42 8 25
4855B5o4M6j8L0J8N1j02J8m4K4J0j09Q5Q7n8L1j1o6nK6K4PK2L1o2no9N4k0J0N
$$ 25 -39 7 -11 19 37 88 -14 4 -40 -16 -6 -115 -30 57 -1 30 19 -47 -52 -26 -2 5 27 58 -4 -9 -78 -24 -44 -34 -29
4886b9N5no2P1q0L0l4O4J6%j9L9np8OJ8J9PKL6m2o5L6nO2m1J7J1oj3k9J1k8nJ9
$$ -29 26 21 -41 30 -50 -20 -54 10 26 26 7 46 41 -37 -31 -13 6 13 15 51 9 -56 -20 -25 37 -4 13 24 18 5 -24 -13 -41 -46 -27
4921b7M7p9Q2l0pk6ojQ4m2J4j%p7L6M8l4P2Moql2Pk6k9P5K7l0L9o5k1M2n1mK7
$$ -27 20 -59 23 -7 -14 -40 -46 -47 37 -5 9 8 8 -69 -33 15 -19 53 57 51 43 11 18 -8 -37 38 65 35 74 9 -12 30 -21 -25 2
4956Bj2K0O3j5r8J4L9m9J9RJ4j1j9Llj0j4jR5m3RJ5j2j3m5J6J2J2O2l2L7o5%J
$$ 2 -10 10 73 58 -40 -26 13 -36 -17 -8 6 -5 -24 -21 -24 -34 -48 -49 46 3 12 27 15 2 -43 -27 -15 -3 59 27 64 -1 -1 0
4990@l7l6Q8K5j4j7K8l0j9K0j5l1O1M7n4L8j03L1l8R7nl7k7J3o5QO1j1M3k5K4
$$ 0 -37 -73 15 40 26 9 37 7 -12 8 -7 -38 23 70 16 54 -49 -18 -56 41 36 -1 -28 -15 -80 -72 -11 -22 21 -4 20
5021B0m6J8m7mO4j0L2l0M3j7rj4n8jK0P6m4J21r3l6nj4J2P8q2M8m2M5l7j7pn1
$$ 20 -26 -8 -55 -59 5 -5 27 -3 40 23 14 0 -58 -59 -39 37 -7 114 21 -15 -20 -34 -22 56 -26 22 -20 25 -12 -29 -36 -87
$$ [...]
8191d5
##END NTUPLES=NMR FID
##END=
