##TITLE=1H_DE-20H2M_HCl
 D2O
 48 sc, 
 3.11.2023
##JCAMPDX= 6.0         $$ Bruker NMR JCAMP-DX V2.0
##DATA TYPE= NMR FID
##DATA CLASS= NTUPLES
##ORIGIN= UXNMR, Bruker Analytische Messtechnik GmbH
##OWNER= root
$$ XWIN-NMR		Version 3.5
$$ Fri Nov  3 14:28:52 2023 Russian Standard Time (UT+4h)  she@DPX200
##.OBSERVE FREQUENCY= 200.1313
##.OBSERVE NUCLEUS= ^1H
##.DELAY= (6, 6)
##.ACQUISITION MODE= SIMULTANEOUS
##.ACQUISITION SCHEME= undefined
##.AVERAGES= 48
##.DIGITISER RES= 18
##SPECTROMETER/DATA SYSTEM= spect
##.PULSE SEQUENCE= zg30
##.SOLVENT NAME= D2O
##.SHIFT REFERENCE= (INTERNAL, D2O, 0, 15.7039)
##AUDIT TRAIL= $$ (NUMBER, WHEN, WHO, WHERE, WHAT)
$$ ##TITLE= Audit trail, XWIN-NMR		Version 3.5
$$ ##JCAMPDX= 5.01
$$ ##ORIGIN= Bruker BioSpin GmbH
$$ ##OWNER= she
$$ F:/spectra/data/she/nmr/H-F/1/audita.txt
$$ ##AUDIT TRAIL=  $$ (NUMBER, WHEN, WHO, WHERE, WHAT)
(   1,<2023-11-03 14:23:56.82 +0400>,<she>,<DPX200>,
      <continue with go, POWCHK disabled, PULCHK disabled
       configuration hash MD5:
       00 E9 B6 7A A2 85 ED C7 34 08 36 98 17 FE 4E 26
       data hash MD5: 16K
       64 79 F5 3F 6F 4A 8A AA 52 35 60 E6 5E 6B 83 40>)
$$ ##END=
$$ 
$$ hash MD5
$$ 1D D4 98 72 83 CA E0 E1 B0 49 4E 79 7C 48 20 42
##$RELAX= 
##$RELAX= 
##$RELAX= 
##$RELAX= 
##$RELAX= 
##$RELAX= 
$$ Bruker specific parameters
$$ --------------------------
##$DU= <F:/spectra>
##$EXPNO= 1
##$NAME= <H-F>
##$PROCNO= 1
##$TYPE= <nmr>
##$USER= <she>
##$AMP= (0..31)
100 100 100 100 100 100 100 100 100 100 100 100 100 100 100 100 100 100 
100 100 100 100 100 100 100 100 100 100 100 100 100 100 
##$AQSEQ= 0
##$AQ_mod= 1
##$AUNM= <au_zg>
##$AUTOPOS= <>
##$BF1= 200.13
##$BF2= 200.13
##$BF3= 200.13
##$BF4= 200.13
##$BF5= 200.13
##$BF6= 200.13
##$BF7= 200.13
##$BF8= 200.13
##$BYTORDA= 1
##$CFDGTYP= 0
##$CFRGTYP= 5
##$CHEMSTR= <none>
##$CNST= (0..31)
1 1 145 1 1 1 1 1 1 1 1 1 1 1 1 1 1 1 1 1 1 1 1 1 1 1 1 1 1 1 1 1 
##$CPDPRG= <>
##$CPDPRG1= <>
##$CPDPRG2= <>
##$CPDPRG3= <>
##$CPDPRG4= <mlev>
##$CPDPRG5= <mlev>
##$CPDPRG6= <mlev>
##$CPDPRG7= <mlev>
##$CPDPRG8= <mlev>
##$CPDPRGB= <>
##$CPDPRGT= <>
##$D= (0..31)
0 1.2 0 0 0 0 0 0 0 0.06 0 0.03 0 0 0 0 0.0002 0 0 0 0 0 0 0 0 0 0 0 0 
0 0 0 
##$DATE= 1699006838
##$DBL= (0..7)
120 120 120 120 120 120 120 120 
##$DBP= (0..7)
150 150 150 150 150 150 150 150 
##$DBP07= 0
##$DBPNAM0= <>
##$DBPNAM1= <>
##$DBPNAM2= <>
##$DBPNAM3= <>
##$DBPNAM4= <>
##$DBPNAM5= <>
##$DBPNAM6= <>
##$DBPNAM7= <>
##$DBPOAL= (0..7)
0.5 0.5 0.5 0.5 0.5 0.5 0.5 0.5 
##$DBPOFFS= (0..7)
0 0 0 0 0 0 0 0 
##$DE= 6
##$DECBNUC= <off>
##$DECIM= 32
##$DECNUC= <off>
##$DECSTAT= 4
##$DIGMOD= 1
##$DIGTYP= 9
##$DL= (0..7)
0 120 120 120 120 120 120 120 
##$DP= (0..7)
150 150 150 150 150 150 150 150 
##$DP07= 0
##$DPNAME0= <>
##$DPNAME1= <>
##$DPNAME2= <>
##$DPNAME3= <>
##$DPNAME4= <>
##$DPNAME5= <>
##$DPNAME6= <>
##$DPNAME7= <>
##$DPOAL= (0..7)
0.5 0.5 0.5 0.5 0.5 0.5 0.5 0.5 
##$DPOFFS= (0..7)
0 0 0 0 0 0 0 0 
##$DQDMODE= 0
##$DR= 18
##$DS= 0
##$DSLIST= <SSSSSSSSSSSSSSS>
$$ [...]
##$SUBNAM2= <"">
##$SUBNAM3= <"">
##$SUBNAM4= <"">
##$SUBNAM5= <"">
##$SUBNAM6= <"">
##$SUBNAM7= <"">
##$SUBNAM8= <"">
##$SUBNAM9= <"">
##$SW= 18.0517328524113
##$SWIBOX= (0..15)
0 0 2 0 0 0 0 0 0 0 0 0 0 0 0 0 
##$SW_h= 3612.71676300578
##$TD= 16384
##$TD0= 1
##$TE= 0
##$TE2= 300
##$TE3= 300
##$TEG= 300
##$TL= (0..7)
0 120 120 120 120 120 120 120 
##$TP= (0..7)
150 150 150 150 150 150 150 150 
##$TP07= 0
##$TPNAME0= <>
##$TPNAME1= <>
##$TPNAME2= <>
##$TPNAME3= <>
##$TPNAME4= <>
##$TPNAME5= <>
##$TPNAME6= <>
##$TPNAME7= <>
##$TPOAL= (0..7)
0.5 0.5 0.5 0.5 0.5 0.5 0.5 0.5 
##$TPOFFS= (0..7)
0 0 0 0 0 0 0 0 
##$TUNHIN= 0
##$TUNHOUT= 0
##$TUNXOUT= 0
##$USERA1= <user>
##$USERA2= <user>
##$USERA3= <user>
##$USERA4= <user>
##$USERA5= <user>
##$V9= 5
##$VALIST= <valist>
##$VCLIST= <CCCCCCCCCCCCCCC>
##$VD= 0
##$VDLIST= <DDDDDDDDDDDDDDD>
##$VPLIST= <PPPPPPPPPPPPPPP>
##$VTLIST= <TTTTTTTTTTTTTTT>
##$WBST= 1024
##$WBSW= 4
##$XGAIN= (0..3)
0 0 0 0 
##$XL= 0
##$YL= 0
##$YMAX_a= 2677283
##$YMIN_a= -2687167
##$ZGOPTNS= <>
##$ZL1= 120
##$ZL2= 120
##$ZL3= 120
##$ZL4= 120
##$ABSF1= 10
##$ABSF2= 0
##$ABSG= 5
##$ABSL= 3
##$ALPHA= 0
##$AQORDER= 0
##$ASSFAC= 0
##$ASSFACI= 0
##$ASSFACX= 0
##$ASSWID= 0
##$AUNMP= <proc_1d>
##$AZFE= 0.1
##$AZFW= 0.1
##$BCFW= 1
##$BC_mod= 2
##$BYTORDP= 1
##$COROFFS= 0
##$CY= 11.3945322036743
##$DATMOD= 1
##$DC= 2
##$DFILT= <>
##$DTYPP= 0
##$F1P= 15.7292609196834
##$F2P= 12.9074282941183
##$FCOR= 0.5
##$FTSIZE= 0
##$FT_mod= 4
##$GAMMA= 1
##$GB= 0.15
##$INTBC= 1
##$INTSCL= 1
##$ISEN= 128
##$LB= 0.24
##$LEV0= 0
##$LPBIN= 0
##$MAXI= 10000
##$MC2= 0
##$MEAN= 0
##$ME_mod= 0
##$MI= 1.114404
##$NCOEF= 0
##$NC_proc= 0
##$NLEV= 6
##$NOISF1= 3.799351
##$NOISF2= 2.8
##$NSP= 1
##$NTH_PI= 0
##$NZP= 0
##$OFFSET= 15.70392
##$PC= 1
##$PHC0= -23877.12
##$PHC1= 8.852692
##$PH_mod= 1
##$PKNL= yes
##$PPARMOD= 0
##$PSCAL= 0
##$PSIGN= 0
##$REVERSE= no
##$SF= 200.130013532006
##$SI= 16384
##$SIGF1= 3
##$SIGF2= 2
##$SINO= 400
##$SIOLD= 16384
##$SREGLST= <1H.CDCl3>
##$SSB= 0
##$STSI= 0
##$STSR= 0
##$SW_p= 3612.71676300578
##$SYMM= 0
##$S_DEV= 0
##$TDeff= 0
##$TDoff= 0
##$TI= <>
##$TILT= no
##$TM1= 0
##$TM2= 0
##$TOPLEV= 0
##$USERP1= <user>
##$USERP2= <user>
##$USERP3= <user>
##$USERP4= <user>
##$USERP5= <user>
##$WDW= 1
##$XDIM= 8192
##$YMAX_p= 0
##$YMIN_p= 0
$$ End of Bruker specific parameters
$$ ---------------------------------
##NTUPLES= NMR FID
##VAR_NAME=  TIME,          FID/REAL,        FID/IMAG
##SYMBOL=    X,             R,               I
##VAR_TYPE=  INDEPENDENT,   DEPENDENT,       DEPENDENT
##VAR_FORM=  AFFN,          ASDF,            ASDF
##VAR_DIM=   8192,          8192,            8192
##UNITS=     SECONDS,       ARBITRARY UNITS, ARBITRARY UNITS
##FACTOR=    0.0002768,     1,               1
##FIRST=     0,             0,               0
##LAST=      2.2672688,     0,               0
##MIN=       0,             -2687167,        0
##MAX=       2.2672688,     2677283,         0
$$ Real data points
##PAGE= N=1
##DATA TABLE= (X++(R..R)), XYDATA
$$ plain form
0 0 0 0 0 0 0 0 0 0 0 0 0 0 0 -48 18 -48 48 -48 76 -76 96 -96 144 -154 192 -218 240 -288 336 -371 432 -490
32 -490 553 -639 699 -796 890 -997 1120 -1240 1388 -1532 1699 -1890 2077 -2306 2535 -2799
48 -2799 3085 -3395 3745 -4117 4547 -5023 5545 -6162 6835 -7633 8566 -9657 11004 -12649
62 -12649 14773 -17588 21516 -27441 37308 -56958 111626 -611947 -2396515 -2687167 -2344003
73 -2344003 -1134318 509016 1971442 2614930 2506529 1466609 -114321 -1602560 -2499564
82 -2499564 -2606287 -1721839 -264218 1232309 2317064 2610037 1933926 644770 -858704
91 -858704 -2085435 -2549756 -2110493 -990193 516821 1825350 2420423 2209450 1282818
100 1282818 -147518 -1494916 -2271449 -2300549 -1529149 -189997 1158621 2101656 2339591
$$ packed form
0@%%%%%%%%%%%%%m8O6o6R6r6J24j52J72j92K40k98L46m10M58n28O24p07Q03r22
32d90J043j192J338j495J686j887K117k360K628k920L231l589L967m383M841n334
48b799N884o480P140p862Q664r570J0568j1707J2997j4468J6199j8223K0661k3653
62a2649K7422l2361L9104m8957O4749r4266J68584p23573j784568k90652L43164
73b344003J209685J643334J462426O43488j08401j039920j580930j488239q97004
82b499564j06723Q84448J457621J496527J084755K92973o76111j289156j503474
91h58704j226731m64321M39263J120300J507014J308529N95073k10973r26632
100A282818j430336j347398p76533k9100P71400J339152J348618R43035K37935
$$ plain form
109 2339591 1715714 505411 -824141 -1903276 -2304179 -1844835 -809033 477762 1665575
118 1665575 2223504 1960143 1093714 -164873 -1414375 -2087006 -2025448 -1340097 -142889
127 -142889 1126003 1924525 2078637 1546875 419275 -829844 -1733987 -2078752 -1692492
136 -1692492 -674233 522133 1514588 2020159 1792947 933253 -204361 -1292081 -1939183
145 -1939183 -1865859 -1161153 -84563 1049885 1798509 1891733 1362232 355240 -795552
154 -795552 -1628537 -1889072 -1519675 -597996 523769 1426584 1854798 1637969 820070 -245002
164 -245002 -1207159 -1784890 -1716066 -1027634 -29491 985696 1683646 1748827 1205587 286087
174 286087 -758278 -1541231 -1740885 -1358306 -527998 519349 1366277 1708452 1485558 743701
$$ packed form
109B339591o23877j210303j329552j079135m00903M59344J035802J286795J187813
118A665575N57929k63361q66429j258587j249502o72631O1558O85351J197208
127a42889J268892P98522J54112n31762j127600j249119r04143l44765L86260
136a692492J018259J196366R92455N05571k27212q59694j137614j087720o47102
145a939183P3324P04706J076590J134448P48624R3224n29501j006992j150792
154g95552q32985k60535L69397R21679J121765R02815M28214k16829q17899j065072
164b45002r62157n77731O8824O88432R98143J015187O97950O5181n43240r19500
174B86087j044365p82953j99654L82579Q30308J047347Q46928L42175k22894p41857
$$ plain form
184 743701 -279955 -1172537 -1646346 -1571805 -932433 35090 958153 1558926 1623751 1099102
194 1099102 205106 -743077 -1446374 -1632499 -1235535 -433106 517702 1298917 1607060 1357223
204 1357223 650149 -293927 -1131333 -1553861 -1445819 -837243 76114 944673 1474006 1504723
214 1504723 1001643 144319 -738671 -1370805 -1532776 -1140559 -357212 527853 1243134 1522507
224 1522507 1251001 561938 -313913 -1096985 -1481445 -1338642 -750660 102026 930551 1412659
234 1412659 1400112 916426 101867 -746885 -1313836 -1433022 -1059742 -303973 548182 1195981
244 1195981 1438812 1175291 494112 -344530 -1059781 -1411760 -1261770 -671862 138524 904542
254 904542 1355978 1324659 835531 62328 -735987 -1272152 -1358491 -977255 -257273 552951
$$ packed form
184G43701j023656q92582m73809P4541O39372R67523R23063O00773O4825n24649
194A099102q93996r48183p03297j86125L96964Q02429R50808P81215L08143k49837
204A357223p07074r44076q37406m22528J08042O08576R13357Q68559N29333L0717
214A504723n03080q57324q82990o32134j61971L92217P83347Q85065P15281K79373
224A522507k71506o89063q75851p83072l84460J42803N87982Q52686Q28525M82108
234A412659j2547m83686q14559q48752n66951j19186L73280P55769Q52155O47799
244A195981K42831k63521o81179q38642p15251l51979J49990N89908Q10386P66018
254I04542M51436l1319m89128p73203p98315n36165q6339L81236P19982Q10224
$$ plain form
264 552951 1162303 1365300 1095660 442487 -362677 -1032973 -1346580 -1189564 -613963 167538
274 167538 885879 1297840 1252820 769250 26127 -726086 -1224399 -1289595 -907663 -215366
284 -215366 555285 1128541 1300522 1024143 394347 -373902 -1006766 -1284407 -1117693 -560386
294 -560386 190733 869051 1243317 1185229 711021 -6774 -716648 -1177148 -1226818 -845801
304 -845801 -173362 555075 1087912 1240746 959664 347497 -383422 -978532 -1228268 -1051436
314 -1051436 -510764 208404 851312 1192281 1118345 657405 -31545 -705853 -1132123 -1163939
324 -1163939 -788864 -139864 553558 1049659 1181091 899923 306110 -390304 -947632 -1172869
334 -1172869 -990682 -463844 223224 828824 1142994 1057031 604754 -55033 -694126 -1088980
$$ packed form
264E52951O09352K02997k69640o53173q05164o70296l13607J57016N75601P81501
274A67538P18341M11961m5020m83570p43123p52213m98313o5196L81932O92297
284b15366P70651N73256J71981k76379o29796p68249o32864k77641J66714N57307
294e60386P51119O78318L74266n8088m74208p17795p09874m60500m9670L81017
304h45801O72439P28437N32837J52834k81082o12167p30919n95110k49736J76832
314a051436N40672P19168O42908L40969p3936m60940o88950o74308m26270l1816
324a163939L75075O49000O93422M96101J31432k81168n93813o96414n57328k25237
334a172869J82187N26838O87068O05600L14170q5963m52277o59787o39093l94854
$$ plain form
344 -1088980 -1103614 -733620 -110020 548078 1013771 1123705 841910 267984 -395423 -918419
354 -918419 -1121438 -933276 -419850 237762 807236 1094560 1000332 557929 -77403 -682150
364 -682150 -1046116 -1045793 -682132 -80556 546239 979668 1068686 786084 233052 -399462 -891768
375 -891768 -1072182 -876373 -377441 250295 788688 1050826 944405 510025 -98682 -670628
385 -670628 -1006975 -993516 -632533 -51834 544437 946746 1018388 735880 197781 -407442
395 -407442 -866852 -1023299 -824899 -338222 265129 773268 1008463 892859 466874 -120159
405 -120159 -662928 -972656 -943324 -584355 -24093 541829 918323 972868 686191 164288
415 164288 -411992 -844467 -981358 -775724 -299835 278487 757825 970262 844404 426376
$$ packed form
344a088980j4634L69994O23600O58098M65693J09934k81795n73926o63407n22996
354i18419k03019J88162N13426O57612N69474K87324r4228m42403o35332o04747
364f82150l63966L23L63661O01576O26795M33429Q9018k82602n53032o32514m92306
375h91768j80414J95809M98932O27736N38393K62138j06421m34380o08707n71946
385f70628l36347J3459L60983N80699N96271M02309P1642k82508n38099o05223
395d07442m59410j56447J98400M86677O03351N08139K35195j15604m25985n87033
405a20159n42769l09728K9332L58969N60262N65922L76494N4545k86677n21903
415A64288n76280m32475j36891K05634M75889N78322M79338K12437j25858m18028
$$ plain form
425 426376 -139953 -655495 -939113 -896709 -541318 2575 542116 891300 928733 641861
435 641861 132899 -417931 -824664 -942157 -729044 -264961 289932 745807 935666 797857
445 797857 386847 -158373 -649316 -908775 -851728 -501403 26265 543527 864199 886042
455 886042 601704 104575 -426771 -803424 -902573 -689089 -231114 304506 729422 902081
465 902081 758788 348776 -177771 -641658 -881301 -811861 -460196 50431 541995 841720
475 841720 847278 559826 77079 -432343 -787142 -867656 -647321 -197253 316910 717842
485 717842 870229 717381 312480 -195131 -633878 -855549 -772920 -420175 72141 541812
495 541812 822769 808446 517611 53288 -437208 -772889 -831013 -606869 -171913 330673
$$ packed form
425D26376n66329n15542k83618M2404L55391N43893N39541L49184L7433k86872
435F41861n08962n50830m06733j17493K13113M64083N54893M55875J89859j37809
445G97857m11010n45220m90943k59459N7047L50325N27668N17262L20672K1843
455H86042k84338m97129n31346l76653r9149K13484M57975N35620M24916J72659
465I02081j43293m10012n26547m63887k39643O9440L51665N10627M91564K99725
475H41720N558k87452m82747n09422l54799q0514K20335M50068N14163M00932
485G17842J52387j52848m04901n07611m38747k21671Q2629L52745M92316M69671
495E41812K80957j4323k90835m64323m90496l35681n8124K24144M34956N02586
$$ plain form
505 330673 709675 834165 678765 283711 -215884 -629808 -822652 -737600 -387498 98205
515 98205 538492 795865 779241 482373 21833 -438953 -752875 -803429 -567669 -139001
525 -139001 334635 696940 810032 638369 250208 -226089 -624404 -799505 -697673 -355041
535 -355041 112647 538241 774051 742019 449270 153 -443033 -734983 -772291 -533300
545 -533300 -113070 342170 683614 781845 602280 221603 -236129 -617233 -774341 -660172
555 -660172 -325994 127496 538478 750978 705570 421190 -18493 -449689 -713992 -737640
565 -737640 -505010 -87456 352233 663905 753406 574219 189665 -248124 -601270 -751266
575 -751266 -630647 -290610 141023 528957 734119 674513 385260 -33746 -448719 -700736
$$ packed form
505C30673L79002J24490j55400l95054m99595m13924j92844Q5052L50102M85703
515I8205M40287K57373j6624k96868m60540m60786l13922n0554K35760M28668
525a39001M73636L62305J13092j71663l88161m76297l98315j75101J01832L42632
535c55041M67688M25594K35810l2032k92749m49117m43186k91950l7308K38991
545e33300M20230M55240L41444R8231j79565l80677m57732l81104j57108J14169
555f60172L34178M53490M10982K12500m5408k84380m39683m31196k64303k3648
565g37640K32630M17554M39689L11672Q9501j79187l84554m37789l53146j49996
575g51266J20619L40037M31633L87934K05162n9606k89253m19006m14973k52017
$$ plain form
585 -700736 -704215 -469901 -69898 358723 652810 720156 541930 168975 -260404 -592181
595 -592181 -722765 -600681 -263619 157187 522276 711240 645564 353105 -51927 -443912
605 -443912 -684811 -676146 -435502 -50299 360706 643074 691477 507721 149332 -268511
615 -268511 -585914 -693619 -570092 -242972 173207 518835 684412 618025 328709 -73020
625 -73020 -442296 -661994 -651968 -407729 -27192 359607 626569 669978 476335 124804
635 124804 -270796 -575926 -672677 -536750 -219410 179644 513822 664507 587815 305306
645 305306 -87165 -442319 -642067 -624169 -381643 -8184 361117 609101 645399 449287
655 449287 102115 -275037 -564350 -653114 -507392 -194815 185265 508380 645444 555233
$$ packed form
585g00736l479K34314M00003M28621K94087O7346j78226l72955m29379l31777
595e92181j30584J22084L37062M20806L65089J88964o5676k92459m05032l91985
605d43912k40899Q665K40644L85203M11005K82368M8403j83756l58389m17843
615b68511l17403j07705J23527L27120M16179L45628J65577o6387k89316m01729
625g3020l69276k19698J0026K44239L80537L86799K66962M3409j93643l51531
635A24804l95600l05130r6751J35927L17340L99054L34178J50685p6692k82509
645C05306l92471l55154j99748J7898K42526L73459L69301K47984L6298j96112
655D49287l47172l77152k89313q8764J45722L12577L80080L23115J37064r0211
$$ plain form
665 555233 281252 -95770 -443550 -624646 -591648 -358612 7191 367915 591989 616963
675 616963 427492 82487 -284753 -548965 -629301 -485435 -168985 197105 496300 627263
685 627263 532399 252221 -108173 -435995 -611864 -566482 -329158 19759 366589 581184
695 581184 590465 399503 67783 -290191 -540985 -603527 -458332 -150665 207570 490258
705 490258 604243 506500 230427 -120494 -430871 -593064 -542738 -303616 34410 363700
715 363700 568100 567383 372355 51120 -292218 -530395 -579982 -432176 -133506 215347 483441
726 483441 581579 482535 211566 -133652 -426113 -572084 -520744 -283807 50002 361231
736 361231 550660 547384 348461 33938 -291210 -518852 -561138 -406146 -116005 216703
$$ packed form
665E55233k73981l77022l47780j81096L2998K33036L65803L60724K24074K4974
675F16963j89471l45005l67240k64212q0336J43866L16450L66090K99195J30963
685F27263r4864k80178l60394l27822j75869M5382K37324L48917L46830K14595
695E81184R281j90962l31720l57974k50794o2542J45195L07667L58235K82688
705D90258J13985r7743k76073l50921l10377j62193N0326K39122L38026L29290
715C63700K04400p17j95028l21235l43338k38177m9587J47806K98670L48853K68094
726D83441R8138r9044k70969l45218k92461j45971N1340K36937L33809L11229
736C61231J89429l276j98923l14523l25148k27642m2286J54992K90141L32708
$$ plain form
746 216703 475722 563113 456546 193614 -139554 -421991 -553685 -495723 -265191 59860
756 59860 360004 533443 524061 329660 20172 -292244 -503956 -540950 -385363 -98209 219764
767 219764 463297 545053 433407 174194 -144363 -414570 -537786 -472280 -244719 68143
777 68143 357270 519213 500471 309008 8129 -293030 -490486 -518581 -364931 -83617
787 -83617 223542 453166 526016 412676 155792 -152016 -406814 -520372 -450477 -224491
797 -224491 77037 353166 504471 479536 288564 -2558 -292913 -478751 -496641 -344106
807 -344106 -70338 226821 443073 505266 392654 141436 -157500 -399862 -503769 -430117
817 -430117 -206986 83888 346068 489964 459699 269175 -12303 -289399 -466810 -478208
$$ packed form
746B16703K59019Q7391j06567k62932l33168k82437j31694N7962K30532L25051
756E9860L00144J73439r382j94401l09488l12416k11712l6994J55587K87154L17973
767B19764K43533Q1756j11646k59213l18557k70207j23216O5506K27561L12862
777F8143K89127J61943j8742j91463l00879l01159j97456k8095J53650K81314
787h3617L07159K29624P2850j13340k56884l07808k54798j13558O9895K25986
797b24491L01528K76129J51305k4935j90972k91122k90355j85838j7890J52535
807c44106K73768K97159K16252O2193j12612k51218k98936k42362j03907P3652
817d30117K23131K90874K62180J43896l0265j90524k81478k77096j77411j1398
$$ plain form
827 -478208 -324066 -59267 227275 432759 486525 372253 127637 -161436 -392101 -485111
837 -485111 -410679 -192620 92563 343077 473484 440131 252656 -22814 -288635 -453268
847 -453268 -459793 -305186 -46415 227426 422937 469729 352269 112457 -165016 -384579
857 -384579 -469111 -390238 -175549 99423 338961 459275 420702 234064 -33105 -287616
867 -287616 -441464 -440340 -286728 -33851 230552 412655 451903 332847 98162 -169647
877 -169647 -377896 -452832 -370934 -159521 106528 334917 445772 400909 217021 -42189
887 -42189 -285852 -428836 -422663 -268498 -22828 231188 402693 434623 314706 84948 -173436
898 -173436 -370312 -436962 -352872 -144917 112772 329624 431569 383796 200803 -51336
$$ packed form
827d78208J54142K64799K86542K05484N3766j14272k44616k89073k30665r3010
837d85111P4432K18059K85183K50514J30407l3353j87475k75470k65821j64633
847d53268o525J54607K58771K73841J95511M6792j17460k39812k77473k19563
857c84579q4532P8873K14689K74972K39538J20314l8573j86638k67169k54511
867b87616j53848J124J53612K52877K64403J82103L9248j19056k34685k67809
877a69647k08249p4936Q1898K11413K66049K28389J10855m4863j83888k59210
887d2189k43663j42984O173J54165K45670K54016J71505L1930j19917k29758k58384
898a73436j96876o6650Q4090K07955K57689K16852J01945m7773j82993k52139
$$ plain form
908 -51336 -283629 -417169 -404288 -251267 -11146 232061 394716 418465 296865 71703
918 71703 -176962 -363140 -421980 -333859 -129472 118129 324565 417479 365026 185121 -58626
929 -58626 -281612 -405501 -387943 -234863 -1124 232034 384140 402200 279878 60108
939 60108 -179262 -355563 -408403 -317554 -116828 123384 320212 404381 348220 170278 -66371
950 -66371 -278878 -392683 -371266 -219342 7974 231641 374818 385963 263096 48381
960 48381 -181459 -347856 -393098 -300298 -103994 127394 315055 392331 331451 155457 -73035
971 -73035 -275968 -382793 -354456 -203314 16247 231612 364994 370969 247485 38267 -183810
982 -183810 -340326 -378313 -284559 -92403 131388 309564 378152 315716 143310 -79172 -273119
$$ packed form
908e1336k32293j33540J2881J53021K40121K43207J62655K3749j21600k25162
918G1703k48665j86178n8840Q8121K04387K47601K06436R2914n2453j79905k43747
929e8626k22986j23889J7558J53080K33739K33158J52106J8060j22322k19770
939F0108k39370j76301n2840R0849K00726K40212J96828Q4169n6161j77942k36649
950f6371k12507j13805K1417J51924K27316K23667J43177J1145j22867k14715
960D8381k29840j66397m5242R2800J96304K31388J87661P7276o0880j75994k28492
971g3035k02933j06825K8337J51142K19561K15365J33382N975j23484k09218k22077
982a83810j56516l7987R3754J92156K23791J78176O8588o2436j72406k22482j93947
$$ plain form
993 -273119 -371004 -339965 -190736 25813 230236 354813 356468 233305 29162 -184309 -333039
1004 -333039 -365393 -269912 -80150 135386 303796 366737 299990 129642 -83228 -268731
1014 -268731 -359815 -324736 -176436 31709 230040 346202 340589 217810 18357 -185881
1024 -185881 -325696 -351238 -255766 -69940 139245 298300 353204 285805 117492 -89722
1034 -89722 -265344 -348959 -309743 -163290 39461 228329 337310 327142 203707 9407
1044 9407 -187404 -318543 -337261 -240447 -59076 142887 292580 340966 270900 105732 -95275
1055 -95275 -262251 -337564 -295358 -149140 47136 226380 327354 313644 190246 523
1065 523 -187370 -310606 -324907 -225139 -48541 144700 286935 328273 256501 94714 -100397
$$ packed form
993b73119r7885L1039J49229K16549K04423J24577J655j23163k04143k13471j48730
1004c33039l2354R5481J89762K15536J68410O2941o6747j70348k12870j85503
1014b68731r1084L5079J48300K08145J98331J16162n613j22779j99453k04238
1024a85881j39815k5542R5472J85826K09185J59055N4904o7399j68313k07214
1034h9722j75622q3615L9216J46453K02751J88868J08981j0168j23435j94300
1044I407j96811j31139j8718R6814J81371K01963J49693M8386p0066j65168k01007
1055i5275j66976p5313M2206J46218J96276J79244J00974j3710j23398j89723
1065E23j87893j23236j4301R9768J76598J93241J42235M1338p1772j61787j95111
$$ plain form
1076 -100397 -258795 -326218 -282210 -137260 53201 224714 318056 300065 176350 -7499
1086 -7499 -187634 -302966 -311652 -211100 -38771 147277 282278 317153 241258 83345 -103347
1097 -103347 -254938 -316491 -266704 -125897 59603 224510 307650 285959 164334 -15056
1107 -15056 -188489 -293507 -299245 -199316 -28166 148863 274731 305039 228819 71287 -106869
1118 -106869 -249433 -306193 -253543 -112290 65211 221232 299943 271938 150868 -22296
1128 -22296 -188240 -287122 -285402 -185077 -19981 151829 269366 292679 214848 61480 -111748
1139 -111748 -246710 -294689 -240263 -101108 71431 219649 289935 259399 137950 -29764
1149 -29764 -187912 -279752 -273513 -172276 -11894 153693 263396 281219 203219 51975 -116314
$$ packed form
1076a00397j58398o7423M4008J44950J90461J71513R3342j7991j23715j83849
1086g499j80135j15332q686J00552J72329J86048J35001L4875p5895j57913j86692
1097a03347j51591o1553M9787J40807J85500J64907Q3140k1691j21625j79390
1107a5056j73433j05018n738R9929J71150J77029J25868L0308p6220j57532j78156
1118a06869j42564n6760N2650J41253J77501J56021P8711k8005j21070j73164
1128b2296j65944r8882J720J00325J65096J71810J17537K3313p7831j53368j73228
1139a11748j34962m7979N4426J39155J72539J48218P0286l0536j21449j67714
1149b9764j58148r1840O239J01237J60382J65587J09703J7823p8000j51244j68289
$$ plain form
1160 -116314 -241675 -283849 -228704 -90361 77025 216134 281592 248286 126341 -36701
1170 -36701 -185827 -272926 -262601 -159679 -3244 152886 258544 270958 189737 44226 -117767
1181 -117767 -238852 -274184 -214844 -82165 80950 214022 271613 235854 117646 -42314
1191 -42314 -185373 -263958 -251472 -150049 3337 153755 250717 261017 178892 35455 -118489
1202 -118489 -233375 -265735 -204151 -73372 82820 211187 262982 224862 108283 -45874
1212 -45874 -183585 -256690 -240515 -140540 9226 153955 244648 250972 169056 27811 -121451
1223 -121451 -228051 -255825 -193609 -63460 86886 207515 255723 214281 98875 -50105
1233 -50105 -182539 -250364 -230486 -130594 14536 154654 239113 240247 158943 21075 -122742
$$ packed form
1160a16314j25361m2174N5145J38343J67386J39109O5458l3306j21945j63042
1170c6701j49126q7099J0325J02922J56435J56130J05658J2414q1221j45511j61993
1181a17767j21085l5332N9340J32679J63115J33072N7591l5759j18208j59960
1191d2314j43059p8585J2486J01423J53386J50418R6962J0300q2125j43437j53944
1202a18489j14886l2360O1584J30779J56192J28367N1795l8120j16579j54157
1212d5874j37711p3105J6175R9975J49766J44729R0693O324q1916j41245j49262
1223a21451j06600k7774O2216J30149J50346J20629M8208m1442j15406j48980
1233e0105j32434o7825J9878R9892J45130J40118Q4459J134q1304j37868j43817
$$ plain form
1244 -122742 -223496 -246983 -183846 -54968 89600 204341 248261 203259 88758 -55631
1254 -55631 -180350 -243474 -219831 -119628 20143 154167 233633 230486 148170 14250 -124650
1265 -124650 -219698 -236549 -173432 -48278 93376 201769 238826 194021 80250 -60776 -179280
1276 -179280 -235315 -210215 -110277 27098 153598 226932 221770 138149 7754 -124735 -214949
1287 -214949 -228531 -162480 -40507 94623 198237 231365 183584 72237 -63186 -176831
1297 -176831 -228528 -200603 -102032 31029 152925 221327 212084 128578 1553 -126037 -210111
1308 -210111 -220649 -153854 -34251 97377 194622 223157 173880 65107 -66860 -174386 -221423
1319 -221423 -191010 -94399 35222 152597 214889 203578 121141 -3189 -126237 -204306 -212645
$$ packed form
1244a22742j00754k3487O3137J28878J44568J14741M3920m5002j14501j44389
1254e5631j24719o3124K3643J00203J39771J34024P9466l147q2316j33920j38900
1265a24650r5048j6851O3117J25154J41654J08393L7057m4805j13771j41026j18504
1276a79280n6035K5100R9938J37375J26500P3334n162q3621j30395j32489r0214
1287b14949j3582O6051J21973J35130J03614L3128m7781j11347j35423j13645
1297a76831n1697K7925R8571J33061J21896O8402r243q3506j27025j27590q4074
1308b10111j0538O6795J19603J31628R7245K8535m9277j08773j31967j07526m7037
1319b21423L0413R6611J29621J17375O2292j1311q2437j24330j23048p8069q339
$$ plain form
1330 -212645 -145146 -27525 97812 189976 215840 165131 58176 -68914 -172305 -214970 -182572
1341 -182572 -86846 39024 151205 209385 194427 113239 -7970 -126758 -199841 -203323 -136698
1352 -136698 -21644 99629 187652 207629 156752 50662 -71638 -168728 -207920 -174378 -78908
1363 -78908 42411 149024 204152 187518 104850 -12408 -125875 -196184 -195886 -128095 -16410
1374 -16410 100895 183053 200505 148818 45230 -74107 -167147 -201434 -165228 -72327 45160
1385 45160 147432 197051 178442 97678 -16851 -125196 -190102 -187917 -120537 -10889 101417
1396 101417 179156 193436 140258 39309 -75788 -163540 -194841 -157098 -65777 48779 146700
1407 146700 192508 172127 90509 -21173 -124886 -185521 -181044 -113363 -6057 101931 175309
$$ packed form
1330b12645O7499J17621J25337R2164K5864n0709j06955j27090j03391m2665L2398
1341a82572R5726J25870J12181N8180j4958q1188j21209j18788p3083l482O6625
1352a36698J15054J21273Q8023J9977n0877j06090j22300r7090l9192L3542R5470
1363g8908J21319J06613N5128j6634q2668j17258j13467p0309K98O7791J11685
1374a6410J17305Q2158J7452n1687j03588j19337r3040l4287L6206R2901J17487
1385D5160J02272M9619j8609q0764j14529j08345o4906K185O7380J09648J12306
1396A01417P7739J4280n3178j00949j15097q7752l1301L7743R1321J14556R7921
1407A46700M5808k0381q1618j11682j03713o0635M477O7681J07306J07988P3378
$$ plain form
1418 175309 186970 132767 33552 -77504 -161287 -188085 -149443 -59608 51731 143910 186753
1429 186753 163406 83875 -25000 -124528 -180745 -173545 -105495 -1740 103165 171146 179875
1440 179875 125943 28506 -78369 -158585 -182477 -142147 -53730 54053 142892 181844 155928
1451 155928 76898 -28051 -124254 -175770 -166253 -98031 2963 103137 167500 173035 118584
1462 118584 22683 -79799 -155310 -175648 -135281 -47403 56876 141234 174849 148883 70786
1473 70786 -31913 -123409 -171220 -158938 -92339 6603 103911 162913 166019 111714 16777 -81719
1485 -81719 -152490 -169743 -128114 -41124 58165 138545 170084 142194 64522 -34309 -121644 -165628
1497 -165628 -151471 -85638 10966 103304 159236 159304 104254 12791 -82722 -148983 -163903 -120748
$$ packed form
1418A75309J1661n4203r9215j11056q3783k6798L8642Q9835J11339R2179M2843
1429A86753k3347p9531j08875r9528n6217P200O8050J03755J04905O7981Q729
1440A79875n3932r7437j06875q0216k3892M0330Q8417J07783Q8839L8952k5916
1451A55928p9030j04949r6203n1516R517O8222J00994J00174O4363N535n4451
1462A18584r5901j02482p5511k0338M0367Q7878J04279Q4358L3615k5966p8097
1473G0786j02699r1496m7811J2282O6599R8942R7308N9002L106n4305r4937r8496
1485h1719p0771j7253M1629Q6990R9289Q0380L1539k7890p7672r8831q7335m3984
1497a65628J4157O5833R6604R2338N5932O8n5050r1463r5513o6261j4920M3155
$$ plain form
1509 -120748 -35944 61003 137156 164278 134275 57768 -38017 -120684 -161297 -145231 -79243 14398
1521 14398 102984 155277 153681 97754 8729 -83803 -145831 -157619 -113978 -30863 62201 133673
1533 133673 158132 127825 52300 -40532 -119551 -156870 -138383 -73096 18093 102899 151268 146504
1545 146504 91172 3644 -83998 -142989 -151588 -107350 -25978 64129 131886 153740 121352 47165
1557 47165 -43870 -118306 -151845 -132329 -66141 21271 101973 147392 140841 85079 -87 -84456
1569 -84456 -139790 -146222 -101760 -21823 65770 129820 148480 114448 41943 -45274 -117318 -147211
1581 -147211 -126118 -62110 24373 101857 143287 134839 79512 -3671 -85626 -136278 -140125 -95889
1593 -95889 -16898 66551 126767 142797 109849 37056 -47241 -114716 -142900 -120703 -56700 27160
$$ packed form
1509a20748Q4804R6947P6153K7122l0003p6507r5785q2667m0613J6066O5988R3641
1521A4398Q8586N2293j596n5927q9025r2532o2028j1788M3641Q3115R3064P1472
1533A33673K4459l0307p5525r2832p9019l7319J8487O5287R1189Q4806M8369m764
1545A46504n5332q7528q7642n8991q599M4238Q1372R0107O7757K1854l2388p4187
1557D7165r1035p4436l3539J9516O6188Q7412Q0702M5419o551n5762q5166q4369
1569h4456n5334o432M4462P9937Q7593O4050J8660l4032p2505q7217p2044k9893
1581a47211K1093O4008Q6483P7484M1430q448n5327q3183q1955n0652l847M4236
1593i5889P8991Q3449O0216J6030l2948p2793q4297o7475k8184K2197O4003Q3860
$$ plain form
1605 27160 101006 139875 128827 73810 -6440 -84784 -133352 -135111 -89952 -14135 67199 124717
1617 124717 138289 103990 33221 -48763 -113679 -138437 -115517 -52307 29218 99710 135634 124378
1629 124378 69489 -9233 -84268 -129942 -130136 -84907 -10259 67547 121741 133359 98458 28845
1641 28845 -50118 -111946 -134318 -109645 -46779 31262 98780 131298 119055 63963 -12578 -84550
1653 -84550 -126723 -125025 -79478 -5980 68268 119106 128873 92523 24882 -51597 -109354 -128943
1665 -128943 -104142 -42636 33695 97543 127651 112601 59697 -15197 -84087 -123610 -120450 -74017
1677 -74017 -3269 68975 116750 123768 87510 20912 -52248 -108232 -124909 -98759 -37895 35022
1689 35022 96322 124024 107777 54078 -17662 -84003 -120257 -114716 -69730 -834 68458 113516
$$ packed form
1605B7160P3846L8869j1048n5017q0250p8344m8568j759M5159P5817Q1334N7518
1617A24717J3572l4299p0769q1984o4916k4758K2920O3210Q1525P0492L5924j1256
1629A24378n4889p8722p5035m5674j94M5229P4648P7806N4194J1618l4901o9613
1641B8845p8963o1828k2372K4673O2866P8041O7518L2518j2243n5092p6541p1972
1653h4550m2173J698M5547P3498P4248N0838R767l6350o7641p6479n7757j9589
1665a28943K4801O1506P6331O3848L0108j5050n2904p4894o8890l9523L160M6433
1677g4017P0748P2244M7775P018l6258o6598p3160n5984j6677K6150O0864P2917
1689C5022O1300K7702j6247n3699p1740o6341l6254N541M4986O8896O9292M5058
$$ plain form
1701 113516 119144 82413 17832 -53150 -105394 -120577 -94937 -34288 37482 95349 120278 103488
1713 103488 50128 -19549 -82483 -116379 -109982 -64740 2333 69068 110788 114548 78034 14318
1725 14318 -54010 -103072 -116413 -88387 -30983 38050 93148 116079 97983 46789 -21464 -82246
1737 -82246 -113058 -105470 -60307 4263 68480 108177 109265 73528 11321 -54370 -101031 -112427
1749 -112427 -83979 -26980 38980 92250 111999 93578 42483 -23808 -81111 -109247 -101121 -56267
1761 -56267 8082 68657 106386 105620 68639 7894 -54195 -99126 -108345 -79440 -24112 40518
1773 40518 90297 108443 88345 38175 -25378 -80345 -107043 -95867 -52070 10073 68785 103334
1785 103334 101182 64335 5155 -55738 -96866 -104500 -76073 -20049 40988 88732 105405 84813
$$ packed form
1701A13516N628l6731o4581p0982n2244j5183K5640O0649P1770N7867K4929j6790
1713A03488n3360o9677o2934l3896O397M5242O7073O6735M1720L760l6514o3716
1725A4318o8328m9062j3341K8026N7404O9033N5098K2931j8096n1194o8253o0782
1737h2246l0812P588M5163O4570O4217L9697J088l5737o2207o5691m6661j1396
1749a12427K8448N6999O5960N3270J9749j8421n1095o6291n7303k8136Q126M4854
1761e6267O4349O0575L7729p66l6981o0745o2089m4931r219K8905N5328O4630
1773D0518M9779J8146k0098n0170o3553n4967k6698J1176M3797O2143N8712L4549
1785A03334k152l6847n9180o0893m1128p634K8427N6024O1037M7744J6673k0592
$$ plain form
1797 84813 34919 -27378 -79345 -103783 -92164 -48265 11385 68039 99960 97813 61216 2688
1809 2688 -55341 -94928 -100434 -71334 -17377 41867 87694 102239 81127 31906 -27682 -78357
1821 -78357 -100771 -88268 -44965 13735 67442 98170 93745 56759 780 -55828 -92528 -97594
1833 -97594 -68482 -15124 42937 84939 98772 77395 28105 -29472 -76679 -98321 -85012 -40874
1845 -40874 15303 66856 95180 89977 53370 -1128 -55711 -90624 -94520 -64163 -12140 43055
1857 43055 83979 95247 73165 25169 -30793 -75905 -94925 -80627 -37856 17182 66763 92678
1869 92678 86635 49834 -4031 -56067 -87996 -89984 -60735 -9421 44140 82674 92308 69212
1881 69212 22740 -32467 -75583 -92189 -77223 -34895 19188 65583 90384 82499 46125 -5254
$$ packed form
1797H4813m9894o2297n1967k4438J1619M3899N9650N6654L1921k147l6597n8528
1809B688n8029l9587n506K9100N3957N9244M5827J4545k1112m9221n9588n0675
1821g8357k2414J2503M3303N8700N3707L0728m425l6986n5979n6608l6700n066
1833i7594K9112N3358N8061M2002J3833k1377m9290n7577m7207k1642J3309M4138
1845d0874N6177N1553K8324n203l6607n4498n4583l4913l896L0357N2023N5195
1857D3055M0924J1268k2082m7996n5962m5112j9020J4298M2771N5038M9581K5915
1869I2678o043l6801n3865n2036l1929j988K9249N1314N3561L8534R634k3096
1881F9212m6472n5207m3116j6606J4966M2328N4083M6395K4801p885l6374n1379
$$ plain form
1893 -5254 -55953 -86582 -86966 -56695 -7265 44803 80836 89198 65839 20537 -32687 -74101 -89449
1906 -89449 -73625 -32348 20150 65732 87749 79805 43353 -7113 -55229 -84127 -83697 -54559
1918 -54559 -5225 45078 79268 86495 62541 17550 -33895 -72704 -86513 -70708 -29584 21363
1930 21363 64069 85473 76174 40982 -9389 -55064 -82303 -80659 -50671 -3332 45380 77217
1942 77217 82766 59606 15919 -33822 -71985 -83431 -66440 -26800 22421 63878 83300 72738
1954 72738 37992 -10066 -54475 -79784 -77536 -47440 -1639 45080 75749 80015 56153 13114
1966 13114 -34204 -69899 -80931 -63387 -24174 23060 62667 80008 69648 34659 -12069 -53750
1978 -53750 -78006 -74524 -44523 127 44807 73538 76747 53291 10919 -34887 -67807 -78472
$$ packed form
1893e254n0699l0629l84L0271M9430N2068L6033Q362k3359m5302n3224m1414j5348
1906h9449J5824M1277N2498M5582K2017p944l6452n0466m8116k8898M30K9138
1918e4559M9334N0303L4190P227k3954m4991n1445l8809j3809J5805M1124N0947
1930B1363M2706K1404r299l5192n0371m5675k7239J644K9988M7339M8712L1837
1942G7217N549k3160m3687m9741l8163j1446J6991L9640M9221M1457J9422j0562
1954G2738l4746m8058m4409k5309K248L0096M5801M6719L0669M266k3862m3039
1966A3114m7318l5695j1032J7544L9213M7234L9607J7341j0360l4989m6728m1681
1978e3750k4256L482L0001M4650M4680K8731L209k3456m2372m5806l2920j0665
$$ plain form
1990 -78472 -60691 -22635 23742 61877 77176 66203 32230 -13340 -53278 -75326 -70980 -41660
2002 -41660 1838 45441 71606 74024 50784 8837 -35194 -67219 -75144 -57399 -19137 25223
2014 25223 60873 75574 63903 29935 -14128 -53449 -74161 -67717 -38554 3489 44450 70368
2026 70368 71351 47105 7170 -35260 -65546 -73071 -54539 -17393 25196 60074 72770 60169
2038 60169 27292 -15600 -52071 -71748 -65113 -36344 5745 44765 67939 68223 44774 4830
2050 4830 -35602 -63642 -70377 -51447 -14931 26278 58785 70096 57196 25172 -16771 -52150
2062 -52150 -69102 -62249 -33880 6438 44644 66622 65715 41802 3733 -35793 -62714 -67070 -49488
2075 -49488 -13673 26748 56984 68044 54697 22193 -16968 -51414 -67724 -59409 -31409 8510
$$ packed form
1990g8472J7781L8056M6377L8135J5299j0973l3973m5570l9938k2048M346K9320
2002d1660M3498M3603K6165K418k3240m1947m4031l2025p925J7745L8262M4360
2014B5223L5650J4701j1671l3968m4063l9321k0712O444K9163M2043M0961K5918
2026G0368R83k4246l9935m2430l0286p525J8532L7146M2589L4878J2696j2601
2038F0169l2877m2892l6471j9677O635K8769M2089L9020K3174K84k3449l9944
2050D830m0432k8040o735J8930L6516M1209L2507J1311j2900l2024m1943l5379
2062e2150j6952O853K8369M0318L8206K1978r07k3913l8069l9526k6921m356J7582
2075d9488L5815M0421L0236J1060j3347l2504l9161l4446j6310Q315K8000L9919
$$ plain form
2087 8510 44048 65209 63157 38797 1791 -35939 -60677 -65347 -47001 -11084 27403 56544
2099 56544 65515 51622 20605 -18388 -50644 -64492 -57432 -28454 9489 43948 63073 60545
2111 60545 36213 733 -35765 -59468 -62557 -44078 -9525 27715 55472 63239 49403 17840
2123 17840 -19440 -49135 -62854 -54317 -26833 9960 43193 61457 57703 34124 -1083 -36481
2135 -36481 -58155 -60493 -41450 -8132 28260 54153 61888 47047 17012 -19831 -48924 -61076
2147 -61076 -52021 -24675 10571 42948 59563 55825 32220 -1976 -35271 -56697 -58286 -38857
2159 -38857 -6313 27938 52502 58924 44277 14898 -20424 -47693 -58761 -49145 -22352 11518
2171 11518 41949 57878 53096 29357 -3453 -35598 -55354 -55592 -36539 -4531 27977 51369
$$ packed form
2087H510L5538K1161k052k4360l7006l7730k4738m670J8346L5917L8487K9141
2099E6544Q971j3893l1017l8993l2256j3848P060K8978L7943L4459J9125k528
2111F0545k4332l5480l6498k3703l089J8479L4553L7240K7757P767j3836l1563
2123A7840l7280k9695j3719Q537K7484L6793L3233J8264l754k3579l5207l5398
2135c6481k1674k338J9043L3318L6392K5893P735j4841l0035l6843k9093j2152
2147f1076R055K7346L5246L2377J6615l738k3605l4196l3295k1426j589J9429
2159c8857L2544L4251K4564O422j4647k9379l5322k7269j1068R616K6793L3870
2171A1518L0431J5929m782k3739l2810l2145j9756k38J9053L2008L2508K3392
$$ plain form
2183 51369 56684 42648 13064 -20560 -47317 -56580 -46119 -21268 12584 41385 55509 51271
2195 51271 27562 -4748 -35381 -53611 -52532 -34628 -3043 28163 50440 54994 39701 11854
2207 11854 -21150 -46180 -55102 -44715 -18883 13973 40726 54403 48310 26203 -5055 -35594
2219 -35594 -51932 -51150 -32828 -2126 28679 49261 52399 38337 9800 -21292 -45418 -53954 -42714
2232 -42714 -16399 14296 40361 52213 46426 24313 -6480 -34524 -50645 -49080 -30064 -1795
2244 -1795 27716 48015 51070 35724 8877 -21946 -43701 -51113 -39934 -15267 14334 39526
2256 39526 50937 44081 22710 -7204 -34276 -49681 -47145 -28465 -202 28206 46804 48923
2268 48923 33298 7234 -22233 -43617 -49963 -38212 -14207 15818 39419 49184 42135 20475
$$ packed form
2183E1369N315j4036k9584l3624k6757r263J0461K4851L3852K8801J4124m238
2195E1271k3709l2310l0633j8230J079J7904L1585L1206K2277M554j5293k7847
2207A1854l3004k5030q922J0387K5832L2856K6753J3677o093k2107l1258l0539
2219c5594j6338P82J8322L0702L0805K0582L138j4062k8537l1092k4126q536J1240
2232d2714K6315L0695K6065J1852n787k2113l0793k8044j6121J565J9016K8269
2244a795K9511K0299L055j5346k6847l0823k1755p412J1179K4667K9601K5192
2256C9526J1411o856k1371k9914k7072j5405K536J8680K8263K8408J8598K119
2268D8923j5625k6064k9467k1384o346J1751K4005L0025K3601R765p049k1660
$$ plain form
2280 20475 -8136 -34503 -48119 -45383 -27046 1378 28276 45719 47106 31912 6048 -22248
2292 -22248 -42651 -47714 -35973 -11611 15609 38465 47705 39938 18662 -8953 -33292 -46971
2304 -46971 -42989 -24852 2532 28340 44406 46125 29993 4838 -22834 -41961 -45815 -34186
2316 -34186 -11344 16819 38269 46475 37409 17517 -9892 -33371 -44915 -41386 -22454 3670
2328 3670 27646 42420 43566 28423 3441 -22315 -40385 -44053 -32466 -9383 15870 36780
2340 36780 43736 36515 15614 -10757 -32834 -43340 -39539 -21063 4356 27777 42357 41337 26067
2353 26067 2640 -22755 -39800 -42512 -30576 -8432 17390 36715 42981 35071 14667 -11613
2365 -11613 -32005 -42515 -37676 -19252 5524 28018 41295 39622 24930 1279 -22992 -38801
$$ packed form
2280B0475k8611k6367j3616K736J8337K8424K6898J7443J387j5194k5864k8296
2292b2248k0403n063J1741K4362K7220K2856R240p767k1276k7615k4339j3679
2304d6971L982J8137K7384K5808J6066J719j6132k5155k7672j9127l854J1629
2316c4186K2842K8163K1450Q206r066j9892k7409k3479j1544L529J8932K6124
2328C670K3976J4774J146j5143k4982k5756j8070l668J1587K3083K5253K0910
2340C6780O956p221k0901k6371k2077j0506L801J8476K5419K3421J4580j020j5270
2353B6067k3427k5395j7045k712J1936K2144K5822J9325O266p910k0404k6280
2365a1613k0392j0510M839J8424K4776K2494J3277j673j4692k3651k4271j5809
$$ plain form
2377 -38801 -41205 -29808 -7174 17608 35272 41228 33213 12848 -12279 -31734 -41021 -35912 -18100
2390 -18100 6382 27766 39394 38504 23606 -487 -22897 -37550 -39505 -27860 -6147 17832
2402 17832 34894 40059 31572 10899 -12271 -31504 -40251 -34204 -17133 6473 27272 38373 36476
2415 36476 21238 -644 -22661 -36382 -38007 -25929 -4632 17925 34085 38336 29934 10619
2427 10619 -12606 -31144 -38516 -32548 -15295 7111 26851 37894 34808 20481 -1975 -23067
2439 -23067 -36304 -36939 -24409 -3924 18015 33432 37280 27878 8899 -13309 -30827 -37819 -31219
2452 -31219 -13714 7480 26788 36109 33453 18775 -2396 -23284 -34977 -35155 -23477 -2986 18253
2465 18253 32601 35822 26127 7802 -13591 -30190 -35891 -29426 -13215 8347 26166 35670 32045
$$ packed form
2377c8801k404J1397K2634K4782J7664N956q015k0365k5127j9455r287N109J7812
2390a8100K4482K1384J1628q90j4898k4093k2410j4653j955J1645K1713K3979
2402A7832J7062N165q487k0673k3170j9233q747O047J7071K3606K0799J1101j897
2415C6476j5238k1882k2017j3721j625J2078K1297K2557J6160M251q402j9315
2427A0619k3225j8538p372N968J7253K2406J9740J1043l086j4327k2456k1092
2439b3067j3237o35J2530K0485K1939J5417L848r402j8979k2208j7518o992O600
2452c1219J7505K1194J9308R321k656j4678k1171k0888j1693j78J1678K0491K1239
2465A8253J4348L221r695j8325k1393j6599n701O465J6211K1562J7819R504l625
$$ plain form
2478 32045 17138 -3271 -22258 -33687 -34051 -21445 -1530 18198 31342 34328 25218 6528 -13793
2491 -13793 -29520 -34719 -27946 -11516 9168 26491 34632 30415 15553 -4497 -22979 -33163 -32304
2504 -32304 -19694 -879 18439 30891 33363 23846 5825 -13634 -28788 -32869 -25565 -9875 9117
2517 9117 25689 32998 28827 14701 -4994 -22124 -32197 -30801 -19206 50 17953 30285 31621
2530 31621 22138 4246 -14486 -27583 -32324 -24963 -8492 9909 25439 31590 27318 13162 -5617
2543 -5617 -22136 -30878 -29344 -17130 995 18299 29734 30380 20757 3278 -14931 -27236 -30921
2556 -30921 -23761 -7821 10513 25100 30373 25929 11979 -5915 -22165 -29403 -27904 -15726 1438
2569 1438 18590 29128 29131 19691 2905 -14887 -26805 -29228 -22006 -6665 10518 24501 29680 24932
$$ packed form
2478C2045j4907k0409j8987j1429l64J2606J9915J9728J3144K986r110j8690k0321
2491a3793j5727n199O773J6430K0684J7323Q141m217j4862k0050j8482j0184Q59
2504c2304J2610J8815J9318J2452K472r517j8021j9459j5154m081P304J5690J8992
2517I117J6572P309m171j4126j9695j7130j0073J396J1595J9256J7903J2332J336
2530C1621r483j7892j8732j3097m741P361J6471J8401J5530O151m272j4156j8779
2543e617j6519q742J534J2214J8125J7304J1435O46r623j7479j8209j2305l685
2556c0921P160J5940J8334J4587N273m444j3950j7894j6250p238J499J2178J7164
2569A438J7152J0538Lr440j6786j7792j1918k423P222J5341J7183J3983N179m748
$$ plain form
2583 24932 10668 -6340 -21291 -28671 -26623 -14443 1639 18188 27839 27927 18414 2705 -14767
2596 -14767 -25965 -28692 -20963 -5807 11097 24331 28693 23365 10107 -7261 -21560 -28349 -24815
2609 -24815 -13057 3080 17663 27434 26764 17667 1321 -15354 -25190 -27774 -20057 -5312 11289
2622 11289 23777 27575 21853 8574 -7097 -21183 -27734 -24411 -12346 3640 17675 26106 25846
2635 25846 16073 401 -15327 -25206 -27004 -18660 -4466 11385 23261 27104 21279 7879 -7526
2648 -7526 -20986 -26135 -23128 -11270 3845 18534 25901 24556 14870 146 -14893 -25249 -25321 -17610
2662 -17610 -3511 12067 22436 25673 20428 7310 -8155 -20329 -25660 -22309 -11215 4206 17395
2675 17395 26021 23738 13627 -1026 -14990 -24535 -25498 -16100 -3664 12197 22156 25346 18713 6573
$$ packed form
2583B4932j4264j7008j4951p380K048J2180J6082J6549R651Q8r513j5709j7472
2596a4767j1198k727P729J5156J6904J3234M362n328j3258j7368j4299o789L534
2609b4815J1758J6137J4583R771o70r097j6346j6675r836k584P717J4745J6601
2622A1289J2488L798n722j3279j5671j4086o551L323J2065J5986J4035Q431k60
2635B5846r773j5672j5728r879j798Q344J4194J5851J1876L843n825j3400j5405
2648g526j3460n149L007J1858J5115J4689P367j345r686j4724j5039j0356p2P711
2662a7610J4099J5578J0369L237n245j3118j5465j2174n331L351J1094J5421J3189
2675A7395Q626k283j0111j4653j3964r545r63R398J2436J5861R959L190o633j2140
$$ plain form
2689 6573 -8783 -20233 -25067 -20727 -9754 4304 17297 24565 22740 13357 -1146 -15060 -23120
2702 -23120 -23500 -15885 -2199 12161 21708 24085 17892 5975 -8652 -20239 -24521 -19617 -8444
2715 -8444 5255 18197 23663 21308 11792 -1254 -15298 -22359 -22298 -13714 -1593 11931 21346 23082
2729 23082 16966 4869 -9058 -19572 -22449 -18420 -8448 5442 17640 23078 20522 11149 -2175
2742 -2175 -14632 -22046 -21782 -13415 -487 12414 21286 22237 15930 4209 -9495 -18903 -22495 -17755
2756 -17755 -7135 6474 17351 22717 19654 10102 -2220 -14956 -21765 -20527 -12758 -421 12141
2769 12141 20695 21435 14282 3694 -9464 -18919 -22144 -16820 -6399 6074 17144 21162 18320 9837
2783 9837 -2986 -14639 -20855 -19650 -11999 349 12091 20069 20491 14100 1706 -9605 -18691 -20647
$$ packed form
2689F573j5356j1450m834M340J0973J4058J2993P268j825r383j4503j3914q060
2702b3120l80P615J3686J4360R547K377o193j1917j4627j1587m282M904J1173
2715h444J3699J2942N466k355r516j3046j4044p061O1Q584J2121J3524R415J736
2729B3082o116j2097j3927j0514k877M029R972J3890J2198N438k556r373j3324
2742b175j2457p414K64Q367J2928J2901Q872R51o307j1721j3704r408l592M740
2756a7755J0620J3609J0877N366l063r552j2322j2736o809J238P769J2337J2562
2769A2141Q554P40p153j0588j3158r455l225N324J0421J2473J1070M018k842q483
2783I837j2823j1653o216J205P651J2348J1742P978M22o391j2394j1311r086j956
$$ plain form
2797 -20647 -15945 -5998 6890 17123 21391 18140 8737 -3931 -14829 -20328 -19108 -11445 1011
2810 1011 12470 19462 20485 13193 2390 -9675 -18479 -19755 -16207 -4987 7445 16169 20187 17193
2824 17193 7579 -4246 -14817 -19987 -18070 -9852 1869 12171 19225 19137 12807 1700 -9999 -17815
2838 -17815 -19909 -14835 -4849 7633 16219 19852 16496 6574 -5067 -14694 -19143 -18128 -9575 1665
2852 1665 12267 18926 18375 11627 1520 -10072 -17542 -19324 -13768 -3643 7567 16572 19791 15578
2866 15578 6068 -4442 -14188 -18950 -16429 -8910 2114 12150 17961 17482 11702 993 -10113 -17755
2880 -17755 -17836 -12866 -3513 7555 15630 19079 14049 5685 -5556 -14197 -18095 -15167 -8112 2474
2894 2474 12251 18020 16528 10410 -85 -10999 -16412 -18095 -11982 -2532 7865 15570 17847 14285
$$ packed form
2797b0647M702R947J2888J0233M268l251r403j2668j0898n499J220P663J2456
2810A011J1459O992J023p292j0803j2065q804j276L548J1220J2432Q724M018k994
2824A7193r614j1825j0571n170J917Q218J1721J0302P054q8o330j1107j1699p816
2838a7815k094N074R986J2482Q586L633l356r922j1641r627m449J015Q553J1240
2852A665J0602O659n51o748j0107j1592p470j782N556J0125J1210R005L219m213
2866A5578r510j0510r746m762K521P519J1024J0036N811m79n780j0709j1106p642
2880a7755q1M970R353J1068Q075L449n030q364j1241q641l898K928P055J0586
2894B474R777N769j492o118j0495j0914n413j683O113R450J0397P705K277l562
$$ plain form
2908 14285 5286 -5571 -13926 -17265 -15189 -7172 2643 12052 17492 16134 9464 -496 -10173 -15979
2922 -15979 -17281 -11634 -2485 7866 15005 16973 13584 4843 -5314 -13585 -16928 -14669 -7374 3072
2936 3072 11736 16358 15681 8404 -1290 -9669 -15752 -16143 -10908 -2068 8175 15329 16561 12075 3807
2951 3807 -5991 -12887 -16304 -13670 -6149 3413 11962 16765 15105 8170 -1774 -9858 -15105 -15499 -10614
2966 -10614 -1420 8444 14134 16053 11526 3490 -5904 -13224 -16256 -12950 -5226 2966 12046 15198 13896
2981 13896 7941 -1371 -9565 -15084 -15097 -10024 -762 8290 14501 14886 10950 2770 -5444 -12483 -15144
2996 -15144 -12446 -5669 4137 11242 15145 12925 6904 -2012 -9706 -14336 -13979 -8797 -773 7908 13283
3011 13283 14350 10127 2056 -5559 -12587 -14803 -11754 -4455 3756 11133 15091 12721 6115 -1565 -9558
$$ packed form
2908A4285q999j0857q355l339K076Q017R815R409N440j358o670r960r677n806
2922a5979j302N647R149J0351P139J968l389q741j0157q271l343K259P295J0446
2936C072Q664M622o77p277r694q379o083l91N235Q840J0243P154J232m486q268
2951C807r798o896l417K634P521R562Q549M803j660o935r944q084n247l94M885
2966a0614R194R864N690J919m527q036r394p320l032L306P724Q192R080L152j302
2981A3896n955r312q194n519j3N073R262R052O211L85l936q180q214p039k661
2996a5144K698O777R806P105L903k220o021q916p694m630L57N182Q024Q681N375
3011A3283J067m223q071p615p028k216L049P299Q211P377L958k370o606p680p993
$$ plain form
3026 -9558 -14348 -13715 -8086 -228 8231 13088 13659 10335 2075 -5585 -12084 -14270 -10852 -4879 4053
3041 4053 10620 13969 11715 6041 -2320 -9474 -14150 -12303 -7220 -230 7796 13274 13591 9167 1573
3056 1573 -5667 -11984 -13579 -10478 -3558 4066 10398 13843 11789 5901 -2456 -8845 -13050 -12329 -7081
3071 -7081 128 8222 12914 12698 8756 1512 -6103 -11175 -13173 -10230 -3844 4539 10732 12930 11376
3086 11376 4865 -1842 -9271 -13300 -11570 -7093 911 7453 12744 12531 8847 1155 -5792 -11106 -12659
3101 -12659 -9605 -3190 4848 10323 12068 10614 4648 -2777 -9099 -11796 -11811 -5895 1369 7859 11963
3116 11963 12076 7852 1239 -6140 -11360 -12249 -8856 -2210 4079 9696 12388 9633 4607 -2635 -8531
3131 -8531 -11887 -11201 -6126 885 7501 11521 10940 7281 315 -5859 -10189 -11875 -8792 -2328 4679
$$ packed form
3026i558m790O33N629P858Q459M857N71l324q260p660o499k186L418N973Q932
3041D053O567L349k254n674q361p154m676J847N083O990Q026N478L17m424p594
3056A573p240o317j595L101O920P624O332L445k054n888q357o389m205P21N248
3071g081P209Q094M692k16l942p244p615n072j998K943O386Q383O193K198j554
3086A1376o511o707p429m029J730M477Q004O542N291k13l684p692o947n314j553
3101a2659L054O415Q038N475J745j454n966p425o322k697j5N916P264O490M104
3116A1963J13m224o613p379n220q89L393O646O289N617K692k755n026p242n896
3131h531l356O86N075P011O616M020n81l659o966o174m330j686L083O464P007
$$ plain form
3146 4679 10094 12203 9648 3740 -2588 -8773 -11311 -10255 -5441 1199 7234 11154 10829 7014 583
3161 583 -6246 -10720 -11537 -7836 -1754 4637 8816 11099 9060 3135 -3299 -8635 -11157 -10136 -5049
3176 -5049 2068 7752 11526 9915 6207 326 -6318 -10022 -11354 -7701 -1938 4826 9618 11468 8405
3191 8405 2976 -3302 -8773 -10939 -9826 -4806 1833 6792 9848 9689 6340 -222 -6098 -10532 -10426
3206 -10426 -6941 -1690 5001 9366 10217 7882 3061 -3241 -8314 -10344 -8926 -3708 2166 7295 10273
3221 10273 9667 5538 -386 -6044 -9604 -9991 -7084 -1085 4953 9263 9961 7686 2858 -3094 -8431
3236 -8431 -10358 -8329 -3892 1660 7029 9857 8645 5031 -669 -6156 -9880 -9113 -6271 -749 4479
3251 4479 9223 10105 7320 2082 -3587 -8753 -9779 -7941 -3211 2496 6793 9358 8130 5059 -1012
$$ packed form
3146D679N415K109k555n908o328o185k538J056M814O640O035L920l25l815o431
3161E83o829m474q17L701O082O391M179K283k039n925o434n336k522J021N087
3176e049P117N684L774j611l708n881o644l704j332L653N763O764M792J850l063
3191H405n429o278n471k166J113N020O639M959L056j59l349o562n876m434J06
3206a0426L485N251O691M365Q51k335m821o302n073k030J418N218N874N129K978
3221A0273o06m129n924n658l560l87K907N999O038M310O98k275m828n952n337
3236h431j927K029M437N552N369K828j212l614n700n487l724P67K842N522N228
3251D479M744Q82k785n238n669n166j026J838M730N707M297K565j228l071o071
$$ plain form
3266 -1012 -6195 -9679 -9566 -5458 -702 4809 8862 9632 6779 1846 -3603 -7820 -9602 -7596 -3740
3281 -3740 2688 6695 9292 8294 4252 -1103 -5434 -9286 -8526 -5703 -851 4576 8297 9566 6260
3296 6260 1449 -3596 -7533 -9233 -7336 -2901 2426 6284 9116 7821 4414 -1196 -6293 -8519 -8692
3311 -8692 -4650 -647 4849 8324 9505 6263 1125 -4214 -7081 -8604 -6980 -2431 2318 6604 8341
3326 8341 7999 3835 -791 -6395 -8360 -7738 -5051 339 4692 7415 7889 4815 875 -3831 -7630 -8537
3342 -8537 -6554 -1985 2451 5969 7767 7615 3317 -1590 -5558 -7820 -7556 -4543 449 4728 7359
3357 7359 7828 4991 614 -4271 -7415 -7215 -5716 -2053 2890 6334 8029 6619 2701 -1491 -5530
3372 -5530 -7403 -6887 -4222 688 4991 6881 6978 5240 528 -3608 -7114 -7576 -5255 -1432 2673 6228
$$ packed form
3266a012n183l484J13M108M756N511M053P70k853m933n449m217j782K006L856
3281c740O428M007K597r98m042n355m331l852P60K823M852N427L721J269l306
3296F260m811n045l937j700J897M435N327L858K832j295l407n610n097k226j73
3311h692M042M003N496L475J181l242n138n339k867j523J624M549M749M286J737
3326H341l42m164m626n604j965O22K687N390M353K723M74l074l940m706l799r07
3342h537J983M569M436L518J798j52m298m907l968k262K64L013M992M279K631
3357G359M69k837m377m885l144K00J499L663M943L444J695j410l918m192m039
3372e530j873N16K665M910M303J890R7j738m712m136l506m62K321L823M105L555
$$ plain form
3388 6228 7495 6340 2982 -2093 -5148 -7585 -6740 -3569 953 4597 6686 6931 4235 582 -3954
3403 -3954 -6590 -7143 -5412 -1728 2773 6326 7232 6022 2906 -1219 -4860 -7262 -6253 -3374 654
3418 654 3821 6870 6074 4502 615 -3593 -6646 -7022 -4761 -1663 2176 5781 6996 4779 1845 -1694
3434 -1694 -5365 -7140 -6245 -3383 844 4197 6559 6035 4272 290 -2991 -6597 -6699 -4106 -1194 2192
3450 2192 5780 6363 5377 2130 -2432 -5027 -6814 -5533 -2220 468 4132 5692 5491 3570 -85 -3629
3466 -3629 -4958 -6158 -4684 -1352 2802 5698 6287 4507 1409 -1904 -4685 -6338 -5282 -1893 861
3481 861 4319 5975 5135 3291 689 -2993 -5201 -4978 -3893 -440 2807 5446 6320 3771 1467 -2238
3497 -2238 -4553 -5963 -4580 -1782 1386 3847 6202 4994 3106 -294 -3435 -4829 -5126 -3932 -1060
$$ packed form
3388F228J267j155l358n075l055k437Q45L171M522L644K089K45k696l653m536
3403c954k636n53J731L684M501L553R06j210l116m125l641k402J009K879M028
3418F54L167L049p96j572l887m208l053l76K261L098L839L605J215k217k934l539
3434a694l671j775Q95K862M227L353K362n24j763l982l281l606j02K593K912L386
3450B192L588N83r86l247m562k595j787J281L313K688L664J560k01j921l655l544
3466c629j329j200J474L332M154K896N89j780l098l313k781j653J056L389K754
3481H61L458J656q40j844k602l682k208K23J085L453L247K639Q74k549k304l705
3497b238k315j410J383K798L168K461K355j208j888l400l141j394k97J194K872
$$ plain form
3512 -1060 2759 5020 5328 4110 1592 -1710 -4508 -5153 -4892 -1367 1693 3834 5161 4805 2584 77
3528 77 -2804 -4633 -4804 -3319 -970 2729 4625 4990 4319 1608 -1696 -3831 -5303 -5137 -1919 1359
3544 1359 3804 4734 5080 2198 -934 -3256 -4507 -5464 -2868 -332 2637 4371 4586 4137 1311 -1548
3560 -1548 -4183 -4882 -4494 -825 473 3594 4002 3574 2631 -190 -3147 -4979 -4361 -2794 -343 2290
3576 2290 4257 4596 3522 723 -1421 -4098 -4750 -3491 -1872 1157 3904 4883 4224 1757 -29 -2968
3592 -2968 -4130 -3967 -2735 -82 2411 4273 4542 3791 1150 -1663 -3872 -4530 -3703 -1043 1206 2991
3608 2991 4006 3738 2272 -900 -2592 -4134 -3938 -2403 -63 1530 4087 3694 3722 1178 -2305 -3001
3624 -3001 -3780 -3388 -1298 1326 3850 4228 3740 2995 199 -2636 -4016 -3510 -2961 20 1908 3890 4103
$$ packed form
3512a060L819K261L08j218k518l302k798o45K61L525L060K141J327l56k221k507
3528G7k881j829j71J485K349L699J896L65o71k711l304k135j472J66L218L278
3544A359K445R30L46k882l132k322j251r57K596K536K969J734K15m49k826k859
3560a548k635o99L88L669J298L121M08m28r43k821k957j832O18J567K451K633
3576B290J967L39j074k799k144k677o52J259J619L029K747R79o59k467j786k939
3592b968j162J63J232K653K493J862K69p51k641k813k209o58Q27K660K249J785
3608B991J015k68j466l172j692j542J96J535K340J593K557l93K8k544l483o96
3624c001p79L92K090K624K524L78m88p45k796k835j380N06N49K981J888J982K13
$$ plain form
3641 4103 2811 116 -1862 -3206 -3980 -3348 -950 972 3173 3819 3222 1971 -453 -2545 -3395 -3619
3657 -3619 -1774 15 2549 3277 3518 2953 686 -2030 -2844 -3960 -2590 -381 1286 2355 3300 3044
3673 3044 1386 -373 -2955 -3307 -3035 -2425 269 1738 3459 3858 2081 573 -2183 -2831 -3955 -2629
3689 -2629 -1177 1261 2710 2759 2990 1611 -419 -3266 -3717 -2677 -1821 166 2115 3283 3109 2356 698
3706 698 -1275 -3491 -3585 -2223 -305 1139 2491 3391 3036 953 -822 -2033 -3189 -2785 -2139 444 1472
3723 1472 3889 3255 2515 445 -1763 -2581 -2926 -2471 -529 1045 2572 3014 2416 1288 -1326 -2015 -2964
3740 -2964 -2089 -1614 220 1935 2875 2646 2268 378 -1263 -2155 -2192 -2471 -311 1049 1943 3243 1650
3757 1650 876 -852 -1926 -2863 -2345 -1256 115 1535 2583 2805 1454 678 -1399 -1540 -2870 -1787
$$ packed form
3641D103j292k695j978j344p74O32K398J922K201O46n97j251k424k092q50k24
3657c619J845J789K534P28K41n65k267k716q14j116J370K209J667J069R45k56
3673C044j658j759k582l52K72O10K694J469J721L99j777j508k756o48j124J326
3689b629J452K438J449M9K31j379k030k847m51J040Q56J987J949J168j74p53j658
3706F98j973k216r4J362J918J444J352R00l55k083j775j211j156M04O46K583J028
3723A472K417o34p40k070k208q18l45M55J942J574J527M42n98j128k614o89r49
3740b964Q75M75J834J715R40k29l78j890j641q92l7k79K160J360Q94J300j593
3757A650p74j728j074r37N18J089J371J420J048K22j351p76k077j41j330J083
$$ plain form
3773 -1787 -830 1084 1989 2424 1718 1519 -829 -2202 -2643 -1945 -842 4 1237 2689 2333 1045 78
3790 78 -969 -2141 -2505 -1870 -743 831 2117 2305 2478 658 -566 -1889 -2576 -2627 -1187 356 1313
3807 1313 1651 2399 1514 -586 -499 -2228 -1548 -1494 -1027 1051 2117 1837 2009 463 -702 -1350 -2276 -2019
3825 -2019 -1140 -26 1609 2404 2850 1789 7 -773 -2401 -1510 -1572 -155 689 1739 2108 1289 450 -301
3843 -301 -1627 -2419 -2051 -1346 514 1396 1724 1897 1261 -463 -734 -2063 -2030 -1532 -187 903 2222 1958
3861 1958 1918 -305 15 -1582 -1052 -1974 -834 61 1216 1792 1900 1548 -299 -1254 -1706 -1933 -1151 -60
3879 -60 699 1083 1607 1537 526 -579 -1304 -1345 -1490 -375 -60 1153 1494 1882 972 202 -1205 -1620 -1121
3898 -1121 -497 36 757 1601 1634 1616 234 -589 -1069 -1692 -1804 -995 -36 1298 1819 1529 1189 89 -767
$$ packed form
3773a787R57J914R05M35p06j99k348j373m41O98J103Q46J233J452l56j288r67
3790G8j047j172l64O35J127J574J286J88J73j820j224j323o87n1J440J543R57
3807A313L38P48q85k100Q7j729O80N4M67K078J066k80J72j546j165o48r26K57
3825b019Q79J114J635P95M46j061j782p80j628Q91o2J417Q44J050L69q19q39p51
3843c01j326p92L68P05J860Q82L28J73o36j724k71j329L3M98J345J090J319k64
3861A958m0k223L20j597N30r22J140Q95J155N76J08l52j847r55m52k27P82J091
3879f0P59L84N24p0j011j105p25m1j45J115L15J213L41L88r10p70j407m15M99
3898a121O24N33P21Q44L3j8j382q23m80o23j12Q09R59J334N21k90l40j100q56
$$ plain form
3917 -767 -1239 -1379 -1018 -355 336 1756 1370 1266 505 -390 -563 -1823 -1975 -419 -164 457 1303 489 689
3936 689 -386 -638 -1466 -907 -595 -359 292 1189 1654 1393 744 -503 -911 -850 -1009 -906 -319 1373 1577
3955 1577 2254 883 219 -1157 -892 -1429 -1469 -189 -127 1237 1533 1083 468 -410 -1383 -2042 -1821 40 1013
3974 1013 683 1786 1380 1040 234 -547 -1209 -1897 -1154 -1164 744 608 1355 1180 1117 263 -1295 -1289 -1160 -602
3994 -602 -357 1541 1535 805 1487 369 400 -1326 -1691 -349 -563 -354 703 870 932 986 -428 -873 -1290 -1613
4014 -1613 -928 -186 808 1359 941 1109 94 -251 -1481 -1763 -611 -655 -205 556 1129 1284 503 95 -695
4033 -695 -1545 -1030 -892 -614 -9 835 958 948 299 -430 -472 -1211 -643 -522 -337 242 1128 824 418 290 -968
4054 -968 -875 -1234 -898 -99 476 1194 876 1128 132 300 -755 -1082 -953 -1021 585 977 1408 1077 1165 -163
$$ packed form
3917g67m72j40L61O63O91J420l86j04p61q95j73j260j52J556K55O21Q46q14K00
3936F89j075k52q28N59L12K36O51Q97M65k61o49j247m08O1j59J03N87J692K04
3955A577O77j371o64j376K65n37m0J280O2J364K96m50o15q78r73o59K21J861R73
3974A013l30J103m06l40q06p81o62o88P43j0J908j36P47j75o3q54j558OJ29N58
3994f02K45J898op30O82j118L1j726l65J342k14K09J057J67O2N4j414m45m17l23
4014a613O85P42R94N51m18J68j015l45j230k82J152m4M50P61N73J55p81m08p90
4033f95q50N15J38K78O05Q44J23j0o49p29m2p39N68J21J85N79Q86l04m06j28j258
4054i68R3l59L36P99N75P18l18K52r96J68j055l27J29o8J606L92M31l31Q8j328
$$ plain form
4074 -163 -592 -1045 -1844 -710 -882 411 706 969 995 860 70 -963 -1672 -588 -887 -359 549 663 377
4093 377 521 304 -416 -648 -1421 -1005 -713 136 422 623 342 760 19 -405 -1122 -1230 -393 -409 661 1040
4113 1040 1079 1438 261 -404 -863 -999 -1003 -842 611 858 958 1698 912 -175 -1794 -904 -735 -608 -846
4132 -846 432 1418 2087 1366 619 -669 -626 -1516 -1120 -471 310 1211 625 624 553 -433 -585 -1217 -1504 -782 269
4153 269 571 849 1329 741 236 -58 -1024 -1157 -1281 -739 104 832 2100 750 877 281 -550 -1435 -799
4172 -799 -1014 -280 356 718 1482 762 -31 -236 -915 -1589 -848 -930 648 894 1162 972 962 120 -712 -1471
4192 -1471 -1163 -1203 -296 516 929 1512 958 722 -833 -1166 -739 -1662 -733 -464 934 1033 1438 1499 -97 -837
4212 -837 -1447 -1401 -422 -809 642 963 1490 1140 129 -229 -905 -1050 -1101 -971 108 822 873 1630 770 -275
$$ packed form
4074a63m29m53p99J134j72J293K95K63K6j35p90j033p09J084k99N28R08J14k86
4093C77J44k17p20k32p73M16K92Q49K86K01k81M18p41m24p17j08Q37j6J070L79
4113A040L9L59j177o65m59j36mJ61J453K47J00P40p86j087j619Q90J69J27k38
4132h46J278R86O69p21p47j288M3q90L96O49P81R01n86jp1r86j52o32k87P22J051
4153B69L02K78M80n88n05k94r66j33j24N42Q43P28J268j350J27n96q31q85O36
4172g99k15P34O36L62P64p20p93k05o79o74P41q2J578K46K68j90j0q42q32p59
4192a471L08m0R07Q12M13N83n54k36j555l33M27r23R29K69J398R9M05O1j596p40
4212h37o10M6R79l87J451L21N27l50j011l58o76j45n1J30J079P14N1P57q60j045
$$ plain form
4232 -275 -205 -1318 -1356 -763 -419 254 2003 998 918 745 -259 -1530 -1616 -998 -1233 191 852 1450 1461 1601
4252 1601 210 -993 -1628 -2088 -1467 -568 805 1372 1748 1695 440 -210 -470 -1333 -1733 -162 421 985
4270 985 977 1909 828 622 -723 -1297 -1441 -1352 -332 703 1639 1282 1377 894 -7 -1001 -1246 -1693 -947 194
4290 194 661 602 1675 1263 -110 -478 -1667 -1535 -1526 -244 422 244 1274 589 651 12 -864 -1390 -1364 -673
4310 -673 -78 574 1353 1203 461 705 -1069 -1497 -1304 -375 -89 716 1160 1463 1067 183 -1225 -1214 -1946 -1430
4330 -1430 -835 694 910 1473 1545 509 -163 -293 -1065 -1509 -1549 -2 948 1576 1670 1499 624 -267 -1293
4349 -1293 -1530 -1443 -319 -410 906 1532 1352 1278 434 -383 -1762 -1362 -1169 -391 844 959 1975 1290 366
4368 366 -595 -410 -1718 -2220 -898 55 1255 1753 1205 1165 749 -1096 -1523 -1603 -715 -331 876 1309 1935
$$ packed form
4232b75P0j113l8N93L44O73J749j005q0j73j004j271q6O18k35J424O61N98J1J40
4252A601j391j203o35m60O21Q99J373N67L76n3j255o50k60q63m00J571N83N64
4270I85qR32j081k06j345n74j44Q9J020J035R36l57R5m83r01r94k45m47P46J141
4290A94M67n9J073m12j373l68j189J32RJ282O66j78J030o85O2o39q76n26K6O91
4310f73N95O52P79j50p42K44j774m28J93R29K86Q05M44L03l96q84j408J1p32N16
4330a430N95J529K16N63P2j036o72j30p72m44m0J547R50O28R4j71q75q91j026
4349a293k37Q7J124r1J316O26j80p4q44q17j379M00J93P78J235J15J016o85r24
4368C66r61J85j308n02J322R53J200M98n48m0m16j845m27q0Q88L84J207M33O26
$$ plain form
4387 1935 1229 551 -113 -992 -1809 -2298 -783 285 1337 1754 1244 1653 30 -1009 -1467 -1548 -1303 -488
4405 -488 1203 1226 1584 1081 571 -7 -1380 -2343 -2010 -1203 485 1455 1389 1653 1365 -486 -1348 -1410 -1739 -1066
4425 -1066 -37 1104 1410 2388 1419 1071 -662 -2452 -2102 -1347 -780 -6 757 1869 1722 818 -31 -1751
4443 -1751 -1489 -1848 -1481 -124 673 1337 1931 1562 362 -609 -1611 -1754 -1041 -559 491 1019 2823 2138
4461 2138 1212 -21 -606 -1915 -1715 -831 -67 747 1112 1929 1832 618 -472 -1495 -2869 -1885 -446 -38
4479 -38 1089 1223 2312 1015 1 -778 -2294 -1597 -1037 -122 1276 2024 1936 1405 572 -702 -1413 -2147
4497 -2147 -1818 -529 614 1273 2098 1675 1500 220 -1456 -1980 -2042 -1977 -711 982 1531 1888 1771 61
4515 61 -838 -2017 -2953 -1848 -457 249 1552 2363 1993 846 -382 -1363 -2371 -1992 -1351 -19 1193
$$ packed form
4387A935p06o78o64q79q17m89J515J068J052M17n10M09j623j039m58q1K45Q15
4405d88J691K3L58n03n10n78j373r63L33Q07J688R70o6K64k88j851q62o2l29O73
4425a066J029J141L06R78r69l48j733j790L50P55N67P74P63J112j47r04q49j720
4443a751K62l59L67J357P97O64N94l69j200r71j002j43P13M82J050N28J804o85
4461B138r26j233n85j309K00Q84P64Q14L65Q17r7j214j090j023j374R84J439M08
4479c8J127J34J089j297j014p79j516O97N60R15J398P48q8n31q33j274p11p34
4497b147L29J289J143O59Q25m23j75j280j676n24o2O5J266J693N49L57j17j710
4515F1q99j179r36J105J391P06J303Q11l70j147j228r81j008L79O41J332J212
$$ plain form
4532 1193 2258 1670 1021 -161 -1201 -1456 -2843 -2187 -877 970 1979 2404 2143 997 -409 -1989
4548 -1989 -2379 -2276 -1208 506 1042 2224 2176 1444 375 -528 -1639 -2660 -1674 -232 214 1786 2220
4565 2220 1813 666 -420 -2219 -1950 -1807 -1005 -410 1063 2040 1778 1817 179 -494 -2167 -1953 -2150 -638
4583 -638 1358 2253 2449 1859 1102 -168 -1626 -2453 -1785 -1483 -189 1527 2154 2629 1560 -152 -789 -2104
4601 -2104 -2818 -1887 -872 850 1886 2447 1913 1041 -359 -1605 -2539 -2048 -878 366 1645 2689 2503
4618 2503 1555 315 -1843 -2005 -2548 -1642 -268 1034 1676 2346 2213 805 -821 -2027 -2709 -2019 -596
4635 -596 175 1615 2532 2062 1183 -430 -1896 -2421 -1712 -662 -296 1514 2165 2142 943 294 -1109 -1671
4653 -1671 -2213 -2000 -796 620 2161 2895 2442 1191 156 -1687 -2475 -1808 -961 8 1296 2344 2507
$$ packed form
4532A193J065n88o49j182j040k55j387O56J310J847J009M25k61j146j406j580
4548a989l90J03J068J714N36J182m8p32j069r03j111j021R86J442M46J572M34
4565B220m07j147j086j799K69J43Q02N95J473R77k62L9j638o73j673K14j97J512
4583f38J996Q95J96n90p57j270j458q27O68L02J294J716O27M75j069j712o37j315
4601b104p14R31J015J722J036N61n34q72j400j246r34M91J170J244J279J044j86
4618B503r48j240k158j62n43R06J374J302O42O70j33j408j626j206o82O90J423
4635e96P71J440R17m70q79j613j466n25P09J050L66J810O51k3j199o49j403n62
4653a671n42K13J204J416J541P34m53j251j035j843p88O67Q47R69J288J048J63
$$ plain form
4670 2507 1609 771 -551 -1905 -2886 -2107 -923 1014 2292 2381 2513 1106 -53 -2467 -2832 -2710 -1252
4687 -1252 -122 1540 2781 1981 2186 -118 -771 -2126 -3013 -2715 -634 401 1743 2938 1665 918
4703 918 -750 -2160 -2253 -2457 -1487 -116 1801 2351 2326 1920 320 -1138 -1831 -2645 -1880 -942 901 2224
4721 2224 2523 2332 1251 -545 -2097 -2670 -2130 -1062 -537 1565 2951 2098 2113 132 -1253 -2474 -2818
4738 -2818 -1986 -631 1229 1979 2974 2361 970 -1049 -2165 -2841 -2508 -1160 462 2570 2832 2559 1942
4755 1942 228 -1022 -2715 -2865 -2206 -123 1493 2429 2620 2803 776 -1600 -1558 -2382 -2284 -1647 223 2139
4773 2139 2563 2684 1539 12 -1747 -3004 -2556 -2235 -644 1641 3079 2472 2010 328 -866 -2390
4789 -2390 -2552 -2058 -1404 997 2133 2258 2323 1493 -104 -1788 -2698 -2747 -2014 -673 1444 2231 3052 2327
$$ packed form
4670B507q98q38j322j354r81P79J184J937J278Q9J32j407j159k414l65J22J458
4687a252J130J662J241q00K05k304o53j355q87K98K081J035J342J195j273p47
4703I18j668j410r3k04R70J371J917N50k5m06j600j458o93q14P65R38J843J323
4721B224K99j91j081j796j552n73N40J068N25K102J386q53J5j981j385j221l44
4738b818Q32J355J860P50R95o13j391k019j116o76L33J348J622K108K62k73o17
4755A942j714j250j693j50O59K083J616R36J91J83k027k376M2q24R8O37J870J916
4773B139M24J21j145j527j759j257M48L21J591K285J438o07m62j682j194j524
4789b390j62M94O54K401J136J25O5q30j597j684r10m9P33J341K117P87Q21p25
$$ plain form
4807 2327 430 -1494 -2383 -3109 -2596 -830 740 1756 2806 2711 1785 684 -1955 -3163 -2696 -1950 85
4824 85 2205 2807 2711 1839 -615 -2029 -3253 -3288 -2113 -164 1371 2835 2482 2323 2022 -393 -1940 -2812
4842 -2812 -2417 -1689 -195 1931 2068 2711 1921 110 -1377 -3001 -2637 -1945 -1001 1216 3412 2238 2374
4859 2374 1397 -764 -2100 -2595 -2663 -2365 318 934 3214 2699 1921 106 -1191 -2762 -3290 -2398 -226
4876 -226 872 2609 3089 2492 1117 -649 -2052 -2777 -3041 -1396 223 1628 3118 3094 1614 317 -1360
4893 -1360 -2593 -3237 -2715 -533 1543 2570 3535 2527 1041 -1149 -2749 -2884 -2515 -1152 515 1995
4909 1995 3638 2749 1173 -120 -2137 -3142 -3675 -2457 -515 1322 2423 2509 2612 784 -1440 -2412
4925 -2412 -3054 -2494 -1532 248 2913 3129 3219 1217 -184 -2357 -2647 -2728 -2332 -442 1141 3019 3406 2861
$$ packed form
4807B327j897j924q89p26N13J766J570J016J050r5r26j101k639j208M67P46K035
4824H5K120O02r6q72k454j414j224l5J175J949J535J464l53j59l01k415j547q72
4842b812L95P28J494K126J37O43p90j811j487j624L64O92R44K217K196j174J36
4859B374r77k161j336m95o8K98K683O16K280n15p78j815j297j571n28Q92K172
4876b26J098J737M80n97j375j766j403p25k64J645J619J405J490k4j480j297j677
4893a360j233o44N22K182K076J027R65j008j486k190j600j35L69J363J667J480
4909A995J643q89j576j293k017j005n33J218J942J837J101Q6J03j828k224r72
4925b412o42N60R62J780K665K16R0k002j401k173k90q1L96J890J583J878L87n45
$$ plain form
4943 2861 1208 -749 -2837 -3041 -2228 -1233 411 2400 3296 3012 1809 -2 -1860 -3229 -3188 -1386 -355
4960 -355 1499 2667 3614 1958 513 -1439 -2426 -3214 -2615 -1372 802 2538 3018 3055 975 -64 -2512
4977 -2512 -2523 -3769 -2471 125 1817 2347 3052 2308 912 -996 -2913 -3705 -3057 -1403 1553 2270 3354
4994 3354 2552 1362 -950 -2208 -2835 -3693 -1609 -353 1587 3019 3742 2884 635 -1217 -2817 -3416
5010 -3416 -2970 -1112 604 2381 3534 2768 1195 -166 -2227 -3653 -3028 -2727 177 1896 3591 2980
5026 2980 2096 423 -863 -3022 -2963 -2984 -796 1326 2374 3423 2460 1938 -606 -2275 -3080 -3155 -1921
5043 -1921 408 2853 3638 2550 2217 882 -2035 -3197 -3403 -2569 -333 974 3175 3277 2874 1595
5059 1595 -702 -3023 -3385 -3248 -1164 345 2129 3502 3012 2176 12 -2152 -3738 -3250 -2342 -1432 1621
$$ packed form
4943B861j653j957k088k04Q13R95J644J989Q96k84j203j811j858j369M1J802J031
4960c55J854J168R47j656j445j952r87p88N99J243K174J736M80L7k080j039k448
4977b512j1j246J298K596J692N30P05p44j396j908j917p92O48J654K956P17J084
4994C354q02j190k312j258o27q58K084J256J940J432P23q58k249j852j600n99
5010c416M46J858J716J777J153p66j573j361k061j426O25L01K904J719J695o11
5026B980q84j673j286k159N9k1K188K122J048J049r63n22k544j669q05p5J234
5043a921K329K445P85j088l33j335k917j162k06Q34K236J307K201J02m03j279
5059A595k297k321l62J37K084J509J784J373m90q36k164k164j586M88R08R10L053
$$ plain form
5076 1621 2808 3539 2920 826 -1573 -2959 -3576 -3003 -1524 -4 2108 3651 3200 2382 -373 -2399
5092 -2399 -2875 -3658 -2377 -780 1613 3538 3306 2761 1342 -751 -2201 -3847 -3448 -1165 1186 2254
5108 2254 3633 2750 2394 -89 -1892 -3694 -3744 -1810 -864 1787 3098 3555 2540 790 -1272 -3031
5124 -3031 -4180 -3606 -1770 932 2674 3407 3449 2063 -533 -2494 -3127 -3536 -2011 -324 2254 2961 3656
5141 3656 2779 1031 -1054 -2755 -4092 -2647 -1076 1119 2785 3746 3166 2400 -398 -2201 -3452 -3950
5157 -3950 -1805 -954 1600 3484 3552 2517 415 -1510 -3072 -3545 -2820 -1558 825 2567 3670 3050
5173 3050 1797 -443 -1971 -4106 -3987 -2251 -60 2042 3057 3922 3188 777 -2038 -3440 -3886 -2750
5189 -2750 -988 747 2609 3615 3361 1670 -361 -2299 -3962 -3455 -1910 17 1813 4049 3501 2248
$$ packed form
5076A621J187P31o19k094k399j386o17N73J479J520K112J543m51q18k755k026
5092b399m76p83J281J597K393J925k32n45j419k093j450j646L99K283K351J068
5108B254J379q83l56k483j803j802n0J934R46K651J311M57j015j750k062j759
5124c031j149N74J836K702J742P33M2j386k596j961o33m09J525J687K578P07O95
5141C656q77j748k085j701j337J445J571K195J666R61n80p66k798j803j251m98
5157c950K145Q51K554J884O8j035k102j925j562m73P25J262K383J742J103o20
5173C050j253k240j528k135J19J736K191K102J015Q65p34k411k815j402m46J136
5189b750J762J735J862J006k54j691k031j938j663N07J545J927J796K236n48j253
$$ plain form
5205 2248 620 -2065 -3281 -4002 -3015 -1561 917 2755 3910 3578 1753 -696 -2534 -3868 -3237 -2012
5221 -2012 395 2004 3237 3165 2863 572 -1916 -2956 -3546 -2947 -1367 1239 2787 3903 3488 1749
5237 1749 -1114 -2479 -3832 -3121 -1879 209 2305 2825 3148 2562 355 -1641 -3515 -3798 -2789 -680
5253 -680 1517 2892 3571 3586 917 -788 -3164 -3285 -3740 -1982 670 2134 3454 3644 2449 394 -1675
5270 -1675 -3464 -4059 -2122 -698 1484 3156 3517 3224 1000 -1226 -2669 -3874 -3700 -1632 234 2686
5286 2686 2542 3758 1557 765 -1519 -3838 -3690 -2632 -656 1179 3367 3610 2570 994 -1330 -2962
5302 -2962 -3933 -2646 -1789 779 2366 3520 3943 2532 239 -2429 -2693 -4096 -2317 -850 1490 3925
5318 3925 3734 2435 739 -787 -2747 -4045 -3349 -1291 815 3137 3501 2956 1558 323 -2252 -3103
$$ packed form
5205B248j628k685j216p21R87J454K478J838J155l32j825k449j838j334O31J225
5221b012K407J609J233p2l02k291k488j040n90N99J580K606J548J116m15j739
5237A749k863j365j353P11J242K088K096N20L23n86k207j996j874k83J009K109
5253f80K197J375O79J5k669j705k376j21m55J758K652J464J320J90j195k055k069
5270a675j789n95J937J424K182J672L61k93k224k226j443j205J74K068J866K452
5286B686j44J216k201p92k284k319J48J058J976J835K188K43j040j576k324j632
5302b962r71J287Q57K568J587J154M23j411k293k668k64j403J779J467K340K435
5318C925j91j299j696j526j960j298O96K058K106K322L64n45j398j235k575q51
$$ plain form
5334 -3103 -3703 -2078 -557 2303 3424 3887 2676 972 -991 -2916 -4392 -2564 -1266 501 2925
5349 2925 3588 3927 1319 -436 -2074 -3698 -3714 -2430 -775 1871 3498 3679 3016 669 -1684 -2852
5365 -2852 -3544 -3284 -1743 1299 2765 4857 3581 2094 261 -2307 -3792 -4139 -2043 -505 1948 3362
5381 3362 3825 3079 310 -1408 -3807 -4079 -3143 -1124 942 2140 3037 3306 1824 -399 -2793 -4000
5397 -4000 -3420 -2514 97 2054 3492 3866 2695 644 -1626 -3368 -4486 -2976 -1565 1780 3043 3816
5413 3816 3282 1616 -113 -2642 -3855 -3917 -2019 253 2141 3908 3693 2432 339 -1467 -3100 -3171
5429 -3171 -2804 -1227 2073 2888 3257 3600 1554 -957 -2468 -3318 -3135 -2703 -235 2209 3588 3784 2243
5446 2243 318 -1664 -3008 -3476 -1925 -1138 898 3615 4021 3395 1246 -850 -2965 -4348 -3372 -2519
$$ packed form
5334c103o00J625J521K860J121M63j211j704j963j925j476J828J298J767K424
5349B925O63L39k608j755j638j624j6J284J655K646J627J81o63k347k353j168
5365b852o92K60J541L042J466K092j276j487j833k568j485l47K096J538K453J414
5381C362M63p46k769j718k399k72R36K019K066J198Q97K69j482k223k394j207
5397d000N80R06K611J957J438L74j171k051k270j742j118J510J411L345J263P73
5413C816n34j666j729k529j213o2J898K272J888J767k15j261k093j806j633p1
5429c171L67J577L300Q15L69L43k046k511j511q50J83M32K468K444J379J96j541
5446B243j925j982j344m68J551P87K036K717M06o26k149k096k115j383R76Q53
$$ plain form
5462 -2519 232 2400 3709 3218 2793 351 -1831 -2866 -4251 -2730 -694 1565 3083 3837 3234 916
5478 916 -1548 -2616 -4238 -3342 -2015 530 1891 3378 3780 2099 702 -1988 -3327 -3599 -2296 -581
5494 -581 1556 3252 3421 2868 987 -1265 -2437 -3944 -3316 -1237 196 2481 3303 3579 2174 522
5510 522 -2403 -3244 -3529 -2198 -864 1548 3153 3892 2824 789 -1289 -2321 -3939 -3218 -1670 701
5526 701 2316 3610 3406 1898 -314 -2158 -3208 -4024 -2751 35 1986 3288 3631 2395 944 -1246
5542 -1246 -2820 -3572 -3285 -1827 621 2210 4073 3249 1326 372 -1665 -3473 -3604 -2332 -659 2583
5558 2583 3398 3980 2669 1222 -1838 -3150 -3433 -2941 -1057 1647 1882 4030 2977 806 -518 -2373
5574 -2373 -3298 -3440 -1920 -205 1786 2971 3693 2342 815 -1694 -2804 -3671 -3351 -1465 1192 2589
$$ packed form
5462b519K751K168J309m91m25k442k182j035j385J521K036K259J518P54o03k318
5478I16k464j068j622Q96J327K545J361J487M02j681j397k690j339k72J303J715
5494e81K137J696J69n53j881k252j172j507O28K079J433K285Q22K76j405j652
5510E22k925q41k85J331J334K412J605P39j068k035k078j032j618P21J548K371
5526G01J615J294k04j508k212j844j050q16J273K786J951J302L43j236j451k190
5542a246j574p52K87J458K448J589J863q24j923r54k037j808j31J272J673L242
5558B583Q15N82j311j447l060j312k83M92J884K704K35K148j053k171j324j855
5574b373r25j42J520J715J991J185P22j351j527k509j110q67L20J886K657J397
$$ plain form
5590 2589 2957 2597 1819 -399 -1959 -3239 -3324 -2218 42 2681 3343 3654 2804 246 -1209 -3005 -4066
5607 -4066 -2836 -307 1344 3020 3910 3123 1452 -656 -1738 -3053 -3160 -1321 -128 1520 3801 4059
5623 4059 3235 472 -1865 -2652 -3029 -2825 -1302 1681 2743 3758 2714 1006 -140 -2496 -3487 -3218
5639 -3218 -1827 -51 2245 3018 2872 1715 540 -2055 -2869 -3624 -2367 -859 1073 2884 3782 2982
5655 2982 1335 -874 -3275 -3648 -3237 -1385 269 2126 3703 3603 1784 -162 -1736 -2828 -3861 -2816
5671 -2816 -1250 1383 2451 3539 2612 1245 -1166 -2720 -3481 -3353 -1784 204 2451 3323 3328 1933 0
5688 0 -2176 -3253 -3340 -1875 -551 800 2922 3854 2995 1146 -836 -2762 -4013 -3079 -828 839 2194
5705 2194 3512 3094 1802 -29 -1545 -3415 -3275 -2709 -538 1428 2945 3921 2178 697 -928 -2766
$$ packed form
5590B589L68l60p78k218j560j280q5J106K260K639O62L11q50k558j455j796j061
5607d066J230K529J651J676Q90p87j671k108j082j315j07J839J193J648K281K58
5623D059q24k763k337p87l77K04J523K983J062J015j044j708j146k356r91K69
5639c218J391J776K296P73j46j157j175k595q14p55J257J508J932J811Q98q00
5655B982j647k209k401l73M11J852J654J857J577j00j819j946j574j092j033J045
5671b816J566K633J068J088r27j367k411j554p61J28J569J988K247Q72Nj395j933
5688@k176j077q7J465J324J351K122R32q59j849j982j926j251R34K251J667J355
5705B194J318m18j292j831j516j870J40N66K171J966J517R76j743j481j625j838
$$ plain form
5721 -2766 -3812 -3391 -1168 515 2926 3751 3295 1732 -556 -1829 -3733 -3462 -2223 -286 1554 2326
5737 2326 3812 3260 1264 -1624 -3274 -3504 -2683 -1249 1500 2546 4047 3376 1774 -74 -2407 -2827
5753 -2827 -3648 -1848 -416 1915 3122 3276 2081 757 -1282 -2140 -3465 -2810 -984 779 2103 3592
5769 3592 3204 1169 -172 -1800 -4089 -3295 -1747 268 1917 3447 3243 2384 964 -1909 -3160 -3407
5785 -3407 -2662 -1396 1216 2629 3448 2815 1367 125 -2350 -3882 -2818 -1924 199 1251 3104 3286
5801 3286 2502 338 -1874 -2932 -3995 -3200 -450 971 2474 3631 3264 1899 -627 -2903 -3059 -2937
5817 -2937 -1378 773 1839 3247 3323 2285 530 -1585 -2449 -2906 -2810 -951 882 2537 3657 2214
5833 2214 718 -68 -2647 -3274 -2781 -1506 -163 2396 3140 2782 1823 31 -939 -3268 -2638 -2600 -747
$$ packed form
5721b766j046M21K223J683K411Q25m56j563k288j273j904K71J239J937J840P72
5737B326J486n52j996k888j650k30Q21J434K749J046J501o71j602j848k333m20
5753b827q21J800J432K331J207J54j195j324k039q58j325O55J826J763J324J489
5769C592l88k035j341j628k289P94J548K015J649J530k04q59j420k873j251k47
5785c407P45J266K612J413Q19o33j448j242k475j532J064Q94K123J052J853J82
5801C286p84k164k212j058j063P95K750J421J503J157l67j365k526k276j56J22
5817b937J559K151J066J408P6j038j755k115q64m57R6J859J833J655J120j443
5833B214j496p86k579o27M93J275J343K559P44l58r59j792r70k329O30L8J853
$$ plain form
5850 -747 1704 2712 3021 2628 1429 -957 -2184 -2724 -3985 -1558 492 2338 3264 3022 1840 -1
5866 -1 -1739 -2843 -3448 -2602 -544 1305 3240 3440 2934 1201 -737 -1812 -3316 -2657 -1081 166 1748
5883 1748 2900 3065 1632 21 -1448 -2853 -3415 -2382 -48 878 2833 3190 2287 140 -823 -2265
5899 -2265 -3125 -2906 -1925 572 2896 2666 3140 1212 190 -1003 -3013 -2855 -2146 -518 907 2781 3613
5916 3613 2587 716 -1414 -2279 -2791 -3374 -1166 824 2451 3347 3239 1650 567 -1741 -3212 -2376
5932 -2376 -1751 -579 1655 3648 3265 2389 806 -1288 -3138 -2810 -2696 -1014 213 2293 2917 3123 1929
5949 1929 -665 -2411 -3034 -3175 -1684 34 1378 2808 3279 1664 409 -1385 -2349 -3460 -3034 -612
5965 -612 708 2600 3241 2981 1750 -292 -2421 -2457 -2609 -1366 -733 2328 1821 2923 1802 971 -1089
$$ packed form
5850g47K451J008L09l93j199k386j227n40j261K427K050J846R26k42j182j841
5866aj738j104o05Q46K058J849J935K00n06j733j938j075j504O59J576J247J582
5883A748J152J65j433j611j469j405n62J033K334R26J955L57r03k147r63j442
5899b265q60K19R81K497K324k30M74j928j022j193k010J58P09J628J425J874Q32
5916C613j026j871k130q65n12n83K208J990J627Q96j08j589j083k308j471Q36
5932b376O25J172K234J993l83q76j583k094j850L28J14J682J227K080O24K06j194
5949A929k594j746o23j41J491J718J344J430M71j615j255j794r64j111M26K422
5965f12J320J892O41k60j231k042k129l6j52J243O33L061n07J102j121q31k060
$$ plain form
5982 -1089 -2866 -2806 -2360 -696 625 2208 3258 2338 1281 -984 -2348 -2053 -2215 -1513 118 1278 2553
5999 2553 3110 1841 156 -1431 -2112 -2760 -1700 -1193 1194 2431 3196 2038 1103 -925 -1918 -2927 -2727
6016 -2727 -1718 -135 1963 2909 2927 1861 895 -1520 -2957 -3140 -1692 -640 1197 2505 3415 2313
6032 2313 1218 -190 -1819 -2681 -2591 -2045 328 2042 3234 2758 1437 260 -1538 -2624 -2843 -1819
6048 -1819 -601 848 2811 2999 2594 958 -219 -2596 -3019 -2885 -770 298 1891 2733 2762 1463 -216
6065 -216 -1788 -3179 -2235 -2494 -598 1148 2069 2873 2095 1041 -563 -1945 -3337 -2369 -755 -326 2183
6082 2183 2504 2243 1533 -55 -1473 -2725 -2160 -1600 -503 1488 3282 3162 2173 870 -1143 -2698 -3098
6099 -3098 -2455 -906 292 2301 2521 2534 1409 -550 -1880 -3088 -3106 -1965 230 1327 2784 2428 1950
$$ packed form
5982a089j777O0M46J664J321J583J050r20j057k265j364K95j62P02J631J160J275
5999B553N57j269j685j587o81o48J060N07K387J237P65j158r35k028r93j009K00
6016b727J009J583K098R46J8j066r66k415j437j83J448J052J837J308R10j102
6032B313j095j408j629q62R0N46K373J714J192m76j321j177j798j086k19J024
6048a819J218J449J963J88m05j636j177k377m23J34K115J068J593Q42K9j299j679
6065b16j572j391R44k59J896J746R21Q04p78j054j604j382j392R68J614M29K509
6082B183L21k61p10j588j418j252N65N60J097J991J794j20r89j303k013j555m00
6099c098O43J549J198K009K20J3j125j959j330j208j8J141K195J097J457l56m78
$$ plain form
6116 1950 971 -1081 -2440 -3338 -2182 -1201 790 2109 2583 2140 1355 -547 -1527 -2546 -2053 -1913 15
6133 15 1712 2672 2269 2093 613 -447 -2459 -2704 -2167 -993 808 2011 2436 2487 1238 -643 -2136
6150 -2136 -2555 -3073 -1344 255 1607 2947 2639 1871 823 -1508 -1673 -2784 -2342 -904 1120 2039 3237
6167 3237 2586 899 -232 -2569 -2621 -2190 -1561 -709 1748 2465 3218 1999 403 -2004 -2323 -3068 -1394
6184 -1394 -707 565 2305 2378 2712 1288 -558 -2738 -2790 -1993 -1832 52 1051 2059 2407 1624 277 -989
6202 -989 -2511 -2316 -2389 -850 710 1881 2722 2355 1184 -944 -2307 -3130 -2907 -980 235 1508 2708
6219 2708 3016 1714 112 -1497 -2484 -2032 -1871 -235 1253 2712 2853 2360 1029 -483 -2520 -2469 -2680
6236 -2680 -1434 -444 1278 2299 1704 1771 -242 -1732 -2027 -2653 -1787 165 1102 2358 2124 2314 166
$$ packed form
6116A950r79k052j359q98J156R81J991J319M74m43p85j902r80j019M93J40J928
6133A5J697R60m03j76j480j060k012k45N37J174J801J203M25N1j249j881j493
6150b136m19n18J729J599J352J340l08p68j048k331j65j111M42J438K024R19J198
6167C237o51j687j131k337n2M31O29Q52K457P17P53j219j596k407l19p45J674
6184a394O87J272J740P3L34j424j846k180n2P97J61J884R99J008L48p83j347j266
6202i89j522J95p3J539J560J171Q41l67j171k128j363q23K23J927J215J273J200
6219B708L08j302j602j609r87M52J61J636J488J459J41m93j331j512k037N1k11
6236b680J246R90J722J021n95O7k013j490k95o26Q66J952R37J256k34J90k148
$$ plain form
6253 166 -928 -2457 -2460 -2694 -485 588 1597 2717 2259 1109 -132 -1495 -1919 -2660 -2297 -426 1740
6270 1740 2185 2762 1972 700 -873 -2032 -2168 -2332 -698 619 1498 2454 2047 1311 -43 -1609 -2175
6287 -2175 -2890 -1638 -429 1143 2714 2770 1746 547 -1043 -1768 -2852 -2067 -918 158 2060 2821
6303 2821 2235 1807 -226 -1530 -2553 -3162 -1266 25 1320 3113 2604 1500 51 -1126 -2558 -2858
6319 -2858 -2179 -709 446 2269 2250 2083 1073 -170 -1500 -2125 -2209 -1617 128 1149 2555 2206 1656
6336 1656 503 -712 -2170 -2638 -1719 -692 574 1530 2095 2584 1053 -651 -2296 -2356 -2165 -1159 95
6353 95 1257 2226 2108 2280 441 -780 -2534 -2258 -1476 -725 1220 1825 3024 2581 831 -947 -1103 -2212
6371 -2212 -2708 -1447 77 2042 1394 2220 1188 137 -1564 -2542 -2550 -1933 -696 889 2429 2840 2543
$$ packed form
6253A66j094j529lk34K209J073J009J120m58j150j241j363m24p41L63J871K166
6270A740M45N77p90j272j573j159j36j64J634J317Q79R56m07p36j354j566n66
6287b175p15J252J209J572J571N6j024j199j590p25j084P85J149J076J902P61
6303B821n86m28k033j304j023o09J896J291J295J793n09j104j449j177j432l00
6319b858O79J470J155J823j9j67j010j243j330o25q4N92J745J021J406l49n50
6336A656j153j215j458m68R19J027J266R56N65M89j531j704j645o0J91J006J254
6353I5J162R69j18J72j839j221j754K76P82P51J945O05J199m43j750j778j56j109
6371b212m96J261J524J965o48Q26j032j051j701r78qO17J237J585J540M11k97
$$ plain form
6388 2543 937 -538 -2233 -1943 -2337 -1246 -193 1809 2464 2733 1678 177 -1341 -2175 -2337 -1983 -351
6405 -351 1002 2601 2359 2000 185 -1121 -1962 -3013 -2025 -327 1275 1813 1795 1390 1653 -420 -1134 -2697
6423 -2697 -2052 -2091 -775 807 2074 3053 928 933 -436 -1779 -2355 -1816 -918 331 1742 2554 2327 1323
6441 1323 -611 -1728 -2430 -2255 -1437 -227 1472 1560 2383 1774 535 -791 -1747 -2077 -2102 -1186 361 1805
6459 1805 2454 2112 1498 -9 -1763 -2204 -2042 -1553 -290 1701 2060 2276 2074 128 -1117 -2259 -2458
6476 -2458 -1623 -638 139 1651 2095 2042 1363 -390 -1643 -2658 -2103 -1363 -148 1581 3218 2063 2084 485
6494 485 -1026 -1828 -2573 -1999 -141 365 2383 2156 1902 963 -335 -1861 -2287 -2586 -1452 250 1590
6511 1590 1698 2279 1670 135 -1235 -2556 -2247 -1954 -1101 798 1289 2815 1397 783 -276 -1046 -1775
$$ packed form
6388B543j606j475j695K90l94J091J053K002O55K69j055j501j518q34j62L54J632
6405c51J353J599k42l59j815j306q41j051R88J698J602N38j8m05K63k073p14j563
6423b697O45l9J316J582J267R79k125Nj369j343n76N39Q98J249J411Q12k27j004
6441A323j934j117p02J75Q18J210J699Q8Q23o09j239j326r56l30k5R16J547J444
6459A805O49l42o14j507j754m41J62M89J263J991L59K16k02j946j245j142j99
6476b458Q35R85P77J512M44n3o79j753j253j015N55P40J215J729J637j155K1j599
6494D85j511q02p45N74J858N06K018k27k54r39j298j526m26k99J134J702J340
6511A590J08N81o09j535j370j321L09K93Q53J899M91J526j418o14j059p70p29
$$ plain form
6528 -1775 -1740 -1253 142 1294 2247 2423 2011 144 -867 -1757 -2349 -1796 -221 876 1347 2231 1947 652
6546 652 -378 -1681 -2134 -1558 -262 378 1232 2205 2415 1381 -378 -1175 -2421 -2545 -1437 -476 881
6563 881 2525 2667 1622 877 -848 -1611 -2289 -2722 -946 804 1341 1803 2409 842 502 -1379 -1488 -1706
6581 -1706 -1416 35 1003 1650 1946 2719 650 -536 -1425 -2706 -1986 -1119 514 1308 1779 1932 1377 -547
6599 -547 -1851 -1789 -2353 -1798 222 877 1726 2605 1506 504 -963 -1054 -2351 -1971 -710 638 2001 2905
6617 2905 1696 904 -323 -1253 -1822 -2190 -1139 -616 494 1731 2050 1620 1091 -344 -1463 -2442 -1717
6634 -1717 -405 496 1324 2728 1756 775 -100 -1108 -1932 -2409 -1176 -2 574 1842 1569 1670 86
6651 86 -818 -1232 -2093 -1345 -535 25 1825 2401 2310 681 -287 -1517 -2037 -1819 -1428 -596 1073 1468 1663
$$ packed form
6528a775L5M87J395J152R53J76m12j867j011q90n92N53J575J097M71Q84k84j295
6546F52j030j303m53N76J296O40Q54R73K10j034j759p97j246j24J108R61J357
6563H81J644J42j045p45j725p63o78m33J776J750N37M62O06j567l40j881j09k18
6581a706K90J451R68O47K96P73k069j186q89j281P20Q67J633P94M71J53n55j924
6599e47j304O2n64N55K020O55Q49Q79j099j002j467r1j297L80J261J348J363R04
6617B905j209p92j227r30n69l68J051N23J110J237L19m30n29j435j119r79P25
6634a717J312R01Q28J404r72r81q75j008q24m77J233J174N76J268k73J01j584
6651H6r04m14q61P48Q10N60J800N76r1j629r68j230n20K18L91Q32J669L95J95
$$ plain form
6670 1663 1877 586 -621 -2217 -2257 -2028 -364 474 1901 2002 1188 953 -607 -1271 -2186 -2606 -1315 -305
6688 -305 995 2160 2473 1550 -236 -838 -1725 -1918 -1672 -274 973 1622 2279 1649 896 -166 -1486 -2193
6706 -2193 -1905 -1192 738 1439 2139 2050 1113 -159 -1350 -2052 -2500 -1244 -369 835 1804 2135 1412 763
6724 763 -532 -1402 -1585 -1815 -1068 504 891 2074 1978 1093 596 -1491 -2160 -2276 -1649 68 956 1492 1782
6743 1782 1358 460 -747 -1303 -1652 -2287 -1106 209 1328 1785 1861 1470 104 -782 -1942 -1802 -1334 -836
6761 -836 894 1650 2175 1337 567 -731 -1862 -2257 -1757 -709 436 1272 2504 2508 1242 -3 -921 -851
6779 -851 -2096 -1395 -164 905 1908 2331 1955 256 -585 -1326 -1779 -1073 -413 331 1193 2248 1910 1239
6797 1239 -448 -835 -2205 -1783 -2285 -250 1077 1968 1664 1309 188 -1145 -1973 -2560 -1879 8 888
$$ packed form
6670A663K14j291j207j596m0K29J664Q38J427J01q14k35j560o64r15m20J291J010
6688c05J300J165L13r23j786o02q87j93K46J398J247O49O57o30p53j062j320p07
6706b193K88P13J930P01P00q9r37j272j191p02m48J256Q75J204R69L31p23o49
6724G63j295q70j83k30P47J572L87J183r6q85m97k087o69j16O27J717Q88N36K90
6743A782m24q98j207n56l49o35J181J315J119M57P6l91j366q86j160J40M68M98
6761h36J730P56N25q38p70j298j131l95N00J048J145Q36J232Mj266j245r18P0
6779h51j245P01J231J069J003M23l76j699q41p41m53P06O60P44Q62J055l38o71
6797A239j687l87j370M22n02K035J327Q91l04l55j121j333q28n87O81J887Q80
$$ plain form
6814 888 1068 2171 2188 493 100 -1099 -1256 -1677 -1071 464 829 2144 2254 1739 368 -913 -1291 -2094
6832 -2094 -1652 -849 380 1548 1801 1626 711 -189 -1603 -2254 -1923 -1245 57 1642 1540 2149 983 268
6850 268 -867 -1563 -2406 -1937 -437 650 2168 2291 1142 255 -140 -1457 -1814 -1657 -1290 -360 921 1945
6868 1945 2004 1778 717 -1000 -1391 -2470 -1628 -702 893 1852 2465 1677 413 -156 -1361 -1827 -1573 -1188
6886 -1188 317 1144 1281 1692 1316 593 -641 -1630 -2154 -2169 -762 1147 1811 2536 1767 711 -473 -1524
6904 -1524 -1684 -2113 -1157 -143 800 2171 2261 1345 55 -1731 -1351 -1401 -1095 -822 717 2004 1577 2457
6922 2457 457 -41 -1573 -1937 -1189 -557 569 804 1324 2347 694 169 -1403 -1742 -2218 -1237 -595 896
6940 896 1975 1813 1183 613 -565 -1014 -2398 -1555 -691 462 1165 1317 2417 1023 19 -1243 -1093
$$ packed form
6814H88J80J103J7j695l93j199j57m21O06J535L65J315J10n15j371j281l78q03
6832b094M42Q03J229J168K53j75r15r00j414o51L31O78J302J585j02O09j166p15
6850B68j135o96q43M69J500J087J518J23j149q87l95j317l57J57L67R30J281J024
6868A945N9k26j061j717l91j079Q42R26J595R59O13p88j264n69j205m66K54L85
6886a188J505Q27J37M11l76p23j234r89n24j5J407J909O64P25p69j056j184j051
6904a524j60m29R56J014R43J371R0r16j290j786L80n0L06K73J539J287m27Q80
6922B457k000m98j532l64P48O32J126K35N20J023j653n25j572l39m76R81O42J491
6940H96J079j62o30n70j178m49j384Q43Q64J153P03J52J100j394j004j262J50
$$ plain form
6957 -1093 -1556 -1678 -426 790 1341 1877 1025 955 -604 -1103 -1812 -1748 55 273 665 2330 2122 1395 -114
6976 -114 -1125 -1985 -2142 -1140 -183 731 2081 2255 1549 1399 -391 -2026 -1918 -1724 -655 371 1193 2209
6994 2209 1687 984 -551 -1771 -1450 -1324 -1205 176 619 1366 2405 1561 572 -812 -1450 -2086 -713 -429
7012 -429 349 1094 1191 1913 731 -23 -1044 -2010 -2005 -702 -232 371 2126 1369 1091 628 -539 -1709 -2710
7031 -2710 -1826 -864 433 1289 1442 1853 601 -226 -446 -1173 -1644 -1512 272 1063 1983 1579 934 -416
7049 -416 -563 -1640 -1739 -782 -824 900 1159 1205 1528 699 -689 -1184 -1924 -1567 -1103 -426 1093 1498 1721 1535
7069 1535 -166 -1217 -1280 -1969 -1273 -672 552 1078 1570 1121 668 -189 -1187 -1574 -1768 -774 113 770 1975
7088 1975 1498 849 639 -931 -1019 -1430 -1888 -931 258 1319 1633 1257 149 -477 -1091 -1520 -1161 -1001 29
$$ packed form
6957a093m63j22J252J216N51N36q52p0j559m99p09O4J803K18L92J665k08p27j509
6976a14j011q60j57J002R57R14J350J74p06j50j790j635J08J94J069J026Q22J016
6994B209n22p03j535j220L21J26J19J381M43P47J039q44r89j384o38o36J373K84
7012d29P78P45R7P22j182p54j021r66NJ303M70O03J755p57k78m63j167j170j001
7031b710Q84R62J297Q56J53M11j252q27k20p27m71J32J784P91R20m04o45j350
7049d16j47j077r9R57m2J724K59M6L23q29j388m95p40L57M64O77J519M05K23j86
7069A535j701j051o3o89O96O01J224N26M92m49m53q57r98l87j94R94Q87O57J205
7088A975m77o49k10j570q8m11m58R57J189J061L14l76j108o26o14m29L59J60J030
$$ plain form
7107 29 760 1797 1541 1080 242 -546 -2023 -1364 -1190 -555 352 1665 1464 1055 836 -550 -1337 -1306 -1695
7126 -1695 -706 -172 875 1552 1141 1516 91 -918 -1787 -1849 -848 387 38 1928 1745 755 743 -315
7144 -315 -1282 -1335 -1099 -906 -516 1205 1852 1595 736 -205 -774 -1535 -1889 -1030 -170 605 1564 774 1357 539
7164 539 -75 -1158 -1543 -1404 -1186 -425 905 1508 1815 1932 -308 -1074 -1138 -1062 -1231 -192 860 1400 1523
7183 1523 1504 171 -684 -1073 -1023 -844 -944 -218 895 1388 1695 1414 -150 -1393 -1535 -2089 -1095 -1009 932
7202 932 740 1854 1526 71 -849 -775 -1566 -1286 -170 494 1739 1392 1705 757 509 -659 -1473 -2119 -1069
7221 -1069 -687 246 1836 1626 865 841 -188 -1060 -1200 -949 -792 88 1495 1514 1646 906 217 -1033 -1048
7240 -1048 -1450 -1122 -100 1058 797 1075 884 394 -124 -833 -1722 -2115 -115 386 571 1661 1733 672
$$ packed form
7107B9P31J037k56m61q38p88j477O59J74O35R07J313k01m09k19j386p87L1l89
7126a695R89N34J047O77m11L75j425j009q69o2J001J235l49J890j83r90j2j058
7144c15r67n3K36J93L90J721O47k57q59r41n69p61l54Q59Q60P75R59p90N83q18
7164E39o14j083l85J39K18P61J330O03L07J17k240p66o4P6j69J039J052N40J23
7183A523j9j333q55l89N0J79j00P26J113M93L07k81j564j243j42n54R94Q6J941
7202I32j92J114l28j455r20P4p91K80J116O64J245l47L13r48k48j168q14o46J050
7221a069L82R33J590k10p61k4j029q72j40K51J57Q80J407J9J32p40o89j250j5
7240a048m02L28J022J158k61K78j91m90n18p09q89l93K000N01J85J090P2j061
$$ plain form
7258 672 -274 -599 -1117 -1511 -701 123 355 1114 2028 972 428 -139 -1047 -685 -1078 -622 26 366 1007 1580
7278 1580 644 -735 -1020 -752 -539 -1336 -59 875 1296 1013 906 111 -150 -947 -1088 -995 -442 951 673
7297 673 1329 1327 615 -33 -1667 -1365 -1435 -863 -89 639 1343 1362 576 712 -813 -1155 -1551 -1176 -1168 178 1295
7318 1295 1220 1462 358 -907 -1358 -1441 -982 -1017 369 1254 1140 1631 1410 210 -980 -1086 -1145 -992 -267
7337 -267 560 574 1378 941 752 -16 -1400 -431 -1192 -653 -456 433 1874 604 1402 -628 -750 -886 -1163
7356 -1163 -1397 -835 1353 955 732 1218 435 -502 -1358 -1562 -1253 -989 -66 753 1232 1027 589 563 -1275
7375 -1275 -1150 -1822 -817 -546 471 966 1111 1366 720 -439 -911 -1380 -1590 -980 -149 1002 1363 940
7393 940 823 -79 -382 -1037 -1056 -1278 -143 642 683 1304 1048 510 89 -1261 -712 -1458 -262 115 1163
$$ packed form
7258F72r46l25n18l94Q10Q24K32P59R14j056n44n67r08L62l93M56O48L40O41N73
7278A580r36j379k85K68K13p97J277R34M21k83j07p95k61p97j41R3N53J393k78
7297F73O56kp12o48j634L02p0N72P74P28P04J9p86J36j525l42l96L75QJ346J117
7318A295p5K42j104j265m51q3M59l5J386Q85j14M91k21j200j190j06n9J53P25
7337b67Q27J4Q04m37j89p68j384R69p61N39J97Q89J441j270P98k030j22j36k77
7356a163k34N62K188l98k23M86p83r37q56k04L09K64R23Q19M79k05m38k6j838
7375a275J25o72J005K71J017M95J45K55o46j159m72m69k10O10Q31J151L61m23
7393I40j17r02l03o55j9k22J135P85M1O21k56n38m21j350N49p46J196L77J048
$$ plain form
7412 1163 1159 1572 1192 88 -519 -949 -480 -1570 -132 544 905 1199 772 504 -107 -698 -1385 -696 -1279
7431 -1279 -189 702 1586 1308 749 408 -940 -1665 -1537 -1211 -679 926 241 901 882 79 -738 -450 -1161
7450 -1161 -1173 -1077 75 1064 1512 1346 819 375 -429 -1566 -1337 -875 186 -6 1007 1343 1388 287 -626
7469 -626 -1176 -712 -1241 -702 437 951 886 1562 479 -252 -903 -1067 -728 -1143 130 611 1583 1359 1141
7488 1141 24 56 -187 -961 -934 -595 451 242 585 1101 95 -514 -455 -681 -1385 -784 -89 216 402 948
7508 948 1561 536 -743 -1076 -1378 -1181 -778 509 1252 938 1014 471 -328 -1040 -1333 -966 -1519 -462 793
7527 793 1194 802 889 630 -383 -1075 -1085 -1081 -340 77 857 1402 914 486 -204 -964 -1300 -1323 -895 163 984
7548 984 409 914 591 320 143 -1000 -1256 -531 -322 -89 588 1407 1335 498 -628 -390 -1488 -1535 -926 409
$$ packed form
7412A163mM13l80j104o07m30M69j090J438O76L61K94m27k68o11n91o87O89n83
7431a279J090Q91Q84k78n59l41j348p25J28L26N32J605o85O60j9q03q17K88p11
7450a161j2R6J152R89M48j66n27m44q04j137K29M62J061j92J013L36M5j101r13
7469f26n50M64n29N39J139N14o5O76j083p31o51j64L39m15J273M81R72k24k18
7488A141j117L2k43p74K7L39J046k09L43N16j006o09N9k26p04O01O95L05J86N46
7508I48O13j025j279l33l02J97M03J287P43l14P6n43p99p12k93L67n53J057J255
7527G93M01l92Q7k59j013o92j0MP41M17P80N45m88m28o90p60l36k3M28J058Q21
7548I84n75N05l23k71j77j143k56P25K09K33O77Q19p2q37j126K38j098m7O09J335
$$ plain form
7568 409 634 911 1110 765 244 -592 -1019 -1538 -1399 -306 628 608 918 848 394 -291 -833 -1132 -533 -545 14
7589 14 397 1088 918 1220 -266 -713 -1296 -551 -641 -734 245 279 702 922 565 -630 96 -742 -775 -906 -133
7610 -133 675 874 774 345 58 -830 -356 -1021 -639 -222 215 913 1360 893 -24 -511 -961 -1151 -1324 -466
7630 -466 -285 750 1384 681 774 558 -472 -1043 -1378 -1049 -440 -121 1470 901 927 248 56 -160 -1273
7649 -1273 -1528 -1014 -138 310 1212 474 73 -100 -209 -954 -353 -913 -853 447 1277 1003 802 1047 50 -1080
7669 -1080 -481 -1298 -543 -768 912 746 618 643 79 -295 -619 -724 -962 -206 146 713 1095 283 353 -113
7689 -113 -254 -647 -786 -732 -157 452 1617 1043 -70 194 170 -273 -637 -770 -995 419 -105 1071 1188
7708 1188 560 -42 -523 -296 -1025 -124 -187 775 297 1477 1233 17 -442 -1087 -777 -808 -356 570 729 683
$$ packed form
7568D09K25K77J99l45n21q36m27n19J39J093R34k0L10p0m54o85n42k99N99j2N59
7589A4L83O91j70L02j486m47n83P45r0r3R79L4M23K20l57j195P26q38l3j31P73
7610a33Q08J99j00m29k87q88M74o65L82M17M37O98M47m67r17m87m50j90j73Q58
7630d66J81J035O34p03R3k16j030n71l35L29O09L19J591n69K6o79j92k16j113
7649a273k55N14Q76M48R02p38m01j73j09p45O01n60O0J300Q30k74k01K45r97j130
7669a080N99q17P55k25J680j66j28K5n64l74l24j05k38P56L52N67L82q12P0m66
7689a13j41l93j39N4N75O09J165n74j113K64k4m43l64j33k25J414n24J176J17
7708A188o28o02m81K27p29R01o3R62m78J180k44j216m59o45L10l1M52R26J59m6
$$ plain form
7728 683 901 236 -512 -943 -1073 -722 -399 163 60 1085 957 986 210 -502 -651 -735 -942 -220 -49 146
7748 146 731 1151 779 -8 -15 -874 -854 -236 200 -187 898 1445 929 455 -551 -279 -720 -863 -517 579
7768 579 288 581 530 130 -183 -484 -756 -609 -743 -413 193 353 1137 91 229 -731 -1123 -802 -613 167
7788 167 269 290 1149 109 535 -9 -1013 -558 -996 -293 66 -25 879 578 585 493 -441 -1140 -847 -612 -839
7809 -839 17 314 572 869 450 -53 -912 -576 -868 -262 114 787 822 845 1007 -184 -504 -608 -968 -521
7829 -521 -949 252 388 504 856 619 -269 -1066 -930 -384 -241 -474 146 426 669 -46 -510 -801 -951 -981
7849 -981 -877 -554 553 1035 859 802 521 -175 -404 -817 -940 -520 -232 768 286 660 221 -286 -3 -6
7869 -6 -1015 -670 159 235 486 1302 398 225 -868 -453 -635 -733 -631 23 1084 485 1210 775 334 -506
$$ packed form
7728F83K18o65p48m31j30L51L23N62j03J025j28K9p76p12j49q4k07P22J71J95
7748A46N85M20l72p87pq59K0O18M36l87J085N47n16m74j006K72m41j43L46J096
7768E79k91K93n1m00l13l01k72J47j34L30O06J60P84j046J38r60l92L21J89P80
7788A67J02K1Q59j040M26n44j004M55m38P03L59r1R04l01Pr2r34o99K93K35k27
7809h39Q56K97K58K97m19n03q59L36k92O06L76O73L5K3J62j191l20j04l60M47
7829e21m28J201J36J16L52k37q88p97J36N46J43k33O20K80K43p15m64k91j50l0
7849i81J04L23J107M82j76n7k81o96k29m13j23M20K88J000m82L74m39n07K83l
7869fj009L45Q29P6K51Q16r04j73j093M15j82r8J02O54J061n99P25m35m41q40
$$ plain form
7889 -506 -711 -175 215 97 148 355 1481 275 -23 -402 -771 -445 -803 -528 85 111 -203 495 741 31
7909 31 -149 -726 -852 -520 -681 -205 367 820 43 437 -107 -310 -833 -792 -9 270 414 367 1066 666 136
7930 136 -214 -735 -279 -466 49 -59 453 209 583 855 -338 -537 -554 -1045 -194 316 564 294 251 358
7950 358 -128 -531 -182 -252 -521 -58 47 709 1057 -86 557 -179 -1016 -674 -845 -354 -60 868 707 538
7970 538 369 -334 -144 -1270 -684 -428 163 -151 635 533 592 464 -333 251 -548 -473 -532 327 294 831 913
7991 913 307 67 -629 -847 -804 -1010 -481 69 428 440 37 -149 16 -63 -726 -252 -189 -152 846 785 255 -273
8013 -273 -132 -394 -224 -641 -323 357 303 792 788 487 489 169 -235 -476 -661 -542 16 523 119 446 503 -146
8035 -146 -638 -287 -374 -315 192 558 450 135 217 -153 -121 58 -521 -509 87 -376 7 753 191 -236 57 -183
$$ packed form
7889e06k05N36L90j18N1K07J126j206k98l79l69L26l58K75O13K6l14O98K46p10
7909C1j80n77j26L32j61M76N72M53p77L94n44k03n23M1P83K79J44m7O99m00n30
7930A36l50n21M56j87N15j08N12k44L74K72j193j99j7m91Q51N10K48k70m3J07
7950C58m86m03L49p0k69M63J05O62L48j143O43p36q37L42j71M91K94R28j61j69
7970E38j69p03J90j126N86K56N91l14P86j02N9j28p97N84p99P5n9Q59l3N37Q2
7991I13o06k40o96k18M3k06N29N50L59J2m03j86J65p9o63M74O3L7R98o1n30n28
8013b73J41k62J70m17L18O80n4M89ml01Kl20m04k41j85J19N58N07m04L27N7o49
8035a46m92L51q7N9N07L66j08l15Q2l70L2J79n79J2N96m63L83P46n62m27K93k40
$$ plain form
8057 -183 -646 -655 -170 36 224 1089 596 158 618 420 -546 -490 -743 -109 -546 -10 546 701 435 -363 -29
8078 -29 -562 -612 -301 458 356 317 911 751 -170 -13 -568 -909 -48 -236 129 302 988 432 578 303 -431
8099 -431 -884 -385 -522 -404 442 630 252 118 -39 -345 -61 -1053 -437 -696 548 474 362 411 509 212 163
8120 163 -544 -681 -127 -561 453 951 432 507 540 -151 21 -1090 -955 -375 -89 522 790 596 575 -300
8140 -300 -412 -853 -744 -66 -295 493 747 1142 1376 392 -149 -424 -453 -911 -142 -201 239 976 958 782 -94
8161 -94 -568 -1184 -1084 -1028 -607 -258 398 168 325 115 213 -587 238 -726 -511 244 683 620 44 533 314
8182 314 169 -472 -243 -444 -697 247 711 254 459
$$ packed form
8057a83m63rM85K06J88Q65m93m38M60j98r66N6k53O34m37N36N56J55k66p98L34
8078b9n33n0L11P59j02l9N94j60r21J57n55l41Q61j88L65J73O86n56J46k75p34
8099d31m53M99j37J18Q46J88l78j34j57l06K84r92O16k59J244p4j12M9R8k97m9
8120A63p07j37N54m34J014M98n19P5L3o91J72j111J35N80K86O11K68j94k1q75
8140c00j12m41J09O78k29P88K54L95K34r84n41k75k9m58P69n9M40P37j8j76q76
8161i4m74o16J00N6M21L49O56k30J57k10R8q00Q25r64K15P55M39o3n76M89k19
8182C14j45o41K29k01k53R44M64m57K05
8191D59
$$ Imaginary data points
##PAGE= N=2
##DATA TABLE= (X++(I..I)), XYDATA
$$ plain form
0 0 0 0 0 0 0 0 0 0 0 -48 0 -48 48 -48 96 -96 126 -144 189 -194 240 -290 338 -431 482 -575 673 -769
28 -769 872 -1010 1154 -1328 1491 -1696 1918 -2151 2432 -2708 3037 -3387 3761 -4189 4636 -5139
44 -5139 5686 -6279 6939 -7635 8427 -9282 10217 -11268 12410 -13707 15140 -16767
56 -16767 18616 -20734 23213 -26115 29619 -33920 39338 -46444 56167 -70397 93307 -136358
68 -136358 246415 -1180769 -1900411 85138 1311467 2589274 2677283 1942360 459436
77 459436 -1003789 -2336592 -2685622 -2161039 -875384 665822 2064523 2605789 2319780
86 2319780 1214714 -307957 -1730939 -2471984 -2431089 -1499333 -53392 1376604 2314582
95 2314582 2485003 1706540 383711 -1009604 -2083993 -2453371 -1898266 -738166 656176
$$ packed form
0@%%%%%%%%%m8M8m8R6r6J44j92K22k70L33l83M34n30O28p69R13j057J248j442
28g69J641j882K164k482K819l187L614m069M583n140N745o424P148p950Q825r775
44e139J0825j1965J3218j4574J6062j7709J9499k1485K3678k6117K8847l1907
56a6767L5383l9350M3947m9328N5734o3539P3258q5782J02611j26564J63704k29665
68a36358L82773j427184p19642J985549J226329J277807Q8009p34923j482924
77D59436j463225j332803l49030N24583J285655J541206J398701N41266k86009
86B319780j105066j522671j422982p41045M0895R31756J445941J429996R37978
95B314582J70421p78463j322829j393315j074389l69378N55105J160100J394342
$$ plain form
104 656176 1853389 2376673 2044147 1053964 -329190 -1598471 -2253047 -2142198 -1313689
113 -1313689 22704 1301352 2074410 2194232 1541230 291212 -983895 -1893155 -2210267
122 -2210267 -1704920 -578669 654895 1677822 2168953 1836736 868849 -334523 -1462935
131 -1462935 -2085662 -1918701 -1121995 36772 1226678 1950312 1959011 1340777 252625 -946241
141 -946241 -1767860 -1980174 -1534470 -518501 668676 1576782 1960365 1667249 761175 -374849
151 -374849 -1362355 -1904997 -1759324 -986663 87854 1137401 1800698 1801979 1191319 189743
161 189743 -902780 -1659567 -1809323 -1369560 -450445 653377 1487440 1792660 1514328 679693
171 679693 -403028 -1292433 -1744605 -1613110 -880817 144017 1075886 1662562 1672710 1065428
$$ packed form
104F56176J197213N23284l32526r90183j383154j269281o54576J10849Q28509
113a313689J336393J278648P73058J19822o53002j250018j275107r09260l17112
122b210267N05347J126251J233564J022927M91131l32217r67887j203372j128412
131a462935o22727J66961P96706J158767J189906P23634Q699o18234j088152j198866
141i46241q21619k12314M45704J015969J187177R08106L83583k93116r06074j136024
151c74849r87506n42642J45673P72661J074517J049547O63297J281o10660j001576
161A89743j092523p56787j49756M39763R19115J103822Q34063L05220k78332q34635
171F79693j082721q89405m52172J31495P32293J024834R31869N86676J0148o07282
$$ [...]
8191a71
##END NTUPLES=NMR FID
##END=
