##TITLE=1H_DE-20H2K3_HCl
 D2O
 8 sc, 
 30.10.2023
##JCAMPDX= 6.0         $$ Bruker NMR JCAMP-DX V2.0
##DATA TYPE= NMR FID
##DATA CLASS= NTUPLES
##ORIGIN= UXNMR, Bruker Analytische Messtechnik GmbH
##OWNER= root
$$ XWIN-NMR		Version 3.5
$$ Mon Oct 30 16:20:37 2023 Russian Standard Time (UT+4h)  she@DPX200
##.OBSERVE FREQUENCY= 200.13135
##.OBSERVE NUCLEUS= ^1H
##.DELAY= (6, 6)
##.ACQUISITION MODE= SIMULTANEOUS
##.ACQUISITION SCHEME= undefined
##.AVERAGES= 8
##.DIGITISER RES= 18
##SPECTROMETER/DATA SYSTEM= spect
##.PULSE SEQUENCE= zg30
##.SOLVENT NAME= D2O
##.SHIFT REFERENCE= (INTERNAL, D2O, 0, 15.7039)
##AUDIT TRAIL= $$ (NUMBER, WHEN, WHO, WHERE, WHAT)
$$ ##TITLE= Audit trail, XWIN-NMR		Version 3.5
$$ ##JCAMPDX= 5.01
$$ ##ORIGIN= Bruker BioSpin GmbH
$$ ##OWNER= she
$$ F:/spectra/data/she/nmr/H-F/1/audita.txt
$$ ##AUDIT TRAIL=  $$ (NUMBER, WHEN, WHO, WHERE, WHAT)
(   1,<2023-10-30 16:19:39.71 +0400>,<she>,<DPX200>,
      <created by zg, POWCHK disabled, PULCHK disabled
       configuration hash MD5:
       00 E9 B6 7A A2 85 ED C7 34 08 36 98 17 FE 4E 26
       data hash MD5: 16K
       37 95 FB C4 C6 B0 46 8D 5F 03 28 BA DA A0 04 2C>)
$$ ##END=
$$ 
$$ hash MD5
$$ 69 6D DB 5F F5 C8 69 AE E1 17 D8 0F 0A 18 6F A7
##$RELAX= 
##$RELAX= 
##$RELAX= 
##$RELAX= 
##$RELAX= 
##$RELAX= 
$$ Bruker specific parameters
$$ --------------------------
##$DU= <F:/spectra>
##$EXPNO= 1
##$NAME= <H-F>
##$PROCNO= 1
##$TYPE= <nmr>
##$USER= <she>
##$AMP= (0..31)
100 100 100 100 100 100 100 100 100 100 100 100 100 100 100 100 100 100 
100 100 100 100 100 100 100 100 100 100 100 100 100 100 
##$AQSEQ= 0
##$AQ_mod= 1
##$AUNM= <au_zg>
##$AUTOPOS= <>
##$BF1= 200.13
##$BF2= 200.13
##$BF3= 200.13
##$BF4= 200.13
##$BF5= 200.13
##$BF6= 200.13
##$BF7= 200.13
##$BF8= 200.13
##$BYTORDA= 1
##$CFDGTYP= 0
##$CFRGTYP= 5
##$CHEMSTR= <none>
##$CNST= (0..31)
1 1 145 1 1 1 1 1 1 1 1 1 1 1 1 1 1 1 1 1 1 1 1 1 1 1 1 1 1 1 1 1 
##$CPDPRG= <>
##$CPDPRG1= <>
##$CPDPRG2= <>
##$CPDPRG3= <>
##$CPDPRG4= <mlev>
##$CPDPRG5= <mlev>
##$CPDPRG6= <mlev>
##$CPDPRG7= <mlev>
##$CPDPRG8= <mlev>
##$CPDPRGB= <>
##$CPDPRGT= <>
##$D= (0..31)
0 1.2 0 0 0 0 0 0 0 0.06 0 0.03 0 0 0 0 0.0002 0 0 0 0 0 0 0 0 0 0 0 0 
0 0 0 
##$DATE= 1698668379
##$DBL= (0..7)
120 120 120 120 120 120 120 120 
##$DBP= (0..7)
150 150 150 150 150 150 150 150 
##$DBP07= 0
##$DBPNAM0= <>
##$DBPNAM1= <>
##$DBPNAM2= <>
##$DBPNAM3= <>
##$DBPNAM4= <>
##$DBPNAM5= <>
##$DBPNAM6= <>
##$DBPNAM7= <>
##$DBPOAL= (0..7)
0.5 0.5 0.5 0.5 0.5 0.5 0.5 0.5 
##$DBPOFFS= (0..7)
0 0 0 0 0 0 0 0 
##$DE= 6
##$DECBNUC= <off>
##$DECIM= 32
##$DECNUC= <off>
##$DECSTAT= 4
##$DIGMOD= 1
##$DIGTYP= 9
##$DL= (0..7)
0 120 120 120 120 120 120 120 
##$DP= (0..7)
150 150 150 150 150 150 150 150 
##$DP07= 0
##$DPNAME0= <>
##$DPNAME1= <>
##$DPNAME2= <>
##$DPNAME3= <>
##$DPNAME4= <>
##$DPNAME5= <>
##$DPNAME6= <>
##$DPNAME7= <>
##$DPOAL= (0..7)
0.5 0.5 0.5 0.5 0.5 0.5 0.5 0.5 
##$DPOFFS= (0..7)
0 0 0 0 0 0 0 0 
##$DQDMODE= 0
##$DR= 18
##$DS= 0
##$DSLIST= <SSSSSSSSSSSSSSS>
$$ [...]
##$SUBNAM2= <"">
##$SUBNAM3= <"">
##$SUBNAM4= <"">
##$SUBNAM5= <"">
##$SUBNAM6= <"">
##$SUBNAM7= <"">
##$SUBNAM8= <"">
##$SUBNAM9= <"">
##$SW= 18.05172834244
##$SWIBOX= (0..15)
0 0 2 0 0 0 0 0 0 0 0 0 0 0 0 0 
##$SW_h= 3612.71676300578
##$TD= 16384
##$TD0= 1
##$TE= 0
##$TE2= 300
##$TE3= 300
##$TEG= 300
##$TL= (0..7)
0 120 120 120 120 120 120 120 
##$TP= (0..7)
150 150 150 150 150 150 150 150 
##$TP07= 0
##$TPNAME0= <>
##$TPNAME1= <>
##$TPNAME2= <>
##$TPNAME3= <>
##$TPNAME4= <>
##$TPNAME5= <>
##$TPNAME6= <>
##$TPNAME7= <>
##$TPOAL= (0..7)
0.5 0.5 0.5 0.5 0.5 0.5 0.5 0.5 
##$TPOFFS= (0..7)
0 0 0 0 0 0 0 0 
##$TUNHIN= 0
##$TUNHOUT= 0
##$TUNXOUT= 0
##$USERA1= <user>
##$USERA2= <user>
##$USERA3= <user>
##$USERA4= <user>
##$USERA5= <user>
##$V9= 5
##$VALIST= <valist>
##$VCLIST= <CCCCCCCCCCCCCCC>
##$VD= 0
##$VDLIST= <DDDDDDDDDDDDDDD>
##$VPLIST= <PPPPPPPPPPPPPPP>
##$VTLIST= <TTTTTTTTTTTTTTT>
##$WBST= 1024
##$WBSW= 4
##$XGAIN= (0..3)
0 0 0 0 
##$XL= 0
##$YL= 0
##$YMAX_a= 186161
##$YMIN_a= -251973
##$ZGOPTNS= <>
##$ZL1= 120
##$ZL2= 120
##$ZL3= 120
##$ZL4= 120
##$ABSF1= 10
##$ABSF2= 0
##$ABSG= 5
##$ABSL= 3
##$ALPHA= 0
##$AQORDER= 0
##$ASSFAC= 0
##$ASSFACI= 0
##$ASSFACX= 0
##$ASSWID= 0
##$AUNMP= <proc_1d>
##$AZFE= 0.1
##$AZFW= 0.1
##$BCFW= 1
##$BC_mod= 2
##$BYTORDP= 1
##$COROFFS= 0
##$CY= 11.3945322036743
##$DATMOD= 1
##$DC= 2
##$DFILT= <>
##$DTYPP= 0
##$F1P= 15.7292609196834
##$F2P= 12.9074282941183
##$FCOR= 0.5
##$FTSIZE= 0
##$FT_mod= 4
##$GAMMA= 1
##$GB= 0.15
##$INTBC= 1
##$INTSCL= 1
##$ISEN= 128
##$LB= 0.24
##$LEV0= 0
##$LPBIN= 0
##$MAXI= 10000
##$MC2= 0
##$MEAN= 0
##$ME_mod= 0
##$MI= 1.114404
##$NCOEF= 0
##$NC_proc= 0
##$NLEV= 6
##$NOISF1= 3.799351
##$NOISF2= 2.8
##$NSP= 1
##$NTH_PI= 0
##$NZP= 0
##$OFFSET= 15.70392
##$PC= 1
##$PHC0= -23867.32
##$PHC1= 5.852709
##$PH_mod= 1
##$PKNL= yes
##$PPARMOD= 0
##$PSCAL= 0
##$PSIGN= 0
##$REVERSE= no
##$SF= 200.130013532006
##$SI= 16384
##$SIGF1= 3
##$SIGF2= 2
##$SINO= 400
##$SIOLD= 16384
##$SREGLST= <1H.CDCl3>
##$SSB= 0
##$STSI= 0
##$STSR= 0
##$SW_p= 3612.71676300578
##$SYMM= 0
##$S_DEV= 0
##$TDeff= 0
##$TDoff= 0
##$TI= <>
##$TILT= no
##$TM1= 0
##$TM2= 0
##$TOPLEV= 0
##$USERP1= <user>
##$USERP2= <user>
##$USERP3= <user>
##$USERP4= <user>
##$USERP5= <user>
##$WDW= 1
##$XDIM= 8192
##$YMAX_p= 0
##$YMIN_p= 0
$$ End of Bruker specific parameters
$$ ---------------------------------
##NTUPLES= NMR FID
##VAR_NAME=  TIME,          FID/REAL,        FID/IMAG
##SYMBOL=    X,             R,               I
##VAR_TYPE=  INDEPENDENT,   DEPENDENT,       DEPENDENT
##VAR_FORM=  AFFN,          ASDF,            ASDF
##VAR_DIM=   8192,          8192,            8192
##UNITS=     SECONDS,       ARBITRARY UNITS, ARBITRARY UNITS
##FACTOR=    0.0002768,     1,               1
##FIRST=     0,             0,               0
##LAST=      2.2672688,     0,               0
##MIN=       0,             -251973,         0
##MAX=       2.2672688,     186161,          0
$$ Real data points
##PAGE= N=1
##DATA TABLE= (X++(R..R)), XYDATA
0@%%%%%%%%%%%%%%%%Nj1J4j6J6j6J6k2L0l2L7m5M9n5O3p1Q1r1J02j15J30j45J61
39H5j78J96k19K44k69K96l27L61l99M38m81N32n84O45p14P89q76R76j092J229
59F52j393J593j843K167k603L217m148N707q753J6726p4132j89163J34198K9606
73h8169P015K09969N7346j02918L198q7419j56336J3096N0496M6552J42746O0070
85A55646m3721k9839j05297j18624J2221L4059N6249J28133N3332j8217l3589
96I0353j41561j14100M8787M9169M9072J21910K7490n6278k0890q0623r4335J5441
108a05565K9138N2099J19417K8757m2162k0912j02748r2226M8536K6938K2281
119c6447J32408M1788p4369j9427p6703j13549N1969P7950M778Q0729N5733p0104
$$ plain form
0 0 0 0 0 0 0 0 0 0 0 0 0 0 0 0 0 0 5 -6 8 -8 8 -8 8 -14 16 -16 21 -24 25 -30 33 -38 43 -48 54 -61 69 -76 85
39 85 -93 103 -116 128 -141 155 -172 189 -210 228 -253 279 -305 340 -374 415 -461 515 -577 652
59 652 -741 852 -991 1176 -1427 1790 -2358 3349 -5404 11322 -62810 -251973 -117775 -88169
73 -88169 -81154 128815 186161 83243 86441 -978 -157314 -144218 -93722 -47170 95576 155646
85 155646 111925 82086 -23211 -141835 -129614 -95555 -39306 88827 142159 123942 90353
96 90353 -51208 -165308 -116521 -67352 -18280 103630 131120 74842 53952 -26671 -121006 -105565
108 -105565 -76427 -24328 95089 123846 81684 60772 -41976 -134202 -85666 -58728 -36447
119 -36447 95961 137749 63380 43953 -32750 -146299 -94330 -16380 -11602 69127 124860 54756
131E4756l8929l3320q5741L865O4146L1291P1217N1614n2816n4310m6147o6252
143a00626J0663O2070L5614N7799M0452m3876n5882n0685n1014J9106N6728L4391
155A4740M8745K3662m0063l7308m2768n4212J2615M9153L5510N8947K4095n2981
167D0135m0060l4596n3601J9505O0498K1478M3103L4496n2388n1202k0446m2148
179g5226O473O3780K9649K3657K7427l6496n1173k1813l2307m83N4899M0263K5396
192E4046J7302l5769n2087k4787j9610P007M6611L5670K2286J2882l1600m7082
204a5131k5637j7647J0141M4434L3220J9133Q487k9723m1893k4293j7633J0067
216d6475M4052L3016J8235N756l2596m1970j8696j2081R703M2350K9555J2167
$$ plain form
131 54756 15827 -17493 -103234 -99369 -35223 -3932 67285 118899 66083 11773 -34374 -100626
143 -100626 -89963 -27893 7721 65520 105972 62096 6214 -44471 -95485 -76379 -19651 14740
155 14740 63485 87147 47084 9776 -32992 -87204 -74589 -25436 10074 69021 93116 40135
167 40135 75 -34521 -88122 -68617 -8119 13359 56462 90958 38570 -12632 -33078 -75226
179 -75226 -68753 -4973 24676 48333 75760 39264 -11909 -33722 -66029 -66512 -11613 28650 54046
192 54046 71348 35579 -16508 -41295 -60905 -53898 -7287 28383 50669 63551 31951 -15131
204 -15131 -40768 -58415 -48274 -3840 29380 48513 57000 27277 -14616 -38909 -56542 -46475
216 -46475 -2423 30593 48828 54584 21988 -19982 -38678 -50759 -41056 1294 30849 43016
228D3016O733k7709m3332j8347o787R112L9083L2113Q500J17k3486l9055j9531
241c9573m357J0581L5994L2009P776m033k3324l6447j8333m40J2804L0684K8945
254C2286R106o030k3415l2488j7801n03J4407L0559K6231O351o756k2257l0538
267b0848j6802J431J5343K8136K3957O472q218k3375k7835j3577J893J4179K7769
280H525K3284L376r606k0034k6675j4641M614J6539K3801K0381M881j0659k1604
293B182k3967j1421M564J5300K3255J9835L091j2368j9739k1212j1912M613J7464
306a0315K1933J6175K954j1849k0103k0054r313N572J6087K0941J5674J391j2126
319A6967j9633j8482q254O337J6566J8999J3593J008j1868j9117j7099o746O383
$$ plain form
228 43016 49749 22040 -21292 -39639 -46426 -37314 1769 33882 42382 42499 19013 -20042 -39573
241 -39573 -43930 -33349 2645 34654 42430 38397 15073 -21374 -39707 -40147 -27343 3341 32286
254 32286 41392 35362 11947 -20541 -38342 -38845 -24438 6121 32352 38703 31947 9690 -20848
267 -20848 -37650 -36219 -20876 7260 31217 37689 29471 6096 -21739 -35316 -33423 -19244 8525
280 8525 31809 35185 25579 5545 -21130 -35771 -31157 -14618 9183 29564 34445 23786 2182
293 2182 -21785 -33206 -28642 -13342 9913 29748 32839 20471 732 -20480 -32392 -27779 -10315
306 -10315 11618 27793 30747 18898 -1205 -21259 -30572 -25000 -8913 12028 27702 29093 16967
319 16967 -2666 -21148 -29402 -23065 -6499 12500 26093 27101 15233 -3884 -20983 -27729 -21346
332b1346J6438J8330J2139l91j2319j7974j4989o236O521J6650J7574R789j016
345B3170j1169j7993j5210l821Q119J4488J6050R994j509j2806j6393j2298m109
358b3487O567J6227J5992P133k650j1209j5842j2171k819P660J4636J4677O886
371B1600k677j1823j5371j1275r93Q001J3104J3848O997m334j2112j3391j0134
384a8560j114Q462J3423J2327M991l815j1152j3097r401m97Q723J2196J1298N360
398A9144m170j1867j2649p722k6Q341J2644J0074L530l695j1073j2104p075O36
412a6012Q171J1895R973K420m339j0375j1422o657J329Q114J1168R497K662n322
426A1102j0696j0044o118J554Q384J1091Q022J804n022j0238r268n310J237Q961
$$ plain form
332 -21346 -4908 13422 25561 25170 12851 -5123 -20112 -26348 -19827 -3177 14397 24186 23170
345 23170 12001 -5992 -21202 -25023 -16904 -2416 13634 23628 22119 9313 -7080 -19378 -23487
358 -23487 -16920 -693 15299 22432 19782 8573 -7269 -19440 -22259 -14599 37 14714 21600
371 21600 18923 7100 -8271 -19546 -20539 -12538 566 14414 21411 17077 4965 -8426 -18560
384 -18560 -19674 -11212 2211 14538 19529 15714 4562 -8535 -17936 -18433 -9710 2486 13784 19144
398 19144 14974 3107 -9542 -17264 -17290 -8949 3695 13769 17299 13604 2531 -9573 -16648 -16012
412 -16012 -7841 4054 14027 16447 12108 1733 -9689 -16346 -15017 -6903 4265 13762 16424 11102
426 11102 406 -9638 -15756 -14202 -5818 5273 13295 15099 10077 -161 -9429 -14739 -13502 -4541
440d541J0469O610K060n050j0787q562l620O14Q172J1039O157J180m889j0574
454a722r359j935K427O806J0889N798j160m341q920r214k310L674O171R506O099
469A2409n55n520q755p962k332L188P635R037M850n22n837r330p128r49L439P295
485a037Q424L740j360m725q456o814p25L143O921Q663L317k087m003q937o879
500a0815K85L611O341Q935L158l679m107p427p077Q48M747N056P607L778l834
515G427m855n758o934J6N333N228O682M073l618n975n749n721M51N173N950N710
531G433K606l172n756n688m564Q02M505N014O159J947l049m594n919n085J031
546h330M881M933O002K228m465m192n619n085J715O323L747M619K967m969n243
$$ plain form
440 -4541 5928 12538 14598 9548 -1239 -9801 -13421 -12807 -4635 6404 12561 13741 8852 -1722
454 -1722 -11081 -13016 -10589 -3783 7106 12904 11744 7403 -1517 -10731 -13041 -9367 -3196 6310 12409
469 12409 11854 6334 -2421 -10383 -12715 -9527 -1892 7145 11995 11473 5636 -3694 -10822 -11771 -8332 -1037
485 -1037 7387 11127 9767 5042 -3414 -10228 -10953 -7810 -889 7774 11091 9004 5001 -3936 -10815
500 -10815 -10530 -6919 -578 8357 11515 7836 3729 -3698 -10775 -9927 -5180 -124 7483 11261 7427
515 7427 2572 -3186 -10120 -10104 -4771 457 7139 11212 7594 1619 -4130 -9851 -9400 -4227 1723 7433
531 7433 10039 6867 1111 -4577 -9141 -8339 -3834 1180 7339 9286 6237 1643 -4276 -9361 -8330
546 -8330 -3449 1484 7486 9714 5249 1057 -4562 -9647 -7932 -1609 2138 6757 9724 4755 -488
561d88l164m962J033N833L994L946K814m086n561l475l961K47O289M567L229J745
577H000l378n949l658k634R78N400M388K868J391l738m997l350k377P35N168M430
593C277K834J193l898m874l438k530J750N434L806K445J006l999n468j980k163
608f605J421N276L503J633J107l358n576k017j329N31N549L981J091Q29l115n546
624b625k312m05O76M875M233P74%k917n085k212j28J126M360L754J100n11k630
641B073m627k338k67J400M280L682P91n42k802m552j636j31J429M243L147J33
657D283q8k999m468j289M08J031M048L226J94o34k332m548j610Q45Q81L765L627
674D340k45r08k139m056j618Q56J630L078L232Pj430j941l596j640J042J849K702
$$ plain form
561 -488 -3652 -8614 -7581 -1748 2246 6192 9006 4920 -641 -4116 -8077 -7830 -1541 3026 6255 8000
577 8000 4622 -1327 -4985 -7619 -6641 -1241 3147 6015 7406 3668 -1329 -4679 -7056 -6321 -1153 3277
593 3277 6111 7304 3406 -1468 -4906 -7436 -5686 -252 3554 5999 7005 3006 -2462 -4442 -6605
608 -6605 -5184 92 3595 5228 6335 2977 -2599 -4616 -5945 -5414 135 4116 5207 6036 2921 -2625
624 -2625 -4937 -5342 -4666 209 4442 5216 5216 2299 -2786 -4998 -5126 -4000 360 4114 5214 4703 2073
641 2073 -2554 -4892 -5159 -3759 521 4203 4994 4452 1650 -2902 -4538 -4669 -3240 1003 4150 4283
657 4283 4195 1196 -3272 -4561 -4153 -3122 926 4152 4346 3712 1380 -3168 -4778 -3933 -3052 713 4340
674 4340 4095 3187 1048 -3008 -4626 -3770 -2140 938 4170 4177 2747 806 -2790 -4430 -3388 -1539 1163
691A163K743K10j204k380l251j505P59J927K834K670o7j589k053l255j133Q36
707c295K039K612K403N8j549k372k662r57J203J540K473K303m51j528k025k636
723b844j115J224J979K208J892J23j997j802k257j176J436J691K207J598j29j792
739A246j789k068j034J418K021J583K087l48k012j789j856o69J284J709J797J507
755C087m31j451k091j466q96J285K185J735J016m24j844j488j440q74J260K061
771B24J378J424p34j740j547j360j79J005J954J184J019k19j807j862q90n31J230
788a451J807J480N07m02j560j454j125l75J529J553R70R78l29j764j380j120p1
805b207Q95J729J278P36p45j475j168j161j35J316J609P66P61o55j154j465p73
$$ plain form
691 1163 3906 4116 2912 532 -2719 -4224 -3465 -1538 1296 3966 3899 2310 257 -2998 -4131 -3295
707 -3295 -1256 1356 3759 3817 2268 -104 -2766 -3723 -2520 -980 1493 3796 3345 1817 -208 -2844
723 -2844 -3959 -2735 -756 1452 3344 3467 1470 -332 -2589 -3765 -2329 -638 1569 3167 3038 1246
739 1246 -543 -2611 -3645 -2227 -206 1377 3464 3116 1104 -685 -2541 -3210 -1926 -217 1580 3087
755 3087 2656 1205 -886 -2352 -3248 -1963 222 1957 2973 2549 705 -783 -2223 -3097 -1837 224
771 224 1602 3026 2292 552 -995 -2355 -2534 -1529 425 1609 2628 2409 602 -1260 -2150 -2681 -1451
788 -1451 356 1836 2343 1941 381 -1073 -2198 -2573 -1044 509 1479 2457 2128 364 -1016 -2136 -2207
805 -2207 -1312 417 1695 2431 1686 211 -957 -2118 -2253 -937 672 1438 2199 1544 390 -1075 -1848
822a848J91Q52J654O66N89o01j327j319q49J88R57J617J043j64m98j070j433m83
840a835L08J022R95J239Op52j092j064o50L98Q18J470R76m06k58j327q86o86N74
859a150P93J453O11n4n97j313j068k50K02J141J325N38P9j036j205o38m08M28
877a149R30J176M56n8n22j133j041k50M72Q67J114P15l25o00j047p62n52P12P96
896b01J294L91k76p43q78j049j31O59Q22J201K30n3q38j124m73m08O02Q53J294
915A172J46l14o37r21n50m50Q94P47R26L69k39j144p13m44K3N58Q47J001O2l85
935I48q08p51n49K51K76J111P37J26m52p56o12q93J05P82P34P57L48n61o66r02
955g75m61J55O42R40M05J40l54p88o57m36J27P97O27M83L0p8p45q56k06p8O75
$$ plain form
822 -1848 -1657 -805 849 1515 2104 1503 176 -1143 -1992 -1804 -847 770 1813 1649 1151 81 -1352 -1835
840 -1835 -1527 -505 490 1729 1735 983 -109 -1173 -1823 -1425 -607 863 1839 1433 1175 -152 -1038 -1724 -1150
859 -1150 -357 1096 1707 1653 1056 -257 -1325 -1575 -1373 -232 1093 1631 1710 674 -531 -1169 -1577 -1149
877 -1149 -219 957 1413 1355 833 -300 -1341 -1591 -1119 -252 862 1577 1252 652 -395 -1157 -1709 -997 -201
896 -201 1093 1484 1208 465 -413 -1462 -1593 -934 -112 1089 1319 1266 428 -696 -1169 -1577 -975 -122 1172
915 1172 1318 1004 367 -554 -1104 -1554 -660 87 1013 1382 1143 -1 -714 -1158 -1135 -577 270 1271 1333 948
935 948 140 -611 -1160 -909 -633 478 1215 1341 889 133 -479 -1372 -1267 -485 249 1006 1354 793 127 -775
955 -775 -1236 -1081 -439 501 906 1046 692 -96 -753 -1189 -1062 -265 362 845 875 797 52 -804 -1010 -1088 -413
976d13P88O32J3n82n84m53m49J36O26O12P85K04q26p26n05l86M11K33R40O61k3
997A094m09q35q12k79L53R12N48L4K94m70q77m96K13J32N79O20M17j42o92m56
1017b72n75k74N01P62O4O41j45m12o02m32j07K46P50L71M34j43n44p22n02J9K84
1038f58Q07M69L21j45p03l84o71M02J53N49M16L14l52l38n25m84j42L56O20Q30
1058H35J0j39n66o11j74R6L50M09O17l5j70r71J3k81Q9K39M29N29j82J0k89o16
1080d08k63J91L91K36N10j42k36m07k78m43M13L52N42l7K53j34l35q14k48L39
1100e18L36N43K66k43P6o11k52k53J73L10N55L50k02l36p87O8j71N51P1J65M87
1121E78p9l20k32l94j54r7O17L81M24m10j65m13j60j36K36J66L64M06j24n61R1
$$ plain form
976 -413 375 1007 1020 438 -146 -599 -1048 -912 -286 326 1111 1315 489 -237 -742 -1128 -717 -484 456 1117 1094
997 1094 685 -150 -962 -1241 -888 24 572 606 900 430 -447 -943 -730 -598 -19 601 1018 876 184 -272
1017 -272 -847 -1121 -620 142 206 847 702 290 -312 -744 -851 -605 145 516 950 807 263 -459 -961 -942 -658
1038 -658 149 618 939 794 91 -293 -964 -562 -409 140 556 870 518 180 -345 -829 -971 -615 5 835
1058 835 845 706 140 -471 -645 -549 -199 210 827 792 622 -349 -336 -617 -528 -289 140 669 487 497 208 -408
1080 -408 -671 -480 -89 147 657 515 279 -128 -406 -849 -436 -84 458 421 674 540 205 -609 -857 -518
1100 -518 -182 361 627 384 460 -151 -403 -656 -483 -173 382 732 530 194 -593 -525 -696 -145 -74 91 578
1121 578 499 179 -53 -447 -601 -698 -81 300 724 314 149 -264 -424 -560 -324 -158 206 612 488 -73 18
1142A8l71k19L99N24k83N12q9n24l56J6j68J33P29K01k01l6m51j51k07J83L10
1163c1J86m1L40j06l15K2l24j67N1M76M12r5j90l76j15l46Q3K25K93L66M9l41
1185E6j32j60J12k66K29M94j15J89j85l54J78l15j18K65P6K18J5nk37l35J9Q5
1207b86J08N40l0J8k90m9j92j95J91J76J84P5j39O0m04O6O9j92Q2N02J63l32J82
1230C07n15O3j87J34K85K82j13N6j53m20j35K00J28L7K23J6L47k11m07k54K24
1251i3k57M17N7K03k7k56k7l81n5K07K25K6jK94J43o40o2k6j17K76L48L6o8m0
1275A82l19j60L3J48L17P7J27m33P6m91J15K7K52L57q3O7M3k93N1k69N5j5M51
1298C15j51J37j22j20j86q7J06j32n6N65n1l43Q6k19j20J86j27N86J33r8m25N1
$$ plain form
1142 18 -353 -572 -173 351 68 580 491 -33 -389 -373 -541 -408 321 522 321 285 -166 -317 -524 -341 -31
1163 -31 155 114 454 348 33 55 -269 -436 -385 91 503 408 218 -158 -273 -619 -536 -311 -18 348 397 56
1185 56 -76 -236 -124 -390 -161 333 218 407 222 -132 46 -269 -387 -122 -46 172 187 182 -55 -390 -371 -286
1207 -286 -178 362 332 350 60 11 -181 -376 -185 -9 175 250 111 171 -233 -167 -98 -290 -208 294 457 125 307
1230 307 -208 -145 -332 -198 87 369 256 312 159 -261 -396 -196 -68 -31 192 208 555 344 -63 -317 -93
1251 -93 -350 67 124 327 300 44 17 -364 -419 -212 13 39 38 332 475 -165 -227 -253 -370 -94 254 290 222 182
1275 182 -137 -297 -264 -116 201 278 405 -28 48 -443 -328 -301 -49 308 225 292 335 42 93 -176 -121 -136 315
1298 315 164 301 179 59 -127 -214 -108 -240 -296 269 218 -125 -39 -258 -378 -192 -319 267 400 302 -123 -72
1320g2j59j21L5J41L46M6l6l1j78k08R5k03M13k2J12l7j42j36K40k48o4J08M27
1343C06p7Rj24k31j59J42L42j67n0L12o5j83o5k67K11k23L24K1J31j97K38n38
1365c10J55L1j44L54N6J47K39m30j93P9q2L48k25J73k59J48k15l8J26K82l02M2
1387a8L21k74J45l41p8m7m2K36Q5J55L75l33j85k54K62l55L48J31L4nj99k26O5
1410b00K4m2K42Q8R1K28n11Q7j90K82j73K8K44p8on2r6j75M3M1J38r5L08N9k44
1435D1oN5k64L8qM7K89o2q0kn9l2J00k28K98j8j37J62o1K6m46L33r0J42J88l32
1461a06j8J89l9j56M37j57N0M8j74K2j11K4l5l73J4L09O5k1j89K37r7N4O3l4k26
1486b24L98j13j77K53n42L08m5P2J96n4j70K5J9O4J67l46L8L72j37K85m72N4J7
$$ plain form
1320 -72 -231 -352 -317 -176 170 216 180 149 -29 -237 -142 -345 68 46 158 121 -21 -157 83 -165 -229 -121 306
1343 306 229 238 114 -117 -276 -134 208 41 -9 303 238 55 -10 -277 -66 -289 35 56 187 -10 228 -310
1365 -310 -155 -124 -268 86 142 289 528 98 -95 -16 -98 250 25 198 -61 87 -128 -166 -40 242 -60 -18
1387 -18 303 29 174 -167 -245 -292 -334 -98 -13 142 517 184 -1 -255 7 -348 0 131 165 160 -39 -265 -200
1410 -200 -176 -218 24 112 203 431 -80 7 -183 99 -74 -46 198 120 114 62 -34 -209 -166 -125 13 -82 226 285 41
1435 41 35 90 -174 -136 -144 -97 192 130 50 48 -11 -43 57 -171 127 109 -28 134 73 99 -347 -14 -104 38 226 -106
1461 -106 -124 65 26 -130 307 150 200 248 74 96 -15 9 -26 -399 -385 -76 -11 -32 -221 16 -81 -27 36 2 -224
1486 -224 174 61 -116 137 -405 -97 -142 -70 126 72 -98 -73 -54 10 177 -169 -131 241 104 389 -83 -29 -12
1509a2r8Q9J25p2J54j84j15j69J34K08j83K39j81L1J7m7j39K45k21J78L6O3q2
1532A6J35k84J03mJ28P8m28K75J70j06Q7q5j67J80k14J34p6J72k83K46k46K67
1554I8P5k15K6J11j84p4OJ90p3J03k32P6P2N3Q6o8p7k50K78n4J8J24j20R9k8n
1580C5J18Pj80O5o0K51m01J51L6j71O4j21K05J16o3l40M50k35k1l5n4J78o7k3
1604i5j17L21j34j7j02R1M9l10K95j89J86J9l3qk3J25k5j5N9J48l51k1L04k63
1628a06J40L0k89L68l27P1K21p1jm8kP7N7J73k78o8n5M8K33r0k53J94lK49k85
1653a5J25k28PJ80j00M1l10J70J72J04j68p1j87K69J80j16j70R0N8j06K70j64
1675C1m7j89K64O6N0l32Q3P3J93k00k07K10j85K59J62j43m8j15J00n6n6J58j60
$$ plain form
1509 -12 -110 -21 104 32 186 2 -113 -282 -148 60 -123 116 -65 -34 -17 -64 -203 42 -179 -1 35 98 16
1532 16 151 -133 -30 -34 94 172 -256 19 189 83 170 85 -82 98 -116 18 -58 114 -169 77 -169 98
1554 98 173 -42 -16 95 -89 -163 -157 33 -40 63 -169 -93 -21 32 118 50 -27 -277 1 -53 -35 89 -31 68 40 35
1580 35 153 160 -20 45 -15 236 -165 -14 22 -149 -85 -206 -1 115 52 -288 162 -73 -94 -129 -183 -5 -72 -95
1604 -95 -212 109 -25 -42 -144 -53 -4 -314 -19 -208 -22 -3 -36 -44 -67 58 33 18 77 225 -126 -147 157 -106
1628 -106 34 64 -225 143 -184 -113 108 37 36 -12 -14 63 120 293 15 -53 -108 -60 173 83 -170 24 21 270 -15
1653 -15 110 -118 -111 69 -31 10 -300 -130 42 146 -22 -93 -280 -11 169 53 -117 -27 31 -75 195 31
1675 31 -16 -205 59 125 175 -157 -74 -1 192 -8 -215 -5 -190 69 231 88 40 -75 25 -31 -87 71 -89
1698h9K78k54k51M31l65K86M4k10K66j78l4Nj62K80K17m88L53Mm3n0j71N4j7K16
1722A22l6k45Q1M4J49j06O4j44Q3n3K27j87j43J75j91M0K25j06K03m29K88k72
1744b11j22J55JK51J0j49J88L7k82j08J68j27K83km5k09J62j1Qk20L05K6k4J24
1768B08j61J06m16K87j35L37k05K4J38k49J68O8k07J52k38J72k16L43m54K54Q7
1789F3m2O1j56R2J4J26j68m9n6J38k2m0J03K34r3j68J82j20L4O3l77K45L0o1J27
1814A60k66k09L95j11qM4J79k34O0L9j0j21J47j35M92l71j92L3j3J20n0J22J5
1837H6k6R7j9r4p2j46j98L26no9K61Oj97j4k37K49j11K48j08Rk56L41J01O7l29
1862i0k86L76k12K78k33K0K13Mj64n4L46J3k13o7J41j01N8l1j21J17j02J35L1
$$ plain form
1698 -89 189 -65 -316 115 -250 36 80 -130 136 -42 -76 -71 -233 47 264 -224 129 133 90 40 -131 -77 -94 122
1722 122 86 -159 -78 -34 115 9 73 -71 12 -41 186 -1 -144 31 -160 -120 105 -1 202 -227 61 -211
1744 -211 -333 -178 -177 74 84 -65 123 160 -122 -230 -62 -189 94 92 47 -162 0 -11 -3 -223 82 108 84 208
1768 208 47 153 -263 24 -111 226 21 45 183 -66 102 170 -37 115 -123 49 -167 176 -278 -24 63
1789 63 21 82 -74 18 32 158 -10 -59 -115 23 1 -39 64 298 205 37 219 99 133 196 -181 64 94 33 160
1814 160 -106 -315 80 -31 -39 5 184 -50 10 49 39 -82 65 -70 422 51 -141 -108 -121 -1 -51 71 86
1837 86 60 157 138 44 -28 -174 -372 -46 -51 -120 141 147 -50 -64 -301 -52 -163 85 -23 -14 -270 71 172 239 -90
1862 -90 -376 0 -212 66 -167 -147 66 70 -94 -148 198 211 -2 -69 72 -29 29 -2 -123 -6 -108 27 58
1885E8m3j16m3MJ44K79m06L25l8j23j6j27J13l41M67k45J96J27k13r2J00q3l1
1908a04q9J42J00J74l63M8K34J02k67j16M5KJ16j62J91p9K6k08L73p2K7j40n0
1931g0PL52k40q5j43K44Q9m4k08K18j71pj11J65NmN2J64k27P5k01K49r2j21K06
1956A02k07L38l64OL1r0O7K58k39j46J26J89qq9K6j23K98j45k8O5j49K2J31nj39
1981g3J49j91m7N56j74p0k55J29N0M8j39K64m75J51M2J12J97q6M2l7M0k78J2L06
2005B73l40N8O5M6q1k57J93Q6k00j01L19R3j52N4k96K89j5l05O0K65L7j46q2j2
2029a49J78m9o8J4J07J28j37m0K19l35PQ4J64l10R2J26l69L74j84L1J28R0k70
2052a69K19j08q5Q9j71L36J38l46J41J5j34Q4K3Mj90J10q6J08J6J66j06k5j00
$$ plain form
1885 58 15 -101 -144 -140 4 283 -123 202 164 41 25 -102 11 -330 137 -108 88 215 2 -90 10 -73 -104
1908 -104 -193 -51 49 223 -140 -92 142 244 -23 -139 -94 -92 24 -138 53 -26 0 -208 165 93 120 -20 -70
1931 -70 -63 289 49 -36 -179 65 154 110 -98 120 -51 -58 -169 -4 1 -3 49 213 -14 61 -140 109 17 -104 102
1956 102 -105 233 -131 -125 -94 -184 -117 141 -98 -244 -118 71 63 -26 0 -123 175 30 2 67 -82 -60 71 66 -73
1981 -73 76 -115 -162 394 220 150 -105 24 74 122 -17 247 -228 -77 -35 77 274 188 230 193 233 -45 -33 273
2005 273 -67 -9 56 102 21 -236 -43 43 -157 -258 61 154 2 56 -240 49 34 -271 -211 54 91 -55 -137 -149
2029 -149 29 -20 -88 -74 33 161 24 -16 203 -132 -125 -41 123 -187 -95 31 -338 36 -148 -117 11 101 -169
2052 -169 50 -58 -143 -54 -225 111 249 -97 44 59 -75 9 32 36 -154 -44 -130 -22 -6 160 54 29 -71
2075g1L95j92j5j74k3j31L40k49K09m5k20J95j05P3j62O9L81j28k10J12k57K59
2097E1j90K23j20k86M75k74j9O7m7J63jJ13j17l65J65J50Rr5k3J47j73J4Q2K26
2121A75k75J59n4l7J14lk2p9J00n2j59L57l44N0O1j53K70m8O4q8j81J60O8k86
2145b03L09j80N6J49l61M00j96O0m9J10O5n5K5r0Q4r9L0L9j92r0J91N5J52j49
2169F1l71M68k51O1p0rj07O2R4Q3j15J28Q6j99K42j51j44l6M23j24j49n1Q2j94
2193a81J41J56rp3M3j53J17l93J28L20J18m02K96j28%N4j71qJ50J27j98Q8r8n7
2217a33L29k05J27k17K91m23N17l03J10j44r8R0N1J74o2j84o3J36r4J79k81J99
2239dP6M3J9o4M0j30K4k7j29o9M00k57J27M7q5o4K41j75L1k5K78l77J35p3R0j5
$$ plain form
2075 -71 324 132 117 -57 -80 -211 129 -120 89 44 -176 19 -86 -13 -175 -106 275 147 -63 49 -208 51
2097 51 -139 84 -36 -322 153 -121 -140 -73 -120 43 42 155 38 -327 -162 -12 -3 -98 -121 26 -147 -133 -51 175
2121 175 -100 59 5 -32 82 79 57 -22 78 26 -133 224 -120 -70 -9 -162 108 60 124 36 -145 15 83 -203
2145 -203 106 -74 -18 131 -230 170 -26 34 -15 95 160 105 130 40 124 25 55 94 -98 -188 3 58 210 61
2169 61 -310 158 -93 -32 -102 -111 -218 -156 -62 21 -94 34 120 -79 163 12 -132 -168 255 131 -18 -69 13 -181
2193 -181 -40 116 107 34 77 -76 41 -352 -224 96 214 -188 108 -20 -20 34 -137 -145 5 132 -66 22 -76 -133
2217 -133 196 -9 118 -99 192 -231 286 -17 93 -51 -149 -59 -8 166 104 -80 -143 -7 -101 78 -203 -4
2239 -4 72 115 134 70 110 -20 4 -23 -152 -221 179 -78 49 96 11 -53 188 13 44 19 297 -80 55 -18 72 57
2265E7r4K4j66k7K36j68L5P3j89N6L11o5N0l35J68p3K51j74J71l08J58J83k89
2288a15J75K1j19m8K47Q8k28J42l73K56r5K24Jk90J74l2K29l42%P6K04j06j11
2311b2J75j83J93j09l35K21OJ36J44k05k33K02k1q3Pm1J90JL6j47J81qO9k58J4
2336g0l1MJ04m7J46j32J19o9j81K35j71L91j62J28k50n0j06J83O3j78K84j81k1
2359Hk00O1J27R0j53K2P2R8j16lj42N5J59K9m5R9J29k37j50M3J81k37j9J71m2
2384@O5R1r5k30J61P5j69J5L55m85L13p1l7K20j57K4o5n5Q0j26K54k37j09L44
2408A61k98J30k03J48NN4o7J80j82KJ51J26k71L83k01j5l29K94J07J20j15l68
2430a88K30P3j12o7J42k5j23K17l42L03J1O0k07j1k09J56K42r9jk92L20p1j11
$$ plain form
2265 57 -37 -13 -179 -206 30 -138 -103 -30 -219 -163 148 83 133 -202 -34 -107 144 -30 141 -167 -9 174 -115
2288 -115 60 81 -38 -86 161 249 21 163 -210 46 -49 175 176 -114 60 28 257 -85 -85 -9 195 89 -22
2311 -22 153 -30 163 54 -281 -60 -54 82 226 21 -212 -10 -31 -114 -107 -148 42 43 79 -68 113 105 174 -84 -70
2336 -70 -101 -97 7 -40 106 -26 93 24 -157 78 -93 298 136 264 14 -36 -142 41 104 -74 210 29 8
2359 8 -192 -131 -4 86 -67 -45 27 125 9 6 -136 -81 78 107 62 161 290 53 -97 -54 127 -110 -129 42 0
2384 0 65 156 61 -169 -8 67 -102 -87 268 -217 96 25 -12 208 51 75 10 -45 35 -91 163 -74 -183 161
2408 161 -137 -7 -210 -62 -57 -3 -70 110 -72 -70 81 207 -64 319 118 103 -226 68 175 295 180 -188
2430 -188 42 115 3 -64 78 53 -70 147 -195 108 119 179 -28 -39 -248 -92 150 51 50 -242 78 7 -104
2453a04J82P7j86L6L9M4Lp8K57l09J55q0J19k78J15j12L1J48J63j98J58j09j55
2476h2J82j25J64m5j01j77L7J46R1j03J35k70j67J56R7P5j17J17k8L35k15k79
2498a74K91k5j2j72K53l1j11m5J31j82M8j48L10r0l5j36L6L9L9M3j81K42k98k6
2522b34M66r0j17K29k90J26k20l8K29Q3l79K39r4R3l59K00K3L91m48K12Q0j94
2544i2j55L10p8j0j04p8K11l1L6j62L55k17o4p3K37j73J39M1j71p8J68J55j65
2567Alm9Q1J78k13j20J76l6q0K81l59J17j99K37p8PN1J26j84J50l42K46P3j25
2591f4K9pPK23k16J64j61J22Q6n26M01N9r3k37P2J68R0J70o50L27K5K47l9j53
2615D4j05K66l42K97j54O9K20l55l6J49P0J45j07L14l80L1j76N4k6M0J49J0j76
$$ plain form
2453 -104 78 155 -31 5 44 88 91 13 270 -39 116 36 155 -123 -8 -120 -89 59 222 24 182 73 -82
2476 -82 100 -25 139 94 -7 -184 -147 -1 90 -13 122 -148 -315 -159 -62 13 -104 13 -15 320 105 -174
2498 -174 117 92 80 -92 161 130 19 -26 105 -77 -29 -177 133 43 8 -128 -92 -53 -14 29 -152 90 -208 -234
2522 -234 232 142 25 254 -36 90 -130 -168 61 144 -235 4 -90 3 -356 -156 -133 258 -190 22 102 -92
2544 -92 -247 63 -15 -25 -129 -207 4 -27 9 -153 202 -15 -79 -152 85 -88 51 92 -79 -157 11 166 1
2567 1 -2 -51 30 208 -5 -125 51 15 -65 216 -143 -26 -225 12 -66 -59 -8 118 -66 84 -258 -12 61 -64
2591 -64 -35 -42 -35 188 -28 136 -25 97 183 -343 58 117 24 -213 -141 27 117 287 -363 -36 -11 236 197 44
2615 44 -61 205 -137 160 6 75 295 -60 -96 53 123 268 161 475 95 126 -50 4 -22 18 167 177 1
2638Ak02K53k71QL61o1k4j09m16M88j67K20Oq9R1j29J17k26J31R5k10J85j13J22
2662F1Qm3j7n6J4q1j7K30K8R3m9l28K31m39L59J50j39L38j75j23J59l23M77m33
2686g5K91l92o0K04P0M9l21J6L13Q8k70J57K6j91J8K65n0k39O5L71l87k14L06
2709D0K8K6Rm3p2m5K4J13J7P7l39K62r1J10k89K33m18J80K49k3j18L28j51kj75
2734g0r7N49l96J01j34Q7qj50J7n4J7J76n0q4J05L4j14j56K74K7M1k47L5k4K00
2759G9O4r8l9Q8p6j10MK28J74l45ONJ35K7k83M30m66J61J3m24L67J25j65k7K04
2784G7k59L5L3J57J56k74J41P8%J96j96j95K92m14Q9P4k19J58J06P9l08k16M51
2807D1R9k61J36l36L75k00J30Q0j36J51k87M1N4J42q9M4K37l89K16k4n1k47K61
$$ plain form
2638 1 -201 52 -219 -211 150 89 65 -44 -460 28 -139 81 87 -2 89 -40 77 -149 -18 77 -133 52 -61 61
2662 61 69 26 9 -47 -33 -114 -131 99 127 220 171 -157 74 -365 -6 144 5 343 168 45 204 -119 358 -75
2686 -75 216 -176 -236 -32 38 87 -234 -218 95 183 -87 70 96 -95 -77 188 138 -101 -36 335 -52 -266 40
2709 40 68 94 103 60 -12 -57 -33 80 97 174 -165 97 6 116 -173 60 -358 -178 71 48 -70 258 107 105 -70
2734 -70 -167 382 -14 87 -47 40 32 -118 -101 -155 -138 38 -12 -96 9 43 -71 -227 47 74 115 -132 -97 -121 79
2759 79 143 45 6 94 18 -92 -88 140 314 -31 -25 -20 115 142 -141 289 -177 -16 -3 -427 -60 65 -100 -127 77
2784 77 -182 -147 -114 43 199 -75 66 144 144 340 144 -51 241 -173 -84 -10 -229 -71 35 114 -194 -410 41
2807 41 140 -121 15 -321 54 -146 -16 64 -72 79 -208 -167 -113 29 -60 -16 221 -168 48 24 -27 -274 -13
2830a3K01k19M6k23L15n1o4l08J27J17L73k51j0l9J38o8L9Lj45R8j0k24J70L0
2854C2j56J0J1J46m44K35k3K14K2p0J69n1j86O1J63k47J02l2K60K0l42K13K9q
2878A28K3q4q8M7Ok65J58J01k3J34l65K84M6k29M52k86l0Pj92L50l69K21m2J02
2902H6k57j7K71k40K54j72M9j2L47k37J9j00m0j27K23n7jp8r3J24K60j26N5j47
2926a6J15J05r2J19l6j77k57K75J0K41r3q9N0k28m4J97r3k5J94p3k25n2K82j30
2950d2P8M4k0J5k31J31J44k67J62p3j3J11j53J7Q6L9j7R2J40k87J3J68k13J39
2974F3j66L21k33L0n4o0l5J47L3M6j11j9R7j92J24j80L36p9j11k44J85m2J30k19
2998b33K34J00j54J09k28N6K26k71J37q0J8K02j45R3p7L60m68O8J39l87N25j44
$$ plain form
2830 -13 188 -31 15 -208 107 56 -8 -316 -189 -72 301 50 40 1 139 71 110 113 -32 66 56 -168 2 32
2854 32 -124 -114 -103 43 -401 -166 -189 25 47 -23 146 95 -91 -30 133 -114 -12 -44 216 236 -106 107 136 128
2878 128 151 67 -21 26 32 -233 -75 26 3 137 -228 56 102 -127 325 39 9 16 -176 174 -195 26 -16 86
2902 86 -171 -188 83 -157 97 -75 -26 -38 309 72 91 -9 -49 -176 47 -10 -11 -89 -182 -58 202 76 131 -16
2926 -16 99 204 112 231 195 18 -239 36 46 287 194 105 155 -73 -117 80 -13 -38 156 83 -142 -194 88 -42
2950 -42 36 80 60 75 -156 -25 119 -148 14 -59 -72 39 -114 -97 -11 28 11 103 243 -44 -31 137 -76 63
2974 63 -103 218 -15 15 -39 -99 -134 13 46 92 -19 -38 59 -133 -9 -189 147 68 -43 -287 -102 -144 -14 -233
2998 -233 1 101 -53 56 -172 -116 110 -161 -24 -104 -86 116 -29 64 -13 347 -121 -53 86 -301 224 80
3020H0l33K33J71J4k97k8J2K36j82J0L4J04n3k80K95j02J13rK5k77N58k92k19
3043a87J15j07O5j2J5J75m4k32K14jj64j7J91JJ34j75M0J6p5n5M5J53pl60L01
3068B9K1n%n7p3l8K76jj88P0p7rp9J82j7l7P1p1o8r6R3O9J67l2r5%k28j1M47k30
3098A3j98K24k61R4K94k01O0j07J27J70l05J72k27K04m07L05q0j32L28l27o7K56
3120f5J67n0r0J90l2l65K83p1J03j72RN9O6p3m3J73j37J22q7N4j91J09J07L9j56
3145e1Q4J88r5r9J32l33J4K12o9M5o1R9l5j69L22j32J5k17J37J51j73P6l4P4M12
3170D93l48k94L01j03n3k3M6l4J55J32l61J21k91L70O9k26j16P4J90j64n7P7j5
3193e7n7q5J8L94l23L40j97j44K96j81rK44k57J50m04M81k62p9N4K8Q8l6L9L6
$$ plain form
3020 80 -253 -20 151 165 -132 -160 -148 88 -94 -84 -50 54 1 -279 16 -86 27 18 43 -234 324 32 -187
3043 -187 -72 -179 -114 -126 -111 64 20 -212 2 1 -163 -180 11 12 146 -29 11 27 -48 -103 -58 95 88 -272 29
3068 29 50 45 45 -12 -85 -123 153 152 -36 34 -43 -52 -131 51 34 -3 68 -3 -71 -167 -74 -5 162 130 35 35 -193 -204 243 13
3098 13 -185 39 -222 -128 166 -35 25 -82 45 215 -90 82 -145 59 -348 -43 -123 -255 73 -254 -321 -65
3120 -65 102 52 -38 152 120 -245 38 -33 70 -102 -93 -34 32 -41 -84 89 -48 74 -13 41 -150 -41 66 105 -51
3145 -51 33 221 126 27 159 -174 -160 52 -17 28 -33 66 31 -138 184 52 67 -150 -13 138 -35 41 7 81 493
3170 493 145 -149 152 49 -4 -27 19 -15 140 272 -89 32 -259 111 180 -46 -162 -88 102 -62 -119 -42 -57
3193 -57 -114 -199 -181 213 -110 230 33 -111 185 4 -5 239 -18 132 -272 209 -53 -132 -78 -50 38 2 41 77
3217G7j63Q5L8k34J41j39J45K33k19pr8Q3k5j20M31l03l6n8K79k2J%M9j62M5J32
3243A53pr5j03P9j95K77l01P6J76M4p9r1Q5l0J19p7Q5l90L07k27K87j39Q1j89
3267a54J45k76J51K07k18J8J30J12l30K06j42J43k35K90p1p2n3J21Np7l5P6K08
3290A49l45K86p8k9l2J08j75p0O1J85q2Q7q4N6J07k32L9O8m5J23j97J14P2k70
3314a84j05L06Q8k8Np5q3k21L54j24P0o5P1R7j65J47r7M9o8L9m3J51l4k73K90
3339A02j50K20k04K86k48k7K25j55K83j99j52jn1K91r6j55R1P8j33o5J6%J71j17
3363A0q4O1k84L43J35k63O2j57L28o8l17K38j57l0J37Q2j16L4l3K36j12o4P7p2
3387a4k09R6M9NK6n3K14j69j12M8K02l53O28m75K27q2J64k99L4k66K84P2r2J97
$$ plain form
3217 77 -86 -1 37 -197 -56 -195 -50 183 -36 -43 -141 -58 -83 -203 228 -75 -111 -169 110 88 89 89 138 -24 21 153
3243 153 146 51 -52 27 -168 109 -192 -116 60 104 25 -66 19 -11 108 31 116 -274 33 -194 93 -46 35 -154
3267 -154 -9 -285 -134 73 -145 -127 3 115 -215 -9 -151 -8 -243 47 -24 -96 -149 -28 -23 -100 -135 -59 149
3290 149 -196 90 12 -17 -49 59 -116 -186 -125 60 -22 65 -19 37 144 -88 -49 19 -26 97 -100 14 86 -184
3314 -184 -289 17 105 77 82 7 -76 -297 57 -67 3 -62 9 106 -59 88 -9 40 -28 11 -32 119 85 -188 102
3339 102 -48 172 -32 254 6 -21 204 49 332 133 -19 -20 -71 220 124 -31 60 138 5 -60 -44 -44 127 10
3363 10 -74 -13 -297 46 181 -82 -20 -177 151 83 -234 4 -153 -183 -46 36 -80 -46 -79 157 45 -19 58 -14
3387 -14 -223 -127 -78 -73 -47 -100 114 -55 -167 -119 83 -270 358 -117 110 28 192 -107 -73 -339 -55 17 -75 122
3411A22j07K4j08R9j21k8L41K3m35O6j63M51p7j62R2O4j22R1j26K05P3K1k60J24
3435H7k1j38K10j45o0p1L59o1J8j62k40J41K48j04j62J13k3J28k05j25L74R9k59
3458AN3l86L07J03M7j52n9L46l61O9j46k7K50J23l42Q0M02m21J95k45L95j67j28
3481f3J76k29L2J56m4L0j48J30l8m8N7j84J2L66l20R9M8O5K3l52J90j59M5J86
3505C0l9j15R9q1L02k54J22j6M4k89r9L48n5K0p5Q9q4j94L45j85o0k5M48k00k10
3530a34o1m3J86J39M8j23j00M6l5p1ML13k87J32L1J3K1p7J66k56J28l5Qr8j14
3555a99J66Q5k1q7J04Kk52J17J82j39j77K32M9j07P6q0J85k99L8R8L44j64J81
3578C34m33R9m7n1J60j02l7l1K17l54M50m74J52M28k42j9O5j78k90M61o32K45
$$ plain form
3411 122 15 39 -69 30 -91 -119 222 245 -190 -124 -287 164 87 -75 17 81 -41 50 -76 129 202 223 -37 87
3435 87 66 -72 138 -7 -67 -138 221 160 178 16 -224 -83 165 61 -101 12 -11 117 -88 -213 161 260 1
3458 1 54 -332 -25 78 125 -27 -86 260 -101 -32 -178 -205 45 168 -174 -94 308 -113 82 -163 232 65 -63
3481 -63 113 -116 -84 72 28 58 -90 40 2 -46 11 -173 -161 205 -115 -16 32 97 120 -232 -42 -201 -156 30
3505 30 -9 -124 -25 -106 196 -58 64 48 92 -197 -296 52 -3 17 -58 31 -53 -247 98 -87 -147 -172 276 76 -134
3530 -134 -195 -238 -52 87 135 12 -88 -42 -77 -148 -144 169 -118 14 45 58 79 2 168 -88 40 5 13 -85 -199
3555 -199 -33 52 31 -56 48 50 -202 -85 97 -42 -219 13 62 -45 31 -49 136 -163 -125 -27 317 153 334
3578 334 -99 0 -47 -98 62 -40 -77 -108 109 -245 205 -269 -117 311 69 50 115 -63 -353 108 -524 -279
3600b79J61j57N93k42nj78N7K10K26n48K26q9Q6L2j1k67j93K20J53M2n8Nj57j36
3624c09K38J28j43J4p1L9OK5r3R6J74k22n6J87J07k13L7m5K07j60L6R8j21jR0
3649D8m9J30j24j37K52p3k96K52P8k02P9Q0j13m2K56k78J74K60l72J1J62j44j44
3672a92K55j78Q7K0J99l44J96k85Q8K41j30J0mM0N8lj9J23k74k8K35L8j47p2R1
3697Eo9J52j63Q9J68m09J90J09K87l83J24k1m35J16M25k28J8J6Q7j07n5J91O3
3720A70k19K06j37N6M1m6L4j82J11O9r9J88Pj22k15j8O1q7J99K7k03J86q9J8j96
3745b40O1K45o5J81l9j90q0J50J74Ql21K25k63L00l8nr9J41J41m50m8K75J18k15
3769c4j58N0K2J40mj58l1P4L0m6L47j90j97L39m7k01L00j91k23K01r1K32j79J43
$$ plain form
3600 -279 -118 -275 318 76 71 -107 -50 160 386 -162 64 -25 61 93 82 -185 -378 -158 -5 37 -21 -16 -173 -309
3624 -309 -71 57 -86 -72 -143 -104 -98 -73 -166 -70 104 -118 -174 13 120 -93 -56 -101 106 -54 -18 80 -41 -42 48
3649 48 -1 129 5 -132 120 47 -249 3 81 -121 -42 38 -75 -117 139 -139 35 295 -77 -66 96 -48 -192
3672 -192 63 -115 -28 -8 191 -153 43 -242 -154 87 -43 -33 -37 3 61 58 39 162 -112 -140 95 133 -14 -86 5
3697 5 -64 88 -75 14 182 -227 -37 72 359 -24 100 79 -356 -240 185 -43 -25 -9 78 -29 -84 107 170
3720 170 -49 157 20 76 117 71 105 -77 34 103 4 192 199 77 -138 -156 -95 -182 17 44 -159 27 -62 -44 -240
3745 -240 -179 66 1 182 143 -47 -127 23 197 205 -116 109 -154 146 108 103 4 145 286 -164 -212 63 181 -34
3769 -34 -192 -142 -120 20 16 -142 -173 -99 -69 -115 232 42 -155 184 137 -64 236 45 -178 23 -68 164 -15 128
3793A28j72J91l03J89J31k12L97m02L2n2K50j18M8qo7j36L7J90j1j56j3j47J98
3816fJ56m31N95p4k67J4m2Q9j65L53j43q7J27k12l8N24n83K64R2k65J23O9p3j46
3840a26N7j56L00Ll3P9l03J78j80R7rnP0m1J53j70J95k16M35m59J18J70k46J57
3864F8o3p4q0K80j29j24J39n2Q9j22J99j8M1k4k32J47M3m6q1lK00q1k9j76J45
3889A7k2J12o1j85o6J81R2O7j66J27j01Q0J39%j58lM4k19J53j52N5K28j43k17
3913a98M01l68J40L6j08J91k07K16Kj67K2j53J36m2okm2J47k23J30Q8j46J6j54
3937b91M28j9m13L31j03K4L3Q7k67J60K35k07j74J80r0KL20k29P4q5J79n8k05
3960h8o7K98j93Q1J2j88L30k61PQ9k14K07q0J73m4J22l8J55k37O0k24K0J29r9
$$ plain form
3793 128 -44 147 -156 33 164 -48 349 -53 -21 -73 177 59 107 99 32 -104 -67 123 112 -44 -57 -204 -6
3816 -6 150 -281 314 240 -27 -13 -55 34 -131 222 79 -8 119 -93 -131 393 -190 74 166 -99 24 93 20 -126
3840 -126 -69 -225 75 78 45 124 -179 -1 -181 -84 -93 -98 -28 -69 84 -86 109 -107 328 -131 -13 157 -89 68
3864 68 5 -69 -149 131 2 -122 17 -35 54 -68 131 113 154 130 -102 45 88 42 -39 -42 158 77 48 -128 17
3889 17 -5 107 46 -139 -205 -24 68 135 -31 96 -5 75 214 214 56 53 97 -122 31 -121 -66 162 19 -198
3913 -198 203 -165 -25 11 -97 94 -113 103 105 -62 -40 -193 -57 -99 -105 -107 -149 -2 -225 -95 -7 -153 -137 -291
3937 -291 137 118 -295 36 -67 -43 -10 77 -190 -30 205 -2 -176 4 -86 -84 236 7 81 -4 175 117 -88
3960 -88 -155 143 -50 31 43 -145 185 -76 -69 20 -194 13 -67 106 62 184 146 301 64 124 -100 -80 49 -50
3984e0j2J3K12k07L58l83J91j51J03RJ96l42J53J12k32K57m28K54j16Oj01J39
4006a9M8J00j90K5o3M5qJ71L3k43Q0k5O6M1M0j59K6K15j38R4mr6O6M7j74m5j18
4033a85N7J8J69l2k30l4N76l71o4j70K39o4P0J42k91L07l51J96J38J07k25M4j52
4056a06J28m2j91L4J17j12J67Rn7l5k0J15qq1j23J45j50J52j72J04J55J15k01
4079e7J64j42n6J15K27k97J9P5j06M8P3o3J67l99k4K85K32l63J23k9K41k93RP9
4103B8j00L1L7J10O9k46J72r5J06r8k5j99K03k91L60K5j84M59n08K08k13L30m05
4126b26J38J73j31k3J97j59J65k73J45j04J7L83k45k26J82k51M11m37L07N4j38
4147d1j66K31N5j62N0l2M0J31P9k01k10J34L18r3j24l3L13m14J1K71j20j6k0j54
$$ plain form
3984 -50 -62 -49 163 -44 314 -69 122 -29 74 83 279 -63 90 202 -30 227 -201 53 -63 -57 -158 -19
4006 -19 29 129 -61 -36 -99 -54 -62 109 142 -101 -21 -46 20 61 101 -58 -32 183 45 139 135 39 105 152 -22 -67 -185
4033 -185 -128 -110 59 27 -203 -237 339 -32 -96 -266 -27 -91 -21 121 -170 137 -214 -18 120 227 2 46 -106
4056 -106 22 -20 -211 -177 -60 -172 -5 4 -53 -88 -108 7 -1 -82 -205 -60 -210 -58 -230 -126 29 144 -57
4079 -57 107 -35 -91 24 251 -46 -27 48 -58 -10 63 0 167 -232 -256 29 261 -102 21 -8 233 -60 -51 28
4103 28 -72 -41 -4 106 175 -71 101 6 112 14 -11 -210 -7 -298 62 87 -97 362 -146 62 -151 179 -226
4126 -226 -88 85 -46 -69 128 -31 134 -139 6 -98 -81 302 57 -169 13 -238 173 -264 43 97 -41
4147 -41 -207 24 79 -83 -33 -65 -25 106 185 -16 -226 -92 226 133 9 -24 289 -125 -114 157 37 21 1 -153
4171a53J6K11m5Q7j7j52J80m08J53K32k37J65j21rJ67M5j16k18J10J68j32O7k1
4194b8j13j03L70j78K00k53P7j53L60N8j87N8N3j55k3J50k08J90L7k93J14J65
4216A38l55J62K17l1o1l03K71J92k28J28J18k92J78l54J33Q5j37q7K79k9Q8O2
4238A74j69j62m9M24l12k86K01J93m5J48o0K3o1J9L5k99K19r2J6M06o00M77r0
4261A10o7j10m1Qj38K5K98J3k15K52n5k91R1k27N19r0mk14K84k59J0J20J8j52
4285a15K9J23Q7j7Pl87J53kJ35k08J84K31l25K28k42J08K20l22J59q9O4k06K24
4308C9N9J56j03m12L22J00j83j68O7L76l53J40k40K30K60k26m01J72qQ9K7j20
4330a77J73j7j85J26L29J09l61pJ53l06Q6M02j31j67j2O4k5o7K35k52j24K80J3
$$ plain form
4171 -153 -137 74 29 116 99 -53 127 -281 -128 104 -133 32 -89 -98 69 114 -2 -220 -110 58 -74 -7 -28
4194 -28 -141 -244 126 -52 148 -105 -28 -181 179 237 50 108 161 6 -17 133 -75 115 152 -141 -27 138
4216 138 -217 -55 162 131 70 -233 38 230 2 130 248 -44 134 -220 -87 -2 -139 -226 53 24 112 174
4238 174 5 -157 -206 218 -94 -380 -179 14 -31 117 57 80 19 38 73 -226 -7 -99 -83 323 -277 200 110
4261 110 43 -67 -108 -100 -238 -213 85 98 -117 135 80 -211 -120 -347 172 82 78 -136 148 -111 -101 19 37 -115
4285 -115 -86 37 124 107 114 -273 -120 -122 13 -195 -11 220 -105 123 -119 -11 209 -113 46 -43 21 -185 39
4308 39 98 254 151 -261 61 161 -22 -190 -123 253 -100 40 -200 30 290 64 -337 -165 -173 -84 -57 -177
4330 -177 -4 -21 -206 -80 249 358 -3 -10 143 -163 -77 325 194 27 15 79 54 -13 222 -30 -154 126 139
4353A39l35n7L65P8l25L35j31j27J8k9n2k8L3K91p9l7j08J17r7J13j15R0k1K64
4377C02k85k3Q3j52O3j16P2J18R5j13q9m57N67r5n5k6J26R0l26K62o6J38J03j74
4401D2k70K43k90J97J18j8J8RJ95r1k56K46J07k21k51O4RL22j51p6R1j04o1N2
4425g6j82J66j44J14R6j60J66j5J33l71J81p0K95j34k48K51L3k9J04Nj39jj07
4448a32J84J2N1J51m50K01j71Q8j29K14R4n8M2j57o3j28J83K03j39o4J41k00l9
4471a66J88O1j97J58K1kL3k30K76M0k21J5j4K92p8j34j4P6J5J08k88J87K3N8J5
4496B22j62J08k41J45q0J31m0K0j15k03L39j15K8j2l64L53NK57l62J99Q8k97K11
4519A15n5Rj70J84j13R0j01LJ8j68M3L3N0M5j22p1J92o8k7K30m2j28K9lK5K49
$$ plain form
4353 139 -196 -253 112 190 -135 200 69 -58 -40 -69 -121 -149 -116 175 96 59 -49 68 -29 84 -31 59 38 302
4377 302 17 -6 77 -75 -12 -128 -56 62 157 44 -45 -502 65 -30 -85 -111 15 105 -221 41 -25 113 216 42
4401 42 -228 15 -275 -78 40 22 40 49 244 153 -103 143 250 29 -222 -158 -149 173 22 -54 37 -67 -128 -76
4425 -76 -258 -92 -236 -122 -26 -186 -20 -35 98 -273 -92 -162 133 -1 -249 2 35 6 110 115 -24 -25 -132
4448 -132 52 64 115 266 -184 17 -154 -66 -195 19 113 55 97 -60 -123 -251 -68 135 -4 -68 73 -127 -166
4471 -166 22 83 -114 44 65 63 96 -134 142 182 -39 -24 -38 254 176 42 28 104 119 227 -61 126 149 207 222
4496 222 60 168 -73 72 -8 123 83 103 -12 -215 124 9 37 25 -339 14 19 276 -86 113 201 -96 115
4519 115 60 69 -101 83 -30 60 -41 -38 -20 -188 -145 -112 -62 -17 -139 -210 -18 -86 -113 117 75 -53 -24 -27 -2 247
4545B47l83K19j70K15k82m1j9K41k41N12N9l93j31K27p9j87K02J02o9j68K49r6
4567A4j50J8mJ57Q7l01M1K01N1m88L51N5J9k38J03mJ72q3j51J96oK67n12K03l03
4592c05K54K20j63j82j16L88l6L6j40p2J17K17l63k6M23l28K65k39j65L52j34
4613Ck3K06k47K3R2J92k8l9j02Pl27K75p9J40k16N7N0j65K97j86J71j11J00J86
4637B76j73k1M6k06K07m0n3J43J7J34m87M5J22M1l7k3j62o0L43j85O1k34K42K34
4661B30m57L23n2o0n1L41l70P9j52N7Q1J19j82J81p4K7L9M3j92R7J06L0l57L39
4685A45l03Q9P1m4K15l00K57j15k39q0J16J89L3j70J07J33k26J20k05J64L05m86
4707b24J72R5j57J09j73L41k88J89k14J84J22r1j83J45K15l23J90J14l39N6L3
$$ plain form
4545 247 -136 83 -87 128 -154 -195 -214 27 -214 298 357 -36 -167 60 -19 -206 -4 98 29 -139 110 14
4567 14 -136 -118 -122 35 122 -179 -138 63 114 -374 -23 32 51 -187 -84 -88 84 1 -150 46 40 307 -205 -2 -305
4592 -305 -51 169 6 -176 -292 96 60 96 -44 -116 1 218 -145 -171 252 -76 189 -50 -215 137 3
4613 3 -20 186 -61 -38 54 246 218 179 77 84 -243 32 -47 93 -123 -66 -16 -181 116 -70 101 -10 90 276
4637 276 103 82 128 -78 129 89 36 179 196 330 -157 -112 10 51 14 -9 -171 -231 112 -73 -12 -246 -4 230
4661 230 -227 96 44 -16 -67 274 -96 -17 -169 -112 -31 88 -94 87 13 40 79 122 -70 27 133 163 -194 145
4685 145 -158 -69 2 -42 173 -127 130 15 -224 -304 -188 1 34 -136 -29 104 -122 -2 -207 -43 262 -224
4707 -224 -52 43 -114 -5 -178 163 -125 64 -150 34 156 65 -118 27 242 -81 109 223 -116 -60 -27
4728b7P5J01j04j1j34m3R6J92j44j78K98j49p9L14m53J52L66k39O9k6K6L2r9m9
4752a4Q1k81J60L52n29L00K7o4k15kM6J38M1K6jk08J71k5l8N4J57n73L85Pj66
4777a71J83pk53L23j32mj55K60j58L5K01r7J14k41K53k03O0RP8j51M9p9j0J02
4801Fk3J07p5q1J5K0J80O5n1k30J03J19j87R9o1o6J24j35l5j96K52O0P6N9o8r3
4827a6p3Q1j00L70k36J4k4k26J86Q7k9J70J4l40M49k64R4p0r3k4K25m12K63m3
4851CP9j23m5M26l13N7o4p7m0nQ1O8J19N8k28p4K84k41J65k33J37J10q7k12L23
4876A68q8k53J95k64K74J8k9M0m1q0J90n2J29j7l50j12K27J23n6r2l7J67R3j51
4900BJ60r6l14M25j19o0j72J87J86n18M27m7j89J0Q2L52k35j8o1n1j40J56J27
$$ plain form
4728 -27 48 149 45 34 -100 -143 -47 145 1 -177 121 -28 -107 207 -246 -94 272 33 102 76 102 134 35 -14
4752 -14 67 -214 -54 298 -231 69 96 32 -183 -185 -139 -1 40 66 65 -143 28 3 -35 19 176 -397 -12 -5 -171
4777 -171 12 5 -248 75 -57 -61 -216 44 -114 -79 122 25 139 -102 151 -52 8 17 95 -56 -7 -86 -96 6
4801 6 -17 90 15 -66 -51 -31 149 214 163 -67 36 155 -32 67 6 -60 64 -71 -106 -302 -50 10 86 145 77 -16
4827 -16 -89 -8 -108 262 26 40 16 -210 -24 63 34 204 218 -122 327 63 157 87 -6 -30 195 -217 46 3
4851 3 82 -41 -86 340 27 84 20 -57 -97 -102 -21 47 166 224 -4 -78 206 -35 130 -103 34 144 57 -155 168
4876 168 80 -173 22 -242 32 50 21 61 20 -60 130 78 207 190 -160 -272 -45 78 22 -70 -107 60 153 2
4900 2 162 66 -248 177 58 -2 -174 13 199 -319 108 61 -128 -118 -36 316 81 63 2 -49 -189 -33 94
4923I4K1O9j25K2j32J74k31L1K38n1k3L1k77K34j97j80J16J65j17J29Rn8l3J15
4947B4j59J11O9O3l20J88p7j4R8j21O3k18L52j66J55M9M9k94L63k62o4N4J72j40
4971b5P5N7o6q7rO5j73K29K15l10l4R5j62J15r4J44k47K7K86j12J56l06K38O1
4995A38R1k55q2J37j01Q8j12J69J8k29J30pk2M9k15L10M3P3k72J64j93k1p7J29
5019d7J76N9k55K75j76m3k0K99k28k51J91L2M3k10Jq0K95N6J6m16N13l40k3K9
5043a04K34j04j47J04J36q9k08J49k4j50r4M26l97M37l7%j23n2O6M7k19J86j05
5066f8P0l8J33j98J27o0L68l10j76L77l63J88j06L93j36j91m8L3J7j9j50O1K10
5089A14M6k75K07j32K72m22K71K9qk10j7K34j06m4m2J85j9k29J73j55K07o3J15
$$ plain form
4923 94 115 184 59 81 -51 123 -108 -77 161 110 87 118 -159 75 -122 -302 -186 -21 -138 -9 0 -58 -91 24
4947 24 -135 -24 45 108 -212 -24 -101 -115 -17 -138 -75 -293 59 -107 48 97 146 -148 215 -47 -111 -57 115 -25
4971 -25 50 107 41 -46 -55 10 -163 66 281 -29 -63 32 -130 -15 -109 35 -212 -185 101 -11 145 -161 77 138
4995 138 229 -26 -108 29 -72 16 -96 73 91 -138 -8 -15 -37 12 -203 107 150 223 -49 115 -78 -99 -176 -47
5019 -47 129 188 -67 208 32 -11 -31 268 40 -211 -20 12 55 -155 -154 -234 61 117 133 -283 230 -110 -133 -104
5043 -104 130 26 -121 -17 119 30 -178 -29 -53 -203 -297 129 -268 169 132 132 9 -43 23 70 -149 37 -68
5066 -68 2 -36 97 -101 26 -34 334 24 -152 225 -138 50 -56 337 201 10 -38 -5 12 -7 -157 -96 114
5089 114 160 -115 92 -40 232 -190 81 110 102 -108 -125 109 3 -41 -83 102 83 -146 27 -128 79 16 131
5112A31j76p6P8J36l96K25O1J50J35j82O0k06k84J03L85j50j41L08o0PKl67K31
5135b6K43j79n0J1K5K14l85j5L86j73k24J59k7q8q5L67j21J03j37N9N6p2j13q
5159h0R7j42J01j35K41r8j07J30k1Pl3k6J27K24l10k03J32J50j39R4J43j59n7
5182f4k2j2J69r1o7L92k35L9J1l7Qn1l1Q3j20J44k32J99j99J60k78J99j00K17
5206H2R2l04J85n3J59L9k3k03k8J63j49J2l8L9J22k24L6P4N9n6k12K13K84m87
5230b18K85M8j18k5J26j94J4K26j14n2k19M7L38j37K18k11m9J63q4Q6j99l2q6
5253a87K64l9J5j22j2J68N3j7M9l32j01J45Q8r5n7j37K53r4L07j24K9k3o6M7K24
5278B36r5k39K8m0J00L30l62J48l19J18J17k29M1J07m4J25q7j9K35j90m2K13m1
$$ plain form
5112 131 -45 -121 -43 93 -303 -78 -17 133 268 86 146 -60 -344 -241 144 -6 -147 161 101 108 110 -257 -26
5135 -26 217 38 -12 -1 24 238 -147 -162 224 51 -173 -14 -41 -129 -214 153 32 135 -2 57 113 41 -72 -80
5159 -80 17 -125 -24 -159 82 -16 -123 7 -14 -7 -40 -66 61 285 -25 -228 -96 54 -85 9 152 -7 -64
5182 -64 -86 -98 71 -20 -87 305 70 109 120 83 91 40 9 92 -28 116 -116 83 -116 44 -234 -35 -135 82
5206 82 174 -130 55 2 161 200 177 -26 -54 109 -40 -28 -66 -27 95 -129 -93 -19 40 -16 -228 -15 269 -218
5230 -218 67 115 -3 -28 98 -96 -82 144 30 -22 -241 -194 144 7 225 14 -35 128 44 130 -69 -101 -187
5253 -187 77 38 53 -69 -81 87 140 123 172 -160 -261 -116 -28 -123 -180 -317 -64 -158 149 25 54 31 -35 12 236
5278 236 141 -98 -70 -110 -10 320 -42 106 -213 -95 22 -207 -166 -59 -103 22 -65 -84 151 -39 -81 132 91
5301I1r4k00M2J16r8K94k42K7L16l16M0p0P9O9L46l89K48l85m7j8O8O3J13n7j64
5326a68M65l13J63q9K6j85N8j49J36l5K29j03p7m1L7J23j64j4L81K2m87K08J6
5349C9Q4p6J26k16J56k23K26l07J27J6J63m25K80k6j17rK31k72oJ0L39j41j5J94
5373A58j09j10k52L59j07OK46j82k52L34r4K2K15j82j63K54k31Q2J8j72r0L35
5395H5k82L48j30j86K60Q0l35R1J24o9j92K67J0j22J19J26Q0l17J63k76K55k22
5417a23J41J59l8j09k2R4O1k61M08l22J56o3o3R1O8k47J39k8jJ4k10L31k22L28
5441B81k26l4J23j4k76J85q4J32j94J53j23j4M5jL64l70J93k31K21k60J53k05
5463a82M43l92J16K14j58L3J34j61P9M19m28j70J5J28k57P4J88j46O3J02j39o8
$$ plain form
5301 91 -3 -203 -161 -45 -143 151 -91 -64 252 -64 -24 -94 -15 54 400 11 259 -126 -173 -191 -123 -60 53 -4 -168
5326 -168 297 -16 147 58 84 -101 -43 -192 -56 -91 138 35 -42 -83 -46 77 -87 -101 280 302 -185 23 39
5349 39 123 47 173 -43 113 -110 116 -191 -64 -48 115 -310 -30 -56 -173 -182 49 -223 -229 -219 120 -21 -36 158
5373 158 49 -61 -313 46 -61 -55 191 9 -243 91 -3 19 234 52 -111 143 -88 -6 12 -160 -250 85
5395 85 -197 151 21 -165 95 175 -160 -69 55 -14 -206 61 71 -51 68 194 274 -43 120 -156 99 -123
5417 -123 18 177 139 30 8 102 163 -98 310 -12 144 81 18 109 177 -70 69 41 40 54 -156 175 -47 281
5441 281 55 21 144 130 -146 39 -45 87 -107 46 -77 -91 -46 -47 317 -53 140 -91 130 -130 23 -182
5463 -182 261 -131 -15 199 41 74 208 47 126 545 117 -53 -38 90 -167 -93 95 -51 12 114 -25 -93
5485i3P6j32J83k56L67k35n8l3L00k01J66l38L60l35L19k5M0k02p8K55k21q4R5
5508a30M39l27j26L01q5j66K59j02j4j28J91l62Q5O1j8O5K59k23J01L6n5j60K07
5531A08k19L70m22K50Jj93O0qJ69j63k61M26JK6j47q5j54K80K1N0O2j46l2k16
5555b22L8l9K25K98k84k39L74k37m0L01k95O7K8M2P4lj49K94k53K52k83r2K43
5578A00J86l91p2J55j11j3J57k7Ln7lJ96n3k52K02j74K04m0j80J50r4Q4J08j32
5602e4Q4j54j66K81J61k42q0K07j36n8l2K28L2j05j16K59l22L60M9k91J04J44
5624A53k31LJ61N4q5K5k18njM08l30J97m2j73mO8K39m6m2m7O2l83M14k06Q0j70
5650a19K91n10L25jK2L2J0j9l3Kj19J14k84J76Jp6K70k9k0j60K46j11O7j7P4j64
$$ plain form
5485 -93 -17 -149 34 -222 145 -90 -148 -181 119 -82 84 -254 106 -229 90 65 105 -97 -175 80 -141 -225 -130
5508 -130 309 -18 -144 157 72 -94 165 63 49 -79 112 -250 -165 -104 -122 -57 202 -21 80 116 61 -99 108
5531 108 -111 259 -163 87 88 -105 -45 -53 116 -47 -308 118 119 145 -2 -87 -241 39 60 110 172 26 -6 -222
5555 -222 -184 -223 2 300 16 -223 151 -86 -126 175 -120 -53 -25 17 91 88 -61 233 -20 232 -51 -143 100
5578 100 286 -105 -177 -22 -133 -146 11 -16 -13 -70 -73 123 70 -182 20 -154 50 10 -170 -20 -114 -30 78 -54
5602 -54 30 -124 -290 -9 152 -90 -170 37 -99 -157 -189 39 71 -34 -150 109 -213 147 196 -95 9 153
5624 153 -78 -75 86 140 55 80 -138 -143 -144 264 -66 131 89 -84 -88 -20 219 173 131 84 146 -237 177 -29 51 -119
5650 -119 172 -338 -13 -14 8 40 50 31 -2 0 -119 -5 -289 -113 -112 -188 82 53 33 -127 119 8 75 58 132 -32
5676c2j12J77k00Q9j68L70j10p9J00l07K88J64j65M2j53J1J5J18O5J4K13l81k18
5699b59L04n0j60J14j02jJ95J67q1k57J58jJ0J92q7l06J43j44J74j39O2R4J33
5722A59N6j48K61l53j03J04P3O4k76L14j53j60K33j42o9J22j10K03J15l09L0J34
5744D5j4R9l79K33J6J7K2M6l68J64J53q3J79j66P0P9j76l1K60j09n5L8j11J56
5768H5J5k00J67r2J44k19K83j29j52Q9J6k91J29K09k32K89m42M23j3M4L2j61J21
5791A15Qk90M21l66O4J76k49Q4O8j7J8m3P1Lj84K44j14j63J59q6N7l7j2o3K62
5816A26l7j24J05M2j30M5k22M29n24K71K50l27O1j07P0J56l23L18j84pK98j07
5838G9J9J42k02N0j17j99J40J76j07M5k00K91n8j29j01L71l94L40n0j67J74j22
$$ plain form
5676 -32 -144 33 -167 -78 -246 124 14 -65 35 -272 16 180 15 57 -96 -85 -70 48 113 127 340 -41 -259
5699 -259 45 -5 -165 -51 -153 -154 41 208 127 -130 28 27 37 229 142 -164 -21 -165 9 -130 -68 26 159
5722 159 215 67 328 -25 -128 -24 49 113 -163 151 -2 -162 71 -71 -140 -18 -128 75 190 -119 -89 45
5744 45 31 130 -249 -16 0 17 39 85 -283 -119 34 -49 130 -36 34 113 -63 -94 166 57 2 40 -71 85
5768 85 100 -100 67 -25 119 -100 183 54 -98 -9 7 -284 -155 54 -178 111 -331 92 79 123 155 -6 115
5791 115 123 -167 254 -112 -48 128 -121 -37 31 14 32 -11 60 63 -121 123 9 -154 5 -81 -24 -61 -73 -136 126
5816 126 89 -35 70 112 -18 27 -195 234 -290 -19 231 -96 -35 -142 -72 84 -239 79 -105 -112 186 79
5838 79 98 240 38 88 -29 -228 -88 88 -19 26 -174 117 59 -70 -171 200 -194 146 96 -71 103 -19
5860a9Lq1L76k88q6K05q1j6l08K92K4J30j51q3k5M3J92j59O7K27j96j11R3Oj36
5885h2Q3j57L1Pm5J07j16K22j83J80k11J29J38k91K72j34J42p1O3o2K1j41j7J35
5909B0K5m3l8l4O8O7r3n9Q0J22j39qM2j39J59K0k4j25K3M8J31j10N7k0J60j05
5935H5M3j46j65K43k17N53k57o2j97J51nJ4j64j1L21j06j52J95j89M7L49m24K5
5958f9L1K18k8k05J23Q1j59Q8pk87L05J8J42o89L25M06j06p1j87n1P3J98j90R0
5982D9j07K3J81o5O0m22K66j00J86p8n0J53k20P3j2J23J59j20n4l4L1j25J19j88
6006a52M47n36N66m49K05k63K11Oq0P7q1ll6K6J53N7j05o5j0k27J71J60l64M87
6030A95k94J47k78K44l8j87M92j56N1k21j67K64r0J89k51K04J38l08O8J86j13
$$ plain form
5860 -19 -16 -97 279 -9 -95 110 29 13 -295 -3 21 151 0 -83 -108 -65 127 -32 35 262 66 -45 48 54 -82
5885 -82 1 -156 -125 -118 -163 -56 -172 50 -133 47 -164 -35 103 -188 84 -50 92 21 84 22 43 -98 -115 20
5909 20 45 2 -36 -70 -2 65 -28 -87 -7 115 -24 -32 10 -129 30 50 26 -99 -76 -28 103 -7 50 30 190 85
5935 85 128 -18 -183 60 -157 396 139 77 -120 31 26 40 -124 -135 186 80 -72 123 -66 -19 330 -94 -69
5958 -69 -38 180 152 -53 70 151 -8 80 73 -214 91 109 251 -438 -113 293 187 116 -71 -122 -49 149 -41 49
5982 49 -58 -35 146 81 141 -281 -15 -115 71 -7 -57 96 -124 -51 -63 60 219 99 45 11 42 -83 36 -152
6006 -152 295 -241 325 -124 81 -182 29 35 -45 32 -49 -52 -88 -62 91 148 43 -22 -32 -259 -88 72 -292 195
6030 195 -99 48 -230 14 -24 -211 281 125 176 -45 -212 52 -38 151 -100 104 242 -66 2 188 75
6051G5j43P8r4J25J93j17j40j30K21k50J83Q1j17K3J88n3k91J18L02l31j90J05
6073a64M39l70J02n1n9J22j87J71r3J51L6n9J17k22Q9r7M6N3j84L27k32Q8k9K86
6097B80k29m20K53K6Q8J18j26Oj35K63k22J37L4k21J06k15Q6J99j21j27K84n9
6119EN1j00M1L6p9j4J86j76J76j21j05J34k91M36J23l81J8j46L15k25P5l5nQ8
6143FJ60l76K38J2j95J58M7J64l30J30q7J20q6j84L75p6L9k74J16K13k00m1K59
6166A88P1j35l7j11J59l04J10J25K2j13k7K8j21P7j05K45K03l06K55o3j44K1j42
6189a04l0L07l7j66J4J76l5k7j69O3ok37J17j43K12K6K09j89K09k6k81J45J4k6
6213A6k70O38n10K99r2J68j08l32M28k14j83rJ4j58J15n9J22N8m4P1q0M6J43j14
$$ plain form
6051 75 -68 10 -84 41 234 117 -23 -153 68 -182 1 82 -35 -12 176 123 -168 -50 252 -79 -269 -164
6073 -164 275 -95 7 -44 -103 19 -168 3 -90 61 97 38 155 -67 22 -75 -29 24 -160 167 -65 23 -6 280
6097 280 51 -369 -116 -90 -2 116 -10 -4 -139 124 -98 39 73 -148 -42 -257 -171 28 -93 -220 64 5
6119 5 56 -44 -3 33 -46 -60 126 -50 126 5 -100 34 -257 179 302 -79 -61 -207 108 -117 -42 -77 -82 6
6143 6 166 -210 28 40 -155 3 50 214 -116 14 -73 47 -39 -223 152 76 115 -159 -43 170 -30 -71 188
6166 188 259 124 87 -24 135 -169 -59 66 88 -25 -52 -24 -145 -68 -173 72 275 -31 224 161 17 38 -104
6189 -104 -134 173 136 -30 -16 160 125 98 -71 -8 -14 -251 -134 -277 -65 -39 170 -19 190 164 -117 28 42 16
6213 16 -254 384 -126 173 81 249 141 -191 237 23 -160 -169 -155 -313 -198 -257 -135 -77 -121 -50 -130 -84 59 -55
6237e5K93l97J42o6J67j44m7j09M55r2j6j53P4L5M2k67n8J59M3p5j39L08j42J79
6261A37R8k13K9J19l47K08r8p9J56M5j17J59l8J32m21J59J59n9J84Pl01K05j16
6284Hl8P7N1j05Q3j3k04Q1j20J80J5j80RK14j44k67L88l31J67K24P2j28q1Q6q8
6309d4M72j31k29K4k78J86qJ62j92J86m7r7j34P7J35l3l9k5K20k99J90k27K27
6332I6j94M78m42O0J54r9j40J10J52j72j23jO0J33j12r0N40m87L82o08K77K12
6354A86k41M8j23K48l00L7L73m64K46j60J66J30m01K55M5K44k72j17M44j52k83
6375i1J39K7k8L3n1k50L16k11J70k07L70j02j79o1N5l17L73J38l12J90j33K2l4
6398a43O6K55r1J3m5J2P5O2l34L82p0r4j51J10J4K60k30k3J24l03K52j22J8M6
$$ plain form
6237 -55 238 -159 -17 -83 84 -60 -107 -216 239 147 131 -22 52 87 129 -138 -196 -37 6 -69 -208 100 -42 137
6261 137 235 22 51 170 -177 31 -67 -146 10 55 -62 97 59 191 -230 -71 88 29 213 220 -81 124 8
6284 8 -30 47 98 -7 76 63 -141 -60 -180 0 15 -165 -156 58 -86 -353 35 -296 -129 95 167 39 -42 44 -44
6309 -44 428 297 68 92 -186 0 -8 154 -38 148 101 4 -130 -53 82 49 10 -15 205 -94 96 -131 96
6332 96 -98 380 -62 -2 152 53 -87 23 175 3 -120 -121 -61 72 -40 -130 410 -77 305 -303 -26 186
6354 186 -55 -7 -130 118 -182 -145 228 -236 10 -150 16 146 -255 0 45 289 17 -100 344 192 -91
6375 -91 48 75 47 80 29 -221 95 -116 54 -153 217 115 -64 -125 -70 -387 -14 124 -188 2 -131 -109 -143
6398 -143 -77 178 87 100 55 67 142 204 -130 252 182 88 -63 47 61 321 91 68 192 -111 141 19 37 83
6422H3Q8j03q0l6J55j44j19K89k56l9J00J5j33J93K48k53j84K94j80N4M6p4K40
6445B04l09K66O7j88L0J43l72K98j30j11K11j33K3M8j11m5L70l95j1j29K02j00
6467a72K76k52m4J24l5m1J13j36L11j14r4o3J57K49l84J30Jj29K13n1k21Q1J28
6490D7J96l16j91K23pO3J31K7m1l51J90K8J01l45J38J81j25K33Kn17M42j54J14
6513F9m4K04k73Q9J66m92L52k44K97Kj62j66J66K42l67K10k13K93j57j51Q2L07
6535B10m14K00L3N1j70J01k0j42L80j07p2L52m96K5j52J64R1j42K63j76K39j76
6557D2K23k65o0j15K58k37O0J36o7K0l1p9p9P0L2J51k10J23J89k02K50j75j56
6580a22l6K70j15L7o6Q7K8o0k44K69l8O0j80l4J50l24K99j6q3J1N8K04k29M5j00
$$ plain form
6422 83 171 68 -12 -48 107 -37 -156 133 -123 -162 -62 -47 -180 13 261 8 -176 118 -62 -8 38 -36 204
6445 204 -105 161 228 40 70 213 -159 139 9 -102 109 -24 -1 47 -64 -109 261 -134 -145 -274 -72 -172
6467 -172 104 -148 -192 -68 -103 -144 -31 -167 144 30 -64 -127 30 279 -105 25 26 -103 110 59 -162 -81 47
6490 47 243 -73 -264 -41 -48 15 146 173 132 -219 -29 -1 100 -245 -107 74 -51 182 184 -333 109 -45 69
6513 69 25 229 -44 45 211 -281 71 -173 124 126 -36 -202 -36 206 -161 49 -164 129 -28 -179 -97 210
6535 210 -204 -4 29 80 -90 11 -9 -151 229 122 50 402 -94 -69 -221 -57 34 -108 155 -21 218 42
6557 42 265 0 -60 -175 83 -154 -94 42 -25 -5 -36 -115 -194 -124 -92 59 -151 -28 161 -41 209 34 -122
6580 -122 -158 112 -3 34 -32 55 83 23 -221 48 10 70 -110 -144 6 -318 -19 -35 -118 -107 -49 155 -74 -29 -129
6605a29J80j44j76L37l00J72N02l00n5m31M94r1j97J35j18J10n1K5j8k62K39K35
6627A57j42o1j02O1K88k6j53J59l89L63k64K01J0q3J52j38j37j3K65k26j81M40
6649A81k36k13J54K34j9n5J2K7K5k08L00L6m8q9q9R2q6J94r0nj35m5N7n2k1J91
6675A12L5j86J67k82K29K50l22j43j16N58k09j98K9j08K40L5K33m08j57L42j97
6696i6K68l48L38p4j55J1L8J26j64j5Q9k30J96Q2n7M01m34m9R9O9l3j68L1N4J19
6721I8j40Mj07R6m8J22J12r4J32k56Q3L8j75O9J9L87m20J01j93L18j43j30J62
6744C5P9j88J14J41j30k63J53o5M7Q3j81NM13K5j94J26l73n4J63O8J16j64R6J7
6768F9j82L2J43k17J50j9N0rl9J99j34j57L56J20l91J14j92L5K9L05k04q8PJ14
$$ plain form
6605 -129 51 -93 -269 68 -232 -60 442 142 87 -344 150 59 -138 -3 -121 -11 -62 -37 -55 -317 -78 157
6627 157 15 -46 -148 -87 201 175 22 181 -208 155 -109 92 102 19 171 33 -104 -117 148 -78 -259 181
6649 181 -55 -268 -114 120 101 46 58 85 110 -98 202 238 190 101 12 104 18 212 122 117 -18 -63 -6 -58 -79 112
6675 112 147 -39 128 -154 75 325 3 -140 -256 302 93 -105 -76 -184 56 91 324 -84 -241 101 -96
6696 -96 172 -176 162 88 -67 -56 -18 108 -56 -71 18 -212 -16 66 9 410 -24 -73 26 95 62 -106 -75 -21 98
6721 98 -42 -38 -145 -49 -97 25 137 43 175 -81 2 40 -135 -66 -47 340 -80 21 -172 146 3 -127 35
6744 35 114 -74 40 181 51 -212 -59 -124 -77 6 -175 -170 243 268 74 200 -173 -227 -64 4 120 -44 52 69
6768 69 -113 -81 62 -155 -5 -24 26 17 -22 177 43 -114 242 362 -29 85 -107 -72 -43 262 58 -30 -23 91
6792I1J29j57o8k18J96J07j3j75K2L00l00J19m6O3l43J24J20L03p4J05j56k7j59
6815e7K89k08p9Q0K25m7j89M7j98K64j43K21l27J61r9J93J08k75L3M5J04k87M1
6838i8m2J60j12K61l38J74n9K6j67K29q5j5J05m0k22J39K11k16j03L03Ol8j90
6861a11K54J00j79l0P0j32P7J92j70N7l14L19k31J39l4N4PL6j48J5K3l3J7j31
6885a53K83k31j37J33J18p4L8j04M8J31K1pk76N77m47J29M7p3Q2k01L17m3k25
6908d7P9M8j51J36r1l4K59n9j60J53p8n7n4Q2j42O8NrM4J43k25rk9j21L40l8j94
6935a41L61j95p9O4o8r7J92j24J81j78L6n7J33P3k95J63K0KJ84j28n3L6j17r4
6959a81K05O8m9l04L98j34j50L67j02J41l01o4M3j10N7p6L52l67L54l45P7J55
$$ plain form
6792 91 220 63 -5 -223 -27 80 67 -108 -86 214 -86 33 -13 50 -293 -169 -49 254 180 285 129 102 -57
6815 -57 232 24 -55 25 250 203 14 61 -137 127 -16 205 -122 39 -60 133 241 -34 -1 44 148 -139 -98
6838 -98 -140 20 -92 169 -169 5 -54 -28 -195 34 -51 -66 39 -1 -223 -84 127 -89 -192 111 117 79 -111
6861 -111 143 243 64 34 104 -28 49 241 71 128 -186 133 -98 41 7 61 68 104 -44 -29 -6 -39 -22 -153
6885 -153 130 -101 -238 -105 13 -61 -23 -127 -79 52 73 66 -210 367 -80 49 96 23 105 -96 221 178 -47
6908 -47 32 80 -71 65 -26 -60 199 140 -20 133 55 -2 -56 26 -116 -48 -43 -52 -8 135 -90 -99 -128 -249 91 53 -141
6935 -141 220 25 -54 10 -58 -155 37 -87 94 -84 -48 -105 28 101 -194 -31 -11 -9 175 47 -6 30 -87 -181
6959 -181 24 92 43 -261 137 3 -147 220 118 259 -42 -106 -63 -173 -116 -192 160 -207 147 -198 -121 34
6981C4rj43R3J17l7qj50K72j04L6j90o0L00n79M46J17j39j30K57JJ18j77R2j74
7005a7n9J1J35K03k59J15J38n28N92n10M08k04k7O5n5J48n17L66o7L12j58o4J34
7028A62J9r4j92J57P3k52J35k42L89R0k31J57k12P7p9J39r5r1j01K36k70K97J29
7051B01m00L21Rm0j4o0M4j91L76j20j66j43K16j99K2J23n3J24k06Q6k94O91l54
7074b7k7K0j13J02r7K5J65n9NJ66k06Nn1NJ17j34K33j19kk02K52j11L1K4n3j08
7100a59NoNO4M3j98K75k85L96k95O6K43k06k8J00K22j03n3j45P2J54j89K17J35
7124C30l38K29r6k63L22j28l3j34K51j02j71K04p9q9J59m5l4M2j62J17j60M3L
7147a34P2r5L40k84L1K3K11l00P5J02k11M12l00l9J96j40J67k92K58O7l61K52
$$ plain form
6981 34 25 -118 -25 92 55 47 -103 169 65 101 -89 -149 151 -428 18 135 -4 -134 123 124 242 65 157 -17
7005 -17 -76 -65 70 273 14 129 267 -261 331 -179 229 25 -2 63 8 156 -361 5 -62 250 92 28 162
7028 162 181 87 -105 52 125 -127 8 -234 155 245 14 171 -41 36 -43 96 1 -90 -191 45 -225 72 201
7051 201 -199 122 131 91 77 17 61 -130 246 126 -40 -183 33 -166 -144 -21 -74 50 -156 -70 -364 327 -27
7074 -27 -54 -34 -147 -45 -142 -117 48 -11 -6 160 -46 -41 -92 -87 30 -104 129 10 8 -194 58 -53 -22 2 -51 -159
7100 -159 -154 -160 -155 -91 -48 -246 29 -256 140 -155 -89 154 -52 -80 20 242 139 86 -59 13 167 -22 195 330
7124 330 -8 221 125 -138 184 56 23 -111 140 38 -133 71 -8 -97 62 17 -17 25 -137 -20 -180 -137 -134
7147 -134 -62 -157 183 -101 -70 -47 164 -136 -61 41 -170 242 -58 -97 99 -41 126 -166 92 159 -202 50
7169E0p3oJ24k25J87j30O9J86l09J2K22m5ok02L5Q0N6O1J65k19J87j72l4p6J10
7194D7l3j61j10K42PK39j21k67L15q4o1k6k25L97j54J06l46L00j3r5K36k97K79
7217A75j60N8j5m3k6o7J04q7J24j22MM6J85p1Mk05K24k53L09j14k22N1JK0jl3
7243a14J61k06K10k10J33R6O5m04K16M8j33J94q9r8j56K34R8k83M03J6j42o4j15
7266a40L68k24Oj89K95j57n9J90m8j57L22l51J08j55L61n7m07N63m92J61J41M
7288H3j11QJ56k67J51n7j19Q4P3Q4L1j53n3r1K74k07K23m6j08J68l85K09j22L35
7312A60j30j2J81l13J36Qj35J40j30Q0J68J9m53J19O1K01n8j16M4r0oL28l16J87
7336G3j4j65J04l9j72K6J85K8ON1J20k73K14k3j46L7P3j07QJ40j96J31k54L10
$$ plain form
7169 50 -23 -29 95 -130 57 -73 -4 182 -127 -115 107 62 56 -146 -111 -31 25 86 251 32 219 47 13 -63 47
7194 47 14 -147 -257 -15 -8 231 110 -157 158 74 13 -13 -238 159 5 111 -235 65 52 -43 193 -104 175
7217 175 15 73 58 15 -11 -78 26 -61 63 -59 -55 -9 176 105 109 -96 128 -125 184 70 -152 -101 -100 -80 -81 -114
7243 -114 47 -159 51 -159 -26 70 135 -269 -53 -5 -138 56 -33 -131 -287 -53 45 -238 165 181 39 -25 -140
7266 -140 228 4 10 -179 116 -41 -100 90 42 -115 207 -144 -36 -191 170 113 -294 269 -223 -62 79 83
7288 83 -28 -20 136 -131 20 -37 -156 -72 1 85 116 -37 -90 -181 93 -114 109 63 -45 123 -262 -53 -175 160
7312 160 30 18 199 -114 22 30 -105 35 -95 -15 153 172 -281 -162 -101 100 42 -74 -30 -120 -126 202 -114 73
7336 73 59 -106 -2 -41 -213 -187 -2 26 32 83 203 -70 144 121 -25 12 85 -22 -14 126 -70 61 -193 117
7360A17j68o9L05m26K45n6J3p7n2K3K80j04M7k34R8Q9K2o3J93r1q8L0jo4M6J1
7386B6J3p2q0J68o6K46j79M8j17j60K23J8r0j6k08K64m0j71K60m6k11J37k2O7
7410hj4k7J26k43K63j04k0k06J55M7k48J61L20r2N1k29l24M08J8j68J06N5M8k00
7434a25K38j04pj49N03l98j56K68l2l26K54j49K08O8J29k25j40J53r4K33q1J2
7456H0N2l39Q4N3J68j66R3O0j25J76j09J6j56J11O8k39J99Q0q5Q0p8L0J27M5l43
7481a18L3j04J55o9J11K71k78K17k52j19M23l30K46k83J98J0j7k32R2L88l54j17
7503a29J23K6Qj94J55J12j31J43j43J1Q3k54R7P4k02l4L91j75p7K2L70l41p8M09
7527B66k44k5k4Q1p6J74l18J6K16j05J45k12J50q7R9k60J62K25l87J08J86J52
$$ plain form
7360 117 -51 -120 185 -241 4 -52 -39 -116 -168 -145 135 31 78 -156 -58 31 53 -10 183 92 4 34 33 -31 15 26
7386 26 39 -33 -113 55 -11 235 56 104 -13 -173 50 68 -22 -38 -246 18 -22 -193 67 21 -190 -53 -75 -8
7410 -8 -22 -49 77 -166 97 -7 -27 -233 -78 -31 -279 -118 202 110 161 -68 -392 16 34 -134 -28 27 75 -125
7434 -125 113 9 2 -147 356 -42 -198 70 38 -288 -34 -183 25 93 222 -3 -143 10 -84 149 68 80
7456 80 132 -207 -123 -70 98 -68 25 85 -40 136 27 43 -113 -2 66 -173 26 106 21 101 23 53 180 225 -118
7481 -118 -85 -189 -34 -103 8 279 1 218 -34 -153 270 -60 186 -97 101 111 94 -138 -46 342 -12 -129
7503 -129 -6 20 28 -166 -11 101 -30 113 -30 -19 64 -190 -93 -19 -221 -255 136 -39 -116 -94 276 -65 -143 266
7527 266 22 -3 -27 54 -22 152 -166 -150 66 -39 106 -106 44 -43 56 -204 -42 183 -204 -96 90 242
7549B42k02P5k0p3N4Jk25K04j14l8P0J88k37J09J75k46J47j76O4J31p3N3j78R2
7573B3j60K3p0J23J41p8QO4j05O0Mk31k9K32j56K30m0nj62p1L36j18m1m5l4O8
7599c3J26q3Q1k00K69J26j90j46J9Q0R9r4j8K13l29J43l3j7j54n2L24M1k72K63
7623A63j4k43K10Lq5k34p0J99J92j42j1p0JJ83q2J54j45p0J47r9O6j50M3QK1L2
7649Gj5R5K43k64r7J9j47L30k23k96K87noM9K5J3K0j9j38N3J18m3o9R0j09J99
7675A17o9J00k10j72J95M9n0o2L20m75K43m8K16j39Jj83N3J43K04k15p8R7j22
7698h5k1P9J67k15J03O4k27K73k37J76P0l53L00j71N0J81q6J18k8P2j08m41L03
7721a6K55o7k81p9K63j21L2k3n2j62K59m7q4Q5l5J15k21J83p2J34K8j58n1J93
$$ plain form
7549 242 40 115 95 22 76 77 -148 56 -58 -96 -26 162 -75 34 209 -37 110 -66 -2 129 56 109 -69 23
7573 23 -137 -114 -184 -61 80 2 10 74 -31 29 33 -198 -227 5 -151 79 39 34 -128 -199 137 19 -22 -67 -101 -33
7599 -33 93 10 91 -109 160 286 96 -50 -31 49 148 54 36 249 -80 63 30 13 -141 -193 131 172 -100 163
7623 163 149 -94 116 119 34 -200 -270 -71 121 -21 -32 -102 -101 82 0 154 9 -61 86 -13 53 -97 -54 -46 -25 7
7649 7 -8 87 330 66 -31 -12 -159 171 -52 -348 -61 -66 -72 -23 2 15 35 16 -122 -69 49 6 -63 27 -82 117
7675 117 48 148 -62 -234 -39 10 -40 -102 218 -257 -14 -62 154 15 16 -167 -114 29 233 18 -60 37 -85
7698 -85 -106 -27 140 -75 28 92 -135 138 -99 77 147 -206 94 -77 -27 154 68 186 158 230 122 -319 -16
7721 -16 239 172 -109 -188 75 -46 -14 -37 -89 -251 8 -39 -123 -38 -73 42 -179 4 -68 66 94 -64 -115 78
7745G8k72J20J47L9M4k66O9JO5L7r5k04K91J2J21k4J7l33K00J39l44L93k12l23
7769c00N49l82J97l9j24p6K64k6j19N9m0j75kP1K56p3J32j15j76n5J15J6O0p2
7793e5J7K73l20M4M5q1J65r6J95k63O3PP4k3L6j73J4J04o2r2j58K20j69K88k41
7818a88K07N9K0O5j95r7K91k57J3J57k73J9J03K9K04n5j95j4k3M18l04J85l2q4
7842E3L2j40K16k6j23J36r8j87J48J63k90j5K13j78R4R2l98L22J70j56N5j14K45
7865B14k37k16J66K47j64l8o5J04q2K5J86o6K3o1n6j15%K76k88K45j37o8J16m
7889EJ50l61K50k14J66l27M06K10k95qJ0K34l73R7J44p7J16k08j7J55k48L40o6
7912H9j31o5N9j67J78j42J23r2J51L51o34M9L90k22j96K02L9k9K18k03K17n51
$$ plain form
7745 78 -194 -74 73 112 156 -110 -41 -40 25 62 -33 -237 54 66 187 163 180 -153 47 186 -158 235 23 -300
7769 -300 249 -133 64 25 -99 -175 89 63 -56 3 -37 -212 -214 -143 113 40 172 57 -119 -174 -59 -43 17 -55
7793 -55 -38 235 -85 -41 4 -77 88 -8 187 -76 -13 -6 68 45 81 -92 -78 26 -36 -128 -286 -66 -235 53 -188
7818 -188 19 78 98 163 -32 -129 162 -95 -82 75 -198 -179 -76 -47 157 102 -93 -107 -130 288 -16 169 137 53
7842 53 85 -55 161 135 12 148 50 -137 11 174 -116 -131 82 -96 -2 90 -308 14 184 28 83 -31 214
7865 214 -23 -239 -73 174 10 -28 -93 11 -71 -46 140 74 97 36 -20 -135 -135 141 -147 98 -39 -107 9 5
7889 5 155 -206 44 -170 -4 -331 75 285 -10 -18 -8 226 -147 -50 94 17 133 -75 -92 63 -185 155 89
7912 89 -42 -107 -48 -215 -37 -179 -56 -148 3 354 -280 -231 159 -63 -259 -57 -18 -47 171 -32 185 -366
7934c66M58r6L3j50OJ15k01J85q8l1J45J24k18J7K19o0j06p8P0k24L83m1o5r9
7958f8r4J95j89L2j15J30J06rr7J56R9l67J76J42lN5k37Q9J66m0j08M5p3r8l9
7983a46n4L40l72L19j32m7J85rn3Q9j99O2J39l3j59K30k49J05n8j35K61o2Q3k24
8007a19n6L56l27J75r9j14N2J6N6L7J97N9k85L5K30k36p4L0K10k97K75j06j32
8030a17K47j86m5L3Q9R9j74n5J03j03J37l98O1L19Q4J99l84J91r9j40J86l1M6
8053F2N7j96J5O1p1P8M1J56k20o7J86j0n6R2l3m73L60NL72j91j63j14j05J79P5
8078D0j1J22k08k75L44nj63J17J28p6n6J89k70L53n68L09k8q2L24N2k48J36j10
8101A4O6R0j97J21k02K51k74J20R6q4L04k79q1M1K14m76K41l2K04k75K5J04m5
$$ plain form
7934 -366 92 -4 29 -121 -115 0 -201 -16 -104 -135 10 134 -84 -67 152 92 -14 -92 -22 -246 137 96 31 -68
7958 -68 -162 33 -156 -124 -239 -109 -3 -12 -109 47 146 -221 -45 97 94 149 -88 1 167 127 19 64 -9 -107 -146
7983 -146 -200 140 -232 87 -45 -92 93 84 31 120 -79 -17 122 89 -70 160 -89 16 -42 -177 84 22 105 -119
8007 -119 -175 181 -146 29 -70 -184 -132 -116 -60 -23 174 233 -52 -17 213 -23 -97 -67 143 -154 121 15 -117
8030 -117 130 -56 -101 -68 21 120 -54 -109 -6 -109 28 -370 -309 10 94 293 -91 100 1 -139 47 16 62
8053 62 119 -77 -62 -1 -72 6 47 203 -17 -84 102 92 36 128 95 -378 -18 -13 359 168 5 -109 -214 -35 40
8078 40 29 151 -57 -332 12 7 -156 -39 89 13 -43 146 -124 229 -339 -30 -58 -140 184 236 -12 124 14
8101 14 80 170 -27 94 -108 143 -131 -11 85 1 305 26 -55 -14 200 -276 -35 -67 137 -138 -113 -9 -54
8124e4K70k43M0M2n2J53j2p0j17J15L22l60j27M0j3J90k14J71j4k69J32r6K84
8147A18r3j87R2R7M3J97k77p7K18n2j73o5J12OR0n5Q0k41L19l94J76O9k70L33
8171F6j49J64O4l9J17k10j73q4J99j99J65O4P3Pj70N8N6m6J5J90
$$ plain form
8124 -54 216 -27 13 55 3 156 144 74 -43 72 394 34 -93 -53 -66 124 -90 81 67 -202 -70 -166 118
8147 118 25 -162 -70 27 70 267 -10 -87 131 79 -94 -159 -47 -41 49 -6 74 -167 152 -242 -66 3 -267 66
8171 66 -83 81 145 106 223 13 -160 -244 -45 -244 -79 -15 58 65 -105 -47 9 -37 -22 168
8191A68
$$ Imaginary data points
##PAGE= N=2
##DATA TABLE= (X++(I..I)), XYDATA
0@%%%%%%%%%%%qJ6j6J6j8K6l3M1n1N9p2Q8j04J21j40J64j94K23k55K92l31L78
33B02m29M84n46O13o88P72q63R61j067J184j312J452j605J771j955K156k375K617
51A372k883L176l503L868m279M744n273N885o603P457q494R781j1430J3636j6752
66i298K1520k9814M8351j67804L0470K11520o6243J41011l98j86294o8903p173
78h3055j02920Q4482J35756M8613O3301O376j33797p3241n8583n1663P9483J14063
90B8815M6955O9944j0095j06201p7045q4286m8664J23034J15996K3993N0211k0383
102A12274j22751m9203k9689m2034O9613R2454L8486N9970j9288j12034m9553
113e1755m6481m1722R8566R0110M412O5587J835j35142n5189j3331n0581Q6149
$$ plain form
0 0 0 0 0 0 0 0 0 0 0 0 0 -8 8 -8 8 -10 16 -17 24 -27 32 -40 48 -56 65 -75 89 -105 118 -137 155 -176 202
33 202 -227 257 -289 324 -364 408 -455 506 -561 623 -689 763 -842 929 -1026 1130 -1245 1372
51 1372 -1511 1665 -1838 2030 -2249 2495 -2778 3107 -3496 3961 -4533 5248 -6182 7454 -9298
66 -9298 12222 -17592 30759 -137045 -106575 104945 38702 179713 179315 -6979 -75882 -83055
78 -83055 -185975 -101493 34263 82876 146177 152553 18756 -54485 -113068 -164731 -85248 28815
90 28815 75770 145714 135619 29418 -47627 -131913 -180577 -57543 58453 82446 132657 112274
102 112274 -10477 -59680 -89369 -131403 -61790 30664 69150 129120 109832 -2202 -51755
113 -51755 -98236 -139958 -41392 48718 53130 118717 120552 -14590 -69779 -83110 -133691 -47542
125d7542J27383r871P466J8626j03760o9715J0461k5496L5412J02933K9190Q622
137H3709L356q7434p6005n033n169M5839R0507K6720R23n901p4555o9145j0463
150h2651M956N2371P7532J9496k671j4114o5489m8582p234o272M2917P3871K3057
163F7187O375j4129p8012m9691N171l131M2142P8718J0869r550k393o7169n9721
176g3334J3384R738K7181P2473K0705k2483r860m6996n4672M451J5148K3557O1397
189D0689L0298j7980k1414m6416m9319L318K3607K8635M9081K2100j5357k1316
201B5926m1784m2787J528K2259L0414M5180J8396j6036k1807l8332l6535J641
213e1937J8811K9392M4565J7355j6831k3585l8344l4567O936K2679K5564L9531
$$ plain form
125 -47542 79841 69970 77436 96062 -7698 -77413 -66952 -92448 -57036 45897 75087 83709
137 83709 87065 -369 -76374 -81407 -86576 -40737 49770 76490 77413 71512 -3043 -72188 -82651
150 -82651 -77695 -25324 52208 71704 69033 54919 -10570 -59152 -66386 -72658 -29741 44130 67187
163 67187 73562 59433 -18579 -68270 -63099 -66230 -24088 54630 65499 55949 53556 -13613 -73334
176 -73334 -59950 -50212 -23031 49442 70147 47664 37804 -9192 -63864 -59413 -44265 -20708 40689
189 40689 70987 53007 31593 -14823 -64142 -60824 -37217 -8582 40499 62599 47242 25926
201 25926 -15858 -58645 -57117 -34858 -4444 40736 59132 43096 21289 -17043 -53578 -51937
213 -51937 -33126 -3734 40831 58186 41355 17770 -20574 -55141 -48205 -25526 38 39569
225C9569J5081k0064k0667l1636l4673M582K6263K4436L4367J6149k0420k5367
237G620k7099k8213K451K5585K5277L0162J5166j9302k7519k5892k3680L313K6038
250a6093K5595K4632J1259j5784k6752k6004j9682M274K3694K5648K4057Q348
262D3192j7262k5810k3188j7564M215K4000K5411K0680O255j5867k5030k3528
274b4496j4350O574K2640K2471J9778O054j7324k5228j9271j2936M676K3194K4175
287A5957J5826K603j4844k3686k0597j0263P352K1882K1145J4868K760j5332k4286
300f615j7854p664O534K0296K2245J3333l60j4632k1742j8085o573Q391J9377
313c349J9756J2070k30j5124k0909j6368n122Q343J9296J9021J0142k407j3797
$$ plain form
225 39569 54650 34586 13919 -17717 -52390 -47808 -21545 2891 37258 53407 32987 7620
237 7620 -19479 -47692 -45241 -19656 5621 35783 50949 31647 4128 -21764 -45444 -42131 -16093
250 -16093 9502 34134 45393 29609 2857 -23147 -42829 -38555 -14861 10787 34844 43192
262 43192 25930 120 -23068 -40632 -36417 -12417 12994 33674 39929 24062 -968 -24496
274 -24496 -38846 -32272 -9632 12839 32617 38671 21347 -3881 -23152 -36088 -31412 -8218 15957
287 15957 31783 34386 19542 -4144 -24741 -35004 -27652 -5770 15375 30243 33003 17671 -6615
300 -6615 -24469 -32133 -25599 -5303 16942 30275 29915 15283 -6459 -24544 -31117 -22726 -3349
313 -3349 16407 28477 28247 13123 -7786 -24154 -29276 -20933 -1637 17384 27526 25119 11322
326A1322j9751j5425m154R261J8182J7848R396l082j4353j8708j3727k641R326
339a6506J6911J6966Q656m429j4492j6582j3014k913J0571J7756J4620O317l777
352B0084j3376j7519j1436o5R277J5066J5476O676o310j3748j5017j0235o18J0223
366a1522J5116J3350N546n537j3488j4679r582O30J0554J4521J1437M615n096
379A5865j3689j4192p739J248R726J4037J1484L209o389j2455j3005p101J692
392a7309J0024J3324R799K616n423j1860j3425o277K800R860J2109J0158J341
405A7737o733j1022j1698o306L049R975J1737R001J213p250j0914j0068n469K883
419a3865R812J0989Q013Q47o341j1479j0290l766L452R120J0959P570m17o907
$$ plain form
326 11322 -8429 -23854 -28008 -18747 -565 17283 26679 23597 9244 -9464 -23191 -25832 -16506
339 -16506 405 17371 26027 21598 7106 -9476 -22490 -25403 -14832 2924 17544 23861 20084
352 20084 6708 -10811 -22247 -22312 -13035 2031 17507 24183 17873 4125 -10892 -21127 -21745 -11522
366 -11522 3594 16944 22490 16953 3465 -11214 -20796 -20166 -9612 4909 16346 20961 15865
379 15865 2176 -12016 -19755 -18507 -8781 5256 16740 19949 13560 1105 -11900 -19001 -17309
392 -17309 -7285 6039 15838 18454 13031 1171 -12254 -18531 -15731 -5871 6238 16396 17737
405 17737 11004 -18 -11716 -18022 -14973 -4998 6739 15740 16953 9703 -1211 -11279 -16748 -13865
419 -13865 -4053 6936 14949 15796 9455 -2024 -12314 -16080 -12628 -3508 7451 15021 14604 7697
433G697j0342r298l251L827Q470J0820O687q78p044r432r197k804N112P741Q804
448F912P499j020p763q830q812k723O097Q297P834O181r44q368q315o678k920
463a3553M994R121P198M850j113p332q598o570j592M502Q643P803M391k045p283
478C416q482o375q15N675P918P031L820k620p479o780n625j303N819P440O168
493G808M268k980p668o409n365j401O416P914N446L633k660q808o287l290j443
508a0826O219Q430L883K423j688q009p043k250o37M577Q667M268J849k035p463
523C65p437k490P17M943P627M854P87k946p102o024k271Q91N216P043L360J276
539H809k562o993n694j965J30N318P170L305R84k473p365n375j070j09N324P995
$$ plain form
433 7697 -2645 -11943 -15194 -11367 -2897 7923 14610 13732 6688 -2744 -11941 -14745 -9633 -1892 6912
448 6912 14411 13391 5628 -3202 -12014 -14737 -8640 -343 7491 13672 12728 4360 -3955 -10633 -13553
463 -13553 -8559 562 7760 12610 11497 4165 -4433 -11003 -12595 -8093 550 8353 12744 10699 3416
478 3416 -5066 -11441 -12256 -6581 1337 8368 12188 9568 2089 -4691 -10316 -11619 -5800 1640 7808
493 7808 12076 9096 1428 -4981 -10346 -11747 -5331 2583 8029 11662 9002 194 -6093 -9383 -10826
508 -10826 -4607 3823 7706 10129 8441 432 -6611 -8861 -9498 -4921 3746 8014 9863 7828 365
523 365 -7072 -9562 -8845 -3902 3725 8579 9366 6420 -682 -6706 -8977 -8086 -2870 4173 7533 8809
539 8809 6247 -746 -6440 -8405 -8275 -2957 4213 7518 8502 6029 -1336 -6711 -7781 -7890 -2566 5429
555E429K248m68j647p079n793L6J021L568P646K672r92j442o447o097M3J463L750
572b089P018L456j933k567n565n658j53K417L898O117K552j514k855m812n122
587f810k5K184L595N316K764j153k773n310m501K65J939L688N871K288k383k053
603B902n497m506J138K624K957N575J739k622j892m215m983N77L174K425M946
618D342K799k936k559l630m673N82L795K647M189K307k736l250l211l594M07L615
634a906K683L171K185k269l458k777l233K54L094L284L367J407k180l107l298
649b783k979R80K930K849L219J434k913k467k718k748P83L096K419K972J288k568
665B794l078k149k720N32L603K651K082J504k363l748j857k068O63L435K545J754
$$ plain form
555 5429 7677 7209 5562 -1517 -7310 -7274 -6253 -2685 4961 7633 6641 5199 -1248 -7345 -7302 -5839 -2089
572 -2089 4929 8385 6452 3885 -1680 -7338 -7491 -5074 -1176 4941 7493 5979 3124 -1688 -6810
587 -6810 -6835 -4651 -1056 4260 7024 5871 3098 -2212 -6713 -6448 -4509 -821 5050 7338 4955 2902
603 2902 -2595 -7101 -5963 -3339 -382 5193 6932 4310 2418 -1797 -6780 -6203 -3029 -604 4342
618 4342 7141 4205 1646 -1984 -6657 -6075 -2280 367 4556 6863 4127 877 -2334 -5928 -5521 -1906
634 -1906 777 3948 6133 3864 406 -2371 -5604 -5350 -2256 1028 4395 5802 3622 515 -2783
649 -2783 -5762 -4782 -1852 997 4216 5650 2737 270 -2448 -5196 -4413 -1317 1102 4074 5362 2794
665 2794 -284 -2433 -5153 -4621 -1018 1633 3715 5219 2856 -892 -2749 -4817 -4154 -719 1826 3580
681C580J321k285l321j902j773L49L384K635J805O82k084l205k283j377J023L025
697d26K464J752L48k219l143j713q04M48L106K154J711K73k218k871j422j213
713c773Q81K832J995J377K34k225k667j402p89P88L009K220Q01j16j676l237j133
730b881n62P55L042J860Q73l46j504k765j451j29Q39K425K485N64n23j489k712
747a519j469j60J094K400K007N25m98j491k393j531N32O39K201J845O96n68j782
764E28k231p39K18O29K188J844L24o28j576j921j322L43Q66J871J883J54q40j163
782D28k039o10k2J319J557J403N01r82j158j863q46K21R74J945J320jm67j843
800a63j380p78L40J067J847J166J59r63j065j845o81L96J240J387J056K77r48
$$ plain form
681 3580 4901 2616 -705 -2607 -4380 -4031 -647 1988 3793 4475 2391 -814 -3097 -4474 -3451 -426
697 -426 2038 3790 4138 1919 -1224 -2937 -3741 -3293 -187 1967 3678 3951 1733 -1138 -2560 -3773
713 -3773 -2892 -60 1935 3312 3546 1321 -1346 -2748 -3537 -2749 260 2480 3281 3165 1489 -1748 -2881
730 -2881 -3443 -2688 354 2214 3087 2741 1237 -1528 -2979 -3108 -2269 156 2641 3205 2682 1193 -1519
747 -1519 -2988 -3148 -2054 346 2353 2878 2380 889 -1504 -3035 -2503 -1864 337 2182 2878 2310 528
764 528 -1703 -2442 -2224 -1595 593 2437 2761 2133 557 -1364 -2686 -2343 -1477 394 2277 2431 1591 428
782 428 -1611 -2221 -2243 -924 633 2036 2537 1555 397 -1466 -2312 -2091 -1117 828 2148 2147 1680 -163
800 -163 -1543 -2321 -1981 -914 933 2099 2258 1295 230 -1615 -2296 -1900 -660 727 1783 2060 1112
817A112j414j015o76L04J211J196J444j92j052j154j511k86N28J027J143J374
833B039k30o99j347j275n84O97J079J368R56k30j146j371p46n20Q15Q32J228Q30
851A696j39j042j085o72l76K32J281J386L77l4j034j243q06j81P78O29J311P42
869A820l44q38j215o86m84Q90J001R94K15j7r94j124p81lP28J188P95K60j47r46
889C12j237l19k03O70J178P01M12l21q44j091m63k97Q22J135O01K13j50r74j165
908a020n50K99R11O78Q42L97o24o73j116l64j21O90J040P83L75q63q17q42k13
927a188O0P79O48P67M29r12o26r11n07K77R18O26Q22k17l71r69o26k55J61O57
947d38R04O33Q3n64q31n91m68M89O73O39O33j05l69p66q03j4NP73O22N68j7n46
$$ plain form
817 1112 -302 -1317 -1993 -1689 -478 718 2162 1970 918 -236 -1747 -2033 -1505 -478 665 2039
833 2039 1809 1110 -237 -1512 -2096 -1399 -320 1048 2004 1774 628 -743 -1489 -2009 -1194 -362 866 1696
851 1696 1557 515 -570 -1242 -1618 -1386 -105 1281 1658 1624 590 -653 -1459 -1640 -862 -233 1078 1820
869 1820 1476 638 -577 -1263 -1747 -857 144 1138 1353 1336 342 -782 -1563 -1566 -838 350 1145 1405 1258 312
889 312 -925 -1244 -1447 -777 401 1102 1514 1193 349 -742 -1205 -1502 -680 455 1056 1269 1119 145 -1020
908 -1020 -1570 -1271 -360 318 1160 1557 933 260 -856 -1220 -1341 -651 389 1172 1547 684 -133 -975 -1188
927 -1188 -1128 -349 299 1066 1495 583 -43 -954 -1461 -1184 -266 360 1182 965 594 -375 -1001 -1256 -1095 -438
947 -438 466 1099 1182 618 -213 -804 -1272 -783 -110 529 1162 1057 688 -78 -881 -895 -890 -117 505 1073 1056 510
969E10m92q70m53L20R05P14M76L7n44j006n69j88M79O69O97M53l76l78n70o46
989h32l04O16M06R27J44j64l95q17m36%L26M34Q23L11j47p65o14l37j49M59O56
1010A42M28N88m59n55p31l77K44K35O37P08r7l28l90m76m33J28K49N58P81J53
1030A005p21l49m49j97m2L65N12N54R5j69o24n01k39j16P09M49L98N9l52j06q19
1051e38j25j45M21N22M80K65o10m00o08J64M7K22O71L13lj22q45m21Q3P3L63N36
1073C43o1K45q4n43n26M7n2L50P69J86K06o48n84j87j75N22J81M91M5N9m25j48
1095A1m00j81K04L74M68J11L69p96l27k16l04J34P23P8K81P5l01q28k26J66K80
1116c05N43M14j36o8k29m88j85L4k0L22M27K08p7l33m11l38R9J74N87J96J76k22
$$ plain form
969 510 18 -852 -1305 -985 -80 634 1110 1147 603 -403 -972 -1160 -681 -12 685 1138 762 384 -186 -832
989 -832 -1136 -520 -114 813 957 793 398 -419 -855 -855 -529 -95 728 1039 892 127 -487 -824 -973 -514 142
1010 142 570 1158 699 144 -587 -964 -720 -485 152 860 763 435 45 -431 -864 -736 -487 71 852 1005
1030 1005 284 -65 -514 -711 -753 -388 124 678 773 604 -20 -521 -760 -876 -167 282 680 739 387 281 -538
1051 -538 -663 -808 -387 135 615 880 270 -130 -738 -574 -527 -305 366 679 676 554 -291 -712 -629 -556 -193 343
1073 343 282 527 443 -100 -626 -579 -631 -281 488 674 880 232 -352 -539 -714 -192 -11 480 525 584 159 11
1095 11 -389 -570 -366 8 476 587 956 160 -167 -383 -687 -553 170 248 529 604 303 -525 -751 -585 -305
1116 -305 238 652 516 448 219 -269 -454 -420 -440 -118 309 517 440 107 -304 -642 -543 -369 218 414 590 368
1138C68l93k18l87K21M7O01L04J57k92j48n83J49k20j79M78O02n2j9m93l43j5
1159d15j08M87K21M96j54l4n21k37k48J99K80K57L47N2k92o51n1J22j29K55L61
1180B37po8j53k32p6j98K21p7P47J75j80j26k70j53k29j4O45M9K31k17k98j99
1202a92k30O8J25L36K65M7j57l35k85J59M3j20J56K06K29Ql62o7N0j60k92M46
1224f2K94M8K16l56n34K39lJ10K10J84j09j8j73j51k51O1NK79K37J92l12j47l09
1247c50o0L58L4J26Q5L48k96j2j32m29K9J71L25j89L38k29l21J9K0l00M02J60
1269I7J08L3L7m14J54l51J0L22J86j1K70j70l38m60M52n4l5M90j72l0ql75mK65
1293Bm10L49O8L10k05Q3k5m24O8k19M25K1QR9j16q4k01o2j8L39L23l56K21N8l21
$$ plain form
1138 368 -25 -243 -630 -409 -362 239 543 700 408 260 -323 -174 -394 -573 -95 507 455 436 -57 -400 -415
1159 -415 -523 -36 185 681 527 493 -28 -265 -513 -314 -34 223 570 622 330 -321 -372 -250 -379 -124 237
1180 237 230 162 9 -223 -299 -497 -276 -353 394 569 389 263 -7 -160 -389 -403 242 291 522 305 7 -192
1202 -192 -422 -354 -229 107 372 419 262 -73 -358 -199 -156 -276 -120 86 315 323 -39 -106 -56 -216 -508 -62
1224 -62 232 280 496 140 -394 -155 -158 -48 162 346 237 219 46 -105 -356 -295 -290 -11 226 418 106 -41 -350
1247 -350 -410 -52 -18 108 193 541 245 233 101 -328 -299 -128 197 8 346 117 -204 -185 -165 -465 -63 97
1269 97 205 238 275 -139 15 -336 -326 -4 182 171 441 271 -67 -527 -75 -129 -164 326 154 124 116 -259 -263 2
1293 2 -408 -59 9 319 114 197 172 -252 -184 -403 22 43 51 150 34 -50 -251 -313 -331 8 331 -25 196 254 -67
1318f7k36K29o0Q2J71j16L49k96n4k85Q7M7J62J05J63p4K13o15j27O8pL38O6N7
1342B00k69K28j58j82J09R3j02M12m39L76j67m70K09QO6J79j75J21m8J02j04m03
1364d14L20l9K77KJ3J3j99j88lJ30N4K00j04J88Om26J16M0k9J51O5K44k13k77
1388g3m6r2N8pJ77P0j26J92r5j69R3j4n4L4J88j35N3L2j61K51m13J49P5K98k65
1413B0K71j79j8j56m6K6N5K89j29Qn0j90j46J99o8L35j00j02N9q7M3o5j04K81
1437A46m3Q4J6kJ6l26J22l67K79L1J16K68j73j86lq0Lj39K86j6K59l53l39K77
1461a24j02J48l6K63r8O0J01l59L7L3N1k38N38l85L00l21K12j04j34J9J77m6n1
1484e9J07k21J26o9R6M5j13l3K00k19J77l18J18Q4k24L74j52k29L66Qo1K23j04
$$ plain form
1318 -67 -303 -74 -134 -52 119 3 352 56 2 -283 -196 -149 13 118 281 207 420 -195 -322 -254 -261 77 143 200
1342 200 -69 159 1 -181 -72 21 -81 331 -108 268 101 -369 -160 -152 -86 93 -82 39 -9 93 -11 -414
1364 -414 -94 -133 144 146 159 172 -27 -215 -218 -88 -34 166 62 250 256 -170 -54 -14 -43 108 173 417 204 -73
1388 -73 -119 -211 -153 -160 17 87 -39 153 58 -111 -18 -32 -86 -52 136 1 54 86 -75 176 -237 -88 -13 285 20
1413 20 291 112 94 -62 -108 -82 -27 262 133 141 91 -99 -245 -46 -114 221 121 19 78 -9 34 -31 -135 146
1437 146 103 187 203 201 217 -109 13 -354 -75 -44 72 340 167 -19 -22 -102 -99 -238 48 32 291 -62 -401 -124
1461 -124 -226 -78 -114 149 51 111 212 -147 -110 -77 -26 -264 274 -111 189 -132 80 -24 -158 -139 38 -8 -59
1484 -59 48 -173 -47 -116 -20 25 -88 -121 79 -140 37 -281 -163 -79 -303 71 -81 -310 56 64 3 226 122
1507A22Pj17p9K92p2j02j75L53k13q5J54J43l81K34l18K18l52J95K40m5R3l19
1529b07L34j71J63L7l03J39O7l5N7J41Jk02r5k2Q9j59K50J21j31j57n8j4J59K21
1553B25j71m2j61K38r5L7%j94K23m0N7k18J87K2m2J10j63O9N0L3j48r9J78j96
1577a40K71k87QJ12J63k54K40J0m03J63J14k49Q5J65k6r2L8J95k41K14l80J83
1599a11q1K67L1j86P7M9j87J75o5l11K89P7N0p3m6lP5K6o6m9J17j36J86P7k53
1624g1R9q1K4r2L83j93j18k17J70Q1J36O2l73n5J52K50N2l77P1K79m36Q2J18J64
1648A10k54q3J63L93k29J4o2l82J28K00o4R7Q3r1l17K10J13q9K11k4j33p1K21
1671A44l60J52L8j10L42j63P5M6j80m1o0L52p0r1k7k4K21j19l47M38l29P8M2k5
$$ plain form
1507 122 129 12 -67 225 153 51 -124 229 16 -69 85 228 -153 81 -237 -19 -371 -176 64 19 112 -207
1529 -207 127 -44 119 156 -147 -8 59 24 81 222 223 21 -74 -96 -7 -166 84 205 74 -83 -141 -155 4 225
1553 225 54 12 -149 89 -6 31 31 -163 60 20 77 -141 46 68 26 136 -27 42 92 125 -23 -122 56 -140
1577 -140 131 -156 -148 -36 127 -127 113 123 -280 -117 -3 -252 -167 -2 -28 -120 -82 113 -128 86 -294 -111
1599 -111 -192 75 106 -80 -3 46 -141 34 -31 -342 -53 24 74 1 -45 -48 27 53 -13 -62 55 -81 105 182 -71
1624 -71 28 -53 -29 -121 262 69 -49 -266 -96 -15 121 183 -190 -245 -93 157 209 -168 -97 182 -254 -172 -54 110
1648 110 -144 -227 -64 329 100 114 52 -330 -202 -2 -66 31 114 23 -294 -84 29 -60 151 127 -6 -77 144
1671 144 -216 -64 -26 -136 206 43 118 164 -16 -57 -117 235 165 74 47 23 244 125 -222 216 -113 -35 7 -18
1695a8q0J80N8j69j97K46O2j35R8k67K47J32J45j97j4q9l1PO5j73J46j41o2J60
1719b7rl98L50K80k25k00lJ87j65L37j85K9L68m00L6J2O5j1RqJ06j99K02k02K62
1744B11l28R0K19k54L85l70M0p1l5O3J62n6k60K69K2m1n6R3p4k6J05Mj50K39p
1769A74j61J12l43J59K36j1J70o0l08k3r4l9K69j86J95j6l0ln2k4o7K13J70l00
1793a9K17l64K58k36L31j11k25p9L08J07k80K3K54k45J1R9L6J5%k47j6J19o2M5
1817f1p7L36m9j03Q1Qp6j3K19j18j47J5J14j86q3N1P9J7J27Nn7j02R8J0p0j92
1843a74J88k0j29L12k97R5O2j29K4P5K4J3N7K2l8q0k9j00J73Q0k17P4M2M5k8j31
1869h6J26q5N7p4K05j91m3L47l85r0K04o3q6L50l16JQ2PJ29k92N3K02j87K27k0
$$ plain form
1695 -18 -98 82 140 -29 -226 20 82 -53 45 -222 25 157 302 105 91 2 -29 -22 43 -130 16 -125 -187 -27
1719 -27 -36 -434 -84 196 -29 -229 -232 -45 -210 127 -58 -29 339 -61 -25 -13 52 41 50 42 148 -51 151 -51 211
1744 211 -117 -27 192 -62 323 -47 -7 -78 -113 -50 112 56 -204 65 87 46 -10 83 9 -17 88 92 -58 181 174
1769 174 13 125 -218 -59 177 166 336 276 -32 -55 -149 -188 81 -105 90 74 44 41 -11 -35 -102 111 281 -19
1793 -19 198 -166 92 -144 187 76 -149 -228 80 187 -93 -70 184 -61 -50 49 85 100 100 -147 -163 -44 -106 -61
1817 -61 -138 198 149 46 127 135 59 46 265 147 0 15 129 -57 -140 -89 -10 7 134 139 82 -20 78 88 18 -174
1843 -174 14 -6 -135 177 -120 -25 37 -92 -68 7 31 44 101 123 85 5 -24 -124 49 129 -88 -14 28 73 45 -86
1869 -86 40 -45 12 -62 143 -48 -91 256 -129 -219 -15 -78 -164 186 -130 -129 -47 -40 89 -203 -150 52 -135 92 72
1894G2j69J78q5m1O3j99K55M2l35K79k25o3jL25p2k13K46J70l78NJ92k14L92n8
1918A66J8k47Kj33L90r9j10j50N03k82M8l53K50o8J30K7ll21m9L58j75Q4j12K56
1942A30J51j88j12L9j69R6j24K35k68R8j81J38K17l30J70Q7j91Q8o8K84j99L2
1964f5J09n5Q7k30J49J24l30L96J0l2j69j27K61R9k63n8J74M8k33n6Q3j06L41
1987A57j95l5j42K63q9m39P34k8l09N6J75k00M79n39J61k22J69k12J87J21m36
2008c44L17Nj8j37J01J07j36Q5r8K30l3Mj24K20J97l29J67k46Q0j68P6o6QL6J25
2033E9l74K87P1j14p8J35j39R8o7n6K78k72PK31l40L35O3k85K20J38j88l8j00
2056a29K94m10P3J52l2J04j72K49k78K72j45J79l53K20J31k15M0pJ42Q9j2k33
$$ plain form
1894 72 -97 81 -4 -45 18 -181 74 116 -219 60 -165 -228 -229 96 24 -189 57 227 -151 -146 46 -168 224 166
1918 166 184 -63 -61 -194 196 97 -13 -163 340 58 106 -247 3 -65 65 92 89 -232 -281 77 -98 -14 -126 130
1942 130 281 93 -19 20 -149 -53 -177 58 -210 -112 -293 -155 62 -268 -98 -11 -202 -114 -182 102 -97 -65
1964 -65 44 -11 76 -154 -5 119 -211 185 195 163 -6 -133 128 227 -36 -94 80 128 -105 -161 -78 -184 157
1987 157 -38 -73 -215 48 -41 -480 254 226 -83 -27 148 -52 427 -112 49 -173 -4 -216 -29 92 -344
2008 -344 -27 -22 -40 -177 -76 31 -105 -20 -118 112 79 83 -41 179 376 47 214 -32 48 -120 -44 -110 -102 -66 59
2033 59 -315 -28 43 -71 -149 -14 -153 -55 -122 -178 100 -172 -165 66 -274 61 124 -161 59 197 9 -29 -129
2056 -129 165 -245 -172 -20 -52 52 -120 129 -149 123 -22 157 -196 24 155 -60 -20 -27 115 204 192 -41
2078d1N8K58m07K13J4k48L45j92J45j36p5J97k74J78k03J6K81j74J79r8l3Kk13
2101b08K39j4j92l0K33k6lRj22J1J38P1n4Kq5k91L71k92M02j63N4j38R1J6K7m1
2127Ek19Q4K4K33P9k97J85L0j64j49J73l5K04j72k16Q6k24L86j02O2n4k68J14
2150b35L24O6j14K32j61l5j84K85k43Q9k0j67K06j1k40l6K38Q3KN2r2O1J07j47
2174F0k26M32l24J86m32K85K87l39K7J1n5N7J35l8P9k89K16M9j27l2J67K8k26
2197f9q5K20j19J37k6j61K70J69m66OK30p9j45J90N6j00qOj27j04K7N7J29j45
2221a37K75m4q9pN0k22L15k54J80O3k66K32k9%l3J30k00n4J41O1n0k2j80K2J07
2246a1J14j97L02k66J01J10k24L01k46K65k51L2j8K3o2j32L96k77L24l25O1K8
$$ plain form
2078 -41 17 275 -132 81 95 -153 192 0 145 9 -66 131 -143 35 -168 -152 129 -45 134 36 3 5 -208
2101 -208 31 17 -175 -205 28 2 -1 8 -114 -103 35 106 52 54 -31 -322 49 -243 159 -4 50 -88 3 19 46 5
2127 5 -214 -130 -106 127 206 -91 94 124 -40 -189 -16 -51 153 -19 -235 -149 -373 13 -89 -27 -81 -349 -235
2150 -235 89 155 41 273 112 77 -107 178 -65 24 4 -163 43 32 -208 -244 -6 77 79 131 39 100 207 60
2174 60 -166 266 -58 128 -304 -19 268 -71 -44 -33 -88 -31 104 66 145 -144 72 121 -6 -38 129 157 -69
2197 -69 -154 66 -53 84 58 -103 167 336 -130 -124 106 27 -118 72 128 28 20 26 -101 -205 -178 -121 8 -137
2221 -137 138 94 5 -2 48 -174 141 -113 67 130 -136 96 67 67 34 164 -36 -90 51 112 62 40 -140 -118 -11
2246 -11 103 -94 208 -58 43 153 -71 230 -16 249 -2 30 12 35 -27 -159 237 -40 284 -41 20 48
2268D8j49K05l36K19k13Q6j17J84J66k24J3J69k8pq3K37k57J06J42k23Q1N1j95
2291a25J33r2J83k8Lk12j60L55j81R9j13J01K55k5j67j7N6Jj07j04O3L33j35l56
2315b40J93j52J61K3p2J38j92J46n0L5N3m9M2p1k02J70Jj03L7K19J70k24j45K89
2339A77k11j1Qj3Kj13K13k18m3O36l72oj59j34M25j64j58p2J4K90r5L6k22R4N5
2364d1l9qK5j57L62k1l18P9L8J08j15J87l60K14L6K05k51L6L4r1L28j17k05O6
2388eK8m5N5k17J88k25K59r9K65j34j66J31O6R9m31K88k52K20M14n34NJ49j42
2411h3K59j8j21k98M19j75o3K22k77P3J31pl6jj28L66j97m0j27K88m15K64m8n2
2435f4J75nK6j57j96K97Q8j52N7k98J31j1P4K77j91j75K00q7K1l9O5j38J51j12
$$ plain form
2268 48 -101 104 -232 -13 -226 -140 -257 -73 93 -131 -118 51 23 16 -67 170 -87 19 161 -62 19 70 -125
2291 -125 8 -84 99 71 74 -138 -298 57 -124 -25 -138 -37 218 193 26 9 65 66 -41 -145 -82 251 116 -240
2315 -240 -47 -199 -38 -15 -87 51 -141 5 -45 -10 43 -6 36 -35 -237 -67 -66 -169 -132 87 257 33 -112 177
2339 177 -34 -45 -37 -50 -48 -161 52 -166 -209 427 55 49 -110 -244 181 17 -141 -213 -199 91 -4 32 -190 -96 -41
2364 -41 -80 -88 -63 -220 142 121 -197 -118 -80 28 -87 100 -260 -46 -10 195 -56 -20 14 -77 251 134 -71 -5
2388 -5 23 -22 33 -184 4 -221 38 -61 204 70 -96 35 101 200 -231 57 -195 25 439 -95 -90 59 -83
2411 -83 176 158 37 -261 158 -17 -80 142 -135 -62 69 62 26 25 -103 263 66 26 -101 187 -228 36 -12 -64
2435 -64 111 106 132 -25 -221 76 164 12 69 -229 -98 -109 -35 242 51 -124 76 -11 10 -29 36 -102 49 -63
2459f3Q3J78q6k54p6K19J3K02j72J18p3jp9l3J82k95J69K4J3j04J5P2o4j00K66
2484A54j52j23J63k39K92q7O0n6K27k80l6J19q0q5Q6K93J94l65j13J18k57j22
2506b89J53P1J98k86J56Q0J92k47l5j86J28l8J41O9Q1l32R9Q4j73J28NK33p6k77
2530a21j74M24P1Lk85J87J3j33Qk17J60J96j09J06q9l5K31k72M29n01Q9J36P1
2553A88j96J75k12J73j24m4J74j42j6J20l1k18L22n02J69J78O7J21j00l7k76L57
2575A46k81P5L53l74k8P1K2K7L2k08J82P2K43n16J70k63L69k65k4j7N67l80J11
2598H4q4j5P2J61o6j52L3JJ6R1j65N7K17n68J59K4K65r0j35P4j02J42j6K69n43
2623b71K80K3k0P2j00j63J92K7k93L60k28L14l62J46K34k96l8P8J34p5m1N7k61
$$ plain form
2459 -63 20 198 112 -142 -218 1 14 216 44 162 89 88 9 -24 158 -137 32 56 69 -35 -20 52 -12 -112 154
2484 154 2 -121 42 -197 95 8 68 12 239 -41 -77 42 -38 -123 -37 256 450 85 -28 90 -167 -289
2506 -289 -136 -65 133 -153 3 83 275 28 -7 -193 -65 -103 38 107 188 -144 -45 39 -134 -6 -1 232 156 -121
2530 -121 -295 129 200 203 -82 105 118 -15 -7 -224 -64 132 23 129 40 5 236 -36 393 -108 -19 117 188
2553 188 -8 167 -45 128 4 -40 134 -8 -24 96 65 -153 169 -333 -164 14 81 202 102 65 -211 146
2575 146 -135 -60 293 -81 -109 -38 -16 11 43 -165 17 89 332 -184 -14 -277 92 -173 -197 -214 353 -27 84
2598 84 0 -15 57 218 152 0 33 34 50 141 -24 33 250 -318 -159 -135 130 40 -95 -21 -123 19 3 272 -271
2623 -271 9 32 12 84 -16 -179 13 40 -253 107 -121 193 -169 -23 211 -85 -123 -45 89 14 -27 30 -231
2646b31K86k82K17K41j74J00k70K5L69k20p5mj60R7L45l17P3q2M4j25J69j02O7
2669iO9l4j97K39n8l8r5L0J89k95K64J09m28L13l8L8L9J61m20M16l81K21k28J85
2693E2r3k30K41m9P5o1L5NJ57j31N2J39q8k8r7J06j41K19j07p8j13O3J56J8j49
2718d7M5r5L36m04J84J61j51M6k22L05j25J66k51p2j21K81k02n3J95o2L19p2p9
2741H2O1n4j14k2P0m41L56J1P3K0L0j60k8J10j20M2J22K4k54R9J51k7k71L28m2
2766D6J02j29P3j0j66J29j33J32m9J15q8j53L5J78N5j36m2l8J04n4K44l32J74
2789E7J59k84K26j19L2M3j76J61J40k25j96K95k08KJ80J5k12J33K38j36j09j90
2811a74L99j08j3j3k04J11P4m1l8j07K24j91K75l19K49k39K64j75J10l8P0j13
$$ plain form
2646 -231 55 -227 -10 231 57 157 -113 -88 281 61 -14 -18 -178 -81 264 -53 20 -62 -18 -143 26 -76 -9
2669 -9 60 26 -171 68 10 -28 -123 -93 96 -199 65 174 -254 59 21 59 98 259 -161 255 -126 95 -133 52
2693 52 -41 -271 -30 -79 -4 -65 -30 -25 132 1 53 192 104 76 -21 85 -56 163 56 -22 -135 -72 84 102 -47
2718 -47 -2 -97 239 -165 19 180 29 75 -147 158 33 199 -52 -124 -245 36 -166 -219 -24 -86 233 161 82
2741 82 143 89 -25 -47 23 -418 -62 -51 22 42 72 -88 -116 -6 -126 -84 38 62 -192 -93 58 31 -240 88 46
2766 46 148 19 92 82 -84 45 -88 44 -5 110 22 -131 -96 82 137 1 -41 -79 25 -29 215 -117 57
2789 57 216 -68 158 39 71 114 -62 99 239 14 -182 113 -95 -93 87 102 -110 23 261 125 16 -174
2811 -174 225 117 104 91 -113 -2 72 31 -7 -114 110 -81 194 -125 124 -115 149 -26 84 46 116 3
2833CJ65m9k70J66%K10j16j10j50L16k86P9L15m40K21J28l49R4J66j27k24J81
2855g7N1J52k64L29o5p6j5J48km09K77k01L20m08K12M4j37J28j39K20j16J03j58
2878h3J55m6K4R1o5qj08J59k23P9J33j16p3J34r5O4J41k61L40k58J21L1p2j6j9
2903B9mJ36m25%M16j24p0J56k07K5L39p3j12J02j41Lj35J36mj17J08j63m9N51
2927C77l15k81L91k34J56n8j67L74l9l78J31N9n8k2J04k11p8N00l42j5J95o8k04
2950a83L16k81m2K89k38P6r9K56p6K25k16o6j7j6M5J29p0j19P0j3Q8r3P9K61l05
2975@Lo4KJ56q3j42j74M12j61j66M38J32l25j64l9J68J27k05K11j14M0j22K29
2998A59j00o5p9J96r8j83R3p7Q0N6R6j57J85q9J01l5Q8p0P3l1Jk06n4K82k86J15
$$ plain form
2833 3 168 119 -151 15 15 225 109 -1 -151 165 -121 -42 273 -167 54 182 -167 -73 93 -34 -258 -77
2855 -77 -26 126 -138 191 126 50 35 183 181 -228 49 -152 168 -240 -28 16 -121 7 -132 88 -28 75 -83
2878 -83 72 26 50 141 76 68 -40 119 -104 -25 108 -8 -81 53 -42 22 163 -98 242 -16 105 136 64 48 29
2903 29 25 161 -264 -264 152 28 -42 114 -93 -68 271 198 86 188 47 50 -85 51 47 -70 38 -125 -174 377
2927 377 62 -219 172 -62 94 36 -131 243 204 -174 -43 16 -42 -64 40 -171 -249 251 -91 -106 89 21 -183
2950 -183 133 -148 -190 99 -139 -63 -162 94 18 243 27 -39 -56 -72 -27 102 32 -87 -17 -30 58 -35 44 305 0
2975 0 3 -61 -59 97 14 -128 -302 110 -51 -217 221 353 28 -136 -175 -7 120 -85 126 12 52 -70 159
2998 159 59 -6 -85 111 13 -170 -77 -154 -74 -18 78 -79 106 17 118 83 171 101 174 143 144 -62 -116 166 -120 -5
3024em3O3j15j78K98L5M3P9k41J21P2k74J40nJ06j18k9J17J78m01K61K24o53L89
3048F4k84K87j78J01j36L18l12O9R0k12Q7P9J91m54K93L5K70k88J1J17j89MO7
3071C0N2k15Q8O9j17K95l40L26k44J77q3R5j27O4nO6N1l16M0Q5M8k84M8J27L49
3096B79n4o8j31k62L91j71K8J8K0K9r8pj54K18l6j91K53j18Q6j45J63L0k5k2l3
3121@R9j09J58m8j03J32J4j98L9j38K06j02R8m7K25k81p2K17j07J31j31kj21K37
3145I7m62L55qR4n2O1k24l2K36n7j21J65j47N3l0J5K26l69L07r4L0M1k5p0j70
3170a81J13oJ32J0Q3j54j52K54O1J15k39j92J96j43L17j42j06Q7o1j69J67K22
3192B12j55J92L6j66K4k17L62l19J8j39J01K05j99K63k79K49k03O6K12j29l40
$$ plain form
3024 -5 -48 15 -100 -278 20 55 98 177 -64 57 129 -145 -5 -10 96 -22 -51 66 244 -157 104 328 -325 64
3048 64 -220 67 -111 -10 -146 172 -140 -71 19 -193 -106 -27 164 -290 3 38 308 20 31 148 -41 -37 30
3071 30 82 -133 -45 24 -93 202 -138 188 -56 121 38 133 6 70 65 131 182 -134 -94 -9 39 -245 -197 -70 279
3096 279 225 157 26 -236 155 -16 12 30 50 79 -19 -26 -180 38 2 -189 64 -54 32 -113 50 80 55 33 0
3121 0 99 -10 148 100 -3 129 143 -55 -16 -154 52 -50 48 1 226 -55 -127 90 -17 114 -17 -19 -140 97
3145 97 -365 -10 -18 76 24 85 -139 -171 65 8 -113 52 -95 -42 -72 -57 169 -200 107 13 43 84 59 -11 -181
3170 -181 -68 -74 58 68 151 -3 -155 99 160 275 36 -156 40 -103 214 72 -34 53 -8 -177 -10 212
3192 212 57 249 285 119 143 -74 288 -31 -13 -152 -51 154 -45 218 -61 188 -15 51 263 134 -206
3213b06R1J15N1r0J42K0j93K74k63r0L8K00K6m8q8j87K89p1Q8j75k7J09p2N4P7
3238F4M5J20ok42J10k56L07m5m8k54J79J44j59lJ91j67r6J29J6k3o8J30N0k11
3262i3j6J15l4O1RJ7k10J59l6J69j47J23j29J00j06K46j63k00J96Q0J3k88J7M02
3286B85l58K2R9j27M8N8j27O9O3M2o5j16J27Kl0R1K8k55o7P4Nj1J27K61q6j08
3312E1M1q3J9L4m1J41k68J73n2Nk1P4j49J5K67l63L32k24N4k31J96J27jj92K11
3337A15j85L2j0k7K73j89K11j34j34J54o2k60K53j48O2l1K87j5j69k46R7L69n49
3360c06M59j35J51n7j35M7j55J71J85j91J91r6m34K80Q4k50L84j65K2J16l44L43
3382A65K8j81pR7Nj74L36k05j42K93p3N5k00kq8J27P2p4p0M7K08j31k99L34k23
$$ plain form
3213 -206 -115 0 51 -39 103 123 -70 204 -59 -149 -111 89 115 67 -21 -208 81 10 98 -77 -104 5 -67 -13 64
3238 64 109 229 223 -19 91 -165 142 97 49 -205 -26 118 -41 -44 147 -20 -116 13 29 6 -62 68 118 -93
3262 -93 -109 6 -28 33 42 59 -151 8 -28 141 -6 117 -12 88 -18 228 65 -135 61 141 154 -134 -117 285
3286 285 -73 -51 48 -79 -31 27 -100 -31 32 74 9 -107 20 22 -8 83 111 -144 -211 -137 -132 -143 -16 245 159 51
3312 51 92 9 28 62 21 162 -106 67 15 20 -1 73 -76 -61 206 -157 175 -49 5 -226 -30 97 96 -96 115
3337 115 -70 -38 -48 -75 198 9 220 86 -48 106 44 -216 37 -111 -49 -80 207 192 23 -223 -126 243 -306
3360 -306 153 18 169 112 -23 24 -131 40 225 34 225 129 -305 -25 59 -191 193 28 50 166 -178 165
3382 165 193 12 5 102 107 -67 269 64 -78 215 142 197 -3 -5 -93 34 106 32 -38 9 217 86 -213 121 -102
3407a02o7K18j40K77j53J89j72j30K91m8j70j60N0L78j95j86L36j33j94L08k87
3428i0J1K59k78l4M97l15m7k16J3J98J05j08R1n6k44J52J14O0j71j43j7J55L9
3451b5N8l4O2k07J52j03r3J33L9J14R1l09P0j01K41j29oJ11l3O0p8r9J62r9L0
3476Gp9m1K18j95j00k4J01Q0Mn4J66k27ok8K24j66J39m0K06j09l03K14O2p6j93
3501b20M97rj50p8M8l01L77j14o3r9K11j07K5k94K48j32M5L76m37K36J60l70O3
3524h8Q0N1j54r0J85l6J46Rk4mJ1r1O3r4J06j36J87j86k1J13m0j56L02r6J76j27
3550H6p0j29KK46k48r3J77m3L20j84j18K54j90rJ65m02K44J40l12L13l04J06J28
3573G9kk78K85j00j10j16J53q5K31J3jj01Q1l61J89j16N1L24k70K27p0Rj95P9
$$ plain form
3407 -102 -169 49 -91 186 33 222 50 -80 211 163 -7 -167 -117 261 66 -120 216 83 -111 197 -90
3428 -90 -79 180 -98 -132 365 50 3 -213 -200 -2 103 -5 86 30 -214 -62 52 112 -59 -202 -219 -64 -25
3451 -25 33 -1 61 -146 6 -97 -190 -57 -18 96 187 -122 -52 -153 88 -41 -47 64 31 91 13 -86 76 -23 7
3476 7 -72 -113 105 -90 -190 -214 -113 -33 -29 -83 83 -144 -150 -178 46 -120 19 -21 185 76 -227 -13 49 -27 -220
3501 -220 277 268 118 40 88 -213 164 50 -13 -112 99 -8 17 -277 -29 -161 -116 260 -177 59 219 -151 -88
3524 -88 -8 43 -111 -201 -16 -52 94 103 79 75 86 -5 58 -36 70 -66 121 -65 -86 27 -13 -169 133 37 213 86
3550 86 16 -113 -111 135 -113 -206 -29 -72 248 64 -54 200 10 1 166 -236 8 148 -164 149 -155 -49 79
3573 79 77 -201 84 -16 -126 -242 -89 -174 57 70 69 -32 49 -312 -123 -239 -188 136 -134 93 23 32 -163 -84
3597h4J11k5j66J16M2J23k80K30j19r6K02J7k39K18j15j09M73m04PQn5J99J36
3620A90l2l29K41qp1j21L7J93K29k96j00J78j94P1NJ75j0k90J87k1k9J06k59O6
3644h2J85pn8J29j62j6n2K33l22m9J42J7K29l09J84m44O52m86J62K39k29Q5p3
3667c2q1P4J17k65J26o6J30J85k46J68n3Q9k81N2J36K9j77K18j44%qK45j36J1
3691I1j2j0k7j43O5K41k24qJ09l3J61j3j58j9j12j69lL67j78l5K97k23K03j01
3715F6j98L04J5m3k01j35L96j43q1m9N9j15M71k63j66L9K22l38R8q3J36O7j82
3738a24J09k2q2R8J09j59J19oK3m0O1L5j46r4K65k82J92l6j94K73n1N5j04Rj89
3763a81N0K83l37L14k89J57K35l86K24J1n8N6m36L13L6n0K01m10J92K21k23O1
$$ plain form
3597 -84 27 2 -164 -48 -6 117 -163 67 -52 -148 54 71 -168 50 -65 -174 299 -105 -98 -90 -145 54 190
3620 190 158 -171 70 62 -9 -130 -93 100 329 33 -67 111 -83 -12 -7 168 158 -132 55 34 5 111 -148 -82
3644 -82 103 96 38 167 5 -11 -63 170 -152 -201 -59 -42 187 -122 62 -382 270 -216 -54 185 -44 41 -32
3667 -32 -113 -39 78 -187 -61 -127 3 188 -58 110 57 146 -135 -83 53 82 -95 123 -21 -21 -29 216 80 91
3691 91 79 69 42 -101 -36 205 -19 -27 82 49 210 197 39 20 -92 -261 -264 103 -75 -110 187 -36 167 66
3715 66 -132 172 187 144 -57 -192 204 61 -20 -69 -10 -125 346 83 -83 -44 178 -160 -62 -145 -9 58 -124
3738 -124 -15 -37 -119 -21 88 -71 48 42 65 25 86 121 -25 -119 146 -136 56 20 -174 99 48 103 -1 8 -181
3763 -181 -131 152 -185 129 -160 -3 232 -154 70 81 23 79 -357 -44 -8 -58 143 -267 -75 146 -77 -16
3785a6lM5j98M91j20O4n9k51LM1NJ40j71J40n8k81L42o0L87l50j07K08L0k78L26
3810B70l20O8j8J71k36L08O9k41K32l36J07O9K38l23m81N02j57R2l5JR2k8k4M0
3834F0n0j79J50p0J74j98J04O0J04k3k1k37L62l39J39q3R7j57R8r7j90J28K94
3857A26l06J35J17K4k15K75j99K76j49l16K31j19J66n22K30K46N5j68j1L59l43
3878a08J58L8Q8k89J44k96J04K85r5L6k66J93j96J73m2k4O5J30j22j26L42m32
$$ plain form
3785 -16 -19 26 -172 319 199 263 204 -47 -44 -3 2 142 -29 111 53 -228 114 54 441 91 -16 192 222 -56 270
3810 270 -50 18 0 171 -65 243 312 71 303 -33 74 143 381 58 -423 79 -78 14 -21 -20 72 44 20 60
3834 60 10 -169 -19 -89 85 -113 -9 51 155 132 111 -126 236 -103 36 -47 50 -107 -9 -106 -296 -168 126
3857 126 -180 -45 72 96 -119 156 -43 233 84 -232 -1 -120 46 -476 -246 0 55 -113 -124 235 -108
3878 -108 50 88 176 -113 31 -265 -161 124 29 65 -201 -8 -204 -31 -73 -97 -32 98 -24 -150 192 -240
$$ [...]
8191H9
##END NTUPLES=NMR FID
##END=
