##TITLE=1H_DE-2-AAoccid
 DMSO-d6
 8 sc, 
 29.7.2024
##JCAMPDX= 6.0         $$ Bruker NMR JCAMP-DX V2.0
##DATA TYPE= NMR FID
##DATA CLASS= NTUPLES
##ORIGIN= UXNMR, Bruker Analytische Messtechnik GmbH
##OWNER= root
$$ XWIN-NMR		Version 3.5
$$ Mon Jul 29 13:55:42 2024 Russian Standard Time (UT+4h)  she@DPX200
##.OBSERVE FREQUENCY= 200.1315
##.OBSERVE NUCLEUS= ^1H
##.DELAY= (6, 6)
##.ACQUISITION MODE= SIMULTANEOUS
##.ACQUISITION SCHEME= undefined
##.AVERAGES= 8
##.DIGITISER RES= 18
##SPECTROMETER/DATA SYSTEM= spect
##.PULSE SEQUENCE= zg30
##.SOLVENT NAME= DMSO
##.SHIFT REFERENCE= (INTERNAL, DMSO, 0, 15.7039)
##AUDIT TRAIL= $$ (NUMBER, WHEN, WHO, WHERE, WHAT)
$$ ##TITLE= Audit trail, XWIN-NMR		Version 3.5
$$ ##JCAMPDX= 5.01
$$ ##ORIGIN= Bruker BioSpin GmbH
$$ ##OWNER= she
$$ F:/spectra/data/she/nmr/H-F/1/audita.txt
$$ ##AUDIT TRAIL=  $$ (NUMBER, WHEN, WHO, WHERE, WHAT)
(   1,<2024-07-29 13:46:41.60 +0400>,<she>,<DPX200>,
      <created by zg, POWCHK disabled, PULCHK disabled
       configuration hash MD5:
       00 E9 B6 7A A2 85 ED C7 34 08 36 98 17 FE 4E 26
       data hash MD5: 16K
       86 4B F2 E9 31 7B E1 EA 86 E4 9F 75 84 83 BA 08>)
$$ ##END=
$$ 
$$ hash MD5
$$ 77 59 8A 89 2F 5A D1 5C B8 37 2C BE D2 3A 2F 4C
##$RELAX= 
##$RELAX= 
##$RELAX= 
##$RELAX= 
##$RELAX= 
##$RELAX= 
$$ Bruker specific parameters
$$ --------------------------
##$DU= <F:/spectra>
##$EXPNO= 1
##$NAME= <H-F>
##$PROCNO= 1
##$TYPE= <nmr>
##$USER= <she>
##$AMP= (0..31)
100 100 100 100 100 100 100 100 100 100 100 100 100 100 100 100 100 100 
100 100 100 100 100 100 100 100 100 100 100 100 100 100 
##$AQSEQ= 0
##$AQ_mod= 1
##$AUNM= <au_zg>
##$AUTOPOS= <>
##$BF1= 200.13
##$BF2= 200.13
##$BF3= 200.13
##$BF4= 200.13
##$BF5= 200.13
##$BF6= 200.13
##$BF7= 200.13
##$BF8= 200.13
##$BYTORDA= 1
##$CFDGTYP= 0
##$CFRGTYP= 5
##$CHEMSTR= <none>
##$CNST= (0..31)
1 1 145 1 1 1 1 1 1 1 1 1 1 1 1 1 1 1 1 1 1 1 1 1 1 1 1 1 1 1 1 1 
##$CPDPRG= <>
##$CPDPRG1= <>
##$CPDPRG2= <>
##$CPDPRG3= <>
##$CPDPRG4= <mlev>
##$CPDPRG5= <mlev>
##$CPDPRG6= <mlev>
##$CPDPRG7= <mlev>
##$CPDPRG8= <mlev>
##$CPDPRGB= <>
##$CPDPRGT= <>
##$D= (0..31)
0 1.2 0 0 0 0 0 0 0 0.06 0 0.03 0 0 0 0 0.0002 0 0 0 0 0 0 0 0 0 0 0 0 
0 0 0 
##$DATE= 1722246401
##$DBL= (0..7)
120 120 120 120 120 120 120 120 
##$DBP= (0..7)
150 150 150 150 150 150 150 150 
##$DBP07= 0
##$DBPNAM0= <>
##$DBPNAM1= <>
##$DBPNAM2= <>
##$DBPNAM3= <>
##$DBPNAM4= <>
##$DBPNAM5= <>
##$DBPNAM6= <>
##$DBPNAM7= <>
##$DBPOAL= (0..7)
0.5 0.5 0.5 0.5 0.5 0.5 0.5 0.5 
##$DBPOFFS= (0..7)
0 0 0 0 0 0 0 0 
##$DE= 6
##$DECBNUC= <off>
##$DECIM= 24
##$DECNUC= <off>
##$DECSTAT= 4
##$DIGMOD= 1
##$DIGTYP= 9
##$DL= (0..7)
0 120 120 120 120 120 120 120 
##$DP= (0..7)
150 150 150 150 150 150 150 150 
##$DP07= 0
##$DPNAME0= <>
##$DPNAME1= <>
##$DPNAME2= <>
##$DPNAME3= <>
##$DPNAME4= <>
##$DPNAME5= <>
##$DPNAME6= <>
##$DPNAME7= <>
##$DPOAL= (0..7)
0.5 0.5 0.5 0.5 0.5 0.5 0.5 0.5 
##$DPOFFS= (0..7)
0 0 0 0 0 0 0 0 
##$DQDMODE= 0
##$DR= 18
##$DS= 0
##$DSLIST= <SSSSSSSSSSSSSSS>
$$ [...]
##$SUBNAM2= <"">
##$SUBNAM3= <"">
##$SUBNAM4= <"">
##$SUBNAM5= <"">
##$SUBNAM6= <"">
##$SUBNAM7= <"">
##$SUBNAM8= <"">
##$SUBNAM9= <"">
##$SW= 24.0689530833862
##$SWIBOX= (0..15)
0 0 2 0 0 0 0 0 0 0 0 0 0 0 0 0 
##$SW_h= 4816.95568400771
##$TD= 16384
##$TD0= 1
##$TE= 0
##$TE2= 300
##$TE3= 300
##$TEG= 300
##$TL= (0..7)
0 120 120 120 120 120 120 120 
##$TP= (0..7)
150 150 150 150 150 150 150 150 
##$TP07= 0
##$TPNAME0= <>
##$TPNAME1= <>
##$TPNAME2= <>
##$TPNAME3= <>
##$TPNAME4= <>
##$TPNAME5= <>
##$TPNAME6= <>
##$TPNAME7= <>
##$TPOAL= (0..7)
0.5 0.5 0.5 0.5 0.5 0.5 0.5 0.5 
##$TPOFFS= (0..7)
0 0 0 0 0 0 0 0 
##$TUNHIN= 0
##$TUNHOUT= 0
##$TUNXOUT= 0
##$USERA1= <user>
##$USERA2= <user>
##$USERA3= <user>
##$USERA4= <user>
##$USERA5= <user>
##$V9= 5
##$VALIST= <valist>
##$VCLIST= <CCCCCCCCCCCCCCC>
##$VD= 0
##$VDLIST= <DDDDDDDDDDDDDDD>
##$VPLIST= <PPPPPPPPPPPPPPP>
##$VTLIST= <TTTTTTTTTTTTTTT>
##$WBST= 1024
##$WBSW= 4
##$XGAIN= (0..3)
0 0 0 0 
##$XL= 0
##$YL= 0
##$YMAX_a= 39325
##$YMIN_a= -46613
##$ZGOPTNS= <>
##$ZL1= 120
##$ZL2= 120
##$ZL3= 120
##$ZL4= 120
##$ABSF1= 10
##$ABSF2= 0
##$ABSG= 5
##$ABSL= 3
##$ALPHA= 0
##$AQORDER= 0
##$ASSFAC= 0
##$ASSFACI= 0
##$ASSFACX= 0
##$ASSWID= 0
##$AUNMP= <proc_1d>
##$AZFE= 0.1
##$AZFW= 0.1
##$BCFW= 1
##$BC_mod= 2
##$BYTORDP= 1
##$COROFFS= 0
##$CY= 11.3945322036743
##$DATMOD= 1
##$DC= 2
##$DFILT= <>
##$DTYPP= 0
##$F1P= 15.6554695791079
##$F2P= 12.8336369535428
##$FCOR= 0.5
##$FTSIZE= 0
##$FT_mod= 4
##$GAMMA= 1
##$GB= 0.15
##$INTBC= 1
##$INTSCL= 1
##$ISEN= 128
##$LB= 0.24
##$LEV0= 0
##$LPBIN= 0
##$MAXI= 10000
##$MC2= 0
##$MEAN= 0
##$ME_mod= 0
##$MI= 1.114404
##$NCOEF= 0
##$NC_proc= 0
##$NLEV= 6
##$NOISF1= 3.799351
##$NOISF2= 2.8
##$NSP= 1
##$NTH_PI= 0
##$NZP= 0
##$OFFSET= 15.70392
##$PC= 1
##$PHC0= -25636.35
##$PHC1= 8.587491
##$PH_mod= 1
##$PKNL= yes
##$PPARMOD= 0
##$PSCAL= 0
##$PSIGN= 0
##$REVERSE= no
##$SF= 200.130013532006
##$SI= 16384
##$SIGF1= 3
##$SIGF2= 2
##$SINO= 400
##$SIOLD= 16384
##$SREGLST= <1H.CDCl3>
##$SSB= 0
##$STSI= 0
##$STSR= 0
##$SW_p= 3612.71676300578
##$SYMM= 0
##$S_DEV= 0
##$TDeff= 0
##$TDoff= 0
##$TI= <>
##$TILT= no
##$TM1= 0
##$TM2= 0
##$TOPLEV= 0
##$USERP1= <user>
##$USERP2= <user>
##$USERP3= <user>
##$USERP4= <user>
##$USERP5= <user>
##$WDW= 1
##$XDIM= 8192
##$YMAX_p= 0
##$YMIN_p= 0
$$ End of Bruker specific parameters
$$ ---------------------------------
##NTUPLES= NMR FID
##VAR_NAME=  TIME,          FID/REAL,        FID/IMAG
##SYMBOL=    X,             R,               I
##VAR_TYPE=  INDEPENDENT,   DEPENDENT,       DEPENDENT
##VAR_FORM=  AFFN,          ASDF,            ASDF
##VAR_DIM=   8192,          8192,            8192
##UNITS=     SECONDS,       ARBITRARY UNITS, ARBITRARY UNITS
##FACTOR=    0.0002076,     1,               1
##FIRST=     0,             0,               0
##LAST=      1.7004516,     0,               0
##MIN=       0,             -46613,          0
##MAX=       1.7004516,     39325,           0
$$ Real data points
##PAGE= N=1
##DATA TABLE= (X++(R..R)), XYDATA
0@%%%%%%%%%%%%%%%Oj4J6j6J6j6J9k7L2l3L9m6N0n8O6p4Q4r3J06j20J32j46J62
38H5j80K03k25K48k75L04l36L71m12M59n10N68o36P16q11R26j068J250j493J831
58A015k344L246j0836M8244l4205m3969N7957M572m9746J5635L6244k5097j0892
71a0176J7871m433o139R695q994j352J7495j0372j9409K2801J0311l1315m95L6122
85B1610j0142l4788J8855K7048l0982j6194M1468L777m4487Q660L4964k2502j6688
98a9401L1814j018k7962J0457J1199j0939J0882M069k2682J1172J7743k8800J441
111a2025M1020k3363l6434M0550J6979m7764Q821M3457k8507k8268L5501Q519
123A8486l1728O247K0697j1271r114Q752r92l699L338k187n98Q651n436j4701
$$ y = [0, 0, 0, 0, 0, 0, 0, 0, 0, 0, 0, 0, 0, 0, 0, 0, 6, -8, 8, -8, 8, -8, 11, -16, 16, -17, 22, -24, 26, -32, 34, -40, 44, -49, 57, -63, 69, -77, 85, -95, 108, -117, 131, -144, 160, -176, 195, -217, 242, -268, 300, -336, 380, -431, 495, -573, 677, -816, 1015, -1329, 1917, -8919, 39325, 5120, -38849, 19108, 23680, -26066, -10431, 25813, 716, -10176, 7695, 3262, -2877, 6818, -2176, -3528, 13967, 3595, -15814, 6987, 17298, -14017, -14512, 21610, 11468, -23320, -4465, 22583, -8399, -24593, 16875, 20652, -23835, -15175, 19789, -2713, -19401, 12413, 11395, -16567, -6110, 5089, -5850, 5032, 9101, -13581, -2409, 15334, -13466, -12025, 28995, 5632, -30802, 9748, 26727, -21037, -12216, 31241, 2734, -25534, 9967, 18486, -13242, -6995, 13702, 2431, -6683, 2069, 1077, -2622, 716, -1471, -2069, 6582, 1146, -13555]
137a3555J0017J5978j5211j0762K3037J192l1778J0201L4701k1618k5596L2176
149H782P726l7401J1186L3172k2926j7192K5580j732j7912J4731L900j4604J1007
162D317L211j9174J3530J4759k7549j060L2851j5287k7067K7801J1791l3771M194
175a1454L1082j4350k2921J7914J0064j7432k40J5809m212j3061M273O690k421
188b59N40J632m738J356M454q285J188J6002r514j8233J9858J1765k8362K307
202a0289L1048j7777k3733K9599Q778l2964P909K5242j8490r837J9686n783j2813
215i424J2213Q53q626J1035j446j7179J1492J2732j8527m20K0899j2062j9439
228a7899J8646J2839j9656l331J8417n151j6914J0066J4950j2217r244J3005J467
$$ y = [-13555, -3538, 12440, -2771, -13533, 9504, 10696, -21082, -10881, 23820, 2202, -23394, 8782, 16508, -20893, -9707, 23465, 539, -16653, 8927, 7195, -10717, 4014, 7914, -6690, 4317, 7528, -11646, 1884, 16643, -10906, -11966, 20885, 5598, -21469, 6332, 18123, -15648, -11454, 19628, 5278, -17643, 271, 10335, -7097, -7337, 8472, 4260, -8801, -4528, 2162, -259, 281, 1913, -2825, -1469, 2985, -5300, -4112, 11890, 2376, -15857, 4001, 15766, -12596, -10289, 20759, 2982, -20751, 8848, 17626, -15338, -7429, 17813, -677, -10514, 9172, 3389, -9424, 2789, 3642, -4984, 6051, 4605, -12574, -1082, 11650, -6877, -7297, 13602, 1540, -17899, 747, 13586, -6070, -9401, 9016, 3865, -13049, -2983, 11967, -250, -9494, 3511, 4978]
241D978j1265M460Q158p149j730O220n413J79Q585r836m860J7795l955j9606J5938
256B499J1496k5499J892K8194j4729k0869K1588O295k2231P499J7109j4709p535
269i000J1556k818l696P985k627o450P142j047q709R481O391j2828k660J3926
283F646l156j2416P920J0640j1175p770J4556L384j6459K454J5660q338j0138
296h192J2921J732j3866N189Q935p965R87N492r678n1J1640q115n208J5207n937
311C091j7198J5236J1219j9632M93J8477j1772j3041J6928N123j5309L083Q825
324E523o841l078O524r85k373K067j304r66M065j904m608L617N306n026m176O792
340B633J639j0010K068J2827o658j1474J0603N829j4572K862J4794q976j0817
$$ y = [4978, -6287, -1827, 6331, -818, -2548, 3672, -1741, -1562, 7023, -2813, -7673, 10122, 6167, -13439, 2499, 13995, -11504, -9612, 18582, 3853, -17016, 4572, 10867, -11364, -3865, 13244, -1465, -9000, 2556, -262, -3958, 4027, 1400, -5050, 2092, 1045, -7664, 1817, 8208, -4620, -7280, 6646, 3490, -8926, -1006, 9634, -1541, -9311, 5245, 8629, -7830, -5376, 10284, 1946, -8192, 4729, 6461, -7405, -2216, 6719, -1246, -259, 5233, -4445, -4496, 7144, -971, -6179, 9028, 3091, -14107, 1129, 12348, -7284, -6791, 11686, -86, -13127, 3801, 8924, -6385, -3302, 5523, -1318, -4396, 2128, 1143, -1230, 837, -467, -1433, 2632, 728, -3880, -263, 5043, 17, -4159, 2633, 4272, -5738, -3670, 9157, 2499, -8975, 1628, 7457, -7115, -4253, 10541, 1565, -9252]
353i252J1500J927r836O900M194r519K314N111q202L589Q574j0300l958J3368
367F410m132j1936J1995N883j4302J220J2773p040q391Q906L308o884M46N388
381C644k321m077J777K936j78j572l46m98N9J240n60j03L425k288o856N449O301
398F032q840j941J1565n411j0691J1162O335j3695J407J1140p941n768J0265r40
412B679p358O008J263n887M181J938p629M372O361q175j235Q847n119p254R262
427B254M296q827q50O488k785m676M794M390m644m251L758K438l662O57L626k663
443C43l295L158L12j622K874j662k997M898J47p002M615N990r329j356J1387m796
459A665r616R692M050j0732L064P905p519l348P170j077k711M084k026l462L889
$$ y = [-9252, 2248, 4175, -5661, 1239, 5433, -4086, -1772, 3339, -4863, -1274, 7300, -3000, -6958, 6410, 2278, -9658, 2337, 8220, -6082, -4862, 7911, 871, -7520, 1386, 4694, -2190, -1744, 3644, 1323, -2754, -977, 1959, 1781, 209, -137, -635, -576, 664, 104, 1, 3426, 1138, -5718, -269, 6032, -2808, -4749, 6816, 1405, -9286, 1876, 8211, -5484, -4077, 7063, -878, -6646, 3619, 2679, -4679, 1329, 2592, -3295, 886, 2824, -4805, -433, 5928, -2247, -3482, 5365, 246, -7008, 2254, 6550, -2277, -3127, 3361, 576, -4100, 694, 5084, 440, -3811, -53, 2385, -1277, -620, 3006, 343, -2952, 206, 518, -1104, 1770, 108, -2889, 2009, 2156, -4846, -231, 5759, -3570, -4926, 6461, 1665, -7951, 1741, 5791, -4941, -1877, 6028, -1491, -4839, 2331, 1254, -1457, 2627, 601, -2861, 1028]
474A028pl302M409J750p053J17O375k435l255L683J686m757j526M837J518n279
490b211K10N244k635m651M421L143o237K88N761l178k336L511k387j080M870j910
506H23l616N318r11p407O372N773r283q11Q616n323n472Q933J717q011J789L880
522B387l469q7L545j838p29M7j272J212K308k141j395K510n07j891N79K012o61
539F10k458R55L030j195m287K765L736m727p33O223l247n742N164L531n545J761
555a59L298n222L6M204k784M04L486m546k077O071j293m844N484J677p495J409
571b351O250l853l084M508J53l471J098J681n48q66j03O49J106j633j138J813
587B11K26j306J241O34j023r89k37J062K473k084k362L486n82m370M208M061o534
$$ y = [1028, 1021, -2281, 2128, 3878, -3175, -3058, 3317, 882, -2373, 1310, 2996, -1761, -3287, 1550, 3068, -2211, -2001, 3243, 608, -4043, 378, 3521, -2716, -2428, 3333, 155, -2181, 1330, -1057, -2137, 2733, 823, -2793, 2525, 1614, -5793, 579, 6352, -2931, -3742, 4874, -449, -5921, 3012, 4729, -3282, -1493, 2387, -1082, -1169, 2376, 538, -191, -144, -1416, -204, 2104, -37, -1432, 1078, 571, -1320, -741, 1271, 610, -1848, -893, 2137, 942, -3345, -580, 3156, -1571, -2304, 3919, 672, -5070, 94, 3625, -1920, -159, 3139, -2083, -2047, 2157, -627, -223, 3263, -1283, -3360, 2711, 1418, -3426, 2058, 3735, -3760, -2351, 3899, 46, -3038, 1470, 1623, -1848, -750, 931, 383, -483, -586, 63, 1169, -464, -1602, 211, 437, -869, 372, 1006, -17, -1006, -1243, -181, 2292, 208, -2154, 1332, 750, -3620, 588, 4649, -1885]
604a885j152N879k502l698N232M41m696K238J599k703J478J119k997J700K273
619B326m272J00M629l179k530M780M81m741J193K661k017l09J413N75j335j255
635a480L60K389l45k133J678L21k801J262L057j821j034J030j303M35J307j570
651f48N33K350l330j600M999q24m875M077K620n470N50M120l097j399L475p90
667F91j690J647q97j827L029m90j617K543l71l876J941K857k177q40K148q13j913
684a655J180R73N06o67j474J173Q55j986M40L195k563k431L462m3k336J355J000
701I84j919J172M48j843J598N19k615K053K691m555o43L835j474k617M078K88
717B000l720M25K389j774P53J169j612k86O00j153J402J940k704q42K655j318
$$ y = [-1885, -3037, 2842, 340, -3358, 1874, 2315, -2381, -143, 1456, -1247, 231, 1350, -1647, 53, 2326, -1946, -1846, 2783, -396, -2926, 1854, 2335, -2406, -1213, 1448, -569, -878, 535, 1110, -225, -1480, -1120, 1269, 924, -1209, 469, 790, -2011, -749, 2308, 487, -547, 483, -820, -385, 922, -648, -115, 2235, -1095, -2695, 2304, 1480, -3395, 682, 3302, -2168, -1618, 2502, -595, -1994, 1481, 691, -999, 648, -249, -2076, 953, 463, -1154, 1389, 1018, -2858, -917, 1940, -237, -1077, 1071, 258, -1655, -475, 498, 1004, 337, -1137, 36, 891, -1095, -655, 2540, -23, -2454, 1008, 965, -1371, -16, 984, -935, 237, 685, -1158, 440, 959, -1656, 397, 3088, -1467, -2110, 1725, 251, -2366, 1712, 2000, -1720, -1295, 1094, -680, 73, 1242, -370, -656, -56, -1209, 193, 2133, -571, -1413, 1242, -76]
733g6j311K324K03j882L37P71o69M63n92j31J780r73j742K492N48l791J613L028
751B392k521j027K225j591o72K083p6r93J040j427j114K988j06k783K152R76l860
768b314J277L112j823j472K148j038j639J771L96k63N17j437l16K218r69j685
784a517K009Q27k335O65J702k044j8J393m12N5Q1j075J77J120j240L81K086k070
802b15k157K911M48k238J996J026l236N76J484l99l0R96j876J77J326j448J82
819d77K446k090j706K828j36k276J663R31j799M29J024j252K36n0p36J148R67
836A150k077J86J895j748l44K892j524k073J660L56j124J339J79j459J027l48
852a3j540J933R01k194N28J342j902q5K526j024j535J930o15r48Q90p1q05J294
$$ y = [-76, -1387, 937, 1140, -742, -405, 366, -303, 160, -432, -563, 1217, 244, -1498, 994, 1542, -2249, -636, 2392, -129, -1156, 1069, -522, -1194, 889, 813, -180, 860, -567, -1681, 1307, 1201, -1582, 570, 1546, -2314, -1037, 2075, 252, -1220, 928, -110, -1749, 22, 418, 155, 672, -765, -1081, 1137, 168, -1517, 492, 1319, -1016, -351, 1351, -693, -711, 682, 270, 325, 406, -669, -492, 628, -612, -231, 1855, -215, -2372, 539, 987, -1251, 745, 1771, -1465, -889, 595, 196, 166, 1162, -714, -537, 789, -659, -477, 1969, -121, -1827, 1001, 865, -1411, 252, 1183, -616, -187, 837, -415, -179, -229, -965, 183, 1150, -927, -741, 1154, -594, -938, 1954, 430, -1643, 17, 373, -751, 588, 767, -692, 335, -13, -1553, 380, 1281, -913, -385, 957, -945, -1030, 1496, 472, -1063, 867, 252, -696, 194, 123, -682, 612]
870F12j17j388J344M16k452J698J490k237K7J523j093r77J936l10p18N17j140
887h69j89K015p05r71J883r25k141K180J127k050N05R07j458l68J847p04k54J280
905A110j662o0J589j202j221K807o74j742J652N99k380O19J711j436L37O73j441
922g21M05P32q56N52J176j913q02K046k17j221J855P9k275P46J109j055M49M56
940E45j055N63M84j302N64J288j728k61K004j465j002J972j99j424J299J50j178
957g45R31l6r89J422M04j693N49J227k130M51K355j807q66J149j06r17J569j72
975E96j091Q68p02p17J753K97j511Q38L55j836K50K122j272o23J032o16l31R48
993C60j74o70R85j94r05J441o08j478J726M35j747R68R23j995k96K051p63l21
$$ y = [612, 495, -893, 451, 867, -1585, 113, 1603, -634, -607, 916, -177, -1154, 782, 472, -246, 271, -869, -1058, 957, 252, -719, 1164, 239, -1902, 278, 1405, -645, -140, 767, -691, -1059, 788, 84, -170, 1110, -552, -612, 977, -225, -1446, 1361, 687, -1055, 597, 1196, -1184, -565, 1146, -290, 47, 720, -721, -316, 416, -440, 112, 1288, -625, -1427, 619, 402, -819, 1036, 1115, -1160, -414, 695, -360, 89, 545, -510, 53, 537, -765, -201, 1087, -641, -902, 1102, -363, -1365, 607, 408, -1016, 283, 433, -745, 186, 150, -839, 583, 987, -706, -157, 1070, -1060, -609, 1746, -61, -927, 222, 116, -801, 768, 596, -495, 373, -329, -1046, 707, 1004, -507, 331, 686, -1150, -900, 1222, -50, -673, 359, -257, -588, 360, 186, -484, 501, 307, -598, 843, 235, -1243, 483, 918, -829, 139, 1062, -933, -1229, 822, 59, -262]
1011b62R44j042o2J011m55q30J542j032j251J816L89j727J332L0j166K57J441
1028I35j081j62J042j063j21J411j456J31J302r65p90J652l58j499O31J353j272
1045c10O21L13j206K73O28q50Q89N33j430J13R66o60l44J512r16j358J102K24
1063A00p82Q96L55j309P12Q35j615J012N87j332Q0J737j556n64J422o37q74J608
1081F75j39j162Q29l49l88J068L91j379O58L7j331J130J142j379n03J427j181
1098d54l91J701m83r35Q17m32n02J188k9j074R98M9j527J298N18j335O5J441j109
1117a96l85P81m3q57J147m66n67J544j037j227J621L01j386J003N71j632L36J313
1135H21j162J58P19j158q8J100m50N8J033j295p36J599l06q19Q49L57j918J171
$$ y = [-262, 682, -360, -422, 589, 134, -696, 846, -186, -1437, 379, 768, -959, 373, 403, -763, -506, 935, -146, -308, 734, -329, -450, 961, -495, -364, 938, -27, -817, 835, 477, -1022, -391, 962, -310, 311, 624, -582, -309, 319, -531, 358, 891, -539, -426, 540, -120, -464, 1048, 132, -1226, -124, 100, -682, 214, 569, -740, -28, 807, -808, 204, 791, -541, -461, 1276, -280, -844, 578, -59, -933, 675, 536, -626, 203, -146, -534, 534, 925, -454, 204, 241, -1090, 40, 1182, -197, -700, 727, -454, -845, 856, 373, -562, 255, -177, -679, 509, 480, -594, 404, 453, -1074, 224, 742, -593, -528, 913, -196, -581, 200, 157, -700, 447, -19, -586, 958, -79, -1306, 315, 616, -770, 233, 804, -828, -492, 821, -341, -183, 536, -622, -710, 390, -60, -2, 1031, -264, -1000, 599, 293, -526, 323, 680, -1238, -67]
1153f7Q10j128J18P38p43K08Q01j293O2J052p27l13J819j033j260J171L39j346
1171g92J433L81j655N29L70p08Q40L62q58k10Q75r48m4J313r72o09J003k07p72
1190f69R76M2q55Q67j79p77Q61L88j218O65Q21j479QJ151q17n43J631q49q09J329
1210E44p20p64J553j86o41K16L46j536J211J141j571K04R50j349j37J433k32q23
1228c61O63l84j04P41m03n00P27j17o51N97J89j276Q90N71j151J90J120r67l3
1247b59O52k34n09J297q37j139J952p19m81Q01k54j272R07Q12j277M05J110j306
1265c51j18P89n05j09J012p88r00J310m52o18J245q3j194P59O66j066M20N06q31
1284c08N56Q7p08O8Q13o85R6P00q82m51J095m63l22J108m75q83Q06l7m55P46K10
$$ y = [-67, 743, -385, -267, 471, -272, -64, 737, -556, -494, 558, -169, -482, 1337, 304, -956, 215, 554, -792, 641, 1022, -633, -104, 266, -442, 398, 760, -98, -308, 567, -381, -425, 888, -84, -693, 310, 103, -669, 307, 349, -506, 361, 182, -595, 266, 654, -564, 101, 922, -557, -549, 602, -215, -758, 873, 24, -785, 544, -176, -940, 613, 427, -214, 2, 348, -1188, 23, 1164, -407, -203, 747, -602, -739, 694, 462, -361, 302, -82, -186, 555, 152, -348, 379, 262, -389, 208, 397, -879, 11, 582, -569, -379, 741, -226, -259, 393, 159, -350, 947, 110, -1029, 923, 204, -277, 524, 270, -1002, -95, 717, -560, -155, 955, -351, -469, 320, -185, -294, 718, -70, -970, 340, -112, -730, 515, 432, -762, -3, 663, -403, 17, 523, -308, 248, 335, -373, -305, 508, -177, -81, 619, -263, -714, 381, -82, -404, 704, 229, -654, 152, 115, -340, 406, 616]
1305F16j343P68L58r72M30Q93r66n29J090n11m21J326l48r29N62K48m36J65L66
1324C67r85J092P7j125L19P41j001J01P91m17m86Q10n66k97P42l3l59Q69n41q44
1344g45J267p0r88N65N16j188N79N74p96k07P91o27l54J124m42q37J311k62r05
1363f94J559o68p99Q99K76j459O01O03q43J74R32q21K3R87r70m18R86J2r03J158
1383F35m60q49P78L23j002Q72J20p18O7L56n36M20M48j009K7J147p69j99J103
1402G54p74m47P25m03l75N57K61q47M52N85j053L97N86p56M53O48p34k76N73m79
1422a53k56J006k45q04N03J46p05R38nj063P58m3o59O24L08r67L80R40j227K31
1442b93J171p88n29Q63l18m86Q19k58p39O84K93o25J16N99j126K58J320j164l58
$$ y = [616, -727, 41, 399, -573, -143, 750, -216, -745, 345, -166, -587, 739, 391, -538, 24, 272, -164, 1, 367, -618, 474, 551, -574, -255, 486, -515, -414, 377, -40, -526, 284, -282, -579, 163, 130, -229, 640, 99, -745, 522, 452, -536, 29, 545, -643, -64, 510, -286, -493, 298, -329, -683, 441, -1, -838, 473, 211, -694, 865, 197, -602, 297, 573, -886, -285, 318, -525, -351, 581, -240, -217, 770, -200, -618, 368, 380, -523, 635, 175, -674, 104, 427, -575, 297, 417, -301, -234, 122, -414, 6, 454, -555, -528, 619, -150, -349, 754, -20, -467, 258, -145, -520, 37, 298, -549, -97, 488, -565, -168, 418, -338, 115, 763, 29, -247, 326, -153, -409, 597, 352, -452, 51, 197, -508, 430, 425, -638, 120, 77, -582, 42, 350, -617, -237, 703, -524, -293, 878, 90, -439, 424, 106, -380, 439, 181, -558, 126, 419, -206, -90, 509, -617, -359, 961, -203, -561]
1461e61P27l96p0Q10m01k95O58n57o29Q34J85q50R86j70p67K11Q85o98M9K58j23
1482H6k47N95m43l71Q04m35m42O97k78o48J015P7p05L90L09o43L60M39q44K94
1502A0O73j082P1O28m53j52P71j81p92O75K6j026J124K07j000P52P4p73L26P18
1522E96q07l8Q96r67j72J290n59q34Q37k91k38K39L81o86O40j33n37K89K50m43
1542b87J2R38p90J46N82j161M65Q17q02m20Q83m89m93Q30O3r39R80J89j009P31
1562B46J63r06M21O95r49j06Q18m95m1Q46o82l70P18k58m81P41j73n09O62k02
1582A38o73K35P27m47%L32q46K96P91l11k30M07o07l12O99R4n64O01J91j187J103
1603D37J75r85L93M34p91K02N98p49L76M17n91m77P37j88j33M32l57j16N82j81
$$ y = [-561, 166, -230, -300, 510, 109, -186, 472, -85, -714, 120, 305, -545, 441, 271, -496, -285, 600, -98, -49, 209, 86, -161, 434, -9, -380, 424, -11, -453, 244, -34, -682, 333, 410, -295, 95, 404, -239, 121, 560, -284, 10, 683, -399, -328, 300, -153, -305, 466, 285, -507, 168, 194, -832, 292, 499, -501, 251, 325, -448, -122, 596, -211, -249, 647, -320, -492, 798, 239, -595, 242, -49, -287, -48, 333, -353, 287, 154, -383, -94, 156, -287, -275, 663, -127, 19, 601, -560, -95, 722, -80, -500, 383, -106, -599, 231, 294, -645, 335, 524, -485, 246, 409, -497, -76, 619, -330, -436, 382, -113, -154, 692, 10, -360, 358, 100, -381, 360, 187, -322, 340, 138, -535, -300, 427, -20, -20, 312, -534, -238, 553, 242, 12, 419, -188, -500, 199, 293, -271, 330, 521, -666, 437, 612, -373, 20, 454, -337, -135, 463, -286, 90, 507, -84, -561, 176, -12, -145, 287, -70, -186, 396, 215]
1623B15o28M83K76n03L25M26r64L19L9k64K1P82q11J33N77j87r84P56p0m09O62
1644A94J87o80K58M85o83K72L03o61J56N84m39k89P06k51j64L52Rq02O73J72q49
1665d67Q48l57m98M12N75p31L04L94q97R1Q03m79l48P62o00n35J033Jn39N24k31
1686F5m48Q00m26l51L61L79n70K22J89l55L4O94j040N2M52j64q1M64p7m83M99
1707B16j09p03O29M40o36J80L43m38L5K89l23k67P11m80k14N68l68k38P81k15
1727B01o08O03o7l56L27K03p62J72L44m67J84M74l59m1K95j31k57O70j8o03M67
1748B71j73n52N92Q2p48O58J15m98L4N44n51L64J37m57J77K67l95j89N30j26n27
1769d45N97p9k08L38j02n37P71J8o43K55L80n00m5P88q83J29N08n29j58M89Jo09
$$ y = [215, -413, 70, 346, -157, 168, 594, -370, -51, -12, -276, -255, 527, -284, -151, 426, 239, -745, 11, -59, -468, 194, 381, -299, -41, 444, -239, 33, 336, -325, -169, 415, -24, -313, 393, 142, -22, 330, 339, -463, 210, 382, -467, 381, 24, -474, -62, 513, -218, 86, 480, -417, -326, 477, -2, -350, 412, -188, -723, 310, 311, -228, 296, 65, -383, 417, -9, -360, 1, 380, -190, 32, 221, -134, -100, 594, -446, -394, 58, -106, -187, 277, 200, -283, 216, 107, -596, 33, 473, -163, 17, 360, -78, -43, 246, -77, -344, 367, -113, -327, 241, -127, -365, 416, 201, -407, 196, 129, -227, 100, 303, -459, -287, 57, -410, -226, 248, -111, -152, 143, 12, -245, 425, 407, -196, 271, 98, -454, 138, 220, -528, 130, 245, -253, -219, 325, -226, 138, 275, -182, -5, 262, -133, -322, 208, 82, -445, 152, 73, -135, 203, 101, -436, 335, 353, -290, -35, 345, -155, -200, 588, -295, -166, 342, -187, -345, 144, 145, -464]
1791d64Q63n86j76P38r4q36O40L32p63L03N09q36J67M73n42m50Q12k88k54P81
1811C29j40m49K70Q9o17Q93qn94J4K79l03J44O98n12k21M07j32k79N63l62k66
1832a97J84j14m87P82K35o35M01K21p45O56L27j000L45L63m85j59L59l84r0N62
1852A39m97j0M16n0k20M34l20j93K43K33k21R0K13n61l5O92n46J93K31l76r3Q23
1874E85m63m22O45k36m83M00L92n99L19o0l17J88O17q58K38K44n39q4N74j35m24
1895d18Q96o66k26N82j93j68N5M69p78N93J46o86N95Mo79L20N36m02l46P77l17
1916I4m34P21m58J00J27q4m76M74Pm01O56M46r99J3L87o62K07O64l88j92J87q0
1938i1l28M91J52k87L70m12k66M83K38p28K02L69l85j03N72l15m20P29k29l16
$$ y = [-464, 399, -187, -363, 375, 281, -555, 85, 417, -346, -43, 466, -370, -203, 270, -272, -722, 90, -198, -452, 329, 189, -260, 10, 99, -518, 375, 367, -227, -213, 66, -237, -93, 605, 93, -128, 279, 147, -132, 431, 69, -197, -13, -127, -614, 168, 403, -232, 169, 390, -355, 301, 628, -372, -27, 336, -149, -308, 51, -333, -423, 139, -358, -368, 48, -2, -222, 212, -108, -301, -58, 175, -46, 44, 257, -304, -339, 353, -193, 0, 231, -145, -238, 585, 122, -300, 345, 109, -374, 26, 418, -181, 138, 78, -239, -51, 566, -292, -54, 190, -349, -433, 141, 6, -418, 478, -188, -414, 168, -25, -193, -138, 331, -447, 146, 292, -394, 201, 205, -474, -154, 382, -20, -366, 411, 94, -340, 381, -77, 23, 150, 66, -410, 64, 71, -330, 326, 772, -227, -214, 173, -489, -282, 382, -6, -198, -11, -91, -419, 72, 224, -63, 307, -105, -371, 112, 350, -378, -176, 193, -192, -295, 277, -38, -458, 271, 42, -274]
1958b74N83n21k17Q72p0n26N34l86k31M29j40q6J59K18n97Q9k1m0l34J101n11
1979C1j72J38L8p8M69j53q02R07k20n21N09np3k9j48Q7J51K30n27J06K36l30k80
2002d36M78k9m03M34M27r26N13K9k33L91K3l56j45Q33p70o4N07m04k86Q58m87
2023d6k58J03L33l88K69P5m08Q5L67k90K34R5l98j66P05m96K31K09n36K42L72
2044C34o51M66Q2l57K7O40m06n47N16O3l89M96K8o07N71J76n03j3M78l15n68Q38
2066C59m40l68M04L58o48L71J75l81L08p9k74j03P00p92L01M79k09k29L82l64
2086e0n8L50k57Q1N1l9k88L85O6n55L95j10l90N45q9k19M9L28p42J53P17l36l10
2109c23Q38n32m85P15l9o28O23K01n33J34N08p66K46M57n09k1O57m05l25M55k17
$$ y = [-274, 309, -212, -429, 443, 373, -153, 381, -5, -236, 193, 53, -33, 126, 344, -253, -164, -185, -225, -559, 542, 31, -141, -3, 35, -43, 426, 273, -529, 378, 158, -363, 146, 141, 68, 39, -109, -22, 129, 359, -168, -62, 174, -156, -436, 42, 13, -390, 44, 471, -455, 58, 87, -146, 245, 268, -88, -233, 600, -170, -234, 273, -131, -417, 441, -46, -304, -201, 132, -256, 13, 88, -320, -235, 132, -158, 76, 171, -227, -393, 312, -184, 47, 256, -280, -38, 334, -317, 149, 231, -126, -99, 541, 135, -412, 104, 167, -222, 274, 302, -305, 266, 442, -61, -74, 404, 89, -479, 359, -81, -449, -45, 313, -335, 36, 211, -170, 138, 59, -215, -318, 382, -410, -109, 370, 161, -68, 314, -50, -108, 242, -15, 66, 117, 78, -210, 175, 241, -314, 81, -29, -419, 126, 37, -182, -133, 195, -547, -394, 323, -13, -323, 515, -17, -502, 213, 174, -454, 169, 370, -163, -29, 479, -287, -41, 416, -93, -114, 543, 138, -187, 268, 51]
2130E1m89M35j67J05J88L5m06L47K26m22K46r9qJ9p9k63J14P8k90K97L18k96n
2153f5M15m80k78N58l86k35P62j02m29L48J67n45K1P38n44j25L46j82k57L24q5
2174c4l38O65k92l57M63P3k56L6NN4k46M31k47j67N99l16j65k29O1L87j38j91
2196b02J45Q7J5q8L25J14o15K75O0l24R5L84p53K27N45k60j40M03k96n8M08l32
2218A5n74Q23K78q91K70L76p59L46M05m06Q0L80j7m20K40L2l22P7O8j64M89k85
2240D1K5r3k02p0L80j88J79J44r4r8K86j20n50K27L34m09J88N38m55l66N98k28
2262F7l36M66K57r09L37N40n57J18L81n47p0M92l18l06O06l16OJ94j36r5K35K48
2284C57m74K15N6k97mL64m50R8L17k18K33l90l64N91K64l82q0L59k35M4K24l95
$$ y = [51, -438, -3, -170, -65, 123, 158, -248, 99, 325, -97, 149, 50, 42, 61, -18, -281, -167, -89, -379, -82, 236, -60, -65, 350, -130, -408, 150, -236, -471, 291, 189, -240, 108, 275, -270, -249, 489, -55, -180, 166, -16, -273, 51, -34, -372, 293, 1, -356, 107, 180, -76, -40, -35, 19, -227, 204, -43, -210, 389, 73, -92, -321, -260, 127, -11, -202, -57, 30, 45, -43, 282, 396, -219, 56, 116, -208, -113, 271, -482, -255, 290, 30, -110, 293, -3, -61, 347, 15, -559, 264, 542, -349, -79, 297, -462, -116, 289, -117, -37, 343, 326, -94, 146, 178, -144, -67, 1, -163, 326, 41, 66, -27, -229, -299, 81, -107, 72, 216, 122, 24, 310, 190, -360, -133, 201, -208, -20, 518, 63, -303, 295, 67, -269, 197, 454, -455, -118, 422, -135, -17, 364, -183, -253, 239, -79, -385, 221, -95, -89, 105, -31, -126, 109, 357, -117, 98, 154, -143, -147, 217, -233, -135, 182, -36, 197, -193, -557, 34, 298, -84, -164, 195, -40, 4, 228, -167]
2306a67r0N36k30k26N2N48q08O77J69n57j49Q15q96j30P82l63O8Q2l16l46O99
2327A50q6l07N74j00m08J40P0k43M33j68K11j53j77J04l39M34j04n1L67n10N8
2348a05L83m89O6J99P0n73O56K7k98O3J96l06n7O19p56O6N29l14k05M56j68o43
2370e84J051j31m54R6N2m27K33M08j51o4o1K37k93K90o5k75L4M10m02K00q7J59
2392A76m30K2J70K64l68rK85j17j95L97R9n33K71O0l55N8L66O0m87P11k10o62
2414d27O90R2o77K02K69m69L65K55n77n9N77l16l29N17M8n11L21N81o56j6K28
2435A08O2j50K52m34N4Q2J33p4l32J0O14l22j47L25J83o08K20J66m83J34O35m37
2457io6L35m06j46N76k53r6NM94r05J19Q87n12l37M80N6o48Q52l35j87J43M2j26
$$ y = [-167, -257, 279, 49, -177, -125, 423, -385, 292, 461, -96, -245, 570, -326, -456, 326, -37, 31, 113, -203, -549, 150, 64, -243, 331, 231, -177, -37, 33, -210, 223, 55, 266, 113, -64, 40, -299, 135, 31, -20, 347, -163, -105, 278, -211, -145, 54, 124, -449, 207, 234, -64, -1, 195, -111, -168, 451, -305, -239, 290, -24, -229, 227, 59, -584, 467, 336, -118, -22, 30, -397, -164, 244, 93, 29, -32, 205, -88, 202, 137, -138, -104, 306, -96, 104, 17, 176, -254, -232, -62, 202, -166, -175, 110, -7, -202, 195, 294, -239, 32, 92, -263, -205, 161, 221, -266, 445, 235, -427, 263, 355, -322, -120, 149, -320, 45, 300, -277, -336, 241, -75, -404, 113, 161, -350, -29, 552, -104, -120, 108, 170, 20, 272, -162, -108, -26, 107, 33, -299, -289, 325, 3, -144, 181, 364, -244, -24, 142, -341, -207, 428, -9, -75, 260, -146, -292, 284, 31, -65, -60, 434, -471, -352, 535, 23, -314, 166, 222, -426, 426, 91, -96, 47, 89, -37]
2480c7j87J21K95l45L23M1m65J12J34J9nJ57k06N7N8l8P0j2J1Q9k46k67M37l8
2504G8n39Q58l40m50N42K51p41J44L98k23j40N75k80m70N47K0p25O50N13o23j60
2525a15K86j74k15M39k88j47N19l85r0J41L94l66k68M70l47K67j18k34K40j75
2545a66J33J69l22J73J80l40r2M41r3l28L09J14m52L78j03m0l49N21m5l32N54
2566C10k6n03K66J88m43K33L66m58j93M07N6o10K57L57k70J04K68m11j84M16j4
2587A16m3r7K96o7k01PJ21M9k28J46K8k92J65M3j42J6K93l83LO15n16l06N51k40
2611f6m07O54Q4n10L54m1k55P5K33J21l34M78l20l59L55J14l47J54K96j66m31
2632c18N99P7n18L78m38K05K6J25jo0j9K95m16LK66j42n73O57K07m81r6K46j9
$$ y = [-37, -224, -103, 192, -153, 170, 211, -254, -142, -8, 11, 6, 163, -43, 14, 72, 34, 104, 92, 103, 192, -54, -321, 116, 78, -461, 397, 57, -393, 149, 400, -341, -197, 201, -22, -162, 413, 133, -337, 210, 230, -495, 155, 668, 45, -115, 171, -3, -218, 221, -67, -214, 305, -80, -170, -29, 365, -1, -269, 201, -146, 121, 3, -231, 9, -166, -33, 136, -186, -13, 167, -173, -265, 176, 83, -245, 64, 178, -274, 104, 1, -39, -388, 133, 88, -244, 310, 284, -219, 47, 235, -208, 25, 391, -67, -260, 147, 203, -407, -150, 207, -63, 41, 309, -102, -286, 130, 116, 73, -24, 272, 205, 4, 11, 132, 181, -47, 99, 127, -165, 0, 43, -99, -83, 210, -173, -170, 445, -71, -377, 174, -66, -473, 181, 265, -245, 109, 68, -187, -112, 121, 242, -92, 386, 66, -293, 62, 176, -171, -17, 279, 113, -318, 281, 358, -160, 218, -220, -15, 11, 136, 135, 75, 56, 351, -65, -62, 204, 62, -511, 146, 353, -128, -224, 22, 3]
2655CK1M21j99o72K68N47o50L88L10p81j01Q72l56o71P78J99p23M30M4n39L11
2676a00J67l82K6M26N0m61O19m24j48L38j63O0J48M4j34N4q7k16OQ0p8K48r3J44
2700A24J33k88l30N66N9p17N47K90j81p27O40k23j92N62k61k59M92j46l59J09
2720a61O40m50n52R39p40R0L90R4l82R0J40k38L34j22n3L7j3Q4J6n0k51j5L8J68
2744C3Q5j64K77j51O2k23J58j42j24K15L58r4m21K09k91j45P76m20l1P8K42l78
2766i1j0K75m88N5N87j44n39L72R0l11k5M56l51j44K52o2J9K70j49j94q5M23j16
2789I0j50P0j07K87j81l9P6jP8p2j21J7K18k18q8K99Q7l57K87j74l80L90M43o85
2813b31K57M42m36o11Q17q9n86N26N5l50K50K54l11N6M32o43O4M8k77O0M97k30
$$ y = [3, 24, 445, 246, -426, -158, 389, -261, 127, 437, -344, -445, 427, 71, -600, 178, 377, -346, 84, 128, -411, -100, 67, -315, -289, 137, 187, -274, 345, -79, -227, 111, -52, 8, 156, 200, 66, 120, 33, -183, -177, -97, -175, 73, -20, 124, 257, -31, -361, 205, 264, -453, 94, 384, 203, -524, 116, -107, -299, 263, 2, -257, 235, 89, -270, -161, 479, 29, -523, 416, -324, -234, 156, 250, -132, -42, 98, -140, 194, 72, 19, 56, 43, 127, 143, 93, -158, -173, -135, 33, 118, -46, 231, 80, 142, -81, 77, -65, -189, 26, 384, 290, -131, 78, -213, -358, 418, -2, -33, 45, 287, -91, -101, 174, -314, -259, 328, 184, -355, 17, 107, -204, -229, 227, -124, -268, -16, -78, -59, 211, 62, -132, -217, 206, 90, -60, 10, -97, 190, 9, -30, 46, 45, 123, 51, -70, -53, 165, -53, -141, 158, 245, -112, 175, 1, -379, 11, 454, -231, 26, 468, 32, -579, 238, 149, -437, 89, 144, -206, 44, 298, -13, 43, 475, -168, -104, -56, -333, -273, 224, -6]
2835fo5K23j45k9O1j05j81L07k0k33L31m09j42M97j90J82M9J85l40L5L15l66J42
2858I6l7k39J84J99k26j44M05k88m16N55J17o48M19M26m07l23M98k90L6L30l21
2879g4q3L24j2k59R8L36m31K69j22o9J93m2k27o2Rj26O71p47J46L40m19L31M6
2902I0K12n15M24k23k5k24M13l30K21R0Q5l83N2n8n6L65k54L4o4K65M0m88N82
2925B53k43l50K13L92k13Kk66K85l18j9J96n5J78J4j90J31KJ2Q3P8J3m3k37J54
2949G2N1l46P8K92k10n5J1M6J60j14L60p78K46N46j98j1Q5l51K98J64o28j83L66
2972i9M9K9o6J92p5m5L60l96K20N0l44n3L62m7n68L99J49RJ92n23K63l1n3Lj0
2997c3j21j07M52M2k18Q4j15L55n0n12L09p8K22m53j49L94J33m30L77P7j04j71
$$ y = [-6, -71, 152, 7, -22, 39, -66, -247, 60, 40, -193, 138, -271, -413, 84, -106, 76, 125, 310, -30, 5, 320, -46, 96, 59, -180, 4, 203, -23, -167, 238, -50, -466, 89, 206, -442, -23, 403, -4, -327, 171, -119, -83, 247, -74, -157, 167, 155, -104, -6, 330, -101, 168, 46, -23, 170, 128, -99, -161, -152, -278, 393, -354, -208, 132, -287, 44, 90, 302, -213, 211, -12, -37, -261, 152, -178, 43, 133, 218, -165, -113, -171, -227, 138, -116, -82, -146, 119, 159, -329, 253, 10, -340, -127, 265, 52, 54, -212, 73, -245, -264, -68, -123, 55, 69, -121, 10, 12, 24, 107, 185, 198, 155, -82, 72, 123, -223, -145, 147, -63, -118, -107, -61, 99, -15, 345, -433, -187, 359, 161, 150, 235, -116, 182, 346, -282, -465, -99, -50, -21, -87, 105, 30, -15, 345, -51, 169, 219, -125, -178, 184, 137, -431, -32, 117, 126, 318, -205, 58, 27, -26, -23, -33, -154, -261, 191, 233, 15, 99, -16, 339, 289, -223, 86, 8, 230, -223, -372, 22, 155, -275, 102, 179, 75, -96]
3019i6N11p50Q0N16l32k61O3N5K03j68J68p2J82j51j23P6K5J58p7m6N4j25L47
3042B37j09o9J41k31r5L01n19M78j63l5Q9Q3l92M54J04m01K99j36J08k52L11n
3064A98p0n2J4pj5L46k05l33N58m27j00J04M39p06J84K64k18M4J23j29n1R6l23
3087b66K68K17l06l53L75L8J17R5l95l8J45K71k06L63k68r4J46j18l21M85n6k95
3109a96K82K38l74J5L60k94m49P41n16L0L95j47k65L04j20l46N36j35l08J41L29
3130B21l54q9L44J53l12j05K16q4j32Q2J23l00L85r3m8K6k45L62M0m69N13j80
3152E4j92M00k21%j12J09Kl88K81J18j03P9J45j46p5RK2J42K3n11K24K44k55J89
3176C8M25n09j50M34m26L32j9p0l54P3L74l56K45p5M02l63K37k32j20K05j0P2
$$ y = [-96, 415, -335, -255, 261, -71, -332, -269, -214, -11, -179, -11, -83, 99, -52, -175, -99, -74, 84, 7, -39, 15, -110, 237, 128, 59, 200, -31, -126, 175, -344, 134, -29, -64, 25, 108, -284, 170, 274, -127, 172, 36, 144, -108, 203, 198, 128, 76, 90, 83, 68, 414, 209, -124, 434, 7, -93, 11, 450, -256, -72, 192, -26, 18, 141, 12, -39, 57, -266, 2, 219, -87, -440, -65, -27, 90, 185, -210, -248, -103, 168, -38, 325, 57, -37, 109, -9, -330, 155, 99, -196, 86, 324, -50, -35, 325, 31, -418, 323, -193, -163, 232, 85, -180, 124, 4, -342, 194, 59, -249, -108, 221, -133, -222, 122, 275, -37, -142, 74, -10, -142, -60, 63, -237, 148, 55, 7, 33, -212, 150, 190, -279, 234, 54, -138, 262, 41, 41, -71, 38, 40, -348, -67, 51, -52, 27, 172, 26, -49, -40, -18, 124, 147, -364, -140, 104, -151, 38, 463, -46, -196, 238, -188, 144, 125, 55, -299, -226, 148, -208, 37, -38, 364, 1, 238, 6, -114, 91, 81, 153]
3198A53k01J07rJ49j85J3O6j1m04M25K22m81K00M2k4K3P6k11j98L77l36O5k2o
3222a70J98J56k44j0J97k20j37N39k35L8rJ58m64J90K75n07J67k48J67K88M0k34
3244f5j0J68p0P1k44K42m78O15l80K7L64j18l75K79J68l77J45N5n5J19j09m6o3
3267a37L80k95o3L49L0o31M34j9k75L81K8M8l97m0K58m7j10Q5J33r9j51J15L48
3290C25k30k31L73n38J82J30J35j04K00l02L63l36K04m32K67J60k24r8M08m36
3310a84J8M46m06K28JJ20n72M47Q0l31J33J51k57R1j50j32M80j32J84m84N05J73
3332D09o83K65j05k37J97K70l30J13K65j77l91M61K0Q0p8l8o5J6J59p3N8l21n6
3355b41K27K69n35M40k26o2N31n69j7N7L8p6K30k65kK79M3P8m04L74l26L33J21
$$ y = [153, -48, 59, 50, 199, 14, 27, 93, 82, -322, 103, 325, -156, 44, 86, 62, 85, 161, -50, -248, 129, -207, -142, -164, -170, 28, 184, -60, -70, 127, -93, -230, 309, 74, 112, 103, 261, -203, -13, 262, -245, -78, -326, -159, 129, 169, -65, -75, 93, 23, 94, -150, 92, -386, 229, -151, -124, 240, 122, -253, 26, 194, -183, -38, 17, -38, 81, -28, -74, -137, 243, -52, -115, 234, 264, -367, 67, 48, -227, 154, 182, 230, -167, -207, 51, 4, -106, -21, 112, 13, -138, -23, 325, 95, -136, 237, -301, -119, 11, 146, 42, 242, -60, 303, -33, 171, -261, 6, 166, -58, -156, 252, -184, -166, 280, -126, 102, 103, 223, -349, 98, 178, -153, -20, 131, -126, -35, -185, -317, 163, 31, 215, -269, 236, 409, -274, -9, -114, -351, -154, 116, -214, -101, 164, -13, -404, 57, 77, 157, 79, 41, -24, -8, 151, 78, 136, -185, -241, -14, 255, -280, 160, -66, -128, 403, -166, -183, -126, -88, -164, 66, -199, -201, 78, 121, 199, -205, 169, -157, 176, 297]
3378B97l14k20K17K10Ok01j56M5K92m10lRL01o7K38j01n8q5K89k04q5kj23R9M
3403b2j40m5J41J36k0j18L97m46kL03k61J06j7J86j87J89j88j09j8M3L1L40m06
3426a07k73M15j4k43K22M25o94L66K7l47J65K09k72J94j5k18P3R3P2j78j55L66
3448A11j64J09n4j95p2M97l65o6R5K02j64j86J78J22J94m24j12L87K00m33M32
3469B92m87J65Q6M5j81R9j50L1K59J04m61Q8K40k77K98M0j5j99J86l22N1J91L21
3492D04j15j76j23p8K51J2l3j04J95l28J1M10l68K2J59k14j26J70K7k54J64K01
3514A07k80P2k9l4K77k36j44J94J38L0m31N25l08O8J39M3j68K9Q1k58M18r7N9
3537A95j8O4k83L26j54j50J16l45L06q5P9RO4J77k09j47R5Q3l27M89q7m35N90
$$ y = [297, -17, -237, -20, 190, 196, -5, -161, -116, 176, -234, -237, -228, 73, 6, 244, 143, 85, 0, 289, 85, 0, -2, -125, -26, -22, -162, -207, -66, 70, 50, -68, 329, -117, -119, 184, -77, 29, 12, 198, 11, 200, 12, -97, -115, -72, -41, 299, -107, -380, 35, 21, -222, 0, 425, -269, 97, 124, -223, -58, 151, -121, 73, 58, -160, -87, 6, 78, -100, -255, 111, -53, 56, 2, -193, -265, 232, -133, -199, -104, 98, -66, -252, -74, 48, 242, -182, -294, 93, 293, -140, 292, -195, -30, 56, 101, -80, 19, -131, -100, 159, 263, -198, -110, 130, -147, 151, 191, 176, -23, 163, -159, -108, 83, 404, 289, 113, -10, -88, 163, 175, 142, 38, 233, -95, -84, 326, -42, -20, 139, -75, -201, -31, -4, -258, -94, 107, -173, -101, -130, -164, 113, -123, -267, -73, 65, 95, -336, 189, -119, -51, 88, 131, -37, -8, 73, -185, 233, 136, 195, 177, 241, -42, 284, 130, -20, 96, -249, 57, -28, 51, 60, 124, 301, 92, -55, 40, 123, -204, 285, 198, -237, 353]
3560C53k32k68J63J89m21K9N21n04J73L5l1q2l25N76l51r9N73l19J87r2j84J77
3582F8O0j12J13l43K06j19j13J9mL60k47o3N00m15r4K19j00Kk17J9J29O2J87j84
3606f7J00p4J01k09L99n15P3L4M45k38R0k72j82N09m8j14j7k30K3J34K17m01J12
3629a30J24j24j23J81j67K14m1K30k66J04q9l12M03K40r7o8J56l60K18r5Q0j68
3651i0J59k49K0J37l89K67M95k28J18l01M0j92K11jn9J00N9k04O8J13o8r4J96
3674A08p1L18m53J92o3K33j0l35J87j85j2K64L0k81K84M1l44j80M61m88L42J27
3696A65j4o7R2k48J76l08J92J47n7J25k90K5L65n70K06j07r8M65l6j6k00J87l47
3719b13Q9O10n21L77n08K02rK99k67J89j89J4P1o3j98P4J75J6k82k37O23m13J71
$$ y = [353, 121, -147, 16, 205, -216, -187, 334, -170, 3, 38, 7, -75, -400, 176, -175, -274, 299, -20, 167, 75, -109, 68, 128, 16, 129, -214, -8, -127, -240, -221, -225, 135, -112, -175, 325, -90, -184, 35, -65, -63, -280, -261, -132, -70, 117, -67, 33, -41, 60, -149, 250, -265, -192, -158, 287, 49, 139, -133, -315, 194, 146, 32, 15, -215, -192, -58, 159, -242, -130, -6, -130, -253, -72, -239, -25, -66, 164, -102, 2, -87, -399, 4, 244, 147, 79, 235, -125, 93, -2, 78, -90, 69, -180, -160, -23, -412, -145, 350, 122, 240, -61, -21, -213, -2, -3, -62, 38, 97, -107, -39, 74, 6, -88, 108, 37, 355, -98, 94, 31, 264, 254, -81, 106, -79, -91, 173, 203, -78, 206, 247, -97, -277, 184, -304, 38, 165, 151, 84, 176, -72, 104, -204, -12, 135, 78, 203, -87, -62, 303, -267, -61, -168, -266, 199, 163, 147, -53, 134, -213, -124, 486, -35, 342, -166, 36, 27, 326, 59, 248, 59, 73, 144, 81, -117, -43, 132, 148, -134, -371, 252, -161, 10]
3742A0k21JN2L03J53l01j34J19j13J85J77k63l8J21J41l64K50J9l45L56m01M04
3764A11LJ4k21o6K24l84N44q9k57l1K19j05N3K10j36q1K39l52p3J67K2J16K5k86
3788a34O9K6k95L28K33j71n2K0J2j32j09J55j14q1M35j48j11j18j94L93O3J10
3810A85k84Q3Q2j00J38j7o13M54L33l41R1J30p5J16R6k87k83O32m23K6J3JJ90
3833A47q8j00j48J17J21p5J58J12l11J08k6K89l50q4J01P8LJ53m40L18J82k64
3855AJ04J06L8j47o0m35N27n7J19j93j37L5L7L7K28m02K55%K1J3k76K53j03L26
3879B90l95R4K38Q6l9l8m02K31k03K29k43K9J24o2R3N8l8j04N6l74K20K73m55
3902c32K73p5J11n6K20j8j99K12O9k28j90K14O8m2M4j50J63M8q5L69l27j88L7
$$ y = [10, -211, -210, -158, 145, 298, -3, -137, -18, -131, 54, 231, -32, -70, 51, 192, -172, 78, 97, -248, 108, -293, 111, 114, 128, -93, -159, 65, -319, 225, 136, -121, -152, 67, -38, 15, 225, 89, 8, 247, -105, -178, -11, 11, 127, 152, -134, -65, -39, -334, -6, 227, 56, 4, 24, 36, -96, -205, -50, -164, -245, 190, 42, -69, -187, -381, 12, 75, 185, -99, -16, 66, -34, 104, 87, -526, -72, 261, -80, 11, 141, 66, 182, 278, -9, -292, 340, -83, -57, -44, -43, 147, 59, -41, -189, -72, 49, -26, 132, 244, -67, 41, 15, 304, -46, -130, -29, 49, 52, 205, -235, 83, 265, 1, 105, 211, 249, 102, 42, -393, 134, 77, 196, 3, -134, -99, -62, -25, 203, -199, 56, 56, 77, 90, -186, 67, -36, 290, -105, -11, 227, 313, 274, 236, -166, 65, -138, 91, -152, -123, 1, -61, 32, 90, 52, -52, 4, -370, -150, 123, -332, -59, -134, -23, -79, 141, 123, -76, 136, 205, -23, -213, 1, 69, 27, 71, -79, 84, 132, 47, 416, 89, -99, -62]
3925f2n3j25R7L24k70p3j7J50j7q9K08k39N89n52k42N25Q8l99K95j60k7O3R5M
3949A13R3m3r4j18M4Q0LJ17l9j65p2O7k93L18j03q7K30M7l61L97j36QK47j18j80
3974d5j68J19K17l26MK42k08L3n8O2J50p8K00j90N4L1k38K48k1o1R2%j53ML58
3999B68q1K1p4k69P5Q2L1m16M71q2p1n8Q5o7j17j70M49J11n55L78J64m64M4M6
4023a99N00l15k30P4K6K71k38m4L61k70nk7r5M3j31K83L7N3k47J43l2K31Lk08
4047a6L74k63k13M32l58O6R9k31q4K98K75m52N5L49k90j88J65k91L98k09L73q5
4069B04l01J33j98K08J1o3n8L00n28L92l6m9m86M59R9k61l2J55O3J20o3r7j3P8
4093C7k58K50R9n11O23l25j19m2M61k23p7K76l51%L73j0j94Pn3k38M17k66m2O
$$ y = [-62, -115, -240, -143, 181, -89, -162, -179, -29, -46, -135, 73, -166, 423, -129, -371, 154, 242, -157, 138, -22, -49, 14, 109, 113, 206, 163, 69, -49, -5, 75, 78, 195, 156, -9, -81, -14, -307, 11, -92, -179, 51, 98, -263, 134, -2, 6, 253, 135, -45, -213, -94, 123, -203, -199, 43, -165, -132, -190, -128, 22, -56, 144, -46, 8, 39, -199, 49, 28, -33, 59, 59, -94, -90, 268, 187, 208, 134, -135, -60, 22, 53, -363, 108, 26, -45, -103, -18, -85, -202, -372, 77, 188, -367, 11, 175, -289, -245, -199, 301, -14, -244, -170, -144, 127, -111, -155, 206, -64, -69, -96, -191, -148, -279, 4, 41, 94, -153, -10, -42, 189, 192, -16, 358, 95, -118, 314, -44, 22, 121, -110, -194, 104, 379, -73, -18, 331, 41, -147, 18, -273, 125, -84, 289, 204, -97, 36, -162, 46, 57, -6, -64, 236, -292, 100, 64, 15, -471, -12, 87, -174, -206, -51, 12, 132, 69, -28, -41, 37, -221, 29, 128, -383, 240, -85, -204, -246, 215, -8, -85, 191, -160, -160, 213, 203, 9, 16, -37, -275, 142, -124, -166, -160]
4117a60K7o9K27k17J99j55K70k36M1J96k72L3j28K30L5j21Q6J46j35j15N5M7J74
4140A58m45L99K2k02J97Q0k40j9OoK4k1k4k2L65j70k49L0k70J29K71J03j60p9
4164a23K74k91J4Q1%j69K37q6q6L47j85k20M21j15l59K60K1k55L19m38K64K88
4186A99J61p69L58K92m05J84o1J62q6K3r9k4p6J44m01P99n32K2K55L2k00j89J81
4209c0j00L25j21q8K3k8j83j08K57J45p9l6M7K45j86L93m54K54J14k95rk94J95
4232a3j33J86k11K57K9l96K51nL9p0K15O6l39N9K42J6L5j26p6J38j49Q1n0K0l21
4257b55K07L49k53j09K01r5J02j07J02k94L14j69k62l22N96p8j1L67k40j43L05
4278B05j04j22L35k10j60j44M22m63J69O9J09k57J80l47M16R1j59k42L20j54L79
$$ y = [-160, -133, -202, 25, -192, 7, -148, 122, -114, -73, 123, -149, -116, -244, -14, 21, -100, -14, 132, -3, -118, -63, -16, 158, -287, 112, 134, -68, 129, 209, -31, -50, -44, -50, -26, -47, -71, -93, 272, 102, -147, -117, -387, -258, 13, 116, -44, -123, 151, -140, -126, -45, -45, -214, 23, -63, -149, 198, 13, -207, 214, 99, -260, 0, 21, -234, 85, -353, -89, 199, 360, -409, -51, 241, -164, 20, -41, 121, 35, 58, -41, -65, -141, 3, -398, 401, -131, -109, 146, 178, -22, -211, -30, -130, 195, 74, -14, 9, -19, -202, -310, -53, 92, 13, -23, 24, 269, 83, 476, 22, 276, 390, 95, 86, -208, -13, -146, 40, -171, 86, 115, -281, -30, -35, 4, -66, 149, 215, -124, -65, 177, 193, 228, 102, 26, 164, 15, 96, 46, 66, -255, -48, 301, 48, -61, 140, 45, 147, 40, 142, -152, 162, -7, -269, -591, 5, -73, -84, 283, 43, -100, 205, 101, -21, 314, 104, -56, -200, 222, -241, -72, -3, 106, -151, 29, -318, 98, 189, 30, -212, 108, -46, 333]
4299C33m36J14L32n06L27j43J09Q0j21nK07o34O60k18R1j00k01k3q2N0J47K0J83
4322A84o4r3J14M8j52k90O2Q0L7L65l80j96M80m2l12K40l82L19o2J30k82K75j53
4345g4o5K53m40K65J64J04k1k8j35k47J40L15j28j17K51l11J82m1J04j03J09m4
4367A33m39M80k83O2L84k44m19N42l36K7o8L79K1j70L62l39m4m4j24j72N31r1
4389A48l00K81J5j52M40l18m1K24j31n76M08J07q3k99K58P9l21K19J15klQ4jj26
4413B5n7J81j52j2R2k36KL00j68l6p4J61l6R4j39p3K36k37J45O3l36J27J79J32
4437A81k17L9Nl15Q7J88m6O9lRL7j31J12k82M21mj18P6M8j6r6l1j80L34k17J11
4463F1K6J09j29l48N3J75L94n56R1K7j33K49j09Q8m1Q5K09l66K03q4R6j46L42
$$ y = [333, -103, 11, 343, -163, 164, 21, 130, 210, 89, 84, 291, -343, 317, 99, 190, 90, -111, -134, -216, -166, -19, 1, 184, 120, 27, 141, 189, 37, -253, -191, -111, -74, 291, -89, -285, 195, 153, -159, 81, -301, 18, -44, 86, -196, 79, -74, -139, 114, -326, -61, 103, 207, 186, 158, 23, -224, -84, 231, 103, -14, 237, -74, 108, 67, 171, 68, 177, 133, -306, 174, -109, -47, 337, 93, -326, 216, -120, -93, -161, 218, 239, 69, 431, 92, 48, 4, -120, -292, 239, 148, -152, 129, 144, -8, 432, 114, 73, 297, 166, -410, -2, 105, 22, -277, -19, 60, -261, -42, 73, 71, 68, 152, 151, 25, -32, 149, -3, -15, 77, -159, -157, 143, -25, -61, -135, 26, -10, 84, -55, -128, 108, -129, 16, 79, -257, -130, 49, 181, -36, 3, 8, -307, -220, -32, -78, -9, -12, -3, 34, -97, 15, -267, 154, 150, 32, 108, 156, 140, 44, 13, -167, 167, -50, 61, 87, 196, 67, -281, -228, -53, 341, -215, -124, -97, -230, 19, -90, -2, -43, 42, 251, -115, 88, 4, 100, -46, 296]
4486B96m92K19J16j71K02j80j00J45P2j10lM6M8j32J92r0n3j4J85j0m1n5l3J24
4510A61l25N06k20l09J24n9K51m45N65j69j57qK41l59L15R3J52m38Q6K2l35M14
4532A06J36l46J44l52J02P27o10J04l01K67N4j59k4M45o6m6QK5O2O0l63l7O8J1
4556A5k27J57J67l03J34j17J10p5J78l04O3L13l74K59L3l65L36K40j44o1l81K64
4578h2J25k87MK41j21M77n42M6N0K9r4Q6k6q6K80j80K49p2K24l65K07j86j0P2
4602C9n1j13J23o9l42N65k32K8K57k90m7J08J43l15M41k27L8j27J7J43k66L21
4624A44n61L01O9N2j10k29L15j43K82K2l23K74J98k28l25J62K09k70J98Q7j57
4645c3K25J71p08L69l56L56j48K1rq7N02m16J59J85N2n83O26l06l04J14J84j11
$$ y = [296, -196, 23, 139, -32, 170, -10, -110, 35, 107, -3, -6, 40, 88, -44, 148, 58, 5, -9, 176, 166, 125, 70, 37, 161, -164, 342, 122, -187, -63, -122, 129, -316, 249, 80, -77, -85, 156, -203, 112, 205, 357, -81, 5, 27, -308, 106, 242, -104, 40, -312, -210, 517, -93, 11, -290, -23, 31, -128, -152, 293, 227, 181, 189, 214, 276, 336, -27, -64, 4, 15, -212, -55, 112, -191, -57, -174, -64, -139, 39, -265, -202, 111, -263, -4, 29, -336, 0, 240, 96, 35, -346, -82, 43, -244, -240, 1, -120, 357, -185, -139, -89, -60, -154, -68, -94, -180, 100, -80, 169, 97, 321, -44, 163, -23, -33, 39, -12, -125, -2, -71, -413, 152, -80, -52, 205, -85, -132, -24, 119, -196, 245, 18, 56, -71, -54, 89, -177, 144, -417, -116, -47, 5, -105, -334, -19, -162, 120, 142, -181, 93, 291, 63, -262, -100, 109, -161, 37, 124, -33, 192, 363, -345, 24, -332, 24, -124, -103, -112, -199, 303, -113, 46, 231, 283, -300, 326, 20, -284, -170, 14, -97]
4667i7j33k7L26L0j81O1P7k37J2K96j66q5Q2M42o34J07M88j27j76j42K12j54j12
4690a38K1J15n7k06J51Q0K16k53j6K03l70L31m2k1k98N10k60N8J67k06p5K12j20
4713Bl88L88J66j96p5j04j0L99j50j73J97j4l06j10M73P5k45O6N9k37L15k17J74
4736H9j58J86r6q6J52j22k30K75q5n2J65q3J51m46L32P8ML6k51L07o5j48J33l73
4760b87K91j89K18N5O1l09j5K8K00O1k51L34j77r7K80k78j28J52K94o46K97L25
4782B19k75j3J23O7k77K29J58l73K03q4J77r9lR0j01J64l06J82m7J90k54k32q
4805b70K07K28O4k32J79M6l62L53j60L4j95K90m16K92r1J06l39J64N3J63P9J66
4827C59l12k49L23k74J35RK20j30j21j43K41j55K69o2nj91J45J0J01k10k75N07
$$ y = [-97, -230, -257, 69, 99, -82, -21, 56, -181, -169, 127, -39, -124, -42, 400, -234, -127, 361, 234, 58, -84, 128, -26, -138, -117, -2, -59, -265, -114, -34, 182, -71, -87, 116, -254, 77, 35, 14, -284, 226, -34, 24, 191, -15, -90, 122, 2, -386, 2, 168, -28, -103, -207, -217, 182, 32, -141, 56, 42, -264, -374, 99, 174, -71, -5, 54, -183, 132, -85, 89, -69, 117, 21, -65, 87, -35, -265, 10, -75, -127, 38, -45, 106, -340, -8, 70, 74, 110, -141, 166, 101, -47, 86, -287, 4, -185, 33, 88, 149, -160, -175, -147, 53, 114, -137, 197, 20, -77, 203, -75, -203, -51, 243, -403, -106, 219, -56, -69, 54, 121, -156, 73, 231, -142, 61, -23, 154, 55, 52, 142, 41, 205, -101, 81, 34, 224, -30, -262, -270, -63, 165, 229, -3, 176, 222, -140, 213, 53, 87, -108, 182, -234, 58, -33, 73, -266, -102, -49, 114, 193, 359, 47, -202, 121, -153, -18, -9, 211, 81, -40, -183, 58, -97, 172, 110, 105, -86, 59, 69, 170, -40, -315, 192]
4849A92m2p1R1m68M88p1k11N0j8j35O7L00j99p2J63j50J99j77O1p2M1l3MJ20M1
4874I8k29J77N0k51L1q8M3M04q4J26k89p3J69j94K35n5k06L7N2k29M24j13k03
4897a68J11R2M1k71O28k04q5ll54L61m95L03mk43L00P5rj40J03O8j14p2L7j48
4921a91j3L35m51J85M26r0l94O30m44k30N8O1n1K53k47L99j14K0l00J61L83l28
4943E8j5q4O0K49O1j95j85O2k49M42m80N95j61k91L90l39L15Pn05M31j96R5l53
4966b88K34Q8Q6j92j29L42l3K42l04p5L99n31J46J55j39p9N1M2O4l2m9J17J32
4989B47l82M09j49k03L00q3p2j96M9K24j86J43K68l34J31n4k31J49j18J14o6K62
5011B22j89j36J88R7j66J36k84L05j78J42m3k6n2l0L09j62k92K55M4j75j29K32
$$ y = [192, 150, 79, 170, -298, 190, 119, -92, -42, -60, -195, -128, 172, -27, -99, 64, -86, 113, -64, -3, -75, -34, -67, -63, 57, 98, -131, 46, 96, -155, -124, -212, -169, 235, 151, 277, -12, -85, 84, -110, 125, 70, -136, -99, -47, -276, 148, 35, -168, -57, 35, 76, -195, 433, 229, 144, 141, -213, 148, -347, -44, -48, -291, 9, 84, 75, -65, 38, 106, -8, -80, -43, -191, -204, 131, -320, -135, 291, 201, -193, 437, -7, -237, -179, -118, -169, 84, -163, 236, 122, 142, -158, 3, 386, 58, 43, -41, 19, 268, 329, 134, -51, 11, -238, 204, -276, 319, 158, -133, 257, -82, 233, 240, -265, 166, -30, 65, -288, -54, 34, 120, -72, -201, 141, 108, 350, 46, -29, 370, -161, -15, 140, 1, -78, -27, 15, 79, 47, -2, 115, 247, -135, 274, 125, -78, 222, 139, 67, -129, -80, 144, -42, 101, 369, 35, 166, 112, -119, 30, -88, 26, -40, 222, 33, -103, 85, 182, 16, 152, -132, 173, -5, 137, 94, 68, 16, -14, 295, 133, -159, 96, 140, -35, -164, 68]
5033F8m9j50K15K89n11j2N1l1J64O9K1O2J8l27K42L9l22J76n7J50j92J35p0k12
5057b34M08Kk72J6J10j62r3N45m38J71j30O6K93m20K95k73k3K55k23J88j19k01
5079b39R7J53O0L2j41M8j07L06p1k58L09k88K09J07j37K96k19k56J43R8n8j27
5101d3J65j38o0o9J10r4m4K62l2R8k0j89J38J45j4m29J71J18j4N4j13j49K61o7
5125D7k38K87p5O8j55k7J00J83r8K4r9j43K75j5m5j64J85o6k94J98J72K0j76K43
5149B07j66k79L02P3N4n5J07j89l70L51J17l06K12k36J61j61l7L16r7o3M8K43
5171B32n5m56L21mP7j24k10J7K58P2j35k44L5L7OJ49Q5l22K74j05j14J3J20rq0
5196a62K45n7p3J72p9R4j80j2l22M96j33n1K8m3K0O6R5k05m2J18r4K1J91m39O12
$$ y = [68, 19, -131, 84, 373, -138, -150, -99, -130, 34, 103, 124, 186, 204, -123, 119, 158, -164, 12, -45, 105, -87, 48, -22, -234, 174, 176, -96, -80, 30, -132, -225, 320, -118, 53, -77, -11, 282, -138, 157, -116, -139, 116, -107, 81, -38, -239, -142, 11, 71, 103, -38, 10, -97, 209, 138, -120, 189, -99, 110, 217, 80, 376, 157, -99, 44, 142, 84, -43, 122, -16, -76, -145, -35, -129, -173, 89, 57, 155, 135, -54, 84, 229, 215, -214, -43, 75, 61, 115, 2, -147, 114, 47, -191, 96, 21, 89, -66, -93, 7, 190, 92, 116, 17, -126, 149, 134, 89, -75, 110, 44, -250, -52, 120, 140, -36, 207, 41, -238, 64, 137, 191, 136, 243, 54, -316, 35, 152, -154, 58, -178, -17, -178, -215, 101, 4, -59, -11, 232, 177, -279, 42, 38, 115, -9, -219, -202, 56, 128, -7, -251, -216, -179, -173, -24, 61, -261, 13, -92, -206, -193, -73, -82, -162, 83, 26, -47, 125, 46, 140, -40, -52, -374, 122, -11, -62, -34, -77, -57, 9, 104, -101, -143, -25, -119, -98, 93, -346, 266]
5221B66j46j72p7K08k37M0K35j83j60L29r6j00R6k6J72j07L8J64l45J46K23l47
5243g9J15r9J95o6o1Q2j41J57oj34J60j91j35M70l60L7L26k98m7p9J95k26J46
5266c9j22K02p2K42k94m9L3Q4O7o4J07P5o8L25n22K17j13j99J21k24J86O8J87
5289A48m23n7L64j42j72M04N2j74o1L2J81p0k75N00j94J48l58N2j98r6O71k18
5311A14j49K28l80J69J99k70J2N9k2j5N0K24k05J41l05nK93j81R6o9p7N3k76M08
5335I2P8k53k06L40M2J40j00l59J49J94J61l25j94j00K00K08nl7M07n88K09J2
5357F5m7L47k44o0k96J84J68k60J3K44J2m6M8j76k48J95j33Q0M01k22j99K12P7
5380A15j38m0n0N0J40ll8k15K81j70Q4k36L39m06P5N2K55R1j78j61K78o17N63
$$ y = [266, 120, -52, -129, 79, -158, -118, 117, -66, -226, 103, 7, -93, 3, -23, 149, 42, 80, 244, -101, 45, 268, -79, 36, -63, 132, 66, 5, 87, -54, 103, 97, -37, 123, -68, -203, 267, -93, -56, 270, -28, -75, -154, 41, -185, -39, -161, 41, -31, 211, -83, -132, -99, -15, 52, -12, 95, 170, 102, 427, -95, 122, 9, -190, -69, -293, -107, -39, 148, -275, -332, 32, -110, -282, 122, 174, 0, -61, -29, 152, 82, -193, 307, 113, 261, -97, -45, -243, -339, 332, 114, -35, 193, -187, -18, 181, -89, -77, -18, -40, -55, -5, 219, 14, 155, -150, -155, 138, -43, 53, -16, -93, -40, -316, 92, 170, -83, -289, 51, 93, 233, 133, -226, -77, 117, 278, -47, -241, -341, -141, 67, 62, 25, 432, -156, 53, 65, 18, 365, 121, 61, -235, -51, 117, -143, -130, 114, 126, 80, 128, -48, -296, -101, -234, -154, 247, 25, -174, 38, 115, -23, -63, -113, -63, 77, 74, 36, -179, 102, -68, 16, -220, 119, -287, -212, -160, 95, 186, 8, -153, 125, -492, 71]
5403G1M4l57R3p4J74j82K88k33J29j28L20j92M44k30j9m9J39ql53M87l67M3j77
5426a37L91k64J94O2k20o9J79r0J56l2k04k9K18lk80j6j83L14K73l26O7K24j86
5449C9j05J56j02L06K2k52q0J61j29l4R4k88Q3n9MM14m2k23L24l36J2K43j73j99
5473a64L31l22J44j09J67l00J21qL9k12L27q3J89n89N71k8K30l99j1o3L43j15
5495E9l0o7J23J87m42J17n5m0J16K64r5k27K35j86n2K66l03J15k3K8N4J24m31
5518b63K83Q5J01j42RJ6k11J89k89J58P9P5l32L93j17K99j74n7r5j64L03j70L0
5541Fo1O7J62l2k44N0K70j14Rk80N1J06J25M0k65K8k36K07J7J07j65K62q4J6j17
5566g5K4N5O7m91N81n4k81R2K34pj9j32r2L5o3J37k5j98J54l59N44j98m9L01l32
$$ y = [71, 115, -242, -149, -223, -49, -231, 57, -176, -47, -175, 145, -47, 397, 167, 148, 99, 238, 230, -123, 364, -3, 40, -137, 254, -10, 184, 246, 26, -43, 136, 46, 202, 170, -34, -63, 155, 152, -128, -144, -327, -13, 260, -66, 1, 225, 39, -66, 90, -12, 294, 316, 64, -16, 145, 16, -18, 76, -212, -129, -188, -184, 230, 188, -35, 289, -47, -35, 208, 35, -164, 167, -155, -11, -120, 47, -253, -132, -140, -101, -313, 14, -69, 120, -469, 102, 74, 304, -95, -106, -169, 174, 59, 29, -38, 85, 272, -170, -53, -108, -148, -32, 232, 137, -90, 145, -41, -93, 173, -130, -15, -38, -10, 44, 168, -263, 20, 105, 206, 64, 73, 89, -122, 67, -222, -64, 15, 90, -242, 151, 34, 333, 159, 102, 7, -157, 146, -24, 6, -55, 12, 174, 142, -102, -52, 218, 104, 113, -167, -116, -10, 115, 155, -110, -82, -318, -111, -94, 13, -152, 110, 26, 42, -75, -51, 4, 71, -420, 161, 107, -174, -82, 152, 145, 126, -6, -98, -63, -126, 11, -14, -212, -58, -417, 127, -71, -120, 181, -151]
5591a51N4J21p7l0K19J52j67k84j39L87j26K46l80L18p0k80m3K65j19L61m7J48
5613C58m46J36n7k9k82M87l2l54n9K04ML35k04j83M00m48J32J9K88k13p1q1P7
5636a9o9j68M7J35J25p3J00K67l51K17l97L7J88O3q8j49j73K90K1P6Q2o93M36
5659i6K08k02M3L9pm02N10M2J67n7m65K51j0P8j54K44j34j55J71R7k4j51k81Q18
5683E30n56k7Ko2R8rR1O5o7N0k0l17M51k83m5j81K69N7R5l28L56l92K33J19j03
5708B6o3N6lj18L90l94K30l0j77J4J14N5J8R1m98M00j32M1j83j00L54j72K84j56
5732D7lp1M7J37j21K20n36J67NJ61k11K49k43K61J82m91J08K31J60n07L8Rk28
5755c89K86j9P7L1k00oQ1n4K90m9J36J34l47q5K15J24k82O1L6l24L35j19q4K36
$$ y = [-151, -97, 24, -53, -83, 136, 288, 121, -163, -302, 85, -41, 205, -175, 143, 73, -207, -250, 15, -104, 257, 210, 358, -88, 48, -9, -38, -320, 167, 135, -219, -278, -74, -70, 265, 61, -122, 278, -170, -38, -19, 269, 56, -15, -96, -19, -88, -256, -209, -74, 51, -22, 78, 345, -6, 211, -186, -149, 39, 102, 14, -135, -308, -18, 3, 79, 161, -532, -96, 112, -90, -47, -8, -15, -417, 93, 135, 302, 245, -220, 31, 21, 99, -55, 189, 55, -100, 71, 168, 144, -7, -288, 530, -26, -53, -51, -113, -15, -24, 67, 132, 65, 115, 95, -222, 229, -54, -99, -280, -11, 46, 141, -187, 169, -223, 10, 129, 26, -37, 19, 16, -102, 288, -106, 124, 94, -83, -69, 45, 100, 118, 209, -289, 111, -21, 20, -163, -263, 91, -81, 203, 47, 44, -27, 20, 157, 36, 256, -280, -113, -108, 53, -158, 91, -152, 109, 291, -200, -92, 139, 299, -208, -170, -161, -389, -103, -122, -45, -14, -214, -220, -139, -193, 97, 48, 184, 318, -29, -114, 101, 225, -57, 4, 40, -284, 51, -68, -152, 84]
5779H4J31j17j01L9l3J52m35K84K22j87J08k83J47K90l73n5O2L29l0j96k93L80
5801A25k29L98j91j48KL5j58L95j49M36n05l05J61L56j60L3j69J49K33m40M65
5822C34m17K5j33J85j8K1J18n9l16O7N4J47j43L25j86J26j01J74j71j35j27J37
5844i3j70L4J45n4K14n4j23J96p8m2R8k05J40Q4k07N7R3J61pp1m67K69r1L16j06
5869C9J17L04k92m9j12N45l50k77J24R0k10j92J34N16n10J34j63l17L84M37j7
5890C35l20J21j53j12N5k30K53J58l06J40J35p3L1J29q6k83K58k45K9K04r2J20
5912F8j3M0J56o3j40k84L47L6j02m1k81J16J18J17Q3k35j06K52l01J27M61n23
5934a68J9M99m05J40K07m68J50l0j00J42P2l20J36L0m1J96Kk43L02k5l65M98j83
$$ y = [84, 215, 98, -3, 36, 3, 155, -280, 4, 226, 39, 147, -136, 11, 301, -72, -127, -65, 264, 234, 38, -255, 125, -104, 294, 103, -45, -43, -8, -166, 229, 80, 516, 11, -294, -133, 223, 63, 96, -73, 76, 309, -131, 334, -83, -58, -191, -6, -24, -3, 115, 56, -260, -193, -139, 8, -135, 190, 4, 130, 29, 203, 32, -103, -230, -93, -263, -229, -84, -138, 76, 22, -101, 95, 17, -25, 73, -132, 8, 92, -115, -58, 35, 196, 189, 118, -349, -80, -171, 145, 39, 156, 460, 168, 119, 7, 552, 202, -75, 49, 139, -71, -263, -129, 387, -123, 11, -152, -469, -85, 352, 335, 15, 136, -17, -129, -74, -304, -51, 107, -199, -59, 76, 3, 34, 163, 77, -206, 52, -193, -164, 40, -52, 68, 55, 95, 251, 188, 48, -236, 111, 147, 45, 4, -277, -161, -43, 74, 157, -78, -184, 68, -233, -106, 355, -168, -149, 350, -55, 85, 292, -176, -26, -56, -156, -14, 58, -262, -126, -96, -137, 59, 61, -182, 120, 95, -270, 228, 45]
5957D5j3J25j57M0j26J40K25M3k18l88K14l8k04K77lk70K26P2qr6P7R4k06l16
5981d65L51J62l9k66K37n9J93j61K02j26k29pL45l48P0J46k93K12J91M1j28j04
6003g5J11K42n00L32R9j62k73M64k46J13l09K60J17m28L59M7j06R9Nm06M01j61
6025a7p8M9K79j29l32J00J45j39K33M0k16n8J12K47j98k7L4J49j71p2O6N0M4q0
6049C1l0r7R1P4m20N59No4Q1K2L1m27N37j66l69j16K64N3j27l3L4J06J71K23m46
6074a3Mn1K8j64j29N16j98J04l23M31j03k90J43J81j54K19j48j26J06P0j34K4
6096gK14l2j71P8k16J23m5O5J31l11K71K04n95M84j78O8j85p8J13K95k60J47j58
6119d3j45j17J98k90J71K25k26K15j3j19N9j00J67o1n6J01P9R5Mk48O7J10k94
$$ y = [45, 32, 157, 0, 40, -86, 54, 279, 322, 104, -284, -70, -108, -312, -35, -38, -308, -82, -10, -18, -114, -37, 57, -149, -465, -114, 48, 9, -257, -20, -79, 114, -47, 155, 29, -200, -207, 138, -210, -140, 6, -287, -75, 116, 157, 29, -75, 36, 278, -222, 110, 209, 47, -226, 238, -8, 105, -204, 56, 173, -255, 104, 151, 45, 144, 149, -257, 144, -17, -95, -46, 233, 104, -228, -128, 17, -122, 111, 151, -65, -123, -11, 236, 38, 11, 45, 194, 23, -49, 17, 67, 111, 31, 1, -96, -5, 69, -351, 208, 213, 149, 230, 252, 283, -144, 393, 227, -142, -258, 6, 59, -68, -101, -67, 39, 210, 433, -13, -9, -60, -32, -196, -325, 191, -7, 97, -226, 205, 102, -188, -45, 136, -18, 201, 53, -73, 33, 103, -31, -7, 207, 175, 4, 82, -134, -11, -56, 9, 140, -171, 100, 304, -291, 193, 15, 83, -102, -180, -67, 228, -32, 115, -43, -188, -305, -107, -397, -226, -1, -227, -12, -25, -144, -85, -185, -18, -79, -135, -34, 45, 140, 144, -104, -37, 73, -221]
6142b21L40l34J94m3P6j01l37N92J07j28m5n8J84k71K65k62L8J58l60J63j13L30
6164A74L7m70M00k78nL23j10J4l47M21Qj31N6k49K20j03j1K47l3L7Rm34L54R4
6188B23k45J73j22p5M2j8J94k3k46J24l79L35o7J3K02j44K8J5l43M34j03j22L11
6211B07j92j58l0k11L72K6Nl1J24k40l0L53k96J01k26J69j30J22Q4M3R5k72K23
6234A08k51K8J13j35J10K98n49M31P1l30RP0J89m7J96l75j68K57l05K32j2j47
6256b07O9J02lj31K18p4j13J04l3J87j70J02J07j53NP8j59j12J01j7j24K34K26
6279B37n81N91m80R0K78k92K51j76L62l95j17J82n7M7J68l25J04K01j02M6l1R5
6301I6Q3l82J51R3rJ09N9j02n4j48K57j13Q4k57M14j54o3l04J12L02k79L49k91
$$ y = [-221, 119, -215, -21, -64, 12, -89, -426, 166, 273, 145, 100, 42, 226, -45, 220, -42, -4, 154, -206, -43, -156, 174, 211, -259, 141, -137, -142, 181, 71, 85, -262, 159, 167, 36, 92, -157, 63, -40, -51, 196, 163, 200, 209, -225, 129, 223, -22, 151, 29, -46, -4, -22, 172, 149, -97, 27, -352, -17, -84, -71, 131, -13, 15, 30, -313, 121, 18, -104, 207, 15, -143, -173, -384, -12, 14, 19, -12, 112, -128, -158, 195, -101, 0, -226, -57, -187, -65, 19, 62, 157, -115, 108, -143, -115, -2, -137, -27, 271, -278, 153, 224, -106, -97, -27, 162, 115, 311, -64, -232, 25, -280, -48, -60, -207, -138, -36, -39, -170, 48, -26, -139, -35, -68, 119, -51, 51, 158, 5, 10, 88, -71, -183, -82, -99, -223, 11, 237, -344, 247, -233, -143, 135, -157, 94, -82, 280, -115, -232, -50, -107, -60, 108, -217, -113, 88, -14, 32, 1, 96, 179, -203, -52, 41, 32, 141, 200, 98, 44, -104, 153, 40, 124, -133, 281, 127, 64, -240, -128, 174, -105, 244, -47]
6324d7J21qp4J57k42M7J0M7n1o6j72K38k83K87J65r5j46MJ29J79k43K3J43j08
6348A5l59R5J89jj47K05m6K07j12l17K09J15k5N2j78j4J66k17J25K02l21L57l97
6371a97J49J9j03J64j12P4j42K54n4n2r4M91l94K66j67j85J18j53K20l72L25k55
6393b00K58j73M50n78J85K79o93L27N11l81M0L1l30M54R5j99J0j78L2j90L64k1
6415I3k73M32k13l5K6k60j17M67p3P5j70j45J29J07J16jJ56l95K0J48mk37p5L89
6439A60j33l0m6n1J56m42N57l17K40J2k69J25q9j4K62l4j88K0N9J9o8R9n6J42
6463A14p3L5k55J83K80l62q9J59o1lk5M22l50K70m15K82J17j68J6J49r8j03m0
6486a5M15o57K32K27Q5k54J2j20L9m6j31L21M4j62l7J01j21l08Q8J77L85l04j00
$$ y = [-47, 74, 66, -8, 149, -93, -46, -36, 11, -40, -106, -278, -40, -323, -36, 129, 34, -112, -108, 21, 200, -43, -20, 123, 15, -344, -249, -60, -61, -208, -3, -49, 158, 46, -271, -62, 53, 28, 80, -98, -112, 54, -163, -38, 164, -157, 200, -197, -48, -29, -132, 32, -80, -6, -148, 106, 52, 0, -94, 397, 3, 269, 102, -83, 35, -118, 102, -270, 55, -200, 58, -115, 335, -243, -58, 221, -472, -145, 366, -15, 25, 56, -274, 180, 275, 76, 86, -92, -60, -250, 114, 93, -180, 252, 39, 4, 30, -230, -347, 120, 47, 122, -48, -193, -64, 43, 159, 158, 314, -81, -61, 87, 83, -154, -229, 160, 27, -3, -49, -100, 56, -386, 171, -146, 94, 106, -163, -38, -127, -141, 121, 87, -101, -81, -22, -3, -71, 28, -28, 114, 41, 76, -179, 4, 284, -78, -167, -8, -69, -72, -97, 325, -25, 245, -170, 112, 229, 61, 77, 226, 128, 25, -15, 400, -257, -25, 202, 287, 33, 45, -75, -36, -82, -213, 108, 152, -10, -47, 54, -67, -375, -287, -110, 275, -29, -129]
6509a29L3K13m6K6J71k07l16L03l78J11L30j40N9M5l12L88Q9l60J26k11K88o7
6531A6K69R9l20kqj09K40l3j61j71J57l01K46j50N34j57k22Q1l2J34j66J90j21
6554A3K65m66N00j79j52M3j67M9K12l76M55l48N19j62l23J06K4M8J91k34k76K79
6576B1pn7P7j84L30j71O9k44K16K15k41M2L3J13l58N27n70J25k6q6O8N5j65O12
6600C94k77k04j02K43j65L1K63j21m5K31j36k94K95j1j96j62L04j30k4L84q7K4
6622B15k89j2j2K00J86l12j74L52m4o8q8j9R3Oj94J09J9M4m3m2k6j87N20m86R0
6647a62L71l31J85ok72K19P3j3L0q8K16n7J54k10qk57K20Q1p0l70M15j64K10l73
6671b07L77j16k46M90m40O3l57L71j70J29k44J58K55j76J24R8j60O7M11l91rj38
$$ y = [-129, -96, 117, 71, 97, 268, 61, -255, 48, -330, -219, 111, -29, 30, 75, -237, 151, 240, -120, 6, -205, 83, 16, 285, 384, 64, 62, 54, -55, 185, 152, -9, -180, -23, -324, -78, -228, 306, 149, -73, 8, -24, 110, -56, 134, 13, 278, -188, 312, 133, -19, 24, -143, -94, 118, -258, 197, -151, 368, 206, -117, -11, 13, 61, 252, 18, -258, 21, 14, -43, 34, -150, 180, 9, 78, -166, 50, 265, 24, 66, 99, 212, -146, 381, -189, -64, -90, -176, -108, -53, -218, 394, 117, -87, -189, 54, -111, -80, 183, 62, 17, 248, 112, -182, 113, 102, -94, -256, 48, -82, -106, 278, 191, 215, -74, -86, -98, 102, 288, -24, -198, 154, 110, 42, -46, -65, 28, 34, -160, -51, -32, 12, -31, -73, -99, -286, 234, -252, -162, 209, -122, 63, 57, -215, 4, 77, 64, 94, 6, 222, 165, 319, 109, 101, -156, 64, 145, 75, -295, 120, -44, 166, -207, 170, 54, -192, 298, -142, -79, -436, -65, -235, -106, -350, -192, 63, -113, 11, 109, -51, 16, 427, 36, 27, -111]
6693a11K04j18o0J23k32L31o4k33O9L06k49k7L62k36j50k76K40K67L4J3k56J07
6715D4J40j58l1O7j19M9R1q9k4j02J14J07k90L13K7n7K6j24j74K20J82q6q4j61
6739a19rm0J15p4K03k67L23j44M1p8K22m28K92K1N1m8R6k43K86j52j15K06j73
6762c4J46j22N9l85M39q5l2K61j53J30l25M56m15j54J99p0L34n2p4j07l4K47j84
6785D5j0j68P2Q3P6k59j19K69J22kk37Q6j60L76l19K3L37l51K57J01n36K44K47
6808A77J11l59R1j6j58K41k83o0J15J50K16Qn04L63J23j45j03K04J03l44L62k34
6830E8J52k78n2J27L3l00M94k28j40r4K21j37j65J90N2J73l23M21J16l11l4p8
6852a03N5k7K53l30J80j26J45p0l6j37l5J16J04K19n08L20j19oJ85k63L60k43
$$ y = [-111, 93, -25, -85, 38, -194, 137, 73, -160, -91, 215, -34, -61, 301, 65, -85, -361, -121, 146, 180, 193, -63, 44, 184, 26, -5, 62, -57, -8, 83, -6, -30, -132, -18, 89, -201, 112, 139, 82, 108, -16, -190, 30, 212, 126, 42, -119, -128, -168, -53, -127, 76, -191, 132, -12, 29, -49, 173, -255, 37, 58, 109, 61, 157, -86, 200, 48, -67, 139, -34, 112, -10, 49, -336, 103, 18, -14, 247, 94, 224, -101, 355, -60, -214, -15, -85, 249, 197, 123, 16, -18, 229, 45, 35, -133, -61, 22, 98, -161, -280, -11, 111, 109, -128, -42, -202, 174, -145, -122, 215, -136, 121, 222, -314, -70, 177, 288, -71, 20, 4, -154, 87, -196, -256, -141, 9, 225, 233, -271, 92, 215, 70, -33, 171, 274, -70, 292, 58, 210, -68, -120, 7, 40, -260, 234, 6, -134, -228, -7, -144, -309, -119, -67, 106, -217, 204, 320, 9, -25, -103, -48, -75, 178, -152, 28, -98, 47, -23, -59, -196, -231, -115, -11, 208, -300, 20, -99, -105, 80, -183, 177, -66]
6874f6m7L09K4k95k68O88k75R6k05J88Kj97Q7k27J67k3J37j67o4J80P2J82n52
6897b54J71K6k65J55J27Kk49N88l44j7J17o8k8M0K74p05L83M7j7L5j80N1K93k36
6921e4K01j1k96J07Q3j2M5j19J12K63l63j50K56j95J35kj29J46j47M04k28j84
6943a38J55j5J01P7j99j18L87j96m5k29J38J93L0K1r8k61J93L94l08j64n1Q4J13
6966F4J76m56O6M5M9K93k89K57m94K42K25l28K14j95J01k9O5K33k20j51J54p5
6988e3L04l26k64N36q7j65O0k74n2J68K97m2j29J76k9j27k2j51M12m02m5O2R1
7011f2N6J87J48j84J7l43J79o7L61k91J47l82L55Jj99J64j12k59M99l90K12oO7
7034I8O3m14L60J01l38L20Jm62J86M2k19L93om8k40J07J66P3k43%P8k42J34m3
$$ y = [-66, -113, 196, 220, -75, -343, 345, 70, 166, -39, 149, 151, -46, 41, -186, -19, -42, 95, -72, -136, 44, 116, 298, -254, -83, -57, -322, -167, -40, -38, -287, 301, -43, -60, 57, -11, -39, 1, 275, -430, -47, 0, -17, 18, -162, -111, 182, -54, 147, 136, -160, -53, 30, 18, 63, -56, 56, 319, -44, -194, 62, -133, 2, 0, -129, 17, -130, 274, 46, -138, 17, 2, 103, 180, -19, -137, 250, 54, 9, -220, -82, 111, 141, 162, 64, -197, -4, 390, 82, -82, -133, -49, 64, 240, -216, -150, -105, -56, 237, -52, 205, -289, -47, 178, -150, 64, -131, -30, -59, 6, 239, 19, -132, 22, -53, 251, -75, -339, 197, 110, -55, 5, -269, -321, -153, 144, 102, -27, 149, 120, -7, -29, -180, 232, -170, -215, -153, -62, -6, 181, 329, 145, 162, -181, -2, -69, 292, 1, 148, -234, 121, 122, -77, 87, -25, -284, 215, -175, 37, 31, 98, 161, -253, 107, 208, -130, 190, 191, -271, -85, -43, -262, 131, 125, 77, -163, -56, 110, 183, -60, -60, 18, -224, -90, -133]
7058a33L19k51K45j63M8j69K73k24k9o7K40m9m88L32k32J46L08l66L09m8p0K40
7080A71N0k0m21M37m06M2J21O6M4J08n3Q9j86j85L50j87K91m82K30k93J27N70
7102D63o04o8L12j21J5J55k86J80J84j5n82J64K15P3r7j38L56l9l04K69J22J57
7124D11m51J42j83K61k18Q8J08L0k60j37P6J36l9o2J69K96o19K31k87L59j46N8
7146c7L09o0l93Q5P0j49L25J48m46R5N2q3K84j79k88J1K22Q7k02L82j48j73q3
7169a71K50q0j75P3K31j67N6p8J90j6J96j76k11J07l20M47j31o4K9P7j93K52m03
7192b77K47Oj19K68l8j05J7L11l71M8J61r3k5j11J9J27o9Q0j39J43p6J5Ol42J71
7217a46K35j68j8k01K30J59J29j43J35k41j9l6MK85j77M6M0J85l59q2J21J11K0
$$ y = [-133, 186, -65, 180, 17, 65, -104, 169, -55, -84, -151, 89, 40, -448, -116, -348, -202, 106, -260, 49, 1, -69, 171, 221, 201, -220, 217, -189, -147, -26, 40, 84, 192, 139, 228, 42, -143, 207, 20, 311, -171, 59, -234, -107, 463, -141, -209, 103, -18, -3, 152, -134, 46, 230, 215, -367, -203, 12, 85, -12, -150, 206, 167, -137, 132, 254, 411, -40, 102, -81, 180, -38, 50, 158, 188, -72, -209, -133, 3, -36, -98, 71, 367, -252, -21, -308, 51, -95, -37, 272, 212, -181, -96, -26, -175, 150, 298, -148, -53, -1, -84, 200, 21, -267, -256, -34, 53, -149, 233, 85, -88, -171, 79, -1, -176, -103, 128, -39, 17, -61, 129, 113, 309, 133, -78, 29, -291, 156, 25, -39, -10, 67, -126, 126, -277, -30, -24, -143, 125, 87, -18, -1, 310, -61, -13, 148, 55, 30, -81, -62, 65, -4, 76, -63, 80, 4, 19, 25, -317, -146, 89, -79, -97, -298, -68, 91, 220, 77, 212, -29, -48, -84, -80, 205, 28, 74, 114, 299, -60, -142, -21, 90, 110]
7240A10J06R0m93qJ12L79k10k67J49J44mj91J40J4p9N6o4m44K97K29K8r9J54q0
7264F9O6j96K59l93J49O4J08r4l09J59L85j64k74J77n97M56K53R3k04R1n5j62
7286a19J30j34J84l2k82J20j67M7M14j91K85k63j19J97k38J89N8m8R7n8j66O5
7308c1k3K62Nl94K08j79j3L94k85R3J33k08J42q9j95K64k89K40l63L89m1q3K42
7331A79j42N7M3k22M3j60J40J26n6L7j54M29mk63k40L2K22J06k98j7r4L18k64
7354a82j33N61j59k04Q4L26l97M0q8N14o04M62j49O6j16j03K53l82L69k62k3J11
7376a6r8k6j90L25L5j28K61j84K69m09K54rm9J9j01J82N5l36J13n4po9K02k41
7400b02N9K31j22R9R2k50O6J51r3J25j54J18l88J27Q6Q1J71j87m1K25m77L27N3
$$ y = [110, 216, 306, -187, -195, -83, 296, 86, -181, -32, 112, 108, -83, 57, 71, -8, 48, -16, -460, -163, 66, 94, -5, 149, 69, 135, -61, 198, -195, -46, 18, 126, 32, -277, -118, 267, 103, -171, 6, -591, -135, 118, 211, 7, 98, 43, -119, 11, -123, 61, 29, -253, -133, -300, -253, 161, -30, 255, -8, -127, 70, -168, 21, 79, 31, 128, 70, -96, -31, -54, 208, 213, -181, 27, -152, -165, 229, -56, 37, 170, -38, 104, 15, -180, 84, -205, 35, -328, 61, 20, -63, 179, 37, 94, 137, -85, -42, -202, -62, 64, 8, 45, -109, 320, 316, 53, -187, -155, 67, 173, -125, -142, -236, 82, -182, -315, 246, 87, -117, -33, 293, -104, -64, -152, 362, -242, 220, 71, 137, 21, -82, 171, -211, 158, -104, -127, -16, -114, -140, -330, -5, 30, -98, 163, -21, 248, -161, 93, 84, 35, 54, -47, 135, 190, -146, -33, -87, -94, -163, 39, -202, -143, 88, -34, 65, 157, -93, -27, 124, 31, 156, 2, 120, -268, -141, -55, 26, 197, 10, -31, 194, -283, 44, 97]
7423I7k11M0q5J89p5J80j8k8K1l01JL54L6j16k82p5L64K03k96K09k35l02M50k82
7447a62N0J00j75K62j39q7K20N0j31K72j40k07L18j36J02k51J48j38O7m9K07k80
7469i9J00R0m04N42k38K55m19K65k01N0J58j88n5L12l32M50k22lJ48o0r5j98J13
7492c1O5M9r6p6J13N05m13m0k51J14J0q0J35N5O8L9j66j4K66m20O2J09k16L07
7516I4Q0j93J65j28M3j70J2l9K52qo6l0j46J83j83m8L47n35J46J28P0j1l83N16
7540I6l6nj69L14k96Q7L21l07L09l28K00j10O1k92L01l94J73L18l05K87j98J82
7562B09k63K80j77O6o4k23M82j22j15q9N4j11N5mj30K85J08k95K18j35j8r5l8
7585a22L31m91J27K58J1n9j21J4j62M39j09j90J75J24k48Q8o3J76n2J14j91J39
$$ y = [97, -114, -74, -159, 30, -45, 135, 117, 89, 110, -191, -190, 164, 200, 84, -198, -273, 91, 294, -2, 207, -28, -330, 120, -162, -112, -12, -187, 75, -64, -151, 69, 119, -12, 260, 120, -87, 231, 95, 197, -54, 94, -44, 23, -26, 181, -99, 1, 91, -313, 229, -9, 246, -173, 92, -109, -59, 99, -89, -144, 168, -164, 286, 64, 61, 209, 149, 54, -144, -31, 34, 83, -13, -89, 24, 529, 116, 76, -175, -61, -51, -131, 4, 59, 127, 166, 0, -14, 252, -168, -106, 3, -213, 94, 174, -19, 146, 18, 61, -109, -97, -136, 116, 108, 42, 12, -134, 49, -134, -182, 165, -370, -224, -96, -26, -37, -420, 96, 60, 55, -114, 200, -96, -9, 312, 5, 314, -14, 186, 76, 137, -155, 146, -248, -75, 243, -62, 225, 27, 209, -54, 226, 49, 115, 51, -172, 310, 188, 73, -16, 38, -73, -18, -22, -152, 133, 241, -54, 164, 29, 11, -84, -122, 209, -282, -155, 103, 114, 55, -66, -52, -214, 225, 116, -74, 101, 225, -23, 65, 2, 178, 126, 240, 49, 188]
7607A88L3k36N8%J41l20l5J12J36n7J22k18K54j35kL8j0Q1j44K78l81L11o8m16
7631b70L33k05P4m3M7N60n22L34k25K4j23m7JR9l9q3m7K69k1l5K82m93n5L65j47
7656C3j91J52p9JQJ4J16J28j20n6J19j44P2j30L5J74q2k29K96o8Qj74N6Q7j91
7681a65r2o1M16l5l55L79k08j6K79j17j66J93n0J76j52K99l57L54k26q9k0n3L89
7704C23k45k34L65k32R3k8Q7l51K22R1j2k65J42r6J13K47n5K18m12p3j78ML97
7727A21j57j61K45q3J94k67K72j69n6J01K84k86K5J90j35k9k84J81qj73R8pJ92
7750H8j8j63P2J27k32K04l96K87K1j69j6L68k29K50rr6l46J91p5j37J81L59q0
7773A82k27j01J67Q2M6J22m88K5M58q6o6p9J9m6k25M4k43M04k4M7k82K60k5M4
$$ y = [188, 221, -15, 43, 43, 184, -136, -171, -59, 77, 20, 142, -76, 178, 43, 41, 79, 69, 150, 6, 284, -97, 214, 146, -270, 63, -142, -68, -111, -64, 496, -26, 308, 83, 107, -16, -63, -62, 37, -2, -85, -132, 137, 116, 81, 363, -130, -185, 180, 33, -158, -6, -85, -84, -76, -62, 54, 182, 62, 6, 125, -19, 53, -77, -42, 132, 50, -179, 117, 49, 57, -117, -61, 26, -165, -257, -318, 98, 63, -292, 87, -121, -137, 142, 25, -141, 52, 2, 178, 26, 325, -32, 322, 96, 7, -13, -66, 323, 78, -156, 209, -23, 70, 42, 129, -222, 0, 91, 79, -186, -44, -140, -27, 220, 165, 383, -29, -102, -280, -276, 121, -36, -197, 48, -35, 159, -108, 164, -5, -61, 40, 324, 38, 63, 253, 118, 89, -195, -14, -22, -195, -97, -104, 88, 70, -93, -21, 106, -126, 78, -318, -31, -10, -179, -195, 173, -56, 194, 185, 89, -257, -66, -141, -278, -97, 262, 182, -45, -146, 21, 103, 149, 271, -217, -192, 266, 180, 114, 35, 54, 8, -217, -173, -416, -12, -36, 11, -271, -11, -36, 8]
7797Hk05L04k67m5K39l57K19J61N5j3o2j0o2M3l5j25J08J22n25O84M4m82K13R1
7821A03l8k0j18J15J74n54N10k02K18k68L77l67L23k94J5m1j03M08j92J27k2j31
7843B0J09j05O6r0K54r3m68N29j84K6M8j67q4J36J80l13L15l74M5K63j10k55K43
7866ij68j08M46j67K07l50L37j78m79L27M0L84j57j20j88N19j63o4j25j46J48
7887a4M20l81k77O12l72p3K16j04J57J12L4m69M07k60r3P0J06j40J30j19J74k30
7909i4J71j25q7K15k02j52J93J21J16l02J99l4r5k4J40r6R4L3j82j15J5L12J52
7932B53k70m1J05j25K97L5l43r3M04J27k30j00l5K07j88l3o7L60l58J49J8q4o6
7955g8o4J25K17%k38J12k52K6J62j68J02l3K85K26l87NL4K03j03j51j26K25l26
$$ y = [8, -197, 107, -160, -205, 34, -323, -104, 57, 112, 99, 37, 27, -35, 8, -27, -152, -44, 78, -447, 237, 281, -201, 12, 103, 65, 45, -73, 42, 216, -338, 172, -30, 188, -80, 297, -70, 253, -41, -26, -67, -170, 238, 46, 173, 151, 20, 129, 24, 90, 0, 254, 161, -307, 222, 38, 64, 112, -55, -139, -3, 177, -136, 179, -195, -150, 113, 3, -252, -9, -177, -285, 161, -6, 201, -149, 188, 10, -469, -142, -102, 282, 125, 5, -183, 336, 173, 109, -16, -162, -14, 406, 25, -252, 360, -12, -85, 131, 27, 184, 296, 330, -139, 268, 8, -85, -15, 91, -49, 81, -38, 136, -94, 77, -48, -135, 80, -122, -274, -81, 40, 156, -146, 53, 19, -76, -100, 40, -56, 38, 71, -111, -226, -211, 101, 253, -17, -58, 47, -78, 219, 254, -89, -182, 222, 349, 119, 19, -16, 191, 3, -30, -97, 263, -95, 54, 72, -12, -78, -142, -17, 200, 200, -38, 74, -178, -152, 10, -158, -56, -89, 196, 422, 35, 40, 74, 277, 174, 23, -103, 122, -204]
7978b04K23K43R2l43R0k72k8K66k29K04N6q2l63N32k88L27k46O2j39J99r0M4j03
8001d9J60N8m2o5k44L2L48q4j86l5N2j12L80n1r3j36K87l48J18l53K45k0JM1M7
8026d9K1j37L77j15j93L17j4k99K58p5o7m53J85J4J41j48M86k4l10M9J15j26k0
8049f7P0k96M59l38O8L63l07K34k78K80L2l08M99j40n83M32j37n26N50J68O6K
8071B43j93k75J62K62l87L21l60J98j80O8j30K99K96n0k19k75N68k02j81J76k65
8092a24M37J23m07j88J45J49k03N9k41M29j84J53k72J60K9J35k22j21K44k4j34
8113e7j47M42m93K37j13J16j79L65l3j41j15J57Q1o6l32P2O2Q0J83k77L86k96
8135f8k91M80Q6p3k60o3K8L44l0k52j35K72n0K9j84n3J80J06j74K23j26k13M86
$$ y = [-204, 19, 262, 354, 11, 101, -171, -199, 67, -162, 42, 98, 16, -347, 185, -103, 224, -22, 40, -99, 100, 10, 54, -49, 111, 169, 127, 62, -182, -150, 198, 114, -72, -107, -55, -167, 213, 162, 69, -67, 220, -128, -10, -363, -118, -138, -137, -96, -49, -28, -165, 212, 97, -96, 221, 207, -92, 166, 91, 24, -429, -244, -230, -89, -237, 249, 225, -85, -36, 79, -47, -67, 3, -293, 166, -172, -104, 259, -48, 186, -92, 188, 220, -88, 411, 271, -312, 120, -17, -543, 7, 175, 241, 243, 50, -225, -63, 199, -188, 133, -227, -29, -209, -141, -271, 28, 324, 274, 55, -220, 348, 146, -35, 141, -124, 313, 436, 29, -159, -14, 135, -68, -9, -250, 179, -5, 148, -124, 36, 65, 200, -22, -143, 101, 77, -57, -204, 238, -255, -18, -131, -15, -194, 171, 138, -3, -118, 39, 120, 54, -278, -206, -144, -64, 119, -158, 228, -68, -359, 121, 207, 134, -126, -189, -161, 183, 153, -99, -234, 38, -12, 17, -167, -220, -40, 66, -108, 115, -11, -224, 262]
8158B62m21j2L51l17k74M29k59R3K40k40L98m63RK26J8o0N9%r8R4P5j7j13K46
8182B26m68K85j05K10k39O9J62r7k9
$$ y = [262, -159, -171, 180, -137, -411, 18, -241, -148, 92, -148, 250, -213, -204, 22, 40, -20, 39, 39, -59, 35, 110, 93, -20, 226, -242, 43, -62, 148, -91, -22, 140, 43, 14]
8191A4
$$ Imaginary data points
##PAGE= N=2
##DATA TABLE= (X++(I..I)), XYDATA
0@%%%%%%%%%%Oj4J6j6J6j8K6l2L5m3N0n8O9p8Q9j04J20j36J54j73J97k21K46k78
34a47L10l45L86m30M78n29N85o49P17p93Q77r74J083j204J343j503J693j918K191
53A171k531K968l556M390n674P931j3047M6294j1034p3525N6128J8594m7166N499
67a3558M6599k8182k4129K0351N732j1485J1038m262q147J0656k817j8446J9306
80B656J5025k8668q216L3927m461l3836J5232L1592k6723k2701L6695J1394m2746
93b0830L151L9980j6575k6714K8335Q956l0583P195K0161j3511O87Q875j7433
106h306L474K2497k1463j0150L5871j1764l9791L3190K7393m6902m476M7538j9424
119G687l6812L3288J7897l5868m27K7426r557j4301J0264K680o836K935J568j844
$$ y = [0, 0, 0, 0, 0, 0, 0, 0, 0, 0, 0, 6, -8, 8, -8, 8, -10, 16, -16, 19, -24, 26, -32, 37, -41, 48, -56, 64, -72, 82, -91, 106, -115, 131, -147, 163, -182, 204, -226, 252, -277, 308, -341, 376, -417, 460, -514, 569, -635, 708, -795, 898, -1020, 1171, -1360, 1608, -1948, 2442, -3232, 4699, -8348, 37946, 26912, -46613, 9515, 28109, -19057, -13558, 33041, 4859, -19270, 1081, 6813, -4672, 6366, 2104, -6043, 4613, 1796, -16650, 2656, 17681, -10987, -19203, 14724, 10263, -23573, -8341, 23251, -3472, -26173, 10522, 21916, -20830, -17679, 22301, 5726, -20988, 7347, 16303, -14280, -7085, 13076, -435, 252, 9127, -8306, -4832, 17665, -3798, -13948, 21923, 10159, -29632, 3558, 30951, -15951, -20427, 27111, 7687, -29125, 4163, 22060, -13808, -14235, 13191, 3634, -10667, -403, 2277, -4559, -1624, -56, -1900]
133a900N531k719j2666P836J6401j1568j3254J8315O096k8144M520L4752j5030
146H170l0796K6882J6541l5675K070L7030j7443k6591K5301P181k3285J0037J1937
159A1359j6629L909J0009j7375M747J8734k1022q839L1277p845l1523K2747K0107
172A9656l1461l691L3445j0824k7634J7096J6898j7504m478J6167k644j4508M657
185d825J0474k836k791J564l292m31N790m484j675J2206n421j8224J4881J6231
199A7167k4660n268L0655j0450k8934K4601J7023l2502l57K9613j3558j8318K0354
212E366J497j7612J0113P164j1525N275M716j5844O969J5937j5151p193K0149
225I861n811k0710J6296J6548j9446q110J8729q64j7645Q147J6202j1440j1909
$$ y = [-1900, 3631, 912, -11754, -3918, 12483, 915, -12339, 5976, 12072, -16072, -11552, 23200, 8170, -22626, 4256, 20797, -14878, -12808, 24222, 6779, -19812, 5489, 12670, -10615, -578, 11359, -5270, -1361, 8648, -8727, -3980, 14754, -6268, -15107, 16170, 8325, -23198, -451, 19656, -11805, -15496, 17949, 7125, -20509, -3413, 13485, -4019, -8497, 7670, 5026, -9482, -4825, 5649, 2813, 22, 1586, -1706, -2137, 3653, -831, -2506, 9700, 4279, -13945, 936, 17167, -7493, -12761, 17894, 7444, -21490, 3111, 20134, -12368, -12725, 16888, 3330, -14988, 5366, 6863, -10749, -636, 6528, -4997, 278, 4994, -10850, -3881, 12056, -3095, -10288, 9861, 4050, -16660, -364, 16184, -3262, -11372, 7357, 6493, -11152, -3005, 13197, 1757, -10152]
238a0152J2403N584j2607J638J0643o450n172P222k592l320P404m502p285J4088
252F902O07k0137R892J6483k0844n482K7757q441k5428J8510J3957k2524J270
265g478K0287j2227j2963J4281K442q679O668Q54q698N761K974q006N459Q081
279H756j1610m734J3141J91j2980N431J1605r444r582J2855N781j5755m09J6261
293I507n597j3064J0824N654j3745K049J1843p346m123P323o022k919J1799m254
307A929r159J2032k78j7275J1121J5498j8323n651J9720o360j6457J5494R244
320A1535j6544q73J2083n468n167O778O81m698K104N17j838K644k13m346K692
335a13M682m291m507N306L138q122J73J1535m371j2994Q254R737j2743k075J5387
$$ y = [-10152, 2251, 7835, -4772, -3134, 7509, 1059, -4113, 3109, 517, -2803, 4601, 99, -7186, 6902, 7509, -12628, -2736, 13747, -7097, -12579, 15178, 6737, -18691, -181, 13776, -8748, -7478, 12809, 582, -12381, 1900, 4342, -4337, 2331, 3185, -5513, 248, 3222, -4784, 675, 8756, -2854, -7588, 5553, 5744, -7236, -1805, 9800, 356, -9226, 3629, 9410, -6345, -6754, 9507, 3910, -9154, 1670, 7324, -6421, -4372, 7471, 125, -3998, 3325, -2697, -5616, 6183, 1929, -7230, 4802, 4524, -12751, -1630, 13868, -4455, -10106, 9614, 3254, -13203, 2291, 11535, -5009, -5882, 6201, 733, -4434, 2344, 3025, -1673, 431, 948, -890, 1754, 1541, -2805, -113, 4569, 278, -4229, 1077, 4215, -3907, -3734, 7801, 3430, -9564, -1310, 8427, -4316, -6391, 8996]
350H996o332j3760J1123O563j1218L518P301r234j227Q115n154j553R448o958
364c72p183J2803l76j3245Q663R143j3466k606J4512m952j0522Q043O022q078
378a614j736O413j786m796K406L885j097k542J43q2j45J580L69j385J459r58n215
395e101M084P295p617m164R953j661j1729Q797R464j3197k354J3184n458q875
409g379R858K769r775L917N048o665J596M127o416J494P392o728l878Q852k179
424B033q553P950N735r496k685P947j750m916M087M304m907m468M170L197l634
439i86o69M138j906m082L098K337k715J764j63l825L672K164o130J602P578p017
455a140m527J1462k359j1182Q072O934j0416l67R336n443n815P858R06m940K744
$$ y = [8996, 2664, -11096, 27, 6590, -4628, -1110, 6191, -3043, -4270, 3845, -1309, -2862, 6586, -372, -7555, 5248, 4872, -8373, 290, 9433, -4033, -6639, 7873, 2921, -7601, 442, 6464, -1614, -3350, 3063, 1277, -3519, -1113, 2772, 1675, -867, -724, -806, -951, 629, 998, -387, 1072, 114, -5101, -1017, 6278, -1339, -5503, 4450, 2789, -8940, -143, 9321, -3876, -6230, 6954, 1496, -7379, 2479, 5248, -4527, -610, 4438, -2227, -631, 3496, -2920, -1426, 5966, -762, -4640, 4212, 2033, -6520, 1430, 7165, -2331, -5016, 2931, 1181, -3735, 352, 4656, -251, -4719, -549, 2648, -986, -1655, 2483, 577, -3505, -407, 1930, -785, 979, 816, -3009, 663, 2827, -3303, -1701, 5877, -1140, -5667, 5795, 3436, -7746, 326, 7260, -3156, -3523, 5813, 370, -5445, 2413, 3319, -1621, 1123]
470A123Qm596L736J864l648K402J860n506j090O716r18m527K661K263l988j909
486c549N122J495n055n30N020q38n441L661L856n641r31O036k065l958L728J8
502I28k648L777n01m218L479J457o372L926O726q049l763R052k345o901P555L475
518E578r073K40O162l139j598L601q06k555J083JN5K030j519j958K249R83k923
535a589M93K410n93k161O32K639p96l860K205M336m152k145N675j342o415M576
551h7M547n370q26M321l597j537M776r36k741L551k802l260N801Q41n786L438
567C33L239o888j05P180k282n308M931J077m226Q15K626j221r72N14M53Q54j532
584e12q20J852O25j685Q35P98j673o01Q93O69J518j655k610K868J147l965K613
$$ y = [1123, 1131, -3465, 271, 2135, -1513, 889, 2749, -2757, -3847, 2869, 1951, -2576, 85, 2348, -1640, -3549, 1573, 3068, -1987, -2517, 2503, 1665, -3776, -115, 3741, -1900, -2831, 3205, 1140, -2818, 910, 928, -1720, 2057, 1556, -2662, 817, 2274, -4098, -172, 6554, -1495, -5258, 3794, 1449, -5452, 2103, 5578, -3495, -3255, 2907, -232, -1830, 1771, 965, -1590, -507, -506, -451, 1579, 60, -1898, 351, 1334, -1589, -1096, 1314, 721, -1440, -808, 1831, 1035, -2825, -620, 3716, -436, -2581, 3094, 1752, -4663, -87, 4460, -910, -1736, 2585, -1012, -2549, 2227, 1291, -1450, 2101, -701, -3961, 1840, 2681, -3105, 333, 3572, -3316, -3421, 3759, 1477, -3831, 1100, 2177, -2049, -1234, 1392, 171, -801, -287, 166, 1020, -512, -1332, 520, 1145, -540, 295, 1093, -580, -1181, -288, 381, 1899, 244, -2366, 502, 1649, -2316, 297]
601B97M104n358l105O436m95m969M016K409n401L87L368k217J03K071k556M4K818
618A952l041j093M436j163m110L998J673n029L16L755j520j213J797K33j640n54
634a203P89K207l53k526J113Q10k343Q54L167j605k379J613o77P1J976j572n80
651f38K145j966k028M098M94n174K358L892m788j005N085k426k969M252O5k702
667a307J105N13k028K302N14k294J692M92l513J578L967k429j997K056k40k030
683a619J546J544o65j069q06Q42J549j798j98K798j966k737L024J798l604J137
699b24J637j965K23R73j490L11J584k290O98K708k930k027M119J32l648L208J278
716B297m523N38L475j774m22J607j571m83Q49j71L59J816k630j282K807k02k105
$$ y = [297, 4401, -957, -4062, 2374, 1879, -3090, 926, 3335, -2066, -1679, 1689, -528, -425, 1646, -910, -866, 1952, -1089, -2182, 2254, 1091, -3019, 979, 2652, -2377, -2061, 1694, 174, -1039, 758, 991, -649, -1203, -414, 1793, 1440, -1086, 27, 837, -1506, -652, 2515, 910, -1469, 144, -533, -462, 1514, -58, -638, 1507, -459, -2487, 1611, 2105, -3069, -711, 3181, -1607, -2612, 2473, 47, -2922, 1330, 1395, -1307, -202, 311, -1717, 585, 1099, -1195, 497, 989, -2524, -946, 3021, 592, -1405, 651, 411, -1619, -73, 1471, 806, -263, -1069, -227, 1322, -476, -674, 2124, 158, -2579, 445, 2243, -1361, -224, 1413, -552, -329, 644, -846, -535, 1049, -1241, -543, 2165, -765, -2792, 1327, 1459, -2189, 1019, 2297, -2226, -1688, 1787, 13, -409, 1198, -373, -856, -7, -178, 181, 1997, -633, -1915, 892, 690, -1415]
733a415J987J013k411m0J352n29M40m23m78J246l72j817J681J409l190P18L088
750B259j975k414L097l26k100K330O6j721P61k28j350K693M76k547O65J741l249
767a822P56L754j952k522J903L21j607J388R28j153J51l65p85J851n3k004J506
784B95R78k458O24J950j559r43K028j57r36L57p35JJ285q37n62K392j917k228
802b422L167J197k911R84J341k617N4K184m80n46P60j405j46J641p31q67K351
819A554j196k168K498P54k594Q87J870k304j56J682j000n21R07m91O20R50j987
836f95k82K141j263j096K751o66k579J440J246j369P35L08j384K85O94r35Q73
853B04J754k777k16K219j509j093K702m00k257J712O86j469J82Q94j121R44J43
$$ y = [-1415, 572, 1585, -826, -866, 486, -43, 397, -26, -504, 742, 370, -1447, 234, 1643, -1547, -829, 2259, 284, -2130, 967, 641, -1459, 871, 937, -784, -23, -251, -1601, 1092, 1568, -979, -314, 1427, -1822, -1066, 2688, 736, -1786, 117, 438, -1169, 219, 1147, -6, 145, -220, -1005, 846, 793, -1211, 295, 1273, -1185, -561, 1389, -170, -1113, 915, 758, -178, 179, -556, -555, 730, -107, -669, 1723, -194, -2422, 745, 1942, -969, 15, 1356, -1261, -1207, 977, 497, -49, 711, -694, -840, 801, 70, -797, 1554, 358, -1810, 688, 1442, -1152, -265, 1605, -699, -855, 827, -173, -694, 213, -278, 342, 1292, -695, -977, 1164, -99, -1195, 1556, 890, -1689, -249, 997, -372, 363, 671, -713, -428, 266, -669, 204, 1958, -819, -1035, 1184, -325, -1418, 1284, 884, -1373, 339, 1025, -444, -262, 632, -489, 455, 598]
870E98j250K87J416k238P98K410k112j068J818o97j145J693M97j571L50j95l98
887h07J360K8j387J207J84k279J632J891k131q64K137j338n59J199M67j683J523
904E80p42n41J689p29j281J821M84k461J280J170k066k24K063j090o37R13m01
921a72r33J767n87j85J083j228j178K108J63j496R24P21k307N34J712r11k82R93
939G26j146j53J404j447N48J281j445o79J818n64j770K099K9j408M34J164j222
956c31p8J090j326Q30O94j456J70J255j214k85K155j258j993J712O14j141R46
973C84N27j296r6P57j183J537L10j635K02J436j825J75J703p36j205J587k23j256
991h37J338j45o53N68R4r06M27N40j420J055J252j639m25J581j179n52J947o13
$$ y = [598, -652, -365, 1051, -1187, -389, 2021, -91, -1159, 659, -38, -1183, 510, 1007, -564, -214, -409, -807, 553, 581, -806, 401, 585, -1694, -62, 1829, -302, -1166, 971, -367, -926, 273, 740, -943, 580, -162, -703, 986, 257, -1024, 797, 1281, -1180, 100, 1270, -796, -1020, 1043, -47, -684, 229, -172, -1105, 662, 75, -110, 973, -255, -1433, 675, 838, -658, 266, 987, -1320, -786, 926, 15, -267, 726, -420, -573, 831, -616, -68, 1213, -232, -911, 907, 343, -1427, 672, 701, -707, -273, 891, -331, -409, 681, -645, 185, 879, -577, -407, 848, -366, -651, 1504, 246, -1747, -35, 579, -562, 384, 911, -385, -481, 276, -907, 630, 940, -695, -493, 943, -882, -707, 996, 260, -945, 642, 419, -837, 501, 356, -297, 271, 365, -541, -114, 426, -994, 61, 1313, -326, -751, 830, -349, -901, 1046, 433]
1009D33j015O98m42n59J623l90p92Q69j76j464J289J287j808L02J244j937J77
1026f61J383o43n23R91m98o33J182m63j298J713r5j377J072M85j850O31J614j127
1044i7j49J135j562o7J436q24M5P88q94q22J533m06q19J467Mk250J129J019j050
1063c84K47J029j432Q1Q38p30J49J315j444o94J911q59p05J282r6j418P19Q17
1081F26j115L22N95r77Q36M42j339K15P82o38J34J557j348j093J411j77r63J499
1099G69l3j438N87L3o86J123M6j037N98Q37j528K05J642j353m03J403q17o71Q91
1118A68M0q28J096m34p39J012k96j122J310Q13j745M40J244j782L04J632j131
1135a8k02O79n57p77J417j67p66J186p17p78J161L65j394P62O54j781N35R99r68
$$ y = [433, -582, 116, -326, -885, 738, 348, -444, 425, 249, -1215, 74, 1361, -447, -145, 1099, -838, -661, 722, 79, -444, 547, 49, -584, 598, 135, -1163, 550, 455, -922, 150, 635, -1215, -584, 1030, -97, -246, 889, -673, -740, 696, -128, -83, 705, -189, -1011, 522, 116, -703, 764, 768, -1482, -353, 666, -384, -137, 892, -540, -459, 379, -351, -202, 1113, -331, -1025, 886, 27, -678, 604, 508, -910, -191, 626, -489, -167, 428, -549, 287, 729, -610, -395, 387, -251, -117, 1440, 92, -1001, 410, 233, -730, 769, 736, -702, -115, -82, -768, 355, 401, -636, -38, 799, -729, -524, 1118, -235, -638, 765, -52, -723, 168, 208, -620, 476, 42, -697, 315, 19, -1103, 207, 1020, -725, -285, 959, -823, -519, 1113, -18, -220, 459, -98, -875, 542, 375, -391, 795, 78, -700, 461, 826, -568, 194, 848, -933, -398, 601, -367]
1154c67k1J076r66m7N81l93n00J219k74r32J344j99j470Q33P95j263M70R62j164
1173c16l72J084o73K61L73o64m74J354m05p29J407m03j485J355L57r27L54L12
1191D09p27K07O21o67m8P85j080M49O41q10l63J144j58j222J453k77j108J012
1209B61M9q20O09O13j344L97N05o26L00J241j637k35Q16j95n45J561m41j237O96
1228c2L96j320J143L08j048O04M24r36O77M43j398L74J364j153p1P55o39m27J120
1247E84l17p16P13j39q27J220J22j338J093J20j401N43J341r70l68J039j028l24
1265f53J357l53n75O34o69o50J233P7r51O38M83j314O91O57r53R7R19r15m43Q34
1285A44l41qP04l72l20O12k68p99P46N51j282R70N1j109O11N83j060O00K85r77
$$ y = [-367, -388, 688, -278, -325, 256, -137, -637, 582, 308, -624, 720, 521, -949, -116, 679, -584, -114, 848, -316, -688, 396, -277, -16, 357, -307, -781, 573, 168, -561, 846, 443, -1042, 313, 670, -257, 97, 409, -318, -111, 510, -157, -205, 580, -500, -51, 590, -220, -583, 561, 403, -819, 634, 357, -751, 261, 310, -510, 99, 712, -632, -235, 270, -356, -56, 1185, -452, -687, 129, -66, -611, 950, 509, -728, -32, 364, -956, 187, 495, -553, 51, 475, -461, 216, 659, -739, -365, 999, -154, -225, 530, -109, -536, 584, 267, -449, 264, 125, -702, 518, 640, -698, 395, 515, -886, -343, 998, 28, -340, 699, -329, -653, 704, 351, -224, 410, -259, -909, 324, 401, -550, 88, 571, -743, -52, 605, -348, -251, 668, -247, -690, 144, -197, -205, 499, 127, -193, 419, 151, -648, 98, 649, -633, 337, 388, -721, -110, 473, -587, 13, 298, -679]
1305f79J71J206r14j96J402p69p86J187r4j497J234N33j075K51M11r73N85P16
1323G13j230K64P49n33l55R91o40m55J076q8q57O94k57l73O44n5o93J85L48q21
1343f93J007O39j013k49N82m97l01J155n57n05Q45m29n46Q76J08j236J203L1j165
1362g45J045J33p96K40J052j278p9J038l89q18J154n28n53P14J2p17R62r8o55
1381c06M29M2p67O95M54q31K18N80q03R9M28o39M01K22n11j49J139p63m33J013
1401E18k20j174Q68O17j368P19N19q18J93O98q79k4Q97j009K87R51n98r62Q75
1420I0K13o52Q53Q1j528P94P55r89O47L23r91P4O92n23K33O32p50l82N78k32m92
1441e74R03M5p12N98O4p06N83L03r70N64M06j124M62Q70j105J5J081q69l38R92
$$ y = [-679, -508, 698, -216, -412, 990, 221, -565, 622, 528, -969, 265, 798, -277, -26, 385, -588, -3, 713, -517, -253, 496, -37, -392, 599, -41, -496, 580, 492, -365, 329, 72, -301, 343, 288, -405, -220, 128, -693, 314, 953, -60, -309, 273, -224, -525, 630, 73, -432, 413, -16, -562, 314, 422, -814, 389, 420, -745, 300, 433, -363, -123, 929, -349, -428, 610, 221, -597, 557, 29, -524, 190, 202, -515, 447, 349, -306, 123, 165, -602, 93, 547, -284, -66, 514, -289, -190, 238, -401, 0, 222, -289, -438, 701, -62, -495, 518, 298, -876, -8, 609, -759, -40, 479, -339, -146, 552, -327, -351, 546, -463, -176, 775, 177, -785, 90, 303, -349, 504, 585, -943, -149, 606, -383, 264, 587, -404, -330, 362, -161, 72, 704, -46, -428, 150, -82, -574, 329, 374, -338, 260, 324, -382, 201, 504, -466, 98, 504, -620, -158, 712, -393, -378, 703, -166, -504, 488]
1461D88m97m67J037j90p16N38r9o13O75M34r25M89O18j052jP04n50k3M81n03J3
1482a59N21j62l34M86m14n11P26J25o52N93Ko01K83J75m93K91Q28n39k86O54r81
1503d48N3P12k87k50M30L8p85P04L84j066O96M76j288K16O91n25J17O38o37k71
1523d02J027p68N4M79j07r06Q31j24n87N16N56q61N24J7n62J60N50n69P6N81o79
1544a94l8N96l74m86P57K55q63M13m6l52L78M35j264P16P21j157J90J225j297
1563c85L24O23p80k07R16k50o39R96j86o27K32J43m78L18L96o34M24L29o06JP13
1584F23r33j62R06k50p91J065k18n09N21l33k43L50K00q50O03M97r41N26L24o76
1604b91M2O68o22p4P86p29J16N45m64m85R96j77q43O31M26r07M84K93p25j00N98
$$ y = [488, -9, -476, 561, 371, -345, 193, 94, -519, 156, 590, -335, 154, 772, -280, -281, 423, -127, -150, 331, -172, -159, 362, 200, -134, 352, -62, -573, 153, 278, -374, 219, 221, -380, -97, 78, -415, -124, 704, 165, -121, 533, -448, -395, 317, 30, -220, 210, 248, -537, 167, 551, -515, 181, 657, -631, -415, 276, -249, -132, 506, -131, -402, 625, -143, -89, 390, 283, -623, 208, 84, -503, 13, 569, -292, 232, 249, -313, -153, 397, -172, -96, 485, -194, -232, 364, -10, -496, 261, 516, -347, 66, 20, -332, 46, 481, -783, -67, 654, -503, -313, 912, -385, -61, 562, -218, -425, 491, 241, -398, 598, 412, -215, 17, 160, -318, 0, 396, -238, 186, 515, -91, -90, 623, -310, -472, 434, 184, -607, 458, 240, -269, 252, -81, -324, 26, 226, -624, -21, 476, -465, 61, 385, -291, -249, 419, -203, -277, 509, -220, -104, 441, -23, -508, 488, 311, -532, 99, 525, -382, 102, 395, -330, -430, 168]
1625A68m23J29M95l01j99M05m34k15Q09o27m8M35K64n57O04pj200N58N68p87M34
1646G1M82q34Q1J78l87J70N47k25n59J246n75n64N62L37q77M26J68o34P6N50l95
1667a56J79P11r65k98J067o89K2Q32n84p14R49n54l01Q64l29j36J16n1m88O19
1687I4J10l44R5M47l92m9N38n87j98O05m62m45J070m89j51L45j83k56J87L56o62
1708c71L65K08n11L2N97l46j20O49m75l47P84l95m89N72K16n72J41O5l75L56L23
1729C07m96M5O11m03l37N71n61j54R61o81j54N59l22n00Q20j29l95K36P9j15J03
1750D5M54p74K31K49k14k21M23k63j2L45m50j83O63j67n37J004j13p84N11m2m34
1771b69L11M20q49J78L58m22K45K78l12K3L55q0n31M66j47m05J55N84j117P51
$$ y = [168, -255, -126, 369, 68, -131, 274, -160, -375, 434, -193, -241, 194, 458, -99, 505, 498, -702, -144, 424, -363, 71, 553, -281, -200, -22, -409, -239, 308, 83, -476, 770, 195, -369, 193, 530, -347, 79, 247, -387, -311, 239, -156, 23, 734, -231, -529, 538, -151, -129, 703, 119, -595, 354, -200, -501, 363, 34, -102, 14, -37, -525, 94, 204, -140, -45, 402, 10, -39, 499, -88, -286, 319, -143, -588, 482, -7, -158, 187, 4, -252, -65, 291, -371, -6, 202, -309, -277, 320, -26, -146, 503, 28, -319, 465, 70, -419, 153, 369, -203, -62, 3, -372, -16, 307, -189, -144, 467, 64, -273, 298, -263, -417, 544, -137, -291, 268, -54, -554, 266, 137, -258, -22, 57, -58, 45, 499, -275, -44, 205, -9, -230, 193, -70, -82, 263, -187, -370, 293, 126, -411, 593, 480, -304, 207, 165, -269, 42, 462, -387, -209, 149, -273, -28, 250, -62, -39, 316, 236, -295, 171, 24, -381, -226, 358, -759, -8]
1791hj47k51K09M70n06j73N75l66k00R96m97l81M94j37l07M28N3o98O61K7m56
1812b14L57p4n81P05R4k62m13P45p72L86L83m47r3M52j27n27N68o8m34J43L03
1833A24m96N15J66m49J26J63m23K74J09l90L38L74n66j74P89j25l48J66l02O0
1853f9K14J42q28N79J61k99j72O39o39K45M82k74m15N38k63l14P20k84o42N76
1873I7l6m18O28m29N6l1K60k59J2N60k45l42K24m12K69N26m45j87O11k70n53K41
1895a43L03o32M54M02n77K53J08o53J13P24o35k03Q77m30l69P58o0m05N20l02
1915A03l28M85L9o00L81J67k34j15J35l77K03M42j04m27M80k11m2K56j35l70J10
1936a42L41m49M12jl26N03j16n89Q9O31n63J34M97q78L72O02o23o8M47k93l70
$$ y = [-8, -155, -406, -197, 273, -233, -406, 169, -197, -397, 599, 102, -279, 215, 78, -229, 199, 252, -446, 215, 242, -214, 143, 69, -512, 193, 287, 25, -388, 357, -415, -29, 354, -93, -186, 266, 139, -388, 180, 112, -322, -179, 124, -372, 143, 309, -140, -14, 149, -274, 0, 109, -281, 57, 431, -135, -309, 480, 355, 7, 173, -129, -69, 145, 287, -541, 38, 199, -100, -272, 367, -272, -27, 455, 181, -234, 304, 41, -273, 447, 163, -479, 97, 61, -357, 271, -158, -102, -133, 127, -132, -120, 440, 195, -147, 77, -335, -66, 460, 15, -172, 439, 169, -384, -143, 160, -472, -18, 384, -193, 60, 168, -485, -372, 352, -283, -486, 391, -39, -408, 350, 290, -115, 405, 103, -225, 260, 299, -301, 80, 247, 13, -102, 33, -344, -141, 301, 197, -230, 250, 39, -3, 253, 118, -252, -142, 199, -250, 162, 161, -165, 338, 222, -367, -278, 353, -210, -76, 421, -457, -85, 517, -106, -174, 273, -20, -390]
1957c90O89m69l25P92j35k82N25j62m55P5O38p85J30N53o19Q0L55K5n15O06j27
1978B04o03M02J44m21M12O7n40J96M85k98k7L57m05n0N11o43J08L83j79k68L12
1999A47j77l26N78k22k38K08K19n51L51n1n5K34M37n56l10N40k66J13N03n39k63
2020b24J21J27m43N31L07o23K57J1m11L65K68m43J06L52p35L61o7O2J26k46K70
2041G2k76N68k80l22P39k87m60J48J91n54M38L22n37O9M10k42k83O54p95K41O22
2062D38k38n04K55M3k04M63Q1p22L68K76m54J90N21m48j71N01p2o88N73p1l46
2083b09K71j09k16K01J04j88K04Jl30K66J82n83L68K03m75M74r4l18L87J21l23
2104f3j24M23k18m17O09l0n25M59J52n97J0N18k73K0M08m40k78N25k96j84L76
$$ y = [-390, 299, -170, -495, 297, 162, -120, 405, 243, -212, -137, 501, -284, -154, 399, -220, -140, 215, 240, -275, 331, 204, -399, 3, 147, -274, 138, 205, -335, -139, 346, 48, 21, 378, -27, -77, 434, -209, -101, 282, 103, -165, 147, -30, -356, 222, 0, -238, -30, 189, -362, -11, -62, -117, 117, 554, -2, -312, 228, -38, 75, 578, 39, -224, -103, 24, -419, 112, 419, -204, 53, 64, -347, 18, 286, -157, -51, 301, -434, -73, -140, -78, 48, -198, 72, -204, 364, 84, -238, 501, 214, -246, -98, 93, -461, -23, 299, -238, -169, 241, -1, -284, 370, -425, -184, 438, 200, -304, -49, -6, -210, 253, 334, -388, -20, 256, -198, -8, 513, 65, -106, 395, 323, -365, 208, 137, -209, 62, -47, -263, -62, 42, -146, 58, 59, -271, -5, 177, -406, -38, 165, -310, 164, 70, -248, 139, 260, -63, -187, 236, 18, -399, 210, 180, -345, 114, 266, -331, -321, 197, -76, -56, 352, -88, -366, 159, -137, -321, 55]
2125E5j93l7J65j09l98M38K95n86N92m5j73J01J92l81J26l4k75K42J39P4l74L69
2147A83Nm57K44q5j14M18q9p03R28l2o11M16J01m81K49M27m90j95N61m05k62P01
2169C09k95j77L62j58q9O6K80n20J39K21j52j37M93m79j43L13J24j39j24J41j7
2190A8j03j16J27K48k13M5Q5j09K24j1M6m56N11k07l72O6L14l60J44M59n0l64
2212g4N34k39m10M06J29r48O04K46n06M2O76o41Q1L08k18J45j07k57K4K32rl37
2234c19K76Kj22J70J4j45K18j51Q4j65J11k74L18P4%o6L15p01L79K92m03j4M66
2257C59k14n39N55J87l49j01L02o97K15N66l99jN88k54n70M75n1l24N31J01n68
2278a88l26Q73m98J89R0O7j80J97j94RK03k26J47J1l61J88r2J29o2K72l99k81
$$ y = [55, -138, -175, -10, -119, -517, -79, 216, -370, 222, 177, 4, 105, 297, -84, 42, 8, -267, -25, 114, 188, -186, 183, 188, -269, -25, -110, -224, 194, 105, -598, 330, 298, -313, 103, 204, -277, -28, 399, -91, -286, 275, -130, -392, 309, 14, -163, 199, 41, -48, 18, 298, -222, -83, 138, -14, -151, 342, -137, -280, 33, 157, 18, -106, 35, 18, -85, -201, -74, 174, -39, 6, 91, -18, 206, 195, 241, -215, 296, 89, -283, -217, 97, -263, -119, 340, 290, -74, 460, 221, -189, 217, 346, -602, 2, 248, -258, -216, 460, -181, -100, 208, -10, 135, 28, -229, -205, 27, 18, -319, -43, -41, -163, 7, 21, -124, 94, -57, 27, -138, -27, -301, 17, 91, 91, 25, 340, -361, 18, 310, -93, -107, 359, 145, -394, 161, 348, -1, -102, 200, -497, -282, 284, -115, -116, 472, 218, -352, 123, 72, -252, 279, 380, -188, -514, 359, -139, 50, 140, 207, 27, 224, 30, 39, 242, 16, 163, 174, -187, 1, -91, 38, -24, 248, -151, -432]
2300d32N52K28m97L22O9l28L66k09k95O24j16n20J4O74l46r3K64l69m43P86Q5
2321C36q70N43K73n35p1Q85n01l30O52l59k16J85k5J90k41K31k25j44L92j66k31
2342b27M18k84R4J32k03P6m49K42O04l87j79L83K01n91J45J59p75K55O54m79j99
2363d10P90k61l99N00R5q17M34J71k46o2M39l82J34K73k90j11K4L18k44R1j65
2384a18L94o36L72Q5p4j62K82R8m02oN52j88m45M17l95M9L82m04NJ03L06m34J26
2407i3M65k74m60M92J73p02O27r2p29K94O16l76k66P02n66M1K77J39o72J13N74
2428B83k56k52M57j47k78P9K08k64J93P5j28m6j3j74J50o5L86j83m74M55L71m10
2450c3j67P44o27j56L31J59n81M69J29n15K46L21n99r6O62l70j76N03k71n46J000
$$ y = [-432, 120, 348, -149, 173, 242, -86, 280, 71, -224, 400, 284, -236, -222, 452, 106, 13, 277, -92, -535, 251, 336, -534, 9, 282, -253, -324, 561, 60, -270, 382, 23, -193, -8, -33, 157, -84, 147, -78, -222, 170, 4, -227, 191, -93, 1, 133, -70, 6, -443, -201, 403, 16, -163, 220, 421, -170, -25, 134, -641, -386, 268, -211, -410, 380, 119, -280, 220, 315, -502, -68, 103, -143, -205, 234, -148, -14, 259, -31, -142, -118, 200, -44, 47, -118, 276, -360, 12, 97, 23, -139, 143, 241, -161, -167, 385, 197, -248, 169, -226, -177, 205, -199, -194, -91, 215, -219, -93, 372, 98, -362, 130, 303, -399, 228, 136, -593, -299, 317, -59, -325, 377, -189, -148, 129, 268, -404, -291, 283, 27, -225, 232, 85, -193, -114, 94, -170, 23, 98, -30, -76, -89, -263, -113, -178, 208, 25, -449, 6, 377, -33, -200, 544, -83, -239, 92, 251, -330, 139, 268, -247, -1, 320, -279, -375, 287, -83, -259, 244, -27, -573, 427]
2471D27j70o64J37L68m12K93L18n33n8M45k4l54J31L77j21l97L89j12j44J54j89
2492a39K41j34Q7O6k29Q6L08k30l15N74k19n93N94K88o68L48j17j02J6P84p30
2513h4k40N76K5o20M54J09o46M45K90n48P9P18r33M0M92km97N32k5p57K86P15
2535D09Nn05k0K61k25O6J5N6k44L17J43k79l68J64K87j99j6j23J85j19O92q24
2557c22Q6M31j27m18L46l4l98K57K75n66J03P85p04j25Q08o30M6O57k81j40l8
2578A1M94q36J53L27k80J14l2l46JL22J90j20L6k45P39o84j28J28J54j42o1O61
2600D56n85J99L14n92L01J76j34l53K75K58o59L48L87n04k72R66p13j74N79r7
2620A76k66L02j98m14N13J89l72j24K58k13k12O37l27NJ94K68n53n6L37j18q6
$$ y = [427, 257, -407, -270, 98, -314, -21, 297, -236, -294, 151, 127, -227, -96, 281, 160, -237, 152, 40, -104, 50, -139, 102, -32, 55, 121, -108, -22, 286, 56, -259, 315, 96, -497, 97, 385, -283, 65, -52, -154, -138, 646, -84, -324, 252, 277, -343, 111, 220, -426, 19, 309, -239, -160, 558, -375, -335, 157, 155, -342, 190, 165, -592, -306, 409, 414, -91, -111, 150, -75, -9, 6, 62, -182, 135, 278, -1, -369, -205, 82, -117, -133, -256, -71, -190, 502, -322, -236, 195, 68, -350, -4, -38, -436, -179, 96, -470, -367, 418, -286, -411, 397, -233, -187, 470, 189, 49, 11, 505, -331, -178, 149, -131, -17, -49, -395, -394, -72, 118, -2, 34, -211, 528, -156, -284, -156, -2, -144, -205, 456, -129, 70, 384, -208, 93, 269, 135, -218, 57, 315, -344, 4, 391, -113, -385, 581, -132, -306, 273, 176, -90, 212, 14, -400, 113, 302, -70, -194, 64, -149, -361, 276, -51, -46, 148, 416, -137, -193, 144, 26, -60]
2641f0n3k2M32m42R4L76m20%O6K2m15O46l76j58M37l9k17J08K87n01K42M23m97
2664f7n78Q88L4p33N41K54m69N8J00n19J09N40R5o49N31J01m71M93Qp6m6r6j32
2687h4m0R5r7L13k48L56j64k57r9L89k73j80N23j6o17N58j76J3k91M59p3k49L26
2710A68m46J20N24J2o89L76L15j043N92L08m03K25K8K00j71l30O5M8j14N03l34
2731d6k35M20Qj30J82l3j03Q2p0L1pm14M69k84j27J44K10j01J50qj69J98j81M62
2755D48n65M02j30n41M34j10j98O8N11n26QO43l01m92N17M8l83K04o2j60J1N62
2777C88n50O9K06Q0m41K08l7j47M94j96j29mj09L34m5m22K66L95o73L47K20o01
2799c47L87l17K29n36P31P4o80O44J44o31K12L68k05J4m6p4k39K77J69m75K71
$$ y = [-60, -113, -135, 297, -145, -51, 325, -95, -95, -29, -7, -422, 224, -152, -310, 127, 88, -129, -21, 266, -235, 7, 430, -67, -645, 243, 277, -456, 85, 339, -130, -72, 28, -491, -382, 158, 253, -396, 135, 236, -235, 258, 266, 190, 144, 48, -84, -124, -29, -126, 187, -61, 295, 131, -126, -225, 164, -109, -289, 234, 218, -399, 159, -17, -4, -295, 164, 91, -158, 168, -278, -158, 366, 378, -311, 65, 380, -663, -71, 237, -166, 59, 87, 287, 116, -214, -149, -101, -215, 288, -46, -281, 139, 147, 17, 199, 166, 63, 145, 75, 106, 99, -315, 154, -130, -257, -113, 97, -4, 146, 138, -31, 167, -14, 448, -117, 285, 155, -386, 48, -62, -260, -192, 319, -207, -199, 444, 143, -349, 168, 216, -167, 37, -25, -185, -174, 388, -162, -93, 113, 193, -248, -40, -77, -224, 270, 74, -55, -59, -168, 166, 121, -301, -35, 360, -313, 34, 254, -347, 40, -277, -48, -584, 147, 221, -459, 185, 329, -302, -90, 278, 73, 87, 41, -33, -272, 5, 174, -301, -30]
2820c0L47l95J92J61k67k33l0P8J63Q7J43j99L4J54m6k04J66JL8k94n1K72K9j38
2844b2O1P5k80L49J4m71L38N9o2j43O6j08m4L85m44o0K31R0m19K98K37m52K20
2867h2M33n02J93K39l95M4K19Q1n16M55l23J92k08L74k89r1M89o36N8K76K55k60
2889FN2o0J71k43k7j07n7K82K31k3q2j9j19k03J10M82m28K59j99k99Q2L75J50
2912C34o43J30M40l51J5M45j24p78N20J27J0l28L88o22M26P22q39k2N74o64j78
2933d18N03K76p24M03J92m27L56r7J63j14p2j34J58j1k9k84M26m85M84k07m48
2954d89K76K50l54J19K58k98K39R4j75j74L86o6l15L0K47k55N08k23j36J20K89
2975C31m20j2L42k06k06M49l02K4l7j45K24p7k3l37J70J81j71N63n3l71J52L70
$$ y = [-30, 317, -78, 114, 275, 8, -225, -255, -177, -14, 73, 216, 17, 51, 205, 159, -45, 121, 122, 160, -134, -185, 87, 116, -22, 39, 114, -166, 183, 197, -274, 64, 123, 61, -82, -16, -124, -168, 217, -227, -287, -56, 34, -385, -87, 150, -302, -82, 351, -151, 42, 281, -114, -70, 149, 230, -286, 169, -154, 38, -170, 204, -85, -176, 313, -323, -265, 11, 266, 6, 58, -2, 169, -74, -101, -208, -265, 17, 248, 225, 143, 124, 5, -198, -88, 394, -34, 225, 26, -273, -191, 184, 334, -309, -179, 261, -90, -75, 370, 246, -532, -12, 115, 125, -203, 185, -437, -11, 711, -128, -150, 424, -240, -418, 85, 361, -363, 40, 232, -195, 161, 64, 227, 113, 41, -93, 65, 54, 25, -259, 167, -318, 166, -41, -489, -213, 37, -317, -198, 60, -238, 1, 95, -80, -254, 132, 66, -249, -219, 28, -227, 281, 58, -78, 42, 331, -89, -101, 241, 35, -171, 278, -24, 0, -37, -182, 42, -35, -58, -395, -225, -44, -215, 348, 295, -76, 76, 446]
2997D46m38K33p9N9n00O76l20j14N09o19R9L47m26j51L16L90o47K00K56m87O2
3018a88M44q08L72N05j31l00Q7L19m34M07l15m0J43M3Q3n64L49P5J59k62j1j15
3040a82R8p7k5P6p0J12K80m51J36K40l24L55j67j35j77N47j00l02K13J10n36N96
3062B17J32l46l34O34m17k04N03j05l44O45k74j00K85k83K70q6j12o6k7P0k62
3083b04J60p7n1j50K90J02j31J12j92K67j03K37j90j27l1j28K71J1Q1j58l7J70
3105A22n81N74p6K62j55j13p3J06l27J42J74J08l53n7K49J80j17J78l55j03K54
3126C9jj30K77k02j12J94j04P1K43k57r1q8K26l9k19K94m14M18M0l49K69m48N83
3149B00l72L83l51L44j75Q6P7m9k10M2J41k60J14N3K82l02k27O26o10K10k7J56
$$ y = [446, 8, 241, 162, 221, -279, 397, 77, -37, 472, -147, -48, 299, -127, -278, 38, 428, -219, -19, 237, -250, -188, 256, -552, -180, 325, 194, -106, -19, 300, -134, 273, -42, -82, 61, 104, 187, -377, -28, 47, 206, -56, -67, -182, -84, -161, -186, -110, -180, -68, 212, -239, -103, 137, -187, 168, 1, -134, -311, 236, 136, -166, 47, 157, -379, 217, 349, 3, -331, 303, -114, -318, 185, 80, -264, 381, 107, 7, 292, 9, 279, 193, 81, 15, -12, 58, -204, -44, -121, -172, -322, -32, 70, -61, 51, -141, 126, 23, 260, 70, -57, -88, -216, 55, 66, 147, -11, -48, 122, -459, 115, 39, 301, 146, 33, -40, 66, -261, -119, 55, 163, -190, -247, 2, 182, 65, 243, -112, -215, 39, 38, -92, 185, -17, -129, 65, -39, 32, 275, 18, -73, -161, 65, 26, -193, 101, -313, 105, 145, -204, 65, -383, 200, -172, 211, -140, 204, 29, 115, 192, 143, -67, -25, 116, -144, -30, 23, 305, 3, -224, 402, -208, 2, -25, 131]
3171A31K8m4Qj78L6Q4q5K76m37K91J6P9k68j6J68j90J55j20M39o13L64m7r2P4
3195E9q7j3r3O8p1J2L60k84P0r9J93k9J40l66Q8K66o76N72m0j85J22K87m14J79
3219E9Q0k80K90P4No1k5p8K05k73J08l56L26j20N3J32Q9q0k47K24q2J96L2m51
3243a80R3L02m74J28L86R3n26M89l02M4Q8q8O8k21L7k30L57O1k39J23L87n55J67
3266HK14k29j41J31l97M77q6j33Q5N4K98m53R6J67k62K51L8O7k87J80o5k51J63
3289g5o6j7J19j01j9L10l56Q4J72p8m18L35L04j44k79L78K7l31j52R2J49L73m33
3312a26l6K52j83k20j4K57J63j75M3n8R5Q8m41K09N88k83l9j01j16j43M13r4m3
3335C6J83k57lK78q3j76J01j92K48j1L21o48L69k23q9k05L54J66k26L02qj21p0
$$ y = [131, 159, 115, 123, -55, -19, 65, -20, 256, -181, 110, 126, 205, -63, -79, 89, -101, 54, -66, 373, -240, 124, 77, -15, 59, -28, -41, -134, -66, -137, -125, 235, -49, 21, -78, 115, 86, 226, -140, -52, 214, -462, 110, 70, -115, 7, 294, -120, 59, 139, -141, 149, 223, 228, 167, 142, 64, 269, -4, 104, -252, 74, -46, 7, 139, 228, 148, -99, 125, 43, 239, 271, -180, -87, 215, -259, -131, 255, 348, -178, 311, 9, 53, 141, 53, 121, -100, -63, -293, 64, 125, -114, 9, 396, -159, 8, 222, -7, -148, -17, -414, 63, -23, -156, -71, -17, 281, -172, -76, 91, -171, 80, 118, 185, -102, 78, 13, -238, -75, -141, -158, -39, -140, -159, 151, -205, -121, 51, -27, -445, -110, 194, 50, -229, 149, 176, -155, -307, -215, -66, 307, -126, -162, 90, -93, -313, -327, -70, 93, -82, -39, -97, -2, 86, -355, -146, 442, 159, 120, 19, -97, -240, 173, 79, 36, 219, -38, -41, 237, 154, -22, 79, -113, 135, 124, 445, -203, 166, -57, -146, -351, 3, 169, -57, 245, 237, 116, 46]
3358D6o8l42L49k9j28j18L84l76J54K87k99p8J30L64k57j79J03pJ35k6l9J19j50
3381b5k87L75N8j21J3j15J75m96M41j46M80l12j16K11P8l62K35j59K09k60J67
3402D3p7l8J13J0k38M2J84k09J81K77q1k29j38R7K71J3k09k90K49O4j30K49R1
3425B45k41J79k08J76l15L33k17m8L12j5k53LK13j76j9l01J49R7o6J30M0J59k44
3448f7O0J26K7j55P7p7j2J82m42K10J61J77L6l59M86k94J0r7l21K81j0O6k70L22
3472A17N6k20J87l68R2K19%J7k93J41k1L3JJ21q1L15o30L55L02k26r7K70l72P2
3496a0qm3j1l6K80j72n5J26J22l19K98m75J60L49l82K37j83J34j14K99l41J85
3518D1J30k17l5J95p4l3K47k97j2K19k04oJ53K52l71o1J96l8l50M59l03J38K11
$$ y = [46, -22, -364, -15, -44, -172, -290, 94, -282, -128, 159, -140, -218, -88, 276, 19, -160, -57, -64, 71, 45, 6, 125, -25, -312, 63, 121, 0, 13, -102, 73, -423, 18, -128, 352, 40, -76, 135, 213, -149, 86, -73, 136, -124, 43, -34, -72, 41, 51, -187, -145, 39, -170, 11, 288, 207, -22, -160, -63, 208, 221, 12, -278, -29, 35, -95, 154, 245, 4, 183, -25, 151, -164, 169, -48, -96, 216, 201, -52, -49, 164, -12, -31, -332, -183, -86, -152, -22, 18, 177, -67, -7, 119, 146, -9, 68, -9, -21, 161, -281, -71, 90, 267, 303, -56, 430, 136, 146, 49, -272, 9, -1, 65, -205, 117, 173, -47, 140, -228, -136, 83, 83, 100, -193, -52, -73, -40, -39, 82, 1, 316, -314, 41, 343, 117, 20, 290, -82, -10, -18, -61, -72, -108, 172, 0, -55, 71, 193, -126, 172, -303, -143, 206, -176, 61, -122, 12, -102, 197, -144, 41, 171, -46, -81, 114, 40, 7, 254, -43, -55, 164, -40, -46, 107, 359, -12, -73, 123, 85, -265, 194, -109, 29, 240]
$$ [...]
8191g7
##END NTUPLES=NMR FID
##END=
