##TITLE=1H_DE-1r_TFA
 DMSO-d6
 8 sc, 
 22.11.2023
##JCAMPDX= 6.0         $$ Bruker NMR JCAMP-DX V2.0
##DATA TYPE= NMR FID
##DATA CLASS= NTUPLES
##ORIGIN= UXNMR, Bruker Analytische Messtechnik GmbH
##OWNER= root
$$ XWIN-NMR		Version 3.5
$$ Wed Nov 22 12:13:57 2023 Russian Standard Time (UT+4h)  she@DPX200
##.OBSERVE FREQUENCY= 200.1313
##.OBSERVE NUCLEUS= ^1H
##.DELAY= (6, 6)
##.ACQUISITION MODE= SIMULTANEOUS
##.ACQUISITION SCHEME= undefined
##.AVERAGES= 8
##.DIGITISER RES= 18
##SPECTROMETER/DATA SYSTEM= spect
##.PULSE SEQUENCE= zg30
##.SOLVENT NAME= DMSO
##.SHIFT REFERENCE= (INTERNAL, DMSO, 0, 15.7039)
##AUDIT TRAIL= $$ (NUMBER, WHEN, WHO, WHERE, WHAT)
$$ ##TITLE= Audit trail, XWIN-NMR		Version 3.5
$$ ##JCAMPDX= 5.01
$$ ##ORIGIN= Bruker BioSpin GmbH
$$ ##OWNER= she
$$ F:/spectra/data/she/nmr/H-F/1/audita.txt
$$ ##AUDIT TRAIL=  $$ (NUMBER, WHEN, WHO, WHERE, WHAT)
(   1,<2023-11-22 12:12:56.54 +0400>,<she>,<DPX200>,
      <created by zg, POWCHK disabled, PULCHK disabled
       configuration hash MD5:
       00 E9 B6 7A A2 85 ED C7 34 08 36 98 17 FE 4E 26
       data hash MD5: 16K
       7E BD BF 81 D7 7C E1 3F 29 DB 60 A7 4C F7 78 C9>)
$$ ##END=
$$ 
$$ hash MD5
$$ 68 E6 88 AE 8E 92 3A 44 D6 27 0A 64 65 9D 5A 73
##$RELAX= 
##$RELAX= 
##$RELAX= 
##$RELAX= 
##$RELAX= 
##$RELAX= 
$$ Bruker specific parameters
$$ --------------------------
##$DU= <F:/spectra>
##$EXPNO= 1
##$NAME= <H-F>
##$PROCNO= 1
##$TYPE= <nmr>
##$USER= <she>
##$AMP= (0..31)
100 100 100 100 100 100 100 100 100 100 100 100 100 100 100 100 100 100 
100 100 100 100 100 100 100 100 100 100 100 100 100 100 
##$AQSEQ= 0
##$AQ_mod= 1
##$AUNM= <au_zg>
##$AUTOPOS= <>
##$BF1= 200.13
##$BF2= 200.13
##$BF3= 200.13
##$BF4= 200.13
##$BF5= 200.13
##$BF6= 200.13
##$BF7= 200.13
##$BF8= 200.13
##$BYTORDA= 1
##$CFDGTYP= 0
##$CFRGTYP= 5
##$CHEMSTR= <none>
##$CNST= (0..31)
1 1 145 1 1 1 1 1 1 1 1 1 1 1 1 1 1 1 1 1 1 1 1 1 1 1 1 1 1 1 1 1 
##$CPDPRG= <>
##$CPDPRG1= <>
##$CPDPRG2= <>
##$CPDPRG3= <>
##$CPDPRG4= <mlev>
##$CPDPRG5= <mlev>
##$CPDPRG6= <mlev>
##$CPDPRG7= <mlev>
##$CPDPRG8= <mlev>
##$CPDPRGB= <>
##$CPDPRGT= <>
##$D= (0..31)
0 1.2 0 0 0 0 0 0 0 0.06 0 0.03 0 0 0 0 0.0002 0 0 0 0 0 0 0 0 0 0 0 0 
0 0 0 
##$DATE= 1700640776
##$DBL= (0..7)
120 120 120 120 120 120 120 120 
##$DBP= (0..7)
150 150 150 150 150 150 150 150 
##$DBP07= 0
##$DBPNAM0= <>
##$DBPNAM1= <>
##$DBPNAM2= <>
##$DBPNAM3= <>
##$DBPNAM4= <>
##$DBPNAM5= <>
##$DBPNAM6= <>
##$DBPNAM7= <>
##$DBPOAL= (0..7)
0.5 0.5 0.5 0.5 0.5 0.5 0.5 0.5 
##$DBPOFFS= (0..7)
0 0 0 0 0 0 0 0 
##$DE= 6
##$DECBNUC= <off>
##$DECIM= 32
##$DECNUC= <off>
##$DECSTAT= 4
##$DIGMOD= 1
##$DIGTYP= 9
##$DL= (0..7)
0 120 120 120 120 120 120 120 
##$DP= (0..7)
150 150 150 150 150 150 150 150 
##$DP07= 0
##$DPNAME0= <>
##$DPNAME1= <>
##$DPNAME2= <>
##$DPNAME3= <>
##$DPNAME4= <>
##$DPNAME5= <>
##$DPNAME6= <>
##$DPNAME7= <>
##$DPOAL= (0..7)
0.5 0.5 0.5 0.5 0.5 0.5 0.5 0.5 
##$DPOFFS= (0..7)
0 0 0 0 0 0 0 0 
##$DQDMODE= 0
##$DR= 18
##$DS= 0
##$DSLIST= <SSSSSSSSSSSSSSS>
$$ [...]
##$SUBNAM2= <"">
##$SUBNAM3= <"">
##$SUBNAM4= <"">
##$SUBNAM5= <"">
##$SUBNAM6= <"">
##$SUBNAM7= <"">
##$SUBNAM8= <"">
##$SUBNAM9= <"">
##$SW= 18.0517328524113
##$SWIBOX= (0..15)
0 0 2 0 0 0 0 0 0 0 0 0 0 0 0 0 
##$SW_h= 3612.71676300578
##$TD= 16384
##$TD0= 1
##$TE= 0
##$TE2= 300
##$TE3= 300
##$TEG= 300
##$TL= (0..7)
0 120 120 120 120 120 120 120 
##$TP= (0..7)
150 150 150 150 150 150 150 150 
##$TP07= 0
##$TPNAME0= <>
##$TPNAME1= <>
##$TPNAME2= <>
##$TPNAME3= <>
##$TPNAME4= <>
##$TPNAME5= <>
##$TPNAME6= <>
##$TPNAME7= <>
##$TPOAL= (0..7)
0.5 0.5 0.5 0.5 0.5 0.5 0.5 0.5 
##$TPOFFS= (0..7)
0 0 0 0 0 0 0 0 
##$TUNHIN= 0
##$TUNHOUT= 0
##$TUNXOUT= 0
##$USERA1= <user>
##$USERA2= <user>
##$USERA3= <user>
##$USERA4= <user>
##$USERA5= <user>
##$V9= 5
##$VALIST= <valist>
##$VCLIST= <CCCCCCCCCCCCCCC>
##$VD= 0
##$VDLIST= <DDDDDDDDDDDDDDD>
##$VPLIST= <PPPPPPPPPPPPPPP>
##$VTLIST= <TTTTTTTTTTTTTTT>
##$WBST= 1024
##$WBSW= 4
##$XGAIN= (0..3)
0 0 0 0 
##$XL= 0
##$YL= 0
##$YMAX_a= 374065
##$YMIN_a= -324376
##$ZGOPTNS= <>
##$ZL1= 120
##$ZL2= 120
##$ZL3= 120
##$ZL4= 120
##$ABSF1= 10
##$ABSF2= 0
##$ABSG= 5
##$ABSL= 3
##$ALPHA= 0
##$AQORDER= 0
##$ASSFAC= 0
##$ASSFACI= 0
##$ASSFACX= 0
##$ASSWID= 0
##$AUNMP= <proc_1d>
##$AZFE= 0.1
##$AZFW= 0.1
##$BCFW= 1
##$BC_mod= 2
##$BYTORDP= 1
##$COROFFS= 0
##$CY= 11.3945322036743
##$DATMOD= 1
##$DC= 2
##$DFILT= <>
##$DTYPP= 0
##$F1P= 15.7292609196834
##$F2P= 12.9074282941183
##$FCOR= 0.5
##$FTSIZE= 0
##$FT_mod= 4
##$GAMMA= 1
##$GB= 0.15
##$INTBC= 1
##$INTSCL= 1
##$ISEN= 128
##$LB= 0.24
##$LEV0= 0
##$LPBIN= 0
##$MAXI= 10000
##$MC2= 0
##$MEAN= 0
##$ME_mod= 0
##$MI= 1.114404
##$NCOEF= 0
##$NC_proc= 0
##$NLEV= 6
##$NOISF1= 3.799351
##$NOISF2= 2.8
##$NSP= 1
##$NTH_PI= 0
##$NZP= 0
##$OFFSET= 15.70392
##$PC= 1
##$PHC0= -23871.17
##$PHC1= 9.052691
##$PH_mod= 1
##$PKNL= yes
##$PPARMOD= 0
##$PSCAL= 0
##$PSIGN= 0
##$REVERSE= no
##$SF= 200.130013532006
##$SI= 16384
##$SIGF1= 3
##$SIGF2= 2
##$SINO= 400
##$SIOLD= 16384
##$SREGLST= <1H.CDCl3>
##$SSB= 0
##$STSI= 0
##$STSR= 0
##$SW_p= 3612.71676300578
##$SYMM= 0
##$S_DEV= 0
##$TDeff= 0
##$TDoff= 0
##$TI= <>
##$TILT= no
##$TM1= 0
##$TM2= 0
##$TOPLEV= 0
##$USERP1= <user>
##$USERP2= <user>
##$USERP3= <user>
##$USERP4= <user>
##$USERP5= <user>
##$WDW= 1
##$XDIM= 8192
##$YMAX_p= 0
##$YMIN_p= 0
$$ End of Bruker specific parameters
$$ ---------------------------------
##NTUPLES= NMR FID
##VAR_NAME=  TIME,          FID/REAL,        FID/IMAG
##SYMBOL=    X,             R,               I
##VAR_TYPE=  INDEPENDENT,   DEPENDENT,       DEPENDENT
##VAR_FORM=  AFFN,          ASDF,            ASDF
##VAR_DIM=   8192,          8192,            8192
##UNITS=     SECONDS,       ARBITRARY UNITS, ARBITRARY UNITS
##FACTOR=    0.0002768,     1,               1
##FIRST=     0,             0,               0
##LAST=      2.2672688,     0,               0
##MIN=       0,             -324376,         0
##MAX=       2.2672688,     374065,          0
$$ Real data points
##PAGE= N=1
##DATA TABLE= (X++(R..R)), XYDATA
$$ [...]
1837a3K23k08J63l70J55O7l08L73N2j44l21K20j8Q3J44l93K63q6K25j13OM1n8
1860a7l5Q9K9j4l8J2R9R0OJj03k80O65n52P4n1j06L16j74J39l40k41O38J49o55
1885b99L76ll12L08j39O9L0N9j06l05M31N4q4j55J08J67j39J02l41Q0M52m77J93
1908F9k65L85j82J66m44L27J64l11L62k3k47J18k83n7L06J84m94J69O1L08k29
1929H4j07m1q1J35m3o5n8J47o3J17l34M04k58J28j9J88J32m58M4J14Q2J60k3n2
1953A33l01J09K76k60J37m8j47R2J36k90Q5R4J41k91J60j47J06mKJ62q3j3o9J61
1977A41j1j30J51m5P9j31J8P8l83L70j83j12K60k1n3J37k10J4J96Kk5j76J1j81
2001b04R8J32j10K34j63J72j45j28J27J2j13J98j41k0J68K4k74M81l29l2r3K34
$$ plain form
1837 -13 210 2 165 -205 -50 17 -291 82 134 -10 -331 -111 -129 -46 98 -295 -32 -118 107 -6 0 41 -17
1860 -17 -52 37 66 52 14 26 125 215 221 222 119 -161 504 -48 26 -25 -131 185 11 150 -190 -431 207 356 -299
1885 -299 77 74 -238 70 -69 0 30 89 -17 -322 109 163 79 -76 32 199 60 162 -179 -99 353 -124 69
1908 69 -196 189 7 173 -271 56 220 -91 271 248 1 119 -164 -221 85 269 -225 -56 5 313 84
1929 84 -23 -64 -145 -10 -53 -118 -176 -29 -92 25 -309 95 -163 -35 -54 134 266 -192 -148 -34 48 208 185 133
1953 133 -168 -59 217 -43 94 46 -101 -9 127 -163 -78 16 157 -134 26 -121 -15 -19 -17 145 62 49 -20 141
1977 141 130 0 151 106 185 54 72 150 -233 137 -46 -158 102 81 28 165 -45 -31 165 167 142 -34 -23 -204
2001 -204 -106 26 -84 150 -13 159 14 -114 13 25 -88 110 -31 -51 117 141 -133 348 19 -13 -106 128
2023A28N0k70m2rP4J25m4K66r4j95k0p3J90L9n3P7j38o1r5O6K41l17L6L47q1K3
2049A70k13J82l17J41j47J98J01k85K3N4J39l9K0j4L0j44O3K18qj40j08P2k4j58
2073a86K49l44P9J15j06K9J96Q4j55J6K06j78K54j60j21p7Q2n4l2J83J67j60k96
2096b09J68o1Q4O3N0j77J96j23L7j29K87k50j30J29J42l0q1j31k8L34n13L93p4
2119e3M6m3j10K73J12l05p6P5K2K53j74j18k36M00k17nJ14M8N5j17L01k26J09
2142A28l60K33k8J07l15Q8p3j0K58K12k51J83j43K71l44J18J80j11j37k1K38o6
2164A57l63L0L35k37n4N0J65j19j67L04k61J92k31J63J86j93J50j37j88J78m0
2185h0p3K94l12K58j18p5M8R3K2J08r8N9l3m0M6j9j21L47l17l16K88L80j96l78
$$ plain form
2023 128 178 -92 -134 -143 -69 56 12 278 184 -11 -31 -104 86 125 72 149 11 -50 -145 -79 162 -155 -119 228 147 170
2049 170 -43 139 -178 -37 -184 14 115 -170 -147 -93 46 7 27 13 43 -101 -38 180 172 32 -76 -4 -28 -186
2073 -186 63 -281 -202 -87 -193 -164 32 116 -39 -23 183 5 259 99 -22 -99 -17 -71 -103 80 247 87 -209
2096 -209 -41 -102 -18 45 95 -82 114 -9 28 -101 186 -64 -194 -65 77 47 -34 -165 -193 141 -372 21 -53
2119 -53 -7 -50 -160 113 225 -80 -156 -81 -59 194 20 -98 -334 66 -151 -156 -42 6 61 -56 245 19 128
2142 128 -232 1 -27 80 -235 -147 -220 -230 28 240 -11 172 29 300 -44 74 254 143 6 -15 223 157
2164 157 -206 -176 159 -78 -132 -82 83 -36 -203 101 -160 32 -199 -36 150 -43 107 -30 -218 -40 -80
2185 -80 -153 141 -171 87 -31 -106 -58 35 57 165 67 126 93 53 99 80 -41 306 -11 -327 -39 341 145 -233
2209b33K19k12J03R1Ok7J00m2p1M2N4l0N3j55o0k8L29j00j1Q5k66q3R3M7Q0j67
2235a83K98j54J81k44J58L11l93L9j75J82j31O7q2K0O5l6J54k8j35J72l06K70
2257E0l8j3j83K72j35J97j74m6J32k77L83j58n0Q0k17L05j4k34J36j73J97K04
2279B44k49m3Ok5P5o5j60rK47k29L49k44J06k17K36r7n5rJ14K55m0j40j54q8P0
2304a22K16j85M2J74J27O9n46L84P2l69O1k22O14l70M2l1K14k04J42l45L21K4
2326A08q1O9k7J30m4j40j2j27K2j10J42L56k26j40k19K88k20K47r6JJ62P1j33
2349B1n1M41o45K90ln3o9j33M28l22K06j28J25R7k02o0J87j23KL5k9m3J03k95
2373b21R1Q6R0j30P6j31J77o6J40m5j62n7J23J15q7j96J57mj06K7rJ95j67K07
$$ plain form
2209 -233 -14 -226 -123 -32 -26 -53 47 5 -66 -24 30 0 53 -102 -162 -190 139 39 28 113 -153 -236 -143 -96 -16 -183
2235 -183 115 -39 142 -102 56 367 -26 13 -162 20 -111 -44 -126 -106 -41 -77 77 49 -86 86 -220 50
2257 50 12 -1 -184 88 -47 150 -24 -70 62 -215 168 10 -40 40 -177 128 114 -120 16 -157 40 244
2279 244 -5 -48 -42 -67 8 -57 -217 -226 21 -208 141 -103 3 -214 22 -75 -130 -139 -25 230 190 50 -104 -192 -122
2304 -122 94 -91 -49 125 252 321 -225 159 231 -138 -77 -299 315 -55 -13 -44 170 -34 108 -237 84 108
2326 108 27 96 69 199 155 15 3 -124 -102 -212 -70 286 60 -80 -299 -11 -231 16 -80 -79 83 154 21
2349 21 -30 411 -234 56 53 0 -69 -202 226 -96 110 -18 107 204 2 -58 129 6 8 43 14 -29 74 -221
2373 -221 -130 -44 46 -84 -8 -139 38 -28 112 67 -95 -152 -29 86 -1 -197 -40 -44 -150 -123 -132 63 -104 103
2397A03j56L09k88n6R6j26L40j92J15j40L3J55q8q6J4k35K22J87j30j11Q5J15
2419A66k07j04J85k80K47r9j86L91J31k05J2q3L8j47R2J25qj49J79RNr0Q4k36
2443a30J24j24K13j05j2K58k98K23K4k36p0m0j69J84J28J19j15l10K27o7K1J10
2465d5P4R1j17k95K04J18L8m3jO3j07N3p6K50j96J82k47P7J5o9J42j28J90l52
2489a79RJ92k66M47k06q6K78k99K64p4m7m4n8j6K72k51M2K5n5j44L02l17R9J55
2513D3J56n13L51M4k42R7k35J98P3J26j56L5m0M20n98J73J72r7P1K7j19J44k27
2536i7j22L40j62J1N6J50j25k55K26J59j15j18L0K2j9j07j2J01l6j79K67K65k66
2559A4k4j7m6l00L24j27K75n4j20J7J7L1M8J06k3l67L29J44p5j25J49j38l04K83
$$ plain form
2397 103 -53 256 -32 -88 8 -118 222 30 145 5 38 193 105 19 33 -202 20 207 77 -34 51 166
2419 166 -41 -145 40 -240 7 -92 -278 113 244 39 51 -32 6 -141 -49 76 68 -81 98 107 112 22 106 -130
2443 -130 -6 -130 83 -22 -34 224 -74 149 173 -63 -133 -173 -342 -158 -30 89 -26 -336 -109 -176 -155 -45
2465 -45 29 120 3 -292 -88 30 68 25 24 87 -20 33 -43 207 11 193 -54 23 38 -31 111 -17 173 -179
2489 -179 -170 22 -244 203 -3 -89 189 -110 154 80 33 -11 -69 -85 187 -64 -22 3 -52 -196 106 -211 -112 43
2513 43 199 -314 37 81 -161 -64 -299 -101 -28 98 -58 -23 -63 357 -241 -68 104 7 78 105 -14 130 -97
2536 -97 -219 121 -41 -30 26 176 51 -204 22 181 66 -52 -22 0 -19 -126 -138 -37 -73 -252 15 280 14
2559 14 -10 -27 -73 -373 -49 -176 99 45 -75 -58 -41 -10 38 144 121 -246 83 227 152 27 176 38 -266 17
2583A7j49j96J57L38l15J79k59M6L49k6j04M0q4j33J22J12k61L41l18J1J08j4
2605c9J86l52L19p5p9K98m01K93k14J49R7l44L2K51k61J18J53j24J66k60j66J41
2627a12K00O7j87K16j73j0M0K7k5K2J12k94l2M00m54L34n1j43k1q8J29M2l7j08
2651a46K10j22J62k3%P6j13k7L5J02l0j09m3J09l22J40J27k06K41k38K76j01Q3
2674H1K3j13L0k86K56j02K98k83P3P7k01j53L29j83J72J00k24K69m3k19j62L45
2696H4n9OK19M3k25n2j95J39P9j53J68mJ21o9r9q8o3K09n8J66p9P4l47L19k05
2721f9J91j02L1o1J0k2lP6j62K75k95j44K30J47M0L5j90jj10L34J22m69L13j92
2745a6K45k44KR4Pj44%P4n7nl01N78L1j38j35j8K96j56l43J84J68k93n8M17po22
$$ plain form
2583 17 -132 -328 -171 167 -148 31 -228 -182 167 141 37 77 -7 -140 -18 94 -167 174 -144 -133 -25 -39
2605 -39 147 -205 114 39 -40 258 -143 150 -64 85 182 -162 -130 121 -140 -22 131 7 173 -87 -253 -112
2627 -112 88 155 -32 184 11 1 41 68 43 65 177 -117 -149 251 -203 131 80 -63 -84 -172 -43 -1 -38 -146
2651 -146 64 -58 104 81 81 157 44 17 52 154 124 15 -28 81 -241 -101 26 -180 61 -177 99 -2 81
2674 81 104 -9 21 -265 -9 -111 187 -96 -23 54 -147 -300 29 -154 18 118 -106 163 120 -99 -261 84
2696 84 25 31 250 293 68 16 -179 -40 39 -114 54 50 171 102 3 -85 -148 61 3 169 90 164 -183 136 -69
2721 -69 122 20 51 -10 0 -22 -25 51 -111 164 -131 -275 -45 102 142 177 -13 -14 -124 210 332 -137 176 -16
2745 -16 229 -15 -13 81 88 -56 -56 18 -39 -44 -345 233 264 126 -9 -27 269 113 -230 -46 122 -171 -229 188 181 -441
2771d41P39n09J89J20l67K12R5j64j87M42M6l24k8J49j79J10q4j8J05J88j22P0
2793D2k05J35J81k57K90k16JL2L2K8K8k48J12K44l48j86L92J32j18j02j65M21
2815B25j83L4N2n2m2j40L6K02K5j45Nj22K73K18p8n25Q0Q5O7q5J49Q3j27m3p7
2840h5J49j09L19k89KJ25k02m4L4K96k36K72l32j90J32J76k6R2K5j95J70p6q5
2863g7J70q1j62J61p1J18q9L17N7m03J14j40J25j34K42j20p9J28k63K43q0k3k20
2886b67K16J09j92R5J56J0j16J7O9k5k61J2J48K3R6jj99O5J93j20q5m4L83k71
2910A1k12J09k50M20N8J26k19j49J12j67o9L79j98J97j29j35K9k23L81j87P2l16
2932c60M16J88l48q5J07jK34k07m6L09j33r0O8Mj03R2m3o8k0J00k37J32K03J6
$$ plain form
2771 -441 298 -211 -22 98 -269 -57 38 -126 -313 129 175 -149 -177 -28 -207 -97 -181 -199 -94 94 -28 42
2793 42 -163 -28 153 -104 186 -30 -29 3 35 63 91 -157 -45 199 -149 -335 57 189 71 -31 -196 225
2815 225 42 76 128 76 34 -106 -70 132 157 12 17 -105 168 386 308 -217 -137 -52 15 -70 79 162 35 -8 -85
2840 -85 64 -45 274 -15 -13 112 -90 -134 -100 196 -40 232 -100 -290 -158 18 -8 84 109 -86 84 8 -77
2863 -77 93 12 -150 11 -60 58 -31 286 343 -60 54 -86 39 -95 147 27 -52 76 -187 56 -24 -47 -267
2886 -267 -51 58 -134 -39 117 127 11 28 97 72 -189 -177 -29 -6 90 89 -110 -45 148 28 -57 -101 282 11
2910 11 -201 -92 -342 78 136 262 43 -106 6 -161 -230 149 -49 148 19 -116 -87 -310 71 -116 -44 -360
2932 -360 56 244 -104 -189 -82 -83 151 -56 -102 207 74 -16 52 56 -47 45 2 -66 -86 14 -223 -91 112 128
2956A28j78L0N8J68j83j78J55J16k13K69N2j37k55K09J87l74P8k74M06J08j23
2977D9J9J52j27J9k26j6J73q7l8j16K97k30K49k08J80L6k13P4j51M02N5j65K8
3000A56l32j8M9K16j22j46R1K75j69K63k94J10j19j99K22J77k80j35L08k5J58
3021A86j75J2L4j50k10L50K62m50J37L33m20N7nQ3j83J53l5J06O0j30J41m31M70
3044A95k02nN4j19K68l17K97k68l1K54j9q4q1n1J10J01k7l2l01N0L44j48o8M7
3068c3Lk2J65j58K73k13K26n74K86J79j98L4K5K2J62j61j4L38l54L52j80m06K44
3091dq7l3J71j04O9P6k75J06K68k99J23o3k46J46J54j04J22k00K07j58j67K21
3113g7l2J76J4j15l09M16n1Q4l71J4K78k8K4j58KK16k50K0M02m65L51J3k89J81
$$ plain form
2956 128 -50 -20 38 206 23 -155 0 116 -97 172 224 87 -168 41 228 -146 -68 -342 64 172 49
2977 49 68 220 93 112 -114 -130 43 -44 -82 -198 99 -131 118 -90 90 126 -87 -13 -164 238 293 128 156
3000 156 -176 -194 -145 71 -51 -197 -106 169 0 263 -31 79 -40 -239 -17 160 -120 -255 53 28 186
3021 186 11 23 57 -93 -303 47 309 -141 -4 329 -91 -34 -39 44 -139 14 -21 85 145 15 156 -275 195
3044 195 -7 -12 42 -77 191 -126 171 -97 -128 126 107 23 -58 -109 1 102 75 43 -258 -208 136 -12 -80 -33
3068 -33 -30 -52 113 -45 228 15 241 -333 -47 132 -66 -32 -7 15 177 16 2 340 -14 338 158 -248 -4
3091 -4 -91 -124 47 -57 12 88 -187 -81 187 -112 11 -52 -298 -152 2 -102 20 -180 27 -131 -298 -77
3113 -77 -109 67 81 -34 -343 73 22 106 -265 -251 27 -1 23 -135 -133 83 -167 -147 255 -210 141 154 -135 46
3137D6k46J56j8J7k07K08Q0r8L72L1j36k95Q9o4L93l81j81M90k26J64l21M1J76
3160I0q6m7J14j80n0K3pJ48j16L0J61%n8o9jJ30m6J36k81J07j03L35l75K45j40
3185d0m6M07M8k77j4o9J28k61J23J36j26j84M26l0m5l71L80k24J30k63J8J53j18
3208a19R9j18p0N6J12L3J98j18k06K27L9j60j25J24kN0J02l75K14j64J24J05K09
3231B35m03K95J3jkj56k07K68K45k37K6k27K91l02K32j51k5K07k0O3o7k67n0K25
3255a5m7jL7J19j42jm7J3o1K94o6p7J52m6K86l95J12k38N3J08q5J99k01j38K91
3280A04j19M4J5J35k68m5J62J35o23N61j69k52K73K56q4M8k74m7K07J71l14J04
3302B0j95J26M3M8j38L75j57p0rkM5j23j73j00M22k14K39k73l1K79Qk56J36j18
$$ plain form
3137 46 -200 -44 -62 -45 -252 -44 36 -62 310 341 205 -90 -1 -65 328 -53 -234 256 30 194 -127 -86 90
3160 90 4 -43 71 -109 -159 -136 -143 5 -111 -81 80 80 22 -47 -48 82 36 172 -109 -2 -105 230 -145 100 -40
3185 -40 -86 321 369 92 78 9 137 -124 -1 135 9 -175 251 221 176 -195 185 -39 91 -172 -154 -1 -119
3208 -119 -20 -138 -208 -152 -40 -7 191 73 -133 94 133 -27 -152 -28 -30 20 122 -253 -39 -203 -79 26 235
3231 235 -168 127 140 139 137 -19 -226 42 287 50 76 -151 140 -162 70 -81 -106 101 81 144 77 -190 -240 -15
3255 -15 -62 -63 -26 93 -49 -50 -97 -84 -145 149 83 6 158 112 398 3 115 -123 -70 38 -47 152 -49 -187 104
3280 104 -15 29 44 179 -89 -134 28 163 -460 101 -68 -320 -47 209 125 173 -101 -148 59 230 -84 20
3302 20 -175 -49 -6 42 -96 279 122 52 43 41 86 -37 -210 -310 112 -102 137 -136 -167 112 120 -136 0 -118
3326a18K71j99l5N3k1J22j74K37r8K25m96K00M1J23j82j11J77K88l48K00Pj21
3348D1J02k21j05J1J37k31L4L76l5l8l4k79L00K9J95l86p4J74nj11J17L1J8q1
3372c5k12K27O7oM9l79K15N7L37l52MK25l2j75O3J21j00j39K35k7j89rJ02j66
3396a19L04j29k2k76K48J5k4j02O0J53o09O60k78J56q0K5j29K35j77q9K50l17
3418b45L55J58k54J83p6k64K80K1l30l2R2N1M0p7J04J2J75l5l11J01R4J75m28
3441b11J00J7j2Q0Mj12K75l14j1J56lk06K72k37J72Q5k78N74m10J90k17J7J31
3464F2q5L8m1K5J21M3o9j49j65jK18j64J58l6J08K2j3m5N7l36J24K89j81J90k83
3489a13M3J78M4Oj01l07K48K7k11JL44l02o5J56J41k29n5J47J18j00o0m1K05j66
$$ plain form
3326 -118 153 -46 -81 -28 -49 73 -101 136 38 263 -233 -33 8 131 -51 -162 15 303 -45 155 162 41
3348 41 143 -78 -183 -172 -35 -266 -232 144 109 71 37 -242 58 87 282 -104 -178 -4 -9 -120 -3 28 46 -35
3372 -35 -247 -20 47 41 90 -289 -74 -17 320 -32 -28 197 165 -10 53 174 74 -65 170 143 -46 -55 47 -119
3396 -119 185 56 34 -242 6 21 -3 -105 -45 108 -501 159 -119 37 -43 -18 -147 88 -89 -178 72 -245
3418 -245 110 268 14 197 121 -143 137 158 -172 -204 -112 -61 -21 -98 6 18 193 158 -153 -52 42 217 -211
3441 -211 -111 -94 -106 -26 -22 -134 141 -173 -184 -28 -31 -237 35 -202 -30 55 -223 351 -59 131 -86 -69 62
3464 62 -23 15 -26 -1 120 163 94 -55 -220 -221 -3 -167 -9 -45 63 85 72 27 84 -252 -128 161 -20 170 -113
3489 -113 -70 108 152 158 57 -250 -2 25 -186 -185 159 -143 -208 -52 89 -140 -195 -48 70 -30 -90 -131 74 -92
3513i2J69nr6J01j86L26m21M60lk17J3K01l28M11m00J80k85P0J90R5R1n22L38
3536I0j98K92k18j04J0k0J86j3l7J39l20J13J34q6j6J04J07q0m1O6j03n7Kj86
3560b36J08K04q0J57k74M1J15m1J03K54k32k07P9j75j0K37J07j6J16l60n7J23
3582d4J73k70K4rJ10p1Q1m5K9Jj31J93L8j37k5n9L46j94l6j79J87l82L01N2N9
3607A2J18k39R1j94L68j61Rr9K34k5J09k46J29j40qJ35j20j74L25jj4j58l5J21
3631C7n0K46l23j6q9j55L95j69JJ13J28J40k01k92K88J17l1k00K13j42r6J39r7
3654d4R0rJ26l28M2K74j4j61j00L5P8k16M15j48J28k36K76Jj2l76J17k23K38J59
3678A12j11r4j26Q6J93j42M6K76l9k36KJ1K92j66l8K30j57j89j19L70j25P1K9
$$ plain form
3513 -92 77 72 -24 77 -109 217 -204 256 253 36 49 250 -78 333 -67 113 -172 -102 88 183 274 -248 90
3536 90 -108 184 -34 -138 -128 -148 38 25 -12 127 -193 -80 54 -32 -48 56 163 83 42 108 5 -52 -50 -236
3560 -236 -128 76 -4 153 -121 -80 35 -6 97 351 119 -88 -9 -184 -194 43 150 134 250 -110 -167 -44
3582 -44 129 -141 -117 -126 -16 -87 -6 -51 -22 -21 -152 41 79 -58 -83 -142 204 10 -26 -205 -18 -400 -99 -47 12
3607 12 130 -109 -18 -212 156 -5 4 -95 139 114 223 -23 106 -34 -42 93 -27 -201 124 123 109 -49 -84 37
3631 37 -13 233 -90 -106 -195 -350 45 -124 -123 -10 118 258 57 -235 53 170 139 -61 152 10 -86 53 -44
3654 -44 46 37 163 -165 -123 151 137 -24 -124 -89 -11 -227 188 40 168 -68 208 209 197 -179 -62 -285 -47 112
3678 112 1 -93 -219 -133 60 -82 -36 240 201 -35 -33 -22 270 104 66 296 139 -50 -169 201 76 147 176
3701A76J14l58N3l12L95J64k49j37K00J8m9k0K06k37J19j90R9K27j16l1j55l57
3723d40M09K69j46j10O9M5p4l5J22k6Q6k26MK43k54J16j24K5J29L1o8o9j00J09
3747a5k99L34J06p4K43k4l47J69j05j9J47l39J70J69j51L15j94l19K08k3n1j73
3769b72K23j44J61o6L13l78P5n6J46j63J63J2L06k95P0J19k12o3K3J7J5r9K97
3792A92j85j80LR6J30R6j93j02K77k3l03M20m19J43r6K60k64Nk4J97j58k5J86
3815C3J19l47K96n2j19R1J94m70K51O0J0j52J63J9k11Q9k86M42k79J34R1J0j4
3838G2Q5j04P0Q5Q3l58j45J47m9p5L36k88M51o11J22K23m7J81k37RO8M9J47l67
3862a53J33j16L15j88ll5N2J42j94J4J57o0j81P7K58j62j49QR8k15K31j2M3K2
$$ plain form
3701 176 290 -68 -15 -327 68 232 -17 -154 46 64 15 -5 201 -36 83 -107 -8 219 103 72 -83 -440
3723 -440 -31 238 92 -18 51 96 22 -13 109 83 169 -57 -53 190 -64 52 -72 -47 82 113 45 -24 -124 -15
3747 -15 -314 20 126 52 295 271 -76 93 -12 -31 116 -223 -53 116 -35 280 86 -233 -25 -48 -99 -272
3769 -272 -49 -193 -32 -98 215 -163 -88 -144 2 -161 2 14 320 25 95 214 2 -61 -38 -21 -6 -105 192
3792 192 7 -173 -170 -74 56 152 -41 -143 134 111 -192 228 -191 -48 -144 116 -148 -143 -167 30 -128 -153 33
3815 33 152 -195 101 49 -70 21 215 -255 -4 56 66 -86 77 96 -115 -26 -312 130 -149 -15 76 86 72
3838 72 157 53 123 208 291 -67 -212 -65 -114 -189 147 -141 310 -301 -179 44 -3 178 -59 -50 18 67 214 -153
3862 -153 -20 -136 179 -9 -12 -47 5 147 -47 -33 124 64 -117 -40 218 56 -93 -85 13 -202 29 17 60 82
3886H2k39K87j76m2j13L62Nl02J73Q8k17K75o8j79j69J40J64K9J26q9k5K71m06
3909b3J89L4L3j40M0k18k8J36l8r0K75j59J61j42N8l7j20K22j57l5M7q1L12k9
3933B10n0k70l9J45J77l94K93p9J62K8k03K47q2P3m44P2J14K6J73l60K54L6l18
3956b29M31j71Q8j60K6mp5k0O3k0J43o5R2j16P5k51O5rL9O0j02N4M8L0j14J81
3982E9Jo7J63q6K02n61L54j2J7j21L57m31L5o4K15k66M68l05J09k9L30k35k26
4005i3L51l41j53K92m2j13K10N7j15l04L45l74M51k17m9J24J24j07M7p2J60l57
4027a76L86k62K42l77J82o7J18r3k20J22M04j16m09J26J38J93j00j64J03j00R4
4048B4J47r9j63J32o1q9K23J21l88j84J20J99L26l87n7O1K31k08L64m75j21L72
$$ plain form
3886 82 -157 130 -46 -88 -201 161 166 -136 37 125 -92 183 115 -64 -233 -93 71 100 226 137 112 383 -23
3909 -23 166 200 233 93 133 -85 -113 23 -15 -105 170 11 172 30 88 51 -69 153 -4 -39 8 -73 239 210
3933 210 160 -110 -149 -4 173 -221 72 -7 155 183 -20 227 145 218 -226 -154 -40 -14 159 -201 53 89 -229
3956 -229 202 31 119 -41 -15 -19 -94 -114 -51 -71 72 7 99 -17 58 -193 -128 -137 -98 -38 -140 -86 -38 -8 -122 59
3982 59 60 -7 156 70 272 -289 65 53 70 -51 306 -125 -90 -154 61 -205 263 -42 67 38 368 133 -93
4005 -93 258 -83 -236 56 14 -99 111 168 53 -251 94 -280 171 -46 -95 29 153 46 93 21 181 -176
4027 -176 210 -52 190 -187 -5 -72 46 -47 -267 -145 259 143 -266 -140 -2 191 91 -73 30 -70 24
4048 24 171 72 -91 41 -20 -109 114 235 -153 -337 -217 -18 308 -79 -136 -75 156 -52 312 -163 -284 88
4070H8k08j8K11p0l0J08o0N8j12j72K36j74PL4j11J75J28j78j76J73J45j01n6
4093a03L28j87P9J42k27o4p7J31M7k9O3O4j99m8j92M91m88L16N5j25j14n3J52
4116c8qN4k51L3J28OL0K34m01j1J39M0n6%M4J03o0K26k70j1k10K30J51j12K52
4141B42l45K45o9P9M4k24Q6j57J64r4k76L53j45K11p1k11L39jk22j38J46j53M5
4164a52J18j25L15l91M27Nj95M26n28JM03m79L99k52j58J25j49L36m07L81L4N2
4186A86j71J92l36p3K72n5NP0q3r6N8m4J54l4j87J51l9j63R2J49J51l33l2M6J92
4211G2q7o6PJ06j72o1R3K42k25l2J16j51N1N0J13j37K19j6m6j46q1J90l1r5K08
4236A21j23J1J47k15J51K7Q6m34L00m6l45L01M3J52j98k3qJ15J66m08L15j77R7
$$ plain form
4070 88 -120 -138 73 3 -27 81 21 79 -33 -205 31 -143 -136 -102 -213 -38 90 -88 -264 -91 54 -47 -103
4093 -103 225 38 117 259 32 -32 -109 22 69 40 103 167 -32 -80 -272 219 -269 47 102 -23 -137 -190 -38
4116 -38 -46 8 -243 -210 -82 -76 -46 188 -213 -224 -85 -45 -101 -101 -57 46 -14 212 -58 -69 -279 -49 102 -10 242
4141 242 -103 142 73 152 196 -28 58 -99 65 -29 -305 48 -97 114 43 -168 171 170 -52 -190 -44 -197 -152
4164 -152 -34 -159 156 -235 192 197 2 428 -100 -99 304 -175 224 -28 -186 -61 -210 126 -281 100 134 186
4186 186 15 207 -129 -202 70 15 20 90 7 -89 -31 -75 79 45 -142 9 -30 -193 -101 48 199 -134 -166 -120 72
4211 72 -15 -81 -74 32 -140 -201 -108 134 -91 -123 -7 -158 -107 -57 56 -81 138 122 76 -70 -151 39 8 -87 121
4236 121 -2 9 156 -59 92 119 205 -229 71 25 -320 -19 24 176 -22 -45 -53 62 228 -180 135 -42 55
4259E5j46j25K19J23l94M23j10P3L2k26mJ2L94l41J32m6N0J89k19l1Q0r9m0Q1
4283H2q1P4K78k92k72L25j05K7n3J88j36p5O0J20k22N4J64j15J30k57p3K33L53
4306D07m20o7L7jL4J02p0K42j03l04J25J9j74K44Q8j42m4K96r9K3j13k57J59J21
4330A03j37N2L07o91L77o7j20J91l9M4M4k00L13k01J70n3j18J20J50J8l51l0M5
4353g3M31l69J52j96l4j10J65L3k21J65J51j1j66k6O9mj15Q0RK6j66J58Q4J4K15
4378B61l18j05J30PQ2j54j2J37J31o5n5J24j75j99J91L07l61n8J25J40k09O0j03
4401a19J10r1n7M54k87j20J50j86J19l3n8K3K87j01L9j8j95n8NK73n11J87J61
4424b6J10p3j2q9J27L01k29o8K18J01l49MNl24J38J0J80j87M62l26k75J47L62
$$ plain form
4259 55 -91 -216 3 126 -268 155 45 118 150 -76 -80 -68 326 -15 117 71 121 310 91 60 140 41 1 82
4283 82 1 75 353 61 -211 114 9 36 -17 171 35 -40 20 140 -82 -28 136 21 151 -106 -179 54 407
4306 407 -13 -80 -43 -44 -10 92 22 264 161 -143 -18 1 -173 71 159 17 -27 269 170 193 80 -177 -18 103
4330 103 -34 18 325 -366 11 -56 -176 15 -24 20 64 -136 177 -24 146 93 -25 95 245 263 -88 -118 -73
4353 -73 358 -11 141 -55 -89 -199 -34 -1 -222 -57 94 83 -83 -109 -40 -44 -159 -79 -70 -44 -210 -52 32 46 261
4378 261 -57 -162 -32 -25 57 -97 -109 28 159 94 39 163 -12 -211 -20 287 -74 -132 -7 133 -76 -16 -119
4401 -119 -9 -100 -157 297 10 -110 40 -146 -27 -60 -118 -95 192 91 130 112 -83 -141 -136 137 -374 -187 -26
4424 -26 84 11 -1 -90 37 338 109 41 259 360 11 15 20 -304 -166 -156 24 -163 299 -27 -302 -155 207
4447B07j58Q7N3j76N8k30K78N3j8l27j28M30j95jK03k06p7j30L10R8k23k6J93
4470G5J46l44K7J09k6Q3l9J23j13j93K08K23l10j78K67L30n03o6K96k33K83k50
4492h5K81k07J99k49J47j81k58L78k37M87l47M03k87j17l0p4M05m25L06j57K42
4513A94k93Ol2K47j70l59M63k17K17j93k4L31k91K59m58L18j80M30j97m53M54
4534E2j96L43k18J42j15k28L14J71j49j60J11n4m9m1J86pk42K01k69K29p2J71
4556A20k52L37k30K62k23J82l15K37r5O5k8l1nk99N76l30k15K14K21m6K4j16K02
4579B55j83p8M5k26K13p9L26m48j37K17l4L43j79O7m1k10o7J73J35J57j39j80
4601g0J14J04j5J19l10Q6J59j76Q5k36J96o5l9K22k03L03m45K65n0m2j22J79k82
$$ plain form
4447 207 49 136 189 13 71 -159 119 172 154 -173 -301 129 -66 -67 136 -70 -147 -277 33 131 -92 -118 75
4470 75 221 -123 -96 13 -13 70 31 154 41 -152 56 279 -31 -209 58 388 -115 -181 115 -118 165 -85
4492 -85 196 -11 188 -61 86 -95 -353 25 -212 275 -72 331 44 -73 -103 -177 228 -197 109 -48 194
4513 194 -99 -93 -125 122 -48 -407 56 -161 56 -137 -161 170 -121 138 -320 -2 -182 248 51 -402 52
4534 52 -144 199 -19 123 8 -220 94 265 116 -44 67 13 -36 -77 109 102 -140 61 -208 21 -51 120
4556 120 -132 205 -25 237 14 196 -119 118 23 88 60 29 24 -275 301 -29 -244 -30 191 145 169 53 255
4579 255 72 -6 39 -187 26 -53 273 -175 -312 -95 -129 214 35 102 61 -149 -216 -43 92 249 110 -70
4601 -70 44 148 133 252 -58 28 187 11 96 -140 56 -9 -48 174 -29 274 -171 94 44 2 -120 59 -223
4624b23L48J9j58m0N6Qk44K91j35m2J11k09M2P7m8J73j2N0J40j78J75q8k44K64
4648A33j40K45l32L37l28j88J73L14n14L48k11K99j47J41j45O7p4k38L51m3j98
4669a50J39j59K66J40m48K18J4m8r8J17K6K97m05j34M18j61P5k84k19M36j40r9
4691a99K04j00jM4N8J35j69K04j52R7j4K5k78J28%q6L12j47l55K11J39k2N0k8
4715E6lk24L89L3j64k74K9L71l13J2L78m20K08J3k08K94jm11R1k9L42O3k08r4
4739g0J94j36L3lK69j96oj69R3M2l10K11J72ko5q7J48r6M2K13m59K73l29q0M57
4764A39j38P2k9l44K43K3K4p7P5J4J96p8k23R9Q8q3q2J90j13J11j37J09m5K2P5
4789A31k3N5k49oJ65nr3k72Q8K99j80J42k98J56J91j59J66J21j34N8l3n8q0k02
$$ plain form
4624 -223 125 144 -14 -54 2 10 -234 57 -78 -120 -9 -218 -176 -99 -147 26 14 64 204 26 201 113 -131 133
4648 133 -7 238 -94 243 -85 -273 -100 214 -300 48 -163 136 -11 130 -15 52 -22 -260 91 48 -150
4669 -150 -11 -170 96 236 -212 6 20 -28 -126 -9 17 314 -91 -225 193 32 107 -177 -396 40 -100 -199
4691 -199 5 -95 -96 -52 6 141 -28 176 24 121 107 132 -146 -18 -18 -104 208 61 -294 -83 56 34 84 56
4715 56 53 -171 218 251 87 -187 -158 213 -100 -88 290 -130 78 91 -117 177 176 -235 -144 -173 169 232 24 -70
4739 -70 124 -12 21 18 287 91 85 -84 9 51 -259 -48 124 122 57 -30 118 22 64 277 -182 91 -238 -318 139
4764 139 1 73 44 -300 -57 -34 -10 -87 -12 2 198 120 -103 -4 84 1 -81 109 -4 107 -30 79 34 56 131
4789 131 108 163 -86 -92 73 68 -25 -297 -209 90 -90 52 -246 -90 101 -58 108 229 95 153 120 62 -18 -220
4813b20K37M3J59k95q2L0J42m4R7j56J64r9K17k89K09l7k55L37l83J51J16k3J5
4836C4k4r5J22o3M4K04l69M3J18J3J32k13j1K23k85J50Lk28J06J65K5j83Q3J95
4860A89k92J13r2J26j13n6L58Q7l38L47l33M85o41K89j69k95K89JK94k74q5Q1
4882b9J0j57J23q3j1K10k65L76j43pK9J07k73J19K1K4m19L45j51q7L6K40J20j31
4906Dj59J50L3J45j66k8m54N12R3j21n5K37k76n3l6M9Q0J06l48R6J89j0j8lN2
4931A9r0q3J63k05J30P1N8K6Kk39J10K29M6l32Km0m6K87Q5m8l43l8L92J5k75O
4957i8Q6j87K87p3P7k71J54P9j77K21l50L27q5l17J09P7P0Kk4L94m21K57mK2m06
4982b51N28k74P7j17k13L44j00M6K22m8j35kJ8oj85r9J05M0rK94m06J3P8j15M40
$$ plain form
4813 -220 17 60 219 -76 -158 -128 14 -30 67 -89 75 -24 193 -96 113 76 -179 158 -225 -74 42 19 34
4836 34 10 -85 37 -26 18 222 -147 -104 14 27 159 -54 -65 158 -127 23 26 -202 -96 69 94 -89 -6 189
4860 189 -103 10 -82 44 -69 -125 233 320 -18 329 -4 481 -160 129 -40 -335 -46 -45 249 -25 -110 -29
4882 -29 -19 -176 -53 -136 -147 63 -202 174 31 24 53 160 -113 6 27 51 -368 -23 -174 -261 -225 15 135 4
4906 4 -155 -5 28 173 7 -21 -475 37 130 9 -46 191 -85 -138 -174 -125 -45 61 -287 -191 -2 -12 -30 -33 19
4931 19 -71 -154 9 -196 -66 5 63 89 91 -148 -38 191 237 -95 -93 -133 -179 108 193 145 -198 -236 156 171 -104 -98
4957 -98 -12 -199 88 15 92 -179 -25 54 -123 98 -252 75 -10 -327 -218 -141 -71 -69 -93 301 -120 137 133 155 -251
4982 -251 277 3 80 -37 -250 94 -6 40 262 214 79 77 95 89 -96 -195 -90 -50 -59 235 -171 -158 -80 -195 245
5007B45l35J30l33J64K22l09K46j64j40L02m4m3r2j30M41j23J73Kj56l42Q3P5
5029a28J45p5J4j98L66k73n3K48N0k37K32N6J76p1k56lm78M94Ll0K32j70j10j05
5053a71M11l87L21j56j5N34m76m9r2j02Q9M3L8N5r4K20k03k06Q9J03j43L01n8
5076E2L3k88J57l5J79j50J37O7j22k63K67q6K65l88r6K81j71R8j51K83J92j98
5098F3K11k67J89j74j60k35L23j18K85o7p4j23m8J93M6j39J63K2m4L2n9j23J02
5121bJ05j70p3O6j07L56k23n6K24k65O9N9m90N82O2k39J20K0l7J90k23r0J69p8
5145c1MJ5N1j16P8j92N2J51n2K39j32N1k16K29J50k19j3J69l64Q5R5O5J32k03
5169B8j5LJ7j1p4L0j57L01j63L6M2k65N1K09p0r8L3J26O5j66L19l36pJ02K13P4
$$ plain form
5007 245 -90 40 -293 -129 93 -216 30 -134 -274 28 -16 -59 -151 -281 160 37 210 212 56 -286 -203 -128
5029 -128 17 -58 -44 -242 124 -149 -202 46 96 -141 91 147 323 252 -4 -7 -485 9 12 -18 214 44 -66 -171
5053 -171 240 -147 174 18 3 537 61 12 -80 -182 -93 -50 -12 43 -51 169 -34 -240 -151 -48 -191 110 52
5076 52 85 -203 -46 -81 98 -52 85 152 30 -233 34 -52 213 -175 -271 10 -161 -63 -214 69 261 63
5098 63 274 7 196 22 -138 -373 -50 -168 117 50 -24 -147 -195 -2 44 -95 68 90 46 78 19 -104 -2
5121 -2 103 -67 -140 -74 -181 175 -48 -104 120 -145 -76 -17 -507 75 137 -102 18 38 1 191 -32 -122 47 -31
5145 -31 -27 -12 39 -77 1 -191 -139 12 -40 199 67 118 -98 131 281 62 49 218 -146 -61 34 99 231 28
5169 28 13 16 33 22 -52 -22 -179 122 -41 -5 37 -228 -177 32 -38 -136 -103 23 88 -78 241 -95 -102 0 213 287
5195B87l74M8n4J73j94M4K49k44K0K9J14J20l65J90j6J17p1P6k0p4Q4K5j92n5
5219h3J86k67J72q1K21k55K46j70l31K46k5J05j43K55j10R5k38J48j6J66j37J67
5241A51k40J7l1L83j44m16L05J63j86P7j88J51J68j87mJ25n9o7j49J59qJ47k62
5264i5J43O0k12P5J95L4l25P3p4k9J16o1M6K13j20j0J21K3k29J46l11L59p0j13
5288d5k19L75l11N3J58k93J62k1j03M09j36k9J97l67p5L47K31l18k6K2K01J51
5310C63m77J06j44P2J29M7l1qP9J3k91K17k39K44k10K06k8j60k5K1L3k2m1K13
5334F7k01K27j3j57J34J40j91nK8K08k8j98p7Q5J53k72P5q6P5J55r7R6r8l48L18
5359a0r3l8J93l3o7L7j45J08m8o5M02l25n0J89j38J19j04J08k83L24P6l75J17
$$ plain form
5195 287 -87 -39 -93 80 -114 -70 179 -65 -45 -16 98 218 -147 43 27 144 73 149 129 55 139 164 -28 -83
5219 -83 103 -164 8 -73 148 -107 139 -31 -362 -116 -141 -36 -179 76 -34 61 -177 -29 -45 121 -16 151
5241 151 -89 -72 -103 280 136 -280 25 188 2 79 -109 42 210 23 19 144 85 18 -131 28 20 167 -95
5264 -95 48 108 -104 -29 166 200 -125 -52 -126 -155 -39 -100 -54 159 39 29 150 173 -56 90 -221 138 68 -45
5288 -45 -264 111 -200 -147 11 -282 -120 -141 -244 165 29 0 197 -170 -245 102 333 15 -11 11 212 363
5310 363 -114 -8 -152 -80 49 96 65 57 136 149 -142 75 -164 80 -130 76 48 -112 -137 -116 -83 -105 -146 67
5334 67 -134 93 80 -77 57 197 6 1 29 237 209 11 -66 19 172 -100 -25 -111 -36 119 22 118 20 -328 -10
5359 -10 -103 -141 52 19 -48 -11 -156 -48 -96 -161 241 -84 -134 55 -83 36 -68 40 -243 81 157 -218 -101
5382a01J43K04j72q9Q4l62K66K89l02j5q2L52j7k14K03l34J04P2m60K82J03j7
5404f3L13k93K81k24J10j20Q6k99J66r3J25k55K40K61k30O7j22p8K23M9q6j25
5426f7j3P1J14j45j32K94k48K90l42K6K18q2j04J52j92K29J15k83J74p1o2K03
5448A45r7O1J64l24J72l61K06K26l3k08L69j70l8j66J22M3j81J07m0o2L21l63
5470a07J26j21Q9J46j39N6M2r2r6l0J25q0J23j66J63r2lprJ40k80K18j6o0o7K81
5496A44j29k28K74L1K12k48K9K0J82m40R7K98o8j42J45j91j30K23J55k11m1L8
5518B0k46M27j85J17L5j10q7L3Q8j03k20N75j55j25N5q4r2J08k81K61J3k9j22
5541a07J68k88p3J23N46j43j25K5p6m1n7q7K95om32K00LL68m92J55P6K5k57L01
$$ plain form
5382 -101 42 246 74 -15 69 -293 -27 262 -40 -55 -137 215 198 -16 187 -147 -43 29 -431 -149 -46 -63
5404 -63 250 -43 238 14 124 4 90 -209 -43 -136 -11 -266 -26 235 5 72 -50 -128 95 144 58 -67
5426 -67 -80 -9 105 -40 -172 122 -126 164 -178 -152 66 -16 -120 32 -160 69 184 -99 75 4 -58 145
5448 145 48 109 273 -51 121 -240 -34 192 159 -49 320 150 112 -54 68 111 -70 37 -3 -65 256 -107
5470 -107 19 -102 -13 133 -6 50 92 0 -96 -126 -1 -81 42 -124 39 -53 -56 -63 -72 68 -212 6 -10 -70 -137 144
5496 144 15 -213 61 92 304 56 85 105 287 -153 -56 242 174 32 177 -14 -144 79 234 23 -18 20
5518 20 -226 201 16 133 168 58 -29 4 92 -11 -231 344 189 64 119 35 -57 51 -230 31 44 15 -107
5541 -107 61 -227 -300 -177 369 226 101 126 50 9 -48 -135 160 154 -278 -78 -75 293 -199 -44 32 57 -200 101
5565A01j98L01k55k20J69J61l80M03J31k57P5L27k62k48K92k38N6p4L25j03j60
5586e4r8L21k28J90j30R4j89K05k86%LkJ37O9j82J00O3K82m02J63j48k33K99P7
5610E1m5j45J12J5k15K25k18K03k00L12j51rM3O0O9k25M0L17l78J76KJ29k10J46
5634A04j37Q1K01l04K43l27L57j79q2R1j65K69k89K37m8P2j7j33J01l1j47K86
5656A83j96p1M0J51j4o2Q2j27K00o5k52J76k1J18j53m2Q1j41L78k95Ro9J54L9
5680A03p7o3N7J24l62N68m30J01j84n1P6K70j60k09M17J7j50o3J42k99J5R8r0
5703a50J32J3k4M1k7r4K40j53K11k56J95k19k1j8l4K00J42k49J55o4P1j58K56
5726A89N0m53J70K36j40j91O7q3L07o3k22K88n8k97N6j36M95l28M38k72O2j41
$$ plain form
5565 101 -97 204 -51 -271 -102 59 -321 82 213 -44 31 358 96 -152 140 -98 -42 -116 209 106 -54
5586 -54 -152 169 -59 131 1 95 -94 111 -175 -175 -172 -174 -37 32 -150 -50 13 295 -107 56 -92 -325 -26 51
5610 51 6 -139 -27 -12 -227 -2 -220 -17 -217 95 -56 -65 -22 38 107 -118 -78 239 -139 37 39 168 -42 104
5634 104 -33 48 249 -55 188 -139 218 39 -43 48 -117 152 -137 100 52 124 107 -26 75 44 -103 183
5656 183 -13 -84 -44 107 93 31 113 -14 186 121 -131 45 24 142 -11 -53 28 -113 265 -30 -21 -90 64 103
5680 103 26 -37 20 144 -218 350 -80 21 -163 -214 -138 132 -28 -237 180 197 47 -16 126 -173 -158 -60 -150
5703 -150 -18 -5 -29 12 -15 -109 131 -22 189 -67 128 -91 -112 -130 -164 36 178 -71 84 20 91 -67 189
5726 189 239 -214 -44 192 52 -139 -72 -155 152 89 -133 155 97 -200 -144 -280 215 -113 325 53 115 -26
5748b6J39n9J17j76j0J37r4k22K35J38l06M0R1M3k2j51N8J22J66k90K84n4k68
5771a08J29j01J24j41M0J48k42K11q5L6J76j21J1J04k11k0J06N8l2R7k74O1n6
5794i0J57l96M24R9j85O9Q8p7rk6oom65N25L01m13Q4j7m2j77L1J60k4J21r3K54
5820B87j31l42J03K43J17j87k5N8r8j44m8O32m99j29R9J1P7J86k08K1j02j88L76
5843A09k22J89m0J27q1K0k8m3r3K88k07N1n5K7O4j6j05M1J56j21j21R1j24K74
5867A81k69o1J92r0n4J52j3j21j01J6%m5J94l40J47K87Q1j63j54J75P1j99j45
5890b59J18J30k51Q3J89j45O6J49j86J73r7L61m34J50j33K66k86l1J00J6J34%
5912A13k56L81j27j62R1J7j35K7q3K89j33k57J58R6j83L13k12j02jJ52J17k06
$$ plain form
5748 -26 113 54 171 -5 -15 122 28 -194 41 179 -127 -87 4 47 25 -126 -68 54 220 -70 214 160 -108
5771 -108 21 -80 44 -97 -57 91 -151 60 -25 11 187 66 77 181 -30 -50 56 114 82 179 -95 -34 -90
5794 -90 67 -329 95 194 9 78 166 89 80 54 48 42 -423 102 403 -10 74 57 15 -162 -131 29 5 126 33 287
5820 287 156 -186 -83 160 277 90 65 123 25 -119 -167 465 -34 -163 -64 -53 24 210 2 23 -79 -267 109
5843 109 -113 76 36 163 82 102 74 31 -62 226 19 70 15 42 106 90 -15 26 182 61 -60 31 -93 181
5867 181 -88 -149 43 -47 -101 51 38 -83 -184 -168 -168 -213 -19 -359 -212 75 156 -7 -161 14 85 -114 -259
5890 -259 -141 -11 -262 -179 10 -135 -69 80 -106 67 -30 331 -103 47 -86 180 -106 -137 -37 -21 113 113
5912 113 -143 238 111 -51 40 57 -78 -51 -134 155 22 -235 -77 19 -164 149 -63 -165 -166 -14 103 -103
5934a03J99J75k95K43j60o4j91r5K92k69M24r7k11J46m5j66n3J61K12j70J16j75
5956a26l8K13n9j30K30k07k8J65j37K6K2J84k17L32j59R4m33K85Q2m9m9M7k01
5979a53NL82l53K69j04n3M7l03L13Lj36J63M2k06L29ok54J10j11j80O7L3K41j35
6003A0j26K79l75K59o3J83l00K28r2nj10r7L71J00m66K57K20k50r1p0j4j99M05
6026E4K38k50k41k5L43k41R4J80Lk57K38j16O8J10j46j05k3J84k78K23j43o8j11
6049b69JK99j21L16j74j82J56k88L81nr0J34m07L32j49J9J58j1m8l01J95l79J91
6072b42J65n0l3J13k04J97J36k28L43l89K36Jn2j07K37J6kJ73l58M9J29n6r2j7
6096c5J16k35L13o8M2k21j02K03M9o3j47J61j05K48j31r6K6QJ98j62J76Q8j77
$$ plain form
5934 -103 96 271 -24 219 59 -5 -196 -291 1 -268 156 59 -152 -6 -51 -217 -270 -109 103 -67 49 -126
5956 -126 -164 49 -10 -140 90 -117 -145 20 -117 -91 -69 115 -102 230 71 165 -268 17 99 50 1 48 -153
5979 -153 -148 234 -119 150 46 -7 40 -263 50 53 -83 80 122 -84 245 239 -15 95 -16 -196 -129 -96 145 10
6003 10 -116 163 -212 47 -16 167 -133 95 3 -2 -112 -209 162 262 -204 53 273 23 -68 -138 -152 -351 54
6026 54 292 42 -199 -224 119 -122 -28 152 155 -102 136 20 88 198 52 -53 -76 108 -170 53 -90 -158 -269
6049 -269 -268 31 -90 226 52 -130 26 -262 119 114 24 158 -249 83 -66 -47 111 100 52 -249 -54 -433 -242
6072 -242 -77 -127 -160 -47 -251 -54 82 -146 197 -192 44 45 -7 -114 123 139 137 310 -48 1 130 74 -18 -35
6096 -35 81 -154 159 91 133 -88 -190 13 62 -1 -148 13 -92 156 25 -71 -45 -37 161 -1 175 263 86
6119H6l0M5k7n9l5K12k59Q4m2J13q7N2R5j79k02K39j64R5J5K48j64j05j9K3J32
6144F7j21pN5J48J52m38P2K36j5j63J41l15N16k48o6k21K52j17n4J08J0j03k3
6167a34K86l41J29J74q2Q8j30j15o0J63K56k01j63K25k33K70q1k97L70n8l69J49
6189a54J48o5J25l09J52%N8K8j03K49j23k04K99k02J31j14L05l11J38R7l44L83
6211A84k03L6k63M28q8r6L4j8j22K7p0K09j67K72q4J6j82N5J44O4j75q2OJ9K29
6236A73k15J8j6L34j54l35%K37M2JJ11k29N1J11j25K99l63JN4J5n8j31K99k52
6260a32K32j20k98K74K01J8k18J44l52J40K15m31K91P4l2L00l04M7J01l0k5K41
6282C36j14l0q9k81K05K26l16R1k64K21q8J29k41J56l7j7K81j22j10K3J58k46
$$ plain form
6119 86 56 101 74 15 -20 192 -67 17 -25 88 1 53 148 -31 -233 6 -158 -63 -48 200 36 -69 -88 -65 67
6144 67 -54 -61 -6 142 294 -144 -72 164 149 -14 127 -188 328 80 14 -207 45 -72 -126 -18 -8 -111 -134
6167 -134 152 -189 -60 114 32 120 -10 -125 -185 -22 234 33 -130 95 -138 132 51 -246 124 66 -303 -154
6189 -154 -6 -71 54 -255 -103 -103 -45 -17 -120 129 6 -198 101 -101 30 -84 221 -90 48 145 -199 184
6211 184 -19 17 -246 182 94 -2 32 14 -108 -81 -151 58 -109 163 79 95 -87 -32 112 176 1 -81 -75 -56 173
6236 173 -42 -24 -40 294 140 -195 -195 42 84 85 196 -33 18 129 4 303 -60 -59 -5 10 -48 -179 120 -132
6260 -132 100 -20 -318 -44 157 175 -43 101 -251 -111 104 -327 -36 38 6 306 2 49 150 120 95 336
6282 336 222 192 103 -178 27 253 -63 28 -236 -15 -103 26 -215 -59 -96 -113 168 46 -64 -41 117 -129
6304a29L54k79j3m2J69J15Km08O1R8m3J32j53L07q2l28o5N17l78K95j19J13J0
6327A34l19J6J08N1J29j81J77k62K11K77j50M1j8l62K86k90P5LmJ66j63j5M7J16
6351G3O0Q9l34j49j80O57j42j37J9jK64kj91J74l29J45l9p1M7j6J85l59R3L99
6375B55k01K3r9r3L39N9k20j97J13J83k84K8J97k20m8Q0M7r5k6J54J0j64J92n1
6399a8J86j41lj35L06j09j65K00J48m14K84k07k3L2j63K30k7rJ76j18l3m1P7P3
6423A06k27J93Q5n9l27K31J51q0L59k05k82j71L63j66r5K05J9k78L0J50k14K05
6445gK81k61M5j11j7j58K81j19J22k4Q3j78J24l31L70r4j11k27P5K11m7m1q9P34
6469E11m80k77M3M45r6p8k0j73K48j94j65J66J58K42l22J70k10J09M1j15J10j
$$ plain form
6304 -129 225 -54 -67 -109 60 175 177 -231 -170 -72 -115 17 -136 171 89 -239 -304 213 -165 130 11 124 134
6327 134 -185 -169 -61 -10 119 -62 115 -147 64 341 191 232 214 -148 138 -152 -77 -74 -78 88 -75 -90 -43 73
6351 73 133 222 -112 -261 -441 216 74 -63 -44 -45 219 217 26 200 -129 16 -23 -94 -47 -63 122 -237 -144 255
6375 255 54 77 -22 -115 224 283 63 -134 -21 162 -122 -94 103 -117 -165 -85 -38 -133 -159 -5 5 -159 33 -18
6399 -18 168 27 24 -111 195 86 -79 121 269 -145 139 -68 -91 -59 -222 8 -19 -28 148 30 -3 -44 33 106
6423 106 -121 72 157 98 -229 2 153 73 432 227 -55 -226 137 -29 -124 81 100 -178 -148 2 -212 -7
6445 -7 274 13 58 -53 -70 -228 53 -66 56 32 115 -63 61 -270 100 6 -105 -332 -257 -46 -93 -134 -223 511
6469 511 31 -246 -203 242 146 68 48 -125 123 -71 -236 -70 88 330 8 178 -32 77 118 3 113 112
6491A12j20K51l69j07L68rm85J15J29k1J54m3P9M3M8l66j4J51jK00j79L13l33
6514h4m6j6K06m5J32j35k23K74p3JR2Ok20N8K63l87P4J37R5k24k3K81k68o3J74
6539a4n6j5j14K09n3J8l0K1K71m67J9J05M6J11j96M3Pj43J68k9N0N5j55l0nK8
6565a56L16l05n2L12k46k00K83J76k27K7j54M31j93L7q3j13K62j81R7j99K01m4
6587a1Q5l58L15M9p6j9Q3ml31M12k2q6l09J77oj90M10J87k24Q2m31L46K62k61
6611H0J21ok30M9j82J05j5j57M08l35R4L1k9J08Q0k42J23L8Jk16K33j19qJ76k44
6636a36L50l06K99l00Q4N0j60J17k1k38n4L19M4O9j22Q6Q6k91j94K47J14k2Kk9
6660fn6R3m8m8M3R7l2l6r8M6L48j00k73j86j42N61m17M16J6k35o2J24l3K25j84
$$ plain form
6491 112 -8 243 -126 -233 135 126 -359 -244 -115 -136 18 -25 54 97 145 -221 -235 -84 -85 115 -64 249 -84
6514 -84 -130 -146 60 15 147 12 -211 63 -10 -9 83 89 -131 -73 190 -197 -123 14 109 -115 -138 143 -125 -188 -14
6539 -14 -70 -85 -199 10 -43 -25 -55 -34 237 -230 -211 -106 -60 51 -145 -102 -95 -238 -70 -99 -49 6 -149 -179 -184 -156
6565 -156 160 -145 -197 115 -131 -331 -48 128 -99 -72 -226 205 12 49 -34 -147 115 -66 31 -168 33 -11
6587 -11 74 -284 31 80 4 -15 68 64 -267 145 123 37 -272 -95 -101 -291 119 306 82 164 -267 79 341 80
6611 80 201 195 -35 14 -168 -63 -78 -235 173 -162 -68 -37 -66 42 122 -120 3 41 42 -174 59 -60 -68 108 -136
6636 -136 214 -92 207 -93 -9 41 -119 -2 -23 -261 -315 4 48 117 -5 81 167 -124 -318 -71 43 21 23 -6
6660 -6 -62 31 -17 -65 -22 75 43 7 -91 -45 303 203 -70 -256 -398 163 -254 162 178 -57 -119 5 -28 197 13
6685A3j30k11J87L62j74j28J11j29R6j50L40j09l5j21qK75j14l1j35L4K30M3l35
6708a19L58j20l2J25l30k6J0P9N1k58L83j42j17J40o4K03k01K55l56J54n9l5J0
6731i1Q5K41k85Q9R6l66K44k07J92k17L77K07l21J57j81r3R8Q1k19L4q4J76J51
6754A64j13oJ62r6K5J99l23K3j67R7J49k88L19k01n2J95L7k42M5m22M53J34j5
6777G7K0J41j90j57O7J31q6Rm2L2p1p7J30O3j72L06k43J26j85QJ51p0r1J11j94
6802b06L63l39%L06k6n5k77K53l2o0J66k3K3n4J4P5j93j69L49j12j4J03k11j19
6826b38J20K68rj49k18K41j9N9L27m00J52O0j75J80l32j86M56j75j35J61L7J20
6848A45P3j12j58j00M48o44K68J49m83M13o8l3K47j23j09K37j23J2j42r5K30O4
$$ plain form
6685 13 -117 -328 -141 221 47 -81 30 -99 -3 -153 187 78 43 -78 -86 189 75 44 -91 -57 173 216 -119
6708 -119 239 119 87 212 -118 -144 -134 -55 -4 -262 121 -21 -138 2 -62 141 -60 195 -161 -7 -66 -101 -91
6731 -91 -6 235 -50 39 135 -231 13 -194 -2 -219 158 365 44 201 20 -73 25 106 -113 -79 -163 13 164
6754 164 51 45 207 111 136 335 12 35 -132 -35 114 -174 145 -56 -108 87 124 -118 -73 -495 -42 92 77
6777 77 97 238 48 -109 -42 89 3 12 -30 2 -69 -146 -16 47 -125 181 -62 64 -121 -113 38 -32 -123 -12 -206
6802 -206 157 -182 -182 124 98 43 -234 19 -13 -73 93 70 93 39 53 128 -65 -234 115 3 -11 92 -119 -238
6826 -238 -118 150 141 -8 -226 15 -4 55 382 -18 134 194 19 199 -133 -319 137 -38 -173 -12 25 145
6848 145 218 106 -52 -152 296 -348 -80 69 -414 -1 -69 -102 145 22 -87 150 27 39 -103 -198 32 96
6870I6j75j05M7J48j19K54l6j10P5K6l31K57O1k3j90J68K80l23K12m80K06J88
6892A26p8j26J00J7o0J83q9J28k14n8Q7M4k2J6p1J43q9J22k94M6J75ok7j38j04
6917a89R3J55j59J30K00j17k48K15q4o4Q4L6L10n33L01k52J31j66K38l7n9j42
6939a57n7J28K36j02o7J27K6j75J37K7o9l62J92q1k6L02l01J48Q2Q3K6p3k22q9
6963b67K15J49j99J47L77p84K22K84m3J75n57J72J36O2k55J07J57j76O8K2J79
6984A91k85j87J31J11J19j3j43m9l5N9K83j79L4l85K85n4L56j13R4k58J02n4k21
7007b11L85l15J26m1j44L49J48l00m3K43k13K0J94k05m9J1J43J82j65J5r7o7j04
7030a38N7J22J43o9l2o1K0P3j23k0r4O3J93m34L66k39K02K4J06o7L9k06J53r6
$$ plain form
6870 96 -79 -184 -137 11 -108 146 110 0 75 101 -230 27 88 65 -125 43 323 0 212 -268 -62 126
6892 126 48 -78 22 39 -21 162 73 201 -13 -71 16 60 38 54 -17 126 37 159 -135 -89 86 80 53 -85 -189
6917 -189 -96 59 -100 30 230 113 -135 80 -4 -68 16 52 362 -171 130 -122 9 -157 81 44 -15 -157
6939 -157 -214 -86 150 48 -19 108 134 -41 96 123 54 -308 -116 -197 -223 79 -222 -74 8 91 117 44 -178 -267
6963 -267 -52 97 -102 45 422 -362 -140 144 101 276 -281 -109 27 89 -166 -59 98 -78 -10 12 191
6984 191 -94 -281 -150 -39 80 67 -76 -125 -160 -101 182 3 37 -348 -63 -117 239 126 220 -38 64 10 -211
7007 -211 174 -141 -15 -56 -200 149 297 -3 -46 197 -16 4 198 -7 -56 -45 98 280 115 130 33 -34 -138
7030 -138 -81 41 184 115 83 22 42 115 -8 -28 -122 -59 134 -300 66 -173 29 53 159 92 131 -75 78 -18
7054a8mJ33O9k18K9j61Q8J1K58j60j27P7J05q1rq0K35k81J08N5j13J94l24K79
7078F5l6j74J35j41K9J65J5K08m22J41j21K77K4k10q0kK3N4O8j01J61j32p6K0
7102a10M6K0K12J1j21K9k68K31r0j25o5J67Q5K07k21J4K6J80m06K80q0p4k18P7
7126a93O3j09L05r5J53j63K41l15L8J4P7R5j05r9K10l26L46m2O1r9Q7j67P0j46
7150i9J46k07L4K30k33P3rn1J71k24N34m81L51k85K69j40p7K8j57K26r5j13J1
7173i8J61J49j3r4k62J03J10O7j29R3j62j18R1K8JJ14k64J36K4j4r3j41L48l17
7197b80K09K28j93N0l5J50j29J25j4l80N31n6m2l3j22N5q6L87k80Rj95P4R0k63
7221b00K73k08K30l23J66j56J20RK60j93l71N44q0R8m1j30q7J06L12k94j19J77
$$ plain form
7054 -18 -22 111 180 -38 -9 -170 -82 -71 187 27 -100 -23 82 1 -8 -88 147 -134 -26 29 -84 110 -214 65
7078 65 29 -145 -10 -151 -122 43 58 266 -156 -15 -136 141 165 -45 -125 -127 -104 -50 18 -83 78 -54 -130 -110
7102 -110 -64 -44 168 179 58 87 -181 50 -40 -165 -230 -63 22 229 8 22 48 228 -178 102 22 -52 -270 -193
7126 -193 -130 -239 66 -29 124 -39 202 -113 -75 -61 16 111 6 -93 117 -209 137 95 156 57 144 -23 47 -99
7150 -99 47 -160 -126 104 -129 -56 -65 -116 55 -169 365 -116 235 -50 219 79 2 30 -127 99 4 -109 -98
7173 -98 63 212 199 105 -157 -54 56 123 -6 87 -75 -193 -102 -74 -73 41 -223 -87 -63 -77 -170 -311 37 -280
7197 -280 -71 157 -36 14 -21 129 0 125 111 -269 262 206 164 131 9 64 -22 365 85 94 -101 -27 63 -200
7221 -200 73 -135 95 -228 -62 -218 -98 -89 171 -22 -393 151 71 169 128 -2 -89 17 329 35 -84 93
7243I3j56O9J62l70K92l1m33M73k11Jr8N2K48m35J24L09R5j10N1k37K83m31N99
7266C39o73M23rk00K18l5J23j81j30N6Q4l62L87K45m61K4L18m1j73J51m82K97
7288h2J30M1j05M5k6j10K16k94K28J82k35K91m61K3L05k9j70L3J85m39N51m15
7310a36N5k42K05J59J67j73m03M27L17n98K73K16l31J71n5m22O92j80j54r1J35
7331C2n6j04K09j66J42P0k17l7L7l0L45k18j92J02K59j64l2j09J39k6K38m8k80
7354a06J33j73J70m5J57j96n8M8l08L98K4j77J13Q2P7l22K27r4M6j64J92K19n3
7377A90n5j4k94J03J32q6L8m0N9l5L33l78J55o1m9p7J50p7m3j7m0j6J94q6L8J56
7403A80m45J5L53k95K01o5J91k98N0NJ41p7j49K98P2k33j01J78m5J47p8j9m8J87
$$ plain form
7243 93 -63 6 168 -202 90 59 -374 99 -112 -111 -209 -157 91 -344 -220 89 184 74 125 -112 171 -260 339
7266 339 -334 89 80 -120 98 63 186 5 -125 -69 15 -347 40 285 -176 -152 166 125 -48 103 -379 -82
7288 -82 48 89 -16 29 3 -107 109 -185 43 225 -10 281 -180 -157 148 119 -51 -18 167 -272 279 -136
7310 -136 -81 -323 -118 41 208 35 -368 59 376 -222 51 267 -64 107 52 -370 322 142 -12 -103 32
7331 32 -24 -128 81 -85 57 127 -90 -127 -90 -120 225 7 -185 -83 176 12 -20 -129 10 -16 222 174 -106
7354 -106 27 -146 24 -21 136 -60 -118 -70 -378 20 44 -133 -20 62 139 -183 44 -50 -4 -168 24 243 190
7377 190 135 121 -173 -70 62 -24 14 -26 33 -2 331 -47 108 47 -2 -79 71 -6 -49 -66 -106 -122 72 -14 24 180
7403 180 -265 -250 103 -192 9 -56 135 -163 -113 -108 33 -44 -193 105 177 -56 -157 21 -24 123 45 26 -22 165
7427A65k69J71k69K21k81K94M5Q2j8j82l0j01K22l0l9J47J3j84O0L8J56l5p6j54
7451e4Q4k72R8L68k86K97j98o4K19k51J25k1J5K84l58k5j89L68j89R3K7l02K18
7474a3N4K4o8J11j5j8L2l95L36p1k61L77j09J81k69J22k5j3N5J26j77j31J34L7
7498B4k73J42L66p0r1l30K83k38N3J68j9q0J26p4k21J21k7K26j97K05J6j56R8
7521E2N5k2M0P1K7k83N1RK4K7j55o0jK40j47J96k56L08j24O0k9j2j06J5J14O8
7547A62k28J3K02j14P0j81K29j23Mo3J92j98M8k72K01J5q9R9L5l6J12m0J09j83
7571c6j09J77k77n7K08J63J16l73Nq5n0L34k11J53K17j29K7K01m93L43l55L69
7593A38l07J75J32l4q5K8j85K0K9J44r8J16mj62KJ5m8J13J82j58J4k69L32k08
$$ plain form
7427 165 -104 67 -202 19 -262 32 77 159 141 -41 -71 -172 50 20 -19 128 141 -43 17 55 211 176 100 -54
7451 -54 30 -242 -144 224 -62 235 37 -27 192 -59 66 45 60 344 -14 -39 -228 140 -49 44 71 -231 -13
7474 -13 41 65 -3 108 93 75 107 -288 48 -23 -284 93 -16 165 -104 18 -7 -20 35 161 -16 -147 -13 24
7498 24 -249 -107 259 189 98 -232 51 -187 -134 34 15 -65 61 -13 -234 -113 -140 86 -111 94 110 -46 52
7521 52 107 85 125 196 223 -60 -9 0 24 51 -104 -164 -165 75 -72 124 -132 176 52 112 83 71 -35 -20 94 162
7547 162 -66 -53 149 35 105 -76 153 30 34 -29 163 -35 13 -259 -58 -43 -132 -33 2 -34 78 38 147 -36
7571 -36 -145 32 -245 -302 -94 69 185 -188 -183 -268 -318 16 -195 -42 175 46 73 274 -219 124 -231 138
7593 138 -169 6 138 104 19 47 -138 -118 -89 55 -43 73 69 -93 -91 -76 -124 -11 171 13 27 -242 90 -118
7617a18l2M5N9J47k03J16P7mJ3K09j86j10n6l94M85N9J21m06K81j82n5K01k95
7640b28m4l0J13K29j20j24J00L2R4J77k28L06j08k74P9J95k52o9j34K80K07l53
7662a52L24k69l3n1L91k30k5L03l77J78j81J93O2l22J54L2j07J92j25R2J52k81
7684h0K57l08O5l5L68l85J69K2j77J16l06L79k17L5q1K87q2L0K5k66M23l63o3
7707a87J46K28j58J68k45J01ml7p9p3n0K36k04J75k4qnJ05R8l73L85n14M86q3
7731H4K19m98L25PJ05n9l02J27p6j8R7J17m16L56k64J17J66k05L76k74jq7N1L7
7755a6J41j35L0l25L35J06k37l8K88m1j64j49J48j29L66K4j72J39k23K19k09j64
7777b06J07R2r9K54J41k77k42L75l15J07K98j93K9j65n7m0K74k84K29n4Q6Q8k3
$$ plain form
7617 -118 -150 -105 -46 101 -102 14 91 87 100 309 123 13 -43 -437 48 107 228 -178 103 -79 -134 67 -228
7640 -228 -272 -302 -189 40 -80 -204 -104 -72 22 199 -29 277 169 -105 -26 169 -83 -152 -286 -6 201 -152
7662 -152 172 -97 -130 -181 210 -20 -45 258 -119 59 -122 71 133 -189 -35 -3 -110 82 -43 49 201 -80
7684 -80 177 -131 -66 -101 267 -118 51 73 -104 12 -294 85 -132 -97 -178 109 27 57 82 -184 239 -124 -187
7707 -187 -41 187 29 197 -48 53 49 12 -67 -140 -190 46 -158 17 -7 -15 -20 85 183 -190 195 -319 167 84
7731 84 303 -195 130 137 242 183 -119 8 -68 -86 11 128 -288 68 -196 -79 87 -118 258 -16 -17 -104 -53 -16
7755 -16 125 -10 20 -305 30 136 -101 -139 149 108 -56 -205 -57 -186 180 204 32 171 -52 167 -42 -206
7777 -206 -99 -7 -106 148 289 12 -230 145 -170 -63 235 42 71 -94 -151 -191 83 -201 28 -26 60 148 125
7800A25j31K24j55r1p4J90j08K42j92L6j46l6K02k10o2R1m5n4K25l38K41J37l6
7823C5l9j0j21J4K17L2L3P4k27l24L50k55J75O8j77K45k64M36m00J78l42K08J08
7846A4L1k09J76j63K34K0j51K15P7k15j04K1Q7j40q0K05j48K45J7Q7k36MJ92K5
7870B04k78J37j58j95L42p4K1O8k35M31k47K24k28j07L7k3R9Q3l05J75Q8j53Q4
7893a0j98K85P7k87N7L24j66j55k0M6P7J16m15K14P3M8j24J1J25K5K2L9j35N3
7917H2j74k0Q1k83M15m0m18M18q8rj53J09k4J28J03j27Q6O1k8j21m3j6K40k98
7941a19J37O0k58J93j38J68m8j82J49m1n2L59K0Lm60L44j72P7KJ09J2k72J57k57
7965b09K18K26k83k33J55P6O0j40K49j68J14r4L13l76K4L8nM57n10L98l12o5p3
$$ plain form
7800 125 -6 218 63 -28 -102 88 -20 222 30 66 -80 -116 86 -124 -186 -95 -140 -194 31 -307 -66 71 35
7823 35 -4 -14 -135 -121 96 128 161 235 8 -316 34 -221 -46 22 -155 90 -174 262 -138 40 -302 -94 14
7846 14 45 -164 12 -151 83 103 -48 167 244 29 -75 -54 33 -107 -187 18 -130 115 132 219 -17 -13 179 204
7870 204 -74 63 -95 -290 52 -22 -1 67 -168 263 16 240 12 -95 -58 -81 18 101 -204 -29 59 -94 -10
7893 -10 -208 77 154 -133 -76 248 82 -73 -93 -47 30 146 -269 -55 18 66 -58 -47 78 103 125 164 29 82
7917 82 -92 -112 -31 -314 101 61 -357 61 -27 -36 -189 -80 -104 24 127 0 86 147 119 -2 -45 -61 179 -119
7941 -119 18 78 -180 13 -125 43 -5 -187 -38 -79 -131 228 248 251 -209 135 -37 40 42 151 163 -109 48 -209
7965 -209 9 235 -48 -281 -126 -50 10 -130 119 -49 65 -29 284 -92 -68 -30 -35 422 -88 310 -2 -67 -140
7988a40K63K1NK07n16R4J55p2k90K50q2J50k3J49j57J76R3j65l6k61J36o9J64
8011E2J1N4J47k36p5L71m86p6L84j27j84M7K74l17L36o0p1p7J45J6j39j90K1L35
8035A55j64j56J25m1J10m8p8Q1J4o3j16K59j85N3R5o2o1J44l9J14j12q2r9J17
8059c9o5K44j65J92j71o6K49k63L5J46n0J62k62O8K85j71k05k71K99J15j5r9M
8082d3J90j05m6K37j65k64J87J62j42n5j16K89K9j0l10K21m2o8R8%o0J66j53K5
8106B5J61l68M79l83j0J7%P6l20K54J1J04j21J12j22N4Q3j38j20P6K31M2j25k7
8130ij90K40J92j16Q3k02r7K77l3j35p4Q5J89j61r2J9r7Q1o9m7%M1K51j68l4J02
8156C6q0M14m33J9p0J30m49L10K31k31K47k58L32l93K05j20J76kK4k0N5N7l8k79
$$ plain form
7988 -140 123 144 149 356 -160 -66 89 17 -273 -23 -105 45 22 171 14 190 283 118 82 -179 -43 -112 52
8011 52 63 117 264 28 -47 324 -162 -238 146 19 -165 -118 156 -161 175 115 44 -33 112 128 -11 -201 -180 155
8035 155 -9 -165 -40 -81 29 -19 -97 -16 -2 -65 -181 78 -107 -54 41 -21 -82 62 23 137 25 -57 -156 -39
8059 -39 -104 140 -25 167 -4 -70 179 -84 -49 97 47 209 -53 15 300 129 -76 -347 -48 67 52 -47 -43
8082 -43 147 42 -4 233 68 -196 -9 153 11 -44 -160 129 158 148 -162 59 17 -51 47 47 -13 153 0 25
8106 25 186 -182 297 -86 -96 -79 -79 -3 -323 -69 -58 46 -75 37 -85 -31 52 -86 -206 -130 101 143 18 -9
8130 -9 -199 41 233 117 200 -2 -99 178 145 10 -64 21 210 49 -43 -24 -121 -40 -109 -156 -156 -115 136 -32 -66 36
8156 36 -44 370 -63 -44 -114 16 -433 -123 108 -123 124 -134 198 -195 10 -110 66 64 88 68 123 180 142 -137
8180a37L3J46n7j56K29j20K04k47p0L67p3
$$ plain form
8180 -137 -104 42 -15 -171 58 -62 142 -105 -175 192 119
8191A19
$$ Imaginary data points
##PAGE= N=2
##DATA TABLE= (X++(I..I)), XYDATA
0@%%%%%%%%Qj6J6j6K4l2M0m8N6p2R5j19J36j60J93k33K77l22L73m32N01n76O57
31C50p49Q53r69J095j232J385j554J739j943K165k407K671k959L277l623L998
47B097m409M862n357N899o499P162p898Q722r649J0698j1897J3285j4911J6845
61H950j9194K2120k5876L0898l7997M8856o7684J09242l60225J69546M95429o98441
73c24376J24665N02185l09830j86204M58320j95910k25900L77402n2901m01427
83b33976K98438J46346l57650J02669K37747l19296k7333K74450j99313j48664
93b26582K92302l4813j81437J85393M6150j51857J57050O3940j91172Q1277J06416
104A46667j99695J4198J42295j73333m0621K01657j23633j29315K26095m917k09541
$$ plain form
0 0 0 0 0 0 0 0 0 0 8 -8 8 -8 16 -16 24 -24 32 -40 55 -64 72 -88 105 -128 149 -173 200 -232 269 -307 350
31 350 -399 454 -515 580 -652 733 -821 918 -1025 1140 -1267 1404 -1555 1722 -1901 2097
47 2097 -2312 2550 -2807 3092 -3407 3755 -4143 4579 -5070 5628 -6269 7016 -7895 8950
61 8950 -10244 11876 -14000 16898 -21099 27757 -39927 69315 -290910 -121364 374065 -324376
73 -324376 -199711 302474 -7356 -193560 264760 68850 -157050 220352 167451 -233976
83 -233976 64462 210808 -146842 -44173 193574 -125722 -153055 121395 -77918 -226582
93 -226582 65720 30907 -150530 34863 81013 -70844 86206 150146 -41026 40251 146667
104 146667 -53028 -38830 103465 -69868 -110489 91168 -32465 -161780 64315 59398 -150143
115a50143J39956R7187j82691P0173J38826j72034J0631K11427j26308j15679
125g8655K02322k1939j94499J00201N2516j66655N4833J02873j44240L452J59527
136F9736q8973p7701J53103O040j05887P3476K7784q6028N8173M8320r8986J6562
148d381P3888q3285l4914P2896m1009m3011O3868k9026n4547Q0085J8539o9028
160d9925N5785N7218o0548J6656N0937o6196j0608P0367n6331o3615O7590K05
172A1535o5877M2334K4216n7569L1725M2463o7226J416P7183l3368l9647O0543
184B7728P701l6962L4084q3n0134L2676K4615o6109p333M6434k9548k3041L6219
197c753j0480j5394M2906m494l4748L8937K4719m1408N662K8332k6825l060K3492
$$ plain form
115 -150143 -10187 87000 -95691 -25518 113308 -58726 -48095 163332 37024 -78655
125 -78655 123667 101728 -92771 7430 59946 -106709 -51876 50997 -93243 -89791 69736
136 69736 -19237 -96938 56165 62205 -43682 29794 57578 -28450 29723 78043 -20943 -4381
148 -4381 69507 -13778 -48692 24204 -16805 -59816 4052 -24974 -79521 564 19103 -49925
160 -49925 5860 63078 2530 19186 70123 3927 -6681 63686 7355 -56260 11330 11535
172 11535 -54342 -12008 12208 -45361 -13636 28827 -38399 -36983 40200 6832 -32815 27728
184 27728 35429 -1533 32551 32468 -17666 15010 39625 -26484 -33817 12617 -16931 -39972 -3753
197 -3753 -14233 -29627 13279 8785 -25963 12974 37693 -3715 1947 30279 3454 394 23886
210B3886k9732j1854M1793j2894m1091K2749J1895l0892Q170J4713k2180J3139
222a2298L0134k0419m297L7801l841k3901J3847q59k0190J0646k071k7639J1533
235a1554K1309k2068r754J9425k156l970J1437r466m254K5371k758k1519J8519
248H562J6381j8643j812J1729j2642k812Q980k0298j2556J9198k754j8284J2884
261a2067J1330p087J3541R628j6807N641J8600j6369j5845J7211K783j4223M346
274F82L935o324O529j237j8602K217J3151j1217p207J2884L338k69J1848M11o866
289C273J0397M375j3659l261M640o340l907J50o657K915J0628p897p830J3253
303H0O523j0206j396M812j31L301J275m620N221R775o415n563N274m294q665J22
$$ plain form
210 23886 -5846 -17700 24093 11199 -29892 -7143 4752 -26140 -17970 -3257 -25437 -12298
222 -12298 17836 -2583 -6880 30921 27080 3179 17026 16167 -4023 6623 4552 -23087 -11554
235 -11554 9755 -12313 -22067 -2642 -4798 -8768 2669 -6797 -11051 14320 11562 -9957 8562
248 8562 24943 6300 4488 16217 3575 763 9743 -10555 -23111 -3913 -6667 -24951 -12067
261 -12067 -737 -7824 5717 15345 -1462 4179 22779 6410 -9435 7776 10559 -3664 682
274 682 4617 -1707 4822 3585 -15017 -12800 351 -10866 -18073 -5189 -1851 -2120 9728 10139 3273
289 3273 13670 18045 4386 1125 5765 -575 -4482 -4332 -10989 -8074 2554 -5343 -13173 80
303 80 6603 -3603 -4999 -187 -318 2983 4258 -362 4859 14634 8219 2656 7930 3636 -5029 -4907
319d907l105p317O429O492n583K299J1471P83k405O38l480O27N728o229q162R967
335C246O431r834j953O869l100n703M20k779k056N087p29m560N942P243j211M81
351C794L310q60M77K044o059o045L062J104n381k103K663L026M95k802n52M612
367G85J81n576J82M467J846J061J806l32K061L438m294o793J075q38n128m50J140
384e369j682L560M947l890r65Q226L79o819J561N457j818k825J193n72M23J784
400C590l765l493L229J279m413j341K670j116n94J980P29L44L693K331j645j092
416B386K228P91l632m174R33J860j379k121P22J954O47j264k103J62K219L75k193
433b589J016L898O30o53J188K24m71K46k161l564J108K450k829l891J625J967
$$ plain form
319 -4907 -8012 -15329 -8900 -2408 -7991 -5692 5779 6562 4157 4795 1315 1942 7670 1441 -6721 3246
335 3246 9677 -157 -2110 4759 1659 -4044 -3624 -6403 -8459 -3372 -4101 -8661 -2719 4524 3313 3794
351 3794 7104 6244 6721 8765 2706 -3339 -277 827 -4554 -6657 -3994 -968 -473 -3275 -3827 785
367 785 966 -4610 -4428 39 1885 2946 4752 4420 6481 9919 5625 -1168 -93 -931 -6059 -6509 -5369
384 -5369 -7051 -3491 1456 -2434 -3399 4827 5206 -1613 -52 5405 3587 762 1955 1383 1806 3590
400 3590 -175 -3668 -439 840 -3573 -4914 -2244 -3360 -3954 -1974 -1245 -901 2792 5123 3478 2386
416 2386 4614 5405 1773 -2401 -1468 392 -987 -3108 -2386 -432 215 -1049 -3152 -2990 -771 -396 -2589
433 -2589 -1573 2325 2955 2302 3490 3714 3243 3489 1328 -2236 -1128 1322 -1507 -5398 -3773 -1806
449a806q92l16J443J835K045m69j167R93K584j713k078N76M12j277O59k2j519
466g12K80N32k394k777O69K162N21J84J475J579K140N79k378K64J962j993m192
483b099J006K267j824j615J099r7m08J213o74j561J232K089o01r04R39K016l93
500A685p4n6L8J647J65k897k203J621n38m002k35L658O73j934J575K832j240L23
518A038J888j933k026J924P14k518J672L026j662j393P00k930k336K913p07m686
534f316K844N049l217j732O171J705l132L03J705k350o41J570j867j854K376k34
550C80l353J573K066k307l66K616j219k775K181K619k899j27N072J186l622R34
566A959K453k515k808N82j326j975J841j91j732K649L575l122p43L843j485l764
$$ plain form
449 -1806 -2698 -3014 -1571 264 2309 1840 673 1666 4250 2537 459 1035 1447 170 829 807 -712
466 -712 -432 100 -2294 -5071 -4402 -2240 -1719 -1535 -60 1519 3659 4238 1860 2124 4086 2093 -2099
483 -2099 -1093 1174 -650 -2265 -1166 -1263 -1671 -458 -1132 -2693 -1461 628 27 -877 62 2078 1685
500 1685 1611 1555 1593 3240 3405 508 -1695 -74 -612 -4614 -4849 -1191 -518 -2452 -877 1955 715 1038
518 1038 2926 993 -1033 891 1605 -913 759 3785 2123 730 1430 -1500 -3836 -923 -1630 -6316
534 -6316 -3472 1577 -1640 -3372 2799 4504 1372 1675 3380 1030 389 1959 92 -1762 614 380
550 380 -2973 -1400 666 -1641 -2007 609 -610 -3385 -1204 1415 -1484 -1611 3461 4647 1025 1959
566 1959 4412 1897 -911 -329 -1655 -3630 -1789 -1980 -3712 -1063 2512 -610 -1353 2490 1005 -2759
582b759K732K607l480J183M586k304l900L256J091m712l69K125k215j263J875
597a547m68l01K979K66k003K062K358k229j062K927m03k946K21J526k248j292
613b160K665N29l089j3K315j482j484J291J453p32J143J089o14J393J532k003
629A833j353J254j319k797P39J750k020j99K802j198k500K412J267k056M45K328
645A388kj005J495J15r54P11l36j706L16N05j417r69J095k39j022j79J450n36
663a290O31J181J035p48O80N37m37j072Q0L48q52P8m21m48oL02j288l15J262k26
683i69r26J193J305n32O47J139l14j155J107j76j331L10L24o80p58n8o78l57N97
702a312k78J59J254R11n18L36R41l93o44M15K73p25k96P40n05k15j73k66j201
$$ plain form
582 -2759 -27 2580 -900 283 4869 2565 -1335 1921 3012 -1700 -2069 56 -2159 -3422 -1547
597 -1547 -2015 -2316 663 929 -1074 988 3346 1117 55 2982 2579 -367 -146 1380 -868 -2160
613 -2160 505 1034 -2055 -2068 247 -1235 -2719 -1428 25 -707 436 1525 911 2304 3836 1833
629 1833 480 1734 415 -2382 -1643 107 -1913 -2112 690 -508 -3008 -596 671 -1385 -940 1388
645 1388 1386 381 1876 1991 1037 1748 1412 -294 22 527 -890 -1859 -764 -1003 -2025 -2204 -754 -1290
663 -1290 -659 522 1557 809 1489 2026 1589 517 597 945 93 171 -250 -698 -704 -402 -1690 -2005 -743 -969
683 -969 -1895 -702 603 71 718 1857 1543 388 1495 1319 -12 298 622 -58 -816 -874 -1552 -1909 -1312
702 -1312 -1590 -1431 -177 734 216 552 1493 1100 456 871 1144 419 123 863 358 143 -30 -296 -1497
721a497m2q7l7P10M31K42M56J009J83p52O2Q98n72j004O22K93j067m97M09o74
741i14k29j94J85mN88M95l2M26J01j94M58N72k70m01R45l32j205q27P93m41j477
762a957J54Q64l8k8J068L83j11j88L15m89M09l98Q93L3j98O3l13K57q85p46k5
783i37j3m45j47Q01Q57k12L4Q99K70m20j05N83K4n65m53L22l78o02l71M09k28
804f77l75J96O67L7o24K96N07M22l57K81Q28J31n61L25j31j97j407l53J26M4m13
825a235N38N76J17l04K42K38l52j58L57P14n41N00M03J05n54m87j40j85m91n56
845a213J97M96p4l33N88N62l45J71O50J9j93K2N34l14p36l7L26o44k90K19N7j04
867d42j04l10M48N39o59j17M63R54n8j72O68j35o38j03J02q46m47N26p0j02k09
$$ plain form
721 -1497 -1539 -1626 -1663 -953 -522 -280 176 1185 1368 616 678 1576 1004 0 622 915 -152 -649 -240 -914
741 -914 -1143 -1337 -1152 -1156 -568 -73 -105 321 422 228 686 1258 988 587 1532 1200 -5 -832 -39 -480 -1957
762 -1957 -1803 -939 -977 -1005 63 446 335 147 462 -27 382 -16 877 910 712 775 462 719 -166 -912 -937
783 -937 -950 -1395 -1542 -741 116 -96 -62 837 1107 687 582 1165 1189 624 171 493 115 -487 -858 -449 -677
804 -677 -1052 -856 -189 -152 -776 -480 27 449 92 373 1201 1332 771 1096 965 768 -639 -992 -866 -822 -1235
825 -1235 -697 -121 -4 -308 -66 172 -180 -338 19 733 192 692 1095 1200 646 159 19 -166 -657 -1213
845 -1213 -1016 -520 -594 -927 -339 223 -122 49 699 718 525 547 1081 767 31 -6 320 -324 -614 -395 -338 -442
867 -442 -546 -856 -408 131 -528 -645 -182 772 714 542 1210 1075 437 334 436 -410 -857 -331 -401 -503 -712
888g12N78p5l65q5q4N49M80kp6J039l0n85l16K00l40j107O50P9j21j55N5N01m91
911d13j61P5L65j76M40J56L56j48l1L4K79l49r83L61N46p38m01N98J23o25j40
932h32L77K80M7J99P08l72K73j27j94l80Q8Q2k03K37k97j54L57K52j158k85Q22
953b80k78k24O09N25j51N38o1L3j95k48n3n4l39n7R0k2M2l36J10K46l45l12K08
976e54M04L72n7O21j46l39j17N77l64q1R5j74l72k84j6k52J43L01j95J77K35j39
998a65M11P30l65p44L88P81q16l79N45M16o92pj17p76N6L39l19L98N06m83K03
1019i0K19J88j06R0L90m82j64J68N37m92n00P24j84q66j61M18k86N3P03L8j05
1040I2L04om72L67K46m9m55L38k74k64M21k92m58p6N22n25j47N98M26p63R5M11
$$ plain form
888 -712 -134 -209 -574 -659 -743 -194 286 284 208 1247 1217 632 316 516 176 -931 -281 -202 -323 -478 -423 78 -413
911 -413 -574 -499 -134 -310 130 286 642 494 463 497 776 427 -556 -195 351 -387 -788 -190 -67 -692 -832
932 -832 -455 -175 -128 71 779 407 680 553 359 -21 67 149 -54 183 -114 -268 89 341 -817 -1102 -280
953 -280 -558 -782 -173 352 201 739 678 711 516 268 215 161 -178 -235 -145 -167 -125 -461 -351 -105 -450 -762 -554
976 -554 -150 222 165 786 640 301 184 761 397 316 411 237 -135 -419 -435 -687 -544 -243 -438 -261 -26 -165
998 -165 246 976 611 -133 255 1036 220 -159 386 802 110 103 -14 -790 -734 -395 -714 -316 190 -293 -90
1019 -90 129 317 211 301 691 209 45 213 750 258 -242 482 298 -568 -729 -311 -597 -544 159 197 92
1040 92 396 390 -82 285 531 482 27 365 91 -173 248 -44 -502 -578 -56 -581 -728 -130 296 -467 -372 39
1062C9j15J32K70j48K96j6R9q25K22L02m56l57L97q6k61K62M00j09l50L77L95
1083D68p57J83O31Q0l45M93j87l25k7k11o01n3N67k50k6O79l21k73K28M38p34
1104c43M01M89L1p25M68J67l35k01J52K3o02J28p5K7K5J37l71N33j10J53J31M96
1126E99j94R2l60L90r4m83l8P6O3m30K87K09m00J14J6K0N9n31K51K83N89k72J5
1149B61M40L7n48lJ30j39n11L59j37j0k1J25m78K06L50k08k2L28l34L70M18j90
1171D23m20m7K69j16m68N06k07l5l01Q3r6J22o0K72N3J68q0J21J96o0l89K87o7
1194A54j51k51N35l15j1N3j05J2k37j88J49O7M4K33j03O18k2j30j09j20J21l22
1216g8j92L98l69J51K09k37k37L31J39l10k9J23Q7J16k29K12K09k15M4J32P8J96
$$ plain form
1062 39 -76 56 326 178 474 458 557 -268 -46 256 -200 -557 -160 -246 -507 -245 155 46 -304 73 468
1083 468 -289 -106 525 605 260 753 566 241 214 3 -598 -651 -84 -334 -360 319 -2 -275 -47 391 -343
1104 -343 58 547 578 -147 321 488 153 -48 104 127 -475 -347 -422 -395 -370 -233 -604 -71 -181 -28 103 599
1126 599 405 497 137 527 433 -50 -88 -12 51 -379 -92 117 -283 -169 -153 -133 -74 -605 -354 -71 518 246 261
1149 261 701 738 190 187 317 178 -333 26 -111 -121 -142 -17 -495 -289 61 -147 -169 159 -175 195 613 423
1171 423 3 -44 225 109 -359 147 -60 -95 -396 -313 -409 -287 -347 -75 -22 146 66 187 383 323 -66 221 154
1194 154 3 -248 287 -28 -39 14 -91 -79 -316 -504 -355 -288 -244 -11 -114 504 482 352 243 123 244 -78
1216 -78 -270 128 -241 -90 119 -118 -355 -24 115 -195 -224 -101 -14 102 -127 85 294 79 123 255 333 529
1238E29j88l93j42j28j35K38K2j88J30M25m8j84K33L3m7k94oM66l60k7L28j73
1260I1k4l45l49O40k82m1J5J79J30k57L04ML2kR1J85j75k50L85p5j01m16L31k70
1284b00l58L19j24J64K55j12n3J18K13k76K90L2j25Q0K81l27l46M30l30J79l23
1305b13J13j54J28k12J36K79K37j24k01K62o6N5J08j12l10K56j04k22J27o7j31
1326b15j04K03j06K61L69j057M28J00K63m04R4L69R7J63k88k50L77m55q0n9M55
1347A61k74k54K64n1j38L81k53J03M9j66K46j24J43J1J38M0M2l73K5Q3k06l1K3
1370a61J26k09J25J44k19K35o0M81k17p1o7K96j67k79j22J08J14j83L79l72j08
1391b27PJ81q7j06j12K91K96J59l04k26K92J44k85J43k20J77k59J27j97NL23K7
$$ plain form
1238 529 341 -52 -194 -322 -457 -219 -197 -385 -255 170 122 -62 171 204 157 -137 -143 323 -37 -64 264 91
1260 91 67 -278 -627 13 -269 -310 -295 -116 14 -243 61 65 97 95 186 371 196 -54 331 256 155 -261 70 -200
1284 -200 -558 -239 -363 -199 56 -56 -109 9 222 -54 236 268 143 223 504 177 -169 261 -69 110 -213
1305 -213 -100 -254 -126 -338 -202 77 314 190 -11 251 185 240 348 236 -74 182 78 -144 -17 -84 -215
1326 -215 -319 -116 -222 39 408 -649 -221 -121 142 -262 -168 201 298 461 173 -77 300 -155 -235 -294 161
1347 161 -113 -367 -103 -154 -292 89 -164 -61 -12 -178 68 -56 87 98 236 276 318 -55 -30 53 -153 -184 -161
1370 -161 -35 -244 -119 25 -194 41 -19 462 245 174 107 403 236 -43 -165 -57 57 -126 253 -119 -227
1391 -227 -220 -39 -126 -232 -344 -53 243 402 98 -128 164 308 23 166 -54 123 -136 -9 -206 -201 122 149
1413A49N6j15m11O22j94j03J00o9m1N6p4j10j7p%J86K63l12j76Q5o1l7J46J34
1437G0j49r3K80L94k90k44L8J72r5k83L6K09Q3j22J3j42J38n07L33k4R5L09L5
1460B56J95j83K1m47L10l30K08l19M31k25l47L16O1O9j85K1q7J52qm0O9O8J36
1483A42k31L59k04M7QL7j48j59L47m20R1q7J45K2j07J47L67k20r4J9O7j06L55
1506C77m27%K76r1j9k66J66l06L10k94L05l25K66J32j62jj3M6Q5m0J90j39l50
1529b80L10J43j89l7Q6k23K95j03J70q0p1n0J59k0J17l14K49J21k74K44N8o7k21
1552B3L1mp6l5P9j02j7J2j0l6R1M4P4p3J66j37k4J73K57n11l4J55k91k4L02J93
1578B26k74r5J18K44j53j20K93l02L80k84K8j3K90j9l12L00o08OJ02K30k11r0
$$ plain form
1413 149 205 90 -321 301 107 4 104 35 -6 50 -24 -134 -151 -158 -158 28 291 -21 -197 -112 -173 -210 -64 70
1437 70 -79 -172 108 502 212 -32 6 178 83 -200 -164 45 128 6 19 -123 15 -492 -159 -183 -88 221 256
1460 256 451 268 289 -158 152 -178 30 -289 142 -83 -430 -114 -53 16 -169 -148 -235 -83 -91 -131 -62 6 142
1483 142 -89 270 66 113 121 158 10 -149 198 -222 -131 -218 -73 -51 -158 -11 356 136 42 61 128 22 377
1506 377 -50 -50 226 135 116 -150 16 -290 20 -274 31 -294 -28 104 -58 -59 -72 -26 59 19 209 70 -280
1529 -280 30 173 -16 -53 33 -190 105 2 172 92 21 -29 130 110 227 -87 162 283 9 253 311 244 23
1552 23 54 50 -26 -61 18 -84 -101 -89 -99 -135 -44 0 74 1 167 30 6 179 436 -75 -109 46 -245 -269 33 226
1578 226 -48 -143 -25 219 66 -54 239 -63 317 33 61 48 338 319 7 307 -301 -295 -193 37 -174 -264
1600b64L66k79P0r7J52r1N2P2qK13N3l2j62Q7K0k88kK64j76q9k19M59n8k24n1
1625b32K91l8r5N4J98j58J26k27J98q6j1k5J02K92o33J36J15k38J58J69P6m52
1647b80m9K35K70k14Q8K80j43o2j1j40K30j47j8K74k53K65n40L87j84k16M38p8
1669A32J4k67K19N6j04pk36N07k90k29Q3l6K14r1j04K57n7j87J28J66k85O6R2
1692D1o2P3j75J75N2j16R5j51M62m23j96K69l1j15N5J22l3k40J09K24o1j48K9
1715d5K38l52J16J75j20j77J26M8j84J0P8o0K98j77O8P4pn1J8jk30L91l7lj16
1740H0l15M88l0j01j9k57PN6pJ11l63K79J5j05L18j32Jq9L2J84k39K78k65J80
1764A07j14j34q7K35J33k64J77Np3j40J80k91K68j06J90R1l51M22j56k22Q6kK81
$$ plain form
1600 -264 102 -177 -107 -204 -52 -143 -91 -19 -27 186 239 207 45 132 152 -136 -138 126 -50 -139 -358 101 43 -181 -232
1625 -232 59 21 -74 -20 178 20 146 -81 117 31 20 -5 97 389 -244 -108 7 -231 -73 96 172 -280
1647 -280 -329 -94 176 -38 50 330 187 125 114 -26 204 57 39 313 60 325 -215 172 -12 -228 210 132
1669 132 146 -121 98 154 50 43 -193 314 24 -205 -122 -158 56 -35 -139 118 61 -126 2 168 -117 -51 41
1692 41 -21 52 -123 52 104 -12 83 -68 394 -29 -225 44 13 -102 -47 75 42 -198 -89 135 74 -74 -45
1715 -45 193 -159 -43 132 12 -165 -39 9 -175 -165 -87 -147 151 -26 42 116 109 58 76 75 -155 236 199 196 80
1740 80 -235 253 223 122 103 -154 -147 -91 -98 13 -350 -71 -56 -161 157 25 26 -63 -31 153 -86 192 -73 107
1764 107 -7 -141 -228 7 140 -124 53 58 -15 -155 25 -266 2 -104 86 177 -174 248 92 -130 -44 -46 235
1787B35k32k53L32N6k59J38j07J18j20J3J31n5J20j93j84L76k09J16M0l25K28
1808c4j09lN7k53M52N1q6K7l62L77j61N2Ko0L8j4L36k44q7M1m5K7M59n77Q6Q1
1834E1l59k0L32J93m31J43R8j8j2O8m0j77J44l7q4j2M3j19n0M18L3k09J93k06
1858e8K43K5j88J54j55O5k13R5K27k39L8j45K97k33K18m70L68kj92K07j71j29
1880b58K93k00O7K5k0O0j74n8J36L41l79K67l6p5k13K07q3J44k4j00L84k55j09
1903f0K50j10p0j92K4K69mn0j32k57K69J1J02Qoj54O6k41L9L71k28J72p0l8J25
1928I4j73J63J92r7k11l4P2j76qP6l7j90M41l9L1M2j43j94L16j51j98M45l4j75
1952A2k9p5J34J60l49J95l8k05L37k56M4J07n3K85m21K51j23J9K5J92m00M1K09
$$ plain form
1787 235 3 -250 82 138 -121 17 -90 28 -92 -79 52 -3 117 -76 -260 116 -93 23 63 -262 -34
1808 -34 -143 -146 -89 -342 110 161 75 102 -260 117 -44 8 10 -50 -12 -26 310 66 -21 20 -25 2 461 -116 -30 51
1834 51 -308 -328 4 197 -234 -91 7 -11 -23 45 5 -172 -28 -65 -149 -161 -118 -237 -287 131 164 -45 148 -58
1858 -58 185 210 22 176 21 86 -127 -32 195 -44 -6 -151 146 -87 131 -339 29 27 -165 42 -129 -258
1880 -258 35 -165 -98 -73 -93 -33 -207 -265 -129 212 -167 100 64 -11 -224 -17 -100 44 20 -80 304 49 -60
1903 -60 190 80 10 -182 -158 111 107 57 -75 -332 -63 -52 50 58 52 -102 -36 -277 -238 133 -95 77 7 -31 94
1928 94 -79 84 276 179 -32 -66 6 -170 -178 -102 -139 -329 112 73 104 146 3 -191 125 -26 -224 221 187 12
1952 12 -17 -92 42 202 -147 48 10 -195 142 -114 -70 37 -16 269 -152 99 -24 -5 20 212 -188 -147 62
1975F2k01P2j56o3KK53l8m9J4m7J21l9J11n6o9J46j58k29N15k26N3P5j59k50M67
2000A51M2l74K19O6j70q5J57l76L38K72k00k6M8q3q8J09j79K96j24l8l1J94p4
2023D4k92K79k02R3L85j43J7l53K31j74L92k41J6P4n8j70l5J56J77j21k1j56J
2046a01j2O6o0p8K65k79K97k77J36J59l12L38m1j26O1l56J75j3K60l01L16k73
2068a56r2p6K39k7J85j1J92o6j51lk72K93%k26K30j15J38n8k71K17O7L2R6j14
2092E1J30l90nL4K68r0j06r2m2K80O6J27k28q2O9m7J22j27P4j10n8J07Jj46K96
2117A02R9n4j81J68k06J46m2j39P9j53m8M07k93K16P2k0j62j47J96M6j5l65Q4
2140b10p0M31m07K25K1n9j1M0O6j13K13k38K60l07R2o5J72j1k43J15o7L89l24
$$ plain form
1975 62 -139 -67 -223 -286 -284 -31 -69 -118 -104 -151 -30 -69 42 -14 -83 63 -95 -324 191 -35 18 93 -66 -316 151
2000 151 193 -181 38 104 -66 -151 6 -370 -32 240 40 14 62 -21 -109 0 -179 117 -7 -45 -76 118 44
2023 44 -248 31 -171 -78 307 164 181 -172 59 -115 277 36 52 126 68 -102 -137 19 196 75 54 -102 -101
2046 -101 -113 -47 -107 -185 80 -199 98 -179 -43 116 -196 142 101 -25 36 -320 -145 -158 102 -199 117 -156
2068 -156 -248 -324 -85 -112 73 62 254 188 37 34 -238 55 55 -171 59 -56 82 24 -247 -30 37 69 165 51
2092 51 181 -209 -214 -180 88 -2 -108 -200 -242 38 104 231 3 -79 -10 -57 65 -62 12 -98 -156 -49 -48 -194 102
2117 102 201 147 -34 134 -72 74 32 -107 -28 -181 -229 178 -115 101 173 153 -9 -156 40 86 71 -294 -210
2140 -210 -280 151 -256 -31 -10 -69 -80 -40 26 -87 126 -112 148 -159 -67 -132 40 29 -214 -99 -166 223 -101
2163a01K82j88j34J40N7k59J41K12J88k83p0J00k27j7L88l89J87r8pj5L13k85
2185f5K8L2J05o1R6M0O1l49R0K35o8j6m25N32j92o9P5K82l45N4J28l19J57lR3
2210I6k29m0P1J36q2J71n2j86n2J42J02Ok5k47J83K74n23L93j5l16K40j48J18
2233A7k73J34J11l51L12R8j09L3R1J9k57J59J20k57J17OK89j40q1l59J91J46R4
2256A10P0j98J95k48L02l94R1J85q0r8qL7J52M1%l4m3j32k04J84J3o6L66l72J39
2281HP5j2k0k9q6K07k33O6NK21k06K27l09M5n9o5J13J10m6L23k59k96K30kK43
2306B51j80J26l63R2J87k55K35j29L9j30J50J36k59O0k65K77J15m6J8p8m7L5Q7
2329E6M8k86K42j34J64j21L29l69L0J59q3J77l58K82l32J86o3j15J59k17M69k06
$$ plain form
2163 -101 181 -7 -141 -1 56 -203 -62 150 338 55 -15 85 -142 -159 229 -160 27 -71 -78 -93 220 -65
2185 -65 -37 -5 100 39 135 175 236 -113 -23 212 144 128 -297 235 43 -26 49 331 -14 40 168 -151 6 3 96
2210 96 -133 -173 -102 34 -48 123 71 -115 -167 -25 77 83 58 -189 -6 268 -255 138 123 -193 47 -101 17
2233 17 -256 -122 -11 -362 -50 48 -61 -28 63 82 -175 -16 104 -153 -36 -30 259 119 38 -321 -130 16 110
2256 110 180 -18 177 -71 231 -163 -72 113 33 -65 -73 -36 116 157 157 123 80 -52 -256 -72 -59 -125 241 -131 8
2281 8 83 71 51 22 -64 143 -90 -24 -19 202 -4 223 -86 -41 -100 -165 -52 58 12 335 76 -220 10 8 251
2306 251 71 197 -166 -74 113 -142 93 -36 3 -127 23 159 -100 -40 -305 -28 87 41 59 -19 -66 -31 56
2329 56 104 -182 60 -74 90 -31 298 -71 -41 118 35 212 -146 136 -196 -10 -73 -188 -29 -246 223 17
2351A7k80M51k14M0J60k51m1J25L60k67N7j35j65j2K17k3J68k24k25K57m1J91
2373A65k23L25r5J25l46N7J72k61q2L36r2j85J64M1k77L65j12m6j22R7K45l08
2395e7J0n2J6J11K56n06R0j21m7K43j40J99j42m4J92O9q7j12J95N2r1p6J3J70
2419A41j58J19O7m7m1j20J92l8l0k89K16kJ46j92L2Kj61J95Lj58o1qP9R2J9Pp1
2446f6K35L4k17R3j74L59k33m3j10QK61N6l64J91j70J59l10M11l0k19K2PL43k50
2470gK91l63P9k52L60j1J3k3l83L11M9j86J44J55l0j11p6L93m38j95L94j18P7
2493G3K6K79m99J31j36J50j31J80k69J52rl74N75l4l46K13L9l5O0j30j06R3m2
2516a40J1q6J87J29k02K03j76O4Q4k69J8P1L96j38k01j16j8K27n6P6j77K24K8
$$ plain form
2351 17 -263 188 -26 14 174 -77 -118 7 367 100 157 22 -143 -155 62 39 207 -17 -242 15 -26 165
2373 165 -58 267 172 297 -49 8 180 -81 -163 173 81 -104 60 101 -176 189 77 31 -91 6 251 -57
2395 -57 -47 -99 -83 28 284 -222 -132 -253 -300 -57 -197 2 -140 -184 8 77 -10 -122 73 125 34 -42 -29 141
2419 141 -17 102 169 122 81 -39 153 115 85 -204 12 10 156 -36 -4 -2 -163 32 35 -123 -184 -192 -113 -21 -2 5 -66
2446 -66 169 203 -14 79 -95 264 31 -12 -122 -114 147 203 -161 30 -140 19 -291 120 90 -129 -107 -100 243 -7
2470 -7 284 -79 0 -252 108 97 110 87 -296 15 64 -122 22 177 147 36 -40 353 -85 -280 114 -4 73
2493 73 99 378 -121 10 -126 24 -107 73 -196 -44 -53 -427 148 114 -232 -19 20 -15 45 -85 -191 -98 -140
2516 -140 -129 -215 -28 101 -101 102 -74 -10 74 -195 -177 -106 290 152 -49 -165 -183 44 -12 64 -113 111 139
2539A39j95K21j03o3P9m3n9r0P8J00j10k45N1K02m1Qo9J41J09j54J45m71M88p6
2563D2k53K97k28L24j76J75p2m6r8j68P2r0L37K79n78K27M2l26J58m7K55J49n16
2586b41J52L81o50K33j3O9j0K4K48k24j36j12K88j31n5L12J05r3m24N9M01p1k22
2609a10K21l78K79J80k53K25j36Nj1q7mN3J17j05J21j49k75J12K74j24l8K84l37
2632a36M6j36L05K23l61J53n39K45K30j6KQ5k00K79l46K59j30Q1N2j24J93l87
2654b22L29J37l18J23J19k49m0m5J23j62K14j99J62N2k11J52L09j69j71K84k40
2675b2l2K81l51J5J41J70j19q9j10O2P0j0j43J42m30M75k1K8J54J25l72J00j30
2698f6K27k85L32q4j95J59j62J12J70j50j07P8j57Q4N6R8k01J9J77Q8j45J66j73
$$ plain form
2539 139 -56 165 62 -1 78 35 -24 -114 -36 64 -46 -291 -240 -38 -79 -71 -140 1 110 -44 101 -370 118 42
2563 42 -211 86 -142 182 6 181 109 63 -35 -203 -131 -221 116 395 -183 44 86 -240 -82 -129 126 275 -241
2586 -241 -89 292 -358 -125 -138 -69 -79 -55 193 -31 -167 -279 9 -122 -177 135 240 147 -277 -218 183 112 -110
2609 -110 111 -267 12 192 -61 164 28 33 22 -65 -69 -16 101 -4 117 -32 -307 -195 79 -45 -83 201 -136
2632 -136 -90 -226 79 302 -59 94 -445 -200 30 14 16 101 -99 180 -166 93 -37 44 96 -28 165 -222
2654 -222 107 244 -74 49 168 -81 -121 -166 -43 -205 9 -190 -28 24 -187 -35 274 105 -66 218 -22
2675 -22 -54 227 -124 -109 32 202 83 -6 -116 -54 16 6 -137 5 -425 50 29 57 211 336 -36 64 -66
2698 -66 161 -124 208 124 -71 88 -74 38 208 58 -49 29 -128 -44 12 110 -91 -72 105 193 48 214 41
2721D1j03q9P3R3k41K48j94L98j99J13l5j97K95m04L30o0k30q2P09n73L20k19
2743fJ11o5L7r6J37l00o9M15o0j90M1Pj11J44J74L5l95L22mj24L34p7l25K5L41
2768C01k77k06J91n9M0j11J41o9K12Lj03j67K06o5j25j3M14j92j8k96P3j46L42
2791G6M2k76M2L40j83k44L71m0j06j43J07O9J5j3J5l33K00N6p8J28N5Q8l63L6
2815a39K46k57J96n0k1P2J55Mj33K56n03M14o0k23m3J78j19K46k98J07j90M4J61
2838D3o4J26j70q6K81r7o5L5L0k41RK02n1O7oJ20J8l65k6J74k72O05k70J43M5
2863A85j87j53K44m8j23r8P4N0K20r1k8p2J28j40RM8M1l1m33M43p3K01N9k95O4
2888fj66J00jJ27o8j29J73j38J80r8J12q5K31l29J8J92k18J81k90M39m82N76l48
$$ plain form
2721 41 -62 -151 -78 15 -226 22 -172 226 27 140 105 -92 203 -201 129 69 -161 -243 466 -107 213 -6
2743 -6 105 40 77 -19 118 -182 -251 164 104 -86 -45 -38 -149 -5 169 204 -191 131 127 3 337 260 -65 -40 301
2768 301 24 -182 9 -50 -10 -121 20 -49 163 166 63 -104 102 37 -88 -101 313 121 103 -193 -120 -266 76
2791 76 118 -158 -116 224 41 -203 168 128 22 -121 -14 55 70 57 72 -261 -61 -5 -83 45 100 188 -175 -139
2815 -139 107 -150 46 -4 -25 47 202 206 73 329 -174 240 180 -43 -86 92 -27 219 -79 28 -162 -118 43
2838 43 -21 105 -65 -151 130 33 -32 3 33 -208 -199 3 -48 19 13 133 151 -214 -240 -66 -338 267 -3 140 185
2863 185 -2 -155 89 41 -82 -180 -106 -56 164 73 45 -27 101 -39 -30 18 59 28 -405 38 -35 166 225 -70 -6
2888 -6 -172 -72 -73 54 -14 -143 30 -108 72 -26 86 1 232 -97 -79 113 -105 76 -214 225 -257 319 -29
2911b9m1K03ll36K35j25J56k28L6J87n1O0j64P2K12l42L70k76j0J2n7R0j40L33
2935A64m62L08p5K7R4j4j6L9J58k41j74L70j50J8j49K7J12l9l5L2r1O5o9l05J37
2960b69M53l26J1K00J8j29rL5j01K6O3J7n2k07L2K93j06J9J29j03k15K84Ro0O3
2985G5k56J52L02n83L24o4K61k37p5M8K02p7nk07L09j93J2J04j92J7k47L63j16
3008h3J15l2k1j84P4j5N7o9L07j69QP3k89n7K28N3K1K65k56q1q4K66j23j71K35
3033F8j74LR7j17J46j17j11l7L22k05j4M30j07k00j09Q5K23j36P2j12n9K77m70
3056b45K16R7R2k33J07j68J69N3l6O5l4j2j18K81j82k33M10r8M0j06j27K27o3
3079A02j58j5J96k01K43p0j96J21R9Pj39m2J97k98J84J43k14P1p6Q5N7Mj02J35
$$ plain form
2911 -29 -70 133 130 -206 29 -96 60 -168 -132 55 4 64 -100 -28 184 -158 212 -64 -74 -62 -119 -29 -169 164
2935 164 -298 10 -65 -38 56 42 26 65 223 -18 -192 178 28 46 -103 -76 36 -3 -38 -6 -97 -32 -101 -406 -269
2960 -269 184 -142 -131 69 87 -42 -51 -16 -117 -91 -28 -11 -63 -270 -238 55 -51 -32 97 -6 -221 63 72 12 75
2985 75 -181 -29 273 -310 14 -50 211 -26 -101 -53 149 72 67 -140 169 -24 -12 92 -100 -83 -330 33 -83
3008 -83 32 0 -21 -205 -131 -146 -89 -158 149 -20 -12 61 -228 -285 -57 -4 17 282 26 -55 -139 127 4 -167 68
3033 68 -106 -103 -6 -123 23 -94 -205 -242 80 -125 -139 291 184 -16 -125 -40 183 47 119 7 -52 225 -245
3056 -245 -29 68 160 -73 34 -134 35 88 52 117 83 71 -47 234 52 -181 229 131 171 65 -62 165 102
3079 102 -56 -71 125 -76 167 97 -99 22 121 128 -11 -53 144 -154 30 173 -41 30 -46 39 96 100 -2 133
3103A33j97J59R5j72M7k5l85M54l10N0J61R0Q1K7k87J3K01k54J61M9l27L07Q4
3126A55k74L09k71M44l09L06m84Q3pK66l13K65j42k6M00o09P4J52L5j67L61m07
3148a59J57Q9r3k47K71n7K7O2J90j62p2j98m7L64l40J4L14j16Q2j28R4j19N4K9
3172IJ71k37p9K28J22j11k84j7J0j8j5J91J75J8j34J31K1l98J61K31k73L59k46
3195A5q5J28j22J67n4k25K55q1K32J5k29j07K46r0l21M15m40J24K46l31N73n81
3217b50K01j08L6lk25N31j86nk08J22L73n71M35O6k86M2k81M60k0r3J4K81l17
3240HJ06k16K05j23M9j22l41L49k8k34K30M80l61K47r0l06j1PM24j32l80K87j27
3263g9J59k43K71k95K91j92J79p6J0j5j11J78P8j61K17n0j52N5J09k12L07k74
$$ plain form
3103 133 -64 95 190 18 65 40 -345 109 -201 -151 10 100 181 208 -79 -66 135 -119 42 91 -236 71 155
3126 155 -119 190 -81 363 54 360 -124 -41 -48 218 -95 170 28 2 402 -207 -133 19 54 -113 248 -159
3148 -159 -2 87 -6 -253 18 -39 -12 50 240 78 6 -192 -239 125 -215 -201 113 -3 79 -49 45 -74 -20 9
3172 9 180 -57 -136 92 214 103 -181 -198 -188 -206 -221 -30 145 163 29 160 181 -217 -56 175 -98 261 15
3195 15 -70 58 -64 103 49 -176 79 -2 230 245 16 -91 155 65 -256 159 -281 -157 89 -242 331 -250
3217 -250 -49 -157 -121 -124 -349 182 -4 -9 -217 -95 278 -293 142 208 -78 -36 -317 143 123 30 44 325 8
3240 8 114 -102 103 -20 29 -93 -434 -85 -113 -347 -117 363 2 249 159 -147 -158 -151 273 141 -239 48 -79
3263 -79 80 -163 108 -187 104 -88 91 15 25 10 -101 77 155 -6 211 161 9 64 173 -39 268 -6
3285fO1Ok03j6%l4J31n7MK87k13R7l18K15J96l14j56M28r2k7n1M5N9k4j21N8l7
3312h2n4NM6L15k76K92p0o1J47m34K5N7Q8K7p8J68m1n5K3J05j98K67j71P1k73
3337a57K48o7k1O9J95j50k81J32M6k1J49m8l0M1J32j30j22J80j42k22J29K03j59
3360b6j40P5q9L04J08l50K40j90r5R6j6Q4N1q8j3M1j46J90j55P5K59k09j99L41
3384A48j50n9J03j7r2J46o0J36rj29j3j67L42p9k27m8M02j96J10j14J17j22M2
3407F4N1k16J14m9K14k2j49J94m90L92k47k8J47J59k4j67%M9j88K95j12j00L15
3430B02k66K00j0K6l0k65N0K18RJ64k23j64J47k3P0k79K63p7P4O7l73L78oj30
3454B2k12R2K26j08r3M1j4l4K18P1k02K61k36j66O37n71J88L5n0p0k80O1P1K97
$$ plain form
3285 -6 55 61 -142 -158 -158 -192 -61 -118 -114 173 -40 57 -261 -46 150 -164 -320 108 16 -11 -62 -17 42 18 -103 -45 -82
3312 -82 -136 -131 -85 230 -46 246 176 115 262 -172 -147 -90 -2 25 -53 115 74 19 42 147 -51 216 45 116 -157
3337 -157 91 24 3 72 267 117 -164 -32 14 -7 142 94 64 105 237 107 -15 165 23 -199 -70 133 -26
3360 -26 -166 -91 -180 124 232 -118 122 -68 -163 -67 -83 1 52 -36 -49 -8 -154 36 -119 -44 215 6 -193 148
3384 148 -2 -61 42 25 -67 79 19 155 146 17 4 -163 179 100 -127 -175 227 31 141 27 144 22 64
3407 64 115 -101 13 -36 178 156 7 201 -289 103 -144 -172 -25 134 110 -57 -57 -8 -196 99 -13 -113 202
3430 202 -64 136 126 152 122 -143 -93 125 134 298 75 -89 58 35 105 -174 89 12 86 153 -220 158 152 22
3454 22 -190 -98 128 20 -73 -32 -46 -80 138 209 7 268 32 -134 503 -68 120 155 105 35 -245 -184 -113 184
3478A84r7J22k93p8O1j4J22J89j78K16k78M9j32K4J53m1p7n0K44k83J05J63j60
3501d9K22p4q4L9J0o7J6J22Q0m04m1L55l5J51j98k82J71j6q2L47Q0l68K69j6k56
3526a10K02O4j38J11o3q0m1K51j0k45m57M85j05J42j45J35k8l37O21j00n1q4j91
3549a74o7k1K99l36K82j41j14L69o1R2M9p6k10K20q8O4j04l4J60r1k1K48J38m73
3573i0j32K56j90m9J66K2o8K95j61j04O1k9K10j76j43K35l21K20p4J05j31N9O3
3596B4O7J19n59J95R9m7J35K5r4L0J77J57l13j0p4J61r9m9O0K3J12j91J44l29
3620b37M02k9n05K53K62k83O9Ml8L52j77j03J28o4j54L74j53j23o7R8j45J16k4
3643d4j30L38L5j09m12J27J27j73J24J0J81J0Q5m04K14K75k58L6n9l5K17k36P2
$$ plain form
3478 184 87 209 -84 -162 -101 -115 7 196 18 234 -44 5 -127 -103 50 9 -68 -118 126 -157 -52 111 -49
3501 -49 173 99 15 54 64 -3 13 135 215 -189 -230 125 90 241 43 -239 -68 -84 -166 181 261 -107 162 146 -110
3526 -110 92 156 18 129 66 -14 -55 196 186 -59 -516 -31 -136 6 -139 -4 -32 -369 252 152 101 17 -174
3549 -174 -241 -262 37 -299 -17 -158 -272 97 36 128 177 101 -109 111 23 87 -17 -51 109 18 -3 245 383 -90
3573 -90 -222 34 -156 -205 -39 -17 -85 210 49 -55 6 -23 187 11 -132 103 -218 2 -72 33 -98 -39 24
3596 24 91 210 -349 -154 -55 -102 33 58 -36 -6 171 328 15 5 -69 92 -7 -56 4 27 139 -52 92 -237
3620 -237 165 136 -369 -116 146 -137 -68 -64 -102 250 73 -30 98 34 -120 254 101 -22 -89 9 -136 -20 -44
3643 -44 -174 164 199 90 -322 -195 -68 -241 -117 -107 74 84 169 -235 -21 254 -4 32 -27 -62 155 -81 -9
3666iJ36K5l25j3L6p0J63M9J0j18J44j74R1J88o6m5q4M5j09K26k14L5k8J20l54
3691c41K61j30L93l0o3l8l6J99l56L7J13pj95J41QK24k41N3j21L25k60j13K35
3714E8j32j10J00Q8O2N9j73Ol2m9K28N0j74J36o1k2j74K1L42M5n60K64N2P8k53
3739a51q6M62l07R6j16K38k13P3K3J13j36P6j80o9M49j43L5j92J15j23R8J02l98
3762b34J28J17n3j57J02M1rM4p5L49k23Nm4J00J03k68K49j78j40K44k04l8nJ67
3786B1J23j67m5l03L37r5J17J0K06m18o9O34j91R7m40N73m20K34j70k25nJ38J90
3809A32m06J9K62K71k20n2j61k3K07kJ36J68l02J15j46m9k34K83j4L12k43j77
3831a24l2K22j57o2J05J18j58K76j06j78J08J27l33L5L57k0n73L23K84k18M8N0
$$ plain form
3666 -9 127 152 -173 -186 -150 -220 -57 -8 2 -116 28 -146 -55 133 67 22 -62 -17 -126 100 -114 -79 -107 13 -341
3691 -341 -80 -210 183 153 90 52 16 215 -141 -104 9 2 -193 -52 -44 180 -61 -8 -129 196 -64 -177 58
3714 58 -74 -184 -84 4 66 125 -48 -42 -74 -123 105 155 -19 117 56 34 -140 -119 223 268 -292 -28 24 102 -151
3739 -151 -237 225 -82 14 -102 136 -77 -4 19 132 -4 72 -108 -177 272 129 164 -28 87 -36 62 164 -234
3762 -234 -106 11 -42 -199 -97 -56 -65 -21 -96 253 30 35 -9 91 194 -74 175 -3 -143 101 -103 -141 -146 21
3786 21 144 -23 -68 -371 -34 -129 -12 -2 204 -214 -283 351 160 257 -183 390 -30 204 34 -191 -196 -58 132
3809 132 -274 -255 7 278 58 6 -155 -178 29 27 163 331 29 144 -2 -51 -285 -2 -16 296 53 -124
3831 -124 -156 66 -91 -153 -48 70 -88 188 82 -96 12 139 -194 -159 198 178 -395 -72 212 -6 42 92
3853I2P7k83n1o7J73j32J00K08j46K04q7k08K0r5K57j51q4K32p7J12j57K43r8
3876H2k43K13k48O6o9J32Q4K72k98rl7KJ81l68L43k27oL74j65j64N8P4j51J30
3900B6m12M58k46K46O9j56L65k66K35j58k27K31j77l1p6K5P7j19K35p5l70L21
3922b5m0M25m14J53p3jM6J1M3j18Oo3j97K20K06l17K58k75K25o3n8P6J43j2j00
3947E6k7n5l4Q4j02J5J9L44k36J97q7r6k1k43L27j27o7m3L8K60m27p8K78r2M5
3972g2j5L43k14l7Jj03J31j46J28j09K9j36K82j58j5J14j29j2R2L5J78l22K85
3995A50m92M77k93L23j56J38j49J4j16j9J34q5J1K54j02k95K51j76j30L51j65
4016g5K29K85n82LL55k92N4O7K11k98j3K48K4k83L06k52L6n8l8J04j56k05L34
$$ plain form
3853 92 169 -114 -165 -232 -59 -191 -91 117 -29 175 88 -120 -100 -195 62 -89 -173 59 -18 94 -63 180 82
3876 82 -161 52 -196 -130 -199 -67 17 289 -9 -18 -55 -53 128 -240 103 -124 -130 244 79 -85 -27 47 -104 26
3900 26 -386 72 -174 72 141 -15 350 84 319 161 -66 165 -12 -43 -119 -94 -17 -136 99 24 -346 -25
3922 -25 -65 360 -54 99 26 25 71 82 125 7 13 -50 -247 -27 179 -138 120 -155 70 7 -51 25 168 156 56
3947 56 29 -26 -60 24 -78 -63 -44 300 64 261 174 78 57 -186 141 14 -53 -96 -58 202 -225 -303 -25 -117 -72
3972 -72 -87 256 42 5 6 -97 34 -112 16 -93 -64 -200 82 -76 -91 23 -106 -118 -26 9 187 -135 150
3995 150 -342 135 -158 165 9 147 -2 12 -104 -123 11 -74 -63 191 89 -206 45 -131 -261 90 -75
4016 -75 154 439 -143 -140 215 -77 -23 44 255 -43 -56 192 216 -67 239 -13 23 -35 -73 31 -125 -330 4
4039DJ03l34J4L03Q7P2j45k92R8K49k44r4J43K0P0J70l94K52Mj60J79j17l32K73
4063g1j17L75j55n2R8M6l81NP6J09J58n3p0J16J30j53N6j72j17K15l08K37r4r4
4087b16K19j37J46J0q0J28K92n90L72m9j70L45l2J10m03k2L47j19J1k7j06k08
4109a79k33K12J32k90M23m0k20j83N18J22m68K59K18L6N4m91J37k23L07k45J58
4130DJ16l04P5L36j46J84k91J99k08r6J02J22O6l11K92j70O2l85L55j57L13l01
4152a43n2J55kP5M9K48r7l30K0o8J76n5k36K04k11L76K9K02m29L0J07j4J52q8
4176I8p2M0K8L3j86J29q1J86M6m65O8O0J31k8K52r4k19nK05j47O5j22L1K02j1
4201A44k26J79O1l70J10l7K81m93K33l7L05k55L42j3k42O5P5M2j67o5J87m7k04
$$ plain form
4039 4 107 -227 -213 90 177 249 104 -188 -90 159 -85 -179 -36 -16 54 224 -170 82 86 -74 105 -12 -344 -71
4063 -71 -188 187 32 -20 78 124 -257 -252 -176 -67 91 38 -32 84 214 61 117 -55 -172 43 -265 -28 -122 -216
4087 -216 3 -134 12 22 -58 70 362 -228 144 95 -75 270 238 348 -55 -77 270 151 162 135 29 -179
4109 -179 -412 -200 -68 -358 65 25 -195 -378 140 262 -206 53 271 307 361 -130 7 -216 91 -154 4
4130 4 120 -184 -109 227 81 265 -26 173 -35 -131 -29 93 159 -152 140 -30 32 -353 2 -155 158 -143
4152 -143 -195 -40 -42 33 82 330 233 -97 -77 -145 31 -24 -260 -56 -267 109 138 340 -89 -59 48 34 186 98
4176 98 26 66 94 127 -59 70 -11 175 221 -244 -176 -116 15 -13 239 145 -74 -79 126 -21 44 -78 -47 155 144
4201 144 -82 97 158 -212 -102 -139 142 -351 -118 -155 150 -105 237 224 -18 47 122 164 -3 -68 119 72 -132
4224a32N1m9Q8j33L47mP5k88K52J75k85j08k08M32k38K2M7k39K73j05J95j33j83
4247a48J06m9J14k1L57j84j10m6q5J5J34j97L4M0j0L06m5j25k15J61R5j90K05
4270A42N4k62L00m04j68L74R0M6m08M57j85r4l5M7K32k77J25k17L56j73l5r6M4
4293h7J57l29J14J99j38K00o7J04j10k37J44K63m24m7L35l03J48NK09j12M0k76
4315b12L28n5k50K81M35k40k28k44J48J48m37K90J00k29L76l67R2K47k1l45J16
4336f7j35N51m51P6p6J74J80j81Q8k5o51N53J20j45l09jJ42k8L90n39K79K09j15
4359C9J6l7Q9k54L61J39l50j08L38l38J51J30j01K07j08j75r0k7O9Q6J13m39L98
4382A09n7J35k08Q8p8J48l53N9J26lJ30R6k25K52j04l40J42K43J6j23j99J76k05
$$ plain form
4224 -132 -81 -130 -42 -175 172 168 243 -45 207 382 97 -11 -219 213 -25 -3 44 -195 78 -27 168 35 -148
4247 -148 -42 -91 23 2 359 175 65 19 -66 -51 83 -114 -80 -40 -50 256 211 86 -129 32 127 -63 142
4270 142 196 -66 234 -170 -338 36 126 172 -236 221 36 -58 -93 -46 186 -91 34 -183 173 0 -35 -131 -87
4293 -87 70 -259 -145 54 -84 116 49 153 43 -194 -50 213 -211 -258 77 -226 -78 -73 136 24 64 -212
4315 -212 116 61 -189 92 527 287 59 -185 -37 111 -326 -36 64 -165 211 -156 -64 183 162 -183 -67
4336 -67 -202 349 -102 -26 -102 72 252 71 159 134 -517 36 156 11 -298 -299 -157 -185 205 -334 -55 154 39
4359 39 55 18 107 -147 214 353 3 -105 233 -105 46 176 75 282 174 -1 -91 -118 -49 37 150 -289 109
4382 109 52 187 -21 67 -11 137 -216 -157 -31 -34 96 192 -33 219 115 -225 -83 160 176 53 -146 30 -175
4405a75K46q6R5j62R5j43K9l7L02QJ39k78j91K3j15J53J18l9Q5p0j3K1j78K03
4429C0J36j1J6k03J12pm52K89J4j09J68q3K25l54o3L27m8J05L62j93j32j02l83
4452c56L49M5QM2j64K01oq2K04k81K3k48J49K5N9O7n9J9l6J31L7l6J89k68k48
4477b36K49r7L4J64Q2o0j88j50J41L3k26J25M6L95l47n7J39l01K11M3m4NQ0j37
4501i6J11K44k28J51j4j09J95j53k5j93j93K96Q2J65k53p8R2J30k23J51O5J7k5
4524A09k25J16J20k7p1N5M8o4l90N93l65K28J27l58J52k18J49K92l58r9K84k81
4546a83L74k33J24m13P07l31m7L9m8K19n23K66k0o6K95R4n90N04j99l3n8j1K99
4569A66j82N9j26J9O8j59L09j33k06l3K06KL5p9R8m9j83J38J68j1j27k0JJ81k38
$$ plain form
4405 -175 71 -15 80 -82 13 -130 -101 -138 164 172 311 33 -158 -135 -250 -97 21 -18 67 -3 -16 5 -173 30
4429 30 166 155 171 -32 80 73 -379 -90 -76 -185 -17 -100 125 -229 -292 35 -13 92 454 261 129 27 -356
4452 -356 -7 38 46 88 -76 125 119 37 241 -40 -17 -265 -116 -91 -32 35 -24 -5 -41 90 127 91 280 12 -236
4477 -236 13 -84 -50 114 196 136 -52 -202 -61 -28 -254 -129 -83 312 -35 -92 47 -254 -43 0 -44 -39 41 -96
4501 -96 15 259 31 182 168 59 254 101 76 -117 -310 -14 68 233 -20 -98 -6 124 -99 52 117 134 109
4524 109 -116 0 120 93 22 77 125 61 -329 264 -101 127 254 -104 48 -170 -21 271 -87 -186 98 -183
4546 -183 191 -42 82 -331 376 45 -2 37 -11 208 -315 -49 -69 -135 160 254 -336 168 -31 -64 -122 -133 166
4569 166 -16 43 -83 -64 4 -155 154 21 -185 -218 -12 -10 25 -54 44 -5 -188 -50 118 107 -20 -40 -39 142 -96
4594i6O1K14K3k39j13K69k19J16j49K7n2K72j76J52J09k33k00J98L85l53M4N3
4616I3K9n15M51P9k6j68J2J82k25L5J07o3r5J70j72K92l73K75N2j24J33k61J7
4639i5K87J71l82p3Q4q9q1J07j18J10m7R5J00J24m9j23M5j18j69O0J40K06l45
4662a60K29K32m37L18k08R5l37L45j38L7j38J34l4N1J20k29K92q8o0K22k94p6
4684a24K05l17O3K66k34M2K4O5k8K32k79k04M16k61Q0j09K75l2k66R5J37k22K22
4707D6j62k02M29k22K16j60PJ53m3j55j08J67L2Q9L8l88J25N9r1J05K8L8J11r
4731A03pk03K62m07J56J41j68q5J53j96M32k88Q0P1l07L52j47j18J13j03J49j10
4753a27j1J44k57L4K16J42k16L1MJ27R4j47J30l66K1K97k14K65k27j26J32K23
$$ plain form
4594 -96 -35 179 202 -37 -150 119 -100 16 -133 -106 -158 114 -62 90 199 -34 -234 -36 349 -4 40 93
4616 93 122 -393 58 137 111 -57 -45 137 -88 -53 54 -9 -104 66 -106 186 -187 88 140 16 149 -112 -95
4639 -95 192 363 -19 -92 -8 -97 -178 -71 -189 -79 -126 -31 69 193 144 21 66 -52 -221 -161 -21 185 -160
4662 -160 69 301 -136 182 -26 69 -268 77 -61 -24 -162 -28 -62 -11 109 -120 172 84 24 246 -48 -124
4684 -124 81 -236 -173 93 -141 -99 -75 -10 -38 194 -85 -289 127 -134 -54 -163 112 80 -186 -91 46 -176 46
4707 46 -116 -318 111 -111 105 -55 -48 105 62 -93 -201 -34 -2 87 125 -263 -138 -79 -170 -65 -37 1 112 103
4731 103 96 -107 155 -252 -96 45 -123 -208 -55 -251 181 -107 -27 44 -263 89 -58 -176 -63 -166 -17 -127
4753 -127 -138 6 -251 -217 -1 141 -75 -44 -40 87 181 34 164 -202 -181 116 -98 167 -60 -186 -54 169
4775A69j41Qr9J26j34p1K94n3o3J15j73O7j40J03j81K92n7k66K88j59K83Mk17
4798ej6LJ14mJ51r0k3j73j45K13KJ7r0l09K54L18J2l14J52O1j74K2O8q3N7k89
4824b71M00k29%L21j17j39L27j93j70J50k28K9M76l50j79K39k79M02j10j63J28
4845D4Q5k13K44k48n5NK83k17J23n6k2j71L92k67p0J96L0O1k08P5r7K23k13K28
4869A52j21j39JJ60l2j86M5K22L4J4n24L07J45j15M87n28J01J01k99L80k9q8l8
4892E0K31k13p2J0o0j08K91N4l44O9M0J43jj81r5R2J20P3k00L58l34J84r8j51
4916a42O6P7J21k06K6L3j22L49ql77J66j17n9k6J76Q0K81m10o8M17k08r9J97k09
4940f2j23L32j96N2j60M11l15K09k16j74M42k28J68k46J89r4O9j93J90l4k11K30
$$ plain form
4775 169 28 36 -63 63 -71 -142 152 99 36 151 -22 45 -95 8 -173 119 62 -204 84 -75 208 212 -5
4798 -5 -21 -18 96 92 243 153 130 -43 -188 25 27 44 -46 -355 -101 217 229 -85 67 128 -46 -24 44 -39 18 -271
4824 -271 129 -100 -100 221 104 -35 292 99 -71 79 -149 -120 356 6 -173 66 -213 189 79 -84 44
4845 44 129 -84 160 -88 -143 -138 145 -72 51 -5 -27 -198 194 -73 -143 53 83 144 -64 11 -86 137 -76 152
4869 152 31 -108 -107 53 21 -165 -120 102 136 150 -374 -67 78 -37 450 -78 23 124 -175 205 176 88 50
4892 50 281 68 -4 6 -54 -162 129 183 -161 -92 -52 91 90 -91 -186 -94 26 99 -101 257 -77 107 9 -142
4916 -142 -76 1 122 -84 -58 -25 -147 202 194 -183 -17 -134 -193 -219 -43 37 318 -92 -160 257 49 -50 147 -62
4940 -62 -185 147 -49 3 -157 254 -61 148 -68 -242 200 -28 140 -106 83 -11 58 -135 55 21 -190 40
4962D0J0o5J14k18J89L0l11J75MP5j96K96Rk43O9J13J03j44m4K8n0r2J63k97L71
4987A29r2l3j37K27j38o5J71j42N1n5L09J21l68k4l3L23m12K22j92M2K68j75j87
5010a90K00j60L93j47k32R8J52k12M49j81m75M34l28L77j70k31J80N3O1q2k56
5031b67K51q5J22Qj21K42j80QJ7j10J70J6l4m1J69j23k16K7K88r5p9Q4nn3q9n9
5057a55K46j36j30L64l7Kj36k25L42k32K34j26n5K04l03N3L12k70R3m2M4K77m45
5080a21K42p2j5J03o7K29k73k7j99L92k3l85M09k36J48k02N3M11k13M6Q7j21J87
5103C53l92K75k56K08l66L70k30j9J74j60l4j13l6J34K96j09l5j69j67M99l68
5124a45Q5nK14l7k3L0j47J74m01M8L04j80K63k51n9J91j45O9J9l2K15k29j03j37
$$ plain form
4962 40 50 -15 99 -119 70 100 -211 -36 -32 43 -153 143 152 -91 -22 91 194 50 6 34 -16 -108 55 -242 129
4987 129 37 4 -133 94 -44 -109 62 -80 -29 -84 225 346 -22 -46 -79 244 -168 54 -138 -96 172 -3 -190
5010 -190 10 -150 243 96 -136 -38 114 -98 351 170 -305 129 -199 178 8 -223 -43 10 71 -11 -267
5031 -267 -16 -101 21 29 -92 150 -30 -22 -5 -115 55 71 37 -4 165 42 -174 -147 141 46 -33 51 46 -7 -96 -155
5057 -155 91 -45 -175 189 152 154 18 -207 135 -97 137 11 -44 160 -143 -90 222 -48 45 3 47 324 -121
5080 -121 121 49 34 137 70 299 26 -1 -200 192 169 -216 193 -43 105 -97 -44 367 154 200 287 166 353
5103 353 -39 236 -20 188 -178 192 -38 -57 117 -43 -77 -190 -226 -92 204 95 60 -109 -276 223 -145
5124 -145 -60 -65 149 112 89 119 -28 146 -255 -207 97 -83 180 -71 -130 61 -84 -15 4 -28 187 -42 -145 -282
5148b82L36O0m4j55P6j28k54M35R7k04J79l07lJ97p2J06k85J35Q8J76l22k6M78
5171B81l77k21N03k70K82k31m6l6P3j12K50p1jr3M0K26k62P2m1Q8K01k84J57j59
5195c1R0n8O0J1o2l5K6j44j51J96L03o72N37n7j1k5J37j38j55K03J68Q6k49n0
5219b1p1P2j00L03m26J82K63N8m64L66p6L0j7k24L11n74L96J02l54J5Q7MP9J54
5243I5j26K16k75m5K52n8k18QJ19k3L9M8l7J8q5J01k39M25j01k37l42J8O81k0
5267B14l09J60k72R1K51n4j46j4m6K50o9j50J7K35k42m6K55j56O7k43K1K25P0
5290A09n0j55O5J33k25J30J20K4k25J57k9k59J12J96j49J95j32Q3n9J1n6J27j7
5313A06q6J16l31M26j68j50K22j75J47l5j99L45l01J4j97L66m08M63j05J6K89
$$ plain form
5148 -282 54 114 70 -85 -9 -137 -391 44 141 -63 116 -191 -194 3 -69 37 -248 -113 -25 151 -171 -197 281
5171 281 -96 -317 186 -84 198 -33 -79 -115 -42 -154 96 25 24 -69 -29 197 -65 7 -34 54 255 -29 128 -31
5195 -31 59 1 61 72 10 -25 1 -143 -294 -98 205 -467 70 13 2 -23 114 -24 -179 24 192 278 29 -21
5219 -21 -92 -20 -120 183 -243 -61 202 260 -204 162 86 116 99 -125 186 -388 8 110 -244 -229 -142 -138 -59 95
5243 95 -31 185 -90 -135 117 59 -159 -151 -32 -55 -16 32 -5 13 -72 29 -210 215 114 -123 -465 -447 234 214
5267 214 -95 65 -207 -116 135 81 -65 -79 -125 125 56 -94 -77 158 -84 -130 125 -31 36 -207 -186 39 109
5290 109 59 -96 -31 102 -123 7 127 151 -74 83 54 -205 -93 103 -46 149 17 100 41 52 -4 123 106
5313 106 20 136 -195 231 63 -87 135 -40 107 72 -127 218 -83 -69 -266 100 -308 155 50 66 355
5334C55l62J43o6M2k47K45n47M48J67l0k96M47j24J5l6q6m9J59r9j91m3N2k6J00
5358b9q8RL10j20Lk43N7J20j5J79k65J99j54J23j81K35l6j97p3J5Q0J68J13l66
5382a56N8J88j40K77R0k49J42l79L9j24L37Q0j11l6j44J31Q7j91J9O83n30j06
5404c5m1jK70j43j57K03l40K61k78M53nk43j9p8q4j5J04L56l31K83j57l0K56j63
5428F6l6Oo9J25p7Q7k14J05j1P8j49n1M45l53j48J21J50J07k02l97K08OL94j46
5452D5q4R1Q7o1J20k20R8Lm5k24K87j21R9o3qJ99j50pQ4o0o4j85J97J94j04P0
5478A78m7r7N4o9k28K93Nk98J46K6o0L4K55k51J61k40l6J28j1K05m36K61k15L25
5502H3J5q6p2N8Q9m6mj65J8R6k10K69Jk36O9l2J02J68k51P1J06j80L24k46j55
$$ plain form
5334 355 -7 136 70 112 -135 110 -437 11 178 148 -148 299 175 190 154 68 19 178 79 -112 -155 -103 -129 -29
5358 -29 -117 -108 202 82 85 -158 -101 19 4 183 -82 117 -37 86 -95 140 104 -93 -166 -151 -71 97 210 -156
5382 -156 -98 90 -50 227 317 68 210 -169 -130 -254 83 163 52 16 -128 3 90 -101 -82 601 71 -35
5404 -35 -76 -77 193 50 -107 96 -244 17 -261 192 187 -56 -75 -153 -237 -252 -148 208 -123 160 3 -27 229 66
5428 66 30 36 -33 92 15 102 -112 -7 -18 60 -89 -140 305 -48 -196 -75 75 182 -20 -417 -209 -203 191 45
5452 45 -39 52 139 78 198 -22 76 79 34 -190 97 -24 75 12 4 203 53 46 130 70 6 -179 18 212 108 178
5478 178 131 34 88 19 -209 84 89 -209 -63 -37 -97 -63 192 -59 102 -138 -174 -46 -57 148 -288 -27 -242 83
5502 83 98 12 -60 -2 87 41 37 -128 -110 -14 -224 45 46 -190 -121 -153 -51 117 -134 -63 43 -137 187 -59 -214
5527b14K96m4j82j86P55n15K66k01K8K09K1k03j62J42j11J41M8L0p7J8K1l4P8
5550A24m1k32J66j43o7N7K05j25j97N04l85K46m28L54j58P6m7l0q1J87K44j75
5572E4R7j37l56M34j0o6J18q6r1J46k12J59Q2n1L1r1n7l8Kl0M8L5L93m07L6K87
5598B90k96J7L56k21Rk50K45j53j03J94j88PN9m5j5j36K59R8L4k80J59l17L10
5621C3j86Qj37K32L8K30k57p6k84K22j14J34Q6J14j01P6q7K15J27m13K86m3o5
5644C8j09K06Q0l85K26j93l8R6J18K3P3ML6j27J37k38k2P8J25J3j90N4m30N10
5668H5j42K81j56K1L2J48k38m7k6k81K58l4J02L5J05l1j77J6J81m32M27k20K71
5691A78m9M4j41P9o2O2R3j31j8r7P6o3J01n1J69j78j4r8Q5M4p0L3n7J14P5l78
$$ plain form
5527 -214 82 38 -144 -330 425 -90 176 -25 3 212 233 30 -132 10 -101 40 88 118 41 59 80 46 124
5550 124 83 -149 17 -126 -193 -136 69 -56 -253 251 -134 112 -316 38 -120 -44 -91 -121 -202 -15 229 54
5572 54 151 14 -342 92 82 16 134 48 -43 103 -109 50 132 81 112 21 -36 -74 -72 -102 -54 -19 374 -33 3 290
5598 290 -6 11 367 146 155 -95 150 -3 -106 88 -100 -93 -34 -79 -94 -230 29 127 161 -119 40 -277 33
5621 33 -153 -145 -282 -50 -12 218 -39 -115 -399 -177 -291 -157 -71 43 -58 18 -69 146 273 -140 146 103 38
5644 38 -71 135 215 -170 56 -137 -175 -79 39 62 135 139 175 48 185 -53 -75 3 128 141 -49 5 -425 85
5668 85 -57 224 68 89 121 269 31 -16 -42 -323 -65 -99 3 38 143 112 -65 -49 132 -300 127 -93 178
5691 178 129 173 32 111 49 111 204 73 55 -42 34 -29 72 21 190 12 -2 -100 -15 29 -41 -8 -65 49 124 -254
5717b54J9K16J58j24q2k29J47j24J52M8j71L17p1o6J72k5p4m2n1R1j93j23M70
5740A61j70k30K15l3J42P8j84n2J41L8j78m3P5J09k2J57j06j03J00p8L8J01j76
5763b0K6j20K37l1l9k01K32p2l5K37l80K58o2k65K0K7J49j05K44k3Qj9k48L03
5787A21l14K92j16j66M93k4m05K71J18k24J78n90L41j35K08N1r4J80j13k41K27
5808E8m5o6K32l42J37L3n4J54n5P1j98j24K86k6j94J54j1j56r8K85J25k42k71
5831c47N04k57K79k35J64L9j88o0m9M6j36K91n6j87J41K66q3n5k02J41k84n3M64
5854A43j67j25J6L8J08p8M7m5J0k5k92L85k37L32k03R7O8K4k00J1L87m06K23J25
5878B36j62k5j2J0l48J32J94O8j75M7J0K96l30J67n7j12M4o9J5K3J88k01L40l31
$$ plain form
5717 -254 -235 -19 139 15 -67 -296 -149 -273 -121 -73 -244 73 2 -64 108 83 9 -33 -84 7 -186 -309 161
5740 161 -9 -239 -24 -57 85 163 -21 -73 68 106 -72 -115 -40 69 47 204 98 -5 95 17 55 156 -20
5763 -20 6 -114 123 92 53 -148 84 12 -23 214 -166 92 30 -235 -215 -188 -39 -144 100 77 85 66 -182 121
5787 121 -193 99 -17 -183 310 286 -119 152 270 46 224 -366 -25 -160 48 99 5 185 72 -169 58
5808 58 13 -53 179 -163 -26 7 -47 107 52 123 -75 -199 87 61 -133 21 10 -146 -244 41 166 -76 -347
5831 -347 157 -100 179 -56 108 147 -41 -101 -150 -104 -240 51 -5 -192 -51 215 132 77 -125 16 -268 -321 143
5854 143 -24 -149 -133 -95 13 -65 -18 -63 -53 -78 -370 15 -222 110 -93 4 72 96 -104 -93 294 -112 111 236
5878 236 74 49 37 47 -301 -169 25 93 -82 -35 -25 271 -59 108 51 -61 -17 -86 -71 -48 140 -61 279 -52
5902e2J35k20J66j25N6J0o3Ml8O4M58o05J2J61Nq2N07j50j8k39Q0q9k9%N8j29
5928a23KN6J01p1Q4j51J78l07K41k41P3P9pK14q1Q3k90K12o5k54L44j46P4j6L75
5953C64j52l5j14l1K25l65K08j81J63j17J00q6rO7Q9Pq7J15j60J04k84O3L96n85
5977c05K13j2J74k29K68j14KL18l46K32n3J12l57K14k52L01j94N0j2j9J71l16
5999a54O9J9O4j5j27J71nQ6j31J48n0J85k92N2oJ33k00R1J14M0l69K23J10m5j16
6024eJ35l01L49j7l02K19j65K59l02K18k22J33OJ20j4q1J22k72J05r2L9K08j59
6047a9M0k38Q8K72n6mJ7M9l17p8L22o1j60P7K4Q0k23K01J57r5j40k15L95j10J57
6072A63rp3j54N9j18P2M8j9j28L78k78RK27j16K1j67Q7k8Q7l3k3j25M16j20j57
$$ plain form
5902 -52 83 -137 29 -96 -40 -30 -93 -89 -127 -63 395 -210 -198 -37 -32 -114 393 243 225 -14 66 -23 -52 -52 6 -123
5928 -123 -121 -65 36 -35 49 -102 76 -231 10 -231 -158 -79 -86 128 47 130 -160 52 -13 -267 77 -69 5 -11 364
5953 364 212 177 63 32 257 -108 100 -81 82 -35 65 -21 -30 37 126 133 46 161 1 105 -179 -116 280 -305
5977 -305 -92 -104 70 -159 109 -5 -3 315 -31 201 148 260 -97 117 -135 166 -28 22 10 -9 162 -154
5999 -154 -85 -66 -2 -17 -144 27 22 108 -23 125 75 260 -32 20 14 147 -53 38 152 192 -177 46 156 111 -5
6024 -5 130 -171 178 161 -141 78 -87 172 -130 88 -134 -1 5 125 111 30 152 -120 -15 -107 -68 140 -19
6047 -19 21 -217 -129 143 87 83 100 149 -168 -246 76 15 -145 -68 -44 36 -187 14 171 76 -64 -279 116 6 163
6072 163 154 81 -73 -14 -132 -60 -12 -31 -159 219 -59 -50 177 61 82 -85 2 -26 61 28 5 -120 296 176 19
6097A9j16M3M8L67M0l13l02K11k86M75j42k2j09J64J6j77j87J18K52k53K08o4
6119a0J08l5p8o1j06K95L1k94L1J71J7n4j52J4K14j03L37k2l28l0L81l08P1j85
6143i6R7j32J83l6K29j47Rm60M47Q7n3oj65K66n12L39K2J9j35l2K68l0m70L31
6167B3k7k81N15J87m95P7P7J05j72k14K86j92J83l7J85l08K68k19QK37Ok90M6
6190c2k83L74Lj05j02K25L21l93Pl9L07k49J58k30j30p2M73l0k07L71l14j52J05
6213FpJ45k49J53j75L24j97J69k03Q4q7j28M32k32j45k22K14K86j37r4j07L9J26
6236eR7K02l98K17Q7l5j72K0m3J24K03j29Oo0k18J95k55m7P2L15j53R0k1k54M1
$$ plain form
6097 19 -97 -54 -6 361 401 88 -214 -3 -289 186 44 22 -87 77 93 -84 -271 -153 99 -154 54 -10
6119 -10 98 63 -15 -76 -182 113 144 -150 -119 52 69 15 -137 -123 91 -12 325 303 -25 -55 326 18 89 -96
6143 -96 1 -131 52 16 245 98 107 -353 94 181 128 122 -43 223 -289 50 72 91 -44 -76 192 162 -308 23
6167 23 -4 -285 230 417 -78 -1 76 181 9 -205 81 -111 72 35 220 -88 180 -39 -31 206 212 -78 -32
6190 -32 -315 59 62 -43 -145 80 401 8 15 -24 283 34 192 -38 -168 -240 233 203 -4 367 53 -99 6
6213 6 -1 144 -105 48 -127 197 0 169 -34 50 -37 -165 267 35 -110 -332 -118 168 31 -63 -170 -131 -5
6236 -5 92 294 -104 113 200 165 -7 13 -30 94 297 168 174 114 -104 91 -164 -211 -139 176 23 113 92 -162 -121
$$ [...]
8191A16
##END NTUPLES=NMR FID
##END=
