##TITLE=1H_DE-1AcClold2Bor
 200.13Hz, .
 8 sc
 20.8.2026
##JCAMPDX= 6.0         $$ Bruker NMR JCAMP-DX V2.0
##DATA TYPE= NMR FID
##DATA CLASS= NTUPLES
##ORIGIN= UXNMR, Bruker Analytische Messtechnik GmbH
##OWNER= pz
$$ XWIN-NMR		Version 3.5
$$ Thu Aug 20 13:43:56 2026 Russian Standard Time (UT+4h)  she@DPX200
##.OBSERVE FREQUENCY= 200.131
##.OBSERVE NUCLEUS= ^1H
##.DELAY= (6, 6)
##.ACQUISITION MODE= SIMULTANEOUS
##.ACQUISITION SCHEME= undefined
##.AVERAGES= 8
##.DIGITISER RES= 18
##SPECTROMETER/DATA SYSTEM= spect
##.PULSE SEQUENCE= zg30
##.SOLVENT NAME= CDCl3
##.SHIFT REFERENCE= (INTERNAL, CDCl3, 0, 14.3821)
##AUDIT TRAIL= $$ (NUMBER, WHEN, WHO, WHERE, WHAT)
$$ ##TITLE= Audit trail, XWIN-NMR		Version 3.5
$$ ##JCAMPDX= 5.01
$$ ##ORIGIN= Bruker BioSpin GmbH
$$ ##OWNER= she
$$ F:/spectra/data/she/nmr/H-C/1/audita.txt
$$ ##AUDIT TRAIL=  $$ (NUMBER, WHEN, WHO, WHERE, WHAT)
(   1,<2026-08-20 13:42:41.90 +0400>,<she>,<DPX200>,
      <created by zg, POWCHK disabled, PULCHK disabled
       configuration hash MD5:
       00 E9 B6 7A A2 85 ED C7 34 08 36 98 17 FE 4E 26
       data hash MD5: 16K
       B1 C5 76 22 EE BC 43 1D D2 AC ED FC 8A 85 EB F1>)
$$ ##END=
$$ 
$$ hash MD5
$$ AE CF 0C CF A0 D4 33 A8 19 55 F3 F9 88 5E 7F 03
##$RELAX= 
##$RELAX= 
##$RELAX= 
##$RELAX= 
##$RELAX= 
##$RELAX= 
$$ Bruker specific parameters
$$ --------------------------
##$DU= <F:/spectra>
##$EXPNO= 1
##$NAME= <H-C>
##$PROCNO= 1
##$TYPE= <nmr>
##$USER= <she>
##$AMP= (0..31)
100 100 100 100 100 100 100 100 100 100 100 100 100 100 100 100 100 100 
100 100 100 100 100 100 100 100 100 100 100 100 100 100 
##$AQSEQ= 0
##$AQ_mod= 1
##$AUNM= <au_zg>
##$AUTOPOS= <>
##$BF1= 200.13
##$BF2= 200.13
##$BF3= 200.13
##$BF4= 200.13
##$BF5= 200.13
##$BF6= 200.13
##$BF7= 200.13
##$BF8= 200.13
##$BYTORDA= 1
##$CFDGTYP= 0
##$CFRGTYP= 5
##$CHEMSTR= <none>
##$CNST= (0..31)
1 1 145 1 1 1 1 1 1 1 1 1 1 1 1 1 1 1 1 1 1 1 1 1 1 1 1 1 1 1 1 1 
##$CPDPRG= <>
##$CPDPRG1= <>
##$CPDPRG2= <>
##$CPDPRG3= <>
##$CPDPRG4= <mlev>
##$CPDPRG5= <mlev>
##$CPDPRG6= <mlev>
##$CPDPRG7= <mlev>
##$CPDPRG8= <mlev>
##$CPDPRGB= <>
##$CPDPRGT= <>
##$D= (0..31)
0 0.7 0 0 0 0 0 0 0 0 0 0.03 0 0 0 0 0 0 0 0 0 0 0 0 0 0 0 0 0 0 0 0 
##$DATE= 1787218961
##$DBL= (0..7)
120 120 120 120 120 120 120 120 
##$DBP= (0..7)
150 150 150 150 150 150 150 150 
##$DBP07= 0
##$DBPNAM0= <>
##$DBPNAM1= <>
##$DBPNAM2= <>
##$DBPNAM3= <>
##$DBPNAM4= <>
##$DBPNAM5= <>
##$DBPNAM6= <>
##$DBPNAM7= <>
##$DBPOAL= (0..7)
0.5 0.5 0.5 0.5 0.5 0.5 0.5 0.5 
##$DBPOFFS= (0..7)
0 0 0 0 0 0 0 0 
##$DE= 6
##$DECBNUC= <off>
##$DECIM= 32
##$DECNUC= <off>
##$DECSTAT= 4
##$DIGMOD= 1
##$DIGTYP= 9
##$DL= (0..7)
0 120 120 120 120 120 120 120 
##$DP= (0..7)
150 150 150 150 150 150 150 150 
##$DP07= 0
##$DPNAME0= <>
##$DPNAME1= <>
##$DPNAME2= <>
##$DPNAME3= <>
##$DPNAME4= <>
##$DPNAME5= <>
##$DPNAME6= <>
##$DPNAME7= <>
##$DPOAL= (0..7)
0.5 0.5 0.5 0.5 0.5 0.5 0.5 0.5 
##$DPOFFS= (0..7)
0 0 0 0 0 0 0 0 
##$DQDMODE= 0
##$DR= 18
##$DS= 0
##$DSLIST= <SSSSSSSSSSSSSSS>
$$ [...]
##$SUBNAM0= <"">
##$SUBNAM1= <"">
##$SUBNAM2= <"">
##$SUBNAM3= <"">
##$SUBNAM4= <"">
##$SUBNAM5= <"">
##$SUBNAM6= <"">
##$SUBNAM7= <"">
##$SUBNAM8= <"">
##$SUBNAM9= <"">
##$SW= 18.0517599122864
##$SWIBOX= (0..15)
0 0 2 0 0 0 0 0 0 0 0 0 0 0 0 0 
##$SW_h= 3612.71676300578
##$TD= 16384
##$TD0= 1
##$TE= 0
##$TE2= 300
##$TE3= 300
##$TEG= 300
##$TL= (0..7)
0 120 120 120 120 120 120 120 
##$TP= (0..7)
150 150 150 150 150 150 150 150 
##$TP07= 0
##$TPNAME0= <>
##$TPNAME1= <>
##$TPNAME2= <>
##$TPNAME3= <>
##$TPNAME4= <>
##$TPNAME5= <>
##$TPNAME6= <>
##$TPNAME7= <>
##$TPOAL= (0..7)
0.5 0.5 0.5 0.5 0.5 0.5 0.5 0.5 
##$TPOFFS= (0..7)
0 0 0 0 0 0 0 0 
##$TUNHIN= 0
##$TUNHOUT= 0
##$TUNXOUT= 0
##$USERA1= <user>
##$USERA2= <user>
##$USERA3= <user>
##$USERA4= <user>
##$USERA5= <user>
##$V9= 5
##$VALIST= <valist>
##$VCLIST= <CCCCCCCCCCCCCCC>
##$VD= 0
##$VDLIST= <DDDDDDDDDDDDDDD>
##$VPLIST= <PPPPPPPPPPPPPPP>
##$VTLIST= <TTTTTTTTTTTTTTT>
##$WBST= 1024
##$WBSW= 4
##$XGAIN= (0..3)
0 0 0 0 
##$XL= 0
##$YL= 0
##$YMAX_a= 625151
##$YMIN_a= -626560
##$ZGOPTNS= <>
##$ZL1= 120
##$ZL2= 120
##$ZL3= 120
##$ZL4= 120
##$ABSF1= 10
##$ABSF2= 0
##$ABSG= 5
##$ABSL= 3
##$ALPHA= 0
##$AQORDER= 0
##$ASSFAC= 0
##$ASSFACI= 0
##$ASSFACX= 0
##$ASSWID= 0
##$AUNMP= <proc_1d>
##$AZFE= 0.1
##$AZFW= 0.1
##$BCFW= 1
##$BC_mod= 2
##$BYTORDP= 1
##$COROFFS= 0
##$CY= -3
##$DATMOD= 1
##$DC= 2
##$DFILT= <>
##$DTYPP= 0
##$F1P= 0
##$F2P= 0
##$FCOR= 0.5
##$FTSIZE= 0
##$FT_mod= 4
##$GAMMA= 1
##$GB= 0.15
##$INTBC= 1
##$INTSCL= 1
##$ISEN= 128
##$LB= 0.25
##$LEV0= 0
##$LPBIN= 0
##$MAXI= 10000
##$MC2= 0
##$MEAN= 0
##$ME_mod= 0
##$MI= 1.114404
##$NCOEF= 0
##$NC_proc= 0
##$NLEV= 6
##$NOISF1= 3.799351
##$NOISF2= 2.8
##$NSP= 1
##$NTH_PI= 0
##$NZP= 0
##$OFFSET= 14.38212
##$PC= 1
##$PHC0= -4508.281
##$PHC1= 31.9923
##$PH_mod= 1
##$PKNL= yes
##$PPARMOD= 0
##$PSCAL= 0
##$PSIGN= 0
##$REVERSE= no
##$SF= 200.129724274929
##$SI= 16384
##$SIGF1= 3
##$SIGF2= 2
##$SINO= 400
##$SIOLD= 16384
##$SREGLST= <1H.CDCl3>
##$SSB= 0
##$STSI= 0
##$STSR= 0
##$SW_p= 3205.1282051282
##$SYMM= 0
##$S_DEV= 0
##$TDeff= 0
##$TDoff= 0
##$TI= <>
##$TILT= no
##$TM1= 0
##$TM2= 0
##$TOPLEV= 0
##$USERP1= <user>
##$USERP2= <user>
##$USERP3= <user>
##$USERP4= <user>
##$USERP5= <user>
##$WDW= 1
##$XDIM= 8192
##$YMAX_p= 0
##$YMIN_p= 0
$$ End of Bruker specific parameters
$$ ---------------------------------
##NTUPLES= NMR FID
##VAR_NAME=  TIME,          FID/REAL,        FID/IMAG
##SYMBOL=    X,             R,               I
##VAR_TYPE=  INDEPENDENT,   DEPENDENT,       DEPENDENT
##VAR_FORM=  AFFN,          ASDF,            ASDF
##VAR_DIM=   8192,          8192,            8192
##UNITS=     SECONDS,       ARBITRARY UNITS, ARBITRARY UNITS
##FACTOR=    0.0002768,     1,               1
##FIRST=     0,             0,               0
##LAST=      2.2672688,     0,               0
##MIN=       0,             -626560,         0
##MAX=       2.2672688,     625151,          0
$$ Real data points
##PAGE= N=1
##DATA TABLE= (X++(R..R)), XYDATA
0@%%%%%%%kKqJ6j6J6k4M0m8N6p2Q8j04J23j50J82k13K51k99L48l98M56n28O08
31C24o90P85q95J009j133J275j431J600j784J989k214K454k717L009l326L669
47A924m047M464m919N416n968O579p253Q011q868R838j0943J2222j3732J5532
61H256j7721K0462k4002K8772l5583M6170o4970J08138l80558k9983R43267k34105
73C68143q30701l7866Q89530J59371p98499l66186P56138M82954o20533o28911
83f26560N07151P03973l37467p84023J89673Q02355j2840q07958j40131P58740
93B52913L02620o95089m37146N93649N63980m82342o54764L44329P22955k00019
103C11086p53971M3706P60349J07188p32954k54027O77510L85393n90117n01804
$$ plain form
0 0 0 0 0 0 0 0 0 -2 0 -8 8 -8 8 -16 24 -24 32 -40 48 -56 67 -83 99 -114 137 -162 186 -212 244 -284 324
31 324 -366 419 -476 533 -600 675 -756 844 -940 1049 -1165 1289 -1428 1581 -1745 1924
47 1924 -2123 2341 -2578 2838 -3130 3449 -3804 4207 -4661 5177 -5766 6456 -7276 8256
61 8256 -9465 10997 -13005 15767 -19816 26354 -38616 69522 -311036 -341019 602248 368143
73 368143 -462558 -500424 389106 548477 -250022 -616208 139930 622884 2351 -626560
83 -626560 -119409 584564 247097 -536926 -347253 455102 442262 -365696 -505827 252913
93 252913 555533 -139556 -576702 16947 580927 98585 -556179 -211850 511105 311086
103 311086 -442885 -399179 361170 468358 -264596 -518623 158887 544280 -45837 -547641
113e47641M80421N96416l52881o67750K15782P09126p2267p17917p2251O93658
123B64696K13359o41499l44254N65087M58853m67352n50703L50283O16678k19209
133B45939o56211Q1442O69611N5919o55821j87009O13525L07312n44314m13131
143d82738M53360N01217l46539n68303K28544O10662j03005o25921k5695O14959
153B56541J51776n80328k69385N23681L73174m45246m59088L46449N25278k32592
163A90260n70759J10634N94269J3114n93021j34121N64871K48709n11451l52716
173d40211M37239M41888l47074n11416K43753N57404j29995n78069J0256N74768
183B58543J08728n49503k20483N03110L19727m35457m02816L48661M67534k47991
$$ plain form
113 -547641 -67220 529196 176315 -491435 -275653 433473 361206 -356711 -428962 264696
123 264696 478055 -163444 -507698 57389 516242 48890 -501813 -151530 465148 245939
133 245939 -410272 -328830 340781 396700 -259121 -446130 167395 474707 -69607 -482738
143 -482738 -29378 471839 125300 -443003 -214459 396203 293198 -332723 -358418 256541
153 256541 408317 -172011 -441396 82285 455459 10213 -448875 -102426 422852 190260
163 190260 -380499 -269865 324404 337518 -255503 -389624 175247 423956 -87495 -440211
173 -440211 -2972 438916 91842 -419574 -175821 381583 251588 -326481 -316225 258543
183 258543 367271 -182232 -402715 100395 420122 -15335 -418151 -69490 398044 150053
193A50053n12436J39498N35938k7866n36274q3376N12919J90563m68433k88883
203c88297M06705L73717l30813m40772K41984M87144j41948n12160L5044N16897
213B47501P2532n02286j75175M67626K69053m12446l51095L38853M18780k51906
223A21437m69477J56794N00173n6881n08120m5296M92613J46414m56180k41584
233c60107M02653L25481l34470l93700K52878M43127j60232m72525O1198M82189
243B46492L8314m72215j33681M42058K21950l92062l00682L25462L67092k47673
253I5055m17935J62901M50280p3426m61960j9041M53158J11124m26156j98040
263c24040L83445K75357l26112l39811K54535L89634j71307m23656Q1422M41125
$$ plain form
193 150053 -362383 -222885 313053 285187 -251087 -334463 178456 369019 -99414 -388297
203 -388297 18408 392125 61312 -379460 -137476 349668 207720 -304440 -269396 247501
213 247501 320033 -182253 -357428 110198 379251 -33195 -384290 -45437 373343 121437
223 121437 -348040 -191246 308927 252046 -256074 -301370 191243 337657 -118523 -360107
233 -360107 42546 368027 33557 -360143 -107265 335862 175630 -296895 -235697 246492
243 246492 284806 -187409 -321090 120968 342918 -49144 -349826 -24364 342728 95055
253 95055 -322880 -159979 290301 216875 -245085 -264126 189032 300156 -126000 -324040
263 -324040 59405 334762 8650 -331161 -76626 313008 141701 -281955 -200533 240592
273B40592R709m40635r8460M20457J82601l80438k59841L23583L26849k54247
283G0170l80249J76054M16927r1097m34814J912M33778Q7010m14998j70657L79882
294G3918K44817l28959l06992K63003L55887j85626l90092J02087M08474j7387
304B19130m09633o5645L92634J45149l58290k18302L09541K81622k49818l31821
314b85433J81069L66928j04439l86102K2266L89732O0913l78840j39800L53420
324G9714K11094l13111k72717K58160L23193j91542l60756J17638L83658m0284
334A95047l90248l8280L79643J15945l52850j88931L12089K52990k59989l04265
344b78849J97563L41044j26042l62554M8292L69122L0499l60893j05691L37893
$$ plain form
273 240592 250301 -190334 -288794 131663 314264 -66174 -326015 -2432 324417 70170
283 70170 -310079 -134025 282902 191805 -243009 -241097 192681 279691 -135307 -305964 73918
294 73918 318735 -10224 -317216 -54213 301674 116048 -274044 -171957 236517 219130
304 219130 -190503 -256148 136486 281635 -76655 -294957 14584 296206 46388 -285433
314 -285433 -104364 262564 158125 -227977 -205711 184021 244934 -133906 -273706 79714
324 79714 290808 -22303 -295020 -36860 286333 94791 -265965 -148327 235331 195047
334 195047 -195201 -233481 146162 262107 -90743 -279674 32415 285405 25416 -278849
344 -278849 -81286 259758 133716 -228838 -180546 188576 219075 -141818 -247509 90384
354I0384J74486l00160k35376K49368K86409j89045l25071J23236L48961n4330
364A68862l56779j6856L48856Q8455l26832j56734K92949K17471k48919k67509
374b57036J95229L05318j32552l30388O3736L42182O862l40082p5675L23423J40866
385B41883k92247k00998K48104K53682j94306k95604J34136L24003o9354l37498
395a88199J333L35803O7739l20066j33557K91543J92194k51454k41186K00538
405d5312K79746j40769l07028P5993L21713j0637l22505n2456L08675J12323k80785
416f1042j67880K40867K16942j92320k56449J37856K84131p8828k99108J6237
426a59594L01489M7438k91759j08539K70742J63501k38501k10786J95355K49774
$$ plain form
354 90384 264870 -35290 -270666 -21298 265111 76066 -249005 -125769 223192 168862
364 168862 -187917 -204773 144083 232538 -94294 -251028 41921 259392 10473 -257036
374 -257036 -61807 243511 110959 -219429 -155693 186489 193351 -146731 -222406 101017 241883
385 241883 -50364 -251362 -3258 250424 56118 -239486 -105350 218653 149299 -188199
395 -188199 -186866 148937 216676 -103390 -236947 54596 246790 -4664 -245850 -45312
405 -45312 234434 93665 -213363 -137370 184343 173706 -148799 -201255 107420 219743 -61042
416 -61042 -228922 11945 228887 36567 -219882 -82026 202105 123277 -175831 -159594
426 -159594 141895 189333 -102426 -210965 59777 223278 -15223 -226009 -30654 219120
436B19120j42891k79513Q4609K98315k4264l04445l5860K97140R4529k76710j49960
447b19930K44756J98795k03304k37896J53982K65577r7840k81682L6735K86511
457A45704K5613k80139q4739K62323J37700k33098j83409J93185K21348j44756
467E9732k50369R1353K68584l5997k74794j9730K69057P4779k52183j27204K25805
478B9033J73691j91388k11414J49864K39181j01719k56928M8359K64757P131k62282
489a11715o1324K49097J11951k25321j58054J91912J98169j50602k30104J03990
499h2001K51084n3690k60171Q13K57687N3396k44798j05924K22614J52845j91863
510hj91488J53366K20818j07993k40803N7942K50911o361k50472m3535K39004
$$ plain form
436 219120 76229 -203284 -118675 179640 155376 -149069 -184929 112211 206740 -69970 -219930
447 -219930 24826 223621 20317 -217579 -63597 201980 104140 -177542 -140807 145704
457 145704 171317 -108822 -193561 68762 206462 -26636 -210045 -16860 204488 59732
467 59732 -190637 -99284 169300 133303 -141491 -161221 107836 182615 -69568 -196772 29033
478 29033 202724 11336 -200078 -50214 188967 87248 -169680 -121321 143436 150567 -111715
489 -111715 -173039 76058 188009 -37312 -195366 -3454 194715 44113 -185991 -82001
499 -82001 169083 115393 -144778 -143965 113722 167118 -77680 -183604 39010 191855 -8
510 -8 -191496 -38130 182688 74695 -166108 -108166 142745 136384 -114088 -157623 81381
521H1381R0137k16827j33083J85620J71184j47771k01938J05611K22931o0594
531I6651k33269J3209K33421L5399k24251q2629K06299J25591j80065j62455J46081
542b6018J92799j05565k16190O0817K31229j4672k36015l0944K29723P5293k12984
553e2527j17674J87349J56102j54653j87569J16459K09826p3953k22235K8018
563a10857K25342J9441k19588o5054K04867J05890j81199j40595J49199J69137
573A56583j10444j91322O7655K05819k3697k11193j9518K06949O1121j93688j00491
584a52226J72750J35640j45240j64338J12284J85206p4560j98490L3263K04547
594A08836R558k03220n1020J93662Q8991j75550j22607J49401J51848j16806j75530
$$ plain form
521 81381 171518 -45309 -178392 7228 178412 30641 -171297 -65686 157245 96651
531 96651 -136618 -123409 110012 145411 -78840 -161469 44830 170421 -9644 -172099 -26018
542 -26018 166781 61216 -154974 -94157 137072 122400 -113615 -144559 85164 160457 -52527
553 -52527 -170201 17148 173250 18597 -168972 -52513 157313 83360 -138875 -110857
563 -110857 114485 133926 -85662 -150716 54151 160041 -21158 -161753 -12554 156583
573 156583 46139 -145183 -77528 128291 104594 -106599 -126117 80832 141953 -51735 -152226
584 -152226 20524 156164 10924 -153414 -41130 144076 69516 -128974 -95711 108836
594 108836 118394 -84826 -135846 57816 146807 -28743 -151350 -1949 149899 33093 -142437
605a42437P9621J91893l9893j99212j146J97390M2637j87456q3007J70407J19464
616A48261j46884j49246J17316J71029q2307j85072M3142J91926k212j91335l7612
627a22994J82660P4309j66074j07033J42557J35377j13748j57959Q1249J72926
637A21270m6210j79487R516J78137K8124j70202o4832J56251R8236j36401j26256
648a31854J10731J48358q0043j64760M5817J75085r966j78219k5575J73008N9863
659A22445j59792r2438J39954J22284j15114j47223Q6444J64886n4723j74223
669a07500K0621J75652J4854j70093m9759J57945Q1619j39121j08725J14211J30631
680A20335q4526j47399N2030J58186j8580j61643j4370J57131M6077j45430p6078
$$ plain form
605 -142437 -62816 129077 89184 -110028 -111174 86216 128853 -58603 -141610 28797 148261
616 148261 1377 -147869 -30553 140476 58169 -126903 -83761 108165 105953 -85382 -122994
627 -122994 59666 133975 -32099 -139132 3425 138802 25054 -132905 -51656 121270
637 121270 75060 -104427 -94911 83226 111350 -58852 -123684 32567 130803 -5598 -131854
648 -131854 -21123 127235 47192 -117568 -71751 103334 93368 -84851 -110426 62582 122445
659 122445 -37347 -129785 10169 132453 17339 -129884 -43440 121446 66723 -107500
669 -107500 -86879 88773 103627 -66466 -116225 41720 123339 -15782 -124507 -10296 120335
680 120335 35809 -111590 -59560 98626 80046 -81597 -95967 61164 107241 -38189 -114267
691a14267J27991J03429j06181j26204Q0693J42773n2048j52907K1129J57147
701H1555J0837j55929m1831J48590P0149j34511r4833J13857J16081q8114j33844
712a07993N9195J46822k8787j53123k088J51933L2716j43802o2413J29911Q9760
723A12131j11043j12620Q7555J29432n9927j40269K9452J45648K144j45741l2525
734i5763J39714O0018j27057q4029J08529J04435q5654j20869O0092J32085l2862
745E8639j36992M658J35633K3704j29014n1264J18295P6191j03475r6802Q4245
756a6182J12272o0784j23011L4052J29758n957j31973k1808J28635M8035j19223
767b6186p2215J04472R3979q5703j12221O3969J25313l9765j32125J3629J32725
$$ plain form
691 -114267 13724 117153 10972 -115232 -34539 108234 56186 -96721 -75592 81555
701 81555 92392 -63537 -105368 43222 113371 -21140 -115973 -2116 113965 25851 -107993
712 -107993 -48798 98024 69237 -83886 -85974 65959 98675 -45127 -107540 22371 112131
723 112131 1088 -111532 -23977 105455 45528 -94741 -65289 80359 82503 -63238 -95763
734 -95763 43951 103969 -23088 -107117 1412 105847 20193 -100676 -40584 91501 58639
745 58639 -78353 -73695 61938 85642 -43372 -94636 23659 99850 -3625 -100427 -16182
756 -16182 96090 35306 -87705 -53653 76105 70148 -61825 -83633 45002 93037 -26186
767 -26186 -98401 6071 100050 14347 -97874 -33905 91408 51643 -80482 -66853 65872
778F5872J3567j28063m0407J18939O4986j05243q5712Q6937J01749o4778j13207
789h5360M0174J20124j4753j21762j0428J17438L4666j07491n7517R3343P8215
800H6649p6250r5688N7221J08194l6201j15036J3331J16787J0565j14391l4118
811g8937J08163N5847r7595p4686Q2380R0498o3457j03266M2370J12385k0225
822E3477j16815k043J15240K4327j08099m6059R6484O6355q1508q3729O3545R6736
834G7911m2726j04956J9914J08709L468j08304k5892J03351M6188r3288o3866
845g9491P8471P8896o0310r1165M0574R9898k0373j03907O7J02654K0129r6801
857c1358l9639Q7583N7415p5641p2206O0726Q3303m2802r0710K2596R5113j681
$$ plain form
778 65872 79439 -48624 -89031 29908 94894 -10349 -96061 -9124 92625 27847 -85360
789 -85360 -45186 74938 60185 -61577 -72005 45433 80099 -27392 -84909 8434 86649
800 86649 10399 -85289 -28068 80126 43925 -71111 -57780 59007 69572 -44819 -78937
811 -78937 29226 85073 -12522 -87208 -4828 85670 22213 -81053 -38683 73702 53477
822 53477 -63338 -65381 49859 74186 -33913 -79972 16512 82867 1359 -82370 -18825 77911
834 77911 35185 -69771 -49857 58852 62320 -45984 -71876 31475 77663 -15625 -79491
845 -79491 -1020 77876 17566 -73599 -33025 66873 46500 -57407 -57340 45314 65443 -31358
857 -31358 -70997 16586 74001 -1640 -73846 -13120 70183 27381 -63329 -40733 54380 52699
869E2699r6499j8703R4160L7557q7206n4614P5877O9636o1176q2309M4287R1761
881F5470k5879r6883O204R7407J4028r3845l3858Q7163N1672p7324o6289O3966
893h168P7131m7106q4462K8086Q8593q389q9523j0530Q6429K8119p9009m4203
905f3032O7903N8539n4574p0374L9979P8727k4288q2761P206Q2852J0738p9889
917b8974k8563P4703M4849o7154n8575N6582O9548m3189p7777K7894Q3247j1768
929D0823q5563m447Q3922K0573p8155l6305O9128N0885n7935o3234M5099P2179
941E6970l0417p7122J3951P8351L458p6563k0296P1892L5543o4100m8647N3017
953c963N9431l9364o7909K4591P3826j0031p6287m137P4685J8010o9262l1475
$$ plain form
869 52699 -43800 -62503 31657 69214 -17992 -72606 3271 72907 11731 -70578 -26291 65470
881 65470 39591 -57292 -51088 46319 60347 -33498 -67356 19807 71479 -5845 -72134 -8168
893 -8168 68963 21857 -62605 -34519 54074 45685 -43838 -54368 32061 60180 -18829 -63032
905 -63032 4871 63410 8836 -61538 -21559 57168 32880 -49881 -42675 40177 50915 -28974
917 -28974 -57537 17166 62015 -5139 -63714 -7132 62416 19227 -58550 -30656 52591 40823
929 40823 -44740 -49187 34735 55308 -22847 -59152 9976 60861 2926 -60308 -15209 56970
941 56970 26553 -50569 -36618 41733 45191 -31372 -51668 20224 55767 -8333 -56980 -3963
953 -3963 55468 16104 -51805 -27214 46612 36581 -39706 -43843 30842 48852 -20410 -51885
965e1885O1106M3908n1228n4455M0089O2235k7366o7053J3228O9296J300o9028
977b9853j5393O6201K8337o0253m0068N1213N0476l9734n9359K7025O6047j3865
989C0774o9682K86O9753J3618o6477k7279O0677L9648n2848m9722M2807N6960
1001D8515l0342o1582J6115O3970j596o4183j1859O1736K3724n6050l4095M7337
1013A690M3028l6618n0308K5036N5383j3148n7593Q53N6968J1870n4209k4073
1025d1121M9758L4890m3814m3657L5934N0272k5976n4930J4457N7906k590n8977
1037b7848q889N7670J9746n3502l0120M6901L9616l8762m7356K9583N2607j9420
1049B0226n4840P924N4340M570n1785j6896M7659K7782m1871l6561L4049M3240
$$ plain form
965 -51885 9221 53129 1901 -52554 -12465 49770 22404 -44649 -31421 37875 39175 -29853
977 -29853 -45246 20955 49292 -10961 -51029 184 50660 10926 -48433 -21408 44639 30774
989 30774 -38908 -38622 31131 44749 -21728 -49007 11670 51318 -1530 -51252 -8445 48515
1001 48515 18173 -43409 -27294 36676 35080 -29103 -40962 20774 44498 -11552 -45647 1690
1013 1690 44718 8100 -42208 -17172 38211 25063 -32530 -31677 25291 37161 -17048 -41121
1025 -41121 8637 43527 -287 -43944 -8010 42262 16286 -38644 -24187 33719 31129 -27848
1037 -27848 -36737 20933 40679 -12823 -42943 3958 43574 4812 -42544 -12961 39646 20226
1049 20226 -34614 -26690 27650 32220 -19565 -36461 11198 38980 -2891 -39452 -5403 37837
1061C7837k4311m7897J3405N0682k497n1283p772M9296J7497m4799k6715L8400
1073A843L5077l1096m1806K3286M6278j4818m8332N499M8218M411m6467j4060
1085c1967M3285K2666l8390l0098L1521L6551k3062m1957J3923M5840m868m7538
1097b4094l942M6552J2884m3047k1906L7657L0356l1160l7222K3788M2019j5460
1109A6425m4536O068M5105L652m3991j2569M1033K0178l6108k6479K9122L1735
1121B9635k0775l5831J1996L8524l628l9212m450L7830J2379l4716j9902L0400
1133B250K6417k5210l1361J8980L4754j1567l6982L338L8211M968l8372j2453
1145b7027L7005J8901l3687k4652K8527K9810k2045l4097J5025L6881p772l7685
$$ plain form
1061 37837 13526 -34371 -20966 29716 27219 -24064 -31836 17460 34957 -9842 -36557 1843
1073 1843 36920 5824 -35982 -12696 33582 18764 -29568 -24069 24149 28560 -17907 -31967
1085 -31967 11318 33984 -4406 -34504 -2983 33568 10506 -31451 -17528 28312 23444 -24094
1097 -24094 -28036 18516 31400 -11647 -33553 4104 34460 3300 -33922 -10134 31885 16425
1109 16425 -28111 -22043 23062 26714 -17277 -29846 11187 31365 -4743 -31222 -2100 29635
1121 29635 8860 -26971 -14975 23549 19921 -19291 -23741 14089 26468 -8248 -28150 2250
1133 2250 28667 3457 -27904 -8924 25830 14263 -22719 -19381 18830 23798 -14574 -27027
1145 -27027 9978 28879 -4808 -29460 -933 28877 6832 -27265 -12240 24641 16869 -20816
1157b0816J12L6673P805l4071j5571L0348K2195k5589k7097J9656L0234j2399
1169A1480l1993M300L2479L798l1693j1095K9447J7465k5705k2994K0727K7691
1181B3907j5159l1139R530L2785l797l2574k366L0968Q972k8558j5280K5575K0474
1194B3338k1905k4274J7163K6981j1301k8897M867K9923J424k9667p327K7833
1206H158J2918k4430j8449J9966K3614j5003k7625R811K9955m384l0435j513K9355
1219A1938P757k7145j3574K3940J8307j9724k1740J4356K4272q296k6010K294
1231a3625K6562L189k5626p976K3091J2414j9309j6726J4932K0431j0336k3053
1243a6032N700K4358q53k4542m322K3925R426k2618j3906K0554J7390j7414k0069
$$ plain form
1157 -20816 -20704 15969 23774 -10297 -25868 4480 26675 1086 -26011 -6355 23879 11480
1169 11480 -20513 -16213 16266 20064 -11629 -22724 6723 24188 -1517 -24511 -3784 23907
1181 23907 8748 -22391 -12861 19924 16127 -16447 -18813 12155 21127 -7431 -22711 2864 23338
1194 23338 1433 -22841 -5678 21303 10002 -18895 -14028 15895 17319 -12348 -19675 8158
1206 8158 21076 -3354 -21803 -1837 21777 6774 -20851 -11040 18915 14531 -15904 -17417 11938
1219 11938 19695 -7450 -21024 2916 21223 1499 -20241 -5885 18387 10091 -15919 -13625
1231 -13625 12937 16126 -9500 -17476 5615 18029 -1280 -18006 -3074 17357 7021 -16032
1243 -16032 -10332 14026 13173 -11369 -15691 8234 17660 -4958 -18864 1690 19080 1666 -18403
1256a8403J3110K2304q039k4134K832K5212K013k5010o485K3399J0758k0565j4816
1269a7824J6942J8155j2675k0328P874K1211k559k1042l125K0177Q493j8573j2958
1282a6232J6076J6176j2438j8557Q005K0335l265k1384j305K1343N466k0081r380
1295a5241J7908J3175j5292j6481J2430J8933r432k0121N983K0163j901j9600
1307i476k542J8655O836j7209j0530J5032J3571j2030j6062Q322J8194m444j9502
1320a1185M77J9672L402j8513p368J6402J1430j3868j5000J0876J7655p560j8934
1333a2514L685J9165N49j8697m656J7505Q230j5399j1038J2255J3323q406j5246
1346a1244M332J6802n93j7450k794J7037N827j5479q842J3275J1820j0880j4344
$$ plain form
1256 -18403 -5293 17011 8972 -15162 -12330 12882 14895 -10115 -16600 6799 17557 -3008 -17824
1269 -17824 -882 17273 4598 -15730 -7856 13355 10796 -10246 -13371 6806 15299 -3274 -16232
1282 -16232 -156 16020 3582 -14975 -6970 13365 10100 -11284 -12589 8754 14220 -5861 -15241
1295 -15241 2667 15842 550 -15931 -3501 15432 6000 -14121 -8138 12025 10124 -9476
1307 -9476 -12018 6637 13473 -3736 -14266 766 14337 2307 -13755 -5433 12761 8317 -11185
1320 -11185 -10708 8964 12366 -6147 -13515 2887 14317 449 -14551 -3675 13980 6420 -12514
1333 -12514 -8829 10336 10885 -7812 -12468 5037 13267 -2132 -13170 -915 12408 4002 -11244
1346 -11244 -6912 9890 9297 -8153 -10947 6090 11917 -3562 -12404 871 12691 1811 -12533
1359a2533Q198J6162n255j7068J833J7477J727j7522n108J7018Q006j5616j0382
1372a3063J3238J2383j0044j4170O448J5624k838j6228p74J5775M358j4379p876
1385a1546J2390J1044r996j3445P166J4664l526j5109n11J4982M651j4565q265
1398a2066J3576J1142j1817j3219R243J4735o181j5912L112J6488j32j6267k755
1411a0053J5130N664j3501q499J1685J0976r673j2823P388J3789m568j4084J268
1424g301J4036K086j3591n247J2531Q146j0669j0735Q124J3100n380j4936K611
1437g225J5866K69j5720l259J4469O479j2668r555J0551J2064q073j3760N192
1450e370J4570j916j4680j501J4307M595j3294p303J1601R476r134j1342O221
$$ plain form
1359 -12533 -4335 11827 6572 -10496 -8663 8814 10541 -6981 -12089 4929 12935 -2681 -13063
1372 -13063 175 12558 2514 -11656 -5208 10416 7578 -8650 -9424 6351 10709 -3670 -11546
1385 -11546 844 11888 1892 -11553 -4387 10277 6751 -8358 -8869 6113 10764 -3801 -12066
1398 -12066 1510 12652 835 -12384 -3141 11594 5413 -10499 -7387 9101 8969 -7298 -10053
1411 -10053 5077 10741 -2760 -11259 426 11402 1729 -11094 -3706 10083 5515 -8569 -7301
1424 -7301 6735 8821 -4770 -10017 2514 10660 -9 -10744 -2620 10480 5100 -9836 -7225
1437 -7225 8641 8910 -6810 -10069 4400 10879 -1789 -11344 -793 11271 3198 -10562 -5370
1450 -5370 9200 7284 -7396 -8897 5410 10005 -3289 -10592 1009 10485 1351 -9991 -3770
1463c770J2948l233j4239N29J4789K057j4524m589J3541P137j2160r403J0510
1476d07J1205q419j2437N698J3254k586j3795n54J4025L353j3543n806J2157Q017
1490A0162r898j0050P046J1842m080j3076J068J3425K156j2978n433J1850Q569
1503A0603j0377j1171Q571J2922o179j3938L263J4339%j4330l152J3936N937j3019
1517b595q215J1396J0143r269j1814P016J2953m665j3479K296J3177M58j2365
1530d963l408J1281O271j0077q661Q522J0458o474j1693L811J2514q22j2975k109
1544h325J2918M790j2006p396J0352R858q127j2113N760J3785l360j4557P94J4461
1558F834J960j3492m900J2047P603j0239r776Q044J1376n445j2435K491J3089
$$ plain form
1463 -3770 9178 5945 -8294 -7765 7024 9081 -5443 -10032 3509 10646 -1514 -10917 -407
1476 -407 10798 2379 -10058 -4360 8894 6308 -7487 -8041 5984 9337 -4206 -10012 2145 10162
1490 10162 264 -9786 -2740 9102 5022 -8054 -6986 6439 8595 -4383 -9816 2034 10603
1503 10603 226 -10945 -2374 10548 4369 -9569 -6306 8033 8033 -6297 -9449 4487 10424 -2595
1517 -2595 -10810 586 10729 1460 -10354 -3338 9615 4950 -8529 -6233 6944 7402 -4963
1530 -4963 -8371 2910 9181 -896 -9557 -1035 9423 2949 -8744 -4933 7581 6759 -6216 -8325
1544 -8325 4593 9383 -2623 -10019 333 10191 2064 -10049 -4289 9496 6136 -8421 -7627 6834
1558 6834 8794 -4698 -9598 2449 10052 -187 -9963 -1919 9457 4012 -8423 -5932 7157
1571G157L82j3285k912J2804N165j1634p183R731R264p614j1145N565J2433l406
1585E322j3155J108J3221J460j2845m054J2130O340j0941q189R121R624o586j0813
1599h257L595J1870o62j2447k044J2241M652j1267p117R566R426p443j1285N044
1613d128J2520k403j3091m83J3022L560j2628o327J1803Q522j0458j0134Q477
1626a748J1363o081j2234L502J2734r93j2716j361J2092L687j1015n927R543Q040
1640H886p916r688O174J0633m059j1026J501J1018J452j0840m240J0298O663r212
1654c56q742P526J0493n388j1920K993J2879o24j3030j878J2468M442j1271o988
1668i396R711R252p890j0926N813J1925l517j2226Q68J2096J788j1563m185J0586
$$ plain form
1571 7157 7539 -5746 -8658 4146 9311 -2323 -9506 225 9489 1875 -9270 -3705 8728 5322
1585 5322 -7833 -6725 6496 7956 -4889 -8943 3187 9527 -1414 -9603 -482 9142 2556 -8257
1599 -8257 -4662 7208 6546 -5901 -7945 4296 8948 -2319 -9436 130 9556 2113 -9172 -4128
1613 -4128 8392 5989 -7102 -7585 5437 8997 -3631 -9958 1845 10367 -91 -10225 -1748
1626 -1748 9615 3534 -8700 -5198 7536 6543 -6173 -7534 4558 8245 -2770 -8697 846 8886
1640 8886 970 -8718 -2544 8089 4030 -6996 -5495 5523 6975 -3865 -8105 2193 8856 -356
1654 -356 -9098 -1572 8921 3533 -8387 -5394 7485 6861 -6169 -8047 4421 8863 -2408 -9396
1668 -9396 315 9567 1677 -9249 -3436 8489 4972 -7254 -6386 5710 7498 -4065 -8250 2336
1682B336O203r022p923P013R486m788j0869K640J1789o90j1995j243J1526L305
1696G768j0549n516R341P532p932r091O216J0144m027j0929J627J1315Q30j1276
1710d547l110J0648N142r324o993P353Q805n094j0296K725J1228l37j1507k079
1724g386J1183M527j0375o831R257Q649p712r937N824J0683l526j1131R88J1381
1738E594J380j1348l276J0712M886r512o392P885P770o020q925M137R574k148
1752D317r716nR435K390q976m633Q248O550p190p966N582R076l557r900J232J0437
1768E324J074j0469l249R908N380q863p383P444R120n814j0316M050J0785k022
1782D969j0709k23J0199K580r477m724Q526O341p134p599N417Q530l501r201J550
$$ plain form
1682 2336 8539 -483 -8406 -1393 8093 3305 -7564 -4924 6865 6175 -5820 -7063 4463 7768
1696 7768 -2781 -8297 1044 8576 644 -8447 -2231 7913 3886 -7043 -5416 5899 6729 -4547
1710 -4547 -7657 2991 8133 -1191 -8184 -831 7974 2880 -7416 -4691 6537 6200 -5307 -7386
1724 -7386 3797 8324 -2051 -8882 375 9024 1312 -8625 -2801 7882 4356 -6775 -5787 5594
1738 5594 6974 -4374 -7650 3062 7948 -1564 -7956 -71 7699 1679 -7246 -3109 6465 4317
1752 4317 -5399 -5404 4031 6421 -2555 -7188 1060 7610 420 -7546 -1964 7112 3555 -6345 -5113 5324
1768 5324 6398 -4071 -7320 2588 7968 -895 -8278 -834 8286 2472 -7844 -3794 6991 4969
1782 4969 -5740 -5963 4236 6816 -2661 -7385 1141 7482 348 -7251 -1834 6696 3195 -6006 -4456
1797d456R541L08r371k080Q745L817p716n580O503P239n251q463L852R245k276
1812D057r538M18R504J546r187l356Q413M950p170o347N477P677l535q797J598
1827d290R410K28r328k124Q730L968p649n834O330P503m986q558L350R147j490
1842D407r426m51R434K290r159l721Q393M900p237n888N739O749m017p533K371
1857c149Q012q13q034p48P659K358p028l949O226N292n149o271L711O948j964
1872C101p419j5P784J911p897l499P426M950o478o221N137P385l633q221K073
1887c616Q576m61q433j261P921L041p278m601O455N773n352o490L981O856k360
1902B751p030O79O979R31o733k330O143L633n308m788M273N836l242o587K149
$$ plain form
1797 -4456 5085 5393 -3978 -6058 2687 6504 -1212 -6792 -289 6950 1699 -6764 -2912 6333 4057
1812 4057 -5481 -5063 4441 5987 -3200 -6556 1857 6807 -363 -6710 -1233 6444 2909 -5888 -4290
1827 -4290 5120 5348 -3980 -6104 2626 6594 -1055 -6889 -559 6944 1958 -6600 -3250 5897 4407
1842 4407 -5019 -5470 3964 6254 -2905 -6626 1767 6667 -570 -6458 -719 6030 2013 -5520 -3149
1857 -3149 4863 4050 -3984 -4732 2927 5285 -1743 -5692 534 5826 677 -5594 -1883 5065 3101
1872 3101 -4318 -4333 3451 5362 -2535 -6034 1392 6342 -136 -6357 -1220 6165 2532 -5689 -3616
1887 -3616 4960 4499 -3934 -5195 2726 5767 -1511 -6112 343 6116 764 -5726 -1745 5111 2751
1902 2751 -4279 -3600 3379 4310 -2423 -4753 1390 5023 -285 -5073 -800 5036 1794 -4793 -2644
1917b644O919r03o891n44O646K117o312l518N742M718m925n633L783O306k342
1932B519o845Q64P071N67o845j910O164L265n121m655L987N835k823o638J610
1947b955O973l13o939j049O633K411o160l556N410M469m469n133L304N668k050
1962B244o158R78O313Oo077r64N505J984m767k993L920L927l048m572J979M971
1978C248p20n195o12N283J915n193k973M757L866l954m647K791N362j519n950
1993c541L10O266P85o133j888N667K961n006l916M217M610l277m997K212N035
2008C305r15m997l01M849J369m592k216M107K872l343l443K466L885j497m295
2023b746O78M390K25m226j250L952K277l651l193L302L862k791m279K005M514
$$ plain form
1917 -2644 4275 3372 -3519 -4063 2583 4700 -1612 -5130 612 5330 405 -5228 -1445 4861 2519
1932 2519 -4326 -3462 3609 4176 -2669 -4579 1585 4850 -271 -4926 -939 4896 2073 -4565 -2955
1947 -2955 4018 3705 -3234 -4283 2350 4761 -1399 -4955 455 4924 455 -4678 -1374 4294 2244
1962 2244 -3914 -2936 3377 3383 -2694 -3658 1847 3831 -936 -3929 -9 3918 870 -3702 -1723 3248
1978 3248 2528 -2667 -3279 2004 3919 -1274 -4247 510 4376 422 -4225 -1434 3928 2409 -3541
1993 -3541 -3231 3035 3820 -2313 -4201 1466 4427 -579 -4495 -278 4332 1055 -3942 -1730 3305
2008 3305 2390 -2607 -2908 1941 3310 -1282 -3498 609 3481 138 -3305 -839 3046 1549 -2746
2023 -2746 -2068 2322 2547 -1679 -2929 1023 3300 -351 -3544 -242 3620 829 -3450 -1445 3069
2038C069r77m628j14M612J161m443k028L920K847l216l537K335M147j430m553
2053b835O06M545L13m220j330L776K297l226l156K739L680k114l971J291M167
2068B562m95m236k12M133P52l755j322L263J814k560k380J900K885j325l202P52
2084a426L240r2l108o96K881J489k560k202K186K786j603l178P77L536O0l855
2100a765p50L924J420l772j967L290K544k639l066J944L412j251l543M99L478
2115A758K34l220r70K948J540k659j844K164K026j475k197P67K265k2k380n37
2131a602K347R77k169j396J870J815j444k247J114K565p95k600K33K612L69k550
2147i01j021K459J592k305k033K042K292j528k518R20K626k57k648l21K466R10
$$ plain form
2038 3069 2092 -2536 -2650 1962 3123 -1320 -3348 572 3419 203 -3334 -999 3148 1718 -2835
2053 -2835 -2229 2316 2629 -1591 -2921 855 3152 -74 -3230 -491 3189 1075 -2896 -1605 2562
2068 2562 2067 -2169 -2381 1752 2504 -1251 -2573 690 2504 -56 -2436 -536 2349 1024 -2178 -1426
2084 -1426 1814 1722 -1386 -2082 799 2288 -272 -2474 -288 2498 895 -2283 -1506 2030 2090 -1765
2100 -1765 -2515 1409 2829 -943 -2910 380 2924 285 -2781 -837 2575 1324 -2219 -1720 1758
2115 1758 1992 -1228 -2198 750 2290 -369 -2213 -49 1977 502 -1695 -928 1337 1315 -1065 -1602
2131 -1602 745 1722 -447 -1843 27 1842 398 -1849 -735 1830 1035 -1565 -1332 1280 1649 -901
2147 -901 -1922 537 2129 -176 -2209 -167 2125 597 -1921 -1001 1625 1368 -1280 -1601 865 1775
2163A775k153j460J690J971j204k418Q67K529m51k462l2K266N77k033j094J837
2179B05J427j549j627J227J710p59j828L58J886n4j853j67J648L83j274p67R19
2196a15J169n88j522L17J752k6j822l57J773Q68j800j248J687J538j424j796J019
2213e75J977m72k209M0K375K57k280n41J979Q31j617j106J242J313q47j355M56
2230e32J287j3j175m10R96Q29q91j052P27J096m55j095J05J108K67j160n49J176
2248B59P69j152r57R93J185q40j393P40J513o10j504L75J406k1j289m26J252P58
2266A058j131j017R76J170o69j273K89J347P2j331l87J199O61r60r25O22J184
2283H85k92j426M6J485J41j387l15J128N97r21p79O82R31m85r39K27Q53J41r09
$$ plain form
2163 1775 -378 -1838 -148 1823 619 -1799 -932 1597 1146 -1316 -1348 918 1495 -538 -1632 205
2179 205 1632 83 -1544 -317 1393 634 -1194 -836 1050 996 -857 -1024 624 1007 -267 -1034 -115
2196 -115 1054 466 -1056 -739 1013 987 -835 -1192 581 1449 -351 -1599 88 1626 202 -1594 -575
2213 -575 1402 930 -1279 -1239 1136 1393 -887 -1428 551 1382 -235 -1341 -99 1214 367 -988 -532
2230 -532 755 742 -433 -843 153 982 91 -961 -234 862 407 -688 -583 525 792 -368 -917 259
2248 259 1028 -124 -1081 -88 1097 257 -1136 -396 1117 507 -997 -622 784 763 -526 -952 300 1058
2266 1058 -73 -1090 -114 1056 387 -886 -597 750 822 -509 -896 303 964 4 -921 -299 885
2283 885 593 -833 -787 698 839 -548 -863 265 862 -59 -838 -156 775 290 -649 -422 431 572 -337
2302c37l86R28N62q80o56P71P03m58q94K30J095n0j248j63J345L40j318n72J245
2321B57Q71j242j069J170J128r44j136O34J089k06j121j68J069N04j018o50P41
2338i1Q34m00r62K4J042K93j011n75Q43Q60o03j172M57J402l12j521J89J501j
2357G97j426k13J252N25j219o57J088P73q80q91O38J050m62j148K47J260j12j222
2375f00n1J036L02q26n93O08R66n05j152K80J201O5j258l65J239P06j181r08R90
2394d6J073p08j219L41J316P1j444l25J393N80j281p73J031R67p39j151M65J231
2412G82k07j204o9J121M46j103p45J054R35r86j057Q78J145o74j215L87J304j23
2430F69j375p6J369L18j272n44J080Q31r49j044P64J136m74j164J38J074L22j035
$$ plain form
2302 -337 -723 205 767 -113 -769 2 705 247 -647 -417 678 628 -620 -783 562 902 -416 -988 257
2321 257 1128 -114 -1183 -13 1115 171 -965 -331 758 552 -569 -737 332 836 -182 -832 -91
2338 -91 743 343 -619 -595 447 740 -271 -846 -3 857 254 -918 -461 941 629 -892 -703 798 797
2357 797 -629 -842 410 935 -284 -941 147 920 40 -851 -213 837 375 -773 -526 734 622 -600
2375 -600 -651 385 687 -139 -732 -124 842 337 -815 -535 666 731 -527 -892 347 1053 -128 -1036 -46
2394 -46 1027 319 -900 -559 757 828 -616 -941 452 1032 -249 -1022 9 976 237 -914 -449 782
2412 782 575 -629 -698 423 869 -234 -979 75 1010 24 -1033 -155 990 316 -899 -512 792 669
2430 669 -706 -782 587 905 -367 -911 169 1000 51 -993 -229 907 433 -731 -593 481 803 -232
2448b32p16R04J050p18j311M85J466j53j637j06J626M70j596p19J428R18j126
2465C3j225Q84J477o82j582M96J574k87j455l5J380K92j221n34J082P15q87q18
2483g93N50J014l07j102l4J255K49j294m47J142P22r61r81P19J272m68j493K27
2501g30J553J25j571m97J567P93j458j072J272J243r36j362N37J472j46j549k15
2518i74J548N37j423q02J190J062r20j272O31J406m21j377J45J323K22j324n48
2535i97J272Q13j221r85J062J131q59j205N61J337l05j355OJ334L06j226o11J040
2553I8R35q16j260O38J430l73j490j6J511L90j425q00J309J179j176j433R22J601
2571A224n64j836L15J856M7j866k97J714N30j425p88J130J027q22j243N63J318
$$ plain form
2448 -232 -948 -44 1006 288 -1023 -538 928 775 -862 -968 658 1128 -468 -1187 241 1159 33
2465 33 -1192 -308 1169 487 -1095 -599 975 688 -767 -802 578 870 -351 -885 197 912 25 -793
2483 -793 -243 771 464 -638 -672 583 832 -462 -909 233 955 -6 -987 -268 1004 536 -957 -730
2501 -730 823 948 -623 -1120 447 1240 -218 -1290 -18 1225 289 -1073 -536 936 790 -759 -974
2518 -974 574 1111 -312 -1114 76 1138 218 -1054 -423 983 562 -815 -670 653 875 -449 -997
2535 -997 275 1088 -133 -1118 -56 1075 216 -989 -428 909 604 -751 -745 589 895 -331 -942 98
2553 98 1033 217 -1043 -405 1025 652 -838 -854 657 1047 -378 -1178 131 1310 134 -1299 -377 1224
2571 1224 660 -1176 -861 995 1042 -824 -1121 593 1123 -302 -1090 40 1067 245 -998 -435 883
2588H83l14j298J2J291K73j145o35J061Q37q59r85N65J204l00j375j7J537K89
2606A024j619m98J502Q02j354j119J159J378q99j574N80J677k34j666k20J683
2622F22N90j617q87J416J148j162j312P92J458m07j504n4J545L92j477o61J304
2639A86J010j094j244Q76J380o07j482L39J463lj435l14J356O59j259r54J130
2656GJ121r22j268O10J442l10j514l5J558L18j448o69J215J081r99j444P83J738
2674A264n45j860K43J862J45j802n54J661R74j562j211J278J475r53j591N39J701
2691A064j91j739r3J631L79j387o70J058R89p70j246M40J443k03j458j61J483
2708E69N16j487q57J452J053j247j282R97J506o54j694K88J877J9j933l39J890
$$ plain form
2588 883 569 -729 -717 574 847 -298 -933 128 965 106 -879 -314 890 590 -785 -802 735 1024
2606 1024 -595 -1093 409 1211 -143 -1262 -103 1275 376 -1198 -618 1059 825 -841 -1061 622
2622 622 1212 -405 -1292 124 1272 110 -1202 -410 1048 641 -863 -917 628 1020 -457 -1118 186
2639 186 1196 102 -1142 -266 1114 507 -975 -636 827 824 -611 -925 431 1090 -169 -1123 7
2656 7 1128 206 -1062 -452 990 680 -834 -869 689 1007 -441 -1110 105 1186 187 -1257 -474 1264
2674 1264 719 -1141 -898 964 1109 -693 -1247 414 1388 -174 -1385 -107 1368 415 -1176 -637 1064
2691 1064 873 -866 -959 672 1051 -336 -1006 52 1041 271 -975 -535 908 705 -753 -914 569
2708 569 1085 -402 -1259 193 1246 -1 -1283 -286 1220 566 -1128 -840 1037 1056 -877 -1216 674
2725F74O67j709j003J470J310j201j534Q28J678m23j719j4J700M87j636q95J475
2742A55J213j250j435Q92J588m64j735N0J780L22j708o66J547J014j311j341J070
2759b79J610q40j752N53J772k06j658k61J628O55j521j012J380J267j129j532
2775a325Q13J774m25j958Q5J997L06j932p29J742J142j503j530J261J797q94k046
2792a425N40K125j41k072l35J976P57j755j142J479J386j053j614O02J823j87
2808I64j903k11J878N96j722r74J463J324j171j602P97J926n10k068J27K108L30
2825A352k147p15K075J036j928j369J692J620j300j835Q33K096m50k158m6K172
2841I28N00k031r52J821J361j527j721J142J985o67k116J40K114M62k081r77J972
$$ plain form
2725 674 1341 -368 -1371 99 1409 208 -1326 -498 1180 757 -962 -976 724 1211 -425 -1320 155
2742 155 1368 118 -1317 -425 1163 699 -1036 -986 794 1116 -592 -1258 289 1303 -8 -1349 -279
2759 -279 1331 491 -1261 -708 1064 858 -800 -1061 567 1222 -299 -1311 69 1336 207 -1325
2775 -1325 -512 1262 837 -1121 -1036 961 1267 -665 -1394 348 1490 -13 -1543 -282 1515 621 -1425
2792 -1425 -885 1240 1099 -973 -1308 668 1425 -330 -1472 7 1393 340 -1274 -672 1151 964
2808 964 -939 -1150 728 1324 -398 -1372 91 1415 244 -1358 -561 1365 855 -1213 -1086 1022 1352
2825 1352 -795 -1510 565 1601 -327 -1696 -4 1616 316 -1519 -686 1410 960 -1198 -1244 928
2841 928 1428 -603 -1555 266 1627 100 -1621 -479 1506 839 -1277 -1137 977 1439 -642 -1619 353
2858C53J424j756j717J366J972r45k168M70K322k0k346m08K197Q43j960j315J690
2875BJ719j380k042J059K216o53k282J50K302L50k222q92K149J309j863j769J539
2892c08K081j062k391O13K593j45k629l62K512Q93k269j411J925J880j573k232
2908a885J130K446n77k526k9K554N50k397j072K149J517j795j881J278K237p47
2924I52k489K16K665K79k645q24K527J316k312j751K010K122j597k439J170K630
2940A830o09k759J2K831N01k764r96K525J470k194j875J689K289j169k575N93
2956a201K694R3k764o53K536J333k335j907K028K340j546k655J001K851l43k953
2972a481l37K930R60k803j523K549K003k125k375J606K696j057k923M98K992N6
$$ plain form
2858 353 1777 21 -1696 -330 1642 697 -1471 -1001 1321 1301 -1045 -1453 744 1587 -373 -1688 2
2875 2 1721 341 -1701 -642 1574 921 -1361 -1211 1091 1441 -781 -1673 476 1785 -78 -1847 -308
2892 -308 1773 711 -1680 -1067 1526 1381 -1248 -1610 902 1795 -474 -1885 40 1920 347 -1885
2908 -1885 -755 1691 1114 -1412 -1441 1113 1663 -734 -1806 343 1860 65 -1816 -538 1699 952
2924 952 -1537 -1321 1344 1623 -1022 -1846 681 1997 -315 -2066 -56 2066 469 -1970 -800 1830
2940 1830 1221 -1538 -1526 1305 1806 -958 -1954 571 2041 -153 -2028 -339 1950 781 -1794 -1201
2956 -1201 1493 1586 -1178 -1831 705 2038 -297 -2204 -176 2164 618 -2037 -1036 1815 1472 -1481
2972 -1481 -1818 1112 2072 -731 -2254 295 2298 173 -2202 -596 2100 1043 -1880 -1382 1610 1666
2988A666k856p58K704J379k472j917K144K380j753k658J148K916n04l099j04L088
3004A304P49k950j378K701J909k224k483J751K934j212l206O12L266Q8l197p77
3020b113K945J513k645k107K219K574j662k926J001L153k98l295l97L255J045
3035B262l054j610K690K155k193k730J684L128j066l426M57L545J60l484q21L327
3051A024J469l043k054K666K491k089k841J332L239o62l395r7L439Q10l287j412
3067b410K839K134k376k778J832L189j145l461L89L562M57l575j251L430J935
3082B771l078k576K636L026j990l396J276L652m98l766k56L692R74l459j647L080
3098D41K339k675k827K084L234j460l465P09L589J32l603r61L500J691l218k334
$$ plain form
2988 1666 -1190 -1948 756 2135 -337 -2254 -110 2270 517 -2141 -993 1923 1419 -1680 -1784 1304
3004 1304 2053 -897 -2275 426 2335 111 -2372 -621 2313 1101 -2105 -1493 1773 1861 -1336 -2113
3020 -2113 832 2345 -300 -2407 -188 2386 724 -2202 -1201 1952 1654 -1641 -2038 1217 2262
3035 2262 -792 -2402 288 2443 250 -2480 -796 2332 1266 -2160 -1703 1842 2002 -1482 -2303 1024
3051 1024 2493 -550 -2604 62 2553 464 -2377 -1045 2194 1532 -1863 -1960 1479 2289 -998 -2410
3067 -2410 429 2563 187 -2591 -759 2430 1285 -2176 -1787 1775 2232 -1343 -2594 836 2771
3082 2771 -307 -2883 -247 2779 789 -2607 -1331 2321 1823 -1943 -2199 1493 2467 -992 -2639 441
3098 441 2780 105 -2722 -638 2596 1136 -2329 -1620 1969 2101 -1502 -2463 1037 2728 -490 -2824
3114b824K758K924k173l398J440L771p29l891q6L853R03l631j726L280K481k770
3130A82l140K192L566j487l831O84L913K23l881j077L691J852l279k560K744L133
3146B925k051l659J343L978o07m129j44M120R06l837j730L445K477l008l098K450
3162f19L533j762l830R30M074j25m077p43L962J493l589k231L004K935k316l518
3178b879J538L950o62m211j66M170J106l980j983L589K788l106l411K440L911
3193C094j661m191P10M437J66m458j026M272J799l889k493L283L154k587l664
3208c054J827M014j001m193J28M151Q44m053j729L782K483l300l142K682L700
3223C139j919m078J009M332l2m435q59M295J761l999k585L471L343k816l928K016
$$ plain form
3114 -2824 -66 2858 685 -2713 -1273 2498 1769 -2122 -2208 1645 2548 -1083 -2809 471 2952 182
3130 182 -2958 -766 2800 1313 -2518 -1834 2079 2302 -1579 -2656 1035 2887 -392 -2952 -208 2925
3146 2925 874 -2785 -1442 2536 1929 -2200 -2344 1776 2682 -1155 -2885 560 3037 29 -3069 -619
3162 -619 2914 1152 -2678 -1748 2326 2201 -1876 -2619 1343 2836 -753 -2984 20 2955 639 -2879
3178 -2879 -1341 2609 1947 -2264 -2430 1740 2846 -1134 -3117 472 3260 154 -3257 -817 3094
3193 3094 1433 -2758 -2048 2389 2555 -1903 -2929 1343 3142 -747 -3240 43 3197 610 -3054
3208 -3054 -1227 2787 1786 -2407 -2279 1872 2716 -1337 -3066 716 3199 -101 -3243 -561 3139
3223 3139 1220 -2858 -1849 2483 2451 -1984 -2843 1452 3213 -786 -3371 100 3443 627 -3301 -1285
3239a285M344j131m514J15M502R07m356j846L971K698l428l377K702L998j961
3254A339m365J023M594p4m618q32M411J738m035k560L478L371k865l974K140M400
3270C171j368m604M62M642N41m510j501M205K312l656l141L018L784k177m285
3285c107J266M621l42m715o39M547J625m151k585L599L450k929m131K098M606
3300C213j098m948J16M996R09m904j819M584K607l973l349L240M000k391m483
3315c300J441M772m77m864m59M726J380m359k291L861L070l176l798K438M263
3330C227j488m579M27M791N86m832j506M516K499m097l286L397M007k509m638
3345c485J626M964n69n110m47M938J563m667k545M173L415l526m083K672M543
$$ plain form
3239 -1285 3059 1928 -2586 -2471 2031 2938 -1418 -3264 707 3405 -23 -3400 -698 3300 1339
3254 1339 -3026 -2003 2591 2517 -2101 -2933 1478 3216 -819 -3379 99 3470 605 -3369 -1229 3171
3270 3171 1803 -2801 -2339 2303 2844 -1666 -3167 1038 3350 -306 -3447 -429 3355 1178 -3107
3285 -3107 -1841 2780 2438 -2277 -2916 1631 3256 -895 -3480 119 3569 640 -3491 -1393 3213
3300 3213 2115 -2833 -2717 2279 3188 -1716 -3535 1049 3656 -317 -3666 -426 3574 1183 -3300
3315 -3300 -1859 2913 2436 -2428 -2887 1839 3219 -1140 -3431 430 3500 324 -3474 -1036 3227
3330 3227 1739 -2840 -2413 2378 2964 -1868 -3374 1142 3641 -456 -3742 -345 3662 1153 -3485
3345 -3485 -1859 3105 2536 -2574 -3021 1917 3480 -1187 -3732 441 3856 330 -3753 -1081 3462
3360C462j629m875N85M974N43m988j518M644K474m131l293L445M035k703m581
3375c556J794M940q39n044k00M983J244m698k264M285L166l733l864K924M437
3390C575j940m877R32N090R8n031j162M730K242m262l202L529M092k705m760J796
3406a855N141p62n329l06N227J449m953k500M512L405l859m147L012M715k006
3421A744n194J021N377J8n350r76N055J916m483k908L856L707l059m335K134M771
3437C294j098n040L4N083J104m967k073M514L022l892l886L096M573k093n146
3452c475J071N426J1n488j060N244K164m820l150M171L987l356m632K364N093
3467C550j288n297Q3N392J024n178k108M804K992m120l803L259M512k337m985
$$ plain form
3360 3462 1833 -3042 -2457 2517 3060 -1928 -3446 1198 3672 -459 -3752 -307 3728 1025 -3556
3375 -3556 -1762 3178 2339 -2705 -2905 2078 3322 -1376 -3640 645 3811 78 -3786 -862 3575
3390 3575 1635 -3242 -2310 2780 2878 -2153 -3315 1415 3657 -605 -3807 -278 3814 1109 -3651 -1855
3406 -1855 3286 2524 -2805 -3111 2116 3565 -1388 -3888 624 4029 170 -3977 -965 3750 1744
3421 1744 -3450 -2429 2948 2966 -2384 -3360 1695 3611 -872 -3780 76 3783 724 -3611 -1477 3294
3437 3294 2196 -2844 -2810 2273 3377 -1590 -3663 851 3873 -19 -3905 -809 3764 1671 -3475
3452 -3475 -2404 3022 3033 -2455 -3515 1729 3893 -927 -4077 94 4081 725 -3907 -1543 3550
3467 3550 2262 -3035 -2952 2440 3464 -1714 -3822 982 3974 -146 -3949 -690 3822 1485 -3500
3482c500J316N256k37n305q41N150J908m798k924M261L768l558m430K677M897
3497C640j641n205M82N359O50n248j753M877K786m302l661L478M493k555n134
3512c734J576N399l79n519p40N298J933m876l060M345M007l628m715K707N234
3527C848j668n550N17N643N66n481j618N086K634m461l569L721M313k866m883
3542c768J928N179q48n310k81N176J438m880k511M418L443l661m242K711M940
3557C732j671n447O40N631N03n587j619N268K688m744l647L942M542l053n165
3572c987K006N557q63n699l17N645J420n313k491M753L407l997m118K980M799
3587C782j945n262Q54N475K70n471j309N153K401m675l361M039M149l236m784
$$ plain form
3482 -3500 -2184 3072 2835 -2470 -3311 1839 3747 -1051 -3975 286 4054 496 -3934 -1257 3640
3497 3640 1999 -3206 -2724 2635 3285 -1963 -3716 1161 3947 -355 -4016 -538 3955 1400 -3734
3512 -3734 -2158 3241 2862 -2657 -3397 1901 3834 -1042 -4102 243 4250 622 -4093 -1386 3848
3527 3848 2180 -3370 -2853 2790 3356 -2125 -3743 1343 3977 -484 -4053 -332 3981 1115 -3768
3542 -3768 -1840 3339 2491 -2819 -3100 2076 3514 -1366 -3877 541 3984 323 -3919 -1208 3732
3557 3732 2061 -3386 -2746 2885 3388 -2199 -3818 1450 4138 -606 -4253 -311 4231 1178 -3987
3572 -3987 -1981 3576 2713 -2986 -3303 2342 3762 -1551 -4042 711 4118 121 -3997 -1017 3782
3587 3782 1837 -3425 -2571 2904 3174 -2297 -3606 1547 3948 -727 -4088 -49 4100 864 -3920
3602c920K236N227j140n446J0N447J208n338k245M887L225m249m036L318M787
3617C971k298n291J163N554L8n552j212N255K389m798l502M198M358l336n041
3632d104K382N406j207n623k9N676J152n446k202M996L194m333m046L499M749
3647D064k585n244J601N415m65n404o71N151J812m738k915M251L798l464m540
3662c934K528N038j409n417K48N542Q99n408k052N045L098m377m066L518M984
3677D237k689n474J589N815m68n871o71N650J838n226k911M595L796l750m514
3692d054K733N072j614n416M74N548N75n396j622M977K656m333l622L568M396
3707C942k671n004J725N361o39n545n03N474J634n199k663M685L554l903m339
$$ plain form
3602 -3920 -1684 3543 2403 -3043 -3033 2414 3622 -1716 -3961 926 4151 -98 -4134 -816 3971
3617 3971 1673 -3618 -2455 3099 3137 -2415 -3627 1628 4017 -781 -4283 -85 4273 937 -4104
3632 -4104 -1722 3684 2477 -3146 -3175 2501 3653 -1793 -3995 1001 4195 -138 -4184 -685 4064
3647 4064 1479 -3765 -2164 3251 2786 -2618 -3289 1862 3674 -1064 -3979 272 4070 606 -3934
3662 -3934 -1406 3632 2223 -3194 -2946 2596 3495 -1913 -3965 1080 4178 -199 -4265 -747 4237
3677 4237 1548 -3926 -2337 3478 3010 -2861 -3532 2118 3956 -1270 -4181 414 4210 460 -4054
3692 -4054 -1321 3751 2137 -3279 -2805 2743 3318 -2078 -3700 1277 3933 -400 -4022 -454 3942
3707 3942 1271 -3733 -2008 3353 2714 -2831 -3334 2140 3774 -1425 -4088 597 4151 248 -4091
3722d091K981M981j882n446P45N647M08n587j556N246K653m620l708L878M530
3737D179k994n080J883N440o76n609n19N561J659n278k697M772L553m011m326
3752d143L094M945k111n318J052N474M3n385j126N064K247m612l212L974M041
3767D027l211m624K220N012j049n281j12N309J298n090k409M647L390l964m292
3782d129L095N026k142n518J078N744M7n694j216N380K386m917l399M277M239
3797D257l468m816K416N236j310n421J83N412Q99n144j930M635K901l887l837
3812c874L083M563k191n060J201N327j69n325r12N112K026m770l005M180L853
3827D039l401m546K418N100j357n465L04N566P77n395j826M880K891m229l799
$$ plain form
3722 -4091 -1110 3871 1989 -3457 -2712 2935 3343 -2244 -3800 1446 4099 -521 -4229 -351 4179
3737 4179 1185 -3895 -2012 3428 2752 -2857 -3376 2185 3844 -1434 -4131 641 4194 183 -4143
3752 -4143 -1049 3896 1785 -3533 -2481 2993 3036 -2349 -3475 1589 3836 -776 -3988 -14 4027
3767 4027 816 -3808 -1588 3424 2375 -2906 -3018 2291 3589 -1501 -3910 737 4127 163 -4129
3782 -4129 -1034 3992 1850 -3668 -2590 3154 3201 -2493 -3709 1671 4057 -860 -4259 18 4257
3797 4257 789 -4027 -1611 3625 2315 -3106 -2923 2489 3388 -1756 -3686 949 3850 -37 -3874
3812 -3874 -791 3772 1581 -3479 -2278 3049 2880 -2445 -3357 1755 3781 -989 -3994 186 4039
3827 4039 638 -3908 -1490 3610 2253 -3212 -2908 2658 3435 -1960 -3786 1094 3985 -244 -4043
3842d043L386M583k441n086J355N389k11n445r51N289K032m885l022M329L771
3857D050l481m409K482M924j404n305L96N377O45n234j658M839K580m254l445
3872c897L531M129k638m661J700M957o08n045n81M993J659m708k637M186L524
3887C904l500m272K625M875j542n318M95N424O26n302j751M953K832m416l751
3902d118L738M439k865m999J965N177q13n236l40N144J378m803k392M312L177
3917C764l566l904K666M512j746m862P75M944K94m822j363M528K362m055l327
3932c800L562M050k804m589J849M996q18n227k26N238J219m955k234M471L115
3947C847l711l977K916M586j928n087R58N225R0n083j211M762K284m294l184L629
$$ plain form
3842 -4043 -657 3926 1485 -3601 -2246 3143 2932 -2513 -3464 1825 3857 -1028 -4050 279 4050
3857 4050 569 -3840 -1358 3566 2162 -3143 -2747 2630 3275 -1959 -3617 1222 3802 -452 -3897
3872 -3897 -366 3763 1125 -3536 -1836 3121 2513 -2532 -3113 1880 3539 -1169 -3806 380 3904
3887 3904 404 -3868 -1243 3632 2090 -3228 -2733 2691 3317 -1985 -3736 1217 4049 -367 -4118
3902 -4118 -380 4059 1194 -3805 -1840 3337 2524 -2712 -3052 2092 3470 -1333 -3725 587 3764
3917 3764 198 -3706 -1040 3472 1726 -3136 -2361 2583 2877 -1945 -3308 1220 3582 -473 -3800
3932 -3800 -238 3812 1008 -3581 -1732 3264 2446 -2781 -3007 2231 3450 -1505 -3739 732 3847
3947 3847 136 -3841 -925 3661 1733 -3354 -2396 2829 2919 -2164 -3375 1387 3671 -623 -3807 -178
3963a78L911k791m462J825M866q30n067j92N093J143m855j973M326K826l686l582
3979c626K916M172k014m600J114M777q5m798r32M593J928m272k771L692L482k881
3995F95m115J945M556q55m952j27N042J096m830k077M418L002l812l800L052M413
4011C651k192m812J245M951j36m981q89M788J851m414k648L841L335l083l887
4026c380K187M261j202m528K67M525O66m294j644L924K557l423l359K834L989
4041C380k142m340J200M610k26m680q01M617J720m310k612L839L374l129m024
4056c524K314M506j431m783N18M806M72m619j457M191K449l664l274L030L849
4071C383k173m306J277M511k94m576o83M479J530m129k317L586L027k900l672
$$ plain form
3963 -178 3733 942 -3520 -1695 3171 2341 -2726 -2918 2175 3318 -1537 -3510 816 3642 -44 -3626
3979 -3626 -710 3462 1448 -3152 -2038 2739 2654 -2144 -3076 1517 3445 -827 -3598 94 3576 695
3995 695 -3420 -1475 3081 2226 -2726 -2853 2189 3285 -1545 -3622 796 3798 -14 -3814 -762 3651
4011 3651 1459 -3353 -2108 2843 2707 -2274 -3163 1625 3476 -938 -3586 255 3590 507 -3380
4026 -3380 -1193 3068 1866 -2662 -2395 2130 2796 -1498 -3142 782 3339 -84 -3443 -609 3380
4041 3380 1238 -3102 -1902 2708 2482 -2198 -2999 1618 3338 -972 -3584 255 3629 500 -3524
4056 -3524 -1210 3296 1865 -2918 -2400 2406 2878 -1741 -3198 993 3442 -222 -3496 -466 3383
4071 3383 1210 -3096 -1819 2692 2398 -2178 -2861 1618 3148 -981 -3298 288 3315 415 -3257
4086c257K163M160j382m437N59M515K71m320j173L968K108l593k816K990L409
4101C165k220l903J372M246l89m495m89M442J359m188k198L708K976l034l671
4116c319K281M209j489m505N74M615L50m514j291M223K168l824k813L217L331
4131C213k409l766J558M031o68m176j51M069J054l853j803L424K476k819l163
4146b983K223L605j437l919O22L992L09m011j213L880K059l589k790L149L344
4161C241k484l838J684M196q32m367n9M331Q96m085j752L689K546l141l178K448
4177g05L660j735l866Q52L993M4l896r63L727J737l331k446K861L018k200l529
4193b779J509L862q25m004Q2L971O44l690j482L366K171k892k821K364L311j712
$$ plain form
4086 -3257 -1094 3066 1684 -2753 -2194 2321 2592 -1728 -2901 1067 3175 -418 -3234 -244 3165
4101 3165 945 -2958 -1586 2660 2271 -2224 -2713 1729 3088 -1100 -3298 410 3386 352 -3319
4116 -3319 -1038 3171 1682 -2823 -2249 2366 2716 -1798 -3089 1134 3302 -522 -3335 -118 3213
4131 3213 804 -2962 -1404 2627 1959 -2217 -2368 1701 2755 -1098 -2901 523 2999 180 -2983
4146 -2983 -760 2845 1408 -2511 -1889 2103 2412 -1599 -2812 1068 3127 -462 -3252 -103 3241
4161 3241 757 -3081 -1397 2799 1967 -2400 -2459 1872 2768 -1317 -3069 620 3166 25 -3153 -705
4177 -705 2955 1220 -2646 -1794 2199 2243 -1653 -2616 1111 2848 -483 -2929 -68 2950 750 -2779
4193 -2779 -1270 2592 1767 -2237 -2155 1816 2460 -1230 -2712 654 2825 -67 -2888 -524 2787 1075
4209A075l632R43L818j40l874o82L759J462l440k146K933K823k299l450J591L882
4225B623q00m135J13M057P16l889j479L535K197l041k823K487L247j786l521R80
4241a519L694k05l761n18L619J187l312j745K771K333k175k827J527L209q42l444
4257b008J58L476N78l369j354L181K035k828k607K372L022j724l399J016L667
4272B216k66l775m74L719J200l520j852L149K389k526k990J956L310j298l410
4287b172M98L432K91l315j063L098J742k787k257K266K688j656k996R72L191k69
4303A663l272l94L234R99l010j596K649K244k297k672J816L008j257l214O37L260
4319A798K8l194p58L028J436k760k013K336K533j800k957J190L247n23l390j69
$$ plain form
4209 1075 -2557 -1614 2204 2064 -1810 -2492 1267 2729 -711 -2857 76 2899 600 -2850 -1259 2623
4225 2623 1823 -2312 -2199 1858 2574 -1315 -2794 741 2938 -103 -2926 -439 2808 1022 -2499 -1519
4241 -1519 2175 1970 -1791 -2309 1310 2497 -815 -2560 211 2544 369 -2458 -931 2278 1436 -2008
4257 -2008 -1850 1626 2204 -1165 -2519 662 2697 -131 -2738 -366 2656 932 -2467 -1451 2216
4272 2216 1950 -1825 -2299 1420 2620 -900 -2752 397 2786 260 -2730 -774 2536 1238 -2172
4287 -2172 -1674 1758 2049 -1266 -2329 769 2511 -276 -2533 -267 2421 765 -2231 -1259 1932 1663
4303 1663 -1609 -2003 1231 2230 -780 -2376 273 2517 220 -2452 -636 2372 1115 -2099 -1462 1798
4319 1798 1826 -1368 -2126 902 2338 -422 -2435 -99 2434 634 -2323 -1133 2114 1591 -1799 -1968
4335a968L333Q39l091j523K769K115k332k626J872K958j279l163O40L226K1l153
4351a362o22K947J187k628j676K196K107j656k469J063K748n51k843m0K885N23
4367A809k684j161K456J720k119k182J681K539j157k859O02L032M8l136o21L074
4383A042J171k829j699K497K124j962k542J394K858q39k983K50K949L78k814r74
4399a979K564J488k236j878J790K155j199k391N93K504jk559n22K510R91k294
4415d64j481K022J894j658k254J269K455p95k598L05K616K59k546q22K466J318
4431A986k242j777J950K043j440k331R26K506l67k581j79K511P41k350j297K067
4447A66J786j724k201J359K457r44k515M18K516J35k461o58K305J133k080j458
$$ plain form
4335 -1968 1365 2204 -887 -2410 359 2474 142 -2484 -612 2346 1067 -2096 -1456 1770 1791 -1362
4351 -1362 -1984 963 2150 -478 -2154 42 2149 493 -1976 -913 1835 1284 -1559 -1599 1286 1809
4367 1809 -875 -2036 420 2140 21 -2161 -480 2059 902 -1957 -1355 1677 1725 -1411 -2032 1042
4383 1042 2213 -616 -2315 182 2306 344 -2198 -804 2054 1215 -1768 -1518 1431 1809 -1005 -1979
4399 -1979 585 2073 -163 -2041 -251 1904 705 -1686 -1093 1411 1410 -1149 -1671 839 1830 -464
4415 -464 -1945 77 1971 313 -1941 -672 1783 988 -1610 -1305 1311 1570 -976 -1798 668 1986
4431 1986 -256 -2033 -83 1960 520 -1811 -885 1621 1254 -1327 -1506 1005 1746 -604 -1901 166
4447 166 1952 228 -1973 -614 1843 899 -1616 -1198 1318 1453 -1008 -1666 639 1772 -308 -1766
4463a766J718J744j280j985Q27K170m49k167nK112M44j962q62J731J307j470j722
4480a615J205J976q55k134M13K257O3k308n10K226R81k107j355J810J716j414
4496C49k061J014K289o09k393J96K374K35k209o87J968J083j684j431J365J647
4512A446r29j775M54J891l4j904l55J807P27j637j022J395J273j081j582Q04J769
4529A247m44j911J02J932L01j963o35J852R41j683j253J486J480j140j680P21
4545f47J815k84j901j16J897N03j800q36J601J143j289j434R67J642o28j758K81
4562h44J716J88j683n87J654Q77j498j106J272J252j014j372O69J492l62j499
4578h45K6J519J86j342n47J221Q26j044j096Q95J266p00j349L82J393j6j412l61
$$ plain form
4463 -1766 -48 1696 416 -1569 -742 1428 979 -1188 -1193 919 1363 -599 -1461 270 1577 107 -1615
4480 -1615 -410 1566 711 -1423 -1010 1247 1310 -998 -1508 718 1699 -408 -1763 47 1763 349
4496 349 -1712 -698 1591 982 -1411 -1215 1159 1394 -815 -1502 466 1549 -135 -1566 -201 1446
4512 1446 517 -1258 -804 1087 1053 -851 -1206 601 1328 -309 -1331 64 1337 256 -1326 -522 1247
4529 1247 803 -1108 -1006 926 1227 -736 -1371 481 1422 -261 -1514 -28 1452 312 -1368 -647
4545 -647 1168 884 -1017 -1133 764 1267 -533 -1369 232 1375 86 -1348 -381 1261 633 -1125 -844
4562 -844 872 1060 -623 -1210 444 1321 -177 -1283 -11 1241 227 -1145 -476 1016 654 -845
4578 -845 -819 700 886 -456 -1003 218 1044 0 -1096 -201 1065 365 -984 -602 791 775 -637 -998
4596i98J449O80j427r16J290J146r99j428P53J585m59j695K42J649Qj490l88J369
4614C71O68j145r69R92J086p53j171M83J169j37j212n8J140K94j034m61Q12O68
4632G43o13r24M92J060k83j206J42J211N3j137l27J084N75j023p52R27R15q11
4650A26r97N35J166l07j256Q3J285J06j258k52J071N00r03o86O52Q89m91r55K41
4669d51J028l1r69k33R70M11r26n24P71O70o24p04L96P97k19q65J08Q68K7q75
4689c75j16P84K60p00m09O45M60m94o14L75O14j16o86p1P45K36p71l84P37M81
4709F01n96o58N22P58l60q46K14Q58n7q55r0P90L06p78m35P28M83n97m91M62M89
4730D48l14m44J11N10n8m43p2M20J23l21k34K29L62k20m23K18L70j14l94L7L85
$$ plain form
4596 -998 451 1131 -296 -1212 78 1224 225 -1203 -450 1135 676 -1019 -777 872 880 -610 -998 371
4614 371 1039 -106 -1075 -83 1003 250 -921 -438 731 594 -618 -676 464 758 -276 -737 75 743
4632 743 130 -794 -302 758 475 -731 -589 622 675 -462 -789 295 870 -153 -905 22 937 126
4650 126 -871 -336 830 523 -733 -650 635 741 -517 -769 302 802 -101 -787 -135 754 263 -692 -451
4669 -451 577 546 -423 -656 314 725 -201 -725 46 716 92 -612 -216 581 362 -503 -395 473 500 -375
4689 -375 -491 293 553 -147 -556 89 549 55 -559 -184 430 314 -372 -443 302 538 -233 -617 120 601
4709 601 5 -653 -131 627 267 -579 -365 493 436 -419 -509 281 587 -191 -626 102 585 -12 -503 -41 448
4730 448 134 -310 -199 311 253 -190 -262 158 281 -40 -274 -45 317 97 -326 -108 262 148 -246 -209 176
4751A76J09m13k41M47L38m69l84M10M65l45n01K28N97j91n83J43N03K0m90j75
4771c56M39L00m31l17L90L10k71l63K08K96o5k86j8K98J3k21q8J80J30q6k52J40
4793e0K68k19k52K29K50j87k79J43K67q4k71K1L27K3k93q3K62J70k49k36J99K87
4815B43j81k75J41K31qk43p4K02J72k16k52K37K12j38l07J27L84j31l77P3M23
4836B43j28l27P5L25o9l12k8L79P0l92r8M12J12m08j14L34K13k94k63K46K97k09
4858F4k61Q5K50P3k62j98K66K62k54l26K30L13j21l14m0M30O8m22j81L92K47l22
4880b1l26L07M04k89m57L03M52k64m42J73M63q1n02jN13Q7m84j87M90K23m26l58
4902d23L94M43l08n03J69N80o8n86o9N36K55m92m15M68M93l84n85L04O39j45p16
$$ plain form
4751 176 285 -128 -369 78 416 -53 -437 -27 438 93 -408 -180 417 226 -357 -214 289 309 -181 -356
4771 -356 83 383 -48 -365 25 335 64 -299 -91 205 140 -146 -164 134 147 -74 -162 18 148 62 -190 -50
4793 -50 218 -1 -253 -24 226 39 -240 -97 170 86 -185 -164 163 186 -107 -190 72 242 -7 -243 -44 243
4815 243 62 -213 -72 159 151 -92 -166 36 208 -8 -260 -23 189 51 -256 -129 255 124 -253 -180 243
4836 243 115 -212 -137 188 119 -193 -221 158 228 -164 -262 150 262 -146 -260 74 287 -7 -270 -24 273 64
4858 64 -197 -112 138 211 -51 -249 17 279 25 -301 -71 242 121 -193 -233 197 265 -157 -338 54 301 -21
4880 -21 -347 -40 364 75 -382 -79 373 109 -333 -160 303 222 -280 -281 232 319 -165 -352 138 361 -65 -423
4902 -423 -29 414 106 -397 -228 352 284 -302 -371 165 420 -72 -487 -19 474 90 -495 -191 448 303 -413
4923d13M8O82M5o02j63N47K81m18m85L86N59k80o05J99N93r7n71p1O06J92o02
4944a69l31N68M46m86n74M20O63k73q38K12R21j20r47jQ74K52q71l89P44N57o65
4965go46N05P45l24q10J32Q62M8q55j80P54L45o42n07M62O70l05p93J74Q40Jq92
4987d23j31Q51L40q21m84P51O33p14p02N54Q06l63r52K18J017m5j033j63J018
5006C57L51r62m89Q29P02p45q11N47R29l02j032R8J020J77j040l81R90N85q53
5025c0p84O93Q87m69j040K85J072oj109k04J093L77r72o11Q83P50p40r25O16R97
5045G63m28j054K11J034J32j126l03J060N39r86p11Q39R19o95j070M62J223k41
5063E68j254k7J283K43j223n42J160Q04j053r82Q50J149o18j248L62J274q4j303
$$ plain form
4923 -413 -365 317 362 -240 -403 144 425 7 -478 -92 467 187 -418 -219 374 277 -294 -365 241 433 -169
4944 -169 -500 68 514 28 -546 -126 537 264 -574 -362 559 439 -508 -509 365 617 -254 -643 101 658 -7
4965 -7 -653 -148 597 273 -537 -405 457 505 -350 -530 224 569 -73 -580 -118 552 247 -546 -372 468 469 -423
4987 -423 -554 297 637 -184 -668 83 716 2 -700 -146 660 297 -655 -437 580 535 -498 -661 357
5006 357 708 -254 -743 86 788 43 -768 -221 708 406 -626 -528 492 669 -371 -752 238 823 -30
5025 -30 -814 -121 766 297 -743 -458 614 608 -501 -705 388 765 -207 -818 65 815 75 -850 -234 763
5045 763 335 -719 -508 526 658 -468 -771 289 828 -158 -869 -30 889 194 -876 -414 809 568
5063 568 -686 -713 570 813 -410 -952 208 1012 -41 -1023 -173 976 358 -890 -528 746 662 -641
5081f41j58J218M23j076o95R17R25p15j070M85J211k43j315K5J266K75j240n46
5099i54J162P90j010r64Q22J142o27j304L93J437j57j476j13J442L88j350o63
5116a042J229R02j034j147Q40J257n31j416K45J467N4j432l77J358O61j183r70
5133a119J037J114p35j282M28J457j53j506j17J453M26j372p34J267R56j030j204
5150a114Q56J297n45j447K54J509N5j491l74J469O23j361q81J149J120r14j314
5167a109O48J475l35j593L6J600L22j541o63J446R41j285j204J066J404p54j545
5184a091M38J617q8j646k57J609N83j505q49J275J121j016j341P35J493m47j522
5201h91M7J576K69j506o53J424R56j266j210J062J395q00j567M75J680j38j704
$$ plain form
5081 -641 -799 419 842 -234 -929 -12 913 198 -872 -387 824 581 -734 -709 557 832 -408 -954
5099 -954 208 998 -12 -976 -154 988 361 -943 -550 887 730 -746 -859 583 971 -379 -1042
5116 -1042 187 1089 55 -1092 -252 1005 474 -942 -697 770 824 -608 -985 373 1034 -149 -1119
5133 -1119 -82 1032 297 -985 -557 900 747 -759 -876 577 1003 -369 -1103 164 1120 90 -1114
5150 -1114 -258 1039 494 -953 -699 810 865 -626 -1000 469 1092 -269 -1150 -1 1119 205 -1109
5167 -1109 -461 1014 679 -914 -878 722 1044 -497 -1160 286 1227 -58 -1262 -196 1208 454 -1091
5184 -1091 -653 964 876 -770 -1027 582 1165 -340 -1189 86 1207 191 -1150 -415 1078 631 -891
5201 -891 -844 732 1001 -505 -1158 266 1222 -44 -1254 -192 1203 403 -1164 -689 991 853 -851
5218h51j82J656N50j604q23J415J136j235j349R28J614o84j691L14J724J04j705
5235f83m74J609P92j424j076J152J379r11j556N64J731k51j775j40J760M47j619
5252d75q07J428J175j225j408R59J559n99j728K71J817Q0j809m29J737P49j555
5269b60j076J358J312j048j563P47J705l82j810J2J825L53j772p16J640J033j369
5286a1j398J154J568p80j760L97J863j6j883l69J859O92j668j016J404J350j155
5303B31j561Q10J740m78j771O4J805L31j726p30J618J048j433j335J164J560q34
5320E03j715M43J846r1j880l06J840O73j729j002J518J340j304j550R38J801o29
5337F96j848K25J910J73j883n75J769R24j575j239J302J520r68j705O11J828k05
$$ plain form
5218 -851 -1033 623 1173 -431 -1254 161 1297 62 -1287 -359 1255 571 -1120 -806 918 1022 -683
5235 -683 -1157 452 1244 -180 -1256 -104 1275 364 -1192 -628 1103 852 -923 -1063 697 1144 -475
5252 -475 -1282 146 1321 96 -1312 -353 1206 607 -1121 -850 967 1047 -762 -1191 546 1295 -260
5269 -260 -1336 22 1334 286 -1277 -530 1175 793 -1017 -1005 820 1173 -599 -1315 325 1358 -11
5286 -11 -1409 -255 1313 533 -1227 -830 1033 1017 -866 -1235 624 1316 -352 -1368 36 1386 231
5303 231 -1330 -520 1220 742 -1029 -965 840 1171 -555 -1285 333 1381 -52 -1387 -223 1337 503
5320 503 -1212 -769 1077 986 -894 -1200 640 1313 -416 -1418 100 1440 136 -1414 -476 1325 696
5337 696 -1152 -927 983 1156 -727 -1302 467 1391 -184 -1423 -121 1399 431 -1274 -663 1165 960
5354I60j910k09J865N74j696r87J529J336j279j580R46J760o02j884K70J874J85
5371A152j899n72J803R41j634j215J344J492j025j748P03J885l38j919p6J926
5387H20M78j849q44J659J194j389j496J082J748p36j911L69J943N7j954m73J881
5404E79Q40j694j189J446J488j140j690P44J855l51j973j8J925M20j838p96J656
5421B64J145j412j416J158J630p99j826M04J929K0j955m14J880P95j742j114J489
5438C6J441j184j720Q75J873m82j983Q4J978L20j940o90J754J096j553j395J231
5455b59J656q78j831M92J933n5j983l40J916P14j713j090J488J410j221j628Q52
5472e37J830m75j922O5J961L22j879p47J797J035j555j354J271J620r70j786N92
$$ plain form
5354 960 -950 -1159 706 1280 -416 -1403 126 1462 183 -1397 -451 1309 707 -1177 -907 967 1152
5371 1152 -747 -1319 484 1425 -209 -1424 -80 1412 387 -1361 -658 1227 889 -1030 -1106 820
5387 820 1298 -551 -1395 264 1458 69 -1427 -345 1403 667 -1244 -875 1068 1125 -829 -1302 579
5404 579 1419 -275 -1464 -18 1470 330 -1360 -616 1239 888 -1085 -1103 822 1242 -596 -1392 264
5421 264 1409 -3 -1419 -261 1369 570 -1256 -852 1077 1097 -858 -1272 608 1403 -339 -1453 36
5438 36 1477 293 -1427 -552 1321 839 -1144 -1060 918 1238 -702 -1392 362 1458 -95 -1490 -259
5455 -259 1397 519 -1312 -820 1113 1058 -925 -1265 651 1365 -348 -1438 50 1460 239 -1389 -537
5472 -537 1293 818 -1104 -1039 922 1244 -635 -1382 415 1450 -105 -1459 -188 1432 462 -1324 -732
5489g32J909j85j961k00J887N88j802r19J564J277j304j552R92J784o21j934K29
5506i80J950J82j890n54J760R43j574j275J286J591j011j744O17J879k35j944
5522i99j39J895N56j780r41J590J276j335j559J035J718o67j846K63J929J14j879
5539g69n14J769R11j598j223J334J462j000j708O23J921l19j926p4J917M73j814
5556e35q34J651J145j381j466J120J617p14j802L53J880M4j885m34J805P95j608
5573b49j178J397J442j075j667P19J827l59j890j9J849M35j777q15J619J137j396
5590@j401J111J614p84j747M17J821J9j865l57J770P06j623j070J443J345j134
5607B65j594Q07J757m62j805L6J800L69j777o93J612J057j418j330J144J532p89
$$ plain form
5489 -732 1177 992 -969 -1169 718 1306 -496 -1415 149 1426 122 -1430 -438 1346 725 -1209 -980
5506 -980 970 1152 -738 -1292 468 1411 -163 -1438 -152 1439 428 -1316 -699 1180 945 -999
5522 -999 -1138 757 1313 -467 -1408 182 1458 123 -1436 -401 1317 650 -1196 -933 996 1110 -769
5539 -769 -1283 486 1397 -201 -1424 -90 1372 372 -1336 -713 1208 889 -1037 -1111 806 1279 -535
5556 -535 -1369 282 1427 46 -1420 -300 1317 603 -1199 -846 1034 1078 -807 -1241 564 1359 -249
5573 -249 -1427 -30 1412 337 -1330 -611 1216 857 -1033 -1052 797 1232 -545 -1360 259 1396 0
5590 0 -1401 -290 1324 540 -1207 -790 1031 1050 -815 -1172 598 1304 -319 -1389 54 1399 265
5607 265 -1329 -522 1235 773 -1032 -996 804 1173 -604 -1297 315 1372 -46 -1376 -232 1300 511
5624E11j726M47J808n7j832k91J742O68j599j001J382J311j129j549Q51J690m58
5641G68j787O4J801L04j777o14J621R33j366j264J135J471q49j629M79J774j40
5658I24j772k24J722N57j585r11J401J185j133j457Q81J594n37j714J88J782J69
5675A070j711n48J574Q78j378j195J145J424q53j577N08J708j60j731j60J674
5691F68N21j577q87J391J179j136j430Q70J570n30j685J91J742J04j643m81J556
5708D23P73j365j061J116J349r14j481N71J613k19j692q8J598M83j510p75J360
5725A81J048j153j250Q35J493n63j593K23J654J33j665m42J531P39j350j051J159
5742g1J275q74j455N88J560k93j601o8J554M41j469p66J388R88j120j237Q29J454
$$ plain form
5624 511 -1215 -768 1040 983 -849 -1140 602 1270 -329 -1330 52 1363 234 -1315 -464 1226 768
5641 768 -1019 -955 846 1150 -627 -1241 380 1313 -53 -1317 -182 1289 440 -1189 -710 1064 924
5658 924 -848 -1072 650 1207 -378 -1289 112 1297 164 -1293 -412 1182 645 -1069 -881 901 1070
5675 1070 -641 -1189 385 1263 -115 -1310 -165 1259 406 -1171 -663 1045 885 -846 -1006 668
5691 668 1189 -388 -1275 116 1295 159 -1271 -401 1169 639 -1046 -855 887 991 -652 -1133 423
5708 423 1196 -169 -1230 -114 1235 321 -1160 -589 1024 805 -887 -975 623 1106 -404 -1179 181
5725 181 1229 76 -1174 -339 1154 591 -1002 -779 875 1008 -657 -1099 432 1171 -179 -1230 -71
5742 -71 1204 330 -1125 -537 1023 730 -871 -939 615 1056 -413 -1179 209 1197 77 -1160 -331 1123
5760A123n90j532K53J595M0j548l81J482O83j293r94J116J230r10j348N85J485
5777I96k94j549qJ512L53j452o47J299R01j093j154Q69J332n68j479K84J504O8
5795H74j518l56J401O79j285r36J114J152q63j324N79J451k90j485J4J454L01
5812I62j378o35J283Q70j075j089Q38J285o19j378L16J381K2j415k69J336N59
5829I94j215q53J060J054q11j238N79J310k51j424j1J433K84j363n57J242Q22
5846A055j081j006Q45J189n81j348L57J346k7j359k91J350N32j207p79J029J010
5863A034q44j132N58J264l16j328L1J338K47j280n29J189P14r68r67P94J110n36
5881C79j251L40J260n5j265k48J245N11j123p47R98R04p43j096N17J218k95j281
$$ plain form
5760 1123 533 -999 -746 849 889 -659 -1040 442 1125 -168 -1162 -46 1184 274 -1074 -489 996
5777 996 702 -847 -855 657 1010 -442 -1089 210 1111 18 -1136 -267 1065 497 -982 -698 806 874
5795 874 -644 -1000 401 1080 -205 -1141 -27 1125 262 -1062 -483 968 678 -807 -793 661 962
5812 962 -416 -1051 232 1102 27 -1062 -224 1061 442 -936 -620 761 783 -632 -901 435 994
5829 994 -221 -1074 -14 1040 229 -1009 -430 880 629 -795 -806 627 911 -452 -1009 233 1055
5846 1055 -26 -1032 -187 1002 421 -927 -570 776 749 -610 -901 449 981 -226 -1005 24 1034
5863 1034 190 -942 -384 880 564 -764 -733 605 852 -428 -957 232 946 -22 -989 -195 915 379
5881 379 -872 -532 728 673 -592 -840 405 916 -207 -954 44 948 205 -891 -374 844 549 -732
5899g32O0J272K19j218n07J108P54r85r48Q31J077n91j194L22J249l5j249k38
5917h05J211M73j118o50R06R01p62j014N12J147k98j196M6J210J86j164m16J057
5935B26O44q81q76P26J022n03j127K96J149j3j190k23J134M26j012o63R06Q18
5953H59o96r98N21J052k62j124J9J174J77j107l91R84O25q72p80O74R58m91j055
5972g33L08J076m5j079k15J055M34r97o02Q58P71o80r31M83J024k71j060J7J094
5991E07J70j026m06R19O13q31p46O71Q61m37r82K39J042k7j066j86R95M29r48
6010b09n84Q18P17n79q96M38R91k44j053P0J048J26r85l66Q71O25p98p62O73Q22
6030G23m62r42K77R85n2r82j68R12L94q43n46P39O63n71p88L54R32k15r58O5R41
$$ plain form
5899 -732 -672 600 819 -399 -906 202 956 -29 -977 -146 931 340 -854 -532 717 682 -567 -805
5917 -805 406 879 -239 -889 17 918 156 -858 -346 801 503 -693 -647 563 749 -415 -831 226
5935 226 870 -11 -887 -161 861 358 -769 -473 676 663 -527 -750 384 810 -202 -865 41 859
5953 859 163 -835 -314 738 476 -648 -629 545 722 -385 -776 208 833 -39 -819 -145 813 322 -733
5972 -733 -425 651 606 -473 -688 367 801 -196 -798 60 831 151 -780 -297 727 456 -604 -587 507
5991 507 677 -349 -755 164 777 -54 -800 -129 732 295 -687 -448 594 567 -499 -685 310 739 -209
6010 -209 -793 25 742 163 -733 -295 696 452 -601 -531 517 643 -342 -708 163 788 -10 -772 -99 723
6030 723 261 -681 -404 581 529 -453 -621 291 685 -158 -704 35 698 127 -661 -307 625 410 -548 -483 458
6051D58J60r08l86Q05N83p25o93O06P78l70r28K05R57j7r45j54R02L46q61m87
6071f74O90O59n57p93L92Q86j97r34L8Q66J73q30l37P61N16o69o41M90P96l21
6091C14q53J22Q81M2q82k01Q46L78p79m99O41O23m88p44L32Q48k01q42K4Q32J96
6112E90q68k90P14M72o38o16M96O97k98p96J56P99M1q50j39P69L47p14n07O32
6132cO33m95p03K85Q34j77q14nQ00J96p64l57O85M82n63n91M31O89k89p61J20
6153c67P60P8p52k44O96L96o35n08M99O39l89p23K95P01r0p60o5P56K53p10l86
6174e56O22M98n24o01M09O99k66p52J33P30N6p56j83O88L44n83n06N03O02l87
6194A70o55K19O86l8p42q1O84K36o34l94N84M71m40n76L11O83j98p20O5P09J08
$$ plain form
6051 458 618 -290 -676 129 712 -13 -706 -100 678 308 -620 -415 542 525 -420 -574 328 674 -187 -674
6071 -674 16 675 118 -675 -283 603 406 -528 -490 376 549 -281 -618 143 659 -10 -651 -161 635 314
6091 314 -539 -417 464 506 -376 -577 269 647 -132 -631 10 633 145 -599 -267 581 380 -462 -438 394 590
6112 590 -278 -568 146 618 -20 -636 -140 557 259 -537 -381 418 459 -391 -530 239 586 -128 -635 -3
6132 -3 630 135 -568 -283 551 374 -440 -445 355 551 -213 -570 115 597 34 -557 -126 563 274 -487 -367
6153 -367 393 471 -281 -525 171 567 -68 -576 -77 562 173 -550 -255 446 356 -404 -469 287 540 -170 -556
6174 -556 66 564 40 -561 -152 547 281 -471 -338 392 448 -308 -491 197 541 -42 -548 -45 557 170
6194 170 -485 -266 420 382 -360 -441 243 479 -155 -549 35 506 66 -510 -199 484 286 -434 -369 340 448
6215D48o57k83O32L67n45m77M60N49l16o24J80O57k9o78j04O43K71o26l75N43
6235C6M83m16n97L02O31j41o56k3O82J45o33l08N91M06n27m93M15N58k51o56J53
6256b99O61j0o12j80O49K79n67l87M65M83l51n75K42O37j28o29k4O29J34n68k92
6277d43N26M17m56n36L73N77k50o22J18O65Lo63j58O24K63n24m10M64M85l47n54
6298d48K47O01r9o31j9N71K05n60l01M80M27m07n10L19N42j70n91K5O19O9n58
6319a89k10N41L12m73m19L64N09l01n39J60N96o1n99p0N99J79n23l50N09M26m05
6340E6m93K88N54j35o04J6N92J48o31k26N65L00m19m41L54N20k82n19J01O30n2
6361C22n85j38N76K61n19l69M27M64l36n14K21N17o4n84k6N72J77n43l01N11L94
$$ plain form
6215 448 -209 -492 140 507 -38 -515 -55 494 178 -446 -266 391 362 -316 -420 223 494 -132 -507 36
6235 36 519 103 -494 -192 439 298 -358 -381 301 446 -187 -495 96 502 -25 -518 -103 455 204 -452 -299
6256 -299 362 352 -260 -440 209 488 -79 -466 -1 482 131 -444 -202 435 307 -322 -346 283 417 -151 -443
6277 -443 83 500 44 -492 -119 458 208 -414 -296 369 372 -291 -449 175 438 -86 -496 -32 453 106 -448
6298 -448 -201 400 301 -330 -349 222 427 -133 -434 46 473 66 -444 -125 417 247 -344 -319 300 369 -189
6319 -189 -399 142 454 -19 -438 -74 435 134 -405 -245 351 290 -309 -379 220 399 -124 -474 35 461 56
6340 56 -437 -149 405 270 -334 -318 274 422 -209 -435 130 430 11 -430 -76 444 162 -357 -256 374 322
6361 322 -263 -401 175 436 -83 -452 -25 439 103 -411 -190 327 263 -321 -347 225 402 -141 -442 69 463
6382D63m32m98L40N38k36n48J23N38M1n62j57N47K73m70l99M46M57l65n04K39
6402a66N19p3n73m1N78J34n19k81M67L97m00m74L02N32j57n79l0O52J04n90j92
6423c90M78L48m74l75L49N14k73n62J42N88k2n84q1N78J96n49l11M61M09l69m77
6444d04K53N71j50o15ON76J53n81k28N44L43m70m43L81M62k30n56J08O22j3o13
6465b84r8N71K61n48l91M81M75l62n22K20N80q6o02j8N90J74n98k79N10M06m46
6486C4m88L26N41k16n83J03O23J3o08j75O31K60n41l99M48M95l34n81K77N72j31
6507B67n91l4O04J73o07k68N30M10m65m81L42N72j97o21L9O37Q1o47j46N56L00
6528D54m99m51M50M87k75o06J85O58r6o58m8O41K02o02l31N32M32m19n29L35N57
$$ plain form
6382 463 31 -467 -127 411 175 -373 -250 288 329 -233 -390 157 430 -40 -439 7 464 99 -405 -166
6402 -166 353 280 -293 -334 244 378 -141 -422 45 442 42 -432 -130 402 245 -334 -364 288 392 -198 -390
6423 -390 88 436 -38 -413 -64 450 177 -385 -243 345 323 -261 -342 236 432 -117 -428 33 442 73 -404
6444 -404 -151 420 270 -345 -339 237 390 -191 -419 125 468 -2 -445 -64 398 168 -388 -280 342 329 -284
6465 -284 -382 189 450 -98 -489 -8 467 105 -417 -197 383 297 -305 -323 267 441 -157 -436 74 480 34
6486 34 -454 -128 413 197 -386 -283 340 353 -255 -430 201 461 -80 -479 -31 464 130 -451 -174 398 267
6507 267 -324 -358 246 419 -188 -456 74 484 19 -462 -120 452 255 -366 -327 310 391 -256 -402 154 454
6528 454 -45 -496 -46 441 166 -440 -255 403 307 -351 -399 242 444 -158 -489 43 475 56 -473 -138 419
6549D19j86o42R7O68M1o73j79O03L35n12m30M04N76l33o48K09O93j09o57q5O65
6570B56K54o51l93O03M52m84n17K93O68k02p04M3P08R3o65k44O24L74n17m93M36
6591f6N64l13o66K36O50j1p12r4O76K29o30l77N45N41n16n54L35O43j94p33P0
6612c77P30J16p21k44O56L60n82m86M83N95l34o60J91P10m1p39j00O83K58o59
6632a61l79N63N22m14o65L34P04j56p92L8P55J58p40l07O88M48o24n34M66O63
6652E67l72p01J91P70l7p93j43P58K78p07l91O13N25m80o38L66P08j76p73J6P84
6673C65J29p71k77O91M38n85n77M98O62l69o96J53P95J1q24j61P95L15p30m31
6693e69O09O04n41o76L51P52j94q06N3P81J26p75l00P24M72o19n97N16O59l64
$$ plain form
6549 419 233 -409 -312 356 397 -276 -455 148 483 -29 -459 -55 521 188 -460 -251 442 333 -324 -409 256
6570 256 510 -141 -534 69 521 37 -480 -187 481 279 -425 -382 326 419 -246 -490 134 508 -9 -502 -66
6591 -66 498 185 -481 -245 405 394 -318 -412 264 493 -137 -514 31 572 56 -498 -163 480 286 -447 -377
6612 -377 353 469 -252 -496 160 520 -62 -548 -65 530 196 -464 -273 437 396 -343 -443 240 498 -161
6632 -161 -540 23 545 131 -534 -200 504 348 -444 -406 349 507 -233 -540 148 596 -28 -562 -96 567
6652 567 195 -506 -315 455 418 -375 -518 240 518 -189 -580 33 558 78 -560 -194 514 338 -435 -419 365
6673 365 494 -277 -554 137 575 -10 -587 -89 573 204 -492 -339 456 467 -357 -518 277 592 -138 -569
6693 -569 40 644 103 -573 -222 530 336 -470 -417 364 490 -285 -585 139 611 -8 -605 -89 570 206
6713B06p64K10Q36o5p90j58P69L35p35m60O72N82n76o56L74Q08k59p93L4Q66J02
6734E38q12l03P28M60o48n98N39P40m66p56K40Q22k2q32j61Q17L13p69m87O71
6754A4O35n38p61M18Q06k23q77R8Q39J50q62k89P93M39o47o42N76P05m42p61K48
6775c21Q57j04q65r2Q49K87q01m45O86O18n87o99L99P93k35q73N8R15J07r02k78
6796f33Q40M64p18o38O14P54m43q30K51Q66m2r38j02R25K87q82m57P57O15n99
6816I1p33M40Q34l07q59O8R28O6q63k81Q43M33p53o00O23P31m93q05L04R17j49
6837D35r36o4R14K75q45m37P77N91o44p60N13Q35k94r27J45R29N8q72l29Q72M67
6858G03p90o30O71P59n04q35K95R35j45r53p6R53K63q91m61Q28N83o80p46N53
$$ plain form
6713 206 -558 -348 488 423 -367 -525 244 579 -156 -616 56 638 62 -594 -220 588 329 -464 -430 436 538
6734 538 -274 -577 151 611 -37 -635 -96 644 178 -578 -338 484 462 -370 -531 286 599 -170 -657 14
6754 14 649 111 -650 -232 574 351 -526 -428 411 561 -301 -590 203 642 -5 -647 -71 634 192 -569 -321
6775 -321 536 432 -433 -525 324 611 -190 -635 51 669 82 -617 -218 575 340 -533 -475 440 547 -355 -633
6796 -633 207 671 -47 -685 -71 683 240 -590 -339 527 485 -453 -555 370 657 -225 -682 75 690 91
6816 91 -642 -202 632 325 -534 -466 462 528 -335 -616 227 660 -93 -693 -70 661 168 -637 -333 584 435
6837 435 -501 -565 349 624 -221 -658 119 710 66 -694 -181 654 360 -567 -422 507 565 -307 -636 236 703
6858 703 -87 -717 -46 713 209 -626 -331 604 459 -494 -570 383 646 -245 -706 122 705 25 -721 -168
6878a68Q67m05r11J81R46J5r60j98R28L87p96o01P41P00n15q97L74R30j57j021
6898e60nJ026K07r22m36Q26O11p26p48N17R13l48j020K07R90M7j022j96R68L91
6918G20q78n82P71P04n54q90L99R65k41r68QR93K04r63l74Q76N72p69p10O09Q01
6939F93l90r55K45R85k6j022j68J002L44r08n70Q09P26o48q47M45R77k81j007
6958e96O1J022J69r99l60Q97N45p58p56O63Q93m99r37K32J023l8j006j76R78L80
6978G38r10n88Q10P51o90q47N01R61l17j003Q8J019J28j004l48R39N34q39o82
6997g59P04P92m75r68L46R63j00j022j04J036K76r14n31Q38O97o73q72N07R84
7016G25l27j032R1J060J51j057l30R86N36q90o72O92Q45n30r67L47J069j94j064
$$ plain form
6878 -168 699 294 -617 -436 510 525 -435 -633 295 682 -114 -715 26 726 211 -686 -312 618 461 -560
6898 -560 -565 461 668 -254 -690 136 747 21 -727 -210 703 355 -665 -458 532 579 -443 -639 329 720
6918 720 -158 -740 31 735 181 -709 -310 655 414 -554 -546 447 651 -312 -686 190 762 -7 -717 -108 693
6939 693 303 -652 -407 578 552 -470 -638 364 708 -200 -770 39 765 117 -730 -285 692 411 -596
6958 -596 -535 487 656 -343 -703 194 739 -19 -775 -112 781 282 -655 -423 600 562 -444 -620 358 738
6978 738 -172 -760 50 801 111 -736 -235 726 409 -594 -506 513 641 -363 -711 228 762 -77 -759
6997 -759 -55 737 262 -706 -360 603 503 -519 -623 413 689 -225 -756 82 779 106 -766 -259 725
7016 725 398 -634 -543 517 668 -389 -719 267 803 -87 -759 -67 778 248 -719 -372 697 503 -561
7035e61n7J070K17r71m56Q53O90p65q01N82R10l60j004J51J054P4j045k52R83
7054C12M61r21o32Q08P85o30r04M09R97j83j067k3J047K51j042m13R03O62p95
7073B5q09O22R27m55r88K11J009M9j028k55J013M54r21o26P56Q11o28r28M53R89
7093F81k17j077M7J066J93j051l71R28O13q63o88O17Q97n13r50K90J023p3j062
7112e10r4R63L73r40n41P97P49o71q98M97R70k53j083P4J069K06j042m12R51O06
7132H11q52p56O90R09m88j053L51J051j18j062j21J047L22j016m84Q68P00p15
7150H4q28N34R29l57j027J60J037O8j012k79R24N03q44o84P29Q33n58r27L25J061
7170F71j44j085o5J056L24j038m68Q74P07p68q28N52R59l66j055J85J042Q4j059
$$ plain form
7035 -561 -618 452 669 -302 -758 95 785 20 -781 -199 711 351 -653 -502 552 626 -419 -671 312
7054 312 773 -148 -780 28 813 183 -721 -312 685 502 -565 -588 459 710 -332 -745 158 820 25
7073 25 -784 -162 765 310 -678 -467 542 591 -437 -692 321 775 -146 -772 -16 795 167 -761 -308 681
7093 681 464 -613 -566 500 693 -358 -729 199 812 -51 -739 -122 775 262 -688 -398 625 552 -510
7112 -510 -604 359 732 -208 -749 48 797 126 -772 -275 695 442 -641 -567 502 708 -334 -746 205 811
7132 811 -41 -797 -107 802 314 -739 -388 663 545 -517 -638 409 731 -285 -769 99 799 84
7150 84 -744 -210 719 362 -665 -505 532 600 -412 -691 233 736 -108 -792 -63 770 212 -715 -390 671
7170 671 527 -558 -623 433 757 -281 -749 125 832 64 -764 -212 747 381 -674 -489 553 637 -422
7189d22k87J001M83r24o41P67P48n36r20L97J000j58j055n2J042K17r75m05Q82
7208A62N90p65p31O14Q35m47r46K56J024m9j007k06J046L56r29n46P84P43o43
7227A41q54M33R75k53r82j8J025J89r47m21Q78O38q20p53O43Q71m41r71K08J047
7247E88n1j035j59J025L20q87n50P92P25o89q34N25Q99k84j013J46R70Q6r18k96
7267f40R05M55q02o63O90P94m87r25L18R69j13r82r8R64K99r38m74P99O87o94
7287F4q04N17R17l28r96J35J028N1r83k96R70M47q36n90O70P65n04r00L30R59
7307F16j53r76m0R80K18r07m15Q30N79p09p29N37Q49l49r42K02R48qr75j82R47
7328C21L52q38n38P26O78n74p95L96Q89k26r56N2R44J74r08l81Q17O06p22p18
$$ plain form
7189 -422 -709 292 775 -149 -790 -23 725 189 -731 -334 666 508 -547 -599 443 660 -315 -720 162
7208 162 752 -13 -744 -130 705 258 -688 -432 592 543 -464 -670 376 732 -197 -743 41 784 141
7227 141 -713 -280 695 442 -540 -558 467 656 -291 -712 166 804 -16 -769 -126 745 304 -667 -459 588
7247 588 537 -498 -657 368 688 -199 -749 43 768 79 -755 -230 669 385 -628 -482 488 574 -344 -640
7267 -640 265 720 -82 -745 -55 739 252 -673 -355 614 501 -481 -579 385 684 -254 -728 71 758 64
7287 64 -740 -223 694 366 -630 -495 533 584 -399 -695 275 722 -114 -704 -34 731 227 -673 -343 616
7307 616 463 -513 -553 427 645 -262 -677 153 732 23 -706 -169 680 331 -611 -409 539 531 -444 -626 321
7328 321 673 -165 -703 23 701 127 -668 -272 617 391 -565 -513 431 605 -303 -684 133 739 17 -701
7348g01N52Q13l73q96J98R38L6j002j74R36L59q96m78P51O49o48p65M96Q42k79
7368C58r07J39Q41J16q66l14Q56M05p31n56N97O79m31p87K82Q52j00q66j10Q78
7388C35K68q16m29P16O33o28p23M55Q48l11q90J18Q94P3q93k58Q54M12p36n76
7408f54O33O80m83q21L28Q59j55q67QQ27J70p40m05P49N03o17o46M82P47l51p97
7429e50J87Q55Nq62j81Q38L08p51m39O04N90m59p35L44Q02j97q28L0Q43J06p55
7450b45l53P38M34n78o08M84O93l23p83J69Q60l7q16j75P96L17p31m75O72N46
7470E85m87o69L87P33k40p66R1P86Q3p74k32P15L46o47m53N20N75m27o15K49P08
7491D68r4p80k5P12K09o50l87O14M91n36n70L65P17k36p59J12P44P0p53k51P65
$$ plain form
7348 -701 -149 664 291 -605 -407 531 567 -435 -609 327 686 -210 -688 63 712 64 -701 -205 637 358
7368 358 -549 -410 431 547 -319 -633 223 628 -103 -659 -62 617 186 -601 -319 533 433 -433 -543 335
7388 335 603 -213 -642 74 707 79 -644 -189 659 348 -542 -424 470 543 -350 -608 246 658 -78 -654
7408 -654 -21 659 176 -645 -317 542 387 -480 -472 355 525 -215 -620 129 632 15 -631 -149 598 247 -550
7429 -550 -363 492 497 -365 -546 292 600 -151 -590 14 604 145 -590 -246 556 359 -469 -439 404 510 -245
7450 -245 -598 140 574 -4 -612 -128 565 242 -541 -372 488 451 -365 -540 256 573 -158 -633 39 585
7470 585 98 -571 -184 549 309 -457 -366 420 503 -271 -503 212 558 -89 -542 -22 553 126 -489 -240 468
7491 468 374 -406 -431 281 490 -160 -547 67 558 22 -548 -183 534 298 -461 -349 395 465 -288 -539 226
7512B26L44o25n07N47N98m32p02L30P09j76p14K0P05J20o61k72O04L97n12n03
7532e04M29N63l13n97J47O47j4o85r7O50K61o16l88N46N01m54n94L35O61k33o71
7553d26J03O57Q9o29k34N89L61n45m66M62N27l10o03J69O79m0o81j16O32K47o02
7574a37l39M95M52l85n81L39O17k08o64J04O49L7o38j28N96K37n47l55M72M64
7594D80l78n19K47N52j00n91rN95J20n46k52N05L37m32m37L29N19k15n88J00O35
7615C52L3o38j60N96K62n24l86M71M35l60n17K58N54j45n78L2O19O8n80j55N13
7636A50K54m56l27L59M30k82m81J88M98p7n19k4M84J70m99k33M36L39l80m00K91
7657g9M45j53n51J02N07M5n45j33M92L07n02l52L89M23l08m45J84M99q1n16k3
$$ plain form
7512 226 570 -55 -562 -15 583 151 -551 -221 488 312 -402 -382 323 443 -218 -490 114 511 -1 -504
7532 -504 -75 488 175 -422 -275 372 358 -327 -424 226 487 -129 -517 29 530 76 -518 -183 478 245 -426
7553 -426 -323 334 423 -206 -440 149 510 -35 -501 -39 488 178 -425 -256 423 383 -298 -414 218 465 -137
7574 -137 -476 19 471 86 -495 -156 461 253 -411 -307 342 379 -259 -387 209 446 -101 -456 16 480
7594 480 102 -417 -170 382 282 -309 -318 277 397 -149 -401 104 441 9 -428 -99 420 205 -383 -283 352
7615 352 385 -253 -413 183 445 -79 -465 6 441 81 -436 -178 376 231 -347 -315 304 372 -208 -363 150
7636 150 404 -52 -379 -20 410 128 -353 -165 333 256 -263 -287 197 367 -132 -365 71 410 30 -370 -79
7657 -79 366 213 -338 -236 271 316 -229 -362 130 437 -65 -417 -28 395 87 -358 -174 325 244 -272 -295
7678b95N02J19m64k10L96L62l75l68K52M28j66n06J07M95l0m32r7M49J80m49k52
7699c54L88L36l43l93K68M25j81m48J07L98O8m52r7L89K15l72k88K96L71k06m65
7720c38J45M58k1m35p1M07K00m06k78L90L12l15l78K10M43j46m52P0M19K7m46
7741b05p6L85J91l64k62L41L11l04k79J53L50p7l70K1L64P4m12j11L45J90l00
7762c5k21J91L67k04l56Q9M39m0l93p8L85J34l65k16K94K99k32l58J86L71j01
7783A56l88L1M32Nl80j47L61K16l01k65K37L33k26l38J37L32k5l62l4L83Q6l58
7805a15j59L53K17k93k74K41K68j43l33R5L51n1l24o1L40J27l29j30K49K15k20
7826B4k52J40K75n6k94pL03R1l20j69K93K32k54k66K16K83j46l12Q1L39k3l50
$$ plain form
7678 -295 207 326 -138 -348 48 410 35 -333 -81 347 181 -325 -218 277 247 -185 -282 167 347 -102 -354
7699 -354 34 370 27 -366 -98 327 146 -302 -195 203 271 -181 -278 111 326 -46 -334 -38 333 127 -338
7720 -338 -193 265 244 -191 -262 145 345 -61 -339 51 363 48 -330 -120 323 177 -275 -205 214 241 -205
7741 -205 -281 104 295 -69 -331 10 321 17 -262 -109 241 164 -206 -185 179 253 -159 -270 75 265 -35
7762 -35 -256 -65 302 98 -258 -169 270 230 -163 -241 144 278 -87 -303 -9 290 58 -300 -114 257 156
7783 156 -232 -201 231 236 -144 -291 70 286 -15 -280 -43 290 64 -274 -137 195 170 -192 -226 157 243 -115
7805 -115 -274 79 296 3 -271 -30 238 95 -238 -143 208 157 -167 -228 112 239 -90 -220 29 244 24
7826 24 -228 -88 187 131 -163 -170 133 224 -96 -265 28 260 6 -260 -44 239 93 -219 -138 201 178 -172
7848a72rL28Q9l10j35K67K02k57k35K25K63j80k67N2K96l8k71LK69R1k55j64K06
7871bJ86j40k53J12L14j03k89rL06N8k67j33K35K28k35k28J59K91j44l03O4L46
7893A93l3l03mK74Q9k85j28K11K21k08k30J65K36j08k26oK70J8k63p7K73Q0k24
7916f5j54K05J91j43k33J12K61p7k85P9K61J8k94n0K54J16k31j42J68K01r4k56
7938a58N0K58mk64m7K44J03k29j38J74K15j86k29J31K48l0k88KK68N5k95n9K40
7961F1J33k17j62J97J96j76k10J41J98p6k43L1K32K7k15o9K17J20j77j57J56J81
7983A88j24k40Q9K47j4k53o1K68Q1k23j68K03J93j55k36J34K50p2k44j3K64J1
8005A25k38p3K48J22j80j96J94J92j62j90J13K02n5k02j8K38L8k22q8J98J33j84
$$ plain form
7848 -172 -181 147 236 -74 -209 58 260 3 -232 -7 256 76 -191 -139 157 119 -152 -149 120 211 -44 -208 -2
7871 -2 184 44 -209 -97 217 114 -175 -184 122 180 -87 -220 15 243 8 -220 -61 230 86 -217 -153 193
7893 193 160 -143 -147 127 216 -69 -197 14 235 27 -203 -38 198 90 -136 -142 128 146 -117 -194 79 159 -65
7916 -65 -219 -14 177 34 -199 -87 174 97 -188 -109 152 170 -124 -174 80 196 -35 -177 -9 192 98 -158
7938 -158 -108 150 146 -118 -165 79 182 -47 -185 -11 204 18 -211 -80 168 138 -150 -148 120 175 -120 -179 61
7961 61 194 -23 -185 12 208 32 -178 -37 161 85 -158 -127 105 132 -83 -152 65 185 8 -149 7 188
7983 188 64 -176 -87 160 146 -107 -168 100 181 -42 -210 -7 186 31 -205 -71 179 107 -137 -150 114 125
8005 125 -113 -186 62 184 4 -192 2 194 32 -158 -45 157 102 -100 -118 120 158 -64 -152 46 179 -5
8027ej48J31J96r8k44P3K53l8k73J9K18O5j67j61J99J58j29k22R8K37o9k51L1
8050a27K39M1k15r3K09J20j69j51J03K14q0k35L6K41lk33%K12O7k23q9J79J40
8073A83j91j80J77J85j32j91N7K24k2k47PK73j5k01q3J68J47j61j68J23J91n2
8095I2k22pK42O7k41r3K16J43k04k03J94J98r7k38O0K48rk52m0K39Q4k46j06J99
8119B4J61k01j65J21J91n4k07O3J92J5k38k9K12P2k26j04K06J14j12j87R5K30
8141A73n8k35J4K47K2k38q0J72J70j97j58J74J74j03k30O4K21kk23l9J79J04k01
8164e0j26J83J67j67j80R8K24j03j88K2K47J2k14o4J99J45k31j35J79J63j44j91
8186a54J01K48r9k34M0
$$ plain form
8027 -5 -153 -22 174 76 -168 -95 158 120 -153 -134 84 149 -18 -179 20 178 49 -173 -75 162 93 -158 -127
8050 -127 112 153 -62 -155 54 174 5 -146 -43 171 91 -144 -108 133 130 -103 -103 109 176 -47 -136 43 183
8073 183 -8 -188 -11 174 42 -149 -92 132 110 -137 -130 143 128 -73 -156 12 159 -2 -170 -47 144 92
8095 92 -130 -137 105 172 -69 -162 54 197 -7 -210 -16 182 85 -153 -93 155 146 -106 -146 93 177 -69 -175 24
8119 24 185 -16 -181 -60 131 77 -130 -67 125 140 -98 -127 85 157 -69 -173 33 147 35 -152 -57 173
8141 173 115 -120 -106 141 163 -75 -155 17 187 -10 -168 6 180 77 -153 -89 132 130 -93 -132 47 151 -50
8164 -50 -176 7 174 7 -173 -75 149 46 -142 -120 127 139 -75 -139 60 205 -26 -161 18 181 37 -154
8186 -154 -53 195 96 -138 -98
8191i8
$$ Imaginary data points
##PAGE= N=2
##DATA TABLE= (X++(I..I)), XYDATA
0@%%%%%%%%%%%lL%Qj6J6j6K4l2L2l9N1o0O8q0R7j14J29j49J75k00K24k56K96l34
36a76L72m20M75n28N87o58P33q11Q99r97J103j217J344j483J631j794J977k179
54a142K398k645K926l242L597m006M487n048N719o543P571q877J0568j2698J4380
69G445j044N60145k08823q96129J05645Q57305J05675q53825k59679P76964M31472
80F25151o95750n55955N63602O72754m26472p45686K62317P99419j03002q08200
90d11822o5678P88784K21597p29363l72796O47996N02688n39796o13593M15886
100a56097O92338k73071p42587J22563P60540L2580p50756j81704P08990L21773
110E34569o37424m45822N37735N51953m18382o35408K85333O92422j44562p17679
$$ plain form
0 0 0 0 0 0 0 0 0 0 0 0 0 -3 0 0 8 -8 8 -8 16 -16 16 -23 28 -32 36 -44 53 -61 68 -81 94 -106 118 -138 158 -176
36 -176 196 -224 251 -277 310 -348 385 -426 473 -524 579 -638 706 -777 854 -940 1037 -1142
54 -1142 1256 -1389 1537 -1705 1892 -2114 2373 -2675 3044 -3499 4072 -4805 5763 -6935 7445
69 7445 6401 566546 357723 -538406 -432761 424544 530219 -323606 -583285 193679 625151
80 625151 -70599 -626554 -62952 609802 183330 -562356 -300039 499380 396378 -411822
90 -411822 -477500 311284 532881 -196482 -569278 78718 581406 41610 -571983 -156097
100 -156097 536241 263170 -479417 -356854 403686 436266 -314490 -496194 212796 534569
110 534569 -102855 -548677 -10942 541011 122629 -512779 -227446 464976 320414 -397265
120c97265j38P09664J43646o70801k80494O06089M04065n18802n07938M11004
130a00970N87028k86092o39732J50717O66210j2267o66241j22601O38259K48736
140D63047n82013l62244N01185M59570m01644n37604K88761N92754j66445o21750
150c66383L8697O23625Q9428o00484k11967N54768L23261m87176m18516L98154
160e6593M94716k90994n50641J72208N85426m8701n96910p4180N82270J92501
170D09102n41114l02306M76610L99501l93979m79371K96913N37482j87923n70876
180c55961P0524N79254M9715n64805j65841N28985K71943m71883l63509L94170
190b7408M37658k99692m92530J94381N26944q3849n39103k8027N27494J37797
$$ plain form
120 -397265 -397403 312261 455907 -214894 -495388 110701 514766 -4036 -511974 -100970
130 -100970 486058 199966 -439766 -289049 377161 364894 -301347 -423948 214311 463047
140 463047 -118966 -481210 19975 479545 77901 -459703 -170942 421812 255367 -366383
150 -366383 -327686 295939 385367 -215117 -427084 127684 450945 -36231 -454747 -56593
160 -56593 438123 147129 -403512 -231304 354122 305421 -291489 -365669 216601 409102
170 409102 -132012 -434318 42292 441793 47814 -431557 -134644 402838 214915 -355961
180 -355961 -285437 293817 343532 -221273 -387114 141871 413814 -58069 -421578 -27408
190 -27408 410250 110558 -381972 -187591 339353 255504 -283599 -311626 215868 353665
200C53665m93103k41144M39491L33308l70454m09702K87947M66706j93212n02270
210c28768Q8975N17016J9018n12047j24745M87558K23410m42576l11707L77684
220f182L86882k96677m46445K05101M87553j07357n07048N922N03153R6322m76796
231a55572j95083M31384K85231l70293l61809K95266M20929k07757m60328J11155
241b06877M79791j1150m79712q6733M59743J78824m19408k62653L60513L35586
251C47924k87632l94640K05936M36605j18645m58820K7452M60039O5407m41780
261a58154j55551M06721K38100l56598l09357K92044L66600k14112m08640J26844
271a72103M34558l5734m43278n4498M33034J41259m02858k22237L53862K94860
$$ plain form
200 353665 -139438 -380582 58909 392217 21763 -387939 -99992 366714 173502 -328768
210 -328768 -239793 277223 296241 -215806 -340551 147007 370417 -72159 -383866 -6182
220 -6182 380700 84023 -362422 -157321 330232 222875 -284173 -278251 224902 321224 -155572
231 -155572 -350655 80729 365960 -4333 -366142 -70876 350053 142296 -318032 -206877
241 -206877 272914 261764 -217948 -304681 155062 333886 -85522 -348175 12338 347924
251 347924 60292 -334348 -128412 308193 189548 -269272 -241820 218219 283626 -158154
261 -158154 -313705 93016 331116 -25482 -334839 -42795 323805 109693 -298947 -172103
271 -172103 262455 226721 -216557 -271055 161979 303238 -99620 -321857 32005 326865
281C26865k90231l55440K16122M00817j34291m28293M6797M36625M2875m26511
291a64665j29725L99402K09090l56359k77496K97671L33202k25464l74876J44264
301a44956M01354n9638m11318k4416M03394J05960l77461j82721L35473K51425
311B97096k80902l08537K16551L51342j43710l78451O3776L89812J9521l86088
321a59590j01101L67953J76557l35125k43219K87293K99469k26048l43675J55191
331a22295L74173p9217l89095J067L87070P7393l68138j53308L34066K22321k87340
342c303k80394K30018L24550j62838l53716Q7646L67697q689l66851o8763L51240
353A16597J41010l20802k06041K76224K62264k20115l07450J56666L38982q9149
$$ plain form
281 326865 36634 -318806 -102684 298133 163842 -264451 -217654 218971 261846 -164665
291 -164665 -294390 105012 314102 -42257 -319753 -22082 311120 85656 -289220 -144956
301 -144956 256398 196760 -214558 -238974 164420 270380 -107081 -289802 45671 297096
311 297096 16194 -292343 -75792 275550 131840 -246611 -182835 206977 226498 -159590
321 -159590 -260691 107262 283819 -51306 -294525 -7232 292237 66189 -277486 -122295
331 -122295 251878 172661 -216434 -215367 171703 249096 -119042 -272350 61716 284037 -3303
342 -3303 -283697 -53679 270871 108033 -245683 -158037 209660 200971 -165880 -234643 116597
353 116597 257607 -63195 -269236 6988 269252 49137 -258313 -101647 237335 148186
363A48186l54908J8964L54717N2826l39466j23285L11196J88293k72168k43948
373b59593K23285K87984j64929l19503R8741L37958k8438l42898m1607L33552
383A24552J08812l09602j71666K71586K28483k22199k76175J64887L11626j02279
393A28025l32634L5660L38520L3286l29606j01308L07296J63969k72920k17902
403b47614K27240K61817j71532k94930J08746L16038m3189l23905k1230L17380
413A28821Q2822k96342j40798K62113J93448k17460k38083J65712K71853j08880
423A03206k93216M7891L01789J5745k98095p8574K82615J36937k56021j88147
433b25870K18234K31382j70094k65966J14236K90424n4495l03041n865L02460
$$ plain form
363 148186 -206722 -187758 166959 219785 -119681 -242966 68230 256523 -15645 -259593
373 -259593 -36308 251676 86747 -232756 -134015 203943 175505 -167393 -209000 124552
383 124552 233364 -76238 -247904 23682 252165 29966 -246209 -81322 230304 128025
393 128025 -204609 -168949 169571 202857 -126749 -228057 79239 243208 -29712 -247614
403 -247614 -20374 241443 69911 -225019 -116273 199765 156576 -167329 -188559 128821
413 128821 211643 -84699 -225497 36616 230064 12604 -225479 -59767 212086 103206
423 103206 -190010 -142119 159670 175415 -122680 -201254 81361 218298 -37723 -225870
433 -225870 -7636 223746 53652 -212314 -98078 192346 137851 -165190 -171055 131405
443A31405O5456k88477j22869K62109J75401k25171k19691J79598K53192j26688
453H4265k75046O7732K85495n466k84769n5775K72668J12088k49105j61481K14344
464D950K03421j69828k37112J18464K60942o3786k73217Q117K73355M7479k61936
475h9151j01519K40082J51434k09587j93764J71555K26536j26621k49268P5543
485a04760K62119k0669k64858l4546K57049Q7173k38544j35619K09716J79022
495A96083j72108k15334J27817K42049p9188k57116K7495K60285K6317k52511
505i6211q0073K34778J30309k08246j73328J73569K07347j31490k31981Q3391
515i1935K47126l2159k52039j8897K46089O7238k29130j12114K02193J52883j67334
$$ plain form
443 131405 196861 -91616 -214485 47624 223025 -2146 -221837 -42239 210953 84265
453 84265 -190781 -123049 162446 156980 -127789 -183564 89104 201192 -47913 -209394 4950
464 4950 208371 38543 -198569 -80105 180837 117051 -156166 -148049 125306 172785 -89151
475 -89151 -190670 49412 200846 -8741 -202505 -30950 195586 68965 -180303 -104760
485 -104760 157359 136690 -128168 -162714 94335 181508 -57036 -192655 17061 196083
495 196083 23975 -191359 -63542 178507 99319 -157797 -130302 129983 156300 -96211
505 -96211 -176284 58494 188803 -19443 -192771 -19202 188145 56655 -175326 -91935
515 -91935 155191 123032 -129007 -147904 98185 165423 -63707 -175821 26372 179255 11921
526A1921j87641J27087K13774q3401k29429L7134K34536J1040k29915n9373K16325
537F2058J04813j94195j44848J64027J78405j26510k05407Q3541K24851l7732
547A09003k34996q254K34194N3290k22530r6790K01133J37566j71779j72908J36189
558c5882J99914r5711k17190N1292K24909m280k23592m2667K13366Q6211j94149
569c7779j24032J66214J55551j30460j81089Q9331J99660m5655k09714J888K10249
580I4164M0582k01376q1170J84117J18706j59764j50926J29428J75757r3944j92739
591a37165N4261K02332j1854k04854l0595J99497P0538j85701j06312J63402J37822
602A51371j33796j64479R8633J84776o0024j96698J9534J99329K1948j93345o3158
$$ plain form
526 11921 -175720 -48633 165141 81740 -147689 -110555 123981 135021 -94894 -154267 62058
537 62058 166871 -27324 -172172 -8145 170260 43750 -161657 -78116 146735 109003
547 109003 -125993 -134247 99947 153237 -69293 -166083 35050 172616 837 -172071 -35882
558 -35882 164032 68321 -148869 -97577 127332 123052 -100540 -143207 70159 156370 -37779
569 -37779 -161811 4403 159954 29494 -151595 -62264 137396 91741 -117973 -116085 94164
580 94164 134746 -66630 -147800 36317 155023 -4741 -155667 -26239 149518 55574 -137165
591 -137165 -82904 119428 107574 -97280 -127875 71622 142160 -43541 -149853 13549 151371
602 151371 17575 -146904 -48271 136505 76481 -120217 -100683 98646 120594 -72751 -135909
613a35909J79787J01883j59405j35304J32835J61141j00480j78929O3112J89411
623A18142k2751j92620j7968J88021N6435j75301r1207J55065J21812j28710j47484
634a36566R7850J66512o4002j77293K8080J79723R281j74937m6773J64016Q2106
645A27997j47114j12992J24294J38038r5954j57244O3236J70788k7986j77644
655i4581p962J76654M2932j67303p6409J50574J07823j28056j35529J01184J57057
666A26384p0878j70644L7936J75841k928j73695l2565J64847O6213j49363r5845
677a24697J27395J20340r9859j39719O8542J53572l5288j60879K010J60329L0412
688A02158j52110o1322J37337R0198j17591j15495R3846J35360o6750j48625L6833
$$ plain form
613 -135909 43878 145761 -13644 -148948 -16113 145028 44548 -134381 -71269 118142
623 118142 95391 -97229 -115197 72824 129259 -46042 -137249 17816 139628 10918 -136566
634 -136566 -38716 127796 63794 -113499 -85419 94304 103585 -71352 -118125 45891 127997
645 127997 -19117 -132109 -7815 130223 34269 -122975 -59739 111049 83063 -94581
655 -94581 -102543 74111 117043 -50260 -126669 23905 131728 3672 -131857 -30673 126384
666 126384 55506 -115138 -77202 98639 95711 -77984 -110549 54298 120511 -28852 -124697
677 -124697 2698 123038 23179 -116540 -47998 105574 70286 -90593 -88583 71746 102158
688 102158 -49952 -111274 26063 116261 -1330 -116825 -22979 112381 45631 -102994 -66161
699f6161J55723n174j57241k6590J53057N6449j42402q2966J24938J05886j01528
710A3991j25441P3906J41058m4070j50888J3313J53505J7439j48713m7726J37499
721C3873P6538j21054j01834R9776J21842p4202j35544M4933J43600j3657j46387
732g2116j7566J43526M6701j34197p2483J18433R4658r7485j13202P3108J27236
743I6613m6622j35399J8829J37062R567j32895l7725J24199O4143j11396q7152
754a00776R4448J05170p2990j18200M7705J26898k0061j31477q035J30970L5181
765H8833j24629o0411J12456Q3435r5525j03630P5160J19506n2135j29524K6923
776e9541J33090p6j30972k7183J24103N3108j12692p5907R6633R4350p6296j08025
$$ plain form
699 -66161 89562 84388 -72853 -99443 53614 110063 -32339 -115305 9633 115519 13991
710 13991 -111450 -37544 103514 59444 -91444 -78131 75374 92813 -55900 -103626 33873
721 33873 110411 -10643 -112477 -12701 109141 34939 -100605 -55672 87928 74271 -72116
732 -72116 -89682 53844 100545 -33652 -106135 12298 106956 9471 -103731 -30623 96613
743 96613 49991 -85408 -66579 70483 80050 -52845 -90570 33629 97772 -13624 -100776
754 -100776 -6328 98842 25852 -92348 -44643 82255 62194 -69283 -77318 53652 88833
765 88833 -35796 -96207 16249 99684 4159 -99471 -24311 95195 43060 -86464 -59541
776 -59541 73549 73473 -57499 -84682 39421 92529 -20163 -96070 563 94913 18617 -89408
788h9408N2724J17212k7477j21622K007J20354K2722j13100m6308J00808O8211
799H6123q5029q7497O6989J02598m6942j12301K4933J16491j444j16084k2442
810g4605J11806M5281j03491o5646R0536Q2989p3325r7264N3124J08328l1345
821D6388j15290R115J16762J3189j12300l5280J02765N6462q9369p5469P2866
832a0161R0802n3462j01440L1528J07336q229j09005j4891J06444L6350r8973
843b3701n5366Q6419P1696o9736q5348N0543R6067l0525j02556J0264J03898J0082
855F1737j00248l0010R2563M8806q1957o5229O8552P8252n2148q7418L2945R3243
$$ plain form
788 -89408 -36684 80528 53051 -68571 -66564 53790 76512 -36588 -82896 17912 86123
799 86123 1094 -86403 -19414 83184 36242 -76059 -51126 65365 63921 -52163 -74605
810 -74605 37201 82482 -21009 -86655 3881 86870 13545 -83719 -30595 77733 46388
821 46388 -68902 -59787 56975 70164 -42136 -77416 25349 81811 -7558 -83027 -10161
832 -10161 80641 27179 -74261 -42733 64603 56374 -52631 -67522 38922 75272 -23701
843 -23701 -79067 7352 79048 9312 -76036 -25493 70574 40049 -62507 -52243 51655 61737
855 61737 -38511 -68521 24042 72848 -9109 -74338 -5786 72466 20318 -67100 -34155 59088
$$ [...]
8191A37
##END NTUPLES=NMR FID
##END=
