##TITLE=1H_DE_19H_b
 200.13MHz, D2O,
 8 sc
 
 21.1.2025
##JCAMPDX= 6.0         $$ Bruker NMR JCAMP-DX V2.0
##DATA TYPE= NMR FID
##DATA CLASS= NTUPLES
##ORIGIN= UXNMR, Bruker Analytische Messtechnik GmbH
##OWNER= pz
$$ XWIN-NMR		Version 3.5
$$ Tue Jan 21 17:41:47 2025 Russian Standard Time (UT+4h)  she@DPX200
##.OBSERVE FREQUENCY= 200.1313
##.OBSERVE NUCLEUS= ^1H
##.DELAY= (6, 6)
##.ACQUISITION MODE= SIMULTANEOUS
##.ACQUISITION SCHEME= undefined
##.AVERAGES= 8
##.DIGITISER RES= 18
##SPECTROMETER/DATA SYSTEM= spect
##.PULSE SEQUENCE= zg30
##.SOLVENT NAME= D2O
##.SHIFT REFERENCE= (INTERNAL, D2O, 0, 14.3821)
##AUDIT TRAIL= $$ (NUMBER, WHEN, WHO, WHERE, WHAT)
$$ ##TITLE= Audit trail, XWIN-NMR		Version 3.5
$$ ##JCAMPDX= 5.01
$$ ##ORIGIN= Bruker BioSpin GmbH
$$ ##OWNER= she
$$ F:/spectra/data/she/nmr/H-C/1/audita.txt
$$ ##AUDIT TRAIL=  $$ (NUMBER, WHEN, WHO, WHERE, WHAT)
(   1,<2025-01-21 17:40:40.32 +0400>,<she>,<DPX200>,
      <created by zg, POWCHK disabled, PULCHK disabled
       configuration hash MD5:
       00 E9 B6 7A A2 85 ED C7 34 08 36 98 17 FE 4E 26
       data hash MD5: 16K
       A4 75 80 A6 AB E2 E4 80 D4 00 64 DE E3 ED 16 8F>)
$$ ##END=
$$ 
$$ hash MD5
$$ B2 6A 25 ED AC 71 88 23 1D 1A F1 53 29 83 6A 3E
##$RELAX= 
##$RELAX= 
##$RELAX= 
##$RELAX= 
##$RELAX= 
##$RELAX= 
$$ Bruker specific parameters
$$ --------------------------
##$DU= <F:/spectra>
##$EXPNO= 1
##$NAME= <H-C>
##$PROCNO= 1
##$TYPE= <nmr>
##$USER= <she>
##$AMP= (0..31)
100 100 100 100 100 100 100 100 100 100 100 100 100 100 100 100 100 100 
100 100 100 100 100 100 100 100 100 100 100 100 100 100 
##$AQSEQ= 0
##$AQ_mod= 1
##$AUNM= <au_zg>
##$AUTOPOS= <>
##$BF1= 200.13
##$BF2= 200.13
##$BF3= 200.13
##$BF4= 200.13
##$BF5= 200.13
##$BF6= 200.13
##$BF7= 200.13
##$BF8= 200.13
##$BYTORDA= 1
##$CFDGTYP= 0
##$CFRGTYP= 5
##$CHEMSTR= <none>
##$CNST= (0..31)
1 1 145 1 1 1 1 1 1 1 1 1 1 1 1 1 1 1 1 1 1 1 1 1 1 1 1 1 1 1 1 1 
##$CPDPRG= <>
##$CPDPRG1= <>
##$CPDPRG2= <>
##$CPDPRG3= <>
##$CPDPRG4= <mlev>
##$CPDPRG5= <mlev>
##$CPDPRG6= <mlev>
##$CPDPRG7= <mlev>
##$CPDPRG8= <mlev>
##$CPDPRGB= <>
##$CPDPRGT= <>
##$D= (0..31)
0 0.7 0 0 0 0 0 0 0 0 0 0.03 0 0 0 0 0 0 0 0 0 0 0 0 0 0 0 0 0 0 0 0 
##$DATE= 1737466839
##$DBL= (0..7)
120 120 120 120 120 120 120 120 
##$DBP= (0..7)
150 150 150 150 150 150 150 150 
##$DBP07= 0
##$DBPNAM0= <>
##$DBPNAM1= <>
##$DBPNAM2= <>
##$DBPNAM3= <>
##$DBPNAM4= <>
##$DBPNAM5= <>
##$DBPNAM6= <>
##$DBPNAM7= <>
##$DBPOAL= (0..7)
0.5 0.5 0.5 0.5 0.5 0.5 0.5 0.5 
##$DBPOFFS= (0..7)
0 0 0 0 0 0 0 0 
##$DE= 6
##$DECBNUC= <off>
##$DECIM= 32
##$DECNUC= <off>
##$DECSTAT= 4
##$DIGMOD= 1
##$DIGTYP= 9
##$DL= (0..7)
0 120 120 120 120 120 120 120 
##$DP= (0..7)
150 150 150 150 150 150 150 150 
##$DP07= 0
##$DPNAME0= <>
##$DPNAME1= <>
##$DPNAME2= <>
##$DPNAME3= <>
##$DPNAME4= <>
##$DPNAME5= <>
##$DPNAME6= <>
##$DPNAME7= <>
##$DPOAL= (0..7)
0.5 0.5 0.5 0.5 0.5 0.5 0.5 0.5 
##$DPOFFS= (0..7)
0 0 0 0 0 0 0 0 
##$DQDMODE= 0
##$DR= 18
##$DS= 0
##$DSLIST= <SSSSSSSSSSSSSSS>
##$DSPFIRM= 0
$$ [...]
##$SUBNAM0= <"">
##$SUBNAM1= <"">
##$SUBNAM2= <"">
##$SUBNAM3= <"">
##$SUBNAM4= <"">
##$SUBNAM5= <"">
##$SUBNAM6= <"">
##$SUBNAM7= <"">
##$SUBNAM8= <"">
##$SUBNAM9= <"">
##$SW= 18.0517328524113
##$SWIBOX= (0..15)
0 0 2 0 0 0 0 0 0 0 0 0 0 0 0 0 
##$SW_h= 3612.71676300578
##$TD= 16384
##$TD0= 1
##$TE= 0
##$TE2= 300
##$TE3= 300
##$TEG= 300
##$TL= (0..7)
0 120 120 120 120 120 120 120 
##$TP= (0..7)
150 150 150 150 150 150 150 150 
##$TP07= 0
##$TPNAME0= <>
##$TPNAME1= <>
##$TPNAME2= <>
##$TPNAME3= <>
##$TPNAME4= <>
##$TPNAME5= <>
##$TPNAME6= <>
##$TPNAME7= <>
##$TPOAL= (0..7)
0.5 0.5 0.5 0.5 0.5 0.5 0.5 0.5 
##$TPOFFS= (0..7)
0 0 0 0 0 0 0 0 
##$TUNHIN= 0
##$TUNHOUT= 0
##$TUNXOUT= 0
##$USERA1= <user>
##$USERA2= <user>
##$USERA3= <user>
##$USERA4= <user>
##$USERA5= <user>
##$V9= 5
##$VALIST= <valist>
##$VCLIST= <CCCCCCCCCCCCCCC>
##$VD= 0
##$VDLIST= <DDDDDDDDDDDDDDD>
##$VPLIST= <PPPPPPPPPPPPPPP>
##$VTLIST= <TTTTTTTTTTTTTTT>
##$WBST= 1024
##$WBSW= 4
##$XGAIN= (0..3)
0 0 0 0 
##$XL= 0
##$YL= 0
##$YMAX_a= 232630
##$YMIN_a= -295211
##$ZGOPTNS= <>
##$ZL1= 120
##$ZL2= 120
##$ZL3= 120
##$ZL4= 120
##$ABSF1= 10
##$ABSF2= 0
##$ABSG= 5
##$ABSL= 3
##$ALPHA= 0
##$AQORDER= 0
##$ASSFAC= 0
##$ASSFACI= 0
##$ASSFACX= 0
##$ASSWID= 0
##$AUNMP= <proc_1d>
##$AZFE= 0.1
##$AZFW= 0.1
##$BCFW= 1
##$BC_mod= 2
##$BYTORDP= 1
##$COROFFS= 0
##$CY= -3
##$DATMOD= 1
##$DC= 2
##$DFILT= <>
##$DTYPP= 0
##$F1P= 0
##$F2P= 0
##$FCOR= 0.5
##$FTSIZE= 0
##$FT_mod= 4
##$GAMMA= 1
##$GB= 0.15
##$INTBC= 1
##$INTSCL= 1
##$ISEN= 128
##$LB= 0.25
##$LEV0= 0
##$LPBIN= 0
##$MAXI= 10000
##$MC2= 0
##$MEAN= 0
##$ME_mod= 0
##$MI= 1.114404
##$NCOEF= 0
##$NC_proc= 0
##$NLEV= 6
##$NOISF1= 3.799351
##$NOISF2= 2.8
##$NSP= 1
##$NTH_PI= 0
##$NZP= 0
##$OFFSET= 14.38212
##$PC= 1
##$PHC0= 258.5088
##$PHC1= -1.007798
##$PH_mod= 1
##$PKNL= yes
##$PPARMOD= 0
##$PSCAL= 0
##$PSIGN= 0
##$REVERSE= no
##$SF= 200.129724274929
##$SI= 16384
##$SIGF1= 3
##$SIGF2= 2
##$SINO= 400
##$SIOLD= 16384
##$SREGLST= <1H.CDCl3>
##$SSB= 0
##$STSI= 0
##$STSR= 0
##$SW_p= 3205.1282051282
##$SYMM= 0
##$S_DEV= 0
##$TDeff= 0
##$TDoff= 0
##$TI= <>
##$TILT= no
##$TM1= 0
##$TM2= 0
##$TOPLEV= 0
##$USERP1= <user>
##$USERP2= <user>
##$USERP3= <user>
##$USERP4= <user>
##$USERP5= <user>
##$WDW= 1
##$XDIM= 8192
##$YMAX_p= 0
##$YMIN_p= 0
$$ End of Bruker specific parameters
$$ ---------------------------------
##NTUPLES= NMR FID
##VAR_NAME=  TIME,          FID/REAL,        FID/IMAG
##SYMBOL=    X,             R,               I
##VAR_TYPE=  INDEPENDENT,   DEPENDENT,       DEPENDENT
##VAR_FORM=  AFFN,          ASDF,            ASDF
##VAR_DIM=   8192,          8192,            8192
##UNITS=     SECONDS,       ARBITRARY UNITS, ARBITRARY UNITS
##FACTOR=    0.0002768,     1,               1
##FIRST=     0,             0,               0
##LAST=      2.2672688,     0,               0
##MIN=       0,             -295211,         0
##MAX=       2.2672688,     232630,          0
$$ Real data points
##PAGE= N=1
##DATA TABLE= (X++(R..R)), XYDATA
0@%%%%%%%%%%%%%%%mJ2j6J6j6J6k1K9l2L5m3M8n4O4p3Q3r4J06j19J33j50J69j88
38i9K10k34K59k86L16l49L86m26M69n15N68o25O87p58Q35r21J021j137J266j416
58g49J597j814K079k415K849l434M271n548P695j1909K2924j01357k09400L15055
72A9844l986k18834K16287J40017j40927O9199K9933j70554K223K1490q7287R9546
84b3049P3453p6496J14962P9585j86314k1152P1157j43108m543J35263p3029L3786
96a9485J88439j05366j16310J35530o6279j65787J13428M9351q9797J12892Q1183
107A17799j02423J5846K0648j10982L337K4603p0000Q5726J03691q6220K1145
118B3170R5781j15623o7330P7139o8855m1311J30217J821n2503R3098n126r8750
$$ plain form
0 0 0 0 0 0 0 0 0 0 0 0 0 0 0 0 0 -4 8 -8 8 -8 8 -13 16 -16 19 -24 24 -30 34 -39 44 -50 56 -63 70 -80 89 -99
38 -99 111 -123 136 -150 166 -183 203 -223 246 -269 299 -326 361 -397 438 -483 538 -599 667 -749
58 -749 848 -966 1113 -1302 1547 -1887 2384 -3164 4531 -7378 15546 -85811 -295211 19844
72 19844 15858 -202976 13311 153328 12401 81600 111533 -59021 -56798 -35308 -122595 -23049
84 -23049 50404 -26092 88870 168455 -17859 -39011 32146 -110962 -115505 19758 -53271 -19485
96 -19485 168954 63588 -52722 82808 16529 -149258 -35830 13521 -76276 36616 117799
107 117799 15376 31222 51870 -59112 -55775 -31172 -101172 -15446 88245 2025 23170
118 23170 118951 3328 -64002 13137 -55718 -97029 33188 35009 -17494 75604 70478 -28272
130b8272K6796j6330p7737O5572M5080m7247O8504N3853p8370M824J8511r6550
142f1366Q16O9272m8670J0546R8459k8303l9232M5578m7721o2098M4878p270k9126
155e4237P2540K5662l1910L7597p039o9571J3809L474n5084L8908N2866l1767
167d752K5462M2765n8688k2036K9352m9537k0132O0142r88q363N5216o507m0922
180A012J6896j9298m6577K3388J3668j5709M0606K3927k7825J2290J595n0325
192b6352j030J9900k5039J6671M5703j2869k195K5507l2086l1496J5365j5229
204b3150j4642L5839J1849o431K6728j664l2043L178n637k7927J4858K1109p508
217e441J9467K0717k1366p855K527k7678r086J7947m054O329K9808j558j0143
$$ plain form
130 -28272 -1476 -17806 -95543 -29971 15109 -32138 36366 90219 11849 16673 35184 -61366
142 -61366 -60550 8722 -39948 -29402 69057 40754 1522 47100 -621 -62719 -17841 -25111 -54237
155 -54237 18303 43965 12055 49652 42613 -26958 -13149 -9675 -64759 -25851 27015 -4752
167 -4752 20710 63475 4787 -17249 12103 -37434 -57566 2576 1588 -6775 48441 41934 1012
180 1012 17908 -1390 -47967 -24579 -10911 -26620 13986 37913 10088 22378 23973 -26352
192 -26352 -27382 -7482 -32521 -15850 29853 16984 14789 40296 8210 -23286 -7921 -23150
204 -23150 -37792 -1953 9896 3465 30193 28529 -3514 -336 -5973 -33900 -19042 2067 -5441
217 -5441 14026 34743 13377 5522 8049 -19629 -28715 -10768 -14822 -8493 21315 19757 9614
230I614J0025j5428k4673P627J231p531K0553J4559m538P598k167k2423m227n58
244a0338j4533R528K0405j463O622J4555j2418j4253P18j0642q477J1652O393
257b251M051J4357O33j0071k93q893j5858L803O446j113J1854J3214l092j663
271A1124j961j2732p281R87l717N843J3185K393J464N196p832j2328j508l272
285a0439m415Q123R288L550O028J808p776n448n755p804J651N612K833P107P952
300A2315k653m521k398p847o574K071K690M145Q169M537L67j015o422p720k686
315g542j710j091O857P773K113J660J069n549o925l799j767J022M208N546N404
330G269K895k301l646m073n852m077J884L626L770M803L809k50l238m134n170
$$ plain form
230 9614 19639 4211 -20462 -12835 -11604 -19135 1418 15977 11439 19037 16870 -5553 -9780 -10338
244 -10338 -24871 -15343 5062 3599 10221 24776 12358 -1895 -1177 -11819 -20296 -8644 -2251
257 -2251 1800 16157 16790 6719 6426 -2467 -18325 -14522 -8076 -9189 2665 15879 12787 11124
271 11124 9163 -3569 -10850 -9863 -13580 -7737 5448 7841 9305 14501 6669 -5659 -7167 -10439
285 -10439 -14854 -6731 2557 6107 12135 13943 6167 719 -5036 -12840 -11189 -5577 -2744 4363 12315
300 12315 9662 5141 2743 -5104 -11678 -9607 -6917 -2772 5397 9934 10301 9286 2864 -4856 -7542
315 -7542 -9252 -10343 -3486 4287 6400 8060 9129 3580 -3345 -7144 -8911 -7889 -3681 1865 7269
330 7269 10164 7863 4217 144 -5708 -9785 -7901 -4275 -505 4298 8107 7857 4619 485 -4685
345d685k416p7J910M724N644K512o97j216l948n843l565J15J868L242M920M095
361F583J147k221l528l680l917k137J804M335M033K861J808o98l562m707l491
376e370j592O07K706M154M282J813m35k372l987m168j967M52K394L554L645K477
392F193l95k146l434m026k409j11J939L376M145K687M03j442l205l829l004k65
408e523J474K700L442L412M50j963k237l341l314j122J216K660L590L107J289
423E840q85k470l257l002j661O63K223L252K507J856j97k295l302k650k104k79
439e761K733L368K630K062P34k615l151k360k075o28J718K645L010K475L8j475
455C348k635l136k048m18J338K818L232J899R5p3l033l716j555k74j38K321L936
$$ plain form
345 -4685 -7101 -7178 -5268 -544 5100 7612 6915 5699 1751 -4092 -7657 -7542 -5674 -2432 2488 6583
361 6583 7730 5509 1981 -1699 -5616 -7753 -5949 -1614 2419 5280 7088 6390 2828 -1879 -5370
376 -5370 -6962 -6355 -3649 505 4787 6600 6165 3793 -194 -4362 -6329 -5877 -3483 71 3716 6193
392 6193 5798 3652 218 -3808 -6217 -6328 -4389 -1013 3132 5819 6222 4780 1575 -2254 -5258 -5523
408 -5523 -4049 -1349 2093 5505 5955 3992 1755 -1586 -4900 -6022 -4806 -2146 1444 4551 5840
423 5840 4955 2485 -772 -3774 -5435 -4772 -2549 703 3210 5066 4869 2574 -728 -3378 -5482 -5761
439 -5761 -3028 340 2970 5032 5766 3151 0 -2360 -4435 -5063 -3345 -700 2310 4785 4823 3348
455 3348 713 -2423 -4471 -4889 -3551 -733 2499 4398 4493 4420 1387 -2329 -3884 -4158 -4296 -1975 1961
472A961J418O04L12k412l363k195j014Q61K532K345J989K222r14k852j825k339
488b670k122P98K011J956K773J549p60q57k274l765o93J028K77K043M055N58o83
505C224q4k813l128r08n63P03L755J952M92J948q37l971j602p60j959R55L582
522a4J340J744J480j700k225j515k973o38K281Q47J691L595j61j449l68k251l617
539c933P07R48j09L402K483j040O97o38l564k427N20o21J296L677O36R55J345
556D334k640k665j74k194j002L281J386M45K775M61l182p35j116l179J309K096
572h00k63K340K988j854o98J2l231k024J315m44J237L483Q26r69J316k232l641
589b639R36n12j645L125K703m67J366J320l947j224k30k256N24K948J3J419K545
$$ plain form
472 1961 3379 3983 4295 1883 -1480 -3675 -4689 -3828 -1296 1049 3038 5260 4346 1494 -331 -2670
488 -2670 -4792 -3994 -1983 -27 2746 4295 3535 2678 404 -3361 -4054 -3026 -2749 -706 3349 3907 3224
505 3224 3140 327 -2801 -3709 -4272 -3569 186 2138 2630 4578 3741 -230 -1832 -2592 -4551 -3596 -14
522 -14 1326 3070 4550 2850 625 -890 -3863 -4501 -2220 -1373 318 3913 3752 2303 1935 -316 -3933
539 -3933 -3226 -2278 -2387 1015 3498 2458 3155 2517 -1047 -3474 -2954 -3575 -2279 1398 2034 2989 4334
556 4334 1694 -971 -1145 -3339 -4341 -1060 326 771 3546 4007 825 90 -1026 -4205 -2896 -800
572 -800 -1063 1277 4265 2411 1713 1725 -1506 -3530 -2215 -2659 -1422 2061 2887 1918 3234 1002 -2639
589 -2639 -1703 -2215 -3860 -735 1968 1501 2867 4187 240 -984 -1214 -3470 -2946 2 15 1434 3979
606C979k036j591P9k544j797K400P08j3L177J440k519O81j431l607M89J258j145
623b472K092L027o75J09N18k937j908O26j306L84L244P25k82K352j757k748N71
640d37j162k030K373J381l80K330J601k960m22r4k903k78K085oJ046K664q79p70
658A159O37k417j910J038o15l8L332P52j036J349o05l101O7M82j819J512K428
675A215m51O67J463k190j550M18j553q91K735K5M11K299n10j699K07j063k357
692b824J428L80k88K452J158j364L91l16k422l81Q03p81R05K232k49o4Q12j620
710B52j496L85j015l00K032P48l28J732j43j873j17k13j627L03J468q9J020J735
728B474j386l96m7j762n76R66o8O0K306j30q64M24o03k096O43J94p48J718J225
$$ plain form
606 3979 1943 352 431 -2113 -3910 -1510 -802 -815 2362 3802 1283 1964 533 -3074 -2585 -1327 -2472
623 -2472 -380 2647 1972 2081 2599 -338 -2246 -1620 -2926 -2542 702 1427 1145 3497 1740 -1008 -437
640 -437 -1599 -3629 -1256 125 -255 2075 3676 716 294 200 -2703 -2981 -896 -902 144 2808 1929 1159
658 1159 1796 -621 -2531 -1493 -2108 -2146 1186 1938 902 2251 1646 -1455 -1388 -906 -2725 -1213 1215
675 1215 764 1431 2894 704 -846 -428 -1981 -2872 -137 -112 299 2598 2088 389 596 -467 -2824
692 -2824 -1396 -1016 -1304 1148 2306 942 1333 1017 -1405 -1786 -983 -1764 -859 1373 1124 1060 1872 252
710 252 -1244 -859 -1874 -2174 -142 606 278 2010 1867 -6 -123 -336 -1963 -1660 -192 -281 739 2474
728 2474 1088 692 645 -1117 -1693 -727 -795 -735 1571 1441 577 1001 398 -1698 -1055 -861 -1609 109 1334
747A334r16J034K25k021o08N19j080K21J502L93K67P56m79j125o5j296k97J183
765d53J40J30J584J59r65J69o68j614O2J072n94J112R87l89o7L79j513j001N94
784h76l1J53J242M77K22p5k36j315k90m48m03J089P69k87J053N48j156k64m78
803c06p79k49Q29L4J005Q74l77m94j39o35j004L67L3L19J029N06O6N2n84j359
823h12%j88k50Q45J066k7K73J66r97l47q9p43J40O18L69L73R30m98p25r2m44p50
845a182L13M07N20N54N35n58j00k34j110k13M58J24J64Q53L61J22j68o68r26J95
865e53l91j27J004O67M44K4k83q07l08n06j54M20L07L38R00L01n10n51m30p16
885i31j70K78O18L30P58L08p27k9n09q94j22P9L98P47M57L49l10j82n30n53o8
$$ plain form
747 1334 418 1452 1677 -344 -952 -433 -1513 -1292 210 603 870 1626 1147 22 -43 -1339 -1636 -453
765 -453 -313 -183 1401 1560 595 764 96 -1518 -1456 -384 -978 134 1121 732 665 1044 -469 -1470 -876
784 -876 -907 -754 488 965 1187 1112 876 -439 -729 -1177 -1580 -491 278 -9 1044 1592 436 172 -306
803 -306 -1085 -1334 -505 -471 534 1408 1031 537 398 -237 -1241 -874 -841 -522 507 1013 1079 1131 547 -812
823 -812 -812 -1000 -1250 -405 661 634 907 1073 76 -271 -360 -1103 -963 -345 24 397 1327 829 104 12 -432 -1182
845 -1182 -869 -462 58 612 1147 589 489 255 -855 -1068 -610 -486 -322 531 892 1014 846 178 -748 -553
865 -553 -944 -1071 -67 600 1044 1068 785 -22 -330 -836 -990 -570 -263 75 975 1276 766 215 -215 -931
885 -931 -1101 -823 -205 125 883 1191 464 435 -74 -968 -1090 -1011 -613 134 591 940 630 448 -82 -635 -703
906g03R8J61N68N70J76r3k73o00q13j27j07N07N06N35N62j01n17k82n31m17q6
927i67K42O46O01N73m07k13l15m02l83l41J59P14L94M32J71j82p61l52m35K27
947e99L2L21L03O63K85o10r7n69l16n86M23N18L85L59L77k75Mo73n66m33K01M83
969c70N25L45K16P5m89l09o17n52O79L03qO17K00P5j32p01m46l66N47j89M91O58
991E52J00K65l69m53l40o84M05J26J30M78O95j04m61j26p20J21m2Q7L18K45L92
1012F15r9M8l51m06m17k25M27K60M03L78M6m09o0n56m82J82L2M50M48K22q9j07
1034C10j43k98l78L3k0M47K38M02k32p0J0l38n57O8j34L74N31K98j8J3j92m07
1056f3l43l30M20q0M95M20k92M27k60m53j38m4k13O02k50L40J87o3R0j81k15n78
$$ plain form
906 -703 -605 -444 124 694 870 777 504 -96 -909 -1036 -1143 -636 -130 405 967 866 349 67 -464 -881 -967
927 -967 -725 -79 522 1095 688 475 160 -242 -625 -966 -807 -93 301 733 904 722 -39 -391 -826 -599
947 -599 -567 -246 57 720 1005 395 298 -271 -587 -1173 -750 -232 153 512 889 614 618 -55 -621 -1054 -853 -370
969 -370 155 500 716 791 302 -7 -624 -1176 -497 -194 -202 415 615 690 558 -143 -589 -955 -408 -597 -106 552
991 552 652 917 548 95 -245 -929 -524 -398 -268 210 905 801 340 214 -506 -385 -427 -340 -22 223 615
1012 615 516 564 213 -193 -610 -835 -408 -148 255 633 679 270 210 -346 -828 -646 -614 -164 284 506 417 310
1034 310 167 -131 -509 -476 -496 -49 189 591 359 289 299 -39 -596 -528 -662 -288 243 541 523 536 344 -63
1056 -63 -406 -736 -316 -396 99 519 227 654 394 -59 -197 -241 -454 148 -102 238 425 362 452 271 56 -522
1078e22R7L0L36L99J78j27p0m27J07n95QK72K58RO46j17R0k04n08k43k15O2N31
1101eJ28L70k34K89m26m43Lq1l2K03K99M59P6Q8n02j04n34R2j7K70J98K23K01
1124E21j06Kl51m01J49k23R6K40J90K61J72q8n46J29l18r9K00J18P2M61k20J91
1146D50k79l25j59J01l8j1O51J87m26L8kj54k86J01l10M59J43j48N02k45j27m36
1168c14J04j0MK34J12O9K21j73J16p03K11k11J91J5K62J23j33L42k09q9l95O6
1190a67PL1mL45l1j27L26n17k06J31k51L43j39N09j01k02L02k82P8j44n3J40l39
1213c51K36J76K76l21J54k41j17n0l39O53J35O6L2l0P1l07j09M1k42L36Q5K03
1235C57K5j25j59M8k71r6k5J52K48P0k07J1r1L56k94m56K06m5k3L28K29j78J49
$$ plain form
1078 -522 -425 -395 -59 340 518 391 321 -106 1 -594 -586 -314 -56 -47 599 482 572 368 -140 -383 -598 -536 -5
1101 -5 123 493 259 548 122 -321 -318 -399 -431 -228 71 530 606 694 192 88 -446 -354 -371 -101 97 320 521
1124 521 415 417 66 -335 -186 -409 -313 -73 117 378 550 462 -84 45 -273 -372 -172 -54 18 479 259 450
1146 450 171 -154 -313 -212 -250 -261 390 577 151 189 187 33 -253 -152 -462 -3 140 -8 494 249 122 -314
1168 -314 -210 -220 -216 18 130 199 420 247 363 -340 -129 -340 -149 -134 128 251 118 460 251 162 -233 -167
1190 -167 -160 -129 -133 212 181 54 380 -137 -343 -212 -463 -120 -259 250 149 -53 249 -33 45 -99 -152 -12 -351
1213 -351 -115 61 337 16 170 -71 -188 -238 -577 76 211 277 309 279 350 43 -66 -25 -267 69 154 357
1235 357 382 257 98 146 -125 -221 -246 -94 154 224 17 28 -63 293 -1 -457 -251 -296 -319 9 238 60 209
1258B09L5j79q1k64R4Jr8O45k95R7J50k26m30L94k38OJ30P6K60Nn17N69m16J09
1282C6k28j36M54j76M43j89J80l77j44J1q8N5o4L52J10qj10J86m37J1j30J16%
1305a33K37j64p3K95j57J32k96k0QR1J65n1l3R2N3j78l52K17n8p6L15J94n4R3
1329B47l7j38j42k92J15N2j63K78K43N5K10n05j67J96l8k69L35j5K46K4j2j53
1351G0qk66J64N4k82J13K94O0L1J8k05j90m15K46K45J63p2P9k48J97J32k82n4
1374a56k62K26J52J62o3N1J79m37K07k62N1P5R5J34K52j23k5m33L76n40J27L97
1396A83m94J61J80l1J51j66J0q8j7J44k29J63K29l11L57k19q9j75m6j23M18K96
1418C04j65M9j20N2n26K78m10M42MP8P2J96N0%k76J3p7j49N5L21j31L44K9l72
$$ plain form
1258 209 244 65 -16 -280 -186 -185 -283 362 67 164 314 88 -342 52 -186 -180 -50 26 286 291 -226 343 -73 36
1282 36 -192 -328 126 -50 393 204 384 7 -137 -126 -214 -159 -223 129 239 231 121 307 -130 -119 -249 -133 -133
1305 -133 104 -60 -133 162 5 137 -159 -179 -171 -80 85 34 1 93 146 -32 -384 -167 -225 -301 14 208 154 247
1329 247 210 72 -70 -362 -247 -195 -358 -80 163 218 428 -77 -244 -48 -86 -355 -20 -35 211 235 223 70
1351 70 62 -204 -40 14 -268 -155 139 199 230 248 43 -147 -562 -316 -71 92 20 99 -149 48 180 -102 -156
1374 -156 -418 -192 -40 122 59 110 289 -148 59 -203 -152 -77 18 152 404 281 256 -177 199 -341 -214 183
1396 183 -311 -150 30 -1 150 -16 -6 -94 -111 33 -196 -33 196 -115 242 23 -66 -241 -287 -410 8 304
1418 304 139 188 68 120 -406 -128 -538 -96 -92 -14 58 254 304 304 28 41 -36 -185 -130 191 60 404 433 61
1442F1J95j81k53N7l8J49J25j33K98m2n96K91j58l3K18q8K01N0J30j1J07l38l2
1465b1j32n23M69J14L28K9J6l46m07Q6L87j80L42L2l3p0L6J22j30l94K97k70L57
1488A09J5O7J05j06k04o8o7j20j30O93k50j27K69m85K71j8o9J52l22J42j5K15
1510E7R0J23k6j91j76r5q7R3J65J86j4M1o7Q8m47J64l37K21J89R4J63j91j11J64
1534I6m4l61K64k16L41Q1J14j08j84R5j77Plm0K8J25P6O8K8j87j24o5mq8N2K83
1560E7k26L93k7j46j11j05J39j51L41j71m9L54J5q8j44k33j28K54n8J97j49K48
1582B12m5k5Mm80R6J18M01l13L0J91j50k0M1j68j43K9O1n0L57k61M73o50L20J46
1606A74l17K0K9J04Q4J66k49J15l17L1J63q3MO1nM9R9p5O0K9k99J49o0M4k19K46
$$ plain form
1442 61 256 75 -178 -121 -159 -10 115 -18 280 238 -358 -67 -225 -258 -40 -128 73 123 253 242 349 11 -21
1465 -21 -153 -676 -207 -93 235 264 280 -66 -473 -387 0 -180 162 194 161 91 127 249 119 -275 22 -248 109
1488 109 124 191 296 190 -14 -82 -149 -269 -399 294 44 -83 186 -299 -28 -46 -115 37 -285 -143 -158 57
1510 57 147 270 244 53 -123 -218 -305 -212 -47 139 125 166 99 187 -260 -96 -433 -212 -23 71 234 43 -68 96
1534 96 52 -309 -45 -261 80 161 275 167 -17 78 -99 -92 -95 -135 -107 18 94 162 190 3 -121 -186 -190 -278 -226 57
1560 57 -169 224 197 51 -60 -165 -26 -177 164 -7 -56 298 313 225 81 -152 -280 -26 -84 113 -36 212
1582 212 167 142 146 -334 -238 -120 281 -32 -2 189 39 19 60 -108 -251 -222 -161 -211 146 -115 358 -292 28 174
1606 174 -143 -123 -94 10 94 260 11 126 -191 -160 3 -80 -76 -15 -20 29 128 53 113 142 -157 -8 -68 -24 -243 3
1632Cj42K94k76K0%J89j21J39P6p9k93M8J33j11P4j12K65l02M49o26L40J61j38
1655ij06j14j7L45%J45j41N5K35n36J90l08K57j37L96k44J34J10j62n2k7k13K80
1678H1l5k2J45j97J47MJ33J5m38K10Q4o9k78J42J26J22k35J74p9r4q5m9J81P7
1702F0j87J16J10j67kL0o2k4J82mK74m32N9j66L18Qrl09R7p9L53j67Q1J5J16l99
1728a88n9l7L6K09j21L69m2j70J04j54J65j06j02L0L0K72r1j16J16K02k65m2j1
1751B9p2L31k11J17j8J80l35P0k23R7j80J71J14k9J78k74K02l98K46j16J32r0
1773g9J48J55l32J29K17l10j31l4J87O2j30K34O8J12j29l38J24j84k9l8L97P1
1795A70k4l4p9J0l16K00J43l9j87L58L1j87P3j89J53l14K35m09N07j36o6L09q2
$$ plain form
1632 3 -139 155 -121 -101 -101 88 -33 106 182 103 -190 -142 -9 -120 -46 -158 107 -195 254 -372 -32 129 -9
1655 -9 -115 -229 -246 99 99 244 103 158 393 -143 47 -261 -4 -141 255 11 145 255 93 41 14 -199 81
1678 81 46 24 169 -28 119 123 256 271 -167 43 127 58 -220 -78 48 170 -65 109 30 -64 -149 -198 -17 60
1702 60 -127 -11 99 -68 -70 -40 -102 -126 56 52 326 -106 -47 -213 105 113 104 -205 -108 -187 166 -1 80 95 211 -188
1728 -188 -247 -284 -248 -39 -160 209 167 -3 101 -53 112 6 -96 -66 -36 236 145 29 145 347 82 40 29
1751 29 -43 288 77 194 176 356 21 91 -132 -35 -215 -44 70 41 219 -55 147 -251 -5 -121 11 -79
1773 -79 69 224 -108 21 238 -72 -203 -237 -50 12 -118 116 184 296 167 -171 -47 -231 -260 -298 99 170
1795 170 146 112 33 43 -273 -73 70 31 -156 202 233 46 119 -70 83 -231 4 -405 102 -34 -100 209 127
1818A27JNj45k09J67K76pk67k8j8M3pl0j73K56j08K26k63P5R8j65J79j18k19k9
1843c33J71K59K22m89M90l63K17j56j68J86q6N4L38k59P7K65k03N8o82O3N3K24
1865f2K30qJ10r5j58j29rJ00r4J53j8J95j53Q7j59m5j64J92K88n30J7L82m3K00
1889B87k60j51L07k29l02L02j76J90M1J72n7M8p8n5k08K18j14rJ82j7j07j98L75
1912A61k91j11J41j25K73nk5K44J25o27J73M4k67K99j00J22j74K69j38M02l92
1933bk24N5J07K44m5M06m76N9j23Qj36k01J00L13l8q2L34l9l89K33j70k20J95
1956i1J67K2%P4k14o9o4J22N8QKk20l0L47K07k67j18l41K00N1Q8O1l3P3m3Q9L8
1983A17l54K91j3j8L70k60J10m01R8k6J02O8q4n9K76J7Q2m41K6k25K32r9oK17
$$ plain form
1818 127 128 133 -12 -221 -54 222 215 -52 -80 -98 -55 -62 -92 -265 -9 -117 109 -154 -79 19 -146 33 -85 -304 -333
1843 -333 -162 97 319 -170 320 -43 174 18 -150 36 -50 4 342 83 160 425 222 280 -402 -339 -286 -62
1865 -62 168 160 270 175 17 -112 -121 -21 -115 38 20 215 62 149 -10 -55 -219 -27 261 -269 -252 130 87 287
1889 287 27 -124 183 -46 -348 -46 -222 -32 9 181 124 172 94 39 -169 49 -65 -74 108 91 -16 -214 161
1912 161 -130 -241 -100 -225 48 43 18 262 387 -240 -67 -23 -290 9 -91 31 -143 126 -12 390 -2
1933 -2 -226 -171 -64 180 135 541 65 124 1 9 -127 -328 -228 85 47 -35 299 260 -129 104 -66 -286 -91
1956 -91 76 98 98 172 -42 -111 -175 -53 5 13 15 -205 -235 112 319 52 -66 -407 -207 -156 -68 -7 -40 33 -10 79 117
1983 117 -237 54 41 23 393 133 243 -158 -60 -86 16 84 0 -59 217 234 316 -125 -99 -324 -92 -191 -197 20
2007B0l6J22Rj20K94k39K8j33l4nJ09Oj40K62n2j33J68Q6k72j9N6J64J19J0j74
2032I6j54q5J73j32O4J6M4j24K46j67J24k04O2k9j27J3K54N9lk9k07L05k21k05
2056b31p1M0L55oj02J50k6j35N9k25K59K3k43K29oP1o3J59k64Mk00R8M22o7M1
2081B71Q3j98m10L55m27K88j5n1p8L71K19k34j30J23l92K40P4m24K52J35m4n1
2103d3j96J18K9l1J31J58k22J30P5J02m01K73l17J08K62l93R1M05j92Q7j37k8
2125Ik14J88J41m66J85K89PO5nj06N3k10j50J65K25k10NK49J47j43k15l2j30o5
2149b18k27M98Q4k5k01J11K72k46k75K60K16j72j84L53j35p7J14j93m06L16J71
2170C6l6J20j95J10N1m5L52n29k05P0j8L12J58qk29LJ19k31J81N6jQ5J67j59k4
$$ plain form
2007 20 -16 106 115 -5 289 50 78 -55 -89 -94 15 21 -119 143 91 -42 126 212 -60 -79 -23 141 260 270 96
2032 96 -58 -143 30 -102 -38 -22 22 -102 144 -23 101 -103 -41 -70 -197 -184 70 129 126 97 -110 195 -26 -231
2056 -231 -302 -262 93 87 -15 135 109 -26 33 -192 67 90 -153 76 70 141 78 237 -27 -23 -223 -125 297 230 271
2081 271 354 156 -254 101 -326 -38 -53 -104 -182 189 408 174 44 167 -225 15 89 -335 -83 52 8 -43
2103 -43 -239 -121 -92 -123 8 166 -56 74 149 251 -150 123 -194 -86 176 -217 -126 279 87 174 37 9
2125 9 -205 -17 124 -342 -157 132 139 204 199 93 146 -64 -214 -49 176 -34 -29 220 367 224 9 -23 -153 -218
2149 -218 -445 53 137 112 -89 22 294 48 -227 33 249 77 -107 246 111 34 148 -45 -451 -135 36
2170 36 0 120 -75 35 86 41 393 -136 -341 -271 -289 23 181 173 -56 -53 66 -165 16 72 71 156 323 164 140
2195A40o8j57j93K45L06m09J61l99K63J85k8L09l29L2p7k5O0K20k71N3k67L04
2217E5k76M85l04j36J54K56q7j40L69l79P2l2j68q7L7L83k09K14k00j44j4K70
2239A19l35J91o0M94j33J12l81j43K23q6Nj01K01j33M6J30k76K94k98j99M37j19
2261a2l49J60J26O0K11l38R5l3K79k93n0J65J29j54L5O5j61o7J79j41K99j38N0
2284A17r4k2o7o9K00k78j19L35j72R3Q4K30k90l72N86l74K51l37L35J09q0K22
2306B88k09J34k9j41n5J95k15J53p3j20J95r7J06k74j21J30K06Q7L7J27k20L2
2328A36j64j08J64j21n7J68M4j33J1L45l92j22K66R5j59j68L89k44nJ19O8k17
2350h5kK3l4K45k46o7K65j32N6j85J07j40K20N9j06L04j99m2M4k31L02k38k31
$$ plain form
2195 140 72 -85 -278 -33 273 -136 25 -374 -111 74 46 355 26 58 -19 -44 16 236 -35 18 -249 55
2217 55 -221 264 -40 -176 -22 234 147 7 376 -3 69 37 -131 -218 -181 202 -7 207 7 -137 -151 119
2239 119 -216 -25 -85 409 276 388 7 -136 87 1 6 -95 106 -27 19 149 -127 167 -131 -330 107 -12
2261 -12 -361 -201 -75 -15 196 -142 -47 -80 199 -94 -144 21 150 -4 31 96 -65 -132 47 -94 205 67 117
2284 117 23 1 -66 -135 65 -213 -332 3 -169 -76 8 238 -52 -424 162 -212 39 -298 37 146 66 288
2306 288 79 213 184 43 -12 183 -32 121 48 -72 123 26 132 -142 -263 -133 73 160 197 324 104 136
2328 136 -28 -136 28 -93 -150 18 62 -71 -60 285 -107 -229 37 132 -27 -195 194 -50 -55 64 132 -85
2350 -85 -87 -64 -98 147 -99 -166 99 -33 23 -162 -55 -195 25 84 -22 282 83 41 85 -146 156 -82 -313
2373c13K52m6J29M4P3j30Q7j9k03P9k1j48L45o9L7p8j72K40j20r5J42j31M37k22
2397I8P7j40m32M57k44k13M11k07L7M96l24J2j11k10J88j35R9J11J81j79k85M17
2419A04p5m8p0k55N36l26K5M64m42J48m4p4M9n5j77M45p7l38L20q3P2k64J98j27
2443i4J38K04j56j37M6j1jj3L8L7o1Q3K55k94K44k03j21J32Jj55Q2L0j91L47k05
2468eJ58j17q9J03j51l0K73j42J11J88l23K1J17j30n2m1K81l40J60j13K30P5j31
2491E3j83n7M9J50k2j12J00J97K1j18Q7k70k2K2M3m9K0P3K10Jj94kk12o6K64j04
2517a21K05o5k9l5Q7n8o5L0j79J91k49L62M3Rl22M6k2J50L70j77m2q1j43l4K5
2542a04N2j42J01k88N66l33K38j01o9P6Mj69K03k07M43n3j41m4J09j07k27J72
$$ plain form
2373 -313 -61 -107 22 66 139 9 96 77 -126 -47 -68 -216 129 60 97 19 -153 87 -33 -128 14 -117 320 98
2397 98 175 35 -397 60 -184 -397 14 -193 -156 340 16 28 -83 -293 -105 -240 -141 -30 151 -28 -313 104
2419 104 29 -19 -89 -344 192 -134 -109 355 -87 61 17 -57 -8 -63 -240 205 128 -210 110 27 99 -165 33 -94
2443 -94 44 248 92 -45 1 -10 -11 -24 14 51 -10 73 328 34 278 75 -46 86 87 -68 14 44 -147 200 -5
2468 -5 153 36 -53 50 -101 -131 142 0 111 299 -24 -3 114 -16 -68 -109 172 -168 -8 -121 109 184 53
2491 53 -130 -187 -138 12 -10 -122 -22 175 196 78 165 -105 -127 -105 -62 -111 -91 -18 192 193 -1 -3 -215 -281 -17 -121
2517 -121 84 19 -10 -45 42 -16 -81 -51 -230 -39 -288 74 117 126 -196 -150 -172 -22 348 171 129 48 -95 -129 -104
2542 -104 -52 -194 -93 -381 185 -148 90 -11 -80 -4 0 -169 34 -173 270 217 76 32 141 34 -193 -21
2564b1j66N5N6K28j42J58q1M3k62J59k08J29M4N6k3L0j36j7L49k70Q6j58M32l12
2588B9M3J63l32J7J4J68j41J07k10J9J7J52R9k85J65M0j56l69L63lj4j0K44J56
2612B76m35J31L4j72M2J89k0k58L93l8j92O0k4j78M40m02J25J2r5J83K08j51k0
2635A08k01J09J79O3l66j34j06J96N3K89j23m2j28K79j14M9j55p8M29l84K32m97
2657c42L84k6J51Ml4k01J9J44k48K41l5N3j10N1J70l06K25l99J28l59O13l19K07
2680A1J26j50Q8k61K05Q7l17K14k04L4L87k68K66K6j26j00rr0k0J29k65K00Q8
2703E1l26L34j43q8J57J38l7j24Q0J75j92l03J48m3k9q0L57J67Q4l62J11Kk07
2726a30kj6k1J40N8o5L90m47J37k29J32Q0P6j81L39l92K21m56N12m31L59j03k14
$$ plain form
2564 -21 -187 -132 -76 152 10 168 87 130 -132 27 -181 -52 -8 48 25 55 -81 -98 251 -19 67 -91 341 29
2588 29 72 235 -97 -80 -66 102 -39 68 -142 -123 -106 46 145 -140 25 65 -91 -460 -97 -100 -114 -124 120 276
2612 276 -159 -28 6 -166 -124 65 45 -213 180 142 -50 10 -14 -192 248 -154 -29 -17 -112 71 279 128 108
2635 108 -93 16 195 258 -108 -242 -348 -152 -99 190 67 25 -103 176 62 111 -44 -122 307 -77 155 -342
2657 -342 42 16 167 171 137 -64 -45 99 -149 92 57 110 0 51 221 -85 140 -259 -131 -490 123 -196 11
2680 11 137 -13 75 -186 19 106 -211 3 -201 -167 220 -48 218 244 118 18 9 -81 -101 28 -237 -37 51
2703 51 -275 59 -84 -172 -15 123 86 -38 42 217 25 -278 -130 -173 -202 -282 75 242 326 -36 75 77 -130
2726 -130 -132 -148 -169 -29 29 -36 354 -93 44 -185 -53 27 103 -78 261 -131 90 -366 146 -285 74 -29 -243
2749b43J31K28J61k62J28j61J93m47L14m5O3j46J58l8K7J60j68k73J40K23j86
2770d3o4J00k0k29K94O3m0j23J4K90j3k40J64J20j45Pk96J93k37J13J08l53N32
2793A95l95J63k5k27K36J62j71J06N7j52Q6j72K01N8k60J54j6k41N54l01J92o9
2815A35l9j13k40K76k84J19J43J65l89J36P1r0M06m16k9N13l11K36l09L68k18
2836A30O3j90m1j66J36J14J7o6K02k40j69J08J28K60m11J42LJ33j14O0k17j35
2858b53M84J8m66K78j10r%K2P3j54J12l00K23J74k70L54j16k55K76j60j71J89
2880f1mJ50q2k27L24J96j18j06o7j24O6k4J51j69O1L53m36j62L32k34o4Q6J81
2903B2J08j65p8J57K28j21j99K90l03l0j35J93N0J94J8l69J1J64P0N0m72K52J21
$$ plain form
2749 -243 -112 116 277 15 143 -18 175 -272 42 -3 60 -86 72 34 61 221 53 -220 -80 143 -43
2770 -43 -107 -7 -27 -256 38 101 61 -62 -48 242 229 -11 153 273 128 135 -161 32 -205 -92 16 -337 195
2793 195 -200 -37 -62 -289 -53 109 -62 44 101 -51 35 -137 64 122 -138 16 0 -241 313 12 204 135
2815 135 96 -17 -257 19 -265 -146 -3 162 -227 -91 -20 -110 296 -120 -149 364 53 289 -20 348 130
2836 130 193 3 -38 -204 -68 46 63 -3 199 -41 -210 -102 26 286 -125 17 20 153 39 99 -118 -253
2858 -253 231 249 -217 61 -49 -58 -58 -36 37 -117 -5 -305 -82 92 -178 176 60 -195 81 -79 -250 -61
2880 -61 -65 85 3 -224 100 296 178 72 5 -119 -53 -77 74 -95 -34 319 -117 -279 53 -181 -245 -159 22
2903 22 130 -35 -113 44 272 151 -48 242 -61 -91 -226 -33 17 211 229 -140 -129 35 105 155 -317 -65 56
2926E6J3j10k00K56j47N1j36K08q1J13n55N04J3K84o4l65L53j52Q8j83K84k42
2948a2J70q4j63K9L55l09k44K31J1j64J70k6n5M05p1k55J01J84j65j88j83L05
2970D2j09K18L0l52O36k57l1l52M88n19L96k32n2K35k54L7J16k36K36J25j62k01
2992a98Q4j36L62J96m02QQ9o4j05J84j6L8j75q6L65j89r9J66k4Q1J24k01K2J13
3016A37k82P6o6K63j89m4k14K41r6K66J03l16P5P1p8j70M75j18k53O7K26pk19
3039e2J28j67M73m90r6K24L6J5m72L46j01J41k30J63J90J9j81J61k6k98L0p7O0
3062b04J07K44k53j76K51J76j91j23R5O2j2O3k6o5P3O9j17J53j23k7j67K75j21
3085c7O0P4j47K99rp1l23J41J28j54j20J36j4K53j23j55nr9N24l92J8J32M11q92
$$ plain form
2926 56 69 -41 -241 15 -132 -81 -217 -9 -90 23 -532 -28 -15 269 205 -160 193 41 129 -54 230 -12
2948 -12 158 74 -89 -60 295 -14 -258 -27 -16 -180 -10 -36 -91 314 243 -12 89 273 108 -80 -263 42
2970 42 -67 151 181 -171 465 208 177 -175 313 -206 190 -42 -94 141 -113 -76 40 -196 40 165 3 -198
2992 -198 -114 -250 112 308 -94 -86 3 -61 -166 18 2 40 -135 -221 144 -45 -144 22 -2 79 203 2 24 137
3016 137 -145 -69 -135 128 -61 -105 -319 -78 -174 92 195 -121 -46 25 -53 -223 252 134 -119 -52 174 167 -52
3039 -52 76 -91 382 -108 -204 20 56 71 -401 -55 -156 -15 -245 -82 108 127 -54 107 81 -217 -187 -264 -204
3062 -204 -97 147 -106 -282 -31 145 -46 -169 -74 -12 -24 39 13 -52 21 90 -27 126 3 -24 -191 84 -37
3085 -37 23 97 -50 249 240 169 -154 -13 115 -39 -159 -23 -37 216 93 -62 -67 -166 358 -34 -16 116 527 -365
3109c65J79N7O9J69n3j9l16J74J94k08J13K28k13N9j39m6J07K8N0lj87J28RQ1
3133I6j55M4j0L59k92J12r9l4j52K12k23J39j05K94k10K83k72l67N97l55m1%K65
3156H6j50J03k85J01k5K53j88K79qK7j61j60J03J9J35k04J26P9m60M26K59m43
3178h8J93K93j62j06l55K60k46L66j7j15k38K03j29m9M3R3n7j64K15J65q0k07
3200a82M38j85k03Q2k3J60m54L64m4p2J11K3R9o7j34q7QJ63Kj85K65k66M22j77
3224E8k41J29L5J68k51q1K13O6k9J5J77j20l23q5K12k2NK40j21j88j33K97K28
3247B49l54K23j65J95j90j68K56k29L25k38M8k2K31j3k61J77l31J65n5O2nr6M5
3270a51R2Q4K28k09j37J36j19n7J20j33K77k49K2jK28Pj74m2J64k51L37n4L6j69
$$ plain form
3109 -365 -186 -129 -60 109 56 37 -279 -105 89 -119 -6 222 9 68 -71 -117 -10 18 68 65 -122 6 15 96
3133 96 -59 -15 -25 334 42 154 55 21 -131 81 -142 -3 -108 186 -24 259 -13 -380 217 -138 -179 -179 86
3156 86 -64 39 -246 -145 -170 83 -105 174 166 193 32 -128 -25 -6 129 -75 51 130 -330 96 355 -88
3178 -88 105 398 236 130 -225 35 -211 155 138 23 -215 -12 -141 -190 -147 -54 -111 -275 -60 105 25 -182
3200 -182 256 71 -132 -50 -73 87 -367 -3 -47 -119 -8 15 114 47 -87 -174 -166 -3 -1 -186 79 -187 235 58
3224 58 -183 -54 -19 149 -102 -183 30 96 67 82 259 139 -184 -269 -57 -79 -74 166 45 -143 -276 21 249
3247 249 -105 118 -47 148 -42 -210 46 -183 142 -96 -48 -70 161 148 -113 64 -267 -102 -157 -95 -100 -196 -151
3270 -151 -59 25 253 44 -93 43 -76 -133 -13 -146 131 -118 -96 -97 131 138 -36 -78 86 -165 172 118 154 -15
3294a5j92L70L6k38Q9j42J87J42p2M7l43q1L34m83M80J86q2j25K2l18J09K3k69
3317c35K11L6N6q1J42j35R0J92k89m6K45n20J90K26K0J52N1k96L13k28J38k23
3339i1p9L09j05K09j9l42q8N28m74J46R0m7N2k19L00k30R6o6n7l8J59j18K30j88
3363d2N4K9j93K93k21L19j13m27K80M1J94m3K31l00q2o8P2L33l54j22J64qJ00
3386A37J19l21J02P5k41Q3J2K12k21%q3L9K7J6p3Q0N9Q6q7j18J94N9j19j89L48
3411A96k50j12L94j90K80m62K75k05J57j31J46J25J19k19j09L40l15r1K74m03
3431a81J66nL5j22j1K74j45K0p4J03k3j08J97j41l9n1O9N1k64J19k5L71k38o4
3455h6K21k41K56j45j77L39Qj47m5J50K17k94j27K7q7k0J80J70m8q8k8k39K06
$$ plain form
3294 -15 -207 163 199 -39 50 -92 95 237 165 212 -131 -212 122 -361 119 305 223 98 120 -198 -89 -66 -335
3317 -335 -124 -88 -32 -113 29 -106 -16 176 -113 -159 86 -434 -244 -18 2 154 205 -91 222 -6 132 -91
3339 -91 -170 139 34 243 224 -118 -206 322 -152 -6 84 37 89 -130 170 -60 36 -30 -87 -125 34 -84 146 -42
3363 -42 12 41 -152 141 -80 239 126 -301 -21 20 214 171 402 102 20 -48 24 357 3 -119 45 37 137
3386 137 256 -65 37 112 -129 -46 -34 178 -43 -43 -126 -87 -60 -44 -117 -37 22 108 21 -97 97 156 37 -152 196
3411 196 -54 -166 228 38 318 -144 131 -74 83 -48 98 223 342 123 14 354 39 -52 222 -181
3431 -181 -15 -20 15 -107 -118 156 11 31 -43 60 37 -71 126 -15 -54 -105 -36 15 -249 -130 -155 216 -22 -86
3455 -86 135 -106 150 5 -172 167 175 28 -17 133 350 56 -71 -44 -131 -151 29 199 151 63 35 -204 2
3478BJ41m10m4K56j54L32J35n9k09k49J73Oj81J91j13M12k10K07p0L9k07k13K15
3501a0m9Rm7L21j20m38M33R7l07J22j48J04n1K02n8o4j8j32j48M41j63j33J82
3524B5n4p6l9J50m9o2K8p5J25l8p3K86l47K17j5j37L02k62N7p8M8J08j41k14L78
3549F4j62K3J09k10L35j46OQ1P2m72L15J8N4r7k18k3R2K59l62L23k51L27q2J93
3573B48j12J22j22q9j3J71Pj91j47J28J96j06J38j89q8L8KJ59k88L79j43J47l74
3596a27J57j34O6P1k9M9P0J14j29rJ21j59lq7o1r5J5J7PN3NJ88L3N6k95K47m02
3623b61L33l0k70J18k0n0L06j62J87k8k75K04j24J54l0m9K89m37j85N79p4k88
3645a13Q3j73L18m6k23K59j75J87n9k03j05O2J82K44l79j6J92J68k47J26k10J65
$$ plain form
3478 2 143 -267 -311 -55 -209 123 258 199 -10 -259 -86 -80 -261 -70 -183 229 19 226 156 195 -12 -225 -10
3501 -10 -59 -50 -97 224 104 -334 99 196 -111 11 -137 -33 -84 118 60 -4 -22 -154 -302 139 -24 -157 25
3524 25 -29 -105 -144 6 -43 -105 -77 -152 -27 -65 -138 148 -199 18 3 -134 168 -94 -37 -115 -67 41 -100 -314 64
3549 64 -98 -75 34 -176 159 13 19 100 172 -300 15 33 87 -10 -228 -251 -159 100 -262 61 -190 137 55 248
3573 248 136 258 136 47 34 205 212 21 -126 2 198 92 230 41 -47 -9 -7 152 -136 243 100 247 -127
3596 -127 30 -104 -38 33 4 53 123 237 108 99 220 61 58 -29 -90 -185 -170 -153 -146 -93 -88 100 133 189 -106 141 -261
3623 -261 72 42 -228 -110 -130 -180 126 -36 151 123 -152 52 -72 82 52 3 292 -145 -330 249 175 -113
3645 -113 -30 -203 115 69 -154 105 -70 117 58 -145 -250 -188 -6 238 -141 -157 35 203 -44 82 -128 37
3667C7rm7K21l06K36j87l7l5L58p9l18K02k18N3K20k21K3r2L52m14J97P5Q8n9
3691D0k56J0j88J35M67k86K59N8k36kJ59j82K39k35l4K36j74J70j29k13J00J73
3713A11%j49J82j25R6o1j82K40k06J16k9n1j07M87k89j40K62k59Q5p1O4k4Q5j90
3737a55J52p0P7j07o8J61j97m5L73l30J35n7N4J16M8j06J08J57n50L25k1k9J2
3760a7k42J80J8K20j55j81R5M3j26n0J39R0q2P5M1j32j21K89J1K39k58k4Q3r4
3784D1l27j8K83K9O9m2M9M1r8j48k29J19M61l04L54l86j57J65R4K60l71J05j12
3807a22O6J4K8o1J93j12j07R2K8J06r5r5l8LJ69k90J53q8P2k87N38n56N04k11
3831i6P5n4lj2mj14J48R0K63k41k2N9j68K8j88J82l1J91j43L22k66Q9k69J7J79
$$ plain form
3667 37 28 -19 202 -104 132 -55 -92 -127 231 152 -166 36 -182 -129 91 -130 -107 -199 153 -261 -64 11 99 40
3691 40 -216 -206 -394 -259 208 -78 181 239 3 1 160 -22 217 -18 -52 184 10 180 51 -162 -62 111
3713 111 111 -38 144 19 115 54 -128 112 -94 22 -7 -58 -165 322 33 -107 155 -104 -19 -90 -26 -50 35 -155
3737 -155 -3 -73 4 -103 -171 -10 -207 -252 121 -209 -74 -131 -77 39 87 -19 89 246 -304 21 0 -29 -17
3760 -17 -259 -79 -61 159 4 -177 -82 -39 -165 -215 -76 14 -68 7 48 -84 -205 84 95 334 76 52 135 41
3784 41 -286 -304 -21 8 77 35 84 125 27 -121 -350 -231 230 -74 280 -106 -263 -98 -4 256 -115 -10 -122
3807 -122 -56 -42 -14 -75 118 6 -101 -9 19 125 30 -65 -103 -100 69 -221 -68 -156 -84 -371 167 -389 115 -96
3831 -96 -21 -75 -78 -90 -94 -208 -60 30 293 52 30 89 -79 -51 -239 -57 -88 103 -40 282 16 105 -164 -147 32
3856C2k26J7K98j62J93l31J33l13K68K12l15r9M17K48m16L79m20J3J38Jl8Q0j02
3879GK57j76L0J19p93N45K89k22J47j97j21M41m19M0p4J49j59K82j31j9O3n0J45
3902A53k85J75j25K71l01K58j38J38o9k08L37k64k92M06l28M11j9q9k29O06l46
3923F2j96P0j4J70O9J8k67J16J19j94j66J15J33m5k50Q1K39O8m8J04l11K73k37
3946i1m0L34m04R7L64j29k54K15j59J31k6k07J51p2J5R4j42j19L63j18J58j2q9
3969F0j86N7r0R5J47r8k00L95j14j11J26o8j15k17L35K30j69j09k57K04l9Q6j62
3992b00j5L40k30N6J33j54l6J49j9R8r0l15J17J39j25K02J15j63L8m6p6j40K02
4015b0mPK22k58J51l24K86o9K17k72K07qj32L66o64M44k81J68j0j4J3j62J93L7
$$ plain form
3856 32 -194 -177 121 -41 152 -179 -46 -359 -91 121 -194 -293 124 372 -44 335 -85 -72 66 67 29 109 7
3879 7 264 88 118 237 -556 -11 278 56 203 6 -115 326 -93 -53 -127 22 -137 145 14 -5 58 8 153
3902 153 -132 43 -82 189 -112 146 8 146 77 -131 206 -58 -350 56 -272 139 120 31 -198 408 62
3923 62 -134 -64 -78 92 161 179 -88 28 147 -47 -213 -98 35 -10 -260 -179 60 128 80 184 -127 146 -91
3946 -91 -131 203 -201 -104 260 131 -123 92 -67 64 38 -169 -18 -90 -75 19 -123 -242 121 3 161 149 60
3969 60 -126 -69 -159 -64 83 -15 -215 180 66 -45 81 13 -102 -319 16 246 77 -32 -289 -85 -124 -38 -200
3992 -200 -215 125 -105 -49 84 -70 -106 43 24 122 32 -283 -166 -27 -152 50 165 2 40 -6 -82 -222 -20
4015 -20 -24 -17 205 -53 98 -226 60 -9 208 -64 143 135 3 369 -295 149 -132 36 26 12 25 -137 56 93
4039I3J77L6k15K00j91j26j94K24q9J97r9r4J66l65K39q2mK33k19m3n6M69j95
4062F2p3M7K07n13K08J37j08J30j56j17J59N0K90k39o8J11r0Q7k44J34k5M9j13
4085g5k14M08l49o3K34j04J02J95J97k54j11K84j92j41K01J0j0k16J75j61J12
4106B8K12m11J53o2J43r6M9L03j46k21K08%k76J49j40p9K92j01k16J23L1j14L90
4129B19m38L33k65J24J47J2J59l79k02M49j41p1K03j61j33J37j59mK24J16j36
4150C4k44J70J05k7j22J63R9J48m81O4M35m47j71K48L56l04j06o4J92j88P4J02
4172C6J31l98J24L08k44K53p8j22L5J43j74j03Q0j4j3J26L7j53Q4Q7k43L34l85
4195a49N03n46M22q6k51J70J59k13O2k08K93k47K52rr7q4o5J90n2J65k16j07Q5
$$ plain form
4039 93 270 306 91 291 100 -26 -220 4 -85 112 13 -81 85 -280 -41 -123 -127 106 -113 -156 -212 257 62
4062 62 -11 36 243 -270 -62 75 -33 97 -59 -176 -17 33 323 84 16 127 37 124 -120 14 -11 38 -75
4085 -75 -289 119 -230 -293 -59 -163 -61 134 331 77 -34 250 58 -83 118 128 118 -98 77 -84 28
4106 28 240 -171 -18 -80 63 -33 16 319 173 -48 160 160 -116 33 -107 -186 106 5 -211 -88 -57 -171 219
4129 219 -219 114 -151 -27 120 132 291 -88 -290 159 18 -53 150 -11 -144 -7 -166 -170 54 170 34
4150 34 -210 -40 65 38 -84 79 178 326 -155 -91 344 -103 -274 -26 330 26 -80 -144 48 -140 -66 36
4172 36 167 -231 -107 201 -43 210 132 10 45 188 14 -89 -9 -23 -36 90 127 -26 58 145 -98 236 -149
4195 -149 354 -192 230 144 -107 63 222 9 71 -137 156 -91 161 152 55 -29 -94 96 44 209 -7 -114 -29
4218b9K26j12k00j84K56K05j29j48L52m28J03J81o4R0j08j10P0j14J97N4oMn29
4241d23N49j75J74j23J56q8k24K5K82r0j01Oj2J67J77k79J07k5m51L20J18j51
4263f1J01k9R4j11J70k56J30p9J45j44j36K65J86l73J80j7K86m15j19L47l24M9
4285a11K48r8J7J91l52K79j44j60K49q5R1j65J31l5j51K37n4m50L83k45M03m5
4307A34j57k4O6J93j99k11J90o9J07k16J32J28j74K62L4l78q4J15K51l04J58K24
4329A78k7j98N3%N5J49o77M53l8J96j7j15K1J01j00P0K37l69L3l5K50l63M94m39
4353h8p0P4j88N48j69O0k93J47K48k67R7j4j71J00j45j33J91J12k34J82J99j64
4375B2j35K95j66k69K75j48Q7K06n4k12J92q4r7K73k58L42l16j53J90j59K67j20
$$ plain form
4218 -29 197 85 -115 -299 -43 162 33 -115 237 -191 -88 93 29 119 11 -99 -29 -143 54 108 102 106 -423
4241 -423 126 -49 125 2 158 70 -154 -129 153 63 -38 -32 -44 123 300 21 128 103 -348 -28 90 -61
4263 -61 40 11 105 -6 164 -92 38 -41 104 -40 -176 89 275 -98 82 65 351 -64 -183 164 -160 -111
4285 -111 137 39 56 247 -105 174 30 -130 119 34 125 -40 91 56 -95 142 88 -362 21 -224 179 134
4307 134 -23 -47 19 212 13 -198 -8 -77 30 -186 -54 74 -100 162 196 -182 -266 -151 100 -204 -46 178
4329 178 151 -47 6 6 61 210 -467 -14 -52 144 127 12 33 134 34 104 341 -28 5 -30 220 -143 351 -88
4353 -88 -158 -84 -272 276 107 167 -126 21 269 2 99 85 -86 14 -131 -264 -73 39 -195 -13 186 22
4375 22 -113 182 16 -253 22 -126 -39 167 113 -99 93 9 -88 185 -73 269 -47 -200 -10 -169 98 -22
4397b2l2J04J45k94j1J21o5j53O7pj42J98K13j28j51J41m34P12j65l43K67P7J14
4420B12j45M2n9M1N7k64j50L01j7j6o2kl43L80R9k40J67o1kJ70r2k56Q6J83m0
4445a1J05q2J3j31m9nJ56j47K67k46P0J29N5k38L58j95K19m17J71O4k09R1J92
4468A60l37J17J49l07L16j1p3oj35K34j04n4R1j69J48N9M03n68J73j02L7N8k28
4491a49K1K90q0K4j39L9m1j45J47K4L9l4K01l12K71J92m60O5q8mN6M9K07j34j49
4516a10J87j53J61LJ08P6l04O2J33l2k13J62k67K87L4l77M00j69q8J44o8NJ05
4539H6m57J73K26j10l2J04k86P77n44M5j35J11k02J75j00J58K29j30j38J67j91
4560g4q3N26l03N1k53M52j75k29K59J01k40l72M22p9j53M51l91r6K20K25r9j41
$$ plain form
4397 -22 -54 50 195 -99 -110 11 -54 -207 -140 -147 -289 -91 122 -6 -157 -16 -450 262 97 -246 21 98 212
4420 212 67 109 50 91 148 -116 -266 35 18 2 -60 -62 -405 -25 74 -166 1 -60 -62 108 16 -240 -154 29 -11
4445 -11 94 12 25 -106 -155 -160 -4 -151 116 -130 -60 69 124 -114 244 49 268 -149 22 86 -123 -32 160
4468 160 -177 -60 89 -218 98 87 14 8 -127 107 3 -51 40 -129 19 78 481 -87 86 -16 21 79 -149
4491 -149 -128 162 82 106 -33 6 -35 -180 -33 -9 30 -4 197 -115 156 348 -112 -47 -135 -139 -83 -34 173 39 -110
4516 -110 77 -76 85 88 196 272 -32 30 163 131 -82 80 -187 100 134 -243 157 -12 -100 44 -24 -19 86
4539 86 -371 -198 28 -82 -114 -10 -296 481 -63 -18 -153 -42 -244 -69 -169 -11 218 88 -50 117 -74
4560 -74 -157 369 66 117 -136 316 141 -88 171 272 32 -340 82 3 -150 301 -90 -186 34 259 160 19
4582A9k55L01N1k0j75K86r9k65J80j66J20N4P5j32J30m2k25N0n0N4L12k35j17
4605a49J96K4J75m60K05J03l1j51P9j05K66k72J93rR7J8j20p3l19L48k8k2R0p2
4629a7q8RK42Q3l43m6NJ53m4L9M3m26L33M01k42k37N5L59j38k31J36o1n4J39n3
4654A7k66PJ99J43j27K14k52k9Q0o9j91L63j57j33J52k0J41N7k08J78j36P1Om49
4678d09M33k9R3j10M23k88p3L1l9k01L19k31j91K26J13r5O6J32l47J49j47M55
4700B80l38j71J90k3J6n4J35j82K04j71J04j43K54l43l0K45L0j7O2N5j21k6J03
4723E9j62J40J20j16P3P3k85J08K30n25M58J05l37k6j54K14p6J58K24o47O31j56
4745A09K32o4l37M5l49L43k77L2R3J35o3O2OJ09J79l95K00O7k5j5m2j84K38J70
$$ plain form
4582 19 -236 65 116 96 -79 207 108 -157 23 -143 -23 31 106 -26 104 62 -163 -113 -163 -109 203 -32 -149
4605 -149 47 71 246 -214 -9 94 63 -88 -9 -114 152 -120 73 64 161 179 59 -14 -333 15 -13 -35 55 -17
4629 -17 -105 -96 146 229 -114 -160 -155 -2 -46 -7 36 -390 -57 344 102 -135 -80 279 141 -90 46 -15 -69 70 17
4654 17 -249 -242 -43 100 -27 187 -65 -94 -14 -83 -274 89 -68 -201 -49 -69 72 129 -79 99 -37 34 40 -409
4678 -409 24 -5 88 -22 401 113 40 71 32 -169 150 -81 -272 -46 67 -28 38 170 -177 -28 -175 280
4700 280 -58 -229 -39 -62 -46 -100 35 -147 57 -114 -10 -153 101 -242 -272 -27 3 -14 48 103 -18 -44 59
4723 59 -103 37 157 41 114 187 -98 10 240 -285 173 278 -59 -85 -239 -25 -101 57 281 -366 265 109
4745 109 341 277 -60 -15 -364 -21 -298 -266 -173 -38 -101 -39 -33 76 255 -140 60 127 102 87 45 -139 99 269
4769B69k95j27J29J91k20k71J24j86L95l9n0K35n8j37j6J35P7k90Q3K37k00J57
4791A43q7M5j77Q2k64n4J51n7M12j26K7j65j25J95l5j65K26J44j54n0k5o1n6M34
4815B58k72n1K01j32o6r7J01Q6j74L2J99p5p2K5J64K59k37l53J01R5K9j97K69
4838I3j99J8Q0P2k1k73L69l75K84J00j09Q1k52O6j27M13l87M49m06R7J5J09j86
4861h9M1K25r7k14J58K04m53j43K78J11j01K90k95K04RJ20l55QP4l43L67Oo4M4
4885a5L5l78O34l16J8j02J03L07j99j06j15LJ61j79r8K32L43m25J46k02L19k83
4907a17k9J61j16R9J50k70M48k94q8J7P6P1l41K15j37J71M0O0j06k36j7L52k77
4930a68L6N6J68km4K4j23k86M61j92J87k2j21k9j50j01p5M72K0r2k21L90j64m1
$$ plain form
4769 269 -26 -153 -24 167 -53 -324 -200 -386 9 -30 -80 155 97 -40 -56 79 156 -134 -51 186 -14 143
4791 143 56 101 -76 6 -258 -312 -161 -218 194 68 95 -70 -195 0 -35 -200 26 170 16 -34 -59 -120 -176 258
4815 258 -14 -65 136 4 -62 -159 -58 28 -146 -114 85 10 -62 -37 127 386 149 -204 -103 -8 21 -176 93
4838 93 -106 -88 -8 64 43 -230 139 -236 48 148 39 120 -132 -66 -193 220 -167 282 -124 -27 -12 97 -89
4861 -89 -48 177 80 -134 24 228 -225 -368 -90 21 -80 210 -85 119 128 248 -107 -99 -25 -368 -1 5 -59 -15
4885 -15 20 -358 276 -40 -22 -124 -21 286 87 -19 -134 -131 30 -149 -247 -15 328 -97 49 -153 166 -117
4907 -117 -146 15 -101 -2 148 -122 326 32 -56 -39 37 108 -233 -18 -155 16 56 116 10 -226 -243 109 -168
4930 -168 -132 -76 92 90 46 70 -53 -339 122 -70 117 95 -26 -55 -205 -306 -381 91 111 19 -202 188 24 -17
4954a7k76L79j66J76j31J75l43L00l0J27k49R8J78k57j25J06o8L01k26l3P8L02
4976B99k11Jj71L59j77Q9l54j07M40O2k05l6l4K25r2n2K02k70J33k61J28J55j96
4999g3m4L53K6l09L06l50K69k14J99j31J35k22j77J52J65J36J12k14j44J11k53
5020a67K72j48j44M05k83J91k28k6K34p2M4Q1j71k11M29P9l14k47L54l29K08K92
5042B49k00K52k17K59l90J88k49J8kn5J31j05J53j27l2L2L77l67J75k04M9J93
5064A28j00j37P4O7p2p4Q8K1N1k60J68o7L83j69qj91J24K7k9P8J6l81L43O6j16
5089C0J7J42l0j32L01l79j6J93l97M05j97J57k25K66l4k85K59r1l2j23R2L65j52
5112A34J5O3j31k73K07P2l3Q3m52L04K57l94J11K56k36n7O7J57Q7k12k23m2M6
$$ plain form
4954 -17 -293 86 -80 96 -35 140 -203 97 67 194 -55 43 221 -36 -161 -55 -123 178 -48 -81 -3 299
4976 299 88 89 -82 277 100 189 -165 -272 168 230 25 -11 -45 180 88 36 238 -32 101 -160 -32 123 -73
4999 -73 -117 236 262 -47 259 -91 178 -36 163 32 167 -55 -232 -80 85 221 333 119 -25 86 -167
5020 -167 105 -43 -187 218 -65 126 -102 -128 106 34 78 159 -12 -223 206 285 -29 -276 78 -251 -43 249
5042 249 49 301 84 343 -47 141 -108 -90 -92 -147 -16 -121 32 -95 -127 -95 282 -85 90 -114 -65 128
5064 128 28 -109 -35 32 -40 -114 -26 -5 46 -214 -46 -113 270 101 93 -98 26 53 24 102 118 -263 80 146 30
5089 30 47 189 159 27 328 -51 -67 126 -271 134 -63 94 -131 135 101 -184 75 -16 -48 -171 -79 286 134
5112 134 149 212 81 -192 15 87 54 137 -315 -11 246 -148 -37 219 -17 -74 -7 150 237 25 -198 -240 -194
5135a94K77n8k40P3J66k51K62J36k59K26m8o0q0kk79M33k51K43K7R3k76n5K75
5158A58j27J11j50j19Rm0K57o9M7l0N3J27m15K7J24j98L14n6P0p1l7j58L44j29
5182D2k27J55j56J58J70k03J90l0L7p4l71P8K96j45K77l75K73k43j4K29n8N8k4
5205D3R6j29j56K90kk04l5n8K15j14k7K45q5j42k8J36L1J7J47j56j39K6Kj57P6
5230a08m7M10Nj21l30K28k75K62P7j21K41k81K3k3Q9J27n1k20L21l72o7K97J25
5253A89k36j87K87J26k16l1J54j16n4L36j3l15K04j05O2j55J26j32p7L37j72Q2
5275I4q0m7J65j87k4K79l38j26JK77k6j58L92k45J36j46O3L72k81j61m9N5J04
5298G0J12l87N82m07J05n9k17J18k8L41m05K42l15L14j57K07j49R0J0r1O1m6M34
$$ plain form
5135 -194 83 25 -215 -142 24 -227 35 171 -88 138 90 30 -50 -52 -331 102 -149 94 121 214 -62 -117 158
5158 158 31 142 -8 -127 -118 -158 99 30 77 47 100 227 -188 -161 -37 -235 79 23 93 22 -15 -173 171 42
5182 42 -185 -30 -186 -28 142 -61 129 99 136 62 -309 -231 65 -80 197 -178 95 -148 -162 67 9 67 43
5205 43 139 10 -146 144 142 -62 -97 -155 60 -54 -81 164 79 -63 -91 45 76 93 240 84 -55 -29 -27 -184 -108
5230 -108 -155 255 260 139 -191 37 -238 24 101 -20 221 -60 -37 -60 29 156 105 -115 206 -166 -233 64 189
5253 189 -47 -234 53 179 -37 -68 86 -30 -84 252 239 -76 128 23 85 -70 56 -76 -153 184 12 94
5275 94 14 -33 132 -55 -79 200 -138 -264 -263 14 -12 -170 222 -23 113 -33 30 402 121 -40 -89 -34 70
5298 70 182 -205 377 -30 75 16 -201 -83 -111 230 -175 67 -248 66 -91 116 -33 57 67 -24 37 -9 425
5321D25m41j48K02l32J92Q2R4lk20J5L03J79l03o7J66j64RJ60J10l76K27j70L7
5344b3O7j00Q1L0k7K8L8k82N4J89J31l74J2K20n5P7k71J88P4j72K9J78M3M1l38
5369a62J2p6K64M4m96L42J09j62L08q0q2j12O0j81J37J42j94K79k35pj13Q8M14
5392B99n6j14n28M45k86K69M3J01k28j89m3M14K6j31j93l6J27P3m6N2J16k20M92
5415C87m91M8J20J21l41J75k09K12J4l25O5L2J03J32k94q7N27j37j73J10J4J5
5437A8J04M7m5j65J12k5j17K07P0k21l28J28K05Q8R2k8m69N09l65M9L21j72j94
5460a79J55J69k99K04R6j08r2M0J89j30kJ41m27K36p8K49k12O4j15J37R3j62J37
5483A06m23N31j54r5j0J16k38O4L9QM7P1q9p6J16j4n5q6O1J46o1K56l01j45L40
$$ plain form
5321 425 -16 -164 38 -294 -102 -20 74 71 -149 -134 169 348 45 -22 144 -20 -11 149 259 -117 110 -60 -23
5344 -23 44 -56 25 55 28 56 94 -188 -134 55 186 -188 -176 44 -11 66 -205 -17 57 -115 -86 92 135 176 -162
5369 -162 -150 -226 38 82 -414 -72 37 -125 183 103 21 -91 -31 -212 -75 67 -127 152 -83 -90 -203 -115 299
5392 299 243 129 -399 46 -240 29 72 173 -55 -244 -287 127 153 22 -171 -207 -80 -7 -53 -1 115 -105 387
5415 387 -104 -56 64 185 -156 19 -190 22 36 -289 -224 -192 -89 43 -251 -338 189 52 -121 -11 3 18
5437 18 122 169 124 -41 71 46 -71 136 206 -15 -343 -215 -10 78 170 142 -327 182 -183 -134 187 15 -179
5460 -179 -24 145 -154 50 146 38 -54 -14 175 45 43 184 -243 -7 -85 164 -48 16 -99 38 131 -31 106
5483 106 -317 214 60 -35 -45 71 -167 -103 -64 -56 -9 62 -27 -103 13 -1 -56 -142 -81 65 4 260 -41 -186 154
5508A54k44K81j85l58O61l84J23j36L0r6J94k7J59p5q0J08k50J45j50J42J58q2
5530H8k08Jk4P5K84o3m5K3j37R8j7k88L64k58O7N5J58l71L64j40j82J37NJ70l60
5555b04K16p5L0j9J57ll3NNq3J51pJ65k82O0l03K49q4p2l5K30m2j7rj87L29l82
5582b40L15Pj06J23j07k3J73pj06J7j40m9J72o0P6j61L45m44L73j29j04r9J60
5605a4l9M8M9j29j00Q8J08l58N22o6j15r4J15O6R1j17m11N26k65M1J22j13K07
5628A62p3j39K02k04k0L1J91j61m5l0L40m09J30J2Pj21K73l83L54k6j43JJ09j39
5652h1K02k56L99j98k86J67K5j33J20J79j18O1L3j48L2q6K66j67j3J1Jj0J32k34
5676a02r1R2l0j40J98J95K1j68l7r0J55N1pN8l7p5o8J58j08J60l13J60N4j86J81
$$ plain form
5508 154 -90 191 6 -352 309 -75 48 -88 -58 -154 40 13 172 97 17 125 -125 20 -130 12 170 88
5530 88 -120 -119 -143 -68 216 153 108 131 -6 92 75 -213 151 -107 -40 15 173 -198 166 26 -156 -19 -14 156 -204
5555 -204 12 -63 -33 -52 105 102 69 74 79 -4 147 140 305 23 83 -220 29 -55 -127 -162 68 26 9 0 -187 142 -240
5582 -240 75 82 -24 99 -8 -31 142 135 29 46 -94 -143 29 -31 45 -116 229 -215 158 29 -75 -174 -14
5605 -14 -53 -5 44 -85 -185 -97 11 -347 175 109 -6 -100 15 81 172 55 -356 170 -95 -54 68 -45 162
5628 162 89 -50 152 -52 -72 -41 150 -11 -56 -86 254 -155 -25 -13 -6 -127 146 -237 117 91 -52 -51 58 -81
5652 -81 121 -135 264 66 -220 -53 -28 -161 -41 138 20 81 114 -34 -2 -88 178 11 -2 9 10 0 132 -102
5676 -102 -193 -101 -131 -271 -73 122 143 -25 -62 -152 3 54 47 105 68 -7 -75 83 -25 135 -178 -18 36 -150 31
5701C1M2M5P9l71J98j20J5J57j24K20l74K77j48J1k5N7J67p1m6j63M09m39k0K38
5725D5r3O3k32J60jo2J74j14J82O0l57o5M47l37j02K13p1J6j63n0R2K48j48M3
5749e2m2k0j04n1K54q5J18J5j12j23L28j46J12n4j11K96k92k3R0j59K42j1k50
5772a80K49j00Q9J45k16k0l7J0p9J84p0j0J72k12K76N3j86j69L64k38k43L78r7
5795F3O0j97O0p9O0J00K6l9j56K27j38J07l50L31R9k23J3K4j44j85K33P8K32j71
5819C1Q5l60J92pq6J93j24n3O6Q0P8o2l22K43o5L17l66J72N8Q3j43P9j89Q1j17
5844a36J62k51o2K45J90J92m04J74l9J47k58J4J15p1J10oO8j30j07L00p3ql51
5867a79J08r8P2J03M30m73J03p3K3j48M18K6n81J26J62M9r0j23K14J59j95j32
$$ plain form
5701 31 73 118 197 -174 24 -96 -81 76 -48 172 -202 75 -73 -62 -87 -30 137 66 20 -143 266 -173 -193 45
5725 45 -48 15 -217 -57 -58 -120 54 -60 122 182 -175 -240 207 -130 -232 -19 -90 -74 -237 -287 -195 53 -95 -52
5749 -52 -94 -114 -218 -269 -15 -100 18 33 -79 -202 126 -20 92 38 -73 223 -69 -92 -2 -161 81 70 -180
5772 -180 69 -31 58 203 -13 -33 -70 -60 -139 45 -25 -35 137 -75 201 254 68 -101 263 25 -218 160 63
5795 63 123 -74 -14 -93 -33 67 93 54 -102 125 -13 94 -256 75 174 -49 -36 -12 -156 -341 -108 -30 202 31
5819 31 116 -244 -52 -59 -145 48 -76 -129 -63 17 95 33 -289 -46 -111 206 -160 12 70 153 10 89 -100 -19 -136
5844 -136 26 -225 -287 -42 148 340 -64 110 71 218 -40 -26 89 18 128 122 190 60 -47 253 180 172 -179
5867 -179 -71 -169 -97 6 436 -37 66 -7 16 -132 286 312 -269 -143 19 68 -22 -145 69 228 33 -99
5889i9K70j72n2PL7j06Q5j22K63J81j82j18j34K11P3K7Q8k38k7K12k45k0J79k29
5913a11R9r3J91K8K16l57j82K40Rq7K60j72pm4K05j03J23j67q6j69L2J63J51q0
5937E9J40K8l41K81l50L45j58O0j60K04j38o4k0j31L44j5j61j0j2K04j04K8J19
5960A48r3j46j34K54Q7K6J33r3j61P5k03P7j13J95J56l41m2N3m2J18N7r3K04q2
5984D0p8l0Q3J17j99m2K29m05N41j98j05j5K08k46r9R1O0R7j44l8J32M7o3j05
6008a22J99o9n1l1M3O3J72k62J4K51k80J96l28K87qJ96l57L9L3n7M3O1P1j24J49
6033A28k42o0M61j37q6RJ6N7k29j2J89k01j28K17l7J83M5k10Q0m8j60j00L95J8
6057A48j46J5r4J08k63M11N2l92N6J22q3j8j57K65j75J97P2j55J51k82J10Q7n
$$ plain form
5889 -99 171 -1 -53 -46 -9 -115 -30 -152 111 292 110 -8 -142 69 142 169 257 19 -8 204 -41 -61 118 -111
5913 -111 -12 -105 86 114 330 -27 -209 31 40 -47 213 41 34 -10 195 92 215 48 -38 -207 -175 -12 139 59
5937 59 199 227 -114 167 -183 162 4 64 -96 108 -30 -94 -114 -245 99 84 -77 -87 -99 105 1 29 148
5960 148 55 -91 -225 29 116 142 275 182 21 96 -107 -30 -143 52 208 -133 -175 -122 -164 -46 11 -82 122 40
5984 40 -38 -68 15 132 -67 -109 120 -285 256 58 -47 -62 146 -100 -199 -108 -48 49 -95 -133 -1 46 -17 -122
6008 -122 77 8 -43 -74 -31 32 204 -58 -44 207 -73 123 -205 82 74 270 -87 -48 -15 -72 -29 32 103 -21 128
6033 128 -114 -174 287 150 64 73 89 146 -83 -95 94 -107 -235 -18 -55 128 173 -37 43 -5 -165 -265 130 148
6057 148 2 17 -77 31 -232 179 231 -161 -105 17 -66 -84 -241 24 -151 46 118 -37 114 -168 -58 29 24
6080B4n8JJ7l6j14JL40j49k9k06J91k9j6j62K45J26j56J88l81J91O3n0OP4o4M03
6106D20m84j39K20J94m83K07k0J7J85P7l2m19J86k43L82p5p2J13j25N9L17j04
6128A81o9J23l30K36p4j90PQ6K09j85J09O5j08O2j40J86l96J09J01J4j9q5J02
6151fj13K83k35o4L4M6K89k18K15n8j7J4l82L48k81J51k17K37j98K11J68j49o6
6174hQ7j97R9K51k82K29k33J11j06PK4l3n8L96k09n2q3j96L32l6k44K89K00j13
6198A75j94K9NQ9j02l42L78j8J0j90M43k36k97N32j09J2p2j26J63J2j96k5L22
6221B63l77K81k78L0J78j90L8n3N15l31N2L4L4P4o4k26j89L07L1k47J06o0n1K27
6245A04k56L40l9k04K20j42j22K1k57M64L2j70K5l6L2k8O8j32q3O8L9J1j39L38
$$ plain form
6080 24 -34 -33 -16 -52 -166 -165 175 26 -3 -209 -18 -47 -63 -225 20 146 -10 178 -203 -12 51 1 7 81 17 420
6106 420 -64 -203 17 211 -272 -65 -85 -68 117 194 162 -257 -71 -314 68 -7 -79 34 -91 -32 285 181
6128 181 112 235 -95 141 67 -123 -116 -30 179 -6 103 168 60 122 -18 168 -228 -119 -18 -4 -23 -108 -6
6151 -6 -119 164 -71 -135 -101 -55 234 16 231 173 156 170 -212 136 -145 6 -211 26 -172 39 207 58 -8
6174 -8 79 -118 -19 232 -50 179 -54 57 -49 -42 -18 -51 -109 287 78 26 -57 -253 79 43 -201 88 288 175
6198 175 -19 10 15 104 2 -340 38 20 30 -160 283 47 -250 282 173 185 113 -13 150 162 -34 -59 263
6221 263 -114 167 -111 -81 97 -93 -55 -108 407 76 128 162 196 270 206 -20 -209 98 129 -118 -12 -72 -123 104
6245 104 -152 188 149 -55 165 23 -99 -78 -335 129 161 -9 16 -20 12 -16 52 -80 -163 -95 -56 -45 -184 154
6269A54%j29M6l04K94j64K0J34k07j61L15J12Q2l5q2m9N4l3k37O8J22j46J04J4
6293b8q0J47o5n1J16k51J76j66K61J22k00K4J38j75J7OQ0l48L12k5k68M55k69
6316g2J67j94K34J34l30L9l20N00k81J44J50j41J41l15j45J27L87m94J95M7OJ26
6338A05m62M58j52Q8N1J20l64L41k26K97l09L34k02J73l49M33k85k1q3K16l22
6359a59P3J05J7J97l53M12m98P8J88J24J7l34q0K08j32J76j04O1J0J79L6j05n06
6382c90L88K2J24k26J64M3k64P9j9J30m0K31J35l16j53j75K80M6Q9k2P5j15j51
6405f5K79j64j24J12q2j00L13l8l23K65n9m0m0J65k4j82L3J42j41M5M1l00K58
6428b9j9K15k36K28p0M0l90K31J5j58QJ22K06k08n2jL84m75K58M2j27J78j80r3
$$ plain form
6269 154 154 25 71 -233 61 -103 -83 51 -156 -317 -2 110 192 157 75 26 80 47 -190 -122 0 -146 -42 -28
6293 -28 -108 39 -26 -77 39 -212 -36 -202 59 181 -19 5 143 -32 -15 -9 71 -277 35 10 -258 197 -72
6316 -72 95 -99 135 269 -61 -22 -342 158 -123 21 171 30 171 -144 -289 -162 225 -269 -74 -27 -21 105
6338 105 -357 101 -51 37 88 208 -156 185 -41 256 -53 281 79 252 -97 336 51 30 -53 163 -159
6359 -159 -86 19 36 233 -120 292 -206 -128 60 184 201 -133 -213 -5 -137 39 -65 -4 6 185 221 116 -390
6382 -390 -2 20 144 -82 82 125 -139 -60 -79 51 11 242 377 61 -92 -267 13 59 148 126 201 86 -65
6405 -65 214 50 -74 38 -44 -144 169 131 -192 73 14 -26 -66 99 75 -107 -74 68 -73 -28 13 -287 -29
6428 -29 -48 167 -69 159 89 129 -261 -30 -15 -173 -165 -43 163 -45 -97 -98 286 -189 69 111 -16 162 -18 -111
6452a11r2M16k41P6j3J57p4k25R5L26m58K10k0j00R1j75R2j7N0r9j55J54J96k25
6476a42M20m8l59J45J0o8J01j41J97j23J7l9j7J84j41K72j85j7k36R5j10J69%
6499a6o7K53j52J02k91J46k9J38J64k65k05K55K22j53J7j11L21m66K33L6k06N4
6521b0K07k1k54L5j10J55n9j43M62j38L4k19L89l31m1R5k4J27m0Mj17Qr1K81R5
6546B84m96K65pj99L60k35j01p3K46L0l9k02O92n18J02j73M33l70p3K68j44N1
6568A01Q3R4j70q0M9l7J01l96K98r4k2j42Q2j2N4L85k22n8r3K12J2j18j96K08
6592C9j5k1RK2J39j04j71N0j5N7r8K76j22j58O7J3K15J0l33R2J51j43o5L56j40
6617A11j54k5p7R7k27M61N8k94K01Lr3j15j1K39J67m91J36P1j00Q7K0%j33J69
$$ plain form
6452 -111 -203 213 -28 48 35 192 118 -107 -12 314 -144 66 46 -54 37 -138 -46 -63 -13 -112 -267 -113 83 -142
6476 -142 278 230 -129 16 26 -42 59 -82 115 -8 9 -30 -47 137 -4 268 83 66 -170 -75 -185 -16 -16
6499 -16 -83 170 18 120 -171 -25 -54 84 248 -17 -222 33 255 102 119 8 329 -137 96 132 -74 -20
6521 -20 187 166 -88 -53 -163 -8 -67 -210 252 114 148 -71 318 -13 -54 41 17 144 104 108 -9 -1 -92 189 284
6546 284 -212 53 46 -153 207 -28 -129 -202 44 74 35 -167 525 7 109 -64 369 -1 -74 194 50 101
6568 101 184 278 108 28 77 40 141 -255 43 -51 -73 -215 -133 -145 -91 294 72 14 -79 133 145 27 -169 39
6592 39 24 3 12 34 173 69 -102 -52 -67 -10 -108 168 46 -112 -45 -32 183 193 -140 -48 103 -40 -105 251 111
6617 111 -43 -68 -145 -48 -275 186 244 -50 151 154 61 -54 -65 174 341 -150 -14 57 -43 44 64 64 -69 100
6641A00Q5o1j39QJ82j38K22j74j30K91m18J87l9N0L1l53L21j46m4M28j34k80K16
6664F5o0n9J65J00j68K3l81J62K18m8Q0l17N28m28K39k0J3k07R1k14J54l4J47
6687D9l4p5j93J18K89k80n0R5J55j55M3mJ61r8r6nK28j69r4L45l17P0j6j1P9J35
6713A70K5k29m2j1P5J03M2M5j77J33J35j99r6j23J3l1J17K17j19L9R0k64K07k54
6737a34R3N7o8L03j85k01P9R2M1k63L63k85K73j65l6J0j72M66l46m6M09r1p8j71
6761e5j0R2N3j30p4K69m29P24m35q0RJ6K00j74k8L15j74K4j41J13llj06J68j13
6786B8j60K87J83l96j83K03k7l1k12L09j31N8j33J48j31J09R1P0L6l65K72J48
6808A73j45J26m77L6J18J79J07m5L2k19K87l14J30J44j47k1J23jj93J49k27J01
$$ plain form
6641 100 185 124 -15 -7 175 37 259 85 -45 246 -172 15 -24 26 57 -296 25 -121 -165 263 129 -151 65
6664 65 5 -54 111 211 43 66 -315 -153 65 17 97 -220 308 -120 119 99 112 -95 -4 -218 -64 -98 49
6687 49 15 -60 -253 -135 154 -126 -176 -81 74 -81 -38 -42 119 21 -75 -80 148 -21 -115 230 -87 -17 -33 -44 35 170
6713 170 195 -34 -76 -87 -12 91 133 178 1 134 269 70 -26 -149 -136 -167 -50 167 48 87 177 -87 120 -134
6737 -134 -41 16 -52 251 66 -135 -56 36 77 -186 177 -108 165 0 -36 -26 -198 268 -78 -124 285 194 116 -55
6761 -55 -65 27 80 -50 -124 145 -284 440 5 -75 -66 -50 150 -24 -52 263 89 113 -28 85 82 79 -27 141 28
6786 28 -132 155 338 -58 -241 -38 -65 -96 -308 1 -130 -72 -205 -57 -188 -79 12 82 118 -247 25 173
6808 173 28 154 -323 -287 -169 10 117 72 104 -115 172 -142 -12 132 -15 -36 87 86 -107 42 -185 -84
6830h4P4J7j47k6J65j1J80M8r5m1k37K21r9m7M88k38j51M6j13Q2k63J03j83K02
6854a09N6R2P1k99N8j84L41k55L72k40RL79l42q6K3K05k53j75K87J36j69M45m93
6877a31K24k86l4M78j58n6j10J8K26m5l8l6j27L7J17L6n8ok18j38J96J57J07r3
6901F2l8k27J59k15M89k55r9q5K13j2P5j84r1K14j92K54m8l15K82p8K02k7q8j00
6925a04j4J44Q8M3J21m90Q1L91j85k77L07l6l59N48m7p8p2QK7j34k03K01J06q7
6949b1O2J50k72J8MR1j54RQ6k08K85j21P3K59k34k42K60R1k03j60J59J27j61J80
6973G8j26Q1J70l30K05k08L88k17j65R3O1K02j90m7K1m0l8k6K43k30J56O3j34
6996A0Q7p4Q9o3M7R1l72J49L8O2J40j99K77k35k92L94k12m4R0m00M34O1j8l22
$$ plain form
6830 -84 -10 7 -140 -166 -1 -12 168 216 121 80 -157 64 -35 -82 406 168 17 63 -50 32 -231 -128 -311 -109
6854 -109 -53 39 110 -189 -131 -315 26 -229 143 -97 -88 291 -51 -137 -114 91 -162 -337 -50 86 -83 362 -131
6877 -131 93 -193 -227 251 93 37 -73 -55 171 126 88 52 -75 -38 79 115 57 51 -167 -305 -109 48 155 62
6901 62 24 -203 -44 -259 230 -25 -124 -209 4 -8 67 -117 -208 6 -186 68 20 -295 -13 -91 111 84 -4 -104
6925 -104 -118 26 114 157 278 -212 -131 260 75 -202 105 69 -290 258 211 133 61 69 96 -38 -241 -40 66 -21
6949 -21 41 191 -81 -63 -59 32 -122 -113 -27 -235 50 -71 2 261 27 -215 45 136 -67 -227 -68 59 -102 78
6973 78 -48 33 203 -127 78 -130 258 41 -124 -31 30 232 42 -5 16 -24 -62 -88 155 -75 81 144 10
6996 10 97 23 112 49 96 187 -185 -36 2 64 204 5 282 47 -245 149 -63 -107 -17 -417 17 78 60 -262
7020b62L47j42J93ro5j27j19J09N5o4K01Q3j52k05K57l15L69k89L63k88L42k42
7042D0J06k46K61k31J38j7J6J20j25R1n7N2k50J0J8J22m9K83k19l79L83L50m67
7065e0mJ07J03j36k3L0J03j58J32j23k44K83o9l8k68M96j72J0J6j17j07J86k75
7088c18J30K25J48J02m07M30m05Q3m4j56J59M6J9j15J86l08K17R0j99J51j10M2
7110c4M04l32J05k20L36m77L06j86K09Qkj02Kn1j67L46r3m2J31JM3K4m33N13j56
7135A33l22L82l41M84j34o5r5K8K28k30k7M9J78l60J85J35k99L83j50k83J30o
7157CN6mJ36l91J51k8J02k3k01L83m54P2O3K23j80J90Q9N5J3nm22J70p0m5N5o
7183f8M26m46n5Q4L5K0J25j91J17Q4l2P2k23P4j97n3L40Q8L1r7j25R2j50j84O2
$$ plain form
7020 -262 85 -57 136 127 62 -65 -184 -75 -20 -84 117 200 48 -157 100 -215 154 -135 228 -60 282 40
7042 40 146 -100 161 -70 68 51 67 187 62 153 96 148 -102 -92 -74 48 -1 282 63 -316 67 417 -50
7065 -50 -54 53 156 20 -3 27 130 -28 104 -19 -263 20 -49 -87 -355 141 -31 -21 -5 -122 -229 -43 -318
7088 -318 -188 37 185 287 -120 310 -95 -12 -56 -212 -53 -7 12 -103 83 -225 -8 82 -117 34 -76 -34
7110 -34 370 38 143 -77 259 -218 88 -98 111 119 117 15 17 -34 -201 145 52 10 141 142 185 209 -224 289 133
7135 133 -189 193 -148 336 202 137 42 70 298 68 41 90 268 -92 93 228 -71 312 162 -121 9 3
7157 3 59 55 191 -200 -49 -77 25 2 -199 184 -270 -198 -135 88 -92 98 187 242 255 250 -172 -2 -72 -117 -62 -68
7183 -68 358 -88 -143 -59 -24 -4 121 -70 47 131 99 171 -52 22 -175 -228 112 200 231 134 9 101 -49 -233 -171
7208a71L82l83L90j78j14M6J44l98J99J85q4j83M32k05J8n44P36m55J76l7L5K34
7230B25j59j06R5r7K8q5M5J16j33j21J31K08j52j06K87n9o9j42J05K66k61J31
7252A47j38J35J39m29M24j31p7M3L3n6o6l04L64k6Pj40Q9M7J54r4m0j30j30M04
7276B25k2j14k24K04j94L11j27L5J41M7j40j09j60j1K16K88j67nk69J41j49qK17
7299A26j27K9j54L91J47m69J30k89L74j33j27j88J98K81N1k47jN3j29J50k20L05
7321A51k04O3L7n2m5L69k16k20R0K5J13j70k7J79r1k5jrk07L92J45k39R4L8l63
7346a73J99p6K47k20O4j51k2L04j05M7N8l9K0k26Q2J96j41j80n6K05J0O3o6k09
7370a69K00k4o7j64J65K16p3k81K93l5j43K14j79k16K85l21K17k56L84n4J14l42
$$ plain form
7208 -171 211 -172 218 40 -74 -28 116 -282 -83 102 18 -165 267 62 80 -464 272 -183 -7 -44 -9 225
7230 225 66 -40 55 -42 -14 -99 -54 62 -71 -192 -61 147 -5 -111 176 117 48 -94 11 277 16 147
7252 147 9 144 283 -146 278 147 70 113 146 90 24 -280 84 58 65 -75 14 61 215 121 81 -49 -179 225
7276 225 203 89 -135 69 -125 186 59 94 235 282 142 33 -127 -138 78 366 199 194 -75 66 -83 -91 126
7299 126 -1 28 -126 265 412 -57 73 -216 158 25 -102 -290 -92 189 240 -7 -8 45 -84 66 -154 151
7321 151 -53 10 47 -5 -50 319 103 -117 -27 -2 111 -59 -86 93 2 -23 -24 -33 -240 152 297 58 152 190 -173
7346 -173 26 -50 197 -23 41 -110 -132 172 67 114 172 133 153 -73 9 205 64 -116 -172 33 43 106 40 -169
7370 -169 31 7 -60 -224 -59 157 84 -197 96 61 -82 132 -47 -263 22 -299 -82 -338 46 -8 106 -236
7392b36J57j35K25N1j52K45m87M90k94o6n8J80J41j24J11q4r5mM6j26L55j15J67
7415A92j23M1k57M07j30m00J55L5J21o0j01N7K56n4j30l1J74j18K58l05P4J25
7437A86l09N5k5K52J23k71o2R0J49l89P5K36k55Q8L03k64j36L65k55J20Ok25K22
7460G9O9l04Q7J33k83M31j14q6k1Ll36K99o4J31J96k23P1k59Q6QK26j52K20K0
7484B17k88L60l36Q0L02m73J05M05k35q9R5j61qP7Q3k60%J96q5q7J27Q9L12k6
7508D00m97N8K65l79L25j98j67M19m14K15J02l7k00N1Q7M8k27J21J18r6O8mj92
7531a34M3J49M3R3qj18j10j42J06o7J82J16j56j45N2j41M22l4l74J69K9K89L5
7554B99j10l15m2J98pj19K29k54K13j13j34K91j41j64K0Q5J23m8K4J19j17l33
$$ plain form
7392 -236 -79 -214 11 62 -90 155 -332 158 -136 -202 -260 -80 61 -63 48 -36 -131 -135 -89 -215 140 25 192
7415 192 69 110 -147 260 130 -270 -115 -80 41 -19 -120 -63 193 139 9 -22 152 34 292 -13 61 186
7437 186 -123 -68 -93 159 282 11 -51 39 188 -201 -126 110 -145 -57 246 -18 -154 211 -44 76 82 -143 79
7460 79 148 -156 -69 64 -219 212 98 12 -9 -6 -342 -43 -107 24 220 -3 68 -191 -105 -97 129 -23 197 217
7484 217 -71 289 -47 33 335 -138 -33 372 137 48 143 -18 -26 51 134 -126 -126 70 -15 -102 25 114 426 400
7508 400 -97 -39 226 -153 172 -26 -193 226 -188 27 129 92 -108 -57 30 78 -149 -28 90 -6 62 58 -134
7531 -134 -91 58 101 194 186 68 -42 -184 -78 -145 37 153 -3 -148 -96 -237 185 151 -223 -54 -25 264 299
7554 299 189 -126 -168 30 23 -96 133 -121 92 -21 -155 136 -5 -169 -149 -64 59 11 35 154 37 -296
7576b96K56k22L23l2k03K63J06l30n9o8J94k95K45J9K50k83J41r1j96L77j00J89
7598A88o00M44J85l19m5J91oj29K82l41K28j41P0J20J64j69n22L03j26K99L59
7619D35n58L41j08r6l0j48M50l66k5K19O3l90L30J4q2J34l28M33l67r0P8J95N5
7642A59l68M32o5j60J83j53j41J71j61K37j41j02J57J10l9J6j59K17j80k97L01
7663A7o9k61M00rJ09p9j41K42J6r0k19N9j58o4J72J3NL13n05M66j09Q3j73J39
7687A57lk94J51K23j60O2j70K71k66j05J43J08k09j34L48k13J78k27J96J37j84
7708Im2k59L46q8J88j54p7J01r4M7m2J19j46L28j71k96J14N0J54J05q6j97L39
7731B48j34k93K70q4J14o9k10M35j55l69K44o8J06k38K30l00M22n3R3j95k56M15
$$ plain form
7576 -296 -40 -262 61 29 -174 89 195 -135 -194 -262 -68 -363 -118 -99 151 -132 9 -82 -278 99 -1 188
7598 188 -412 32 217 -102 -147 44 38 -91 191 -150 78 -63 7 127 291 122 -400 -97 -223 76 435
7619 435 -123 218 110 14 -16 -164 286 -80 -105 114 177 -213 117 131 49 183 -145 288 -79 -169 -91 104 159
7642 159 -209 223 158 -2 181 28 -113 58 -103 134 -7 -109 48 158 119 135 -24 193 13 -284 17
7663 17 -52 -313 87 78 187 108 -33 209 225 135 -84 -25 -183 -247 -75 -62 -57 256 -249 217 108 191 18 157
7687 157 154 -140 11 234 74 136 -34 237 -29 -134 9 117 -92 -226 122 -91 87 -140 56 193 9
7708 9 -33 -292 54 -34 154 0 -77 24 -70 -23 -65 54 -92 236 65 -231 -117 -67 87 192 106 -91 248
7731 248 114 -179 91 7 121 52 -158 277 122 -247 -3 -71 35 -203 27 -273 149 96 189 -6 -262 153
7753A53j82O9k71L96k67R1j74K93k36J47J9l4k98K50kl5J5M9k4j3O2P7K4K61k81
7778H9J62l33k39J75M06l57K46k61K13j14j7K81j5k6k53O0p1R2k97J92R2k33J36
7801g2L7L0j58J52l9P1j30L15k34K75j36P3k07n6L84m1k04K21l32o7L4o7J09M5
7825CJ9K39m52K47P1k47R8j23L12l49R5l2J53J15l9lm1j24j72L26m3m5J03j58
7849d7J11k39L47j07l23M67n25L98j33J54l5K59m59j16L13KN2j89jM9J25j91K9
7872e9J28j27J32P7j60k06O9J10k7K49q6k19kJ12N2j88L15j72o4j90L57j54L03
7895B50j51k52O2K02k29k24J43J0L55n7j29m3Q3Rn0j5J1l2M08k00k59J22K0p1
7919c7J0j1l13K93j21k7L4Q5R1L1n5L4j67J55J26k94K01J3J74r8J64m46J83j68
$$ plain form
7753 153 -29 40 -231 165 -102 -11 -185 108 -128 19 38 4 -294 -44 -46 -81 -66 -17 -41 -54 8 85 109 370 89
7778 89 251 -82 -321 -146 260 -97 149 -112 101 -13 -30 251 236 210 -43 17 -54 38 -259 -67 25 -208 -72
7801 -72 -35 -5 -163 -11 -50 21 -109 206 -28 247 111 184 -23 -79 305 264 60 281 -51 -118 -84 -151 -42 3
7825 3 22 261 -191 56 127 -120 -22 -145 167 -182 -87 -119 34 149 110 107 66 -58 -230 96 53 8 111 -47
7849 -47 64 -175 172 65 -258 209 -316 82 -51 103 68 327 -132 -248 65 67 119 -70 -71 -22 103 -88 -59
7872 -59 69 -58 74 151 -9 -215 -146 -36 -63 186 100 -119 -121 -9 43 -145 170 -2 -66 -256 101 -53 250
7895 250 99 -153 -91 111 -118 -342 -199 -189 166 109 -20 -63 20 29 -21 -36 -25 -57 351 151 -108 14 34 -37
7919 -37 -27 -38 -351 -58 -179 -206 -172 -87 4 35 -20 14 -153 2 128 -166 35 48 222 124 288 -158 25 -143
7943a43L62q4j91oL4J33JJ6j19K15k85k49L14k3L5k20L17n6j12j78K47l2K4l15
7967c15M26j66JnK77m12L18k03Q2K27k5j82j85K95Q9j08k09J22N8k06Q1J02j63
7990a01J82j1J53p9j33L0K09l73J54no8K07j00m23J52L52M3k43J42o3K5k69J92
8013b7Q5O0j83l00M53m1J41Q2O8k48k67K60j25K25k86L18l3l85J48k12K66Q4j91
8036a08K17j48K90k56j72J19J07j9J12k14J66K56j92j40J67j20J02k06j28J91
8056B4K0Q6k64kL0m9P7L51m74J78J60q5P2k94J77m4o5j9lJ66K3O7j25j29J16J06
8082A00K57n22R2K97k20l2o9Rn6j33J49J43J87l94L51q1L8k25l1J19M4j48J03
8105b2j98J19j43K05J42k62K12K8n2J3j13m1R6l0J73l40M18q0J06j01l57J58J81
$$ plain form
7943 -143 219 135 -56 -62 -28 105 106 122 3 218 -67 -316 -2 -25 10 -210 107 51 -61 -239 8 -24 0 -315
7967 -315 111 -55 -54 -59 218 -194 124 -79 3 230 205 23 -162 133 222 114 -95 27 85 -121 -40 62 -101
7990 -101 81 70 223 144 11 41 250 -123 31 26 -42 165 65 -358 -206 146 189 -54 88 25 50 -219 -27
8013 -27 58 118 -65 -365 88 47 188 270 338 90 -177 83 -42 183 -103 215 182 -203 -55 -267 -1 83 -108
8036 -108 109 -39 251 -5 -177 -58 49 30 142 -72 94 350 158 18 185 65 167 -39 -167 24
8056 24 44 130 -134 -136 -106 -155 -78 273 -201 -23 137 52 124 -170 7 -37 -102 -121 -124 42 65 132 7 -122 -6 100
8082 100 357 -165 -73 224 4 -28 -97 -88 -144 -277 -128 15 202 -192 159 78 116 -109 -140 -21 23 -125 -22
8105 -22 -220 -101 -244 -39 103 -159 53 81 29 42 -71 -112 -16 -46 127 -213 205 125 231 130 -227 -69 112
8128A12q3p7Mq7K92m00L17J3k24o7N78o18J12k7P4K06l08K70J15j51M1p6K42j05
8152A53m4k39J54j7L4j49P6J89k55p2J8J03M05l98l1N7J2j53J54q1Rr3J12j29
8176a85K18l8j62L76j60q6K29k68qPj11K33L9J93l89
$$ plain form
8128 112 29 -48 -44 -131 161 -239 78 91 -133 -200 378 -240 -128 -155 -81 125 -183 87 202 51 92 16 258 153
8152 153 109 -130 24 7 41 -108 -32 157 -98 -170 -152 -49 356 -42 -73 -16 -4 -157 -3 -84 -75 -168 -56 -185
8176 -185 33 -5 -167 209 49 -37 192 -76 -84 -77 -188 45 84 277 -112
8191a12
$$ Imaginary data points
##PAGE= N=2
##DATA TABLE= (X++(I..I)), XYDATA
0@%%%%%%%%%%%qJ6j6K4l2L3m1N6p0P9r1J13j35J59j84K11k47K86l30L78m32M92
33B61n57O30p12Q01q98J005j121J249j391J543j709J895k096K314k551K811l098
50a624L413l759M141m569N045n576O180o871P669q604R714j1055J2720j4855J7702
65I671k1704K7785l8252O1175k02994J14172K18248k90370J82052J72847j88370
76D4260o6329P5623j73077r281J07201k7635O2298J20923r5886J7357O2366j85618
88f7798q1391J34798o5541k0236J77781j3150m8480J42311r1715j86671J08060
99a2032J6236j61779J14244J33486r2383M7125R0533j34708n1524M9904q3709
110h4607p068R1602k3243M9807J09102r2835n7237Q1509r2689j00019J04008P164
$$ plain form
0 0 0 0 0 0 0 0 0 0 0 0 0 -8 8 -8 16 -16 17 -24 32 -38 41 -50 63 -72 87 -97 114 -133 153 -177 201 -231 261
33 261 -296 334 -378 423 -475 530 -591 658 -733 810 -899 996 -1100 1214 -1337 1474 -1624
50 -1624 1789 -1970 2171 -2398 2647 -2929 3251 -3620 4049 -4555 5159 -5896 6824 -8031 9671
65 9671 -12033 15752 -22500 38675 -164319 -50147 168101 -122269 59783 232630 44260
76 44260 -22069 53554 -119523 -128804 -21603 -49238 13060 133983 38097 55454 117820 -67798
88 -67798 -149189 -14391 -79932 -100168 77613 64463 15983 158294 66579 -120092 -12032
99 -12032 4204 -157575 -43331 90155 -2228 44897 135430 722 -50802 -898 -84607
110 -84607 -91675 -73 -23316 26491 135593 42758 -14479 67030 -25659 -125678 -21670 -14506
122a4506m9245J25702L3159r9496M3147R724j21316R738M4433n0589O0114Q4131
134G4996n2354J5726M8925r4962m2029M2694n9544n071J03391j3422k1995Q3861
146H0216k7152q5554K8645j5433o1789N6774M0539k8418N4805L3615o2755l067
158A0426J581p0291O999M3714k9326L0386O9119l3913j7383L3168n6958m3994
170e6472M4527j3063j9038P0657J8409l3282K9583p015o2860L962O667l4268L0336
183b1857M2664j3380K0533K1474m3534j4481Q580l9420j249M4208n397O206M3339
196D7686j7046l1263J3287k4667l6070K5775J2801q701L5966J9717k2402M993
208B0076l702l9851j883J3254j3849J7336L3760q012j43J2696k8628k2429Q466
$$ plain form
122 -14506 -63751 61951 95110 -4386 38761 48485 -72831 -63093 -18660 -69249 -9135 74996
134 74996 22642 38368 87293 -7669 -49698 -7004 -66548 -71619 31772 18350 -3645 80216
146 80216 53064 -32490 -3845 -19278 -81067 -24293 16246 -12172 42633 76248 13493 10426
158 10426 12007 -58284 -51285 -7571 -36897 -6511 62608 28695 11312 44480 -12478 -56472
170 -56472 -11945 -25008 -44046 26611 45020 11738 41321 34306 -28554 -24592 -17925 -52193 -21857
183 -21857 20807 7427 27960 49434 5900 -8581 -1 -39421 -40670 3538 -1859 4347 47686
196 47686 30640 -623 12664 -12003 -48073 -22298 -9497 -18198 17768 37485 15083 20076
208 20076 16374 -23477 -25360 -12106 -25955 -8619 25141 17129 16986 29682 1054 -21375 -12909
221a2909j2314l626L0760R448j495K1215o824k7378P96p761k1112J4473J8628
234A901k893J5298J3771j5617q442m017k0972k904J3352r86J0980K3519l789q025
248A1176M883j5860j9982M951K101j858J6981J2060k060M528n311j7814m609j826
262a2640p745R784J6511J745N621P643j0604j2304l376r012l255R884N521O367
276D140J1837j363q721j606q909j2340L636O839J850J0186R828k271l361m214
290E531j1050o498l2M71O302J0629L267K030J464p931r492k210l090j140P535
305d214Q247L972L930p32o753n631o219n316K442N490L683P084O270l008n078
320D167k925o303n584J181M816M496N460L902R83l289o938n861k109j489J376
$$ plain form
221 -12909 -25223 -28849 1911 11359 9864 31079 24255 -3123 -2327 -10088 -31200 -16727 1901
234 1901 -992 14306 28077 12460 4018 1 -20971 -23875 -10523 -11509 -529 22990 19201 11176
248 11176 16059 199 -19783 -14832 -12731 -14589 2392 14452 12392 16920 11609 -6205 -10814 -12640
262 -12640 -20385 -10601 5910 7655 13276 20919 10315 -1989 -5365 -14377 -17632 -7748 -2227 4140
276 4140 15977 14614 5893 4287 -4622 -16962 -13326 -6487 -4637 5549 15377 13106 9745 5531
290 5531 -5519 -12017 -12049 -11578 -5276 5353 8620 10650 12114 4183 -5309 -7519 -10609 -11749 -4214
305 -4214 4033 8005 11935 11203 4450 -1181 -7400 -12716 -10274 -4784 -1101 5983 12253 9245 4167
320 4167 1242 -5061 -10645 -9464 -4648 -152 5308 9210 10193 6904 -34 -5895 -8004 -9493 -8117
335h117O363O797K294J385j183m967o131l537j409K250M552M068M431K498k726
350F568m792l868m185k855J419M769M884L657K082M9l596n383m096j376J79K086
366d458M772M909K093j039k475l804m599k870J47K961M209L815L022O18k503l857
382I41m117k455j139K006L629L953K565O79j453l218m115k736o40R01L414L665
398A880L216J542j197l251l484l130j410K17L182L588K709J586l0k751l824k763
414c920j410j85K215L942L000J686K67k041l244l727j548k96J145L654L484J659
430D681L67j671k681l096k382k10J163K851L383K621R6j095k130l602k904l29
446d938R08J727L477K765Q87q39k250k905j897j543N57K151K605K929J276n96
$$ plain form
335 -8117 -1754 5043 7337 8722 7539 2572 -3559 -7096 -8505 -6255 -1703 2365 6796 9294 6568
350 6568 1776 -2092 -6277 -9132 -7713 -2944 1940 5597 7679 7728 4132 -1251 -5347 -6723 -6544 -4458
366 -4458 314 5223 7316 6277 3802 -2 -4601 -7471 -7324 -4363 -154 3661 6683 7301 4798 941
382 941 -3176 -5631 -6770 -4764 -1135 2818 5383 6062 4609 1391 -2724 -5460 -6100 -5199 -1785 1880
398 1880 5096 6638 5441 2190 -1294 -4424 -5834 -5617 -2435 1153 3862 5448 5418 2667 -1157 -3920
414 -3920 -5330 -5515 -3300 642 3642 5328 5595 3554 310 -3417 -4965 -5261 -4116 -462 3022 4681
430 4681 5048 3377 696 -2400 -4782 -4992 -3829 -978 2405 5026 5122 4027 1897 -1705 -4609 -4938
446 -4938 -4030 -2303 1174 3939 4826 3987 1737 -1168 -3065 -4608 -4051 -1900 705 3634 4910 4314
462D314k374k204k383k442P82K499J574K252L112p46k627j437k662j979L78J671
478b272K019L002J253l06q32k071l570j170K08p8K816L544R96N35m45k871k498
495a740r63j704Q96L505J368J178K312j295l434j337j417j998J481J930J684K974
511C440P33j673o40j875l353o22J823J58J584L942N97j418n14k370l057q7k90
528c622J018L693J581l11J849j505l715o86r30j883K345K949K55J967J445k826
544A624j966m69k698n53K253J292J193K935j89j687l72k352k463J027J78J34L721
561A608J988j836Q23o91l894r93R78j351J755L778l69M42J602k742l000O27j784
578c059r36L168J923o7K581k14k998r2j429l066J830K073o10K665K441k430o42
$$ plain form
462 4314 1940 -264 -2647 -5089 -4307 -1808 -234 2018 5130 4384 1757 320 -2342 -4321 -3943 -2272
478 -2272 -253 2749 4002 3696 2864 793 -2777 -3947 -3739 -3817 -1001 2543 3539 4074 3629 758 -1740
495 -1740 -2703 -4407 -3511 -6 1362 2540 4852 3557 123 -1214 -2631 -4629 -3148 -1218 466 3440
511 3440 4173 2500 1860 -15 -3368 -3990 -2167 -2009 -425 3517 4114 2696 2182 -188 -3245 -3332 -3622
528 -3622 -2604 1089 2670 2359 4208 2703 -1012 -1698 -2628 -4511 -2166 783 1038 3005 4450 1624
544 1624 -342 -811 -3509 -4062 -1809 -517 676 3611 3422 1735 1363 -989 -3452 -2425 -2247 -2113 1608
561 1608 3596 1760 2583 1892 -2002 -2995 -2017 -3368 -1613 2165 1796 2238 3840 1098 -1902 -1275 -3059
578 -3059 -3995 -827 1096 1029 3610 3396 398 306 -1123 -4189 -2359 -286 -896 1769 4210 1780 1138
595A138L63l511j438J957p10J362L672m28q64J046j950l166O88k27j221L264K312
612B287j204J881j28l636m70J87k139N27L209j78R31K539k092j780J48k141j218
629c277J945P92M8L236oj736M06j391l029P45J009j122K832K385j384L67O82l260
647g58j488J174j628L95K933Q93l88J843j222k695K56j066j239K278R25l12K222
664B123J255l101R1l99k664J6J936l4J215K395j013j047O60k242j966J622k34
681a387j07K647J140j079P71q71k430M3J52j443K089J790q50J014Q76k063j095
698h03N31j825j21K225K4M77J872q97j128L47j664j548J378N35k53K195Q42j585
716F02N05m11k132l66J198q88P23K173j54o4N13j594j517O54q57k05J937O09j88
$$ plain form
595 1138 1501 -2010 -3448 -1491 -2201 -839 2833 2405 1541 2587 637 -2529 -1841 -2068 -3289 -25 2287
612 2287 1083 2964 2836 -800 -1270 -1083 -3222 -2695 514 336 1267 3806 1714 -66 82 -2059 -3277
629 -3277 -1332 -540 -492 2744 2738 1002 1408 17 -3012 -2267 -1258 -2380 452 2837 1453 1820 2502 -758
647 -758 -2246 -1072 -2700 -2305 628 1521 1133 2976 1754 -941 -685 -1751 -2990 -712 213 -99 2123
664 2123 3378 277 368 -31 -2695 -2679 -743 -777 438 2833 1820 773 1433 -809 -2775 -1153 -1387
681 -1387 -1494 1153 2293 1214 1985 1114 -1316 -1273 -1121 -2564 -475 1315 465 1479 2355 292 -803
698 -803 -272 -2097 -2218 7 31 508 2380 1483 355 702 -962 -2510 -1132 -597 -850 1345 2187 602
716 602 1107 696 -1436 -1802 -604 -1492 -769 1404 1250 1186 1699 105 -1412 -758 -1615 -1820 117 726 538
735E38J096j88j651K3l82j333P36J145j82J043J203j536m33N93k209m17J593l97
753g58O46J326M27r03K15j058j233M56k45j59J602P55m41P96j59j506n96J90j144
772a789J063J113Q1lJ300j104q75K95j184p50J272O12J28J126L0j081J96o08j104
791a282o7O56k12J230P94Kj89j8j403o09J35L44k33J621k49n4Q77q21j287K81
811d84m85n06R73Q77pO17L16q55l93n87m75K5P27RO86Q94l74n13j85q03q18L44
833a017K40M85J149N1p0k9l28j341J50K41o31Q97J026k24M2M85j311j47l58n13
853a203M36N07M92N04M64l23p80l4p45k26J1O35O09K66L99k83l19j62r48k45K93
874f52J09K41R17j21K51L07j058l95l51l49O71P43L40M2K90j73q09n66j73j40
$$ plain form
735 538 1634 1446 -205 -182 -564 -1897 -1161 -16 -198 845 2048 512 79 672 -1537 -1954 -361 -758
753 -758 -112 1214 1641 738 953 -105 -1338 -882 -1127 -1286 316 1071 630 1426 1267 -239 -835 -645 -1789
772 -1789 -726 387 468 465 1765 661 -214 81 -1103 -1853 -581 31 159 1285 1315 234 430 -178 -1282
791 -1282 -1349 -693 -905 325 1119 1121 932 914 -489 -1098 -963 -619 -852 769 520 466 1343 522 -765 -484
811 -484 -969 -1475 -502 375 368 985 1301 446 53 -534 -1009 -984 -257 -248 438 1332 958 445 260 -543 -1361 -1017
833 -1017 -777 -292 857 908 838 809 481 -860 -710 -469 -1100 -203 823 599 641 1126 -185 -332 -690 -1203
853 -1203 -767 -260 232 736 1200 877 97 63 -682 -908 -897 -262 347 613 1012 729 410 248 -700 -945 -652
874 -652 -543 -302 615 494 745 1052 -6 -401 -752 -1101 -430 313 653 695 985 812 3 -563 -736 -876
894h76K51P35K97K30N13n74m79q18j77r1L72J91O19P10l0J14p97n79l88j53K62
915f68L46N94N24l5J25q37l49l11m45Q3N85Q46J8J07J63l52m34l56n07oP11L62
937A64N17K20m05j70m23m20l16K34J66N90K77O48l71m50k25n73j52J69j94O36
957g8L85M24K40l91k33r24K9m14M59M39M58J67J99m99k49n06l27J21K61K37N30
978C28K96l3J00l91q24j8j52M8N62K18N00Q1k69j22m92l53j05k00O84N08K19M1
1000F26k50k74o0n45k07M5M52M54K97J16J6o61O2k72n94J54K07N59j28P37o1l45
1022C28l28j88l03l19L64M15L35J41K04m74j7n37m87J21M20J09N31M76m61k4o01
1043b95o1q1k89L87J45O28K75j85q3k36m11m26j48O30m9K94K01K46l83k37k04
$$ plain form
894 -876 -625 110 407 637 1150 576 97 -721 -898 -989 -617 -426 193 903 873 987 190 -389 -777 -930 -668
915 -668 -322 272 796 761 886 49 -300 -611 -1056 -973 -388 458 476 583 746 394 -40 -396 -903 -909 -198 164
937 164 681 901 496 326 -97 -517 -833 -599 -433 157 434 1082 711 261 36 -537 -689 -520 -714 -78
957 -78 307 731 971 580 347 -577 -548 -962 -503 -64 394 561 760 261 12 -494 -821 -700 -439 -202 328
978 328 624 591 691 300 -524 -542 -694 -646 -84 134 634 715 446 324 -168 -521 -626 -826 -142 366 585 626
1000 626 376 102 42 -503 -710 -665 -213 241 538 654 670 9 71 -201 -795 -641 -434 125 -3 734 673 328
1022 328 0 -188 -491 -810 -446 -31 304 445 649 175 158 -379 -866 -745 -325 -216 315 791 330 306 -295
1043 -295 -356 -437 -726 -339 -194 434 709 524 441 205 -206 -632 -780 -150 -199 95 296 542 159 -78 -282
1064b82k77j75L45K08J60L32J27P3l01n12k04n7Q0K98L84N23p1j50j87l09j80
1085a75k41J45J74N5J09L10J67l1l33m92k16J3L26Q1K16J97l6k08k31Q0j87n4
1107c31J41J19L37K19j86J01l46l67l35J88J72J43L55q4L1J71n54l5j6j85k5O45
1129A58p7J92pJ00l42k20j71M4J29J3K44K45N1o1l35j71k17LR6J69L94J07O1l14
1153I1Nj73r9o2k89L93j76L90L78l48K68m95p6j15J40R9J10j30K07J60l5p7j87
1176b1j27p4M4J56l2K85o7O0j32j54Q3m24J39R0K96J7j16P1J32m07q8J75R6Q0
1200H2j17L57k70q0l5J77m84m4K23K51J00J7j75K34m01J89j78K9K22j49J7K88
1222B53K2l5j11M5k93P1Q0m46L46j31K69p0J75J37l70j65J38k58K09M34l00J86
$$ plain form
1064 -282 -559 -734 -389 -181 -21 311 438 511 210 -302 -506 -563 -483 -185 199 722 651 501 314 5 -175
1085 -175 -416 -271 -97 -42 67 377 544 513 180 -312 -528 -515 -189 -108 108 305 269 61 -170 -90 -277 -331
1107 -331 -190 -71 266 485 299 400 54 -313 -648 -460 -288 -145 210 126 157 328 -226 -261 -277 -462 -487 158
1129 158 81 273 266 366 24 -196 -367 -323 -194 -181 63 308 359 298 -37 -208 -425 -422 -326 -157 237 344 405 91
1153 91 96 -77 -176 -238 -527 -134 -310 80 458 110 378 -117 -193 -308 -168 -69 41 -89 118 278 243 166 -21
1176 -21 -148 -222 -178 -22 -54 231 164 224 92 -62 21 -403 -264 -174 122 139 23 94 226 -181 -269 -94 2 82
1200 82 -35 322 52 -28 -63 114 -370 -414 -191 60 160 177 2 236 -165 24 -154 -125 97 -52 -35 253
1222 253 275 240 129 174 -119 -48 32 -414 -68 -199 70 0 175 312 -58 -223 -85 -343 -134 300 0 186
1244A86j02j12J18k20K4o4O0N8P6M9J98N2k79J19l52q3J64R5p6L47J40m21N8K8
1268F3J03k74J97j31L45k61OM10l63N4J4j96l39J90J38l7J57J72j51ql03J14j53
1291b53J32j33L10j78M19k1k26%k28j90L64o2M2N9J83k42qK07k78M3k57KK30K09
1315A24lM5J8j46r7q3j00J06K63r9O8K83k06k83N7N1k52K17K6J36p2m9M2L03l02
1340D7j73Jj24R9J37K12l72J24J19N8j07p3l62K61P5J87L6J22k79j16J75l01l63
1363f17O47N2j72K03NL9j31k93k31O61M5k12K12j00j55J38j32k04j46L42k20L26
1385E7NJ29L8J88k95k35q0j23j15M50J49p7q6K10k90k21J00l8J93K80j34k66M87
1408C26l28J65k49k14J37k09J27K57pJ19J79k21k32K30l36N3%L76k50L63k9l19
$$ plain form
1244 186 84 -28 90 -130 -106 -170 -110 -52 24 73 271 323 44 163 -189 -272 -108 -13 -89 258 398 -23 35 63
1268 63 166 -108 89 -42 303 42 48 458 95 149 163 -33 -372 -182 -44 -81 76 248 97 89 -214 -100 -253
1291 -253 -121 -254 56 -122 297 276 50 50 -178 -368 -4 -66 -24 35 218 -24 -32 175 -103 -60 -317 -315 -85 124
1315 124 121 166 184 38 -59 -142 -242 -136 127 28 96 379 173 -110 -53 -2 -254 -37 -11 125 53 4 46 349 47
1340 47 -126 -125 -249 -150 -13 199 -173 -49 70 128 21 -52 -414 -153 -78 109 145 267 -12 -128 47 -254 -617
1363 -617 30 82 -90 113 118 157 26 -267 -498 163 208 -4 208 108 -47 91 -41 -245 -391 -49 -269 57
1385 57 62 191 229 417 122 -113 -193 -316 -431 19 168 91 5 215 -75 -296 -196 -234 -41 239 105 -161 326
1408 326 -2 163 -86 -300 -163 -372 -245 12 5 124 303 82 -150 80 -256 -203 -203 173 -77 286 257 -62
1430f2p2J9%l05M76N7P7J44r4p2k25o1P3k27J71p2P10m82N1J69o90N72k79j51
1454b73K72R3K7K51k52l8Q2k61l26M38l97L62K12N2n2l74j3K28j46Qk21M42P7
1477A91p1M43j75k32j78k01P7J08L50l22L17L7m04k5N9k98n6K74L4m1L02j68n1
1500c0L9j7j53l73M91j48J93J41m3M1O3j98k36m1J52kr3J49L44l86R2j9j64L5
1524a63J73R5m0K39m28K11P5k51J50l01L1L23k41K20J14J10l52j96m5J18l23J36
1546c45N85k1M8j43o6j09k04N7L48k75K32j25M16k12QJ7Kk55J4K32k91J40J2L8
1570A03r3j11J44k56L1O5l3K43J3J4k7j33k74K27J11k70K54N0K24O0j91k77J70
1593D4l9k95rJ80K50n4L05m32l1q1K3K9k45M13k73L28j49K9r1L2JK53k17k2J9
$$ plain form
1430 -62 -134 -115 -115 -420 56 113 190 334 240 168 -57 -118 -45 -272 -101 -173 537 55 106 275 -415 157 -122 -273
1454 -273 -1 92 119 370 118 80 162 -99 -425 13 -384 -22 190 242 190 -184 -197 31 -115 -107 -328 114 191
1477 191 120 563 388 156 -22 -223 -146 -38 312 -10 307 344 -60 -85 -26 -324 -380 -106 -72 -113 189 21 -30
1500 -30 9 -8 -161 -534 -43 -191 2 143 100 141 204 6 -230 -271 -119 -121 -214 -65 279 -107 -15 -34 -198 -163
1524 -163 10 105 65 304 -124 87 162 -89 61 -240 -209 114 -127 93 207 317 -35 -231 -276 -158 -481 -345
1546 -345 240 219 267 124 58 -51 -255 -198 150 -125 107 -18 398 186 194 211 213 -42 -28 204 -87 53 65 103
1570 103 10 -101 43 -213 -182 -117 -150 93 106 120 93 -40 -314 -87 24 -246 8 58 282 342 151 -126 44
1593 44 5 -290 -299 -119 131 77 382 -50 -81 -162 -139 -110 -355 58 -215 113 -36 -7 -98 -66 -65 188 -29 -51 -32
1618c2K14q7j71j1J11j27r0N6K31r5J63j29j6J13k73J16O8j36J43J58k92M29m89
1641a46K38j32j30o3M0L72j93j26J36n1J83r4j15J88k70J77j08M28k55mJK28j52
1664A52k81N9Pk66K20J33m4K10j04q0k3J29l4l36K1M10k92K64j89Q7J61k35N3
1687B2j68J60RK98o7j92k28K10K8j87J80j17K05k72J37J71k91K67j35m35K94P5
1709c6L2N9k36J51K79j90l10J91k19l2K40n1L96N6m85K39k63L49k29J42j69J00
1731A4r2K00k80J58j47P4j11J57J6n7K60p3J4J79l76l02L55j78L58k46M71r2k50
1754E2l3j14L13j34o8j74M4Kj02M48q7l11K98m62M27Q9j34K02l15r4p0L18o4n9
1778b8O2n0J31j57j01M50k78J99k26j85J88L5j64j7mK43N9j15j41Q7j2l88J52
$$ plain form
1618 -32 182 95 -76 -87 24 -103 -193 -137 94 -1 162 33 17 130 -143 -27 41 -95 48 206 -86 343 -146
1641 -146 92 -40 -170 -233 -193 179 -14 -140 -4 -55 128 34 -81 107 -163 14 -94 334 79 75 76 304 152
1664 152 -129 -70 -63 -329 -109 24 -20 190 86 6 -17 112 78 -258 -237 173 -119 145 -44 43 204 -31 22
1687 22 -146 14 23 321 254 62 -166 44 72 -115 65 -52 153 -119 18 189 -102 165 30 -405 -111 -36
1709 -36 -4 55 -181 -30 249 59 -251 -60 -279 -311 -71 -122 274 330 -155 84 -179 170 -59 83 -86 14
1731 14 -78 122 -158 0 -147 -73 -184 -27 -11 -68 192 119 133 312 -64 -366 -11 -189 169 -77 394 302 52
1754 52 19 -95 218 84 16 -158 -114 -112 -214 234 147 -164 134 -328 99 188 54 256 -59 -153 -223 95 31 -28
1778 -28 34 -16 115 -42 -143 307 29 228 2 -183 5 40 -124 -141 -145 98 157 42 -99 -12 -24 -412 -260
1801b60K16j23J33k68M08K61j54n42L74l70M26J79m40M60k48J67m89L15k69rK73
1822D0K13j52O4m6p7P7j63m1o8m4J37k4K58nM9k63k88L48l1k19L27k47J09N08
1846D62k98m86L54j6M1M1m4k1lK56k35j13j08k0J66n8j86N01j25P6j68J7l09M5
1870b31J05R3j96L57k56O9J88J9o5m01J4L66k57J41K06k00M6K16l52K16k37k0
1892a79K7L08j87k2L90l12J06j49j39M7k71O25j46%q7O1j63M2P7j61l4l8L29k57
1916a33L59j91j13n7L40l44J66O4k2n8J96j55k21j78k05L13j06J12J69J35R7J97
1938C65o9m70J22L50l84O5M67m42J85k06n1k4R1q3J98j14j7L39m36K28q4O7l24
1961b27J74k03K31q7N3O9l5O0j6J27k10oL0O3J26q9j04M6j9L7m97M61r4J53m42
$$ plain form
1801 -260 -44 -167 -34 -302 106 367 213 -329 45 -325 101 280 -160 300 52 219 -270 45 -224 -233 40
1822 40 253 101 165 119 42 119 -44 -85 -153 -197 -60 -84 174 169 218 -45 -333 15 -16 -235 92 -155 -46 462
1846 462 164 -322 32 16 57 98 54 33 30 286 51 -62 -170 -190 -24 -82 -268 233 108 184 16 33 -276 -231
1870 -231 -126 -33 -229 128 -128 -59 129 148 83 -318 -304 62 -195 -54 152 -48 -2 214 -138 78 -159 -179
1892 -179 -152 156 -31 -53 337 25 131 -18 -157 -110 -381 244 98 98 11 72 -91 -49 28 -133 -167 -205 124 -133
1916 -133 226 35 -78 -135 205 -139 27 91 69 11 207 52 -169 -347 -552 -239 -345 -233 -64 71 168 365
1938 365 296 -174 -52 298 -86 -21 446 4 189 -17 -68 -92 -1 -84 114 0 -17 322 -114 114 30 97 -227
1961 -227 -53 -256 -25 -112 -59 10 -25 35 19 146 -64 -70 -40 23 149 60 -44 2 -17 20 -477 -16 -110 43 -399
1986c99P7M47M6l60m6K03j09K67j58K39p9K5k65l4n3k38M47k69J4K56J21k74M95
2009C53m66P1O6k07K65n9L0j16L44j12o1l62L51l3n3r8M9J40J32m4k95j82L01
2032A4l32J45J00K38o8J26L8j74l69L22m64J13K34j53K71M7O9j30m8j4J27m4n9
2055a1n5J83J62j57p6K4l2j6j06P9m7P8j29J81J09k80J04R0k70j08J16K16k20
2078a65J21L51j70l46k05J00Q4P9J34J15k33PL00m42K31l46Q3M14l43L57j08J0
2100B8J24j02l20L45l08J43p0K76pJ04n5J67j07l02k72K38Q8q3K73l11o9J32K38
2123A50k05k8o5J19o8J63L9K54j92k20r1j56K01J16j63J43n6M15k65l53N91n12
2145a83n6q1R6M15O6j69N5l49L09r1l0o9K03J35l53K82k35j53J61L2k06K52k47
$$ plain form
1986 -399 -322 125 171 -189 -235 -32 -141 126 -32 207 128 153 -112 -146 -199 -437 10 -259 -245 11 132 -142 353
2009 353 -113 -42 24 -183 82 23 53 -63 281 169 108 -254 97 64 11 -87 -38 102 234 190 -105 -287 14
2032 14 -318 -173 -73 165 97 223 261 87 -282 40 -424 -311 -77 -230 41 88 157 27 -21 -35 92 48 -11
2055 -11 -66 117 279 122 46 70 38 22 -84 -5 -52 26 -103 78 187 -93 11 101 -169 -277 -161 55 -165
2078 -165 -44 307 137 -209 -414 -314 -230 -151 -17 98 -135 -128 172 -270 -39 -385 -302 112 -231 126 18 28
2100 28 152 50 -270 75 -233 -90 -160 116 109 213 158 325 218 -84 -356 -118 -30 -113 160 -151 -220 -88 150
2123 150 -55 -83 -148 -29 -97 66 105 359 167 -53 -144 -300 -99 17 -146 -3 -59 356 91 -262 329 -183
2145 -183 -239 -320 -224 191 257 88 143 -206 103 12 -18 -87 116 251 -102 180 -55 -208 -47 -15 -221 31 -216
2168b16K64P7l12N2j01K59k88L56j45k27M33J81j1j76j11j8J09q0j34P4o9J47
2190F4p5O8L33n12M90m04L6L21m34L64j69J82k55J81k7j09n6q9J9J85R1k78j46
2213b20J73j33Q7pJk5p2K71J03l8l52K98j32r6l7J63%r3L01k70LRj08J93l76K10
2239a47J15j3N5j13J76l50J41J01k38j9J01N34l34K83l02k67L15m13j1N34l0l7
2261H1J89l31Q2M1p1l31L08P7k47K21L6L3k29K45n7M4j17j13J52J2N72n30J8l9
2285D6l9K63l24K69k53K45j33j50L12m59N9j41J29L21p1p8nJ48m9k88J5J99k31
2308b15n5J12mJ61K21l75M30l11j7J48k30J7K68J44J29k56p4l22K2M69k52p0J80
2331A20j32M16k72j54O2k12L71k30j65J16J73N6N1J2j43l87K69J44j84n9J80P5
$$ plain form
2168 -216 48 125 -187 -135 -236 23 -265 91 -54 -281 152 333 322 146 35 17 126 46 -88 -14 -83 64
2190 64 -11 57 390 -122 368 -36 0 321 -113 251 82 264 9 190 163 54 -2 -91 -72 113 204 -74 -220
2213 -220 -47 -180 -93 -100 -99 -124 -196 75 178 140 -212 86 -46 -142 -179 -16 -16 -109 192 -78 -75 -66 -174 19 -357 -147
2239 -147 -32 -45 10 -103 73 -277 -136 -35 -273 -292 -191 343 9 292 -10 -277 38 -375 -386 148 118 81
2261 81 270 -61 21 62 -9 -340 -32 45 -202 19 55 88 -141 104 47 91 -26 -139 13 25 597 67 85 46
2285 46 7 270 -54 215 -38 207 74 -76 236 -223 -164 -305 -176 145 74 -4 -9 139 90 -198 -183 16 -215
2308 -215 -270 -158 -162 -1 220 -155 275 -36 -53 95 -135 -118 150 294 423 167 93 -229 -207 262 10 -60 120
2331 120 -12 404 132 -22 40 -172 199 -31 -196 -80 93 149 200 212 69 -318 -49 95 -89 -148 32 107
2353A07k77L89j50q6j43l6J68J11k62J88oK61j66Q1m22L44J5j29j34J1J68L29
2375C61k00Nj57o7J05j44J5R0J15k97L3K21j17j93L86m01K66j47L88l60J48o6
2397a6l1k82J25q2K64k47L83k34J64l9k6l7L8k3k14k5J35J93J58k85J45p3j55
2420a64K45k45j11J94K40j22J65l44K07m6n03M90K0j05K70J0j85K7n7J20J07k03
2442A0rk62K71M4k3k8L8k5P5J20l06J42L41k90j31m6j36J43J86k7p6N3q4P3q7
2467c4k41J66K0q6K35P7j01k51K81k41j0M28m40k5O5Q9K57K4k29K03k81J1R9n1
2491c5m0J63K2K5m0J08j67J8L5l05R3L6L64n07j69Q76k78j56J04l12j59L24L4
2514C4M1j13N3M4j49K70o6j78k51K20J14J4P1l9j20nq7o8J75r3K49j24K59j64
$$ plain form
2353 107 -170 219 69 -17 -160 -196 -28 83 -179 9 3 264 98 179 -243 101 116 -13 -147 -136 32 361
2375 361 161 166 9 -58 47 -97 -82 8 123 -174 -141 80 -37 -230 156 -245 21 -126 262 -98 50 -16
2397 -16 -47 -329 -204 -286 -22 -269 114 -120 44 5 -21 -58 -20 -43 -257 -282 -147 46 204 -81 64 -9 -164
2420 -164 81 -164 -275 -81 159 37 202 -142 65 19 -484 6 26 -79 191 201 16 43 -14 106 213 10
2442 10 1 -261 10 54 31 3 41 16 91 211 -95 47 388 98 -33 -79 -215 -72 114 87 11 64 -20 53 -34
2467 -34 -275 -109 -89 -175 60 137 36 -215 66 -175 -185 243 -197 -222 -157 -68 189 213 -16 187 -94 -83 16 -35
2491 -35 -75 88 110 135 95 203 36 54 89 -216 -123 -87 277 -230 -399 477 199 43 147 -165 -324 0 34
2514 34 75 -38 15 59 -90 180 114 -64 -315 -95 19 33 104 65 -55 -60 -147 -215 -40 -133 116 -8 251 87
2538H7L6N2k08M7j55j65K69R6J6p5j4O7P1P0l37o8M59j17l2J5j25j6o8K03m1k51
2564a84O0L93l10Lmp1J3kmK19j49J16J11k16j52J16J03r4L0q5L9K42j96O7j38
2589i3L75j75m51K36N1N3P1%j37N0rk26M58l97J39O7J54k22K34l9J55j70l44M43
2613B23j87k42K63K3N0J7k81K84j3j28k94J01J58R3l11n8L75K24l61L95m48K23
2635A06j76J1J74j38Q9l4Ml8j4l43K76pk4J54J65j02j66k6PN8j97L19k09q1o2
2660b54L08m20M75m34K17L48l05q2N3K55j54l6L0j21J42J78j23l92L6K98m2m7
2682g0J9J68l1J59j22k04j6Q9o8L81k07j31J3k2J01J1k65L86p3o3Nj63K6l6J44
2707C1oj42L60j46Nk60K14O8k68j64L10l7O9J16k43K01j12K0l06N65k59q8K98
$$ plain form
2538 87 123 175 -33 14 -141 -306 -37 59 75 0 -14 53 124 194 -143 -211 248 131 99 114 -11 -27 -95 108 67 -184
2564 -184 -124 269 -41 -38 -42 -113 -100 -102 -106 113 -36 80 191 -25 -177 -61 42 -52 -22 -107 -68 174 -22 45 -93
2589 -93 282 107 -344 -108 -57 -4 67 67 -70 -20 -29 -255 203 -194 -55 12 166 -56 178 139 294 124 -220 223
2613 223 36 -206 57 80 130 147 -134 150 137 9 -285 -184 -26 67 -244 -302 73 297 -64 331 -117 106
2635 106 -70 -59 115 -23 66 32 36 -2 -16 -359 -83 -90 -114 40 205 103 -63 -89 -82 -24 -221 98 -111 -192 -254
2660 -254 54 -366 109 -325 -108 240 -65 -147 -94 161 7 -29 1 -120 22 200 77 -315 -279 19 -23 -70
2682 -70 -51 117 86 245 123 -81 -97 -8 -76 305 98 -33 -20 -42 59 70 -195 191 118 55 60 -103 -77 -113 31
2707 31 25 -117 243 97 102 -158 56 124 -144 -308 2 -35 34 150 -93 108 -4 16 -290 275 16 -72 226
2730B26k55j18L67m37K21j26Rl1K08oL09m01q3K05k32L3j8J6j46J13K74k28J7
2753h3j4K2R0j39QJ77k13K21K14l75K94K63m63k27k6P24p94O22k78nK67j67k18
2776a00K53J29j06j66K22j83RK0j01lj8j08Q4NJ61M1J19r2j23l91L15k5n0L85
2800B77j64l1l3k9J59l07J44K81m18J59j1Q5m2k86R2J18Q6p0j54J31J25k6O6L5
2824A87j52J46J9rk30J66p5k7j54J37K5J05j19k16j1L68n1l1N7L2l19j46L59N6
2848A17j6k11p2K54L4Q0k79O1m4QJ01j68q9M15j56J7%pK7J7j34j01O3K72P7l85
2874a19J98j88R1L9N1j09J44l3j39J80j90J36j36j96L84l69K81J48k97L56l02
2895g0P3l23K75m7m3J86l04J69J5J95j26O2J0j63j27K75J9l15J51K60p6k56J41
$$ plain form
2730 226 -29 -147 220 -217 4 -122 -113 -144 64 58 367 -34 -117 88 -144 -111 -129 -113 -259 -146 128 -100 -83
2753 -83 -97 -75 15 -124 -116 61 -152 69 283 -92 202 465 2 -225 -251 473 -321 301 23 18 285 118 -100
2776 -100 153 282 176 10 232 49 58 78 -23 -26 -44 -152 -68 -63 98 139 258 166 43 -348 -33 -58 -108 277
2800 277 113 82 49 20 179 -128 16 297 -121 38 27 112 70 -216 -124 -6 80 10 -144 -13 112 86 152 187
2824 187 35 181 200 191 -39 127 52 25 -129 8 33 138 19 -197 -208 160 109 78 135 167 -152 -298 61 117
2848 117 101 -110 -182 72 106 186 -93 -32 -76 -68 33 -135 -224 191 35 52 52 45 72 89 -45 -146 -83 189 266 -119
2874 -119 79 -109 -18 21 72 -37 107 74 -65 115 -75 61 -75 -271 113 -256 25 173 -124 232 -70
2895 -70 3 -320 -45 -92 -135 51 -253 -84 -69 126 0 62 72 -91 -218 57 76 -239 -88 172 96 -160 -19
2918a9J99j12M0j12J32j19R1k98L41l66K97j76Q4l22M50J08l22K12k1J3m9p8J6
2941a1l0K53p8m0P8p8k33K61m1m3Oj3N8l44K91j76L0o8M00J48l33j49L56m27K41
2966E8k55L02j7k88K54O4l13L72N6j41J46k79L1l30K86j2P8O1j02K76l69K86k18
2989e4qMK22j06J43l5k33J41K8j64J18J5j73K38j7J45n61K90k79J16L87m17k5
3012b25K20k0RK09k63M4Mn2P4l02K07L8K14k07n8L73k69R0R1k13J67O5k10N3n7
3037a8K40J3k16n6p5M76j66N8j74N6p3k66J22p1M7Q5Q1k19K79l1r6J13l1j96J17
3062aL40l95K0j64J58Pj04L09n0j76j14L31j79o2q8L8J11k7k2j05K69n9J4p8K6
3087aR9l52M27l94J98n1J18J27l93J58K34K2k86N0J22j73K50m48O64l29J14J27
$$ plain form
2918 -19 180 68 108 -4 128 9 100 -198 143 -223 74 -102 -18 -340 110 218 -104 108 87 100 51 -27 -11
2941 -11 -41 212 134 94 172 94 -139 122 81 38 44 31 89 -255 36 -140 -110 -178 222 370 37 -112 244 -183 58
2966 58 -197 105 88 -200 54 118 -195 177 233 92 238 -41 -10 -340 -54 -66 12 73 -29 247 -122 164 -54
2989 -54 -62 -58 164 58 201 166 -67 74 102 -62 56 71 -102 136 119 264 -297 -7 -286 -170 217 -200 -225
3012 -225 -5 -25 -16 193 -70 -26 -22 -74 0 -302 -95 -57 157 -50 -108 265 -4 86 177 -36 131 196 -14 39 -18
3037 -18 222 235 19 -37 -112 364 198 256 82 138 65 -201 -79 -150 -103 -18 63 -156 123 92 -4 109 78 -118 -1
3062 -1 339 -56 -36 -200 -42 -35 -139 170 120 -56 -170 161 -18 -80 -168 -130 -19 -46 -68 -173 96 37 51 -27 -1
3087 -1 98 -254 173 -221 -23 -74 44 171 -222 -64 170 192 -94 -44 78 -95 155 -293 371 42 156 283
3109B83m24J38l8M03o31J99P6k38m0J83J44o0K8p9K9j52J71m5q5K62l91K64L2
3132B9lJ4j07P2LK34o8k23L0K0J73l29K77j39M9l04J63m0J63N9J09k59M6K25k00
3157fO9j99J27O1j71R9K37k55L3J14j60L7k7O6m8J25q3K0K01k0k62k59L16n8P2
3182B9j46k16K33j83M26r9M3j29RJ03j26J46om5Q8j30Lj88k7J11O9j80J52J68
3206A05j62r1Q9K96l69K5J74k66L52j57N2P9K9k09P0j91J56Q6j20K19k94J53K39
3229B65n24N84p6m61m2K84k52R5j49K65J87j82Q5K07j89Q8j56J56k97J20r7j30
3251b19J80j15k6M59l00j1J94o0j73N0J93m5l38N4K17M9p7k02J56L4mJ6j59J12
3275a5L3M7J54m29Q9Q8K1K13k38k33J29o7RK13K15Q6l98K09j15r5K24q5J33j19
$$ plain form
3109 283 -141 -3 -41 362 -269 -70 6 -232 -272 -89 55 -5 23 -56 -27 -179 -8 -53 -138 124 -267 -3 29
3132 29 26 40 -67 5 8 242 174 -49 -19 1 174 -155 122 -17 32 -272 -109 -149 14 73 182 -77 -31 194 -6
3157 -6 63 -136 -9 52 -119 -20 217 -38 -5 109 -51 -14 -41 25 -23 102 19 39 240 220 -42 -301 15 -43 29
3182 29 -117 -333 -100 -283 143 44 87 -42 -33 70 -56 90 84 39 127 -3 0 -188 -215 -104 -35 -215 -63 105
3206 105 -57 -148 -59 237 -132 -107 67 -199 153 -4 48 127 156 -53 17 -174 -18 68 -52 167 -127 26 265
3229 265 -259 325 249 -212 -254 30 -222 -127 -276 -11 176 -6 79 286 97 185 29 185 -112 8 -89 -219
3251 -219 -39 -154 -180 279 -21 -32 162 102 -71 -21 172 127 -211 -157 60 109 32 -170 -14 20 16 32 -127 -15
3275 -15 18 65 219 -210 -121 -33 -12 201 -37 -270 -141 -208 -199 14 229 315 -83 126 11 -84 140 55 188 69
3299F9j39j1M0L22k32k26k46L46Mp9K87j06Q9q2k50J27NK91j11M6l32O5R9J60
3323A36k24J00j71J49k9L7q3K83l43J51k31L7L80j2j22q9j07K68l9j83K85j69
3345B4J13p4j1J5j10n3L31P7j94j98nO4j96J01J17n0l0K71k77L8j10J32K1K6P3
3370I5J18k19k80K52m7N2k45J84m8p5O12lm52J36j75J05J05k90K5J24K2j21k10
3393c35L15k26L62j42n5q0m7J09O2J37J14j50k3o9K28j44j29L2l0J80k15K28j62
3416d0J7l5O3j29K63k31J42j36k71M65r2l45M35j45R7L1K0o4j32j28K22mj7J19
3440A05k20J92j20J31L1j27Nj02M7k5j19L88k25n5j22J27J56o8J1K49k84M9k9
3463ek29R1K07k37J92J01L8q0j3k55J28j78K01l3OO6l33J84J70l36K53m4L37k20
$$ plain form
3299 69 -70 -81 -41 281 49 -177 -423 -77 -73 -152 135 29 118 36 -214 -87 -82 209 98 144 -188 -123 -24 136
3323 136 -88 12 -159 -10 -39 -2 -85 198 -145 6 -225 -188 192 180 58 -31 -138 130 91 -92 193 24
3345 24 137 63 52 67 -43 -96 235 312 118 -80 -85 -21 -217 -116 1 -49 -79 192 -85 -47 -157 -25 -4 22 95
3370 95 213 -6 -286 -34 -81 -29 -274 -90 -138 -213 399 396 -56 80 -95 10 115 -175 -150 -26 -4 -125 -335
3393 -335 -20 -246 116 -26 -81 -161 -208 -99 -37 100 214 64 41 -28 200 56 -73 -41 -71 109 -106 122 -40
3416 -40 -23 -58 5 -124 139 -92 50 -86 -357 108 16 -329 106 -39 58 89 109 45 -87 -215 7 3 -14 105
3440 105 -115 77 -43 88 119 -8 -3 -105 -58 -83 -202 186 -39 -94 -216 -89 67 -1 10 259 -25 24 -5
3463 -5 -234 -143 64 -173 19 120 158 78 65 -190 -62 -240 -39 -72 -66 0 -333 -149 21 -315 -62 -106 231 11
3487A1oL91l10k12o3K26L1j22J34K6l53K01K79k23j28M19k75pk25K34N9J86k71
3510Bl66M63j78J89l72L32j58K7N4MK8q2J2P3LP9p5l5k22J80j9j75K53K7K43j53
3536A34l06M2J01J29j18J67k25K38n09M08p9K68j77n5j4Q6J8o9j21q0J76m34P15
3559B95l61J79j99J57j2J33j06N1R1m24R8K17J27k87k7J11k01k9J3j21J22M20
3581B47k12o9J07J69o1O0l88K35l95N54m56K63p8j78L62m12L82k63K94l92K4o0
3603b67K19J13l12L20o2k56L47r0q9O0n4Q1R4j19J3j60lJ52J13j26J16nO7j74
3627b2q4K40j2k44R8J39k3k84p8L06K60n56K67J31k09LK15j9k03k32M20j18J25
3650A20l27j9K47j5j09j16J47J04j22K95J0j60l58L28p9L5J79j64n3K07j70J42
$$ plain form
3487 11 5 396 86 -126 -189 37 68 -54 80 106 -247 -46 233 10 -118 301 26 19 -206 28 87 273 2
3510 2 -364 99 -79 110 -262 70 -88 -61 -7 -3 25 -57 -45 28 31 110 35 0 -222 -42 -61 -236 17 44 287 134
3536 134 -172 -130 -29 100 -18 149 -76 162 -347 61 -18 250 73 18 4 90 108 39 -82 -162 14 -420 295
3559 295 -66 113 -86 71 59 192 86 137 228 -196 -98 119 246 -41 -68 43 -158 -187 -174 -295 -173 247
3581 247 35 -34 73 242 181 241 -147 88 -307 247 -209 54 -24 -202 160 -252 130 -133 161 -231 -207 -267
3603 -267 -48 65 -247 73 11 -245 102 12 -77 -17 -71 10 104 -15 -2 -162 -165 -13 100 -26 90 85 152 -22
3627 -22 -106 134 122 -122 -24 115 92 -192 -270 36 296 -260 7 138 -71 -68 147 128 -75 -307 113 -5 120
3650 120 -207 -226 21 6 -103 -219 -72 32 -90 205 215 55 -303 25 -54 -19 160 -4 -57 150 -20 122
3672A22k07O2J28k01o1J98r4k09J18K20J07l35M43k74j30m9k24K72K20K3l10J01
3694h0j21O3J81K69q1l62J84J30k33J02R1k02j47J54n2J08R4k61p4M18l80K93
3716I4q9J38n5%J1j22J09J78l37Q4k04K50N2k02Q4m2N0j9r9J54J09k01J61k04
3740a00m3k08M46n00K61P3K67l0m28n1M40q0j58j12P9L38r8l32M15k37R5j74J72
3763C5M9lp9m3J40L8k07N4o0N8M12m27J23j30K21J35m15J03QN5J1k27R8k1K26
3788A54j38L6n6K12l6j96K2J7R6k57M28l01K9l24J58J27J26j43Q3P0j35j6K2Q8
3812F6j90Qj11L95q5k10J31j05J45k05K70J62j13m43K36J94k10j29RL15k72K01
3834E9j21K37r1l09J79J0J7J87j77K2R4m7k06nM57m05K23k58K32p5j49J73K88
$$ plain form
3672 122 -85 -23 105 -96 -157 41 -53 -262 -144 76 183 -152 291 17 -113 -162 -386 -114 106 129 -181 -80
3694 -80 -201 -138 43 312 231 -131 53 183 -50 52 143 -59 -206 -52 -104 4 98 -163 -237 181 -199 94
3716 94 5 143 88 88 99 -23 86 264 -73 11 -193 57 109 -93 -9 -51 -1 -20 -119 35 144 -57 104 -100
3740 -100 -143 -351 95 -405 -144 -71 196 166 -262 -313 127 47 -111 -223 -144 194 96 -236 179 -58 37 -137 35
3763 35 84 81 2 -41 99 137 -70 -16 -76 -18 394 -33 90 -40 181 316 -99 4 12 67 78 -149 -51 -72 154
3788 154 16 52 -4 208 172 -24 -2 15 111 -146 282 -19 10 -314 -156 -29 97 -46 37 107 -28 -44 -22 66
3812 66 -124 -116 -227 168 83 -127 4 -101 44 -161 109 271 158 -285 -49 145 -65 -194 -185 130 -142 59
3834 59 -62 175 84 -225 -46 -36 -19 168 -9 13 107 60 -146 -151 306 -99 124 -134 98 23 -126 47 335
3857C35k56q9K29j49K12l26Q8j12m0K23k69r4J83J14R2Ok95J21jo9j22P0L57k0
3881A88J9l21KJ50j2o7j53K58N1j00P1j86O7JL93k40J08k38j35J61J9j30L07k24
3905a1l2p0J30l71L56p2J04J98l74L80Nl68K17m2j50J3M2J31l47L61M9q0n0L3
3929E2K4K74m47K59m07L94j85J01j66l08L14K29j9l04R3lJ9J33m9j12j77M67m07
3952b25K58j82J86O8j47J78k33K06k19N9o3J96K7j7j97k9J94R1j76q4J0L15m19
$$ plain form
3857 335 79 -10 219 70 282 -44 44 -68 -108 115 -154 -248 -65 49 141 147 -148 -27 -28 -97 -219 -149 208 188
3881 188 207 -114 -112 38 26 -41 -194 64 115 15 86 -100 -33 -32 361 121 229 -9 -144 17 36 -94 213 -11
3905 -11 -43 -113 17 -354 2 -70 34 232 -142 238 243 -125 92 50 -100 -87 -45 86 -261 100 149 69 19 52
3929 52 76 350 -97 162 -245 149 -36 65 -101 -409 -95 134 115 -189 -96 -99 -80 53 4 -108 -285 182 -225
3952 -225 33 -149 37 105 -42 136 -97 109 -110 -51 -114 82 109 92 -105 -134 60 151 -25 -109 -99 216 -203
$$ [...]
8191A16
##END NTUPLES=NMR FID
##END=
