##TITLE=1H_ED-18kmshot-TFA
 CDCl3
 8 sc, 
 29.9.2023
##JCAMPDX= 6.0         $$ Bruker NMR JCAMP-DX V2.0
##DATA TYPE= NMR FID
##DATA CLASS= NTUPLES
##ORIGIN= UXNMR, Bruker Analytische Messtechnik GmbH
##OWNER= root
$$ XWIN-NMR		Version 3.5
$$ Fri Sep 29 14:05:32 2023 Russian Standard Time (UT+4h)  she@DPX200
##.OBSERVE FREQUENCY= 200.13135
##.OBSERVE NUCLEUS= ^1H
##.DELAY= (6, 6)
##.ACQUISITION MODE= SIMULTANEOUS
##.ACQUISITION SCHEME= undefined
##.AVERAGES= 8
##.DIGITISER RES= 18
##SPECTROMETER/DATA SYSTEM= spect
##.PULSE SEQUENCE= zg30
##.SOLVENT NAME= CDCl3
##.SHIFT REFERENCE= (INTERNAL, CDCl3, 0, 15.7039)
##AUDIT TRAIL= $$ (NUMBER, WHEN, WHO, WHERE, WHAT)
$$ ##TITLE= Audit trail, XWIN-NMR		Version 3.5
$$ ##JCAMPDX= 5.01
$$ ##ORIGIN= Bruker BioSpin GmbH
$$ ##OWNER= she
$$ F:/spectra/data/she/nmr/H-F/1/audita.txt
$$ ##AUDIT TRAIL=  $$ (NUMBER, WHEN, WHO, WHERE, WHAT)
(   1,<2023-09-29 14:03:55.95 +0400>,<she>,<DPX200>,
      <created by zg, POWCHK disabled, PULCHK disabled
       configuration hash MD5:
       00 E9 B6 7A A2 85 ED C7 34 08 36 98 17 FE 4E 26
       data hash MD5: 16K
       B9 3D DD CE 57 CC 35 3A A8 DA 4D 41 65 4C EC 03>)
$$ ##END=
$$ 
$$ hash MD5
$$ 57 06 83 44 31 B0 CD 1D CF 54 3A D0 1C CB A1 07
##$RELAX= 
##$RELAX= 
##$RELAX= 
##$RELAX= 
##$RELAX= 
##$RELAX= 
$$ Bruker specific parameters
$$ --------------------------
##$DU= <F:/spectra>
##$EXPNO= 1
##$NAME= <H-F>
##$PROCNO= 1
##$TYPE= <nmr>
##$USER= <she>
##$AMP= (0..31)
100 100 100 100 100 100 100 100 100 100 100 100 100 100 100 100 100 100 
100 100 100 100 100 100 100 100 100 100 100 100 100 100 
##$AQSEQ= 0
##$AQ_mod= 1
##$AUNM= <au_zg>
##$AUTOPOS= <>
##$BF1= 200.13
##$BF2= 200.13
##$BF3= 200.13
##$BF4= 200.13
##$BF5= 200.13
##$BF6= 200.13
##$BF7= 200.13
##$BF8= 200.13
##$BYTORDA= 1
##$CFDGTYP= 0
##$CFRGTYP= 5
##$CHEMSTR= <none>
##$CNST= (0..31)
1 1 145 1 1 1 1 1 1 1 1 1 1 1 1 1 1 1 1 1 1 1 1 1 1 1 1 1 1 1 1 1 
##$CPDPRG= <>
##$CPDPRG1= <>
##$CPDPRG2= <>
##$CPDPRG3= <>
##$CPDPRG4= <mlev>
##$CPDPRG5= <mlev>
##$CPDPRG6= <mlev>
##$CPDPRG7= <mlev>
##$CPDPRG8= <mlev>
##$CPDPRGB= <>
##$CPDPRGT= <>
##$D= (0..31)
0 1.2 0 0 0 0 0 0 0 0.06 0 0.03 0 0 0 0 0.0002 0 0 0 0 0 0 0 0 0 0 0 0 
0 0 0 
##$DATE= 1695981835
##$DBL= (0..7)
120 120 120 120 120 120 120 120 
##$DBP= (0..7)
150 150 150 150 150 150 150 150 
##$DBP07= 0
##$DBPNAM0= <>
##$DBPNAM1= <>
##$DBPNAM2= <>
##$DBPNAM3= <>
##$DBPNAM4= <>
##$DBPNAM5= <>
##$DBPNAM6= <>
##$DBPNAM7= <>
##$DBPOAL= (0..7)
0.5 0.5 0.5 0.5 0.5 0.5 0.5 0.5 
##$DBPOFFS= (0..7)
0 0 0 0 0 0 0 0 
##$DE= 6
##$DECBNUC= <off>
##$DECIM= 32
##$DECNUC= <off>
##$DECSTAT= 4
##$DIGMOD= 1
##$DIGTYP= 9
##$DL= (0..7)
0 120 120 120 120 120 120 120 
##$DP= (0..7)
150 150 150 150 150 150 150 150 
##$DP07= 0
##$DPNAME0= <>
##$DPNAME1= <>
##$DPNAME2= <>
##$DPNAME3= <>
##$DPNAME4= <>
##$DPNAME5= <>
##$DPNAME6= <>
##$DPNAME7= <>
##$DPOAL= (0..7)
0.5 0.5 0.5 0.5 0.5 0.5 0.5 0.5 
##$DPOFFS= (0..7)
0 0 0 0 0 0 0 0 
##$DQDMODE= 0
##$DR= 18
##$DS= 0
##$DSLIST= <SSSSSSSSSSSSSSS>
$$ [...]
##$SUBNAM2= <"">
##$SUBNAM3= <"">
##$SUBNAM4= <"">
##$SUBNAM5= <"">
##$SUBNAM6= <"">
##$SUBNAM7= <"">
##$SUBNAM8= <"">
##$SUBNAM9= <"">
##$SW= 18.05172834244
##$SWIBOX= (0..15)
0 0 2 0 0 0 0 0 0 0 0 0 0 0 0 0 
##$SW_h= 3612.71676300578
##$TD= 16384
##$TD0= 1
##$TE= 0
##$TE2= 300
##$TE3= 300
##$TEG= 300
##$TL= (0..7)
0 120 120 120 120 120 120 120 
##$TP= (0..7)
150 150 150 150 150 150 150 150 
##$TP07= 0
##$TPNAME0= <>
##$TPNAME1= <>
##$TPNAME2= <>
##$TPNAME3= <>
##$TPNAME4= <>
##$TPNAME5= <>
##$TPNAME6= <>
##$TPNAME7= <>
##$TPOAL= (0..7)
0.5 0.5 0.5 0.5 0.5 0.5 0.5 0.5 
##$TPOFFS= (0..7)
0 0 0 0 0 0 0 0 
##$TUNHIN= 0
##$TUNHOUT= 0
##$TUNXOUT= 0
##$USERA1= <user>
##$USERA2= <user>
##$USERA3= <user>
##$USERA4= <user>
##$USERA5= <user>
##$V9= 5
##$VALIST= <valist>
##$VCLIST= <CCCCCCCCCCCCCCC>
##$VD= 0
##$VDLIST= <DDDDDDDDDDDDDDD>
##$VPLIST= <PPPPPPPPPPPPPPP>
##$VTLIST= <TTTTTTTTTTTTTTT>
##$WBST= 1024
##$WBSW= 4
##$XGAIN= (0..3)
0 0 0 0 
##$XL= 0
##$YL= 0
##$YMAX_a= 111588
##$YMIN_a= -106844
##$ZGOPTNS= <>
##$ZL1= 120
##$ZL2= 120
##$ZL3= 120
##$ZL4= 120
##$ABSF1= 10
##$ABSF2= 0
##$ABSG= 5
##$ABSL= 3
##$ALPHA= 0
##$AQORDER= 0
##$ASSFAC= 0
##$ASSFACI= 0
##$ASSFACX= 0
##$ASSWID= 0
##$AUNMP= <proc_1d>
##$AZFE= 0.1
##$AZFW= 0.1
##$BCFW= 1
##$BC_mod= 2
##$BYTORDP= 1
##$COROFFS= 0
##$CY= 11.3945322036743
##$DATMOD= 1
##$DC= 2
##$DFILT= <>
##$DTYPP= 0
##$F1P= 15.7292609196834
##$F2P= 12.9074282941183
##$FCOR= 0.5
##$FTSIZE= 0
##$FT_mod= 4
##$GAMMA= 1
##$GB= 0.15
##$INTBC= 1
##$INTSCL= 1
##$ISEN= 128
##$LB= 0.24
##$LEV0= 0
##$LPBIN= 0
##$MAXI= 10000
##$MC2= 0
##$MEAN= 0
##$ME_mod= 0
##$MI= 1.114404
##$NCOEF= 0
##$NC_proc= 0
##$NLEV= 6
##$NOISF1= 3.799351
##$NOISF2= 2.8
##$NSP= 1
##$NTH_PI= 0
##$NZP= 0
##$OFFSET= 15.70392
##$PC= 1
##$PHC0= -21708.75
##$PHC1= 8.852711
##$PH_mod= 1
##$PKNL= yes
##$PPARMOD= 0
##$PSCAL= 0
##$PSIGN= 0
##$REVERSE= no
##$SF= 200.130013532006
##$SI= 16384
##$SIGF1= 3
##$SIGF2= 2
##$SINO= 400
##$SIOLD= 16384
##$SREGLST= <1H.CDCl3>
##$SSB= 0
##$STSI= 0
##$STSR= 0
##$SW_p= 3612.71676300578
##$SYMM= 0
##$S_DEV= 0
##$TDeff= 0
##$TDoff= 0
##$TI= <>
##$TILT= no
##$TM1= 0
##$TM2= 0
##$TOPLEV= 0
##$USERP1= <user>
##$USERP2= <user>
##$USERP3= <user>
##$USERP4= <user>
##$USERP5= <user>
##$WDW= 1
##$XDIM= 8192
##$YMAX_p= 0
##$YMIN_p= 0
$$ End of Bruker specific parameters
$$ ---------------------------------
##NTUPLES= NMR FID
##VAR_NAME=  TIME,          FID/REAL,        FID/IMAG
##SYMBOL=    X,             R,               I
##VAR_TYPE=  INDEPENDENT,   DEPENDENT,       DEPENDENT
##VAR_FORM=  AFFN,          ASDF,            ASDF
##VAR_DIM=   8192,          8192,            8192
##UNITS=     SECONDS,       ARBITRARY UNITS, ARBITRARY UNITS
##FACTOR=    0.0002768,     1,               1
##FIRST=     0,             0,               0
##LAST=      2.2672688,     0,               0
##MIN=       0,             -106844,         0
##MAX=       2.2672688,     111588,          0
$$ Real data points
##PAGE= N=1
##DATA TABLE= (X++(R..R)), XYDATA
0 0 0 0 0 0 0 0 0 0 0 0 0 0 0 0 0 0 0 0 4 -7 8 -8 8 -8 8 -12 16 -16 16 -22 24 -27 31 -35 39 -44 48 -55 61 -67
40 -67 75 -83 91 -102 113 -124 138 -150 166 -184 203 -223 246 -273 303 -334 372 -417 470 -531 607
61 607 -704 826 -991 1227 -1585 2188 -3389 6627 -31904 -70398 64873 23529 -83167 27145
75 27145 111588 28606 12769 32980 21887 70561 61284 -55599 -39098 46974 -11606 -63623
87 -63623 -13008 -14477 -24584 6884 -32656 -74434 -21131 -1704 -29638 -19600 -21551 -15964 47624
100 47624 47037 -12717 20833 77710 38789 -3319 2003 6242 23558 25125 -21317 -20646 25200
113 25200 9567 -22719 -14662 -23750 -31884 -10936 -28697 -57946 -24071 9794 -5751 -11440 2361
126 2361 9192 22224 22505 -3180 -1958 28663 30069 9109 7200 20812 28855 19227 -2800 -9755
140 -9755 -2846 -7995 -23311 -31904 -27784 -16080 -10453 -14091 -13923 -7074 1245 3446 -3183 -7091 3784
155 3784 14790 12466 8463 14297 22223 25335 18930 5774 5174 10732 -1429 -13564 -9277 -7884
169 -7884 -9880 -6100 -10943 -16631 -8554 -7227 -15701 -13309 -9765 -10057 431 7761 1200 9004 25252
184 25252 19261 11298 16175 13036 9262 11705 2209 -3274 6753 4274 -8064 -5847 -4695 -13674
198 -13674 -13301 -13599 -21082 -16643 -8287 -10490 -7397 2223 2265 4974 12634 6712 3682 13987 13490 6472
214 6472 11688 13749 9926 12920 10310 781 1335 1030 -10839 -14214 -10073 -14473 -15333 -8868 -11061 -12578
230 -12578 -4676 -3676 -7865 -3572 -829 -1102 5380 8020 6964 13789 19442 13834 11282 13656 10038
245 10038 4468 2159 -1328 -3149 -1870 -4832 -7783 -5455 -6732 -11231 -11449 -12035 -13630 -12085 -8691
260 -8691 -6213 -2134 2367 5908 9079 10765 9436 9046 10006 7315 5103 6635 7167 6047 5958 4674
276 4674 2404 175 -3666 -7978 -10024 -11828 -13118 -11324 -8447 -6723 -4104 -984 383 501 420 1183
292 1183 1342 2126 2927 5244 8651 9781 10274 11167 10120 6207 1937 -858 -3504 -6190 -7264 -6669 -5699
309 -5699 -5056 -3993 -3179 -2665 -3696 -5185 -5382 -4573 -3459 -1730 1668 5576 8033 8325 9180 8250 5716
326 5716 2944 915 -1135 -2184 -2053 -1667 -235 545 611 -5 -1537 -4285 -6377 -7216 -7174 -7213 -4865 -1373
344 -1373 1435 3431 5075 6126 6039 4653 2572 1878 1071 594 1504 3044 3485 3196 2418 533 -1335
361 -1335 -4495 -7152 -7618 -7340 -8082 -6006 -1862 353 1464 3171 4078 2740 2310 784 -409 1522
377 1522 2245 1882 4272 6660 5424 4288 4090 522 -2180 -2960 -4844 -6911 -5553 -4445 -4116 -2353
393 -2353 -650 -1578 -1685 -1462 -3597 -3412 -1131 -599 395 4187 6617 7243 7798 7560 5865 4252 1650
410 1650 -960 -1310 -1698 -3246 -2174 -658 -1134 -2423 -2301 -2992 -4638 -5625 -5549 -4819 -2993 -1792 -511
427 -511 2515 3980 3701 4269 4417 2708 1753 2172 1865 2413 3631 3805 3416 3347 1554 -523 -1081 -3472
445 -3472 -6099 -5578 -5038 -6185 -4733 -2161 -1704 -821 64 -700 -218 511 -435 418 2695 2929 2822 5327
463 5327 5318 3318 3568 3203 713 -624 -1308 -2459 -1806 -796 -2065 -1312 757 -1267 -3658 -2552 -2474 -4042
481 -4042 -3422 -2004 -2005 -176 2360 1797 2512 3925 2803 906 1667 1488 243 1354 1987 690 1243 2346
499 2346 486 -1214 -786 -1873 -3512 -2828 -3150 -3040 -243 267 -994 996 2239 -534 -445 99 -1672
516 -1672 -165 1643 -495 201 3772 2048 653 2758 386 -1923 623 -781 -4297 -271 1818
531 1818 -2015 -546 2175 -957 -326 1580 -2960 -3550 2134 -406 -3026 2368 3664 455 2778 2403
547 2403 -1634 750 1632 -3769 -3265 1807 -888 -1794 1555 536 -389 1492 -964 -3554 -210 -280 -2442
564 -2442 -724 1078 1238 2958 2725 319 2144 2599 -888 -1027 548 -930 -560 1548 -58 -237 2719
581 2719 231 -2795 -1427 -1074 -3559 -2918 -1142 -2027 -236 2321 742 558 2520 1447 -1208 -119
597 -119 356 -991 927 2565 1362 1902 4087 1888 -362 258 -170 -2515 -2351 -2516 -2584 -937 6 -1238
615 -1238 -197 1047 -1032 -2194 -1142 -2129 -1667 36 149 909 3124 3194 2255 3350 1800 -14 1340
632 1340 67 -2126 119 1542 -600 457 2055 -115 -655 -418 -3059 -3302 -1174 -3370 -3688 2
648 2 287 -895 1584 2228 -106 680 1286 -964 22 1280 383 1653 3868 2227 1882 3120 955 -896
666 -896 -322 -1850 -3136 -1525 -1522 -1777 -47 319 -749 35 -615 -1906 -1279 -898 -2379 -796 1141 749
684 749 1366 2919 2251 1301 1805 463 -163 601 -110 -418 903 1555 397 397 1087 -436 -1590 -1798 -2173
703 -2173 -2179 -1844 -1380 -668 539 752 651 1042 883 -242 -418 -27 -30 -69 235 1567 1361 1363 1416 917 318 -86
725 -86 -840 -1198 -1169 -771 -305 11 435 349 376 172 -944 -1327 -896 -1050 -787 -565 380 860 1281 1328 735 695
747 695 -12 -1166 -867 -404 -719 -774 -142 514 111 393 128 -305 -344 -1217 -998 -213 309 181 799 1422 1079
768 1079 614 673 193 -672 -755 -1090 -1148 -371 -191 -132 670 239 -604 -632 -545 -1299 -1077 -1093 -701 -188 548 1158
790 1158 1440 1725 1055 652 680 335 -11 658 986 543 172 972 754 -95 -645 -1265 -1625 -2016 -2252 -1929
810 -1929 -852 -536 -372 -26 532 241 -117 56 281 112 406 528 838 1397 2028 1813 1912 1265 477 -87
830 -87 -359 -878 -1202 -714 -814 -555 -726 -490 -661 -1255 -1434 -1848 -1703 -1444 -684 -358 799 1195 1243 1810 1799
851 1799 1078 1078 799 791 300 744 817 1281 1044 521 451 -171 -945 -1939 -1910 -1651 -1972 -1388 -1211 -326 144 -50
873 -50 -35 463 65 -507 -121 193 421 875 1576 1845 2151 1626 1357 803 172 -676 -600 -693 -1256 -522 -379 -484
895 -484 -453 -223 -601 -828 -841 -1435 -1031 -436 -636 -277 1177 1326 931 1227 1018 298 132 -319 -270 59 437
916 437 -64 689 865 47 14 274 -934 -1151 -1109 -1671 -806 -111 -457 -85 1234 563 65 583 116 -727
936 -727 -231 -224 -480 385 673 21 890 983 -395 -298 26 -980 -1287 -287 -523 -369 906 643 249 959
956 959 589 -194 405 425 -821 -64 833 -163 684 1302 122 -75 -4 -748 -849 -963 -1486 -1204 -282 -339 -742
977 -742 485 506 -298 -14 -209 -363 99 68 191 954 1589 946 990 1486 665 -83 71 -321 -834 -423 -600
998 -600 -625 -335 -357 -770 -446 -798 -1103 -1297 -907 -911 -893 -100 578 1157 766 1405 1632 873 454 753 130 361
1020 361 842 640 159 1021 528 -533 -453 -922 -1671 -1168 -1439 -1362 -1233 -346 -349 -194 113 -271 163 226 -397
1041 -397 15 858 528 738 1353 1679 1286 1046 594 632 175 -506 -781 -327 -332 -609 17 -192 -869 -609 -607 -1138
1063 -1138 -1178 -883 -867 -505 -16 330 718 984 849 662 962 527 -70 185 209 390 494 453 487 726 279
1084 279 -408 -105 -354 -1173 -1033 -566 -692 -638 -39 223 128 352 -81 -218 -50 -411 -607 482 444 -8 479
1105 479 1026 475 432 202 -435 -169 -399 -891 -139 2 133 351 441 191 76 238 -235 -516 -384 -47 -244
1126 -244 178 523 176 462 219 -266 -439 -241 -995 -851 -288 -248 -352 125 272 494 665 -12 -489 -28
1146 -28 37 -531 302 764 808 663 744 957 399 349 -320 -752 -414 -468 -566 -503 -197 -298 -327 -341 -218 -788 -882 -523
1170 -523 -476 -324 168 396 811 1156 1064 1089 495 544 295 361 534 213 125 710 307 -6 73 164 -932 -682
1192 -682 -649 -1051 -1078 -919 -433 -579 257 -283 96 431 272 -534 227 478 458 327 945 1051 990 1292 372
1213 372 666 213 -544 -493 -418 -510 -757 -470 -185 -410 -404 -648 -862 -660 -619 -931 -363 60 99 527 578 1020 606
1236 606 453 571 91 11 306 67 -14 480 545 614 369 204 -346 -316 -774 -1060 -641 -255 -481 -211 -39 374
1258 374 -167 141 -40 -260 -224 -86 -70 -28 443 326 519 583 497 121 -61 -231 -293 -408 -346 -313 39 160 228
1281 228 -50 365 -305 -382 -32 -526 -361 81 112 83 290 312 354 115 -119 -215 -336 -436 -385 -185 280 79
1303 79 301 715 522 -35 224 77 63 146 75 220 502 361 414 166 394 -155 -360 -412 -700 -393 -485 -377
1325 -377 -225 244 -42 -36 -360 -282 -400 -418 -410 -36 -57 731 431 658 901 553 763 425 166 6 68 -82 -296
1348 -296 252 210 -183 23 -75 -351 -449 -724 -871 -595 -245 -333 177 356 281 314 383 245 39 -53 296 5 372
1371 372 498 652 503 671 4 267 154 -460 -493 -336 -493 -302 -163 -32 -225 -312 -205 -430 -321 -491 -527
1392 -527 -394 -162 -37 309 428 530 582 383 353 77 -150 -152 -61 8 187 646 362 164 316 92 -222 -356
1414 -356 -420 -744 -232 -318 -157 -309 333 290 -227 160 -221 -213 -256 -152 -143 301 53 230 659 590 -9 202 192
1437 192 97 -371 -52 65 48 35 130 -46 130 -231 -291 -133 -358 -417 -320 -469 -384 251 -256 26 -75 -118 55
1460 55 205 -77 -100 1 241 304 505 356 256 161 -138 162 78 49 -135 103 115 158 -149 11 -70 -71 -219 -578
1484 -578 -346 -505 -336 -300 -121 -48 120 82 171 35 255 -81 142 155 166 181 487 519 103 493 286 71 70
1507 70 152 -364 146 -113 -244 -320 -12 -205 -104 -271 -321 -419 -386 -253 -222 14 -71 47 270 266 128 510 306
1530 306 -36 215 334 -48 199 345 229 224 49 -158 226 -5 -398 -276 -167 -309 -259 -63 -62 224 2 -199
1552 -199 -159 -250 -427 -220 -29 142 152 165 314 195 354 442 -241 163 285 -17 -78 298 391 7 362 195
1574 195 -61 -135 -40 -618 -399 -370 -454 -365 -271 -210 196 76 -228 -361 14 -397 -194 66 30 72 384 435 485 438
1598 438 139 61 106 10 -115 19 90 -61 -61 301 67 -298 -80 -321 -253 -413 -503 -370 -138 51 9 -107 63
1621 63 198 -66 36 -138 58 188 348 416 537 612 500 302 89 -64 30 -98 -102 -152 -180 -86 -400 -224 -441
1644 -441 -363 -385 -440 -299 -265 -458 -161 -49 110 348 267 355 452 485 -50 80 411 104 -62 356 336 242 20
1667 20 10 25 6 -391 -362 -159 -323 -530 -384 -188 -253 -81 327 -178 34 80 -183 81 114 -152 -79 197 492
1690 492 172 70 52 77 -297 -109 53 -106 -32 -143 -146 83 308 46 -13 -121 -362 -176 96 -177 123 275
1712 275 68 -63 131 333 300 43 -156 -125 64 -6 -177 -108 207 262 112 -73 48 -160 -199 -202 75 204 131
1735 131 127 107 360 89 -292 -275 -228 -75 -354 -19 -367 -313 -100 -234 -26 -6 -236 -130 -103 -259 12 -45 251
1758 251 13 314 588 183 270 430 147 143 29 -6 142 -23 -66 -106 128 -150 -76 -459 -264 -511 -707 -218
1780 -218 -232 -30 80 -34 234 80 87 -22 35 301 347 731 614 321 288 68 407 210 37 -9 -44 -30 -192
1803 -192 -195 -227 -83 -113 -260 -127 -138 -101 -515 -403 -195 -116 55 249 192 277 213 143 293 183 427 391 316 2
1827 2 320 140 -201 -127 -210 -195 -408 -384 -374 -337 -271 55 -63 115 -491 54 3 -11 59 139 -65 285 141 267
1851 267 395 -10 587 131 -45 24 -92 180 -543 247 -104 -141 -22 -162 -212 -234 -124 -266 -33 -123 50 -28
1873 -28 -1 281 140 82 -30 155 237 112 29 -31 29 286 -65 118 163 64 -310 51 179 -14 -121 -332 -215
1896 -215 84 33 -81 124 150 89 -215 -132 36 -103 -170 -106 -206 -82 -46 -242 -149 -480 -87 -55 -61 -20 -215 281
1920 281 12 67 109 274 314 311 92 235 -2 -107 -187 306 219 -140 159 -68 -81 -356 -261 17 -148 -345 -244
1943 -244 87 -189 -86 -40 114 293 56 154 210 370 418 225 470 475 195 73 249 122 -180 -170 -142 -166 -202
1966 -202 -229 -207 -126 -186 -266 -202 -335 20 -225 -147 15 64 274 453 119 188 199 200 458 71 241 39 -83 -145
1990 -145 119 66 -155 -289 -407 -353 -465 -302 -220 -298 -170 -179 -193 100 40 178 -111 59 36 118 179 135 -74 79
2014 79 205 -147 201 -104 235 -266 -4 -127 -183 -236 -40 -125 -75 -412 -167 -278 -444 -161 -62 -46 -1 61 13
2037 13 114 11 -8 -29 127 -139 155 -76 3 135 37 -145 124 328 -117 21 21 -60 -282 -138 -142 -185 323 202
2061 202 121 -30 292 24 -106 41 -154 -41 60 -92 -424 -358 19 -89 -5 -126 -173 -67 -219 138 -19
2082 -19 72 -32 88 212 78 308 46 82 80 -16 134 109 -126 -208 71 47 -248 -207 -246 46 -340 -2 -132 30
2106 30 -48 198 -166 120 116 -82 241 227 271 312 214 363 450 185 6 208 -71 224 45 -180 -112 -81 -334 -104
2130 -104 -338 -179 -78 -310 -190 -351 -174 -252 320 -155 110 44 49 259 350 406 547 271 -39 -39 155 352 111
2153 111 16 17 -116 -129 -179 -323 -451 -342 -3 -324 -186 -465 -116 394 44 173 13 238 114 186 348 191
2175 191 283 119 111 351 401 177 -12 -119 -151 1 25 2 -93 -117 -176 -279 -107 54 -342 -156 -128 -162 -158 45 218
2200 218 185 -145 55 378 -100 -148 -12 -60 214 -167 -44 169 17 -65 101 -1 -25 25 -16 -56 57 41 -26
2223 -26 115 -132 -203 -1 -387 -67 35 42 55 -109 -151 -244 93 -172 88 -15 18 302 37 -95 -74 111 171
2246 171 207 229 369 -25 -195 -101 216 -198 -25 40 -32 -57 -340 -40 -226 76 -97 -54 -225 36 35 99 -23
2269 -23 101 64 83 190 269 214 191 216 89 251 317 136 210 146 -213 -10 -121 -85 -186 -301 -34 -96 -216 -166
2293 -166 -263 -101 -209 -37 178 -215 103 -83 149 150 116 205 206 229 34 -3 472 -66 200 188 -23 -116 27 42
2317 42 -376 -15 -241 -266 -253 143 -51 -195 -40 -33 -331 122 188 25 97 129 160 -49 99 148 150 96 201 189 107
2342 107 204 -250 205 -31 36 -50 -80 -397 -199 204 -283 54 -160 -94 -44 -105 -106 123 -181 -64 -15 -40 21 -28
2366 -28 14 37 -384 82 81 11 -68 7 -80 335 20 -445 134 -23 114 -118 51 74 -4 -15 -52 108 -111 -82 -66
2391 -66 -129 -123 55 80 349 -177 208 140 -66 221 -23 -118 63 123 206 76 147 -31 -11 214 -24 209 -284 -241
2415 -241 -158 13 -346 -68 -81 137 52 -100 20 59 -138 -298 -277 -25 -20 170 -40 45 115 200 302 -175 192
2438 192 88 -155 262 -269 -44 -208 -56 55 15 -163 -376 -59 244 -78 -171 129 -210 -240 -116 -32 -77 -48
2460 -48 110 -92 28 -54 -214 124 21 328 118 -125 47 237 235 49 -30 -91 -88 -173 -89 -68 -81 -1 16 35 -116
2485 -116 -350 96 -53 -188 -160 127 -67 -189 39 66 40 -97 79 127 -103 175 276 404 -238 -24 64 100
2507 100 117 -244 115 -81 -165 150 -66 -131 -146 34 -96 -122 -33 -153 -76 11 16 -117 163 -67 114 103 256 175
2531 175 338 21 -78 30 33 164 -19 270 154 -32 -100 -35 -141 -32 -268 -103 -16 -33 -35 116 4 20 -136
2554 -136 -295 -93 -197 82 -189 -69 -111 96 345 272 190 44 44 234 83 147 109 -57 62 -61 -61 25 -181
2577 -181 202 2 47 -336 -308 -125 -197 -41 -271 2 -263 -44 77 -173 -224 -63 133 191 211 133 41 93 134
2600 134 17 135 -150 163 -327 -49 -254 -254 -206 -252 -94 -320 -125 -125 118 -118 123 -132 171 -64 -201 -189
2622 -189 17 3 -296 -18 -127 -226 79 151 -92 110 -108 353 -28 269 -110 118 73 208 -155 -139 18 -170
2644 -170 239 -171 -134 -122 -57 -108 48 -128 -117 204 167 86 162 3 -20 -43 44 237 188 11 135 -154 236 -5
2668 -5 -121 -6 10 -191 92 134 -145 17 -164 -28 36 -263 -58 28 54 156 -119 40 -32 21 -33 -81 90 39
2692 39 -240 81 79 -59 148 -114 90 2 -189 47 -36 -186 -110 -45 50 -467 -139 -64 -58 -289 168 -326 -131 185
2716 185 -12 -82 90 36 85 84 65 -327 -85 19 -1 -71 129 131 -66 17 103 -31 -146 44 -17 38 -101 58 -265
2741 -265 -102 -142 -261 -43 269 -7 -42 -273 -161 -68 -31 161 66 9 -40 -12 181 -87 -38 -121 -137 -212 180 -88
2765 -88 -20 -192 231 20 114 -218 -22 -67 -128 128 -77 -180 -177 -24 -238 -79 -156 2 -91 -285 -2 -28 173
2788 173 5 169 266 -177 121 -117 256 239 305 52 -85 28 -163 6 -25 43 -114 -253 -110 101 76 -285
2810 -285 -32 -339 -27 79 -1 -7 176 111 -40 17 -66 342 156 -221 99 -26 86 107 -59 -300 -43 -27 -8
2833 -8 47 5 -18 93 -53 -42 146 -50 -103 -200 34 33 -24 240 170 -53 143 -64 107 -1 90 6 176 119 201
2858 201 215 18 -33 85 -153 -337 -44 -153 0 -218 -227 -235 168 74 -14 -129 109 77 7 -147 -9 -2 -169 68
2882 68 -180 -32 39 -25 -144 170 85 -35 -29 99 153 31 97 107 -34 -30 67 79 104 82 75 130 -76 -173 131 215 207
2909 207 -17 -33 -121 136 -2 54 85 83 144 100 -64 222 103 273 55 269 175 127 146 -4 -80 15 -50 -114 54
2934 54 -136 -138 -237 153 229 -214 70 67 252 166 140 134 152 27 23 -5 231 -107 -64 140 -95 115 -38 -96 61 -254
2960 -254 -100 71 -135 379 21 -41 -31 -42 -179 -3 8 -41 15 -267 20 -74 57 20 232 -139 101 223 69
2983 69 153 -63 92 15 107 61 -171 -308 49 -160 96 65 95 -70 -43 166 -39 -203 -115 -168 -142 30 68 -158
3007 -158 -67 95 -182 56 62 -112 -44 -1 -120 262 248 384 232 -158 106 -149 -13 82 -166 141 327 -194
3029 -194 -61 61 41 104 76 107 -17 -221 83 118 -234 -179 189 136 180 269 69 84 71 26 16 24 -197 25 134
3054 134 -46 6 -35 144 -150 6 -322 -55 100 17 -194 198 -116 -212 -165 -33 -56 2 -14 -26 120 294 -152
3077 -152 -99 75 135 181 191 197 -88 248 -16 120 -49 163 101 -18 41 -51 13 -19 -179 327 126 -29 -164 -231
3101 -231 200 -76 -247 -200 27 -164 0 -67 -198 35 12 -37 200 -13 93 155 129 -66 -67 -153 -37 -286 184
3124 184 96 12 -295 94 37 184 174 175 -221 -376 -328 -153 -88 -288 194 322 -63 -67 5 -3 245 19 91 -40 -33
3149 -33 272 -216 221 27 -60 296 -5 -24 72 -141 64 -3 -90 -161 102 -68 -172 233 149 95 -185 -16 -13 -91
3173 -91 10 95 -186 333 159 -87 -51 184 -101 -77 -144 45 -108 -142 -85 113 222 55 -115 -29 -120 -100 -58 -150
3197 -150 275 5 44 353 157 123 -157 -56 -69 -7 -170 -16 25 -161 117 120 -56 6 247 139 12 -139 80
3220 80 18 38 128 -46 201 -173 -167 140 -106 -187 -46 -91 -103 -133 -245 -48 137 56 64 107 46 -71 -35 81 265
3245 265 -71 159 15 -35 -17 -119 115 24 20 -78 -25 -300 20 -84 -16 -211 -52 -137 -357 150 -130 64 32
3268 32 28 32 12 106 138 -77 113 -6 -68 18 146 12 -1 266 -151 -7 107 32 76 47 43 -3 70 -314 -120 -59
3294 -59 5 -176 -8 101 3 -10 194 132 -37 118 -35 31 51 -41 78 -85 51 -230 -49 -115 233 -149 102
3317 102 -259 238 -268 -49 185 72 45 -52 -56 142 44 100 147 -67 -176 198 -156 119 97 146 215 -236 -19
3340 -19 176 170 237 -33 152 56 343 17 62 -56 -140 88 -4 -135 35 -56 -134 -14 -168 -9 51 59 -122 63
3364 63 99 -121 -136 117 123 -6 -50 123 106 60 142 58 -129 -63 -77 -33 10 57 95 155 155 -108 -41 82 97 -118 -15
3391 -15 -47 8 93 -24 -77 5 -242 -40 -33 -17 -47 -123 135 145 94 43 -12 33 -8 92 -17 -163 -102 0 -29 -108 30
3418 30 11 -121 260 5 -229 109 87 59 -12 140 251 22 -156 -228 -162 305 214 -262 127 12 44 110 -167
3441 -167 23 -48 68 74 106 -71 -87 -129 44 15 -54 27 -13 164 4 123 -247 33 275 -104 155 98 -53 121
3465 121 41 124 -82 -14 79 -178 146 19 -19 -228 47 56 -84 58 -184 140 -10 32 -68 82 -52 3 -99
3488 -99 -206 -156 116 -48 233 77 159 -36 -207 43 -124 13 -85 -55 -146 -20 147 -100 72 24 48 -109 211
3511 211 -50 72 -68 -50 16 -102 34 -159 -99 -110 132 129 -77 -344 23 -192 96 91 -169 -143 153 -117 -21
3534 -21 94 13 36 -48 -120 -83 36 157 113 214 106 67 265 11 77 -62 202 265 -52 -67 -60 -33 70 -131 29
3559 29 174 188 82 -177 28 -66 -7 -113 -29 -134 -44 98 75 215 -7 -111 244 -162 -22 -208 39 190
3581 190 -74 -168 -50 -85 87 -40 49 195 123 53 43 88 -135 99 149 -101 -212 -210 -153 -20 58 18 -147 86
3605 86 168 -241 23 134 -13 6 -96 -69 55 33 94 139 -58 40 -200 85 122 -40 127 35 63 260 91 -161
3629 -161 -3 -106 -8 -3 99 81 59 43 -53 8 -27 36 -111 -47 57 -189 -125 -96 -13 68 13 -32 -254 83 -3 -79
3655 -79 -174 143 -93 94 -46 90 95 133 256 76 29 90 270 55 -39 36 112 407 168 -116 151 -53 57
3678 57 -43 53 326 -39 -141 -375 -172 6 82 67 -215 10 54 67 -15 92 121 58 141 29 40 -20 115 56
3702 56 8 68 -71 -125 44 -92 -103 -105 -151 -118 -315 76 34 -201 -171 -93 -70 -22 -87 43 19 -70 -13 46 303 155
3728 155 -53 75 44 -77 25 321 39 152 133 -230 50 -160 -149 90 211 -163 -5 -120 -153 -30 19 130
3750 130 32 161 -10 125 150 178 18 -249 -45 154 -100 122 83 50 141 -30 -70 160 -48 -314 -29 -145
3772 -145 -190 1 86 -95 67 85 99 43 -38 -71 11 226 215 -31 137 -240 -224 61 228 -39 167 209 197 251
3796 251 125 -177 -180 8 85 -111 125 -187 -29 -65 -145 67 -244 46 2 -168 -74 131 -3 49 -19 -73 89
3819 89 38 -84 59 127 -36 8 -53 -188 223 -61 46 50 210 36 20 148 144 86 -46 -73 27 -126 -181 -162 46
3844 46 286 -228 -68 60 104 -150 -172 10 302 91 60 355 115 96 -153 -220 -169 -9 66 122 232 -7 103
3867 103 -87 -317 135 146 -18 20 126 -88 -95 137 50 -86 -114 -101 70 138 -3 187 229 -71 19 93 81 -76
3891 -76 -167 71 -230 -173 18 -128 -95 38 225 84 225 6 -39 122 -110 -32 153 -17 -161 60 24 34 213
3914 213 163 -170 -133 164 -35 19 45 173 -151 -90 148 276 -3 -88 139 115 -80 -234 -159 -284 60 44 -100
3937 -100 4 -5 -98 -75 -193 86 146 -146 -129 -133 -57 103 76 -73 19 4 -117 -28 3 -91 63 45 277 185 -14 220
3963 220 -233 137 -265 81 48 257 256 2 -167 10 33 22 -166 4 305 -177 34 -20 -64 -139 112 -51 -153
3986 -153 150 150 -38 -242 117 -50 25 185 -133 79 -171 -9 -39 -215 -79 -93 161 339 -26 26 -164 -229
4008 -229 -59 133 -240 113 -186 -107 -51 34 227 139 76 272 234 149 502 -146 238 -132 -80 243 183 -268 163
4031 163 41 -75 79 -245 -173 -129 -98 -35 -229 -139 93 49 137 -186 -57 148 167 -117 16 -57 102 -143 -146 -77
4055 -77 183 60 -130 65 211 93 -163 -263 89 -78 -339 -16 -53 100 107 39 73 -52 -45 42 -15 289 -65
4078 -65 60 -73 393 47 261 165 -60 -68 -137 -24 106 168 -71 -92 131 -327 1 -60 -260 -88 32 -254 -95
4101 -95 40 8 148 -14 26 -362 138 202 -111 278 -20 -41 -109 26 -83 130 160 48 -293 -145 251 108
4123 108 -282 -170 -152 -94 185 -55 -151 61 -26 45 -200 321 65 124 91 -117 -233 -75 -104 -11 -228 -13 138
4146 138 -29 177 -177 87 -130 231 181 17 -179 -43 -53 -184 166 2 -308 -28 -145 97 77 -136 -12
4167 -12 -14 98 67 -16 -237 -169 18 -185 192 54 39 134 -177 39 -85 140 -17 -215 248 56 -87 69 -115
4190 -115 -57 97 25 196 -61 -111 -20 -29 -243 -88 -118 134 -13 175 -50 -105 -60 20 59 121 10 71 -137 18
4214 18 63 45 189 -273 -29 -15 -132 -100 -168 -22 -119 -62 -61 23 -208 -90 102 97 -104 101 -153 -191 80 -62 151
4239 151 -208 -184 -65 -3 45 -112 -250 163 -189 81 -150 -106 109 -191 86 164 29 -50 69 -40 9 -75 -90
4262 -90 59 38 65 -37 -162 205 -172 -168 -3 -31 167 180 -285 56 319 -148 82 75 -268 -23 -164 186 -267
4285 -267 202 115 71 51 -130 -67 126 268 -15 40 74 158 8 -25 72 -192 194 178 -14 32 -159 34 -214 -81
4309 -81 -179 111 -15 149 -97 63 -31 -46 66 92 -203 -173 -113 -35 -22 -49 72 -60 128 -197 41 -230 141
4332 141 -103 -313 -36 -281 -34 96 -18 232 110 -7 234 -13 -75 86 -169 5 -116 -86 204 -50 -29
4353 -29 209 -114 -174 -164 105 -30 91 -75 -187 -202 3 164 -111 -153 33 40 46 -126 6 144 93 -209 -172 203
4377 203 -33 -92 180 -95 71 59 -202 -255 23 -10 -214 1 -103 111 -428 -136 42 -127 -17 -76 -85 -28 95
4400 95 30 131 181 -24 206 176 33 205 45 -254 -132 -91 -62 95 70 -43 162 2 -30 181 -225 -121 63
4423 63 27 -64 -7 18 87 69 170 195 248 -52 -81 -223 74 -3 -48 -10 0 -64 -158 -245 56 109 98 -107 -34 108 -56
4450 -56 -178 66 -57 -89 22 -126 -47 -29 -141 -63 69 -234 -196 122 14 111 -298 -77 115 -18 113 94 368
4473 368 87 -95 36 220 96 -13 33 -44 151 334 66 -68 -204 -11 -10 70 -108 226 -36 78 36 36 34
4496 34 -121 20 135 57 -31 -23 89 -95 -45 -128 108 4 -257 26 22 -197 55 205 -102 57 74 -18 60 189
4520 189 206 188 107 94 -19 -21 148 -46 -118 -154 -156 -41 -25 139 -325 120 209 -19 -15 35 -95 56 121 175 -45 -425
4546 -425 -107 -152 15 -3 18 -148 -167 198 109 -97 -9 -1 135 189 -7 -154 18 13 68 68 -29 -99 185 -93 -204
4571 -204 243 74 -357 -91 -14 -6 -106 -7 -30 -169 34 -164 36 -12 -31 -273 -271 103 245 35 174 -101 168
4594 168 347 -36 -200 -214 14 -81 -59 -6 -180 50 -132 120 -66 -118 -16 84 -18 -65 180 -73 -146 139
4616 139 -48 70 82 -54 172 -66 234 -217 -71 -46 -3 284 6 -173 -63 -198 82 199 238 -260 383
4637 383 99 176 131 -46 130 17 -145 -125 -69 -55 -28 6 88 1 -62 180 248 -16 -149 144 -140 -113 -38 -121 109
4662 109 -4 -13 -55 -71 -203 264 -114 -223 87 91 -148 -51 363 -133 21 117 70 -77 -238 129 -144 57 -91
4685 -91 -45 77 -83 49 222 267 -181 300 65 9 -36 -271 -37 -90 382 14 -37 93 63 -27 -42 -188 -29
4708 -29 -121 -5 6 69 -4 -22 -11 176 -95 -147 17 62 -88 7 -240 -294 -34 -120 -59 63 -89 -20 29 -16 -142
4733 -142 -60 192 -60 -46 -128 -185 63 -66 47 -228 -168 8 -154 60 121 76 -78 -232 65 10 -54 209 288
4756 288 -83 -132 84 186 107 -140 -8 -229 55 10 161 -112 -82 14 -31 -196 -144 111 -278 -174 19 -71 69
4779 69 8 -167 -5 -162 -118 -19 -27 -151 -97 -109 -147 -73 -62 68 -91 -8 -151 78 131 102 -147 59 102 -39 96
4804 96 -22 -194 -84 -215 113 52 -21 -217 -148 -177 -124 235 69 107 125 -67 155 95 -225 183 -413 -160 13
4827 13 -5 78 92 11 -27 -58 232 167 200 -31 -106 -152 57 -88 -103 146 -25 -46 -45 44 -16 201 237 75 89 -37
4853 -37 307 38 162 64 -104 129 137 -102 40 -2 -183 -125 -296 -36 -138 -258 58 28 -111 124 1 133
4875 133 273 -138 -85 184 -122 -133 -43 14 122 13 -46 318 190 -33 25 -111 -76 71 75 199 -107 72 214
4898 214 -47 1 -133 -206 -105 -38 127 22 45 182 -158 20 -186 -35 -86 -109 170 18 -46 35 -2 -223 285
4921 285 14 -156 -160 -36 -79 -90 -216 15 97 -48 -61 34 -3 -195 61 -89 71 8 -46 90 -31 -120 88 21
4945 21 -41 21 33 97 180 139 -123 150 245 19 -36 276 397 -68 54 -202 103 43 -5 72 31 -62 -97 -102 -238 -196
4971 -196 110 -60 -26 419 53 18 -111 -209 81 -308 27 146 -142 -101 18 159 -199 28 -56 -361 145 237
4993 237 55 54 -204 86 10 -37 -70 -119 -262 -117 113 -122 -142 -97 -50 67 142 -131 16 179 -241 -10 -103 -33
5017 -33 -21 103 -92 51 -8 20 11 244 62 164 206 50 243 65 62 100 53 162 130 98 -126 9 -66 112 217
5042 217 34 -135 -35 -161 8 72 31 -26 70 -154 -12 -54 91 -147 44 25 9 -131 17 142 -118 -141 27
5065 27 68 -233 117 83 -140 -244 -139 -71 -60 191 -67 90 -202 -155 -71 -143 -10 -273 -264 -110 69 -70 290
5088 290 45 87 115 -73 -20 -49 70 84 -125 -71 -136 -1 101 40 -32 39 -5 -178 176 -101 38 -42 145 182
5112 182 -109 173 95 83 6 -67 4 -169 223 -58 -110 193 275 -148 121 104 -187 183 123 69 -92 83 103 144
5136 144 -107 -241 -151 -128 148 210 -58 -414 -9 -136 1 -35 52 78 168 71 -158 137 43 173 6 -109 79
5159 79 -202 -50 65 -1 -109 118 193 -154 -198 2 -12 -18 -91 -37 -93 1 56 121 179 29 48 -81 -116 210 214 -168
5185 -168 49 70 171 -119 -130 -114 -120 15 -71 -268 -60 -147 6 89 101 4 65 -249 -5 -143 115 69 102 -30
5209 -30 -8 -198 -113 -175 -37 21 6 -11 113 51 34 22 93 86 -116 -52 -13 315 -6 18 -117 -53 359 59 -69 -102
5235 -102 -16 68 -110 81 247 -93 71 -9 44 -101 -62 -115 -67 115 -103 51 89 -204 -96 167 125 43 -6 149
5259 149 37 33 -108 -65 25 -211 117 32 -32 -217 -138 -21 252 175 -74 137 -116 149 127 21 92 -81 89
5282 89 234 2 -22 35 -69 -87 246 181 -92 123 -71 -125 -15 -11 -26 33 -221 176 -115 96 174 -25 178 25
5306 25 104 -126 111 155 205 251 55 117 -229 -246 303 -50 187 4 16 -33 37 8 -397 68 -12 -308 226 -46
5330 -46 137 -168 62 -244 145 -143 170 100 85 -91 179 -149 -6 -75 139 8 133 117 -269 -208 163 -113
5352 -113 -96 -22 -102 179 -88 59 -312 214 -111 197 292 -260 -153 -104 23 -103 191 39 -117 -151 -294 -70
5374 -70 -26 -74 264 -15 82 -57 -21 15 -74 93 66 -244 -46 -129 43 107 143 -110 235 121 -27 49 126 -60
5398 -60 -23 225 248 323 -13 40 -84 200 -196 -54 -271 -152 146 95 -20 -108 -87 171 70 27 197 240 -4
5421 -4 84 102 -148 -78 -97 -54 -206 -35 84 -69 -19 36 -236 53 -56 -144 114 122 -125 40 87 -19 33 75 -7
5446 -7 -226 93 -57 -25 -398 -61 81 2 74 -408 4 -14 306 8 -189 -56 -50 34 -59 81 -153 -132 -18 -119
5470 -119 -54 -157 63 217 -152 196 -434 6 317 56 56 62 -140 -174 206 3 52 120 260 -24 -22 188 1
5493 1 58 -171 32 -110 -103 62 -42 -1 135 -112 195 -242 123 -101 313 69 98 100 -48 -337 -146 -102 -58 -135
5517 -135 257 98 2 62 -168 166 -43 70 -193 -46 49 133 -81 -215 -46 -88 150 -122 175 -269 -233 154
5539 154 -123 56 176 13 -55 -184 -170 152 -379 281 87 -108 -214 -132 -172 16 50 102 104 52 83 -181 97
5562 97 87 -118 205 -6 -131 150 -127 52 74 76 29 127 -145 127 -199 166 72 -108 -66 -119 41 -254 67
5585 67 132 -55 30 52 -125 -72 -128 23 18 32 -152 -61 27 -109 19 -26 -136 26 -134 -73 -39 -84 102 154 -18
5610 -18 -51 -61 168 -62 93 -59 87 47 -3 -94 55 114 -134 146 231 -57 -81 195 -120 37 32 -3 207 -156
5634 -156 -57 64 19 -71 -180 -52 186 -76 -95 114 -8 -116 -78 113 36 -106 61 -5 111 -94 -134 212 -87
5657 -87 50 -22 -42 125 -144 180 -170 -349 31 -14 28 -130 -107 -206 5 -213 -7 175 114 -85 31 85 -60
5680 -60 201 -31 36 -85 -74 78 93 132 97 17 -31 -222 70 -234 -152 114 17 95 31 -36 24 5 58 70 149 49
5706 49 -133 71 0 186 109 -15 -18 -270 -167 -77 176 -81 -27 65 186 380 39 -72 -4 297 -71 55 195
5729 195 99 25 64 91 -20 -245 -154 -35 188 97 206 61 -57 21 -90 -158 56 -21 304 39 -253 -71 5
5752 5 -51 4 94 20 140 50 89 -151 155 -70 -49 -109 -80 -324 170 -8 89 -37 -29 -41 90 33 51 -25 -266 75
5778 75 -148 -175 76 6 94 150 -230 -78 140 -15 47 -58 46 90 -281 -29 144 -20 60 112 120 -30 -34 151
5802 151 64 148 91 166 -241 -146 -51 148 -280 28 -76 -203 43 165 -133 105 -119 57 53 68 69 34 9 137
5826 137 90 143 114 -108 -85 172 53 -93 344 -92 100 -270 99 34 19 -41 -32 30 37 94 102 43 220 -11 -76 -47
5852 -47 9 27 -194 26 -31 43 197 103 -207 111 -39 -37 183 73 -36 -220 316 -77 124 -215 21 107 246
5875 246 -27 -97 109 -39 -126 -133 29 6 -111 108 46 -29 83 -48 68 29 413 -178 -132 66 -66 -93 -111 -53
5899 -53 -177 -166 16 -97 222 -26 20 116 161 -41 -188 -105 181 -22 288 -107 32 -204 48 -45 -167 -186 113
5922 113 330 -61 -76 14 -160 258 -99 -24 69 71 69 -78 208 -86 -150 229 16 -30 -19 7 -10 35 -14 -128 -32
5947 -32 -64 -76 -25 -148 55 126 143 36 81 141 41 -12 -24 -13 123 47 105 -97 -48 99 115 243 -60 -2 181
5972 181 -125 -23 -75 141 -26 195 334 72 -219 -26 14 50 -7 25 -117 -127 56 -212 -133 92 222 62
5994 62 -12 -162 -342 88 -300 -78 202 -157 -133 -62 135 3 -139 -189 176 -62 7 -123 99 -186 -162 192
6016 192 -225 -138 70 -48 -73 -244 91 75 71 -292 8 -30 -66 -98 134 37 19 119 -67 -133 63 22 195 -9
6040 -9 -26 95 30 115 -54 -70 -87 16 -154 -226 30 -37 286 225 6 -206 -178 150 -16 -257 41 -156 42 110
6064 110 -114 -10 46 -13 127 -85 232 33 256 -125 -86 76 13 -46 196 -44 102 -143 -152 199 -43 -19 -103
6087 -103 14 -27 -217 -93 -153 38 43 -139 -410 -4 161 89 52 82 -295 131 -144 -235 30 -31 -107 -44 51 -102
6111 -102 90 10 76 -145 -51 138 -89 -95 106 266 132 32 131 83 -59 151 -159 128 36 65 226 137 150 -5
6135 -5 -104 -145 127 138 -163 57 65 138 26 45 39 108 -40 -168 -80 -499 -58 54 91 -28 62 228 391 113 -98
6160 -98 -72 36 -17 239 71 -8 35 254 197 86 40 -127 -10 -3 181 -28 14 -123 145 148 56 103 84 1 60 -126
6186 -126 49 -6 -196 175 137 230 122 -136 -119 3 -149 -107 -64 -186 -222 17 -67 13 30 -45 -49 -16 -214 24 101
6211 101 41 48 -74 -4 -96 -55 -71 201 -1 158 -37 -18 -170 139 164 -28 -37 146 -228 7 161 -78 161 65
6235 65 -270 218 -65 127 67 -89 -70 129 -113 284 -1 27 -210 -98 80 27 50 -39 -77 101 19 5 83 -84
6259 -84 92 -296 86 167 42 -114 423 -150 23 -35 -6 111 -98 112 -218 -33 -43 55 23 46 112 -253 109
6282 109 228 118 3 225 102 -11 -325 -73 -94 219 -97 128 0 17 36 53 -216 -30 -143 152 -20
6303 -20 114 -152 -52 14 -134 34 -6 21 -281 227 -8 -11 -255 101 -170 208 117 22 30 -22 -198 118 -101 -110
6327 -110 -69 -82 4 11 153 -174 -110 -119 159 -28 53 63 -129 -232 129 -218 -189 -13 233 -120 18 106 -30 123
6351 123 -156 -111 10 -6 -11 -21 -227 12 -12 43 232 -58 -36 -142 -16 -61 -263 146 147 -70 151 79 54 -50
6375 -50 -182 -51 -109 80 56 -37 169 200 23 -177 -237 36 111 -118 117 74 5 130 -196 84 7 381 -110
6398 -110 -53 -96 36 23 4 70 -6 116 -165 108 28 -44 125 17 -298 130 -26 -18 -123 -20 -173 212 -109
6421 -109 80 86 -153 -88 29 -97 -83 88 0 -17 60 80 -23 119 -218 -75 -167 175 103 64 -112 -107 34 69 -78
6446 -78 -40 -43 -106 -95 131 27 -207 198 -145 49 -44 -120 167 -6 178 -25 -29 2 54 -154 84 -80 28 -87
6470 -87 -14 -135 -85 -209 77 30 6 46 355 -16 141 -169 42 -189 290 58 54 -96 -165 4 215 189 67
6493 67 57 136 230 -90 57 5 -41 -48 -67 -276 120 -6 -126 -73 6 193 -136 254 65 -11 17 -347 -54 -108 170
6518 170 -78 -77 46 -208 -27 -18 169 168 159 -84 -154 20 -19 -76 -51 -50 -121 157 23 55 -110 37 238 -18 302
6543 302 -137 72 209 -69 -17 -242 -151 -157 222 -9 -200 137 39 -151 -102 24 41 -195 -286 -152 -115 158 183
6566 183 -74 -17 -129 -189 -84 -4 -260 -14 -94 -137 -9 103 85 162 -50 -226 -43 200 -2 -4 59 -191 -8
6589 -8 -114 6 149 19 -5 -44 -136 30 181 -199 149 215 75 -305 260 -105 55 -118 -93 -103 -318 -77 -211
6612 -211 51 127 32 240 -39 199 -25 174 -156 -312 27 156 291 -74 -109 -165 132 50 199 50 71 -171
6634 -171 221 86 -202 10 153 44 119 49 102 -53 -11 -94 47 -187 -117 40 9 116 397 -224 -142 60 -25
6657 -25 141 -148 368 -12 -90 -134 -22 60 120 93 -5 -164 -133 -124 -135 -69 52 246 -77 127 -50 107 85 107 143
6682 143 -9 -14 87 8 -140 -36 13 80 71 -45 -114 61 128 -56 218 -46 -5 -156 201 -112 -206 -92 232 -219
6706 -219 -38 -276 307 48 106 80 -212 162 85 -3 162 60 22 209 101 -237 155 328 154 69 -24 -156
6728 -156 -36 -35 -35 58 -5 22 7 -99 -43 -23 79 -196 -109 54 170 107 246 194 150 29 -257 127 -64 -57 162
6753 162 -10 99 235 26 14 -60 -12 -82 16 129 67 45 41 -226 97 -60 -110 -282 -120 27 246 -104 -137 59
6777 59 -152 -199 -5 129 -128 33 -102 -66 -2 -101 115 -95 -124 -88 -31 269 19 299 -171 -70 27 -64 270
6800 270 25 -36 88 -43 -217 155 123 92 69 156 115 -145 -196 88 -355 74 92 -130 111 -225 32 -1 24
6823 24 158 -188 160 212 -101 86 -116 33 104 32 68 -204 -61 -65 5 -47 30 131 173 44 120 21 77 152 -281
6848 -281 258 84 -221 -51 -59 133 34 -94 -91 -81 -41 -194 251 -36 -159 281 91 134 -95 31 -44 104 -208
6871 -208 35 20 48 137 -53 213 5 -59 93 -37 201 162 203 89 213 33 25 391 211 -139 -75 171 -130
6894 -130 -193 -162 -215 -143 108 -382 155 -42 -102 -11 28 115 105 208 55 189 28 -217 170 205 4 111 52 178
6918 178 -22 -33 -57 179 -148 30 -34 243 -189 255 -131 -84 -43 -220 -75 -70 130 -93 106 -219 20 52 -12
6941 -12 128 -24 -55 158 91 29 44 97 -12 -64 108 7 -70 -195 30 -99 -202 20 -181 -121 241 12 -75
6964 -75 82 292 86 10 113 -54 58 180 -20 102 106 -175 -224 79 14 91 -71 -94 146 -19 -61 89 195
6987 195 -33 52 22 -36 39 -56 31 -92 35 -208 -76 -125 -20 48 169 94 -211 50 -78 -76 -89 196 232 -10
7011 -10 -155 -276 -34 -12 -313 26 -181 -123 -78 157 11 350 -25 -66 29 -8 140 -109 0 -113 -16 103 -64
7034 -64 -100 20 -44 14 101 -14 -97 -60 -117 -198 -51 -26 -102 159 -65 -105 50 -128 68 102 -62 275 59 186
7058 186 -177 -30 -69 -249 -3 52 -23 -88 118 -369 32 78 -368 125 86 -70 -22 316 -80 167 42 -232
7080 -232 43 -86 -61 78 137 0 -39 30 -161 69 259 68 95 93 57 135 -41 205 69 100 -5 -197 -83
7103 -83 -64 -50 53 -57 -24 13 -6 31 -36 -169 -323 -155 62 271 197 18 304 221 264 -155 88 58 80 -104
7127 -104 70 32 -140 99 81 -100 -203 141 114 4 133 164 -263 88 79 -126 -114 1 -133 104 103 -279 -94
7150 -94 -249 31 8 -274 -14 203 -208 -43 97 -39 6 -115 24 28 12 -124 32 -205 73 122 43 -26 104
7173 104 -40 -122 76 204 158 -65 184 39 201 21 -20 22 70 94 -51 -218 -32 -80 -23 -359 -64 3 305
7196 305 26 303 -104 21 -124 61 -56 -23 -91 23 156 73 -31 -165 61 55 -122 -148 -80 267 -66 134
7218 134 18 -80 -195 -104 -190 -147 67 -20 -2 0 116 101 -77 -190 71 45 -42 -253 85 0 -94 -197 122 71 27
7243 27 -56 89 154 376 -197 -243 201 -210 -148 -87 241 -77 -125 79 109 -36 62 69 68 -19 -72 103 15 -69 -146 161
7269 161 -48 -451 3 -7 228 100 78 -195 -140 -12 -41 -115 76 -236 -12 108 56 -118 -154 61 -187 33
7291 33 72 -141 -95 -43 89 -123 -156 -152 68 -138 -133 -185 -64 -202 -54 -14 -173 -81 91 77 92 10 -189 97 -291
7316 -291 110 17 -11 -208 108 -90 -22 30 -254 -108 -199 -172 -240 -73 210 175 17 -105 -231 92 -140 -319 43
7339 43 -95 -261 -183 54 30 138 102 96 -42 -163 -3 -82 -183 -29 198 -93 -94 99 108 -130 59 -121 77 -192
7363 -192 278 67 -38 207 -234 226 -65 158 -15 -111 -114 132 53 -212 175 -58 292 -35 182 -25 79
7384 79 212 -402 -26 80 -68 -24 -89 107 -184 75 43 86 -103 -1 -26 -136 -43 43 -164 -59 -56 136 -10
7407 -10 -224 15 -85 -48 -155 131 123 -59 52 243 82 127 -16 -14 -259 -104 -156 114 -99 -78 36 8 -42 60
7431 60 101 -16 141 21 -86 57 24 -65 -182 -214 130 -76 -182 10 41 73 -147 171 49 54 293 -67 122
7454 122 -33 50 -38 -117 105 -77 17 69 -172 -239 -57 52 -128 -175 -160 135 -166 18 -2 -98 77 -268 -94
7477 -94 135 -124 -88 401 -23 264 85 -220 184 -98 26 -211 242 -315 -263 39 56 -242 -62 84 -120
7498 -120 -151 218 -129 88 -62 -146 -55 9 210 -10 -60 273 -40 37 -44 -69 85 -47 189 -43 -232 -51 -90
7521 -90 -198 190 -190 -45 -85 -366 -60 71 -41 -59 348 -180 -8 -28 215 -81 103 -138 -15 215 113
7542 113 -239 -7 25 255 90 27 -6 187 45 -9 15 -140 -109 49 4 -115 132 17 -30 -24 -46 -17 -38 86
7566 86 -150 89 -4 -25 -56 -4 58 23 39 16 116 215 39 -34 149 165 209 -205 56 -249 -172 -35 -44 123 -117
7591 -117 163 -321 57 -110 -7 64 291 127 -169 7 198 41 -97 -11 367 141 -231 -203 -245 62 -19 20
7613 20 -4 71 -8 -174 -37 166 172 89 245 -73 29 15 -84 265 210 -44 -109 205 63 40 -183 -15 168 -154
7637 -154 126 228 -86 -74 227 -8 -159 61 162 -218 -179 -247 349 -137 -140 -242 81 152 106 127 -44 7 -45
7660 -45 -19 139 -2 -180 -40 116 39 175 352 -40 94 14 -80 -164 28 211 -103 30 39 154 -22 -190 8
7683 8 53 -238 -212 -176 -170 280 -336 -21 -142 45 0 -19 87 283 93 169 -150 -24 -266 18 133 29 23 -75
7707 -75 139 3 34 -30 9 73 145 -90 61 -175 51 -308 -127 81 -78 8 -27 -293 -64 90 -205 17 8
7730 8 42 -42 -53 188 -29 171 -21 298 -34 -18 -1 -28 296 -194 -226 -177 -17 -47 119 -121 -136 -140 110 21 -17
7755 -17 -125 -56 41 -8 -55 -161 -17 14 -201 46 123 -18 90 42 5 134 -26 68 81 -13 166 -23 198 -84
7779 -84 -10 -161 112 37 -197 -91 -101 -151 163 -148 9 26 96 162 -177 248 173 270 -98 -28 191 218 32 -64
7803 -64 -19 -215 -192 -11 -197 -70 -26 7 -35 -79 -1 77 -12 -309 112 -392 -248 -22 -67 14 199 5 46 -22 -1
7828 -1 303 -131 -87 -105 11 -14 185 -67 143 212 44 67 126 -78 -137 -13 -12 23 157 30 196 -198 -204 234 96
7853 96 -35 29 3 -39 31 168 -26 -88 96 -240 3 28 -103 5 93 62 -24 159 171 71 -25 119 69 -163
7877 -163 -42 -37 78 -212 -229 -45 -89 22 -91 -155 37 -104 -10 -433 -193 83 109 28 -44 301 38 57 74 139
7901 139 12 -100 -117 81 119 138 54 0 48 -156 38 140 150 -51 111 62 93 140 58 -147 264 58 31 -67
7925 -67 -157 51 -166 210 -75 -30 -109 -257 102 19 314 96 238 197 157 105 48 -47 -243 -187 -248 0 -168 -146
7949 -146 -49 209 90 -6 -68 -309 145 61 -123 132 11 47 -205 -296 163 -74 300 128 -42 376 -24 94
7971 94 -31 -34 15 76 -117 -125 82 1 211 -150 23 -110 -357 -85 -104 245 -241 207 -37 -52 -97 -89 50 -62
7995 -62 83 147 183 -32 -142 -39 36 247 39 -149 -119 -42 20 -19 -12 -95 -3 192 -68 104 6 -29 14 157 150 127
8021 127 -201 -91 79 143 -14 328 -127 -4 -77 -6 58 -290 67 207 -67 222 31 55 176 -146 43 -184
8043 -184 48 40 -107 -205 19 60 151 -310 -113 -23 119 150 74 39 118 -7 -122 223 -17 105 -271 -145 -55 175
8067 175 -153 17 -8 22 -128 -87 -4 -26 153 -42 -193 -150 -10 18 -441 -98 39 -126 -15 10 -89 -238 91
8090 91 -156 -12 76 37 177 -106 -123 31 109 21 -30 -258 95 140 -12 98 82 144 -26 24 74 258 291 143
8114 143 46 167 -186 78 -153 -16 155 11 -273 -144 -6 -83 111 -5 161 189 -3 57 334 143 267
8135 267 -12 -95 34 207 70 -53 -32 147 186 63 218 -93 42 -193 47 18 -143 -36 158 20 55 71
8157 71 -17 -301 65 208 81 -107 -111 115 67 58 -200 -182 -98 -86 -292 -66 196 26 229 -176 33 128 220 7
8181 7 93 -44 -36 34 -103 72 86 -180 -210 -50
8191e0
$$ Imaginary data points
##PAGE= N=2
##DATA TABLE= (X++(I..I)), XYDATA
0 0 0 0 0 0 0 0 0 0 0 0 0 0 8 -8 8 -8 8 -16 16 -24 24 -32 33 -40 48 -56 65 -80 88 -104 120 -136 152 -173
34 -173 195 -220 247 -277 310 -344 384 -427 474 -525 580 -643 707 -781 860 -948 1043 -1150
52 -1150 1267 -1399 1545 -1710 1899 -2116 2368 -2663 3017 -3452 4000 -4716 5688 -7099 9340
67 9340 -13462 23588 -106844 -76065 85399 -51410 -53801 -12450 -15909 23926 58221 -45254
79 -45254 -27988 69483 40578 -12131 25358 10640 27927 96078 41529 -50627 11653 50627
91 50627 -14833 -45683 -36442 -27073 12081 -12659 -74363 -29894 30699 -14082 -41313 -16521 -22321
104 -22321 -16353 13257 -5283 -8924 38341 47069 28499 34725 22185 16753 43834 18715 -29743
117 -29743 -5985 19741 -8543 -17982 -7562 -14951 -9745 -6352 -33566 -39760 -13478 -12114 -24068
130 -24068 -12487 261 6930 20003 20948 12184 15308 21563 19201 11178 3342 7666 18463 15476
144 15476 4367 2116 6750 5853 -7637 -22594 -22823 -15783 -18256 -22755 -19470 -11865 -2976 1511 -1001
159 -1001 207 8479 10243 7459 9251 9026 12989 24780 21190 9024 13924 17559 5292 -3262 -7938
174 -7938 -13878 -10202 -10548 -21528 -16991 -3850 -8528 -13071 -4973 -6458 -8996 -321 -1495 -5193 7326
189 7326 14101 10430 16812 18381 11379 16133 17206 2982 493 6347 -615 -6072 -3260 -6609 -8037
204 -8037 -4477 -12855 -19431 -11463 -12251 -18632 -10949 -5857 -6385 2639 9307 5393 10262 16144 10726 9630
220 9630 12931 8154 7971 13294 8024 2726 7932 5142 -5072 -5778 -7736 -14640 -14109 -13271 -16880 -12239
236 -12239 -7000 -8914 -5960 123 -1781 -1810 3519 3671 3197 8419 11768 12275 14528 14391 11874 12753 8840
253 8840 833 -1516 -1892 -6263 -8338 -7244 -7221 -7409 -7141 -9188 -9257 -8277 -9783 -10179 -7152 -4567 -1234
270 -1234 4078 7627 8777 11060 12673 11207 9024 7121 5123 4520 3742 1962 2458 3207 1079 -2548
286 -2548 -4328 -6946 -10203 -12100 -12079 -11389 -9561 -6034 -2762 987 3113 3716 5118 4870 2838 2103 3593
303 3593 4509 4709 5749 7590 8781 7213 4432 2096 -563 -4082 -7559 -8627 -8014 -7053 -5794 -3991
319 -3991 -1444 -1125 -1755 -2467 -2402 -3300 -2778 -503 1231 3459 6145 8561 9590 9256 7117 4017 1322
336 1322 -1832 -4395 -4165 -4183 -3904 -2743 -1435 -966 -1380 -2341 -3218 -4368 -5361 -5220 -3065 -910 1008 3950
354 3950 6765 7207 6728 5120 3666 1802 -144 -1626 -870 589 272 252 2090 1518 -1215 -2502 -4498
371 -4498 -6965 -7604 -7552 -6425 -3433 -165 758 3161 6108 4957 3278 4138 2973 1034 2053 2824 2406
388 2406 3871 4984 3177 2210 1113 -1935 -4678 -5373 -7406 -7756 -4919 -3968 -3631 -453 1320 306
404 306 -180 183 -565 -514 -228 197 2817 5231 5377 6346 7714 6509 3541 2320 631 -1765 -3017 -3133
422 -3133 -3258 -2480 -2797 -3228 -2459 -2727 -4644 -5043 -4404 -4637 -4342 -1292 356 2415 4984 5658 5458 5258
440 5258 4053 2214 2431 1829 115 1133 2025 569 869 1999 76 -2064 -2612 -4169 -5345 -4992 -5159
457 -5159 -4455 -1859 -1248 -1354 509 1863 -6 299 1626 366 766 2339 2941 4110 5309 3864 2951
474 2951 3730 1309 -2296 -1629 -1399 -3534 -3394 -2009 -1948 -1599 -441 -1433 -2262 -1041 -1575 -3284 -1828 47
492 47 -99 1376 3246 1776 2390 3727 1771 33 1112 907 -825 -6 685 356 2052 1746 -1183
509 -1183 -1020 -186 -2930 -3797 -1990 -2709 -2059 550 -128 -283 2979 1659 -862 1107 586 -1910 1057
526 1057 1541 -1653 1222 4266 113 -135 2404 -1058 -2374 237 -2900 -4167 1789 709 -3068 1654
542 1654 3811 -879 -25 1282 -2608 -1104 2057 -1972 -1779 3990 2429 -503 2315 1946 -642 182
558 182 -1497 -3851 -938 613 -2300 -799 1513 129 605 414 -2139 -1039 588 -2358 -1786 1347
574 1347 1674 1132 3238 2643 1078 2756 1286 -2440 -1013 578 -1550 -1150 888 213 -31 1436 -569
591 -569 -2402 -1030 -1772 -4198 -2442 -897 -1364 366 2714 1313 1337 3046 1646 -919 76 1090 -188
608 -188 633 1717 1666 2148 2793 450 -277 -162 -1933 -3310 -2234 -2377 -2407 -700 -696 -719 918 462 -1459
627 -1459 -528 -999 -2274 -409 532 -449 1809 4342 2443 2129 3539 1600 -11 818 -967 -1807 651
644 651 -197 -1388 1165 1471 -1720 -954 -361 -3530 -3465 -1723 -2824 -1996 454 85 653 2621 1460 312
662 312 1667 705 -932 644 1095 403 2064 2625 1691 2093 2082 12 -433 -811 -2787 -2461 -1173 -2508
680 -2508 -1779 437 -309 -887 351 -423 -1599 -1068 -1031 -1152 430 1230 844 2254 3063 1433 975 1733
698 1733 266 -811 -375 -323 -668 260 317 481 972 450 -1010 -996 -1503 -2241 -2661 -1317 -686 -440 390 951
718 951 1025 805 707 152 -303 -307 -344 -1 649 782 1356 1396 1100 -146 -335 -301 -1398 -1791 -983 -548 -537 224
740 224 757 868 686 -134 -447 -141 -852 -1201 -692 706 168 369 1079 1106 518 -77 -398 -849 -824 -855 -885
761 -885 -160 637 448 654 942 409 -286 -275 -54 -492 -76 185 524 1406 1499 1255 1008 386 -569 -734 -680
782 -680 -1187 -919 -562 -456 -388 -51 199 -261 -516 -1081 -1215 -906 -488 -73 775 1811 1353 1271 1792 1552 744
803 744 293 461 18 -206 8 604 920 832 -84 -701 -540 -1575 -2109 -1700 -1391 -1627 -1423 -472 149 582
823 582 899 925 385 131 -59 344 973 1271 1378 1842 2020 1609 1141 954 208 -678 -1361 -1218 -1554 -1287 -1027
844 -1027 -896 -368 -597 -1005 -810 -1013 -1460 -1307 -764 -264 228 994 1762 2160 1795 1453 1284 1157 293 178
864 178 285 390 326 249 516 480 -99 -1122 -1212 -1483 -2084 -2216 -1802 -1068 -751 -76 261 479 586 447 -202
885 -202 204 38 156 392 1371 1315 1552 2009 1136 813 399 -233 -796 -1054 -1429 -1201 -357 -224 -526 209 50
906 50 -825 -830 -656 -1366 -969 -290 -331 798 1190 904 989 1545 604 -4 3 -221 -676 -91 -209 37 900 482
928 482 -359 718 77 -1071 -483 -303 -1414 -555 404 320 815 1098 368 438 1064 -731 -884 141 -577
947 -577 -697 821 584 -393 730 380 -679 -68 -216 -1334 -665 -56 -514 1 1260 742 697 1313 484
966 484 24 237 169 -303 184 123 238 825 555 -460 189 -33 -1473 -1387 -898 -1197 -963 -67 -609 268 605
987 605 105 90 437 182 -342 304 643 783 1040 1548 1417 1252 753 168 203 -391 -898 -890 -884 -749 -887 -609
1009 -609 -257 -437 -1094 -781 -903 -1088 -953 -305 229 139 1279 1116 1347 1586 1257 861 613 422 -310 364
1029 364 647 97 306 651 169 -942 -727 -1077 -1557 -1459 -1775 -1458 -428 -337 -463 551 711 81 51 245
1049 245 450 461 379 542 1092 1539 1022 1073 1117 383 -62 -132 -1027 -1047 -704 -445 -622 -237 -276 -200 4 -620 -1060
1072 -1060 -680 -577 -750 -120 417 487 830 1135 1008 964 710 -222 215 191 -545 -49 293 347 149 255 136
1093 136 -280 -491 -846 -983 -628 -700 -624 327 424 203 272 941 70 -249 -215 -405 -268 28 132 247 596 431
1115 431 336 392 -73 -734 -448 -593 -470 -198 50 7 474 658 399 185 292 -547 -135 70 -180 -54 415
1136 415 294 133 533 159 -627 -129 -729 -1184 -557 -282 -579 -291 580 244 -81 209 193 249 124 -27 188
1157 188 634 494 786 413 735 539 -48 89 -465 -704 -856 -830 -368 -496 -294 -60 -474 -363 -226 -546
1177 -546 -751 -357 -89 -52 606 676 778 1540 1285 828 766 898 302 -178 378 149 59 101 71 -80 -218 -567
1199 -567 -1098 -763 -861 -1407 -1002 -114 -210 -415 542 412 420 342 82 118 622 134 454 917 1049 899 916 857 384
1222 384 -22 -100 -396 -560 -283 -803 -604 -6 20 -224 -128 -310 -750 -712 -635 -278 -362 -168 252 557 610 745
1244 745 736 385 212 233 94 159 11 141 54 229 89 -151 34 -404 -423 -583 -560 -416 -365 -109 104 119 37
1267 37 102 408 79 -459 -231 84 -209 26 210 339 394 464 123 57 57 -265 -639 8 43 -165 352 282 217
1290 217 466 193 -240 -178 -354 -355 -518 85 -164 84 415 0 -283 89 -50 -458 -410 -378 -193 -49 -98 196
1312 196 220 528 328 77 94 -173 -177 163 291 69 172 417 364 314 251 -325 -5 -568 -803 -724 -199 -201 -441
1335 -441 -120 132 -42 -5 -367 -223 -221 -253 -28 340 591 756 742 809 756 439 178 24 -206 -87 16 -219
1357 -219 -190 85 -1 -94 -449 -534 -431 -794 -706 -606 -161 -333 115 129 203 547 309 219 245 110 43 55 501 471
1381 471 688 620 481 248 169 -348 -408 -415 -262 -660 -175 -177 -124 62 -26 -327 -309 -625 -431 20 -193 -139 267 263
1405 263 469 352 528 395 305 445 -29 128 -257 2 113 85 -162 84 158 -143 -690 -428 -340 -670 -415
1426 -415 -189 -98 165 211 65 -13 84 -269 -299 190 -97 198 12 216 308 437 145 210 400 250 -93 -98 232
1449 232 38 58 60 246 123 34 128 -148 -317 -479 -368 -361 -415 -162 235 134 61 120 -43 -202 -220 -146 -45 83
1473 83 1 618 429 617 418 557 81 305 100 -167 138 -37 -232 -125 218 -131 -297 -268 -570 -299 -377
1494 -377 -645 -391 22 -2 -33 264 460 52 262 369 37 152 227 68 299 405 284 498 352 55 -96
1515 -96 123 -180 -390 -17 -134 -377 -8 -34 -208 -15 -177 -322 -174 -66 -353 86 40 -1 359 249 135
1536 135 546 241 -1 369 404 -169 165 289 254 152 237 495 -146 -179 -148 -83 -168 -180 -262 180 -43 -302 -6
1559 -6 -38 -260 -310 76 -251 -56 64 -292 257 302 227 -30 232 84 -91 110 167 -29 -26 426 24 326 137
1582 137 9 92 270 -130 -605 -347 -512 -539 -98 -216 -110 -229 -5 -294 -169 -219 -292 77 227 118 294
1603 294 571 340 519 584 374 175 92 229 172 -114 114 -238 105 -6 -32 -187 -467 -295 -510 -592 -383 -263
1625 -263 -221 -37 4 -199 -92 304 103 267 -130 83 89 499 470 517 437 575 113 188 370 -29 -271 -312 -264
1648 -264 -340 -357 -113 -142 -228 -227 -239 -225 -115 -311 -298 208 46 107 309 472 223 366 294 231 490 376 -87 331
1672 331 244 91 -86 192 -33 -158 -290 -156 -625 -153 -211 -480 -96 -140 8 155 40 -427 -202 104 109 -70
1694 -70 185 0 256 227 207 366 57 -27 -95 93 -141 -123 -252 -34 -132 176 54 -179 -252 -339 53 -190 -218
1717 -218 204 93 -38 244 10 129 322 226 -387 116 -28 -90 -241 232 194 46 205 -193 -100 41 232
1738 232 41 29 151 269 112 194 265 21 296 -53 -38 -106 -207 -150 -185 -162 -266 -154 -222 -210 -158 -123 -124 -146 -188
1763 -188 126 -274 123 214 330 530 275 317 324 343 -9 -49 -61 -32 24 -166 -55 -275 -455 -162 -396 -268 -597
1786 -597 -418 -98 -149 -391 -29 46 53 195 71 402 300 183 409 443 478 389 710 336 -1 1 -135 -192 -330
1809 -330 -204 -158 -322 -61 -215 -330 -274 -152 -206 -309 -42 -49 0 -32 86 289 335 228 277 306 289 111 418 109
1833 109 69 157 -11 -225 148 168 -365 94 -301 -254 -357 -338 -287 -277 148 -85 -161 116 -83 -61 168 -51 200
1856 200 195 409 382 320 56 354 203 -52 153 -70 -222 -32 -247 40 146 22 16 -103 -72 -176 -165 -218 -275
1879 -275 99 -257 52 312 341 120 -50 127 154 194 -10 41 -41 -200 -31 -198 112 53 46 81 -50 -283 192
1902 192 -56 74 78 -175 89 314 144 27 134 100 -16 -32 3 -249 -288 151 -192 -72 -218 -8 83 -104
1924 -104 103 -71 31 24 -3 332 -143 254 431 57 215 -74 -58 183 73 10 -1 -23 105 -237 -224 -259 -379
1947 -379 -460 -241 -142 -221 71 -182 -18 -10 144 291 192 289 202 154 -84 86 145 18 442 243 49 -166 -356
1970 -356 -151 -64 -190 -270 -79 -485 -406 -215 -149 136 -182 -77 20 -139 56 172 65 271 310 552 597 514 167
1993 167 165 126 140 231 -68 296 -71 -255 -159 -47 -271 -162 -325 -368 -178 -296 -78 -228 -120 7 277 -45
2015 -45 94 355 345 -33 118 268 18 298 440 197 129 161 123 -157 216 -263 -195 -77 -54 -117 -25 -151 -190
2038 -190 -33 210 -3 75 50 66 -59 233 346 -92 345 149 91 99 97 190 -28 -93 -188 -110 -47 33 -147 3 283
2063 283 147 -73 21 237 91 25 191 -32 74 -55 -292 38 -199 -311 -37 -74 -152 -133 137 46 -91 223
2085 223 55 -114 206 -169 9 -21 193 122 380 324 146 72 6 46 101 12 61 -94 -10 -203 -162 -22 22 -107
2109 -107 -398 -81 -43 -241 55 104 -47 -134 370 389 301 261 169 215 93 199 332 137 35 -33 167 235 -150
2132 -150 -217 11 -133 -159 -162 -156 -79 -46 23 -191 -47 318 -117 -146 -128 -34 12 330 13 192 61 106 278 63 -82
2157 -82 111 4 -55 -5 -88 85 -243 -170 -234 -82 -170 -193 -121 -348 -331 88 168 -142 -145 30 -171 203 54 439
2181 439 135 360 171 -20 -179 238 85 -55 336 118 -265 -265 -182 -96 -401 -9 -72 182 -144 39 142 -111
2203 -111 -159 -235 12 159 172 -113 -27 167 -91 161 372 42 -133 -99 18 -125 -157 203 -105 -91 -177 159 -29
2226 -29 -199 -70 12 -161 3 140 149 -89 55 -120 54 270 91 -57 -218 -16 -52 -150 -10 -19 24 40 -76
2249 -76 -16 122 57 -11 439 -13 124 214 72 -31 -165 62 148 127 -77 -97 12 19 -154 -90 -352 -131 -144 28
2273 28 111 -109 90 -239 54 21 117 172 94 272 228 83 245 140 52 24 170 79 -44 -155 -213 -48 -148 -161
2297 -161 -187 -305 -299 -261 -100 -32 60 -158 -178 -221 8 -52 67 73 290 -203 -56 9 31 150 168 102 -72 48 -69
2322 -69 -394 -136 -227 -74 -75 -257 -213 176 -196 -167 -198 2 46 142 -77 77 78 -14 115 -3 1 102 182 53 54 180
2348 180 329 250 -124 10 7 -134 230 17 -232 -225 -239 -152 -97 -304 -131 -188 -423 1 38 -98 -215 -119 -249 60
2372 60 173 35 -49 -70 -70 79 73 127 85 136 -86 -11 117 -243 231 208 -249 108 -159 -149 47 21 138 -61 143
2397 143 6 -84 -230 -251 141 -53 -198 -77 76 -185 -40 108 -49 -88 3 173 34 -51 263 60 40 -13
2419 -13 135 253 -208 98 -181 -63 172 -38 -154 -381 -1 -251 -71 -115 -192 18 -190 -46 20 177 22
2440 22 -42 70 68 156 24 237 224 32 -98 -65 -107 -9 -165 25 191 -10 -157 -46 -237 41 -144 69 -195
2463 -195 -134 -215 155 -24 125 67 -79 288 155 238 185 433 181 288 160 43 18 0 281 -130 -145 -204 -107
2486 -107 -48 -99 -93 -264 -20 -193 -93 -54 -326 51 29 4 -262 -41 190 85 322 7 181 193 38 -28 299
2509 299 17 82 307 47 42 111 -124 176 -56 -26 -178 -292 -151 -185 -213 -173 -150 -92 -194 12 53 -17 9 -109
2533 -109 -88 -12 29 -95 -23 -185 373 143 60 68 -21 100 88 179 62 -89 27 172 34 -49 -147 -163 -285 -12
2557 -12 -17 255 -234 -154 8 47 102 97 -107 70 106 -163 36 115 -156 133 182 164 73 -154 92 145 -56 -14 78
2582 78 166 -152 -30 67 -134 61 -215 14 -25 -119 -36 169 85 -102 -32 93 64 64 -44 -73 -76 138 233 396 141
2607 141 95 143 -43 46 114 -21 -159 -112 -25 -63 39 15 -225 -136 41 -178 -135 -95 -24 -28 140 73 -279 16 62
2632 62 159 201 77 88 63 -25 28 30 -46 4 30 -23 9 11 -89 -211 17 -78 -109 85 37 -337 12 -2 -98 -64 146
2659 146 -35 -18 60 84 391 1 -71 286 -150 -48 -90 147 355 110 179 -225 10 42 296 55 -191 331
2681 331 190 -80 -223 5 -186 8 101 -151 -122 78 -300 30 130 86 30 197 147 -28 135 -14 -1 38
2703 38 -112 -98 -114 77 90 116 140 -3 -3 -227 -289 85 71 -128 125 -38 -125 -71 1 150 104 6 -31 35 109 257
2729 257 -164 165 -51 128 94 78 123 62 98 100 -57 152 79 -280 93 -24 18 64 -106 -136 -37 -183 -112 -54 -9
2754 -9 -124 32 -166 43 -70 -54 -226 107 176 76 91 341 148 -77 157 -128 249 213 -85 84 -216 -157
2776 -157 -117 140 -252 64 -144 -14 -93 -167 -326 140 -96 31 -205 135 -125 -311 108 62 41 -87 171 -34
2798 -34 182 81 102 98 112 90 -23 -16 -5 -45 -151 -257 -34 -113 -139 -75 49 -115 -42 -41 77 188 -167 133 189 -17
2824 -17 -87 19 115 -206 125 37 -122 -62 111 -35 102 -139 41 4 -73 128 -19 -23 -163 -158 26 132 -24 -90
2848 -90 22 -52 -160 73 43 -46 42 -82 -105 192 -64 184 138 210 201 -54 203 82 103 -155 -68 -42 138 -5
2872 -5 97 -37 -57 15 -131 -224 -165 24 -153 -139 -101 37 -59 -241 -43 -30 -104 224 91 133 124 19 -70 -242 98
2897 98 104 -91 -107 76 89 1 -45 -177 -20 -179 -72 31 161 129 50 -93 -71 -129 -223 -150 165 -118 -3 95 69
2922 69 273 -10 85 131 82 55 317 30 180 119 69 113 -48 137 -27 67 -135 309 14 -292 -210 156 134 -2
2946 -2 31 -94 11 140 -195 92 -49 -264 23 131 79 -151 224 130 119 -39 139 -24 43 93 -115 -167 26
2969 26 86 8 254 159 -166 -252 -193 81 151 -55 -113 162 103 97 70 255 -260 -87 -120 164 131 -90 24 19 308
2994 308 -116 50 34 -140 36 -218 54 -158 50 45 -102 -217 -56 -180 30 -31 -242 -99 -296 -157 -16
3015 -16 375 -14 86 -61 -109 3 -153 -161 20 322 262 229 84 86 38 -122 96 262 -35 90 32 -16 -68 54
3039 54 269 -34 57 -103 -90 -321 111 11 -253 129 -2 24 -27 56 -88 57 -86 101 194 110 111 69 156 231
3063 231 17 -129 -61 -131 155 87 196 -147 -10 57 -120 -217 -9 -61 -249 46 22 275 75 220 -36 123
3085 123 39 81 1 -129 161 60 193 -52 134 110 -142 12 -97 117 -96 151 -127 -152 94 -61 117 -97
3107 -97 -163 -56 -34 -13 66 -206 164 70 -38 64 20 -170 -133 133 102 -197 -180 -135 -159 109 -62 -2 83 64 -46
3132 -46 -107 35 66 -137 127 133 11 120 -120 60 141 66 9 -168 -52 135 122 34 -126 28 35 89 -69 191
3156 191 -178 27 288 45 196 -228 -164 -33 -110 -184 -214 -176 -96 -123 -20 42 39 42 -56 -268 179 -195 126 -103
3180 -103 -204 -105 55 -135 4 39 14 -207 155 -187 140 202 186 321 -198 180 -181 -463 -138 0 -318 -58
3202 -58 97 -159 123 -3 -42 88 -167 54 -66 70 -160 -114 208 38 64 -115 191 220 84 85 81 -75 75
3225 75 221 -146 122 -214 -269 -52 111 -216 -5 -317 38 4 -33 -209 -13 297 128 -110 66 -46 -5 -54
3247 -54 -192 20 -207 67 120 48 30 -15 -53 181 -33 -197 62 -139 173 91 -132 -193 -72 -16 -18 -28 60 -143
3271 -143 32 -151 36 -37 106 -16 204 -97 168 -41 -85 82 151 276 -139 216 -84 89 -305 89 -24
3292 -24 180 -109 128 -18 -1 -297 -89 -104 -195 -122 -222 -72 -171 106 110 110 70 -41 5 151 -21 -54 -106 15 -269
3317 -269 58 195 -76 234 64 -223 112 -35 33 -173 -104 -60 -64 112 -6 -221 -213 101 -77 10 -108 349 -51
3340 -51 -52 -112 126 54 41 -78 225 -80 226 82 -23 -184 -35 74 -88 -65 37 -249 -95 -139 186 -67 12
3363 12 51 -206 19 245 -62 -28 59 108 107 53 -100 98 209 3 -67 97 -111 17 189 88 95 -249 38 -45
3387 -45 87 -209 -68 133 -228 -111 -95 46 58 -181 -39 22 165 -166 -203 -77 110 -1 110 -45 55 178
3409 178 -16 -293 6 55 -20 -5 14 -82 45 -64 63 163 4 123 108 -28 196 1 -68 -76 -102 65 132 -31
3433 -31 -100 233 126 93 126 -132 63 133 172 -45 110 292 -134 188 35 4 125 -134 -62 28 -94 -7 -127
3456 -127 -145 17 -20 -158 -186 160 116 145 -21 87 -268 17 -239 -149 74 225 -66 14 172 -102 -133 26 172
3479 172 36 152 -100 -31 -74 71 93 -133 296 -74 91 148 106 -57 -53 50 -238 -35 133 -60 -137 12 28
3502 28 -66 -24 65 -58 -15 262 -24 -68 70 203 -89 -30 -137 188 -181 67 245 -77 -73 -211 95 -153 -229
3525 -229 -284 61 211 39 -189 -152 -46 -124 -16 239 -36 -205 15 -135 219 143 104 80 110 -58 -149 5 -111
3548 -111 186 -250 -186 26 160 -186 93 -56 -327 -124 233 237 -168 -73 -141 -115 265 -64 -103 -22 -60 192 -21
3571 -21 -78 -186 188 68 -57 42 45 -77 -118 -65 -112 260 -117 -22 220 -110 -34 49 128 -53 -264 31 -140 -182
3595 -182 -78 118 97 201 118 89 -125 242 139 85 181 -2 181 98 133 -92 147 -117 104 121 -28 79 84
3618 84 21 -118 -23 -38 -161 -110 -138 -176 88 -189 -117 163 341 -34 109 231 -19 75 132 142 -103 -80 -73 -196 -54
3643 -54 351 -67 65 -112 -15 192 74 67 -22 -147 53 48 14 -42 -40 26 -178 -127 -121 9 64 -216 -39 -58 25 140
3669 140 20 88 130 13 52 88 260 -98 -134 116 -16 21 44 -16 -19 106 -102 -24 226 89 128 -90 -229 10
3693 10 -189 -81 152 74 -73 -29 36 114 -70 -53 239 -109 -11 190 -220 -100 119 104 -32 -59 17 -138 17
3716 17 148 -76 74 -4 -77 -210 -177 -185 -38 -51 46 -4 -132 -115 65 219 -70 105 -182 61 -312 56 129 50
3740 50 146 127 50 127 133 -69 -282 -128 54 128 -42 178 23 -219 -383 9 203 -293 68 137 -128 6 -6
3763 -6 131 23 -34 -102 -84 58 -235 57 -224 -22 141 81 -60 138 69 -90 -155 58 -29 60 350 -172 -38
3786 -38 -113 -31 -318 96 158 -14 98 254 89 64 -47 -16 391 35 76 93 -7 129 -35 237 -285 -255 -65
3809 -65 72 -119 84 84 19 126 71 116 -55 23 -199 264 88 -168 -103 -184 -31 27 43 -90 193 -71 45 203
3833 203 35 225 138 31 13 -215 108 63 -107 100 -190 62 67 -7 -169 45 -118 -109 0 -115 -185 203 140
3856 140 82 64 4 1 -39 -71 99 87 61 40 104 113 108 35 -140 -63 60 -95 -6 111 27 6 -3 -69 -30 18 -196 -188 119
3885 119 3 -151 -46 -214 28 25 11 129 1 173 288 35 109 -42 190 53 126 31 -72 -231 14 80
3907 80 -3 376 57 -167 62 -54 8 129 49 -10 170 45 -68 163 -93 -186 150 40 -97 215 45 -193
3929 -193 97 0 -221 238 -77 -84 -158 -106 122 33 54 -9 -179 49 -106 63 113 51 22 -258 161 207 -10 47
3953 47 342 110 -190 -136 -39 6 -74 -38 221 -139 -63 94 -101 -67 -152 -14 81 -10 -148 -12 -99 186 109 -243
3977 -243 138 81 72 -31 -145 -72 63 -49 83 209 -79 -128 148 70 2 -132 -115 187 15 155 -53 -197 23
4000 23 -111 215 110 -54 -163 375 17 117 -144 -157 86 202 -44 110 -190 -100 -365 250 36 113 -102
4021 -102 25 50 -39 -136 -129 96 40 16 155 78 -12 24 210 121 -184 -76 43 -199 -91 -29 142 106 -68 57
4045 57 116 -191 -37 -10 -105 6 65 113 -116 251 -82 58 11 105 -36 -193 -133 73 -96 129 -22 -239 -183
4068 -183 145 -88 50 2 299 -225 -47 98 -28 101 -201 88 149 -52 -37 111 43 25 28 64 238 83 -100
4091 -100 0 -104 -22 -135 204 -134 -126 -9 39 -27 136 111 201 -104 -79 2 111 -44 97 35 12 3 39 -166 -157
4116 -157 -130 -10 -42 80 98 8 104 -41 -5 -22 -488 -135 -112 205 -165 33 -39 42 318 64 -66 -9 190 -12
4140 -12 -278 25 71 179 211 -115 -150 26 112 44 122 169 -57 -95 -275 6 -80 -118 -144 109 83 70 21 126 -201
4165 -201 7 236 -50 84 69 137 26 -12 -191 -183 -127 -28 35 111 -22 12 218 77 109 -92 -163 -5 32 206
4189 206 174 121 201 43 -209 -157 324 -32 -56 24 2 -67 -179 -63 -22 -182 191 -89 1 170 -186 -172 -121 18
4213 18 63 -82 -57 -130 79 -1 105 -85 -175 -215 -151 -99 121 -216 -72 -11 210 -7 37 -96 -140 -181 51 114 39
4238 39 -75 -88 178 168 -122 24 271 11 -79 -138 204 -9 191 364 -50 179 89 32 58 68 25 -17 -113 -192
4262 -192 32 -29 -48 48 104 -226 66 -108 -39 -50 39 134 56 126 -88 72 -42 39 54 -27 -125 -151 126 -13 -84
4287 -84 194 105 -6 -107 -122 -50 17 -7 29 150 -101 148 -33 149 126 -161 107 14 79 -110 -33 50 -104 170
4311 170 10 126 -133 222 52 48 -276 -102 -158 -73 -47 -37 84 71 -39 79 -61 191 -9 -6 39 -118 92
4334 92 -176 -3 -198 183 -215 124 49 119 62 195 208 -33 184 1 148 -7 81 231 -93 -24 -109 -43 138
4357 138 -59 176 184 -79 -208 -197 -161 -181 22 -145 64 7 6 -139 3 80 -182 -340 -26 285 153 48 163
4380 163 306 144 -132 46 -205 -41 -113 -108 -111 -33 -78 -27 -155 -111 160 -40 63 -147 -194 -356 -10 42 208 3
4404 3 9 -148 67 59 9 -65 81 142 106 13 112 166 -72 -8 5 -6 75 33 -4 100 -335 88 -76 127 -206 -88
4430 -88 -80 -26 228 176 81 -112 10 98 -101 -235 150 -61 -135 -212 150 89 19 203 -6 -76 4 4 247 2 -100
4455 -100 -85 280 -102 158 122 -81 -74 55 -88 -62 -16 -357 -10 140 96 -235 195 -107 60 -189 34 108 407
4478 407 46 -25 166 -155 36 -53 -47 -66 130 3 -67 86 51 -293 -20 13 127 43 -5 -222 52 -261 -74
4501 -74 -25 -96 -301 -6 126 -107 19 197 -195 -312 -179 152 168 -96 -186 186 83 78 -131 33 -76 -89 -16
4524 -16 101 243 -298 -125 -117 -37 -25 -109 -194 -104 72 265 123 -25 102 77 -37 126 -17 -58 87 -89 39
4547 39 93 -36 -227 -156 31 -105 40 -178 158 5 -261 -55 89 -85 -308 -123 127 17 -131 -83 245
4568 245 1 295 -106 154 -65 117 115 5 97 -57 247 -74 -66 -48 -47 115 10 -27 -53 -106 70 -71 21 -127
4592 -127 -72 -166 62 267 -62 -130 -116 232 61 113 48 95 -33 49 -238 49 87 130 35 -44 11 91 -109 -105 -13 -331
4618 -331 -156 -181 -36 91 -161 18 -324 -247 -14 26 -52 -108 -62 -253 -6 198 99 198 37 -74 -178 -100 93
4641 93 -140 -215 58 136 -261 -269 209 23 2 39 -54 -220 226 -84 28 -105 -103 -218 -32 19 -82 130 25 110
4665 110 -16 -296 -2 -174 -5 301 331 -20 218 -61 129 -243 243 30 -157 -95 -343 96 22 -161 108
4686 108 62 30 -40 185 9 -36 246 -171 89 0 322 -69 -169 38 448 119 113 -203 -69 277 60 76 -65
4709 -65 -78 -72 -81 361 130 191 53 -88 -131 -138 -166 -36 -95 -161 154 -153 -185 -37 106 108 -119 1 86 -77 57 -98
4735 -98 -127 -232 -51 -40 -132 45 58 77 -173 78 -37 82 161 -94 98 2 -101 -46 -10 5 -200 -144 -72 -234
4759 -234 220 82 224 108 38 -83 -40 161 231 -173 169 -50 -250 -101 81 -167 2 153 49 38 28 -79
4781 -79 -102 -152 -19 -47 -112 187 251 -1 -181 54 -218 40 85 290 28 140 37 12 232 54 102 -50 87
4804 87 21 85 -155 -46 114 -21 32 129 -152 66 71 104 -99 -3 60 61 92 -30 41 213 -182 -75 92 115 -6
4829 -6 -35 133 12 213 -131 74 -191 -101 -119 -111 -25 25 -19 -88 -148 83 -79 53 88 -67 4 45 101 -132 62
4854 62 -222 -3 -105 96 -98 -33 82 -90 76 72 -109 -75 -180 -349 30 107 101 -42 -22 0 -288 1 -159
4877 -159 35 -43 1 86 47 35 7 -174 -172 -12 6 190 149 -193 71 -70 -101 -115 122 -28 -39 191 196 178 36
4902 36 125 262 220 -160 -209 131 -131 268 105 102 25 -130 -51 -66 -216 219 149 44 42 148 48 17 -89 112
4926 112 229 -329 121 -209 -1 -11 182 205 -48 113 95 138 60 30 1 208 184 -29 -69 -81 42 -316 111
4949 111 16 -280 -58 -129 -113 37 38 -104 -231 -112 -12 160 331 -1 -34 -57 -11 71 93 64 44 49 -104 -64 -186
4974 -186 -289 268 -121 9 168 -69 -37 15 -48 138 -200 198 -127 -32 46 11 105 90 92 27 104 -12 -113 36
4998 36 -58 -47 -336 42 133 -161 -30 -20 -228 58 -48 49 -30 -85 -125 75 48 -109 193 -194 138 77 -104 7
5022 7 19 65 -171 187 20 -100 45 -50 -19 161 -69 -103 140 122 27 -151 152 -19 -143 313 47 -35 -56 -22
5046 -22 78 25 -323 16 238 -61 53 -36 54 -30 -16 -69 -70 272 33 -41 48 -128 10 -120 95 23 56 128 -138
5071 -138 30 -41 -256 72 172 214 -131 -86 49 99 -121 128 -74 64 87 -31 39 5 61 -316 62 -135 -82
5094 -82 115 12 182 70 -156 111 -2 -88 83 -273 -147 99 -3 -177 56 -130 138 -52 -277 -64 73
5115 73 188 45 82 -56 -31 -48 93 -9 -57 49 108 144 28 -109 20 -315 111 -73 85 -26 -36 -46 -95
5138 -95 90 -123 34 -90 -3 -56 41 82 -129 -85 -100 135 38 -143 84 161 6 -93 89 22 -57 130 126 142 62
5163 62 23 -192 -125 11 -132 62 156 -15 119 124 122 94 -152 98 37 -41 30 -36 -94 26 -75 -78 -29 -118 -191 4
5189 4 145 202 -47 -19 171 28 0 -11 33 -116 49 -89 -58 60 21 -18 153 43 -131 -152 138 -80 68 175
5213 175 -99 31 -152 -178 -118 93 -41 -154 284 -67 -57 138 217 98 120 115 -122 116 151 -70 -155 169 41
5236 41 222 61 64 -96 -20 -184 -204 25 104 -64 191 19 -127 -120 -70 -159 27 -143 392 89 146 110 8 44
5260 44 52 -127 17 -85 -88 -67 -89 88 -107 238 -163 -144 -150 -60 42 129 -110 -30 -176 -28 -147 -233 -47 30 139
5285 139 104 134 -120 96 27 -141 103 -183 -201 55 186 -19 -79 -65 84 105 11 199 237 -143 246 59 88
5308 88 193 -21 95 6 61 11 74 -162 -113 132 8 93 -43 -33 106 -137 23 135 215 42 -174 167 -126
5331 -126 265 3 34 -202 -96 -13 159 -162 121 -123 -289 53 -29 -170 -28 18 -150 38 -101 82 147 10
5353 10 19 -42 324 168 -195 93 185 -102 21 212 26 -47 15 -68 57 -117 -158 -113 -217 -34 71 -17 -149 75
5377 75 35 -141 -165 210 -74 -220 139 164 89 68 -202 168 113 145 41 93 -108 247 -27 -163 91 60 -116
5400 -116 94 175 -67 44 -46 171 26 -116 3 211 -108 -167 48 -163 -139 -145 223 -76 27 130 55 37 33
5423 33 32 -40 102 228 241 39 -200 39 102 60 -121 -190 -27 -265 -34 89 -20 -94 124 -239 -6 30 11 -4
5447 -4 -14 349 7 37 82 -7 4 49 37 48 127 40 -260 194 -106 43 -47 -56 -196 186 -217 -22 -56 -10 -11 -140
5473 -140 252 -181 9 -27 107 10 -50 76 -109 -76 31 86 -100 152 -23 35 215 57 131 307 -91 136
5495 136 -138 -183 58 169 47 42 59 -92 130 -253 213 104 -19 -82 -109 54 72 90 79 -76 72 79 142 111
5519 111 -10 110 86 -104 138 13 -34 32 -272 -20 17 -249 68 22 -187 127 -114 -34 48 338 169 67
5541 67 79 -81 231 203 147 -123 183 225 140 86 -190 -282 10 101 116 181 148 25 38 -80 -210 -37 27 136 117
5566 117 77 -215 21 8 82 -38 29 30 -34 77 12 -74 171 112 -30 -147 -124 98 77 81 -120 -179 -139 124 -245
5591 -245 16 18 162 70 -150 255 172 80 -53 0 82 -40 -151 -341 105 367 109 172 43 146 75 2 233
5614 233 234 -111 -19 18 -302 93 -117 -79 129 -88 12 -142 156 -7 -58 67 34 -191 -142 -29 70 184 -106
5637 -106 52 87 -223 22 127 9 -52 28 -135 41 -158 -71 264 85 206 19 78 49 -103 -47 135 -68
5659 -68 21 -126 -137 -81 -113 -14 67 -23 128 26 -7 -84 -71 -143 -171 -59 110 170 -39 -23 -49 31 194 -77 54 2
5685 2 -3 100 -19 -51 -60 -22 9 -74 16 -60 -35 232 -39 -138 -56 -49 105 180 97 -224 212 -102 -91 227 -62 42 70
5712 70 -214 191 173 53 -117 -430 235 -225 -183 366 -262 -81 -125 -41 -52 50 -37 104 -180 31 266 4
5734 4 -146 -101 -25 176 -60 -190 -109 68 105 54 51 83 144 -248 25 -23 134 -63 -108 79 136 212 139 -33 111
5759 111 111 110 -17 95 38 99 4 -144 144 20 -49 200 -55 -250 158 -119 -13 115 -67 -89 22 73 -55
5782 -55 196 -122 -33 96 71 -151 -128 -205 -207 49 183 -111 -8 -140 19 61 -91 -33 40 10 132 -170 116 101
5806 101 -314 203 178 238 -80 102 189 18 -152 -94 123 -38 -31 89 252 -158 -65 -79 -176 -12 178 64 123
5829 123 -205 -39 144 -51 -13 69 -143 -63 32 -89 244 131 36 -18 37 36 -4 28 -22 8 -35 -46 -65 130 -147
5854 -147 -128 38 48 -47 -22 143 177 -136 178 -5 87 16 -25 118 -60 89 -43 13 57 49 -133 -64 84 -102
5878 -102 162 -69 81 -47 -36 -204 44 73 195 60 116 245 -69 -141 27 -52 189 121 81 -172 85 -92
5900 -92 -75 122 177 183 149 -13 -59 -86 -112 77 -244 -42 251 105 -35 179 17 -69 126 352 -87 -9 -214 3
5924 3 116 177 102 -288 -92 -146 -161 204 51 168 101 -112 -130 115 404 -51 -8 -107 73 -142 -182 12 -38 170
5948 170 -51 -76 129 -139 -319 -69 215 -53 105 225 268 -93 -240 -100 -121 10 98 -62 189 127 -49 -14
5970 -14 95 254 -42 130 93 -275 -91 16 -45 9 -290 8 20 94 -2 135 13 204 58 125 54 81 -114
5993 -114 -201 -58 35 298 -72 106 137 201 -57 -104 -119 -102 -11 -422 155 34 -76 179 -210 -115 -10 -20 56 265
6017 265 -84 46 -47 43 -172 1 115 -115 217 -37 109 34 160 86 -158 126 50 118 -5 -138 -103 -191 -62
6040 -62 41 141 287 -66 -56 -198 -266 -198 -155 90 49 169 66 -220 211 -86 185 -101 5 21 -326 -47
6062 -47 -14 118 -85 17 -26 155 -156 -72 79 40 34 -133 177 -12 -96 -148 -104 -232 -10 -64 70 -159 30 -29
6086 -29 177 -140 -62 -57 -44 -160 -6 -75 148 176 142 25 225 185 -69 -46 80 -50 105 256 78 -2 -3 81 108
6111 108 -147 -40 119 113 197 -136 -11 -98 318 -60 -106 101 -69 134 -271 -50 50 203 84 -136 -66 216
6133 216 173 162 -168 -3 40 162 -73 -13 -217 -127 76 69 -222 -158 69 87 -195 -26 -147 -102 9 -126 82
6156 82 -201 128 33 -18 -61 9 50 23 -33 1 16 -127 90 -301 -117 1 -98 -374 -3 -287 -69 -2 88 -176
6180 -176 -188 85 -50 132 84 231 -63 126 92 122 -99 40 -92 -52 197 300 -15 -61 233 -198 89 158
6202 158 -26 125 71 147 -173 -108 -15 -10 -126 45 98 90 103 87 -411 32 70 199 195 -66 112 0 -39 43 -134
6227 -134 -63 96 98 -81 249 -40 -137 -120 4 61 -20 -197 -132 41 100 25 -108 -66 -367 29 -263 161 -339 -46
6251 -46 -26 -74 38 -123 -59 -175 177 -1 -120 -233 -214 -138 -40 -273 -60 -31 -104 -2 98 10 -161 92 -132
6274 -132 -168 143 180 -206 172 -94 11 85 -135 93 -106 -73 -18 -166 -190 -91 -136 208 -13 -105 56 190 -164
6297 -164 130 -62 10 -19 -158 178 -133 21 -116 -26 -38 -34 -89 -84 210 63 -344 201 -88 -45 -45 102 111 -266 -68
6322 -68 -52 -42 -49 149 -228 83 -39 -115 138 184 -31 275 -236 -151 -88 210 58 -93 27 250 -372 -80 131
6345 131 -5 -123 -198 138 -214 151 -91 -163 -177 -82 32 51 11 -118 -352 -18 -219 -74 152 215 -171 -188 8
6368 8 -262 154 -275 40 -71 15 -28 84 -282 31 65 133 100 63 44 -153 3 252 -357 48 126 -13 67 -44
6392 -44 164 -205 -252 -69 -19 20 215 80 7 147 12 139 -165 -58 246 8 2 -28 -272 -200 11 -166 287
6415 287 35 -56 105 -52 21 280 193 56 70 144 -107 -185 34 -14 11 -12 106 -59 -180 -72 238 111 -69
6438 -69 83 218 51 94 -8 0 -267 88 -110 26 150 30 -273 64 -123 -79 -123 -29 31 -52 99 51 -102
6461 -102 82 -105 -17 220 33 -150 207 -15 -205 -41 -24 -64 -184 31 126 117 28 127 36 121 147 17 114 215
6485 215 19 22 -61 36 -10 83 -201 -139 135 -105 -252 -33 -423 250 15 99 -48 -221 -100 213 52 38 101
6508 101 62 81 89 -9 15 32 -47 53 -244 7 -29 -112 132 191 -145 139 145 0 -137 -55 22 39 -118 99 -61
6533 -61 203 -39 -169 -69 0 74 -240 -249 -130 94 82 86 -98 209 111 201 147 -148 -33 56 -107 387 23 63
6557 63 -180 45 10 -24 -173 -148 -81 99 140 59 197 -33 -154 -20 18 -73 46 -32 273 -55 -50 -113 -45 -150 -46
6582 -46 -155 181 -56 44 121 67 175 15 22 -4 46 33 -199 95 -202 157 -134 -52 -49 -76 -2 15 158 -121 -108
6607 -108 -45 -29 -55 173 -137 39 157 -29 -34 -74 304 149 67 134 -47 8 -83 -9 34 22 -13 24 14 -47 246 -101
6633 -101 94 -113 258 125 68 -158 98 69 85 -14 -56 -69 9 -90 96 73 -27 5 66 -198 -38 -104 -62 16 84
6658 84 -141 -83 241 66 47 149 -209 -74 51 67 78 -160 36 49 -155 -220 -214 -87 19 -211 14 -313 -33
6681 -33 -89 -157 -124 34 96 -164 -7 -244 22 -112 136 41 71 45 -277 54 60 63 183 97 -220 271 75 28 -75
6706 -75 67 -169 216 172 96 4 211 218 101 74 -33 78 -103 -52 -191 -85 -20 -261 -25 217 -5 -29 44 74
6730 74 -87 -91 -13 77 -2 -172 -120 -54 -76 47 -12 -49 97 -225 -112 58 -2 1 -157 140 -146 -213 78 158 -86
6755 -86 -69 -64 113 -64 -141 -56 -55 94 -72 19 -266 35 67 120 10 52 154 -84 -15 273 -31 119 177 37 -15
6780 -15 111 -137 33 -54 -12 25 -42 131 -122 48 -22 138 -3 -177 15 52 -11 104 -8 -135 -137 -135 17 -32
6804 -32 72 81 88 83 76 -50 27 60 -110 55 -203 117 -133 83 -123 -22 71 -116 144 -127 -73 28 -145 155
6828 155 168 -27 1 -78 -88 1 21 79 -61 -171 29 -11 -43 33 17 142 141 -120 110 -45 58 144 -25 141 77
6853 77 -190 -58 27 18 24 -103 176 -53 87 -25 -132 65 -52 20 59 -233 152 59 282 49 -26 209 19
6876 19 -71 -94 103 -290 -90 5 328 52 -64 96 164 175 135 -106 36 182 175 -71 101 -57 146 119 70 -19
6900 -19 -232 18 139 -79 66 133 -48 -118 83 51 -9 -170 -244 -53 -154 257 -184 -61 241 7 -15 231
6922 231 -23 -132 184 21 71 75 103 187 -25 -131 76 57 -112 80 170 43 2 84 122 48 47 67 47 -60 90
6947 90 206 26 -88 21 -22 -33 63 -23 -60 100 -161 -173 248 -99 251 -33 -28 48 -55 -18 17 -201 -148 180
6971 180 105 205 122 326 -43 -114 -124 12 185 -8 -10 -56 87 59 -25 -57 37 -112 -145 14 -37 129 -63 92
6995 92 82 -256 2 182 -80 163 -66 48 54 304 -218 176 -62 -194 -72 131 36 -151 -141 61 111 -11
7017 -11 362 59 -22 -52 214 13 -26 118 53 -7 427 -103 110 -87 -4 -31 238 252 140 24 242 -52 -21
7040 -21 -44 -110 4 127 140 -25 -15 233 -147 -189 140 -149 13 72 252 198 -287 111 -125 -44 133 150 176 -134
7064 -134 -181 36 59 6 113 122 -19 -133 -7 -36 37 54 66 25 -208 228 -130 -214 -82 -11 -110 -35 114 192 -67
7089 -67 2 -56 136 38 -25 112 -131 227 -30 152 79 11 75 25 -24 -78 -150 104 -95 154 190 97 78 -3 60 9
7115 9 -127 88 103 68 -48 -336 -19 31 -51 172 82 -63 47 93 -151 -111 -29 32 10 -14 -19 68 142 -231 -103 54
7141 54 216 8 -160 -253 30 -17 63 184 28 -156 42 41 0 -10 -67 40 88 161 -234 -48 51 -147 -105 -151 -141
7166 -141 5 52 163 -31 143 24 123 88 -210 -161 1 55 -179 60 -155 -26 94 112 173 211 173 82 -39
7189 -39 213 -181 110 -48 -27 -82 187 -51 131 -107 -15 181 -97 -70 -92 131 -20 -160 -120 -209 66 52 86
7212 86 4 1 -18 171 62 53 137 -77 122 17 -187 182 -79 281 174 -79 68 -68 -25 -82 -20 -157 22 221
7236 221 66 109 -74 -285 -18 -41 143 -61 -70 -24 -60 -97 8 273 83 -326 136 2 -159 6 90 -105 -113
7259 -113 -478 -80 -129 -150 -268 14 -29 -29 53 55 128 -81 219 -68 129 -201 -68 -114 -89 63 -49 89 -18 14
7283 14 -229 76 211 -143 -36 74 104 46 24 -161 35 -235 -49 47 -27 219 -74 9 132 -15 68 28 130
7306 130 63 88 -298 117 52 -69 -83 -227 170 71 112 -19 131 85 -25 122 2 127 -52 25 181 122 50
7329 50 234 7 -149 154 -16 -60 34 -162 -35 -118 107 -37 94 -104 45 -112 86 -19 -141 -110 122 186
7351 186 -57 -105 -86 -43 45 86 41 17 158 179 106 -188 -8 163 -173 -26 -50 -145 -48 -80 211 59 114 -136 -35
7376 -35 109 -168 216 119 53 -103 -160 -181 -89 -43 63 11 -49 -70 -64 -82 3 -137 210 -112 31 -70 -181 -54 -45
7401 -45 118 7 -9 -38 -122 -159 76 -82 265 22 -47 249 -14 87 169 -287 -37 -211 -83 65 -172 38
7423 38 -66 -176 -179 1 -96 -100 -160 -53 -26 -293 -12 -63 206 129 -119 -121 -26 49 -28 -82 353 -190 69 -167 -80 31
7449 31 -41 -166 -96 -51 21 -11 -98 -129 78 122 294 103 -98 176 -161 208 45 -124 -161 -83 -62 146 -137 -5
7473 -5 -9 -1 14 -293 47 237 -313 89 -81 -115 -95 -55 2 126 -82 103 -53 49 -95 -75 184 -9 -148 -24
7497 -24 47 128 -32 125 71 -236 19 10 -20 -64 -281 -135 55 167 -29 99 76 106 -83 98 119 -151 122 -117
7521 -117 194 -174 -173 -7 -112 -129 -98 335 -29 125 -29 -50 264 -124 82 -148 -152 -25 -52 -269 129 -272 -76
7544 -76 -153 -78 -136 -28 -98 -215 -74 15 -264 -53 -169 -102 118 67 -1 174 2 -113 -3 -146 -85 166 -58
7567 -58 36 -119 47 32 188 71 125 -20 86 -177 -24 51 -291 62 13 6 -24 56 179 -29 78 120 -131 -97
7591 -97 -19 288 128 -146 -49 45 120 4 78 24 -99 -58 -4 84 -54 84 -124 204 71 -124 52 -29 -67 67
7615 67 -219 -42 -33 -46 -63 -153 -39 -37 -207 -216 110 93 64 -17 191 25 101 -33 218 19 -54 -62 33 -215 -142 -110 68
7642 68 114 62 -51 -116 55 169 112 79 87 -177 -58 -17 71 107 -96 14 4 -6 -126 -224 172 -148 241 15 8
7667 8 -93 135 -131 69 75 -17 285 -74 72 157 93 77 -59 321 -19 -96 62 34 -154 78 -86 -186 -164 9
7691 9 -159 -131 1 -55 -12 100 28 -175 165 -128 -58 108 -74 -80 70 216 172 -60 -133 239 -66 13 306 169
7715 169 342 195 -159 125 -291 -12 68 73 -139 -103 62 37 -158 -171 171 152 -11 -162 -176 -137 148 -94 369
7738 369 -45 123 -107 -197 -119 -50 -382 -228 99 -108 169 -121 -122 -176 -150 -88 -72 114 113 120 43 -31 27 38 -25 -280
7764 -280 8 -213 27 169 -176 -100 39 -95 -115 41 -64 49 -32 111 78 0 81 -23 -136 66 332 -180
7786 -180 -71 -151 -105 148 2 124 -167 -64 -33 -99 -143 283 18 159 -217 169 -88 -26 82 -198 5 -41
7808 -41 36 127 106 -38 -9 115 -92 276 -231 -173 75 -116 -4 101 -175 86 -83 243 113 -15 7 61 87
7831 87 244 183 -249 -34 157 -209 -41 41 50 81 221 86 114 195 -198 -32 -100 33 -100 80 -42 145 228
7854 228 28 93 133 185 -58 14 -252 122 -126 142 -80 255 49 -49 74 -52 50 181 -42 -2 -50 121
7876 121 -136 230 -4 181 82 52 -26 113 184 -130 42 -142 -16 -15 74 -254 16 -101 -122 -155 -88 37 162
7899 162 136 117 204 -283 -181 -50 119 46 -144 -153 -104 -61 75 36 13 46 81 39 -50 249 -57 193 -110 117 -49
7924 -49 68 -278 -167 265 85 124 336 -65 -21 68 -70 -24 20 -129 169 -248 101 -189 -36 -103 18 171
7946 171 212 96 226 -116 19 60 69 -37 -236 -332 60 -24 -109 21 -202 328 141 -27 -88 64 -34 -276 153
7969 153 60 -82 131 80 11 110 257 55 153 -198 -60 132 289 -50 303 -115 -127 -49 91 -83 -184 -29
7991 -29 196 36 13 122 -215 20 186 156 -56 -73 244 30 53 194 211 11 -10 -39 63 14 -9 -38 114 327
8015 327 87 14 -143 214 -53 20 434 185 195 -158 -154 -3 -173 95 89 15 166 -86 -185 -116 -202 -7 -86 55
8039 55 36 -219 168 -142 -266 30 -130 73 95 77 82 -132 316 122 58 -6 -2 97 -11 -32 24 227 -79 -52 -123
8064 -123 49 -153 -49 338 49 -17 118 -48 97 96 -247 -62 129 203 200 67 49 -74 30 -2 135 -95 86
8087 86 -216 -53 -48 -258 -56 -1 38 -59 86 127 -96 55 201 36 158 238 254 236 304 209 63 -76 -69 180 110
8112 110 -20 47 -86 -42 -134 84 53 -19 -97 82 -306 -149 193 -78 -167 -8 65 1 74 61 -13 -127 -108 -59 69
8137 69 121 37 38 58 21 74 -34 -28 -90 -76 28 -219 62 257 -125 -315 21 237 80 58 -124 -209 -121 50 -12
8162 -12 -33 -31 118 -328 -107 -62 6 -137 -82 115 82 270 2 -70 141 30 -104 -239 -59 101 4 -21 24 -43
8186 -43 -54 -165 47 92 -211
8191b11
##END NTUPLES=NMR FID
##END=
