##TITLE=1H_DE-18km-TFA
 CDCl3
 8 sc, 
 29.9.2023
##JCAMPDX= 6.0         $$ Bruker NMR JCAMP-DX V2.0
##DATA TYPE= NMR FID
##DATA CLASS= NTUPLES
##ORIGIN= UXNMR, Bruker Analytische Messtechnik GmbH
##OWNER= root
$$ XWIN-NMR		Version 3.5
$$ Fri Sep 29 14:12:19 2023 Russian Standard Time (UT+4h)  she@DPX200
##.OBSERVE FREQUENCY= 200.13135
##.OBSERVE NUCLEUS= ^1H
##.DELAY= (6, 6)
##.ACQUISITION MODE= SIMULTANEOUS
##.ACQUISITION SCHEME= undefined
##.AVERAGES= 8
##.DIGITISER RES= 18
##SPECTROMETER/DATA SYSTEM= spect
##.PULSE SEQUENCE= zg30
##.SOLVENT NAME= CDCl3
##.SHIFT REFERENCE= (INTERNAL, CDCl3, 0, 15.7039)
##AUDIT TRAIL= $$ (NUMBER, WHEN, WHO, WHERE, WHAT)
$$ ##TITLE= Audit trail, XWIN-NMR		Version 3.5
$$ ##JCAMPDX= 5.01
$$ ##ORIGIN= Bruker BioSpin GmbH
$$ ##OWNER= she
$$ F:/spectra/data/she/nmr/H-F/1/audita.txt
$$ ##AUDIT TRAIL=  $$ (NUMBER, WHEN, WHO, WHERE, WHAT)
(   1,<2023-09-29 14:11:20.82 +0400>,<she>,<DPX200>,
      <created by zg, POWCHK disabled, PULCHK disabled
       configuration hash MD5:
       00 E9 B6 7A A2 85 ED C7 34 08 36 98 17 FE 4E 26
       data hash MD5: 16K
       F1 07 AF 66 29 E0 7B 54 88 CE 2A 62 AD FC 83 FD>)
$$ ##END=
$$ 
$$ hash MD5
$$ AF 0D 09 F6 B1 DA 4E 1A F9 75 AD D4 29 13 F0 10
##$RELAX= 
##$RELAX= 
##$RELAX= 
##$RELAX= 
##$RELAX= 
##$RELAX= 
$$ Bruker specific parameters
$$ --------------------------
##$DU= <F:/spectra>
##$EXPNO= 1
##$NAME= <H-F>
##$PROCNO= 1
##$TYPE= <nmr>
##$USER= <she>
##$AMP= (0..31)
100 100 100 100 100 100 100 100 100 100 100 100 100 100 100 100 100 100 
100 100 100 100 100 100 100 100 100 100 100 100 100 100 
##$AQSEQ= 0
##$AQ_mod= 1
##$AUNM= <au_zg>
##$AUTOPOS= <>
##$BF1= 200.13
##$BF2= 200.13
##$BF3= 200.13
##$BF4= 200.13
##$BF5= 200.13
##$BF6= 200.13
##$BF7= 200.13
##$BF8= 200.13
##$BYTORDA= 1
##$CFDGTYP= 0
##$CFRGTYP= 5
##$CHEMSTR= <none>
##$CNST= (0..31)
1 1 145 1 1 1 1 1 1 1 1 1 1 1 1 1 1 1 1 1 1 1 1 1 1 1 1 1 1 1 1 1 
##$CPDPRG= <>
##$CPDPRG1= <>
##$CPDPRG2= <>
##$CPDPRG3= <>
##$CPDPRG4= <mlev>
##$CPDPRG5= <mlev>
##$CPDPRG6= <mlev>
##$CPDPRG7= <mlev>
##$CPDPRG8= <mlev>
##$CPDPRGB= <>
##$CPDPRGT= <>
##$D= (0..31)
0 1.2 0 0 0 0 0 0 0 0.06 0 0.03 0 0 0 0 0.0002 0 0 0 0 0 0 0 0 0 0 0 0 
0 0 0 
##$DATE= 1695982280
##$DBL= (0..7)
120 120 120 120 120 120 120 120 
##$DBP= (0..7)
150 150 150 150 150 150 150 150 
##$DBP07= 0
##$DBPNAM0= <>
##$DBPNAM1= <>
##$DBPNAM2= <>
##$DBPNAM3= <>
##$DBPNAM4= <>
##$DBPNAM5= <>
##$DBPNAM6= <>
##$DBPNAM7= <>
##$DBPOAL= (0..7)
0.5 0.5 0.5 0.5 0.5 0.5 0.5 0.5 
##$DBPOFFS= (0..7)
0 0 0 0 0 0 0 0 
##$DE= 6
##$DECBNUC= <off>
##$DECIM= 32
##$DECNUC= <off>
##$DECSTAT= 4
##$DIGMOD= 1
##$DIGTYP= 9
##$DL= (0..7)
0 120 120 120 120 120 120 120 
##$DP= (0..7)
150 150 150 150 150 150 150 150 
##$DP07= 0
##$DPNAME0= <>
##$DPNAME1= <>
##$DPNAME2= <>
##$DPNAME3= <>
##$DPNAME4= <>
##$DPNAME5= <>
##$DPNAME6= <>
##$DPNAME7= <>
##$DPOAL= (0..7)
0.5 0.5 0.5 0.5 0.5 0.5 0.5 0.5 
##$DPOFFS= (0..7)
0 0 0 0 0 0 0 0 
##$DQDMODE= 0
##$DR= 18
##$DS= 0
##$DSLIST= <SSSSSSSSSSSSSSS>
$$ [...]
##$SUBNAM2= <"">
##$SUBNAM3= <"">
##$SUBNAM4= <"">
##$SUBNAM5= <"">
##$SUBNAM6= <"">
##$SUBNAM7= <"">
##$SUBNAM8= <"">
##$SUBNAM9= <"">
##$SW= 18.05172834244
##$SWIBOX= (0..15)
0 0 2 0 0 0 0 0 0 0 0 0 0 0 0 0 
##$SW_h= 3612.71676300578
##$TD= 16384
##$TD0= 1
##$TE= 0
##$TE2= 300
##$TE3= 300
##$TEG= 300
##$TL= (0..7)
0 120 120 120 120 120 120 120 
##$TP= (0..7)
150 150 150 150 150 150 150 150 
##$TP07= 0
##$TPNAME0= <>
##$TPNAME1= <>
##$TPNAME2= <>
##$TPNAME3= <>
##$TPNAME4= <>
##$TPNAME5= <>
##$TPNAME6= <>
##$TPNAME7= <>
##$TPOAL= (0..7)
0.5 0.5 0.5 0.5 0.5 0.5 0.5 0.5 
##$TPOFFS= (0..7)
0 0 0 0 0 0 0 0 
##$TUNHIN= 0
##$TUNHOUT= 0
##$TUNXOUT= 0
##$USERA1= <user>
##$USERA2= <user>
##$USERA3= <user>
##$USERA4= <user>
##$USERA5= <user>
##$V9= 5
##$VALIST= <valist>
##$VCLIST= <CCCCCCCCCCCCCCC>
##$VD= 0
##$VDLIST= <DDDDDDDDDDDDDDD>
##$VPLIST= <PPPPPPPPPPPPPPP>
##$VTLIST= <TTTTTTTTTTTTTTT>
##$WBST= 1024
##$WBSW= 4
##$XGAIN= (0..3)
0 0 0 0 
##$XL= 0
##$YL= 0
##$YMAX_a= 146479
##$YMIN_a= -129380
##$ZGOPTNS= <>
##$ZL1= 120
##$ZL2= 120
##$ZL3= 120
##$ZL4= 120
##$ABSF1= 10
##$ABSF2= 0
##$ABSG= 5
##$ABSL= 3
##$ALPHA= 0
##$AQORDER= 0
##$ASSFAC= 0
##$ASSFACI= 0
##$ASSFACX= 0
##$ASSWID= 0
##$AUNMP= <proc_1d>
##$AZFE= 0.1
##$AZFW= 0.1
##$BCFW= 1
##$BC_mod= 2
##$BYTORDP= 1
##$COROFFS= 0
##$CY= 11.3945322036743
##$DATMOD= 1
##$DC= 2
##$DFILT= <>
##$DTYPP= 0
##$F1P= 15.7292609196834
##$F2P= 12.9074282941183
##$FCOR= 0.5
##$FTSIZE= 0
##$FT_mod= 4
##$GAMMA= 1
##$GB= 0.15
##$INTBC= 1
##$INTSCL= 1
##$ISEN= 128
##$LB= 0.24
##$LEV0= 0
##$LPBIN= 0
##$MAXI= 10000
##$MC2= 0
##$MEAN= 0
##$ME_mod= 0
##$MI= 1.114404
##$NCOEF= 0
##$NC_proc= 0
##$NLEV= 6
##$NOISF1= 3.799351
##$NOISF2= 2.8
##$NSP= 1
##$NTH_PI= 0
##$NZP= 0
##$OFFSET= 15.70392
##$PC= 1
##$PHC0= -21708.73
##$PHC1= 8.052711
##$PH_mod= 1
##$PKNL= yes
##$PPARMOD= 0
##$PSCAL= 0
##$PSIGN= 0
##$REVERSE= no
##$SF= 200.130013532006
##$SI= 16384
##$SIGF1= 3
##$SIGF2= 2
##$SINO= 400
##$SIOLD= 16384
##$SREGLST= <1H.CDCl3>
##$SSB= 0
##$STSI= 0
##$STSR= 0
##$SW_p= 3612.71676300578
##$SYMM= 0
##$S_DEV= 0
##$TDeff= 0
##$TDoff= 0
##$TI= <>
##$TILT= no
##$TM1= 0
##$TM2= 0
##$TOPLEV= 0
##$USERP1= <user>
##$USERP2= <user>
##$USERP3= <user>
##$USERP4= <user>
##$USERP5= <user>
##$WDW= 1
##$XDIM= 8192
##$YMAX_p= 0
##$YMIN_p= 0
$$ End of Bruker specific parameters
$$ ---------------------------------
##NTUPLES= NMR FID
##VAR_NAME=  TIME,          FID/REAL,        FID/IMAG
##SYMBOL=    X,             R,               I
##VAR_TYPE=  INDEPENDENT,   DEPENDENT,       DEPENDENT
##VAR_FORM=  AFFN,          ASDF,            ASDF
##VAR_DIM=   8192,          8192,            8192
##UNITS=     SECONDS,       ARBITRARY UNITS, ARBITRARY UNITS
##FACTOR=    0.0002768,     1,               1
##FIRST=     0,             0,               0
##LAST=      2.2672688,     0,               0
##MIN=       0,             -129380,         0
##MAX=       2.2672688,     146479,          0
$$ Real data points
##PAGE= N=1
##DATA TABLE= (X++(R..R)), XYDATA
$$ [...]
$$ plain form
1832 596 127 -361 157 258 36 -556 -659 233 70 -754 -154 294 258 -225 -128 337 155 -305 -69 215 380
1853 380 -253 187 559 235 -142 365 428 171 -231 -98 485 28 -101 -268 449 -163 -528 -509 71 -301 -448
1874 -448 -301 67 166 -344 35 270 -150 -420 261 311 146 -201 217 542 -181 -17 128 335 278 -149 -81
1895 -81 420 37 -156 -148 423 -15 -190 -102 -55 -239 -596 -204 -2 32 -424 -165 35 67 -288 87 545 60
1917 60 -312 328 587 185 169 226 464 128 74 150 301 213 -198 -298 411 -238 -664 -11 285 -197 -229 -235 -77
1940 -77 -59 -402 -295 138 -55 -499 -204 269 -85 -235 94 551 304 5 216 303 159 -169 138 433 -159
1961 -159 -198 -61 192 -59 -471 164 130 -48 -314 -178 205 213 -408 -299 344 -170 -601 100 192 -130 -136 5
1983 5 669 183 -276 5 598 69 -453 53 663 -79 -274 47 194 -271 -560 -157 12 -46 -711 -231 -155
$$ packed form
1832E96m69m88N18J01k22n92j03Q92j63q24O00M48l6m83R7M65j82m60K36K84J65
1853C80o33M40L72l24l77N07O3k57m02J33N83m57j29j67P17o12l65J9N80l72j47
1874d48J47L68R9n10L79K35m20k70O81N0j65l47M18L25p23J64J45K07n7m27O8
1895h1N01l83j93QN71m38j75Q8M7j84l57L92K02L4m56K59K00L2l55L75M58m85
1917F0l72O40K59m02j6N7K38l36n4P6J51q8m11j00P09o49m26O53K96m82l2oJ58
1940g7J8l43J07M33j93m44K95M73l54j50L29M57k47k99K11Q7j44l28L07K95n92
1961a59l9J37K53k51m12O35l4j78k66J36L83Qo21J09O43n14m31P01R2l22oJ41
1983EO64m86m59K81N93n29n22N06O10p42j95L21J47m65k89M03J69n8o65M80P6
$$ plain form
2004 -155 -211 -583 90 239 -279 -469 -38 413 -16 -306 287 680 361 -179 -90 302 88 -480 81 586 -26
2025 -26 -297 141 273 -149 -394 -6 175 -494 -295 -101 242 -424 -378 -162 119 -133 -350 -136 286 -33 -197
2046 -197 -197 290 49 54 355 308 166 -317 74 226 42 -343 61 144 121 -427 -164 284 -252 -518 -225 198
2068 198 -91 -532 -249 258 -18 -476 117 374 -187 -235 214 394 10 -140 421 383 54 -149 391 456 -45
2089 -45 -74 -180 196 94 -529 -18 346 -24 -327 -3 195 54 -408 -4 94 -141 -118 274 282 -22 -314 83
2111 83 333 86 -274 337 475 -11 -120 220 393 105 -138 33 316 -97 -344 230 112 -157 -272 -140
2131 -140 182 -370 -221 -25 165 -133 -460 -202 208 -178 -209 296 338 238 78 299 309 -177 -80 302 527
2152 527 130 21 67 339 102 -417 -7 124 -194 -543 -148 98 -172 -491 -71 246 -40 -556 112 286
$$ packed form
2004a55n6l72O73J49n18j90M31M51m29k90N93L93l19n40Q9L92k14n68N61N05o12
2025b6k71M38J32m22k45L88J81o69J99J94L43o66M6K16K81k52k17K14M22l19j64
2046a97%M87k41NL01m7j42m83L91J52j84l85M04Q3k3n48K63M48n36k66K93M23
2068A98k89m41K83N07k76m58N93K57n61m8M49J80l84j50N61l8l29k03N40O5n01
2089d5k9j06L76j02o23N11L64l70l03L24J98j41m62M04R8k35K3L92Ql04k92L97
2111H3K50k47l60O11J38m86j09L40J73k88k43J71K83m13k47N74j18k69j15J32
2131a40L22n52J49J96J90k98l27K58M10l86l1N05M2j00j60K21J0m86R7L82K25
2152E27l97j09M6K72k37n19M10J31l18l49L95K46k70l19M20L17k86n16O68J74
$$ plain form
2172 286 65 -80 21 386 239 -161 486 643 56 -139 188 337 8 -83 88 292 -122 -368 -192 223
2192 223 -211 -438 -32 129 -261 -321 8 -46 35 -381 2 202 200 -168 86 344 112 -195 290 545 -78 -179
2214 -179 165 194 -109 -113 -22 274 -182 -256 -233 514 54 -648 112 63 -195 -394 27 198 -281 -245 -165 100 -42
2237 -42 -101 -131 145 463 -201 110 201 89 38 169 513 -229 -67 231 214 -112 -203 -196 188 39 -369 -232 175
2260 175 -173 -415 40 28 -282 -489 125 132 -258 -222 23 351 156 113 327 173 300 -154 205 253 -92 -84 128
2283 128 229 146 -279 107 129 -121 -315 -68 -5 -176 -486 -148 403 -364 -370 -106 190 80 -270 171 358 -37
2305 -37 46 261 555 307 -344 161 495 -33 -441 155 503 -36 -328 51 139 -259 -234 -297 258 -339 -360 35
2327 35 -156 -250 -283 -161 220 -17 -168 -49 214 -58 30 -43 176 -18 -263 314 210 109 -62 20 -92 -214
$$ packed form
2172B86k21j45J01L65j47m00O47J57n87j95L27J49l29r1J71K04m14k46J76M15
2192B23m34k27M06J61l90o0L29n4Q1m16L83K00kl68K54K58k32l07M85K55o23j01
2214a79L44K9l03mR1K96m56p4K3P47m60p02P60m9k58j99M21J71m79L6Q0K65j42
2237d2n9l0K76L18o64L11R1j12n1J31L44p42J62K98j7l26r1PL84j49m08J37M07
2260A75l48k42M55j2l10k07O14Pl90L6K45L28j95m3K14j54J27m54L59M8l45QK12
2283A28J01q3m25L86K2k50j94K47O3j71l10L38N51p67oK64K96j10l50M41J87l95
2305c7Q3K15K94k48o51N05L34n28m08N96L48n39k92L79Q8l98K5o3N55n97k1L95
2327C5j91r4l3J22L81k37j51J19K63k72Q8p3K19j94k45N77j04j01j71Q2j12j22
$$ plain form
2349 -214 -446 132 391 -143 -311 -65 318 -190 -225 37 30 -81 -185 -373 167 -119 -69 -10 285 2 -97 184
2371 184 241 87 -341 69 359 145 -65 116 87 120 -131 255 197 -330 -206 -3 63 -383 -128 236 138 -66
2393 -66 -372 69 207 -259 -326 30 302 65 -162 -55 416 62 -151 185 56 -151 109 337 117 -131 -50
2414 -50 132 353 -163 -207 -67 200 -227 -202 72 66 -167 -386 215 177 -175 -241 97 264 126 -72 323 72
2436 72 -82 -77 72 376 -210 -292 209 103 -18 -365 -50 283 -258 -404 -133 30 -126 -613 -57 -118 -58 -62 -234
2459 -234 -139 21 -391 264 267 78 11 225 213 -48 15 221 182 188 -30 361 428 -160 -71 -13 331 139 -233 -21
2483 -21 4 -189 -383 -101 178 -222 -239 159 -91 -140 -264 127 183 -206 -103 147 124 -74 -241 -40 326 268
2505 268 -214 98 287 79 -31 97 -103 -135 -211 37 306 83 -84 95 6 4 -439 114 -17 -10 -232 182
$$ packed form
2349b14k32N78K59n34j68K46L83n08l5K62pj11j04j88N40k86N0N9K95k83r9K81
2371A84N7j54m28M10K90k14k10J81k9L3k51L86n8n27J24K03O6m46K55L64r8k04
2393f6l06M41J38m66o7L56K72k37k27J07M71l54k13L36j29k07K60K28k20k48Q1
2414e0J82K21n16m4J40K67m27K5K74ok33k19O01l8l52o6L38J67j38j98L95k51
2436G2j54NJ49L04n86q2N01j06j21l47L15L33n41j46K71J63j56m87N56o1O0mj72
2459b34R5J60m12O55Lj89o7K14j2k61O3K06l9Ok18L91O7n88Q9N8L44j92l72K12
2483b1K5j93j94K82K79m00j7L98k50m9j24L91N6l89J03K50k3j98j67K01L66n8
2505B68m82L12J89k08j10J28k00l2p6K48K69k23j67J79q9km43N53j31Pk22M14
$$ plain form
2527 182 174 -10 21 270 385 -283 -134 -7 130 180 -51 542 169 -74 -139 275 85 -140 -24 -59 285 -168
2549 -168 -360 -49 277 -334 -38 74 -144 -91 -292 -32 91 -177 -368 -68 69 66 -81 90 223 17 -119
2570 -119 141 135 -66 -138 250 99 -14 -236 215 -106 -108 -259 -127 193 -168 -220 169 63 -127 -27 50 -10 -21
2593 -21 -142 255 286 12 -28 480 40 -77 49 -151 295 -644 11 324 71 71 -68 237 311 -108 -254 -12
2615 -12 -31 -90 -110 -74 -167 -44 -305 -255 -47 -356 -400 416 353 -75 -159 262 221 55 -30 187 464 116 25 368
2639 368 209 2 -164 209 -3 -215 -170 101 86 -206 -197 -65 -369 -188 -81 172 165 -98 -271 276 126 -287
2661 -287 -74 57 356 -86 133 498 305 -25 221 241 155 -131 153 60 129 -179 -186 5 -36 -366 -514 5
2683 5 77 -251 -27 -137 161 -130 -320 -197 165 -184 -232 300 295 -20 -39 171 120 82 -245 431 160 -164 -38
$$ packed form
2527A82qj84L1K49J15o68J49J27J37N0k31N93l73k43o5M14j90k25J16l5L44m53
2549a68j92L11L26o11K96J12k18N3k01K60J23k68j91L00J37lj47J71J33k06j36
2570a19K60ok01p2L88j51j13k22M51l21kj51J32L20l61n2L89j06j90J00P7o0j1
2593b1j21L97L1k74m0N08m40j17J26k00M46r39O55L13k53%j39L05P4m19j46K42
2615a2j9n9k0L6r3J23k61N0K08l09m4Q16o3m28q4M21m1j66q5K17K77l48r1L43
2639C68j59k07j66L73k12k12M5K71j5k92RJ32l04J81J07K53pk63j73N47j50m13
2661b87K13J31K99m42K19L65j93l30K46K0q6k86K84r3O9l08pJ91m1l30j48N19
2683EP2l28K24j10K98k91j90J23L62l49m8N32nl15j9K10n1l8l27O76k71l24J26
$$ plain form
2706 -38 19 41 -192 -287 236 17 -223 -225 189 235 -188 8 403 137 38 -12 -66 58 -215 -158 124 57 -161 -16
2730 -16 191 198 -35 -205 53 -90 -42 16 123 46 -58 -182 169 34 -139 -223 -268 109 -8 -207 53 10 -258
2753 -258 -40 58 21 -109 -252 129 136 -93 -185 126 278 32 125 -111 -18 68 -43 1 106 -168 -352 67 117
2776 117 -86 -375 152 97 10 -88 134 254 -116 -196 118 2 -264 -97 239 161 -365 -37 315 196 -27 -198
2798 -198 218 412 92 -142 105 -114 -77 -317 182 171 -127 -88 64 9 -106 -134 -137 -140 43 -32 67 -54 32 -111
2822 -111 16 178 21 -39 212 252 -98 184 119 121 -148 -66 57 173 -209 -96 67 186 -223 -54 -154 158
2844 158 -60 -79 177 -23 -146 -81 96 162 -132 -18 99 199 -19 -168 297 399 172 -100 260 111 111 -58
2866 -58 60 -12 -203 64 143 296 -394 -238 33 144 -203 44 -75 -80 -86 -38 217 96 -74 60 96 202 17
$$ packed form
2706c8N7K2k33r5N23k19k40kM14M6m23J96L95k66r9n0n4J24k73N7K82o7k18J45
2730a6K07Pk33j70K58j43M8N8J07p7j04j24L51j35j73q4m5L77j17j99K60m3k68
2753b58K18R8l7j30j43L81Pk29r2L11J52k46R3k36R3Q6j11M4J05k74j84M19N0
2776A17k03k89N27n5q7r8K22J20l70q0L14j16k66J67L36p8n26L28L52j19k23j71
2798a98M16J94l20k34K47k19L7k40M99j1k98L9J52n5j15k8llJ83p5R9j21Q6j43
2822a11J27J62j57o0K51M0l50K82o5Kk69Q2J23J16l82J13J63J19m09J69j00L12
2844A58k18j9K56k00j23O5J77O6k94J14J17J00k18j49M65J02k27k72L60j49%j69
2866e8J18p2j91K67P9J53o90J56K71J11l47K47j19noM8K55j21j70J34L6J06j85
$$ plain form
2889 17 161 200 274 72 21 29 413 7 -125 144 17 -164 -106 224 33 -159 -229 136 167 -290 -363 53 -301
2912 -301 -252 -198 -86 108 11 61 194 29 -182 269 165 92 250 -24 297 -75 -38 -155 212 412 17 35
2934 35 243 194 -19 -374 -200 56 -238 -233 -85 56 -124 1 80 162 -50 -8 99 -1 163 23 197 98 3
2957 3 77 315 -91 30 54 63 -3 2 101 45 114 -171 -111 -96 195 -374 -71 70 -2 -70 -93 -235 98 -117 -2 146
2983 146 309 -101 191 198 108 54 23 151 201 -101 -168 98 -12 -96 92 -192 6 142 177 67 150 17 -24 156
3007 156 -21 -390 -224 7 -43 126 -273 -41 31 22 113 48 244 -259 294 129 7 181 -175 79 -80 -5
3029 -5 157 -7 21 -315 -35 23 -63 -30 -174 -40 201 -12 -75 180 153 -226 72 55 140 -141 -22 169 101 -173
3053 -173 -28 25 380 -314 146 66 76 223 307 -109 -138 -185 -219 197 -251 -125 -19 131 284 -355 -219 44
$$ packed form
2889A7J44L9P4k02n1QL84m06j32K69j27j81N8L30j91j92p0L65L1m57p3M16l54
2912c01M9N4J12J94r7N0J33j65k11M51j04p3J58k74L21l72L7j17L67K00l95J8
2934C5K08m9k13l55J74K56k94NJ48J41j80J25P9Q2k12M2J07j00J64j40J74r9r5
2957CP4K38m06J21K4Ro6NR9n6O9k85O0J5K91n69L03J41p2o8k3j42L33k15J15J48
2983A46J63m10K92Pr0n4l1J28N0l02o7K66j10q4J88k84J98J36L5j10Q3j33m1J80
3007A56j77l69J66K31n0J69l99K32P2rR1o5J96n03N53j65j22J74l56K54j59P5
3029eJ62j64K8l36K80N8q6L3j44J34K41k13o3K55k7l79K98j7Q5k81J19J91o8k74
3053a73J45N3L55o94M60q0J0J47Q4m16k9m7l4M16m48J26J06J50J53o39J36K63
$$ plain form
3075 44 130 -53 -214 1 197 246 59 208 -114 184 -69 101 181 -81 -45 126 77 -110 -186 91 51 117 23
3098 23 52 -197 -42 -20 -90 -66 111 131 56 -148 110 -206 25 6 -124 -138 165 -33 110 161 147 86 -16 164
3122 164 81 -82 115 137 235 -40 -146 -125 -40 -135 -83 -81 -85 -269 -178 -150 7 70 66 174 75 -50 8 89 289 276 -28
3149 -28 -167 99 280 31 87 303 48 -133 312 42 69 -153 -54 258 -137 -116 172 -146 -34 45 -14 77 -71
3172 -71 -67 52 94 -32 -160 -204 89 297 -15 -59 143 -35 34 44 -9 164 -133 95 153 171 -253 138 51 183
3196 183 116 112 -1 50 -213 15 157 13 31 -68 -39 84 50 136 36 38 -243 -69 150 175 -21 401 229 286
3220 286 -257 -130 -51 -85 -462 16 154 -113 -76 -142 46 -204 -194 -37 48 31 -53 83 193 -14 120 -172 -49
3243 -49 -39 128 160 57 -101 -114 103 319 -109 90 12 32 -20 -138 -102 152 -26 -172 -121 147 -32 -108 -90 -87
$$ packed form
3075D4Q6j83j61K15J96M9j87J49l22K98k53J70Q0k62L6J71m9j87p6K77m0O6r4
3098B3K9k49J55K2p0K4J77K0p5k04K58l16K31j9j30j4L03j98J43N1j4o1j02J80
3122A64q3j63J97K2R8k75j06K1Q5r5N2Kmj84R1K8J57O3mJ08r9j25N8Q1K00j3l04
3149b8j39K66J81k49N6K16k55j81M45k70K7k22R9L12l95K1K88l18J12P9n9R1j48
3172g1MJ19M2j26j28m4K93K08l12m4K02j78O9J0n3J73k97K28N8J8m24L91q7J32
3196A83o7mj13N1k63K28J42j44J8r9K9J23l4Q6j00Kk81J74K19K5j96M22j72N7
3220B86n43J27P9l4l77M78J38k67L7o6J88k50J0J57Q5j7q4J36J10k07J34k92J23
3243d9J0J67L2j03j58j3K17K16m28J99p8K0n2j18L6K54j78j46N1K68j79p6J8L
$$ plain form
3267 -87 -60 -150 -53 139 68 -272 53 50 -39 -70 42 480 3 -188 -25 147 55 18 -219 7 -78 -41 214 87
3291 87 -140 50 20 -177 -193 -72 -64 145 -173 72 -116 156 33 -228 -7 114 141 -150 -142 200 -152 -127 184
3314 184 56 194 -135 -199 61 149 -92 31 146 102 -42 119 -56 105 -25 -2 -59 45 -122 -7 90 44
3336 44 -224 9 106 -152 27 -64 208 404 -2 7 84 -4 81 70 156 -132 -120 -233 236 -24 -339 59 -28 -125
3360 -125 -115 -102 88 53 -94 21 -131 -144 94 -65 265 27 0 103 76 -19 -1 267 188 -30 -337 37 220
3383 220 149 19 128 143 206 135 151 -20 -160 -175 -165 5 -57 6 -122 19 -78 -345 115 111 85 172 65 -122 107
3408 107 -82 41 -98 -43 85 -105 170 5 -112 64 114 139 -87 -62 201 -233 -6 32 -38 186 83 -52
3430 -52 -26 -145 124 -16 139 -117 110 195 298 342 -139 207 42 -121 36 109 128 64 -41 -179 69 164 -181
$$ packed form
3267h7K7r0R7J92p1l40L25lq9l1J12M38m77j91J63J72r2l7k37K26q5L7K55j27
3291H7k27J90l0j97j6J21QK09l18K45j88K72j23k61K21J21K7k91QL42l52K5L11
3314A84j28J38l29o4K60Q8k41J23J15m4j44J61j75J61j30K3n7J04j67J15R7m6
3336D4k68K33R7k58J79r1K72J96m06RP7q8Q5j1Q6k88J2j13M69k60l15L98q7r7
3360a25J0J3J90l5j47J15j52j3K38j59L30k38k7J03k7r5J8K68p9k18l07L74J83
3383B20p1j30J09J5O3p1J6j71j40j5J0J70o2O3j28J41r7k67M60mk6Q7j07j87K29
3408A07j89J23j39N5J28j90K75j65j17J76N0K5k26K5K63m34K27L8p0K24j03j35
3430e2K6j19K69j40J55k56K27Q5J03M4m81L46j65j63J57P3J9o4j05j38K48R5l45
$$ plain form
3453 -181 11 -56 -30 -167 76 129 70 34 -28 72 139 -20 -67 221 -65 18 8 25 -30 -162 441 -134 -129 -212 -112
3478 -112 275 71 -32 -37 84 -21 -291 -158 29 2 -78 -53 33 29 -126 28 -26 -44 102 -229 129 79 -42 13
3502 13 272 -127 73 8 -160 -114 126 154 6 54 -2 -101 -90 -75 58 0 -11 -81 -118 -34 68 -58 -247 88 -3
3527 -3 -156 -73 -219 196 47 1 74 112 -15 -141 109 76 -203 -212 45 50 27 -34 61 -92 27 -198 -26 75 84
3552 84 -213 68 -45 -102 -146 64 -127 198 -201 -79 142 -58 -71 18 113 -24 -27 -79 18 -135 31 55 119 160
3576 160 -342 29 -75 -223 -171 -82 -37 -106 -358 48 312 -117 -58 139 -239 -81 -129 -65 -37 -182 -168 29 152
3599 152 181 -201 -133 -39 182 -94 158 128 -163 183 11 158 36 -114 81 108 -103 -265 57 -245 43 70
3621 70 -2 199 28 -23 -68 173 234 -103 52 252 62 -181 -16 102 64 -84 7 114 342 -3 -47 162 -55
$$ packed form
3453a81J92o7K6j37K43N3n9l6o2J00O7j59m7K88k86Q3j0J7n5j32O03n75Nq3J00
3478a12L87k04j03nJ21j05k70J33J87k7q0K5Q6mj55J54n4j8J46l31L58n0j21N5
3502A3K59l99K00o5j68M6K40K8j48M8n6r9J1J5J33n8j1p0l7Q4J02j26j89L35r1
3527cj53Q3j46M15j49m6P3L8j27j26K50l3k79rK57Nk3o1R5j53J19k25J72J01R
3552H4k97K81j13n7m4K10j91L25l99J22K21k00j3Q9R5j37ln2R7j53J66K4O4M1
3576A60n02L71j04j48N2Q9M5o9k52M06K64m29N9J97l78J58m8O4K8j45J4J97J23
3599A52K9l82O8R4K21k76K52l0k91L46j72J47j22j50J95K7k11j62L22l02K88K7
3621G0p2K01j71n1m5K41O1l37J55K00j90k43J65J18l8j48R1J07K28l45m4K09k17
$$ plain form
3644 -55 -76 239 156 31 -62 -58 -92 227 -47 -221 145 -203 -151 -230 79 -26 -35 130 7 69 30 63 237 49 95
3669 95 390 266 201 -87 -37 -187 20 -22 -7 18 -42 -23 -33 133 -21 60 -131 -1 -162 -180 32 38 96 80 -73
3694 -73 131 47 -118 -11 -34 312 -240 54 137 191 30 73 -78 216 -91 -87 230 46 178 -41 283 -1 -54
3717 -54 -46 37 -123 -7 -5 -59 -259 -150 -61 251 -25 -231 4 221 107 -1 10 217 -116 30 54 52 155 -109
3741 -109 65 -187 -150 -92 125 -16 -204 -70 -95 -99 -103 -25 130 -26 -184 -262 150 -124 -17 72 98 206 -46 4
3765 4 186 -3 16 -120 -214 -111 206 117 -27 345 -31 -52 148 21 55 -335 -162 156 -167 -28 61 -24 37
3788 37 -198 -213 -23 -13 102 -10 200 -58 -156 106 -87 -147 47 268 287 80 -7 214 115 174 42 -147 50
3811 50 242 -117 114 -56 -175 -78 -53 -138 -236 -21 111 -19 -17 -283 287 -165 -80 -163 -24 250 39 -4 53 245
$$ packed form
3644e5k1L15q3j25r3Ml4L19k74j74L66l48N2p9L09j05rJ65j23O2l9L3J74j88M6
3669I5K95j24o5k88N0j50K07m2J5K5o0J9j0J66j54Q1j91J30j61j8K12ON8j6j53
3694g3K04q4j65J07k3L46n52K94Q3N4j61M3j51K94l07ML17j84J32k19L24k84n3
3717e4QQ3j60J16Kn4k00J09Q9L12k76k06K35K17j14j08J1K07l33J46K4kJ03k64
3741a09J74k52L7N8K17j41j88J34k5mmP8J55j56j58p8M12k74J07Q9K6J08k52N0
3765DJ82j89J9j36r4J03L17q9j44L72l76k1K00j27L4l90J73L18l23J39Q9q5O1
3788C7k35j5J90J0J15j12K10k58r8K62j93o0J94K21J9k07q7K21r9N9j32j89J97
3811E0J92l59K31j70j19R7K5q5r8K15J32j30Kk66N70m52Q5q3J39K74k11m3N7J92
$$ plain form
3835 245 74 128 261 159 -107 20 -38 204 -148 -29 116 224 21 -103 -211 -137 -84 -92 -8 162 -115 -102 96
3858 96 86 23 63 -39 235 407 107 176 85 -143 172 104 96 166 -23 14 -215 164 170 211 151 -376 130 38 206
3883 206 67 -159 -33 91 163 -199 205 -59 -22 -65 113 32 87 83 222 -33 257 -128 347 -2 -90 10 24
3906 24 -18 36 129 -2 47 46 -277 -161 -91 38 -55 187 76 -29 246 -251 44 -104 -68 246 114 38 -38 243
3930 243 106 2 64 -72 51 45 -105 -75 -35 -91 49 -3 -144 173 142 -55 -50 -101 -15 -187 -334 129 -183 275
3954 275 22 -60 -119 -81 13 -97 160 -83 68 -21 69 31 295 104 -51 166 220 -125 -143 -59 -221 37 -209
3977 -209 -25 89 43 -62 110 90 -149 77 -39 195 -65 23 39 219 12 24 102 -65 102 -40 23 34 -37
4000 -37 -111 95 296 -8 -28 -46 5 25 -103 -44 -132 145 27 71 -164 -70 62 46 -67 138 -21 48 -221 -14
$$ packed form
3835B45j71N4J33j02k66J27n8K42l52J19J45J08k03j24j08P4N3qQ4J70k77J3J98
3858I6j0o3M0j02K74J72l00O9r1k28L15o8qP0j89L7k29L79OM1o0n27N06r2J68
3883B06j39k26J26J24P2l62M04k64L7m3J78q1N5mJ39k55K90l85M75l49q8J00J4
3906B4m2N4R3j31M9jl23J16P0J29r3K42j11j05K75m97K95j48L6L14j32p6p6K81
3930B43j37j04O2j36J23oj50L0M0n6J40n2j41L17l1j97Nn1Q6j72j47M63l12M58
3954B75k53q2n9L8R4j10K57k43J51q9R0l8K64j91j55K17N4l45j8Q4j62K58k46
3977b09J84J14m6j05J72k0k39K26j16K34k60Q8J6J80k07J2P8j67J67j42O3J1p1
4000c7p4K06K01l04k0j8N1K0j28N9q8K77j18M4k35R4J32j6j13K05j59O9k69K07
$$ plain form
4024 -14 3 63 229 -68 94 102 -208 100 -64 222 14 33 28 -114 -13 -217 86 55 7 -144 -182 -209 -281 -64
4048 -64 -243 46 188 -32 -45 161 250 -61 68 -10 180 247 147 183 161 -49 -202 244 243 -1 45 129 -53 94
4072 94 -306 36 -88 -222 -155 298 -319 -190 -205 -2 256 -30 -182 -43 122 -29 9 144 44 -178 -25
4093 -25 -66 39 -286 -207 144 187 72 204 33 228 34 68 -85 120 38 91 121 267 -258 52 -158 -102 -46
4116 -46 -149 -2 -28 59 -96 -82 93 -100 80 89 167 20 -53 245 246 -128 -216 205 -111 -133 208 114 63 -76 -31
4141 -31 18 -9 105 -15 43 263 173 91 27 -6 72 -63 64 237 -101 31 110 30 171 -135 31 369 -127 -218
4165 -218 50 -69 131 126 -223 -205 222 -179 57 -63 -86 173 8 -55 -30 160 58 -12 -31 -97 -200 386 -100
4188 -100 -75 -8 -36 -38 -70 306 7 -87 11 83 178 93 134 112 54 20 -93 15 -88 -68 -179 62 -89 -128 57 257
$$ packed form
4024a4J7O0J66k97J62Ql10L08j64K86k08J9nj42J01k04L03l1m8j51l8k7p2K17
4048f4j79K89J42k20j3K06Q9l11J29p8J90O7j00L6k2k10j53M46jk44M6Q4j82J47
4072I4m00L42j24j34O7M53o17J29j5K03K58k86j52J39J65j51L8J35j00k22J53
4093b5m1J05l25P9L51M3j15J32j71J95j94L4j53K05q2N3L0J46n25L10k10N6N6
4116d6j03J47k6Q7j55J4J75j93J80RP8j47p3K98Jl74q8M21l16k2L41r4n1j39M5
4141c1M9k7J14j20N8K20r0q2o4l3P8j35J27J73l38J32P9q0J41l06J66L38m96r1
4165b18K68j19K00nl49J8M27m01K36j20k3K59j65o3K5J90j02p0j9o6j03N86m86
4188a00K5O7k8kl2L76k99r4R8P2R5q5M1k2n8l4j13J08j03K0j11K41j51l9J85K00
$$ plain form
4214 257 201 -54 -119 10 77 -93 -145 142 122 -19 -197 232 101 -102 268 80 -95 78 -76 197 -163 -161
4236 -161 -337 -83 -32 -36 -19 -100 -176 -15 239 166 -3 -135 -206 149 -207 -375 -50 -103 98 -275 33 -19 -49 -42
4260 -42 -210 -36 127 14 97 -259 54 158 -46 -5 -213 -126 -75 -170 -132 -316 -109 -17 -59 64 -404 134 96
4283 96 -76 33 222 -11 -63 159 -2 54 21 15 -64 -167 -257 -44 -124 -154 -187 -125 230 -149 -148 -100 175 -24 152
4308 152 235 43 -33 -113 -52 99 196 14 117 -118 113 55 -239 152 122 -51 -136 167 115 -180 -11 -102 33
4331 33 -146 -110 116 71 -41 -256 -31 37 50 117 -246 9 126 -63 -108 -20 -41 73 120 -61 143 81 61 220
4355 220 74 274 307 122 143 2 132 -61 -22 191 61 -1 3 -36 59 94 4 -10 -2 1 306 -89 -9 51 147 -122
4381 -122 28 106 -255 45 27 72 -83 9 -158 88 34 250 -253 90 30 -263 -127 -107 -122 -43 117 -40 341
$$ packed form
4214B57n6k55o5J29O7j70n2K87k0j41j78M29j31k03L70j88j75J73j54K73l60K
4236a61j76K54N1mJ7q1p6J61K54p3j69j32p1L55l56j68L25n3K01l73L08n2l0P
4260d2j68J74J63j13Q3l56L13J04k04M1k08Q7N1r5L8j84K07R2m2J23m68N38l8
4283I6j72J09J89k33n2K22j61N6l3op9j03r0K13q0l0l3O2L55l79JM8K75j99J76
4308A52Q3j92p6q0O1J51R7j82J03k35K31n8k94L91l0j73q5L03n2k95J69r1J35
4331C3j79L6K26m5j12k15K25O8J3O7l63K55J17j89m5Q8k1J14M7j81K04o2k0J59
4355B20j46K00L3j85K1j41J30j93L9K13j30o2Ml9R5L5r0j4QLL05l95Q0O0R6k69
4381a22J50P8l61L00j8M5j55R2j67K46n4K16n03L43o0k93J36K0j5P9J60j57L81
$$ plain form
4404 341 103 63 -59 -52 -160 128 -21 -164 -108 201 116 -131 35 47 153 30 61 -116 -60 -157 80 31 264
4427 264 -186 84 62 -115 142 -54 107 -228 93 -136 -55 80 -55 -54 -55 77 -247 54 222 -32 -18 -151
4449 -151 213 44 -230 171 105 221 -117 -228 -11 -130 -180 54 -22 -53 251 -84 -147 163 55 16 270 -158
4471 -158 -34 -138 -245 -25 -1 99 -19 12 82 177 217 102 5 -99 -171 50 116 142 -229 -94 -96 -64 -179 -182 17
4496 17 -110 63 245 -201 35 93 69 -60 106 -57 69 -35 144 19 106 -19 106 -158 -88 82 266 36
4518 36 -302 18 -84 -111 -58 69 48 125 -18 179 157 -417 238 -50 -27 -126 -31 -352 -321 -28 -78 -3 100 -22
4542 -22 76 109 -63 152 -55 -132 29 78 164 81 -132 77 107 -14 -82 171 17 29 -159 43 -154 124 -16
4565 -16 -68 108 49 -49 25 -75 -4 198 175 -184 -234 -208 121 -262 -106 200 -80 5 44 77 115 -48 -30 96 -86
$$ packed form
4404C41k38m0j22Pj08K88j49j43N6L09q5k47J66J2J06j23L1j77N6r7K37m9K33
4427B64m50K70k2j77K57j96J61l35L21k29Q1J35j35JjJ32l24L01J68k54J4j33
4449a51L64j69k74M01o6J16l38j11K17j19n0K34p6l1L04l35o3L10j08l9K54m28
4471a58J24j04j07K20K4J00j18L1P0R5M0j15r7j04p2K21O6K6l71J35kL2j15lJ99
4496A7j27J73J82m46K36N8k4j29J66j63J26j04J79j25Q7j25J25k64P0J70J84k30
4518C6l38L20j02k7N3J27k1P7j43J97k2n74O55k88K3r9R5l21L1K93n0P5J03j22
4542b2R8L3j72K15k07p7J61M9Q6q3k13K09L0j21o8K53j54J2j88K02j97K78j40
4565a6n2J76n9r8P4j00P1K02k3l59n0K6L29l83J56L06k80Q5L9L3L8j63J8J26j82
$$ plain form
4590 -86 -55 -151 -25 60 18 47 -25 -42 -70 105 -267 -95 -53 15 115 294 -214 20 90 -110 222 64 37 91 -166
4615 -166 -107 38 -39 -159 -49 53 166 14 -166 24 266 -98 -51 187 -31 -180 -234 -104 185 120 103 184
4637 184 16 73 28 -16 -71 -19 -37 31 -48 -77 21 63 212 22 -40 10 54 -75 -43 -239 140 197 -69 60 -90
4662 -90 -40 -151 58 171 251 139 165 -37 0 -88 56 7 -62 26 -128 44 164 158 182 -64 82 140 64 -124 146
4687 146 -42 40 -97 -190 171 6 214 -126 54 132 124 -196 53 159 -57 68 142 -358 -9 128 -348 96
4709 96 54 20 -8 106 -24 -95 -241 -269 -211 -84 92 -196 67 -94 67 120 -70 203 -159 59 92 8 -92
4732 -92 63 125 -210 7 154 -11 -167 57 -58 -95 61 -12 269 70 59 336 235 99 -15 -226 15 194
4754 194 69 -117 139 28 18 -42 -37 65 -20 -128 -144 -263 200 54 -191 108 85 65 -130 -91 42 -146 10
$$ packed form
4590h6L1r6J26Q5m2K9p2j7k8J75l72J72M2O8J00J79n08K34P0k00L32j58k7N4k57
4615a66N9J45p7j20J10J02J13j52j80J90K42l64M7K38k18j49n4J30K89o5j7Q1
4637A84j68N7m5m4n5N2j8O8p9k9R8M2J49j90o2N0M4j29L2j96L79N7k66J29j50
4662i0N0j11K09J13Q0j12K6k02L7q8J44m9o9Q8j54J72J20oK4k46J46N8p6j88K70
4687A46j88Q2j37r3L61j65K08l40J80P8ql20K49J06k16J25P4n00L49J37m76M44
4709I6m2l4k8J14j30p1j46k8N8J27J76k88K63j61J61N3j90K73l62K18L3q4j00
4732i2J55O2l35K17J47j65j56K24j15l7J56p3K81j99j1K77j01j36j14k11K41J79
4754A94j25j86K56j11j0o0NJ02q5j08j6j19M63j46k45K99k3k0j95L9J33j88J56
$$ plain form
4777 10 221 -164 -139 13 -16 -133 -92 37 224 -73 86 86 -42 -54 -86 5 11 -97 -90 -220 -104 -20 -106 -129 -25
4802 -25 52 -208 -7 219 -4 -156 63 23 -155 -65 20 -33 4 264 -164 -140 -109 26 -179 -51 24 -99 -30 -99
4826 -99 45 -308 -9 230 -46 -219 232 62 6 249 8 53 92 182 103 34 -187 -156 200 -118 30 -173 -237
4849 -237 -234 -62 -195 -83 -248 158 -139 -190 170 108 37 -102 -374 -17 124 -14 143 -42 106 -100 20 155
4871 155 -61 -83 -130 3 -129 77 60 47 -225 -45 -105 -48 -335 -3 -24 -11 -231 12 263 46 -68 -134 -75
4894 -75 -34 144 -263 -46 99 83 -77 -13 21 -57 -212 97 -325 -50 114 61 71 -132 -89 -25 -33 98 124 20
4918 20 -4 -106 -88 108 274 -79 -128 63 -170 -154 -42 143 131 -133 33 111 -114 -43 -143 102 -169 -283 -248
4941 -248 137 -10 -268 -53 154 -36 -34 -13 -134 98 -36 -28 -126 57 -221 38 -48 197 -125 -106 293 59 -106
$$ packed form
4777A0K11l85K5J52k9j17M1J29J87k97J59%j28j2l2R1Oj08Pj30J16Q4q6k3J04
4802b5P7k60K01K26k23j52K19m0j78R0Q5n3L7K60m28K4L1J35k05J28P5j23O9o9
4826i9J44l53K99K39k76j73M51j70n6K43k41M5L9R0p9o9k21L1L56l18J48k03o4
4849b37LJ72j33J12j65M06k97n1L60o2p1j39k72L57J41j38J57j85J48k06J20J35
4871A55k16k2m7J33j32K06j7j3k72J80o0N7k87L32k1J3k20K43K51k17j14o6N9
4894g5M1J78m07K17J45j6j60O4L4p8j55L09m22K75J64n3J0k03M3O4qJ31K6j04
4918B0k4j02J8J96J66l53m9J91k33J6J12J85j2k64J66P8k25P1j00K45k71j14L5
4941b48L85j47k58K15K07j90KK1j21K32j34Qr8J83k78K59q6K45l22J9L99k34j65
$$ plain form
4964 -106 -4 -84 25 -160 54 184 120 -2 -165 -25 -3 -151 -149 115 129 -146 -94 21 -51 -260 -50 -189 -211
4987 -211 326 84 99 -131 149 -27 -165 335 20 15 -50 50 101 -162 25 -23 102 -81 -261 -16 -471 54
5009 54 136 40 -42 -105 77 -174 75 -172 -176 30 45 -2 65 174 20 71 -23 102 -151 114 35 -8 -64 -127 -72 55
5035 55 -100 31 -62 225 -92 -28 -84 -79 66 6 10 -216 64 -79 147 -28 -130 -149 -175 104 36 -270 -11 241
5059 241 95 38 17 234 -146 147 -111 -199 61 -210 -48 -114 -65 183 -18 220 51 207 130 280 -126 -15
5081 -15 87 167 92 -16 242 -29 21 -99 -169 -240 17 125 83 -157 -122 -89 113 -102 -16 48 -23 155 4 23
5105 23 -102 -4 -93 158 58 -80 -103 -50 -194 -96 -173 -90 -5 17 -38 208 208 46 -56 111 126 121 96 227 37 -183
5131 -183 -54 -19 3 -21 -202 2 79 -185 263 26 10 14 167 72 88 -30 -44 82 -33 71 -208 31 31 -33
$$ packed form
4964a06J02q0J09j85K14J30o4j22j63J40K2j48KK64J4k75N2J15p2k09K10j39k2
4987b11N37k42J5k30K80j76j38N00l15no5J00N1k63J87m8J25j83j80K45m55N25
5009E4Q2r6q2o3J82k51K49k47mK06J5m7O7J09j54N1r4J25k53K65p9m3n6o3N5J27
5035E5j55J31r3K87l17O4n6NJ45o0Mk26K80j43K26j75j02j9k6K79o8l06K59K52
5059B41j46n7k1K17l80K93k58q8K60k71J62o6M9K48k01K38j69J56p7J50m06J11
5081a5J02Q0p5j08K58k71N0j20p0p1K57J08m2k40L5L3K02k15Q6O4p1J78j51J9
5105B3j25R8q9K51j00j38k3N3j44R8p7Q3Q5K2n5K46%j62j02J67J5nk5J31j90k20
5131a83J29L5K2k4j81K04P7k64M48k37j6MJ53r5J6j18j4J26j15J04k79K39%o4
$$ plain form
5155 -33 191 168 70 134 55 66 15 -115 179 218 -70 -144 9 64 179 80 -308 75 -171 -173 -123 -66 -12 -329 4
5180 4 -76 -36 -219 -60 79 12 -77 -99 109 -72 46 -166 -35 183 127 -115 40 81 324 -111 -111 41 -201 -203
5204 -203 -188 -42 125 -190 -37 -15 70 -130 35 -42 -93 154 243 119 -208 68 337 112 -120 120 37 -126
5226 -126 -145 -80 302 -80 -104 195 -18 -93 -207 49 82 135 -18 -242 -57 156 -212 -54 -341 -118 -132 77
5248 77 -140 241 254 -91 11 50 88 144 20 66 -38 -116 -166 101 -87 -207 60 -64 -162 -113 76 -134 -56 23
5272 23 119 80 -33 -169 -130 -43 156 -80 -237 232 45 143 -16 18 64 113 -119 145 30 -179 -52 -259 97
5295 97 -139 37 84 45 55 47 151 -91 -115 -109 -102 68 237 -193 71 -108 75 -43 89 140 -244 275 -135 -30
5319 -30 -296 8 -84 157 83 -177 -204 173 50 67 116 215 287 22 -88 -119 22 259 -4 117 -100 -73 181
$$ packed form
5155c3K24k3r8O4p9J1n1j30K94L9k88p4J53N5J15r9l88L83k46kN0N7N4l17L33
5180Dq0M0j83J59J39o7q9k2K08j81J18k12J31K18n6k42J55M1K43m35%J52k42k
5204b03J5J46J67l15J53K2Q5k00J65p7n1K47Q9j24l27K76K69k25k32K40q3j63
5226a26j9O5L82l82k4K99k13p5j14K56L3N3j53k24J85K13l68J58k87K23j4K09
5248G7k17L81J3l45J02L9L8N6j24M6j04p8n0K67j88j20K67j24r8M9J89k10P8P9
5272B3R6l9j13j36L9Q7J99k36j57M69j87R8j59L4M6M9k32K64j15k09J27k07L56
5295I7k36J76M7l9J0qJ04k42k4OPJ70J69m30K64j79J83j18J32N1l84N19m10J05
5319c0k66L04r2K41p4k60k7L77j23J7M9R9P2k65j10l1J41K37k63J21k17K7K54
$$ plain form
5342 181 -117 -86 -1 16 -20 131 162 -94 77 -143 31 177 112 115 -152 189 -83 196 112 123 -188 -81 177
5365 177 -25 -81 161 -138 -84 69 176 221 -19 252 -254 30 91 30 46 -34 34 110 -40 162 115 118 125 80 -82
5390 -82 29 -112 76 -106 -35 -16 107 -240 52 -289 49 38 123 -22 -147 53 -318 -164 -54 143 -242 -8
5412 -8 30 147 135 124 -28 260 167 -154 195 -34 171 -68 59 -140 -44 -209 -194 -53 192 160 -169 100 133
5435 133 -91 -17 -201 117 -197 -12 93 5 -72 -76 -90 77 145 47 -42 -83 -67 -200 -179 -173 -48 255 -48 -147 14
5460 14 89 -180 147 -244 -55 -136 79 -78 85 184 -5 -5 98 -19 -106 -62 -126 160 41 45 -54 -71 189 -252
5484 -252 -41 35 -96 49 -170 73 350 -66 -59 110 70 -96 199 272 79 34 -284 55 -14 247 -2 -7 -174
5507 -174 -13 -128 112 181 -90 309 -125 -186 71 20 -220 -45 -111 8 -28 -30 228 35 -174 52 -297 191
$$ packed form
5342A81k98L1Q5J7l6J51L1k56J71k20J74J46o5Lk67L41k72K79q4J1l11J07K58
5365A77k02n6K42k99N4J53J07M5k40K71n06K84O1o1J6q0O8P6j50K02m7LPm5j62
5390h2J11j41J88j82P1J9J23l47K92l41L38j1Q5j45j25K00l71J54J10J97l85K34
5412hL8J17j2j1j52K88r3l21L49k29K05k39J27j99R6j65J5J41K45l2l29K69L3
5435A33k24P4j84L18l14J85J05q8p7mj4J67O8r8q9m1J6j33K1OJ25L03l03r9J61
5460A4P5k69L27l91J89q1K15j57J63R9j89%J03j17q7M4o4K86j19Mr9j7K60m41
5484b52K11P6j31J45k19K43K77m16PJ69m0j66K95P3j93m5l18L39o9K61k49nj67
5507a74J61j15K40O9k71L99m34o1K57n1k40J75o6J19l6kK58j93k09K26l49M88
$$ plain form
5529 191 36 -397 -198 141 -235 118 308 37 127 -22 -127 -67 181 242 -101 39 -236 37 100 24 262 -59
5551 -59 32 -25 -147 -91 -3 142 -68 -82 253 114 65 156 53 58 18 172 95 -273 29 -25 64 44 267 101 -149
5576 -149 4 118 95 -113 37 41 -84 36 8 -120 124 24 -67 61 -109 134 186 107 -146 193 -190 -61
5598 -61 -226 242 7 15 -239 -51 -193 -111 35 -178 -67 24 -299 -5 308 96 -32 5 -264 -10 140 152
5620 152 78 -29 -103 38 123 -25 21 -8 57 -96 -113 -140 -64 249 93 -54 96 -67 185 -79 -82 71 -109 -119
5644 -119 98 37 -40 -127 50 250 -234 -135 -300 171 -75 112 -64 -345 197 -68 -231 -168 -236 2 -73 32
5666 32 34 95 -113 -51 -84 -225 299 122 -6 -103 183 85 22 176 -16 46 -74 212 162 -106 53 -52 125 -86
5690 -86 208 44 -98 69 -316 -211 229 103 -23 -31 -31 116 -104 -246 30 -151 300 76 22 -96 82 -44
$$ packed form
5529A91j55m33J99L39l76L53J90k71R0j49j05O0K48O1l43J40k75K73O3p6K38l21
5551e9R1n7j22N6Q8J45k10j4L35j39m9R1j03Nm0J54p7l68L02n4Q9k0K23j66k50
5576a49J53J14k3k08J50Mj25J20k8j28K44j00r1J28j70K43N2p9k53L39l83J29
5598f1j65M68k35Qk54J88j42Q2J46k13J11R1l23K94L13k12j28L7k69K54J50J2
5620A52p4j07p4J41Q5j48M6k9O5j53j7k7P6L13j56j47J50j63K52k64lJ53j80j0
5644a19K17o1p7q7J77K00m84R9j65M71k46J87j76k81N42k65j63O3o8K38p5J05
5666C2KO1k08O2l3j41N24j77j28r7K86r8o3J54j92O2j20K86n0k68J59j05J77k11
5690h6K94j64j42J67l85J05M40j26j26q%J47k20j42K76j81M51k24n4j18J78j26
$$ plain form
5712 -44 -12 -168 0 -38 -99 50 -173 -325 -63 -153 -48 109 258 -28 -223 63 -35 150 -32 -257 -97 -8
5734 -8 -240 -55 146 -3 -9 229 -124 83 112 -127 -178 17 63 18 241 274 -225 -8 135 158 43 -53 -9 -12 105
5759 105 -184 76 267 71 222 -63 61 75 -138 120 189 4 -29 -50 -86 201 -27 -174 -82 -63 -69 97 78
5782 78 -122 0 271 -160 67 91 -193 64 119 -118 62 63 -73 22 30 -90 -19 -79 244 -52 137 31 -137
5805 -137 72 -231 -149 154 -41 35 154 -269 101 259 52 -196 135 110 -23 41 124 -36 -145 -9 33 71
5827 71 36 3 172 -71 -40 34 17 126 -150 -10 200 44 -200 37 -52 133 15 148 -28 -129 -166 142 8
5850 8 299 -64 -103 171 12 30 -203 -86 -24 -34 -63 154 -37 -64 -219 148 -89 -42 86 281 395 264 40
5873 40 219 160 -115 -124 153 -48 -81 -173 -122 -17 207 138 192 1 -14 -59 112 102 -118 13 -265 84 -104 2
$$ packed form
5712d4L2j56J68l8o1J49k23j52K62r0J05J57J49k86j95K86r8J85j82k25J60Q9
5734hk32J85K01j49oK38l53K07K9k39n1J95M6m5K23L3m99K17J43K3j15r6M4lJ17
5759A05k89K60J91j96J51k85J24J4k13K58O9j85l3k1l6K87k28j47R2J9oJ66j9
5782G8k00J22K71m31K27K4k84K57N5k37J80Jj36R5Qj20P1o0L23k96J89j06j68
5805a37K09l03Q2L03j95P6J19m23L70J58k07k48L31k5j33O4Q3j60j09J36M2L8
5827G1l5l3J69k43L1P4j7J09k76J40K10j56k44K37q9J85j18J33j76j01l7L08j34
5850HK91l63l9K74j59J8k33J17O2j0k9K17j91k7j55L67k37M7J28J95J14j31k24
5873D0J79n9k75rK77k01l3r2N1J05K24o9N4j91j5m5J71j0k20J31k78L49j88J06
$$ plain form
5897 2 70 173 -49 20 -48 6 35 14 53 -185 43 -137 -115 12 -29 198 89 127 -40 -38 -163 164 -246 -220 -207
5922 -207 -50 -44 152 -58 -131 -108 26 24 -170 6 8 145 164 171 149 45 147 128 6 -284 -83 73 132 43 45 126
5948 126 -308 78 -81 -78 79 188 -41 -166 23 165 199 9 176 52 236 -131 -90 271 52 -165 -2
5969 -2 25 -118 -164 -100 63 -59 -106 46 -45 -279 68 -376 154 2 -63 -160 -163 -71 -144 14 105 -62 -78 -197 113
5994 113 -57 -127 253 46 -230 -15 -125 -298 91 -44 179 125 -74 150 116 22 -116 -89 -69 -357 93 54
6016 54 -34 66 -192 -147 127 321 54 -173 155 228 -20 5 -4 281 -158 0 100 -57 176 17 -5 -96 26
6039 26 122 -134 71 8 115 99 -163 125 -33 187 -113 2 187 -52 18 -94 130 61 -86 -289 185 -15
6061 -15 373 66 -222 81 187 122 187 73 138 -101 8 -117 212 -66 60 -219 -65 -32 140 76 13 -34 -36
$$ packed form
5897BO8J03k22O9o8N4K9k1L9k38K28j80K2J27m1K27j09L8j67Kj25L27m10K6J3
5922b07J57OJ96k10p3K3J34kj94J76KJ37J9Pk2j04J02j9j22k90K01J56N9q9KQ1
5948A26m34L86j59LJ57J09k29j25J89J42L4j90J67j24J84l67M1L61k19k17J63
5969bK7j43m6O4J63j22m7J52r1k34L47m44N30j52o5r7lR2p3J58R1j67j6j19L10
5994A13j70p0L80k07k76K15j10j73L89j35K23n4j99K24l4r4j38K7K0k88M50l9
6016E4q8J00k58M5K74J94k67k27L28P3k48K5rK85m39J58J00j57K33j59k2r1J22
6039B6R6k56K05o3J07j6k62K88j58K20l00J15J85k39P0j12K24o9j47k03M74k00
6061a5L88l07k88L03J06o5O5j14O5k39J09j25L29k78J26k79J54L3J72o4o3m7k
$$ plain form
6084 -36 195 61 73 225 196 38 91 235 -62 53 -57 61 -8 69 27 56 -4 104 -64 1 -77 47 -315 -36
6108 -36 -106 35 37 -80 -69 120 -135 -130 118 -194 123 107 47 -210 210 250 369 74 32 -216 41 287 22 5
6132 5 13 176 33 -19 -43 438 -72 -240 77 270 218 8 -130 16 89 67 200 -175 -114 -110 -22 -11 -40 24 85 -4
6158 -4 -104 -54 -99 41 64 44 100 -5 -117 161 21 329 -158 -102 230 -84 -235 -3 174 -67 5 -153 152
6181 152 135 255 51 -19 137 240 128 76 241 180 -181 130 75 14 -69 13 162 64 51 -19 61 -107 -118 -4
6205 -4 14 -76 -72 -61 117 19 -69 62 -136 -39 163 -16 44 -222 -255 -48 -319 -54 -196 -21 226 53 159 72
6229 72 0 -114 84 -240 -40 121 147 -140 -97 -158 -139 -266 68 1 97 99 -166 68 -106 99 313 50 115 136
6253 136 276 70 -265 33 -24 -22 1 -73 -125 128 160 66 132 -94 -141 -107 110 123 82 39 -134 -39 240 -285 21
$$ packed form
6084c6K31j34J2J52k9j58N3J44k97J15j10J18o9P7m2K9o0J08j68O5p8J24l62K79
6108c6p0J41Kj17J1J89k55NK48l12L17j6o0k57M20M0J19k95m2k48K57K46k65j7
6132EQJ63j43n2k4M81n10j68L17J93n2k10j38J46P3k2J33l75O1MQ8J1k9O4O1q9
6158dj00N0m5J40K3k0N6j05j12K78j40L08m87N6L32l14j51K32J77k41P2j58L05
6181A52j7J20k04p0J56J03j12n2J65o1l61L11n5o1q3Q2J49r8j3p0Q0j68j1J14
6205dJ8r0MJ1J78r8q8J31j98R7K02j79O0k66l3K07k71K65j42J75K47j73J06q7
6229G2p2j14J98l24K00J61K6k87M3o1J9j27L34o7R6Kk65K34j74K05K14k63O5K1
6253A36J40k06l35K98n7KK3p4n2K53L2r4O6k26m7L4K17J3m1m3j73R5K79n25L06
$$ plain form
6278 21 77 53 91 -117 199 -44 -22 -30 39 28 80 -336 -153 -198 181 -2 -66 130 47 38 159 65 -189 -236 -178 -63
6304 -63 152 108 -3 101 -52 -111 74 -78 16 -146 59 189 -35 -53 12 -34 -6 86 94 10 -160 39 -52 -258
6328 -258 229 52 38 213 95 -81 49 -129 141 -16 133 -122 -472 -35 -50 179 -135 -7 52 -68 132
6349 132 55 159 -70 -185 232 -37 -42 -88 -42 -107 -98 -89 72 58 -148 -41 -245 -68 1 -40 -187 -133 51 -121 -29
6374 -29 -14 -97 232 84 -182 -75 127 -157 -58 20 21 62 -178 -263 90 -212 67 87 33 -171 -155 35 -67 -20
6398 -20 224 -14 40 -60 175 -53 -53 91 -259 174 137 387 -153 170 -172 -128 145 270 -50 94 -261 231
6420 231 249 106 58 209 85 81 -274 -10 -71 150 -139 85 -61 248 34 -72 -157 284 110 -46 57 53 88
6443 88 -108 70 -70 -125 -139 219 86 101 -347 51 85 178 27 -28 -121 -26 -71 -116 -204 267 243 10 -267 175
$$ packed form
6278B1N6k4L8k08L16k43K2qO9j1N2m16J83m5L79j83o4J96q3rJ21r4k54m7N8J15
6304f3K15m4j11J04j53n9J85j52R4j62K05J30k24j8O5m6K8R2Qq4j70J99r1k06
6328b58M87j77j4J75j18j76J30j78K70j57J49k55l50M37j5K29l14J28N9j20K00
6349A32p7J04k29j15M17k69nm6M6o5RRJ61j4k06J07k04J77O9m1j47N4J84j72R2
6374b9J5q3L29j48k66J07K02k84R9P8JM1k40q5L53l02K79K0n4k04J6J90j02M7
6398b0K44k38N4j00K35k28%J44l50M33l7K50n40L23l42M4K73J25l20J44l55M92
6420B31J8j43m8J51j24ml55K64o1K21k89K24j46L09k14j06q5M41j74j56J03mL5
6443H8j96J78j40n5j4L58j33J5m48L98L4R3j51n5r3R5m5m5q8M71k4k33k77M42
$$ plain form
6467 175 66 0 105 65 247 -109 -28 -88 -268 -16 42 136 -74 223 -65 -67 -58 128 33 27 -93 -83 -63 104 239
6492 239 29 -184 65 -23 103 -29 -106 -143 -46 76 56 3 420 -123 -203 89 124 133 -153 294 -25 -110 113 -27
6516 -27 -126 257 -10 20 -183 30 194 274 290 95 153 -177 -129 -253 243 93 114 32 77 24 -164 162 100 -117
6540 -117 8 51 62 -338 226 195 -58 137 -202 260 -149 178 -83 31 5 202 -20 35 -57 -103 49 94 -112
6563 -112 29 249 96 37 309 160 -123 -44 -186 -48 59 -83 99 294 101 -10 93 -47 50 -254 84
6584 84 -188 -89 -131 149 22 296 -99 -121 61 -106 -192 26 -1 -154 6 -238 88 -28 -93 -172 -2 25 -22
6607 -22 102 36 56 39 133 -59 63 287 183 41 298 12 65 121 -10 -322 -23 -154 -195 -80 -77 48 30 -96
6631 -96 -6 74 120 -134 -73 -164 172 172 -147 -65 207 -196 -85 -110 52 -137 -20 -224 79 27 186 -40 -114 -287
$$ packed form
6467A75j09o6J05m0J82l56Q1o0j80K52N8R4k10K97k88kRJ86r5oj20J0K0J67J35
6492B39k10k13K49q8J26j32p7l7R7J22k0n3M17n43q0K92L5Rk86M47l19q5K23j40
6516b7r9L83k67L0k03K13J64Q0J6j95N8l30M8j24M96j50K1q2M5n3j88L26o2k17
6540a17J25M3J1m00N64l1k53J95l39M62m09L27k61J14k6J97k22N5r2m6J52M5k06
6563a12J41K20j53n9K72j49k83P9j42J38J07j42J82J95j93j11J03j40R7l04L38
6584H4k72R9m2K80j27K74l95k2J82j67q6K18k7j53J60k44L26j16o5p9J70K7m7
6607b2J24o6K0j7R4j92J22K24j04j42K57k86N3N6j31l12K99j31m1J15LJ25j8j26
6631i6R0Q0M6k54O1r1L36%l19Q2K72m03J11k5J62j89J17k04L03n2J59k26p4j73
$$ plain form
6655 -287 35 135 155 -100 25 -7 -107 125 -133 162 -258 -116 43 131 -4 -292 38 274 156 -194 -72
6676 -72 -30 -101 157 -250 317 107 -78 -19 -170 -165 219 2 -52 -201 -73 -117 -345 84 -39 -144 -56 205 17
6699 17 -67 57 -202 74 -101 159 144 163 -37 -57 -42 66 -42 -122 -84 -142 327 23 -220 209 120 71 14 -44
6723 -44 4 1 -96 5 -130 -63 -212 6 -138 137 -326 -37 -109 -132 84 52 -218 -173 10 96 175 -3 19 -363
6747 -363 -45 192 -45 -111 47 -173 239 -257 -6 91 -183 -58 123 55 191 66 44 -10 -26 -91 -73 -76 156
6770 156 -19 -21 90 14 174 116 -18 -158 -30 186 -18 -81 -83 11 -239 11 191 207 5 -254 16 99 83 -12
6794 -12 31 -128 -15 -121 116 -56 11 37 10 -35 5 -47 -191 -240 -104 163 25 186 -217 86 -111 -277 6
6817 6 31 17 37 -141 -117 8 128 76 3 85 210 -169 -100 79 49 58 -127 108 -13 -70 -220 8 -23 44 64 -112
$$ packed form
6655b87L22J00K0k55J25l2j00K32k58K95m20J42J59Q8j35k88L30K36j18l50J22
6676g2M2p1K58m07N67k10j85N9j51NL84k17n4j49J28m4k28M29j23j05Q8K61j88
6699A7q4J24k59K76j75K60j5J9k00k0J5J08j08q0L8n8M69l04k43M29q9m9n7n8
6723d4M8lr7J01j35O7j49K18j44K75m63K89p2k3K16l2k70M5J83Q6P9j78K2l82
6747c63L18K37k37o6J58k20M12m96K51R7k74J25J81o8J36j25k2n4j6o5J8lK32
6770A56j75kJ11p6J60n8j34j40J28K16k04o3kR4k50K50J80J6k02k59K70Q3j6r5
6794a2M3j59J13j06K37j72O7K6k7m5M0n2j44m9J36K67j38J61m03L03j97j66K83
6817FK5j4K0j78K4J25J20n2p3Q2J25l79O9J79l0Rj85K35j21n7j50K28l1O7K0j76
$$ plain form
6843 -112 41 19 -206 -13 102 -112 176 57 -83 -3 136 38 -167 39 91 9 141 -107 5 -75 169 56
6865 56 65 45 -101 -136 -109 105 35 -141 -333 -252 174 74 -130 -19 -120 79 -53 -75 -67 324 -142 -106 -4 -44
6889 -44 152 288 368 -21 70 35 -177 59 -213 -155 -76 71 -104 -238 -123 -81 -74 100 182 96 -96 -29 -37 -117 33
6914 33 -74 -190 247 -46 -6 -89 270 10 -18 -156 104 212 -96 79 -12 100 195 -11 -298 19 -149 37
6936 37 60 149 -38 15 38 -96 -185 5 -30 96 128 -74 89 -47 -208 155 -207 -168 91 -121 -106 -34 42 -41
6960 -41 95 79 -37 117 120 -42 -218 234 70 142 163 100 137 -34 -5 14 -145 232 134 342 -8 -84 -34 -102 21
6985 21 66 339 144 -1 -43 -110 -29 -115 -7 -71 -98 -146 -198 33 -105 121 -135 -95 -157 -33 56 64 -153 -13 -41
7010 -41 -9 63 198 -189 42 52 -93 230 -35 -215 179 250 -236 177 -40 -272 29 -93 95 -132 63 60
$$ packed form
6843a12J53k2k25J93J15k14K88j19j40Q0J39r8k05K06N2q2J32k48J12q0K44j13
6865E6Rk0j46l5K7K14p0j76j92Q1M26j00k04J11j01J99j32k2QL91m66L6J02m0
6889d4J96J36Q0l89R1l5k12K36k72N8P9J47j75j34J15M2PJ74Q2q6j92O7qq0J50
6914C3j07j16M37k93M0q3L59k60k8j38K60J08l08J75r1J12R5k06k87L17j68J86
6936C7K3Q9j87N3K3j34q9J90l5J26L2k02J63j36j61L63l62L9K59k12J5P2P6q3
6960d1J36j6j16J54Lj62j76M52j64P2K1o3L7j71K9J9j59L77r8K08l50p6N0o8J23
6985B1M5K73j95j45m2o7Q1q6J08o4k7m8n2K31j38K26k56M0o2J24Q9Qk17J40k8
7010d1L2P2J35l87K31J0j45L23k65j80L94P1m86M13k17k32L01j22J88k27J95l
$$ plain form
7032 60 290 -146 -90 -86 -101 -78 -124 33 29 83 120 94 -8 -89 -254 -184 195 240 -68 62 117 -10 56 175 -211 54
7058 54 -1 -284 84 -18 2 -77 113 56 4 -15 1 104 -107 126 -191 122 -1 85 45 -79 -48 -68 145 22
7082 22 326 197 -141 122 100 -90 38 -75 32 0 -10 180 204 -174 49 150 127 -33 32 -91 11 -61 -50
7105 -50 198 -48 -43 -85 -130 108 32 -64 -80 -330 -24 110 203 155 31 110 -41 -185 -73 -51 20 97 -9 -122 -60
7130 -60 -82 43 40 -132 -22 -178 161 -22 95 -223 67 -101 99 -286 -138 -358 -89 -150 85 9 -288 161
7152 161 -219 87 131 135 -28 -57 48 124 25 163 148 -111 22 124 62 26 109 -65 52 99 20 -118 232 53
7176 53 74 112 -255 333 -156 192 32 -196 192 -61 143 -139 133 -9 -77 115 -55 5 13 -101 189 4
7198 4 148 -116 182 207 54 -78 -3 -17 179 -47 106 -138 134 77 -279 16 168 75 -128 -139 5 -49 -146
$$ packed form
7032F0K30m36N6Mj5K3m6J57mN4L7k6j02q1j65P0L79M5l08J30N5j27O6J19l86K65
7058E4n5k83L68j02K0p9J90n7n2j9J6J03k11K33l17L13j23Q6m0j24L1k0K13j23
7082B2L04j29l38K63k2j90J28j13J07l2j0J90K4l78K23J01k3j60O5j23J02p2J1
7105e0K48k46Nm2m5K38p6r6j6k50L06J34R3m8j24P9j51j44J12K2P1P7j06j13O2
7130f0k2J25lj72J10j56L39j83J17l18K90j68K00l85J48k20K69o1K35p6k97M49
7152A61l80L06M4Mj63k9J05P6r9J38j5k59J33J02o2l6Q3j74J17M7p9j38L50j79
7176E3K1L8l67N88m89L48j60k28L88k53K04k82K72j42o8J92j70O0Qj14K90j85
7198DJ44k64K98K5j53j32P5j4J96k26J53k44K72n7l56K95J52r3k03j1J44n4r7
$$ plain form
7221 -146 -144 101 -90 282 93 97 -27 15 -5 -68 -17 111 36 -134 -76 115 -314 -58 -121 -217 -8 84 105 76 298
7246 298 -236 123 -70 -31 -22 61 -118 206 -109 -67 -220 157 62 -85 -112 119 -299 43 35 -258 192 32 200
7269 200 124 -147 -123 171 203 34 0 -340 -98 165 107 73 62 -44 -20 -295 -151 -78 222 125 -26 124 14
7292 14 157 123 151 63 103 25 67 77 -34 104 -309 -151 -88 -55 -385 229 79 39 -201 -14 -58 -192 190 -60
7316 -60 -150 27 -155 10 -6 199 -18 -90 -243 -122 182 25 54 80 78 -44 22 -300 -201 33 -2 12 237 -158
7340 -158 -97 173 214 -12 -171 -79 250 22 206 -38 140 132 -78 30 -139 -119 95 61 141 -143 226 45 -109
7363 -109 3 41 109 66 196 122 125 -295 50 132 -81 -236 -16 -111 45 -117 35 77 -77 34 40 40 -154 211
7387 211 171 -116 136 -154 -23 -151 59 16 18 -27 12 -277 -96 233 46 -82 -88 54 146 -209 45 245 -249
$$ packed form
7221a46KK45j91L72j89Mj24M2k0o3N1J28p5j70N8J91m29K56o3r6K09R2K1k9K22
7246B98n34L59j93L9RQ3j79L24l15M2j53L77r5j47k7K31m18L42qk93M50j60J68
7269B00p6k71K4K94L2j69l4l40K42K63n8l4j1j06K4k75J44P3L00r7j51J50j10
7292A4J43l4K8q8M0p8M2J0j11J38m13J58O3L3l30O14j50m0k40J87m4j34L82k50
7316f0r0J77j82J65j6K05k17p2j53J21L04j57K9K6kj22O6l22R9K34l5J4K25l95
7340a58O1K70M1k26j59R2L29k28J84k44J78qk10J08j69K0K14l4Q0k84L69j81j54
7363a09J12L8O8m3J30p4Lm20L45Q2k13j55K20r5J56j62J52M2j54J11O%j94L65
7387B11m0k87K52k90J31j28K10m3Km5L9k89J81L29j87j28oJ42R2l55K54K00m94
$$ plain form
7410 -249 114 77 135 112 130 75 130 -41 -154 -167 -29 -201 -12 33 -385 -170 -32 -20 -156 37 -17 -195 -128 -259
7434 -259 74 -95 76 -87 36 117 49 -136 -106 -261 -181 137 109 213 45 191 115 29 -135 177 -110 53
7456 53 180 264 29 -48 89 -114 37 79 189 72 -106 209 -49 -150 -118 -222 91 -202 -15 -1 -42 -62 -27
7479 -27 175 -17 -100 -312 66 -117 238 20 19 33 -249 -57 51 344 -28 -143 -163 -168 -41 76 264 78 -54
7502 -54 -120 236 -132 -299 130 192 32 -79 53 -255 32 -91 -30 -59 160 123 -77 -102 -10 45 37 -66 280 -27
7526 -27 -3 -63 -26 -116 -32 -184 -36 100 38 -172 27 -41 69 -273 36 -60 -163 -212 290 248 96 -87 -110 27
7550 27 -84 -219 -207 -297 -84 -36 -18 -84 -113 255 37 120 219 1 74 71 -33 92 -147 -124 -211 -12 -16 -53 7 81
7576 81 154 -25 3 207 -181 0 -347 -68 -194 145 -27 -252 -70 -63 -91 -158 -36 -196 34 160 4 -37 60
$$ packed form
7410b49L63l7N8k3J8n5N5j71j13j3J38j72J89M5m18K15J38J2j36J93n4j78O7j31
7434b59L33j69J71j63J23Q1o8j85L0j55Q0L18k8J04j68J46p6q6j64L12k87J63
7456E3J27Q4k35p7J37k03J51M2J10j17j78L15k58j01L2j04L13k93J87J4m1k0L5
7479b7K02j92q3k12L78j83L55k18jJ4k82J92J08K93l72j15k0nJ27J17J88j86j32
7502e4o6L56l68j67M29O2j60j11J32l08K87j23O1k9K19l7k00k5R2N5qj03L46l07
7526b7K4o0L7r0Q4j52J48J36o2k10J99o8J10l42L09r6j03m9N02m2j52j83k3J37
7550B7j11j35J2r0K13M8J8o6k9L68k18Q3R9k18P3lj04J25k39K3q7J99ml7O0P4
7576H1P3j79K8K04l88J81l47K79j26L39j72k25J82Pk8o7J22j60K30J26j56m1R7
$$ plain form
7599 60 -13 -100 63 -266 153 77 32 -60 -28 41 -110 107 55 -104 47 10 -54 64 -182 58 78 224 -110 -39
7623 -39 123 149 135 -17 14 -89 -59 -226 -191 6 69 -90 -20 38 17 9 -142 45 79 -93 104 5 -31 -72 126
7648 126 -102 55 148 -59 83 -71 -245 -114 49 64 228 188 57 -107 11 211 112 -2 -286 -29 54 114
7670 114 40 -289 32 88 -138 102 111 -273 149 -312 -19 63 -19 -33 -139 25 -170 92 -90 31 -33 -33 20 -240
7694 -240 -20 190 77 137 139 224 287 27 49 41 104 38 31 -143 -187 31 36 -148 32 122 -18 -351 6 141 -1
7719 -1 -48 275 -122 163 232 103 93 -190 37 -18 -161 -58 43 7 118 126 114 230 -130 -146 -66 -74 69 76 53 260
7745 260 -3 -128 -3 -31 101 -165 -49 49 -52 -102 5 0 116 -219 -190 -273 162 -38 -48 173 124 -184 1
7768 1 86 -91 147 -253 68 34 62 -42 179 34 -67 11 150 -165 -280 99 174 -123 189 135 -36 191 172
$$ packed form
7599F0p3q7J63l29M19p6m5r2L2O9j51K17n2j59J51l7o4J18k46K40K0J46l34P1
7623c9J62K6j4j52L1j03L0j67L5J97O3j59P0N8k1qj51J87L4j72J97r9l6m1J98
7648A26k28J57R3k07J42j54j74J31J63J5J64m0j31j64J18K00r9j14k84K57Q3O0
7670A14p4l29L21N6k26K40Rl84M22m61K93Q2q2j4j06J64j95K62j82J21o4%N3k60
7694b40K20K10j13O0KQ5O3k60K2qO3o6pj74m4K18Nj84J80R0j40l33L57J35j42
7719am7L23l97K85O9j29j0k83K27n5j43J03J01l6J11Qj2J16l60j6Q0qJ43Pk3K07
7745B60k63j25J25k8J32k66J16R8j01n0J07nJ16l35K9q3M35k00j0K21m9l08J85
7768AQ5j77K38m00L21l4K8j04K21j45j01P8J39l15j15L79P5k97L12n4j71K27j9
$$ plain form
7791 172 90 97 -53 -2 -42 -46 -207 237 -111 74 52 28 3 199 -101 58 331 32 63 103 -160 13 -107 -36
7815 -36 14 -21 114 -19 340 66 -22 0 -102 121 84 116 -92 127 -131 308 -140 50 -3 -270 25 107 34
7838 34 -12 71 105 -41 125 140 -176 53 32 173 16 -34 -81 -10 -1 -67 162 -132 -144 -72 -43 -33 13 112 12 -59
7864 -59 -36 -104 117 98 -8 -130 59 88 49 163 16 -20 61 -85 27 -18 -180 202 74 30 119 -148 -107 -64
7888 -64 25 -6 -172 -82 327 29 -100 102 -49 -49 39 93 190 -168 -90 51 -39 -45 -199 182 31 -43 105 112 67 -97
7914 -97 113 150 -130 -64 -125 9 -269 -154 -49 65 -123 -73 -101 29 117 -16 -10 158 -178 -318 -25 -39 34 -55
7938 -55 42 99 -54 -112 -140 53 6 -21 170 63 -209 131 -372 110 41 -84 69 -96 -34 -245 -64 -155 -49
7961 -49 3 58 68 -21 -36 -111 153 135 23 -213 -51 -258 280 130 247 -136 -69 136 158 -186 -93 21 15 28 -38
$$ packed form
7791A72q2Pj50N1m0mj61M44l48J85k2k4k5J96l00J59K73k99L1M0k63J73j20P1
7815c6N0l5J35j33L59k74q8K2j02K23l7L2k08K19k58M39m48J90n3k67K95Q2p3
7838C4m6Q3L4j46J66J5l16K29k1J41j57n0m7P1Ro6K29k94j2P2K9J0M6R9j00p1
7864e9K3o8K21j9j06j22J89K9l9J14j47l6Q1j46J12m5j62L82j28m4Q9k67M1M3
7888f4Q9l1j66R0M09k98j29K02j51%Q8N4R7l58P8J41r0oj54L81j51p4J48Pm5j64
7914i7K10L7k80O6o1J34k78J15J05J14j88N0k8J30Q8j33OJ68l36j40K93j4P3q9
7938e5R7N7j53n8k8J93m7k7J91j07k72L40n03M82o9j25J53j65O2k11J81r1J06
7961d9N2N5J0q9j5p5K64j8j12k36J62k07N38j50J17l83O7K05K2l44R3J14oJ3o6
$$ plain form
7986 -38 -49 46 30 121 -33 115 -91 -228 -46 23 45 207 -51 140 73 13 -7 54 -27 25 42 4 91 39 -53 81
8012 81 107 30 -82 -370 20 -53 447 -180 -77 66 -77 59 -19 -75 -5 -51 -9 130 -75 -140 61 74 -199 -101
8036 -101 15 -163 -89 -96 -25 160 -66 -209 141 -198 247 3 -41 -12 90 -42 -150 -20 -244 129 119 -34
8058 -34 236 -335 -130 57 44 -46 -243 121 -150 -27 -17 -64 32 37 -54 169 -120 81 -130 134 -196 131 7
8081 7 -97 56 195 2 -125 152 27 18 126 331 23 108 100 97 137 72 224 -247 -123 50 238 453 43 173
8105 173 -14 -142 -81 43 97 12 8 -12 52 235 -73 143 79 -2 35 40 72 232 141 46 -15 146 -42 131 76 238
8131 238 12 -18 -13 -125 -13 58 357 138 169 -68 58 -215 -26 35 124 96 64 12 -122 -200 134 32 -15 60
8155 60 130 -34 -101 -42 -55 -83 26 -151 125 -109 71 -162 -122 -219 301 79 -122 295 54 4 166 149 -221
$$ packed form
7986c8j1R5j6R1j54J48k06j37J82O9K2J62k58J91o7o0k0O1q1N2J7l8Q7n2r2J34
8012H1K6p7j12k88L90p3N00o27J03J43j43J36p8n6P0m6M2J39k05o5K01J3k73R8
8036a01J16j78P4pP1J85k26j43L50l39M45k44m4K9J02j32j08J30k24L73j0j53
8058c4K70n71K05J87j3r0j97L64k71J23J0m7R6Nr1K23k89K01k11K64l30L27j24
8081Gj04J53J39j93j27K77j25rJ08K05l08Q5qlM0o5J52m71J24J73J88K15m10J30
8105A73j87j28O1J24N4q5mk0O4J83l08K16o4q1L7NL2J60r1r5o1J61j88J73n5J62
8131B38k26l0Nj12J12P1K99k19L1k37J26k73J89O1Q9k8l2n2j34p8L34j02m7P5
8155F0P0j64o7N9j3k8J09j77K76k34J80k33M0r7N20k22k01M17k41n0J62j7l70
$$ plain form
8178 -221 -42 54 101 -138 81 109 174 -66 94 -99 -354 79 5
$$ packed form
8178b21J79R6M7k39K19K8O5k40J60j93k55M33p4
8191E
$$ Imaginary data points
##PAGE= N=2
##DATA TABLE= (X++(I..I)), XYDATA
$$ plain form
0 0 0 0 0 0 0 0 0 0 0 0 0 0 8 -8 8 -8 16 -16 20 -24 30 -32 40 -48 56 -64 74 -88 102 -116 134 -152 172 -194
34 -194 220 -246 278 -310 349 -389 430 -479 532 -588 651 -720 795 -876 965 -1062 1171 -1291
52 -1291 1422 -1569 1735 -1920 2131 -2374 2655 -2988 3388 -3876 4494 -5298 6393 -7987 10526
67 10526 -15214 26789 -121366 -98406 124433 39938 32922 757 -99228 -92234 48977 77055
79 77055 71182 22606 -97963 -107466 56792 105163 43097 10423 -47130 -100994 3610 110776
91 110776 72442 -19731 -83693 -86505 19194 87106 26315 -28083 -33703 -64856 -37473 63493
103 63493 79088 -4963 -62206 -64718 -9999 73022 74407 -4194 -47597 -44845 -15138 50960 74413
116 74413 6201 -57934 -50240 -3680 42858 52650 10121 -35915 -50632 -28613 27343 62317
$$ packed form
0@%%%%%%%%%%%%Qj6J6j6K4l2L6m4N4o2P2q8J04j20J38j62J90k18K50k86L24l66
34a94M14m66N24n88O59p38Q19r09J011j120J239j371J515j671J841k027K233k462
52a291K713k991L304l655M051m505N029n643O376p264Q370r792J1691j4380J8513
67A0526k5740M2003j48155K2960K22839q4495p016l2165r9985O994J41211K8078
79G7055n873m8576j20569r503J64258M8371o2066l2674n7553n3864J04604J07166
91A10776l8334r2173o3962k812J05699O7912o0791n4398n620l1153K7383J00966
103F3493J5595q4051n7243k512N4719Q3021J385p8601m3403K752K9707O6098K3453
116G4413o8212o4135P694M6560M6538R792m2529m6036j4717K2019N5956L4974
$$ plain form
128 62317 17542 -50954 -58818 -13846 37310 52837 13569 -31945 -39124 -19570 20826 55183
140 55183 26196 -35255 -47079 -13603 21246 43113 26568 -22259 -44780 -22165 15962 44021
152 44021 28594 -26618 -47294 -11889 19154 28448 25761 -7995 -41338 -23751 15574 34450
164 34450 26474 -9967 -40535 -21107 18276 29068 18604 -3764 -34192 -32783 8966 34161
176 34161 18903 -10152 -29993 -22035 8286 26485 21333 2628 -24511 -30805 3567 35140 25570
189 25570 -4815 -22811 -18815 3084 23786 22747 2774 -21442 -29627 -5786 25110 22040 -5569
202 -5569 -22087 -20850 -6239 14489 20868 5049 -18313 -27444 -7740 22630 25593 1789 -14224
215 -14224 -12799 -2798 14442 24708 11172 -12795 -20601 -7081 15738 22608 3866 -16016 -16128
$$ packed form
128F2317m4775o8496p864M4972N1156J5527l9268m5514p179J9554M0396L4357
140E5183k8987o1451j1824L3476L4849K1867j6545m8827k2521K2615L8127K8059
152D4021j5427n5212k0676L5405L1043R294k687l3756l3343J7587L9325J8876
164C4450p976l6441l0568J9428L9383J0792j0464k2368l0428J409M1749K5195
176C4161j5258k9055j9841P958L0321J8199n152j8705k7139o294L4372L1573r570
189B5570l0385j7996L996K1899K0702j039j9973k4216q185K3841L0896l070k7609
202e569j6518J237J4611K0728O379j5819k3362r131J9704L0370K963k3804j6013
215a4224J425J0001J7240J0266j3536k3967p806J3520K2819O870j8742j9882j12
$$ plain form
228 -16128 -7262 4469 16141 9468 -15093 -25133 -9674 9778 16062 5889 -10920 -16436 -6077
241 -6077 6901 16657 14801 -4523 -18766 -6396 14285 18151 8644 -3586 -12129 -9431 3683
254 3683 14444 11135 -5086 -18894 -13059 6191 13654 4964 -5436 -11774 -13043 -2155 11801
267 11801 11083 -3707 -14852 -9817 5578 14205 9572 -188 -6077 -7425 -1039 11518 13812 -80
281 -80 -12582 -9244 3573 10361 7860 -541 -7727 -9991 -3785 6911 10466 -642 -12992 -10351
295 -10351 1089 7818 6654 1063 -6072 -9432 -3718 7099 11281 2627 -8366 -8403 1119 7828 7568
310 7568 3183 -4079 -8909 -5004 5608 10516 3372 -6483 -7573 -310 6132 6873 3601 -2645 -8612
325 -8612 -6731 3322 8652 2709 -6292 -7437 -1858 3471 5360 3481 -1687 -8010 -6935 1761 8084
$$ packed form
228a6128Q866J1731J1672o673k4561j0040J5459J9452O284j0173j6809n516J0359
241f077J2978R756j856j9324j4243J2370K0681L866r507j2230q543K698J3114
254C683J0761l309j6221j3808N835J9250P463q690j0400o338j269J0888J3956
267A1801p18j4790j1145N035J5395Q627m633r760n889j348O386J2557K294j3892
281h0j2502L338J2817O788k501q401p186k264O206J0696L555j1108j2350K641
295a0351J1440O729j164n591p135l360N714J0817M182q654j0993l7R522O709k60
310G568m385p262m830L905J0612M908p144r855j090P263O442P41l272o246n967
325h612J881J0053N330n943r001j145N579N329J889j879n168o323J075Q696O323
$$ plain form
340 8084 3891 -4557 -5783 -1089 3337 5787 5429 902 -5595 -4998 2772 8406 4428 -2527 -4799 -2663
356 -2663 1105 4365 3770 -855 -6774 -7405 -465 5539 2962 -3485 -5340 -3555 -650 2704 4894 594
372 594 -5507 -4777 1450 6710 5990 547 -2196 -401 1503 3309 6183 3151 -4778 -5863 666 4192
388 4192 2643 -415 -3606 -4696 -2154 646 2222 867 -4658 -7909 -1315 4463 2169 -880 -572
403 -572 -1643 -1542 3276 6169 3203 -1511 -3068 112 5128 5044 630 -776 -864 -2577 -50 4230 2002
420 2002 -4292 -5922 -1876 1421 1218 -119 -1999 -3192 -3330 -804 3303 3327 -2464 -4746 -542 3518
436 3518 2728 1495 1868 -215 -2778 242 5480 3681 -1942 -3153 -789 1713 2527 481 -703 -845
452 -845 -3208 -2963 2571 3643 -3068 -4917 -446 690 -15 1494 586 -2285 -2563 -842 1978 4260
$$ packed form
340H084m193q448j226M694M426K450l58m527o497N97P770N634l978o955k272K136
356b663L768L260n95m625n919o31O940O004k577o447j855J785K905L354K190m300
372E94o101P30O227N260p20n443k743J795J904J806K874l032p929j085O529L526
388D192j549l058l191j090K542K800J576j355n525l251O594N778k294l049L08
403e72j071J01M818K893k966m714j557L180N016q4m414j406q8j713K527M280k228
420B002o294j630M046L297k03j337j880j193j38K526M107K4n791k282M204M060
436C518p90j233L73k083k563L020N238j799n623j211K364K502Q14k046j184j42
452h45k363K45N534J072o711j849M471J136p05J509r08k871k78J721K820K282
$$ plain form
468 4260 -494 -4124 422 3036 410 1018 3514 -161 -3401 -354 2342 2774 639 -2738 -1755 2022
484 2022 1294 -336 1515 -434 -4489 -2033 2699 964 -2230 -1951 -537 -623 -716 213 1889 506 -4219
501 -4219 -2393 3509 4148 -538 -1716 816 2096 1113 392 2292 1598 -2192 -1880 3243 2452 -1593 -1139
518 -1139 603 -856 -1717 -357 734 -444 -4810 -4367 2209 3153 -2998 -3174 1713 1142 -1362 237
534 237 1989 1725 -455 -2843 1599 5610 876 -2744 2752 2780 -2245 989 3993 -1358 -3743 -768
550 -768 59 868 16 -3658 -1488 2179 -2541 -4114 3023 1930 -5506 -2583 2743 1831 848 -212 -625
567 -625 2358 1771 -1699 1844 4744 -1970 -3063 3701 2413 -1387 963 917 -1558 -614 -804 -673 1988
584 1988 -1758 -6130 530 3887 -2798 -2819 2616 234 -2927 -333 781 1182 810 -2382 -886 4461
$$ packed form
468D260m754l630M546K614k626O08K496l675l240L047K696M32k135l377R83L777
484B022p28j630J851j949m055K456M732j735l194K79J414q6r3R29J676j383m725
501d219J826N902O39m686j178K532J280r83p21J900o94l790L12N123p91m045M54
518a139J742j459q61J360J091j178m366M43O576R44o151j76M887n71k504J599
534B37J752k64k180k388M442M011m734l620N496K8n025L234L004n351k385K975
550g68Q27Q09q52l674K170L667m720j573P137j093p436K923N326r12r83j060m13
567f25K983n87l470L543K900o714j093O764j288l800K350m6k475R44j90J31K661
584A988l746m372O660L357o685k1N435k382l161K594J114M01l72l192J496N347
$$ plain form
600 4461 1195 -2007 2622 2386 -2364 200 3420 326 -1425 -544 -2 1892 575 -2838 5 3031
616 3031 -2904 -4126 2867 1936 -3119 -1907 668 -199 389 -561 -685 1346 -327 -2597 1646 3384
632 3384 -1745 -1720 2741 1832 -1022 720 1501 801 -278 -1676 682 3482 -971 -3241 1303 2350
648 2350 -1732 -1380 1047 -230 -2001 -1602 -233 902 -584 -3130 -193 2532 -1221 -2050 1941 1599
664 1599 -1865 -1233 1835 2652 482 -1046 791 3187 424 -1234 1585 1770 -1776 -1480 1224 947
680 947 -1107 -1822 -440 830 -714 -2727 -422 1189 -2430 -2964 1336 1396 -1601 -1087 811 1208 1040
697 1040 -161 568 2322 268 -1502 1997 3058 -627 -1011 1730 1156 -929 -270 509 79 -1509 -2320
714 -2320 -357 1730 -1361 -3030 383 914 -2197 -1628 1200 534 -1532 -1033 612 2096 801 -868
$$ packed form
600D461l266l202M629k36m750K564L220l094j751Q81N42J894j317l413K843L026
616C031n935j222O993r31n055J212K575q67N88r50j24K031j673k270M243J738
632C384n129K5M461r09k854J742P81p00j079j398K358K800m453k270M544J047
648B350m082L52K427j277j771L99J369J135j486k546K937K725l753q29L991l42
664A599l464O32L068Q17k170j528J837K396k763j658K819J85l546K96K704k77
680I47k054p15J382J270j544k013K305J611l619n34M300O0k997N14J898L97j68
697A040j201P29J754k054j770L499J061l685l84K741n74k085O59P79m30j588q11
714b320J963K087l091j669L413N31l111N69K828o66k066M99J645J484j295j669
$$ plain form
730 -868 1102 2424 149 -1015 1825 1917 -1247 -906 1523 1218 -739 -1068 -44 811 -1227 -2392 228
747 228 1273 -1750 -2215 655 1081 -1374 -1665 664 1096 -882 -1255 982 1675 -431 -948 1505 2328
764 2328 -221 -756 1642 1382 -649 -1063 1083 1264 -703 -1422 798 1769 -930 -2146 282 927 -1460
781 -1460 -2216 188 1150 -1135 -1467 85 1346 -278 -1705 419 1451 -567 -1428 1328 2109 -641
797 -641 -723 1632 1908 217 -688 319 1248 -345 -1447 361 1588 -795 -1795 599 1203 -867 -1625
814 -1625 -10 60 -1374 -1557 -60 561 -307 -1366 539 1507 -65 -1111 769 1367 -538 -823 1402
831 1402 1737 -67 -280 1244 1613 190 -995 465 1083 -964 -1742 230 789 -1190 -1465 194 406
848 406 -1083 -1606 -167 388 -1250 -1292 436 1168 -145 -712 959 1654 183 -141 1250 1616 -9 -665
$$ packed form
730h68J970J322k275j164K840R2l164L41K429l05j957l29J024Q55k038j165K620
747B28J045l023m65K870M26k455k91K329M32j978l73K237O93k106n17K453Q23
764B328k549n35K398k60k031m14K146J81j967p19K220R71k699j216K428O45k387
781a460p56K404R62k285l32J552J261j624j427K124J032k018q61K756P81k750
797f41q2K355K76j691r05J007R29j593j102J808J227k383j000K394O04k070p58
814a625J615P0j434j83J497O21q68j059J905R68j572j046J880N98j905k85K225
831A402L35j804k13J524L69j423j185J460O18k047p78J972N59j979k75J659K12
848D06j489n23J439N55j638m2J728P32j313n67J671O95j471l24J391L66j625o56
$$ plain form
866 -665 975 1702 -178 -706 409 777 -817 -1182 -35 -112 -1339 -1604 -199 357 -855 -1682 240 716
884 716 -831 -1167 579 887 -334 -219 1071 1707 454 -185 1077 1580 128 -533 955 932 -683 -877
902 -877 1021 754 -1073 -928 28 -94 -1095 -1367 -399 286 -973 -1503 439 1129 -709 -668 897 910 -779
921 -779 -166 866 796 236 -263 1075 1288 228 -330 877 1002 -581 -887 424 797 -685 -1150 315
939 315 532 -954 -1171 -59 364 -908 -1202 140 305 -653 -575 371 822 -422 -598 805 969 -436
957 -436 -436 1146 1162 -459 166 1257 1060 -229 -529 584 704 -753 -1093 642 631 -1030 -844 377 212
976 212 -1089 -941 137 197 -826 -1165 131 1170 -464 -741 974 876 -365 -71 1125 826 98 -275
994 -275 770 1497 -141 -1035 1269 976 -980 -788 522 75 -1003 -742 213 -261 -565 -1053 -380 327
$$ packed form
866f65J640P27j880n28J115L68j594l65J147p7j227k65J405N56j212q27J922M76
884G16j547l36J746L08j221J15J290O36j253o39J262N03j452o61J488k3j615j94
902h77J898k67j827J45R56j22j001k72R68O85j259n30J942O90j838M1J565J3j689
921g79O13J032p0n60m99J338K13j060n58J207J25j583l06J311L73j482m65J465
939C15K17j486k17J112M23j272k94J342J65r58P8R46M51j244j76J403J64j405
957d36%J582J6j621O25J091j97j289l00J113J20j457l40J735j1j661J86J221j65
976B12j301J48J078O0j023l39J296J039j634k77J715r8j241K94J196k99p28l73
994b75J045P27j638q94K304k93j956J92J310m47j078K61R55m74l04m88O73P07
$$ plain form
1012 327 -838 -1496 207 755 -1201 -282 1579 541 -422 785 1140 607 457 -299 485 1405 -380 -1093
1030 -1093 1142 1057 -1280 -519 833 -183 -985 -718 -130 -469 -757 -1260 -185 527 -818 -794 778 643
1048 643 -1040 -245 1350 579 -504 339 947 1086 212 -195 721 1205 -613 -734 823 356 -917 -207
1066 -207 437 -150 -520 -912 -228 97 -1159 -1413 363 -40 -1313 -339 799 246 -720 -126 569 644 -78
1085 -78 -436 796 1158 -258 -515 1690 1037 -785 211 1040 -179 -443 -215 15 228 -623 -959 346
1103 346 898 -1192 -1352 971 -72 -1813 -312 963 -105 -952 440 444 529 -86 -694 544 1397 -693
1121 -693 -747 1627 1089 -845 28 1486 140 -699 -79 108 382 -343 -799 -7 636 -1042 -1252 738
1139 738 358 -1519 -720 900 -141 -1024 -362 333 272 -240 169 473 1192 227 -536 1032 1244 -744 -484
$$ packed form
1012C27j165o58J703N48j956R19J861j038r63J207L55n33j50p56P84R20j785p13
1030a093K235q5k337P61J352j016q02K67N88l39k88n03J075P12j345K4J572j35
1048F43j683P95J595p71j083Q43O08J39q74m07R16M84j818j21J557m67j273P10
1066b07O44n87l70l92O84L25j256k54J776m03j273R74J138n53r66N94O95P5p22
1085g8l58J232L62j416k57K205o53j822R96Q29j219k64K28K30K13q51l36J305
1103C46N52k090j60K323j043j741J501J275j068q47J392MQ5o15o08J238Q53k090
1121f93n4K374n38j934Q73J458j346q39O20J87K74p25m56P92O43j678k10J990
1139G38l80j877P99J620j041q83O62O95o1n12M09L04P19r65p63J568K12j988K60
$$ plain form
1158 -484 1635 456 -924 15 1094 -219 -569 -268 -155 -92 -649 -975 -50 544 -970 -1349 886 214
1176 214 -1492 -400 982 -187 -291 421 564 774 675 -274 834 1309 -215 -696 1207 1030 -1306 -432
1194 -432 1184 -327 -1384 -104 102 -335 -540 -851 -339 409 -675 -1548 491 933 -1105 -570 1478
1211 1478 334 -1090 433 966 276 225 288 865 893 -97 -410 935 910 -1050 -384 1423 37 -1125
1229 -1125 -132 464 -417 -822 -889 71 9 -884 -970 573 562 -1064 -699 1267 495 -790 -122 1031 674
1248 674 -290 141 880 844 23 139 1088 833 -634 -667 645 262 -792 -814 540 76 -992 -456 492
1267 492 131 -1215 -853 293 284 -619 -508 336 393 -199 -111 782 791 -218 -339 818 639 -435 64 912
1287 912 604 -439 -78 529 475 -675 -619 56 253 -933 -791 486 255 -979 -550 652 -286 -860 -326
$$ packed form
1158d84K119j179j380R39J079j313l50L01J13O3n57l26R25N94j514l79K235o72
1176B14j706J092J382j169j04P12J43K10r9r49J108M75j524m81J903j77k336Q74
1194d32J616j511j057J280K06m37k05l11N12P48j084q73K039M42k038N35K048
1211A478j144j424J523N33o90n1O3N77K8r90l13J345k5j960O66J807j386j162
1229a125R93N96q81m05o7R60o2q93q6J543j1j626L65J966p72j285O68J153l57
1248F74r64M31P39l6q21J16R49k55j467l3J312l83j054k2J354m64j068N36R48
1267D92l61j346L62J146rr03J11Q44N7n92Q8Q93Rj009j21J157j79j074M99Q48
1287I12l08j043L61O07n4j150N6O75J97j186J42J277k31j234M29J202r38n74N34
$$ plain form
1306 -326 388 315 -670 -367 497 705 -404 -41 1263 780 -585 -33 631 595 -314 -281 644 385 -586 -579 429
1327 429 97 -836 -742 289 -250 -980 -564 458 192 -858 -553 563 173 -907 -493 666 600 -309 -236
1346 -236 1069 679 -124 69 1072 475 -614 -181 497 212 -598 -221 345 -105 -1024 -793 262 -130 -769
1365 -769 -578 -53 202 -551 -255 750 494 -679 -160 742 545 -246 -11 670 441 -216 92 973 595
1384 595 -528 -269 648 162 -613 -535 416 -46 -684 -719 241 -22 -757 -665 31 -85 -887 -632 380 262
1404 262 -703 63 1080 599 -30 -22 848 634 -108 -44 833 238 -315 -133 701 287 -501 -168 167 -114 -845
1425 -845 -589 220 198 -739 -406 484 78 -627 -444 429 154 -634 -434 816 625 -260 95 875 663 -64
1445 -64 1 564 494 -267 -176 412 263 -624 -314 431 17 -347 -280 390 -91 -601 -411 461 -130 -579 -131 394
$$ packed form
1306c26P14p3r85L03Q64K08j109L63J304m83j365N52O64l6r09L3R25k59r71PJ008
1327D29l32r33R4J031n39p30M16J022k66j050L05J116l90j080M14J159o6r09P3
1346b36J305l90q03J93J003n97j089M33O78k85q10L77N66m50r19K31J055l92o39
1365g69J91N25K55p53K96J005k56j173N19R02j97p91K35O81k29o57L08Q81l78
1384E95j123K59R17m86p75P8R51m62o38l5R60k63p35R2O96j16q02K55J012j18
1404B62r65P66J017m81o29QQ70k14p42O4Q77n95n53J82Q34m14p88L33L35k81p31
1425h45K56Q09k2r37L33Q90m06p05J83Q73k75p88K00J250j91q85L55P80k12p27
1445f4O5N63p0p61R1N88j49q87L10P45m14l64O7O70m81n10J90Q72n91m49M48N25
$$ plain form
1467 394 284 -252 -303 425 199 -547 136 846 142 -185 54 820 525 -9 -236 374 690 -183 -333 524
1487 524 78 -632 -403 69 -272 -919 -403 32 -155 -562 -464 116 151 -532 -574 535 590 -382 -128 797 304
1508 304 -153 473 721 387 -154 -64 558 250 -474 -522 345 206 -829 -320 280 40 -787 -688 -30 -308 -618
1529 -618 -350 126 203 -386 -220 637 298 -444 97 436 575 -161 53 1130 261 -347 110 567 504 -554
1549 -554 -220 452 77 -838 -395 -32 38 -473 -284 179 12 -587 -368 379 -49 -604 -101 616 164 -35
1569 -35 -209 475 541 -148 -36 634 343 -551 -125 828 142 -411 6 153 136 -595 -219 151 139 -548 -336
1590 -336 366 1 -857 -118 390 -76 -622 55 146 197 -85 90 608 366 111 -136 690 535 -400 -174 712
1611 712 161 -760 10 458 -5 -441 -27 285 -93 -527 -241 78 334 -618 -294 322 -63 -776 -76 480
$$ packed form
1467C94j10n36n1P28k26p46O83P10p04l27K39P66k95n34k27O10L16q73j50Q57
1487E24m46p10K29M72l41o47N16M35j87m07R8N80L5o83m2J109N5r72K54R25m93
1508C04m57O26K48l34n41R0O22l08p24m8Q67j39j035N09O00k40q27R9O58k78l10
1529f18K68M76P7n89J66Q57l39p42N41L39J39p36K14J077q69o08M57M57o3j058
1549e54L34O72l75r15M43L63P0n11J89M63j67n99K19P47m28n55N03P17m52j99
1569c5j74O84O6o89J12O70k91q94M26R53o86n53M17J47j7p31L76L70j2o87K12
1590c36P02l65q58P39N08m66n46O77R1N1k82J75N18k42k55k47Q26j55r35K26Q86
1611G12n51r21P70M48m63m36M14L12l78m34K86L19K56r52L24O16l85p13P00N56
$$ plain form
1631 480 143 -570 50 515 207 -109 -79 559 506 123 -167 577 495 -555 -187 642 121 -549 -39 517 -218
1652 -218 -451 -577 131 116 -438 -443 336 -144 -767 80 526 -197 -177 176 424 -56 -62 -195 653 626 -189 -141 660
1675 660 499 -234 -122 693 -288 -580 34 192 -249 -474 -259 -143 -133 -561 -472 42 -15 -678 23 231 12
1696 12 -454 209 732 442 -49 144 610 398 120 -118 510 418 -216 -89 582 -100 -786 -401 149 32 -443
1717 -443 -192 409 122 -721 -366 262 143 -541 -199 569 127 -295 -39 274 350 -201 84 491 506 46 -88
1738 -88 389 10 -619 0 568 -144 -734 -284 298 -392 -368 -382 277 14 -754 -489 250 8 -492 -360 404
1759 404 53 -490 282 308 127 -148 39 534 445 -231 31 603 178 -225 -425 453 238 -735 187 361 -123
1780 -123 -491 -40 -103 10 -812 -395 236 -153 -569 -115 641 -206 -512 -88 540 211 -244 248 547 2
$$ packed form
1631D80l37p13O20M65l08l16L0O38n3l83k90P44q2j050L68Q29n21o70N10N56p35
1652b18k33j26P08j5n54nP79m80o23Q47M46p23K0L53K48m80oj33Q48k7q15M8Q01
1675F60j61p33J12Q15r81k92O14J58m41k25K15J16J0m28Q9N14n7o63P01K08k19
1696A2m66O63N23k90m91J93M66k12k78k38O28r2o34J27O71o82o86L85N50j17m75
1717d43K51O01k87q43L55O28j19o84L42P68m42m22K56L13P6n51K85M07J5m60j34
1738h8M77l79o29O19N68p12n90M50N82o90K4j4O59k63p68K65P39k42n00J32P64
1759D04l51n43P72K6j81k75J87M95q9o76K62N72m25m03k00Q78k15r73R22J74m84
1780a23l68M51o3J13q22M17O31l89m16M54P56q47l06M24O28l29m55M92K99n45
$$ plain form
1800 2 -270 110 710 349 -264 74 679 -40 -406 -319 42 -94 -431 -117 235 7 -573 -220 3 -173 -514
1821 -514 -355 158 58 -264 -180 539 370 -273 -32 400 51 -244 184 776 287 -184 133 630 4 -208
1841 -208 109 358 -171 -409 -66 231 90 -543 -319 198 -145 -614 -47 130 165 -271 -129 477 75 -158
1861 -158 224 638 229 -322 78 311 272 -241 213 91 315 -372 -51 453 -261 -219 -172 90 -132 -532 -105
1882 -105 202 -139 -440 -303 305 95 -300 207 307 176 -156 65 239 111 59 101 715 124 -248 47 486
1903 486 16 -501 -84 370 -368 -362 -141 223 -236 -528 -88 246 -217 -443 -34 469 -170 -211 54 230 -12
1924 -12 -343 -16 610 134 -229 166 572 256 -337 194 592 141 -422 -23 355 -39 -400 -237 358 -130
1944 -130 -521 -185 190 -161 -664 -83 268 -207 -317 -193 362 282 -372 139 398 -102 -73 263 315 213 29
$$ packed form
1800Bk72L80O00l61o13L38O05p19l66Q7L61j36l37L14L52k28n80L53K23j76l41
1821e14J59N13j00l22Q4P19j69o43K41M32l49k95M28N92m89m71L17M97o26k12
1841b08L17K49n29k38L43K97j41o33K24N17l43m69N67J77L5m36J42O06m02k33
1861a58L82M14m09n51M00K33l9n13M54j22K24o87L21N04p14M2M7K62k22m00M27
1882a05L07l41l01J37O08k10l95N07J00j31l32K21J74j28n2M2O14n91l72K95M39
1903D86m70n17M17M54p38OK21L64m59k92M40L34m63k26M09N03o39m1K65J76k42
1924a2l31L27O26m76l63L95M06l16n93N31L98m51n63L99L78l94l61J63N95m88
1944a30l91L36L75l51n03N81L51m75j10J24N55q0o54N11K59n00K9L36N2j02j84
$$ plain form
1965 29 283 231 113 -313 193 385 -79 -447 -282 155 -120 -658 -21 11 -219 -412 -39 -52 -174 -499 -171
1986 -171 416 518 -232 145 474 82 -225 239 453 -105 175 -21 263 199 -177 -130 285 9 -426 130 67
2007 67 -305 -671 64 317 -226 -512 162 158 73 -332 -230 207 51 -232 163 528 6 105 190 772 -97 -174
2029 -174 77 331 -38 -524 268 399 69 -107 89 276 -251 -661 -96 90 -118 -225 36 180 -40 -349
2049 -349 161 314 -46 -43 -40 415 161 -152 160 625 109 -359 102 549 85 -325 206 357 -97 -219 0
2070 0 255 -84 -450 -154 -84 -220 -546 29 72 -351 -287 221 347 23 -399 122 51 243 -83 242 260 343 -274
2093 -274 267 483 71 -382 -209 548 -106 -368 -64 192 -214 -251 -65 260 -476 -358 -151 -166 -322 -235 96
2114 96 376 14 -426 18 375 -53 -130 234 183 112 -143 205 467 233 -276 220 269 92 -289 30 119 -53
$$ packed form
1965B9K54n2j18m26N06J92m64l68J65M37k75n38O37L2k30j93L73j3j22l25L28
1986a71N87J02p50L77L29l92l07M64K14n58K80j96K84o4l76M7M15k76m35N56o3
2007F7l72l66P35K53n43k86O74mq5m05J02M37j56k83L95L65n22R9Q5N82q69p7
2029a74K51K54l69m86P92J31l30j76J96J87n27m10N65J86k08j07K61J44k20l09
2049c49N10J53l60LLM55k54l13L12M65n16m68M61M47m64m10N31J51m54j22K19
2070@K55l39l66K96P0j36l26N75M3m23O4N08J26l24m22N21p1J92l26L25J8Q3o17
2093b74N41K16m12m53J73P57o54k62L04K56m06l7J86L25p36J18K07j5j56Q7L31
2114I6K80l62m40M44L57m28p7L64n1p1k55L48K62k34n09M96M9j77l81L19Q9j72
$$ plain form
2136 -53 -363 -244 194 -135 -393 -137 73 -290 -551 -135 468 -360 -316 183 417 -244 -280 493 424 302 -175
2157 -175 463 477 117 -282 224 255 94 -346 -160 101 -138 -268 -389 101 101 -461 -43 369 -244 -272 224 321
2179 321 -124 -31 93 241 -106 -148 294 84 94 131 207 483 -2 -225 87 177 -96 -256 275 31 -155 -303
2201 -303 -34 237 -132 -534 -430 3 -139 -348 23 182 -194 -315 -28 411 -92 -158 35 334 -139 -123 312
2222 312 343 64 -333 40 555 -381 -372 215 -21 63 -165 -48 238 -194 -50 -183 9 -171 -282 -96 -95 -319
2244 -319 -279 -11 389 165 -102 404 331 -279 -13 -6 242 165 -1 -104 253 110 -86 -10 413 -112 -227 -189
2266 -189 102 -213 -133 85 -60 -114 -440 15 235 181 -503 109 252 -192 -17 171 289 66 -2 61 -32 376
2288 376 49 -159 261 66 -285 396 357 196 -187 29 281 -246 -524 -129 -63 -385 18 17 68 152 -153 51
$$ packed form
2136e3l10J19M38l29k58K56K10l63k61M16O03q28M4M99K34o61l6P73o9j22m77
2157a75O38J4l60l99N06L1j61m40J86K61k39j30j21M90%n62M18M12o13k8M96R7
2179C21m45R3J24J48l47m2M42k10J0L7P6K76m85k23L12R0k73j60N31k44j86j48
2201c03K69K71l69m02J04M33j42k09L71J59l76j21K87M39n03o6J93K99m73J6M35
2222C12L1k79l97L73N15r36RN87k36Q4k28J17K86m32J44j33J92j80j11J86Jk24
2244c19M0K68M00k24k67N06p3o10K66PK48p7j66j03L57j43j96P6M23n25j15L8
2266a89K91l15Q0K18j45n4l26M55K20n4o84O12J43m44J75J88J18k23o8O3r3M08
2288C76l27k08M20j95l51O81l9j61l83K16K52n27k78L95O6l22M03jN1Q4l05K04
$$ plain form
2310 51 490 -163 -136 110 357 28 -108 92 290 -48 -87 216 404 -38 -155 -101 314 -114 -80 -22 -152 -112
2332 -112 -411 -122 -13 -283 -247 92 279 -41 -202 66 178 20 -33 290 421 152 -93 12 524 178 113
2353 113 143 304 -27 -194 -90 78 -129 -287 118 18 -195 -398 -66 186 -349 -524 -137 129 -295 73
2373 73 19 432 33 -122 -95 74 -88 -149 363 323 113 -246 -8 295 121 -251 20 81 -101 -69 -153 -149 -141 -125
2397 -125 -6 -29 -192 -184 89 219 -53 -265 -101 194 7 -256 -108 443 121 165 304 105 -89 -223 303
2418 303 274 251 -93 83 305 -52 -221 39 4 106 -272 -299 -38 3 -507 106 99 -17 -54 7 316 -95 -98 -100
2442 -100 137 143 -213 371 196 -60 166 280 210 -126 -198 42 285 -64 -134 -297 61 -226 -427 -171 -130 -189
2464 -189 -469 114 153 64 -272 -151 -17 -98 -216 -3 169 93 -54 128 181 -97 56 270 -152 -102 -143 170
$$ packed form
2310E1M39o53K7K46K47l29j36K00J98l38l9L03J88m42j17N4M15m28L4N8j30M0
2332a12k99K89J09k70L6L39J87l20j61K68J12j58n3L23J31k69k45J05N12l46o5
2353A13L0J61l31j67J04J68k07j58M05j00k13k03L32K52n35j75L87K66m24L68
2373G3n4M13l99j55K7J69j62o1N12m0k10l59K38L03j74l72K71O1j82L2q4MQJ6
2397a25J19k3j63QK73J30k72k12J64K95j87k63J48N51l22M4J39j99j94j34N26
2418C03k9k3l44J76K22l57j69K60l5J02l78k7K61M1n10O13pj16l7O1L09m11lk
2442a00K37Ol56N84j75k56K26J14p0l36p2K40K43l49p0j63L58k87k01K56M1n9
2464a89k80N83L9q9l36J21J34q1j18K13J72p6j47J82N3k78J53K14m22N0m1L13
$$ plain form
2486 170 -1 -80 -288 -250 107 -309 -169 -162 18 -204 -218 121 -89 -23 -255 -56 207 -137 -173 64 287 -59
2508 -59 18 158 451 114 -44 92 414 127 -14 164 173 -68 -168 -173 -112 -25 -430 -85 25 -201 -274 -43 -109
2531 -109 277 -203 -281 116 93 -85 133 228 -50 -289 162 90 -31 83 252 28 -9 -149 -125 299 -136 -271
2553 -271 103 -28 32 -114 220 12 -56 29 67 -182 -194 -430 12 -21 -187 -290 129 73 -242 -109 103 305
2575 305 -104 69 215 248 136 202 -129 422 -185 -108 73 268 -117 -240 8 248 -43 -313 61 -6 -334
2596 -334 -335 -52 -70 -194 -166 -48 128 63 -86 -138 293 198 14 100 298 127 41 245 134 -367 153 124 -27
2619 -27 -121 -82 186 447 -33 -217 -175 -53 -15 -281 158 388 -197 -203 171 112 -264 -286 178 181 220 62 501 332
2643 332 118 -77 276 184 -97 -184 159 13 -154 -97 125 -90 -105 -269 65 166 -64 -116 160 256 -241 -199
$$ packed form
2486A70j71p9k08L8L57m16J40PJ80k22j4L39k10O6k32J99K63l44l6K37K23l46
2508e9P7J40K93l37j58J36L22k87j41J78Rk41j00nO1Q7m05L45J10k26p3K31o6
2531a09L86m80p8L97k3j78K18R5k78k39M51p2j21J14J69k24l7j40K4M24m35j35
2553b71L74j31O0j46L34k08o8Q5L8k49j2k36M42l3j66j03M19n6l15J33K12K02
2575C05m09J73J46L3j12O6l31N51o07P7J81J95l85j23K48K40k91k70L74o7l28
2596c34jK83j8j24K8J18J76o5j49n2M31r5j84Q6J98j71q6K04j11n01N20k9j51
2619b7r4L9K68K61m80j84M2J22L8k66M39K30n85oL74n9l76k2M64LL9j58M39j69
2643C32k14j95L53r2k81q7L43j46j67N7K22k15j5j64L34J01k30n2K76R6m97M2
$$ plain form
2665 -199 97 67 76 80 115 135 120 41 118 82 23 -167 111 43 29 -276 140 565 -35 -156 55 70 -213 -211 98 226
2691 226 -180 -85 54 147 -274 -176 -11 225 -124 130 304 383 29 -2 162 224 -26 220 -102 107 -45 58
2713 58 63 292 44 -346 -209 66 -51 -92 -110 -129 -286 2 128 -29 -188 -80 9 76 -284 -329 -172 187 197
2736 197 -52 187 309 -36 -110 104 177 -59 -141 140 49 -293 -315 120 17 -305 -360 90 92 -56 -170 -163 -24
2759 -24 -314 -295 281 142 -237 -254 301 247 42 227 385 224 86 96 77 105 8 -185 -8 13 -60 -210 -350
2782 -350 -9 -137 -102 260 -118 -417 -299 -220 182 190 -218 166 42 -78 -134 76 539 -14 -324 102 76 -5
2804 -5 -97 22 265 -301 -178 160 262 -150 -107 -104 192 -22 -124 128 60 -196 -190 -145 -72 -217 -331 142 -86 52
2828 52 -80 155 53 -98 -64 61 164 -193 27 245 334 109 -180 1 135 -58 -366 109 63 -131 13
$$ packed form
2665a99K96l0RML5K0j5p9P7l6n9j90K78o8j4l05M16M25o00j21K11J5k83KL09J28
2691B26m06R5J39R3m21R8J65K36l49K54J74P9l54l1J64O2k50K46l22K09j52J03
2713E8NK29k48l90J37K75j17m1j8j9j57K88J26j57j59J08Q9O7l60m5J57L59J0
2736A97k49K39J22l45p4K14P3k36q2K81r1l42k2M35j03l22n5M50Kj48j14PJ39
2759b4k90J9N76j39l79j7N55n4k05J85J58j61j38J0j9K8r7j93J77K1p3j50j40
2782c50L41j28L5L62l78k99J18P9M02Qm08L84j24j20n6K10M63n53l10M26k6q1
2804er2J19K43n66J23L38J02m12M3LK96k14j02K52o8k56OM5P3j45j14M73k28J38
2828E2j32K35j02j51L4J25J03l57K20K18Q9k25k89J81J34j93l08M75m6j94J44
$$ plain form
2849 13 5 175 -219 323 -76 127 -261 -32 231 82 -20 190 233 268 -32 -41 171 183 76 -17 196 20 338
2872 338 314 83 81 -80 -132 154 50 210 -245 -39 -62 -126 -310 22 -33 274 -126 -97 -10 -72 -101 70 -47 6
2896 6 -43 175 382 321 -126 236 -26 216 -52 72 195 -185 54 119 15 -193 -287 -6 227 -56 -198 53
2918 53 -39 192 28 64 69 -167 -22 86 104 -154 254 -18 120 -380 90 -14 79 81 29 -133 128 -28 -187
2941 -187 249 136 -158 -202 7 83 38 89 -34 133 -153 -122 143 -76 132 105 80 235 -138 -172 200 248 -43
2964 -43 -141 101 103 45 -58 169 -34 38 -4 44 158 -198 135 -10 33 -126 -229 260 -165 -34 -263 -2 63
2987 63 -70 -147 -165 341 -292 -229 98 -41 81 -24 205 -7 -105 196 -134 1 -68 -6 51 -205 -168 -50 -22
3010 -22 18 -221 -60 -42 28 -179 -260 -49 108 -244 -183 108 35 -181 -128 287 187 -100 9 -8 301 -115 104
$$ packed form
2849A3qJ70l94N42l99K03l88K29K63j49j02K10M3L5l00rK12J2j07r3K13j76L18
2872C38k4k31kj61n2K86j04J60m55K06k3o4j84L32n5L07m00K9Q7o2k9J71j17N3
2896Fm9K18K07o1m47L62k62K42k68J24J23l80K39O5j04k08r4K81K33k83j42K51
2918E3r2K31j64L6Nk36J45J08J8k58M08k72J38n00M70j04R3Kn2j62K61j56j59
2941a87M36j13k94m4K09P6m5N1j23J67k86L1K65k19K08k7k5J55l73l4L72M8k91
2964d3r8K42Kn8j03K27k03P2m2M8J14l56L33j45M3j59j03M89m25J31k29K61O5
2987F3j33p7j8N06o33O3L27j39J22j05K29k12r8L01l30J35o9O2N7k56L7J18K8
3010b2M0k39J61J8P0k07q1K11J57l52O1K91p3k16N3M15j00k87J09j7L09m16K19
$$ plain form
3033 104 197 241 31 -37 373 119 -156 -277 -62 -71 -304 -16 192 -89 -92 -10 -29 -149 -161 -62 261 146 48 20
3057 20 217 78 -66 -206 136 56 -152 3 -7 -42 -69 49 189 205 99 -130 -197 -158 43 -145 11 95 -290
3080 -290 -114 -41 -59 -120 -239 386 46 -148 222 113 50 -5 111 68 161 -69 328 7 214 16 11 176 -27
3103 -27 -118 -41 -201 -222 -263 -380 -3 -202 -386 -100 -139 -65 -109 -41 175 -37 -194 -192 -17 -14 109 79 238 49 73
3128 73 84 248 -7 -71 157 154 54 -200 -16 76 -57 -60 -13 -195 31 194 -17 177 -86 -135 -277 -85 -6 20
3152 20 -11 -9 109 -233 178 -20 133 45 23 219 -16 -194 -267 -128 -38 47 -182 69 -91 23 -152 -185 -54
3175 -54 -192 -118 235 -32 -291 -33 -110 -80 -331 -16 175 -97 -70 2 264 -31 -71 -87 -2 99 -151 318 15
3198 15 53 -165 72 -362 14 -25 3 402 -5 -148 100 -28 -35 -27 6 -50 -48 182 -71 209 32 34 -115 60 -7
$$ packed form
3033A04R3M4k10o8M10k54k75j21K15rk33K88K08k81lQ2j9j20j2R9L23j15r8k8
3057B0J97j39j44j40L42q0k08J55j0l5k7J18J40J6j06k29o7L9K01j88J56Q4l85
3080b90J76P3j8o1j19O25l40j94L70j09o3n5J16m3R3k30L97l21K07j98nJ65k03
3103b7r1P7j60k1m1j17L77j99j84K86l9P4m4O8K16k12j57KJ75LJ23l0J59j89K4
3128G3J1J64k55o4K28lj00k54J84R2j33lM7j82K26J63k11J94k63m9j42J92P9K6
3152B0l1KJ18l42M11j98J53q8k2J96k35j78p3J39R0Q5k29K51j60J14j75l3J31
3175e4j38P4L53k67k59K58p7L0k51L15J91k72K7P2K62k95m0j6Q5J01k50M69l03
3198A5L8k18K37m34L76l9K8L99m07j43K48j28pQL3n6KK30k53K80j77Kj49J75o7
$$ plain form
3223 -7 -32 -179 153 392 111 192 134 237 -289 -27 191 -89 -171 -108 -132 -83 81 -87 -179 -320 -54 -144 128 -95
3247 -95 -87 -196 -89 -57 -234 -3 165 41 -270 53 33 68 131 -27 -23 -104 -3 -91 6 116 -299 -99 -104 -206 -157
3272 -157 -181 11 -82 -127 137 61 40 99 267 246 -19 33 89 136 121 -18 -40 142 95 64 99 60 179 10 104 102
3298 102 -69 -215 20 -137 -104 -55 -158 -105 238 -370 -2 14 55 -73 100 41 7 75 -148 -228 15 -68 93
3321 93 124 184 218 106 121 17 248 -77 -38 18 23 -20 -81 -168 -302 -155 -25 -82 -178 -170 219 27 -118 -258 -44
3346 -44 316 -78 -173 150 -31 -121 117 184 67 124 204 46 209 -278 -43 -74 77 -218 -22 296 -274 -107
3368 -107 -70 28 224 11 -129 25 -41 -83 -23 -109 -196 -75 34 164 -86 -15 236 310 13 -17 86 138 29 224
3392 224 -69 145 58 -171 -168 108 181 -164 38 70 84 -243 -265 55 -97 28 34 -8 250 -142 -193 137 53 -86
$$ packed form
3223gk5j47L32K39k81Q1n8J03n26K62K18k80q2O3k4M9J64j68r2j41K66r0K72k23
3247i5Qj09J07L2j77K31J68j24l11L23k0L5O3j58Mq1J01q8R7J10m15K00nj02M9
3272a57k4J92r3m5K64p6k1N9J68k1k65N2N6M7j5j39k2J82m7l1L5l9J19j69R4k
3298A02j71j46K35j57L3M9j03N3L43o08L68J6M1j28J73n9l4O8k23q0K43q3J61
3321I3L1O0L4j12J5j04K31l25L9N6Nm3o1q7j34J47J30n7r6QL89j92j45j40K14
3346d4L60l94r5L23j81r0K38O7j17N7Q0j58J63m87K35l1J51k95J96L18n70J67
3368a07L7R8J96k13j40J54o6m2O0q6q7J21J09J30k50P1K51P4k97l0J03N2j09J95
3392B24k93K14q7k29LK76P3l45K02L2J4l27k2L20j52J25Om2K58l92n1L30q4j39
$$ plain form
3416 -86 102 312 82 86 185 -21 15 -114 4 162 170 -77 -40 70 -56 -212 -87 82 82 -181 -61 -134 -10 -241
3440 -241 -73 -185 -19 -128 68 55 -89 -205 225 119 215 -214 90 71 73 226 80 270 108 -46 -188 75
3462 75 209 42 203 -81 -212 62 -271 171 -177 -71 -50 -137 -10 -10 220 35 -17 -107 -57 97 -42 80 316
3485 316 128 -8 -138 71 315 -118 96 -174 -8 -256 -22 -201 118 -61 96 48 -133 14 -53 47 243
3506 243 104 -36 -44 165 57 -31 133 42 51 -141 9 64 31 -94 56 298 -101 27 91 41 59 168 -44 25
3530 25 -85 -279 -102 -13 -244 -270 -13 -24 25 99 -102 26 -122 20 -1 -154 33 57 236 232 15 29 -243 169
3554 169 -23 -49 57 257 277 -44 23 -116 21 -34 -68 79 67 -131 179 115 -75 80 186 -79 -112 -87 -4
3577 -4 141 -90 88 -36 -72 59 -73 69 129 127 -238 -88 285 -19 -89 -97 27 -107 -128 104 -43 125 -326
$$ packed form
3416h6J88K10k30MR9k06L6j29J18J58Qk47L7J10j26j56J25J69%k63J20p3J24k31
3440b41J68j12J66j09J96j3j44j16M30j06R6m29L04j9KJ53j46J90j62j54j42K63
3462G5J34j67J61k84j31K74l33M42l48J06K1q7J27%K30j85n2r0N0J54j39J22K36
3485C16j88j36j30K09K44m33K14k70J66k48K34j79L19j79J57m8j81J47o7J00J96
3506B43j39j40qK09j08q8J64r1Rj92J50N5l3j25J50K42l99J28O4n0J8J09k12O9
3530B5j10j94J77Q9k31k6K57j1M9P4k01J28j48J42k1j53J87K4J79mk17J4k72M12
3554A69j92k6J06K00K0l21O7j39J37n5l4J47j2j98L10o4j90J55J06k65l3K5Q3
3577dJ45k31J78j24l6J31j32J42O0kl65J50L73l04p0qJ24j34k1K32j47J68m51
$$ plain form
3600 -326 -159 -18 136 -144 -48 143 26 -98 -15 356 261 -204 48 244 -99 -172 -6 183 221 -88 -280 -21
3622 -21 -22 -23 -125 -231 -8 -312 -163 59 -120 -184 -74 20 194 30 -137 94 171 -382 44 281 -69 55 -37
3645 -37 194 -36 -105 -83 73 109 -50 -121 124 170 43 -85 -73 34 -136 49 205 43 26 -46 -8 6 25 -64
3669 -64 -6 -146 -126 78 178 -79 -130 40 -164 113 -21 -124 156 -23 172 -123 29 -3 -289 -47 -57 -105
3691 -105 197 38 -71 60 -248 -158 112 -24 40 -272 22 123 38 -4 124 -269 119 63 101 221 201 31
3713 31 -120 -161 -44 -129 -62 96 -208 -149 83 -154 -51 82 -35 108 -175 -119 214 -179 -27 -132 49 -32
3735 -32 -223 -179 -80 -6 210 -13 -38 -38 -66 114 133 315 -31 -46 -3 -55 -55 39 -29 33 -22 22 45 -204 -89 -73 -173
3762 -173 140 145 -60 -41 16 69 -211 151 -116 169 -18 -45 -187 -139 83 -134 141 -61 -156 83 -124 -134 26
$$ packed form
3600c26J67J41J54k80R6J91j17j24Q3L71r5m65K52J96l43p3J66J89L8l09j92K59
3622b1jjj02j06K23l04J49K22j79o4J10R4J74j64j67K31P7n53M26K37l50J24r2
3645c7K31k30o9K2J56L6j59p1K45M6j27j28J2J07j70J85J56j62j7p2L8J4J9q9
3669f4N8j40K0K04J00k57n1J70k04K77j34j03K80j79J95k95J52l2k86K42j0m8
3691a05L02j59j09J31l08R0K70j36O4l12K94J01q5m2J28l93L88n6L8J20k0j70
3713C1j51m1J17q5O7J58l04N9K32k37J03J33j17J43k83N6L33l93J52j05J81q1
3735c2j91M4R9P4K16k23k5%k8J80J9J82l46j5M3n2%R4o8O2n5M4K3k49J15J6j00
3762a73L13Nk05J9N7N3k80L62k67K85j87k7j42M8K22k17K75k02r5K39k07j0J60
$$ plain form
3785 26 -54 -7 -164 32 -149 -113 -314 74 58 -160 -47 132 161 -10 -55 -6 -168 207 -44 -111 -79 16 74 149
3809 149 96 176 -277 226 287 -27 109 -55 -62 148 -133 -162 -197 -51 -30 -128 171 -156 112 82 267 28 -13 338
3833 338 54 -264 29 227 109 132 -176 -18 7 67 4 -265 -63 -97 -143 99 27 -138 -223 262 -57 -180 -174
3856 -174 49 -55 47 -115 39 98 385 6 90 37 -73 78 -169 170 50 -15 -30 -3 -205 -168 35 53 233
3879 233 48 -196 31 -158 43 31 -55 -33 -125 -95 137 24 88 -235 324 310 -282 -269 -171 -111 -76 -28 172 139
3903 139 244 14 -29 136 -92 73 110 241 116 37 -184 -240 36 173 -113 -2 -79 -25 -11 -188 -56 -217
3925 -217 -243 89 -185 -168 -207 239 -216 159 -175 28 -6 0 168 -40 86 96 166 -116 185 -138 -174 -12 -60
3948 -60 36 0 94 -192 89 -284 189 -3 147 144 -142 17 121 263 285 36 -47 -66 37 -91 333 241 -95
$$ packed form
3785B6q0M7j57J96j81L6k01L88j6k18J13J79K9j71m5M9j62L75k51o7L2R5N8P5
3809A49n3Q0m53N03O1l14J36j64pK10k81k9l5J46K1r8K99l27K68l0J85k39m1L51
3833C38k84l18K93J98j18K3l08J58K5O0o3k69K02l4m6K42p2j65q5M85l19j23O
3856a74K23j04J02j62J54N9K87l79Q4n3j10J51k47L39j20o5j5K7k02L7K03J8J80
3879B33j85k44K27j89K01j2q6K2r2L0K32j13O4l23N59j4n92J3R8O0L5M8K00l3
3903A39J05k30m3J65k28J65L7J31j25p9k21n6K76J37k86J11p7N4J4j77J32j61
3925b17k6L32k74J7l9M46m55L75l34K03l4OJ68k08J26J0P0k82L01l23l6J62m8
3948f0R6l6R4k86K81l73M73j92J50lk86J59J04J42K2k49q3j9J03j28M24r2l36
$$ plain form
3971 -95 -37 -42 -112 146 -322 33 78 -138 -8 82 2 -64 -194 -220 -119 14 -237 -65 -3 -120 57 102 -88 154
3995 154 -136 21 213 124 -122 88 202 -14 -5 231 298 97 -134 75 -37 -49 -66 124 1 -276 -136 -133 24
4018 24 -212 -366 -135 -94 -82 63 -198 183 235 82 -94 -159 169 -11 298 -236 -263 309 76 78 -252 -184 212
4041 212 -79 186 -93 74 90 -33 -246 124 201 -252 19 146 81 -216 -90 -18 301 -125 106 35 93 -55
4063 -55 238 -189 128 -14 -16 -96 56 80 -86 3 136 -2 -113 128 -124 43 55 -39 100 39 -302 151 -185
4086 -185 15 -107 5 -24 231 -305 144 -89 -274 -52 220 83 -99 104 171 55 -186 -145 141 107 -25
4107 -25 -113 191 154 42 -99 -252 216 15 -263 -43 -47 -268 75 199 -123 106 61 -31 -166 -148 61 123 67
4130 67 16 -4 2 108 12 16 -92 213 106 -14 50 -97 -20 -247 55 41 -23 -254 -233 225 81 54 102 4 -103
$$ packed form
3971i5N8np0K58m68L55M5k16J30R0q0o6j30k6J01J33k51J72O2j17J77M5j90K42
3995A54k90J57J92q9k46K10J14k16RK36O7k01k31K09j12j2j7J90j23k77J40LJ57
4018B4k36j54K31M1J2J45k61L81N2j53j76o5L28j80L09n34k7N72k33Kl30O8L96
4041B12k91K65k79J67J6j23k13L70P7m53K71J27o5k97J26P2L19m26K31p1N8j48
4063e5K93m27L17j42kq0J52K4j66Q9J33j38j11K41k52J67J2r4J39o1l41M53l36
4086a85K00j22J12k9K55n36M49k33j85K22K72j37j82K03O7j16k41M1K86l4j32
4107b5q8L04l7j12j41j53M68k01k78K20mk21L43J24l22K29m5r2j35J8K09O2n6
4130F7n1k0OJ06r6Mj08L05j07j20O4j47P7k27L02j4o4k31K1M58j44k7M8r8j07
$$ plain form
4155 -103 222 300 -14 -60 20 182 90 -164 -113 130 -137 -129 -96 -184 32 -58 -219 54 -183 103 93 51 -118 -145
4179 -145 105 -192 -15 -171 -175 -10 147 -373 138 -53 25 -52 238 1 35 122 -187 -13 98 -291 137 128 29
4202 29 -43 -177 27 25 -37 -193 -65 -99 -99 -65 88 -71 159 1 8 83 -116 -99 -70 201 -87 -2 137 -143 2
4227 2 -336 161 -30 -50 -96 193 -17 53 -11 -68 -119 -87 -84 -26 2 -289 350 -20 -290 -242 -102 -90 77 30 -176
4252 -176 -45 221 -97 170 123 126 -61 -173 -112 40 105 7 -131 9 -47 -8 72 -243 179 -11 -21 -23 -266 228
4276 228 -207 103 7 -235 -138 135 215 151 137 7 -77 45 36 146 -71 -112 154 30 101 161 64 -117 -37 -76 -8
4301 -8 -94 -214 -71 -190 -136 86 -118 20 -83 -216 -81 -33 269 -51 -114 71 89 -181 98 43 29 79 -261
4324 -261 45 -17 79 78 205 134 10 160 -71 -117 -67 -122 154 151 -20 185 42 23 -37 178 -323 -296 48 -104
$$ packed form
4155a03L25P8l14m6Q0J62r2k54N1K43k67QL3q8K16r0j61K73k37K86j0m2j69k7
4179a45K50k97J77j56mJ65J57n20N11j91P8p7K90k37L4Q7l09J74J11l89M28rr9
4202B9p2j34K04ko2j56J28l4%L4J53j59K30j58PP5j99J7K9K71k88Q5J39k80J45
4227Bl38M97j91k0m6K89k10P0o4n7n1L2LN8K8k91O39l70k70M8J40J2J67m7k06
4252a76J31K66l18K67m7Lj87j12O1J52O5r8j38J40n6L9Q0l15M22j90j0kk43M94
4276B28m35L10r6k42R7K73Q0o4j4j30q4J22rJ10k17m1K66j24P1O0r7j81Q0l9O8
4301hq6j20J43j19N4K22k04J38j03j33J35M8L02l20o3J85J8k70K79n5j4N0l40
4324b61L06o2R6jJ27p1j24J50k31m6N0n5K76lj71K05j43j9o0K15n01K7L44j52
$$ plain form
4348 -104 -98 -23 56 -60 209 119 65 -91 -159 -101 -114 -69 137 -133 180 110 -194 84 -38 -161 -83 -292 -149 103
4372 103 106 51 -98 104 -265 73 129 7 -57 214 -6 40 101 -28 35 -148 -119 140 -1 13 -101 -109 -129 145
4396 145 88 64 -37 -99 -11 205 192 -47 52 -106 -52 -61 48 -67 23 284 199 22 122 92 22 20 60 -41 -151
4421 -151 -37 -38 -159 -131 38 60 97 -221 -214 96 -338 -173 -60 -203 -79 -111 -52 255 -150 -203 49 -135 128
4444 128 10 2 57 -87 144 4 19 211 -75 22 -40 95 14 58 79 208 198 -92 101 22 -157 -73 -77 -6 253
4469 253 83 -88 104 -28 -55 83 93 40 93 -138 238 -35 -145 248 284 171 -76 176 17 169 -17 108
4491 108 -151 -335 36 202 -3 -323 -141 -117 -52 2 22 29 -201 -61 45 -71 -54 84 215 -57 -107 37 -149
4514 -149 13 152 -59 -111 129 85 7 -261 -6 74 107 35 112 -89 -94 -151 -246 -46 -294 56 153 -171 -46 94
$$ packed form
4348a04OP5P9j16K69r0n4j56o8N8j3M5K06k70L13p0l04K78j22j23P8k09J43K52
4372A03Ln5j49K02l69L38N6j22o4K71k20M6O1j29O3j83K9K59j41J4j14qk0K74
4396A45n7k4j01o2Q8K16j3k39R9j58N4rJ09j15R0K61q5j77J00l0p0kM0j01j10
4421a51J14jj21K8J69K2L7l18PL10m34J65J13j43J24l2N9L07m05n3K52j84K63
4444A28j18qN5j44K31j40J5J92k86R7o2J35q1M4K1J29j0k90J93p9j79Q4mP1K59
4469B53j70j71J92j32k7J38J0n3N3k31L76k73j10L93L6j13k47K52j59J52j86J25
4491A08k59j84L71J66k05l20J82K4O5N4K0Pk30J40J06j16J7J38J31k72n0J44j86
4514a49J62J39k11n2K40m4p8k68K55Q0L3p2P7k01nn7r5K00k48L50R7l24J25J40
$$ plain form
4538 94 -26 13 62 -131 32 88 246 121 52 143 254 -33 -43 183 -17 -228 -64 253 -48 97 -307 -67
4560 -67 -252 102 -203 -347 23 -92 115 -131 -249 -61 -279 89 69 1 48 -125 105 -33 25 -124 -3 231
4582 231 1 -71 107 -92 -71 -230 44 -93 -178 -82 302 10 -203 201 24 -48 -103 -68 -61 -217 -69 42 41 233
4606 233 34 -106 -27 -38 -76 -123 174 209 46 15 123 -266 -50 -119 -63 248 171 -43 128 24 -66 38 -69
4629 -69 -75 119 -28 -90 -9 -241 192 102 103 3 62 96 295 -95 106 203 69 -58 152 -72 -60 117 244 62
4653 62 9 150 66 -120 -134 -107 -130 80 -115 -28 36 -43 90 -29 44 -15 -304 11 -266 87 -58 31 -44 -2 191
4678 191 2 25 25 120 -108 20 78 -90 156 111 -181 -140 -72 -162 251 -95 -84 92 30 -240 -107 -35 -253 109
4702 109 -23 -158 -176 97 22 89 277 -62 36 90 346 -82 -123 46 -129 73 62 111 72 110 83 209 76 -109
$$ packed form
4538I4j20L9M9j93J63N6J58j25o9R1J11k87j0K26k00k11J64L17l01J45m04K40
4560f7j85L54l05j44L70j15K07k46j18J88k18L68k0o8M7j73K30j38N8j49J21K34
4582B31k30p2J78j99K1j59K74j37q5R6L84k92k13M04j77p2n5L5Pj56J48J11jJ92
4606B33j99j40P9j1l8m7K97L5j63l1J08l89K16o9N6L11p7k14J71j04r0J04j07
4629f9oJ94j47o2Q1k32M33r0Jj00N9L4J99l90K01R7j34j27K10k24J2J77J27j82
4653F2n3J41q4j86j4K7k3K10j95Q7O4p9J33j19P3n9k89L15k77L53j45Q9p5M2J93
4678A91j89K3%R5k28J28N8j68K46m5k92M1O8r0M13l46J1J76o2k70J33P2k18L62
4702A09j32j35j8K73p5O7J88l39R8N4K56m28m1J69j75K02j1M9l9L8k7J26j33j85
$$ plain form
4726 -109 -66 -161 -101 -229 -138 254 -48 78 -52 51 264 78 -138 -60 -118 143 69 -23 28 -57 97 115 -188 -17
4750 -17 -132 -5 -41 65 24 -94 -5 -13 138 82 -37 -62 83 406 -17 155 126 -10 12 104 -189 -18 -253 -62
4774 -62 8 112 187 -151 144 -61 30 -76 -177 -100 63 62 14 63 33 28 -295 -79 1 181 -35 85 61 107 -234
4799 -234 -54 -70 -80 -93 195 -25 54 -276 -173 12 -173 -128 -103 59 32 -91 -273 8 -60 -45 -72 -1 -193 -124
4823 -124 -81 -75 -145 -192 -86 66 -174 -78 69 88 -40 -152 82 -106 9 -233 97 25 -192 34 -50 -59 -156 122
4847 122 -111 239 49 -27 104 -46 -219 -37 6 -318 24 92 -172 -96 -118 -177 -69 9 -132 -155 55 -24 201
4870 201 -11 57 24 -48 -47 203 16 256 122 81 153 190 -185 26 -82 -68 86 -7 200 192 -36 -150 82 14
4894 14 204 -37 75 98 68 4 51 -64 -51 106 -88 -73 -55 60 -59 131 -127 21 151 -140 152 163 -38
$$ packed form
4726a09M3r5O0j28R1L92l02J26j30J03K13j86k16P8n8K61p4r2N1q5J54J8l03J71
4750a7j15J27l6J06m1j18Q9qJ51n6j19k5J45L23m23J72k9j36K2R2k93J71k35J91
4774f2P0J04P5l38K95k05R1j06j01P7J63jm8M9l0nl23K16Q0J80k16J20k4M6l41
4799b34J80j6j0j3K88k20P9l30J03J85j85M5K5J62k7j23j82K81o8J5k7P1j92O9
4823a24M3Op0m7J06J52k40R6J47J9j28j12K34j88J15k42L30p2k17K26q4rr7K78
4847A22k33L50j90p6J31j50j73J82M3l24L42O8k64P6k2n9J08P8j41k3K10p9K25
4870B01k12O8l3p2JK50j87K40j34m1P2L7l75K11j08J4J54r3K07qk28j14K32o8
4894A4J90k41J12K3l0o4M7j15J3J57j94J5J8J15j19J90k58J48J30k91K92J1k01
$$ plain form
4917 -38 89 -122 72 174 20 -149 -246 -52 -4 -161 -131 200 194 -76 -34 176 107 -95 193 65 -114 112 -99
4940 -99 28 -19 64 23 47 152 -144 6 -29 -40 -142 -85 95 61 -36 168 -190 60 -253 -87 192 227 -209 -101
4964 -101 -99 -31 -63 78 155 93 423 211 -123 -90 292 102 243 158 86 16 5 -143 -106 -166 -1 -67 -359 107 -211
4989 -211 -172 -4 61 200 431 93 61 -224 -70 11 152 -89 118 -54 -88 121 -137 47 61 144 -43 88
5011 88 83 -28 130 -213 -237 -7 -4 18 -112 129 8 38 -29 21 -38 -144 -23 38 -185 127 -175 11 -43 -357
5035 -357 -102 111 -80 -84 122 178 -322 -119 -199 22 -80 -145 6 21 123 151 -91 346 -20 115 231 63
5057 63 -58 -107 27 85 215 146 190 -51 24 163 -189 34 34 -148 16 -178 -77 -297 -163 -211 385 141 -330
5080 -330 -128 -23 55 12 -43 -151 -18 -39 -121 86 130 45 133 -184 -25 134 -167 -71 137 -124 -40 -219 55
$$ packed form
4917c8J27k11J94J02j54j69r7J94M8j57L0L31ok70M2K10o9k02K88j28j79K26k11
4940i9J27m7Q3m1K4J05k96J50l5j1j02N7J80l4r7K04l58K50l13J66K79L5m36J08
4964a01KO8l2J41P7o2L30k12l34L3L82j90J41q5p2p0j1j48L7o0J65o6k92M66l18
4989b11L9J68O5J39K31l38l2k85J54Q1J41k41K07j72l4K09k58J84J4Q3j87J31
5011H8nj11J58l43k4K30LK2j30K41j21L0o7N0n9j06J21O1k23L12l02J86n4l14
5035c57K55K13j91mK06N6n00K03q0K21j02o5J51J5J02K8k42M37l66J35J16j68
5057F3j21m9J34N8J30o9M4k41P5J39l52K23%j82J64j94J01k20J34m8N96k44m71
5080c30K02J05P8m3n5j08J33k1q2K07M4q5Q8l17J59J59l01R6K08k61Q4j79K74
$$ plain form
5103 55 122 108 17 -35 23 -76 247 -164 -54 20 -232 15 57 23 -163 -292 183 -192 147 -92 271 20 33 46
5127 46 -148 -58 -241 8 160 -12 -113 100 -68 18 155 188 238 49 -49 236 52 -81 -76 -251 -181 196 -119
5150 -119 -9 -77 -1 -140 -62 -29 186 -20 -72 -13 -186 -49 -13 24 50 -272 69 24 -168 -199 16 94 28 232
5174 232 -106 -39 236 -95 77 137 -211 256 -13 -7 200 60 29 -37 70 -36 198 185 -71 197 -197 117
5196 117 29 -18 -84 -19 240 -167 52 21 97 52 5 38 56 -208 -64 -106 -97 63 124 41 4 -256 6 71 4 -103
5222 -103 85 382 -2 -393 -132 -11 -139 116 23 39 -226 77 129 60 -42 251 10 -17 101 -120 -66 211
5244 211 -248 -151 104 -42 95 -93 -92 23 -230 -90 18 53 -276 -70 126 14 172 -24 -152 -50 47 109
5266 109 52 -34 9 -4 -16 177 -77 -319 -11 -43 60 -23 -180 -106 222 160 -177 126 171 21 18 -21 -98 19 -111
$$ packed form
5103E5O7j4r1n2N8r9L23m11J10P4k52K47M2l4j86j29M75l75L39k39L63k51J3J3
5127D6j94R0j83K49J52j72j01K13j68Q6J37L3N0j89r8K85j84j33Nj75P0L77l15
5150a19J10o8P6j39P8L3K15k06n2N9j73J37L6L7K6l22L41m5j92l1K15P8o6K04
5174B32l38O7K75l31J72O0l48M67k69OK07j40l1o6J07j06K34j3k56K68l94L14
5196A17q8m7o6O5K59m07K19l1P6m5m7L3J8k64J44m2RJ60O1q3l7k60K62O5o7j07
5222a03J88K97l84l91K61J21j28K55r3J6k65L03N2o9j02K93k41k7J18k21N4K77
5244B11m59R7K55j46J37j88JJ15k53J40J08L5l29K06J96j12J58j96j28J02R7O2
5266A09n7q6M3j3j2J93k54k42L08l2J03q3j57P4L28o2l37L03M5j50ll9p7J17j30
$$ plain form
5291 -111 122 -212 7 -163 -163 51 234 -86 -129 146 -55 -153 197 -19 -236 104 -96 0 -134 134 -350 -31
5313 -31 -79 -227 276 31 -114 160 35 220 -131 14 -78 119 -8 -57 -18 -365 109 133 200 101 37 -100 185
5336 185 111 -27 71 -52 65 -29 -65 94 226 -23 -202 -46 -3 103 39 270 166 -16 -200 -25 138 28
5358 28 -206 45 85 -122 -55 -42 96 -305 47 39 -42 -117 -413 1 -2 -299 -90 -20 189 -320 -54 -276 17 57
5382 57 -30 -41 -100 -193 65 14 79 130 9 -48 29 -29 61 232 176 163 -155 -30 -47 -133 21 180 122 -208 -292 -66
5408 -66 -121 -168 -47 -59 -142 43 -144 -4 -224 -133 -212 153 -91 210 -49 79 -153 -174 -195 220 86 -107 -130
5431 -130 11 24 24 53 109 -154 2 -44 -94 149 -8 89 -15 21 -165 -280 46 140 102 65 86 -118 10 89 -212
5456 -212 -20 -212 -70 138 164 -75 12 6 44 -72 -62 105 276 -125 -253 -50 -54 -186 330 -45 -102 67 132
$$ packed form
5291a11K33l34K19j70%K14J83l20m3K75k01r8L50k16k17L40k00R6j34K68m84L19
5313c1m8j48N03k45j45K74j25J85l51J45r2J97j27m9L9l47M74K4O7r9o4j37K85
5336A85p4j38R8j23J17r4l6J59J32k49j79J56M3J06o4K31j04j82j84J75J63j10
5358B8k34K51M0k07O7J3J38m01L52qq1p5k96M14lk97K09P0K09n09K66k22K93M0
5382E7q7j1n9r3K58n1O5N1j21n7P7n8R0J71n6j3l18J25j7q6J54J59n8l30q4K26
5408f6n5m7J21j2q3J85j87J40k20R1p9L65k44L01k59J28k32k1k1M15j34j93k3
5431a30J41J3%K9N6k63J56m6n0K43j57R7j04L6j86j15L26R4l8l7K1k04J28P9l01
5456b12J92j92J42K08K6k39Q7oL8j16J0J67J71m01j28K03mj32N16l75n7J69O5
$$ plain form
5479 132 76 109 172 21 150 -413 -219 -34 113 -50 -85 -66 15 61 -268 95 165 -219 -109 78 97 -11 -31
5502 -31 -395 150 30 -38 -13 53 70 -144 97 48 91 -54 14 215 -61 246 151 -225 -2 -1 -99 1 -305 64
5526 64 0 -12 38 93 56 -207 50 -72 -56 31 5 113 -99 -61 94 84 -6 -62 -2 -40 -22 400 -202 -212 -16 -179
5552 -179 102 83 29 -68 123 154 58 81 178 -52 -109 211 17 174 -284 168 -129 -219 -38 131 -44 -103 94
5575 94 4 -168 85 288 -54 -87 -115 -8 -138 56 -289 21 74 140 -150 -6 -75 -132 -174 -106 -86 -151 74 113
5599 113 59 68 -84 -189 43 117 -112 -86 51 217 183 -128 188 -34 89 55 -181 26 76 -113 170 254 -117
5622 -117 60 182 262 106 68 -5 61 -231 -37 -82 -76 -210 4 114 170 128 93 54 28 73 -155 -101 -79 97 -19
5647 -19 119 -265 -121 145 -222 73 -111 190 -82 -142 -47 4 -115 99 -32 27 190 65 53 -119 169 85
$$ packed form
5479A32n6L3O3j51J29n63J94J85J47j63l5J9Q1M6l29L63P0l84J10J87J9j08k0
5502c1l64N45j20o8K5O6J7k14K41m9M3j45O8K01k76L07r5l76K23Jr8J00l06L69
5526F4o4j2N0N5l7k63K57j22J6Q7k6J08k12L8J55j0r0n6O0l8J8M22o02j0J96j63
5552a79K81j9n4r7J91L1r6K3R7k30n7L20j94J57m58M52k97r0J81J69j75n9J97
5575I4r0j72K53K03l42l3k8J07j30J94l45L10N3O6k90J44o9n7m2O8K0o5K25L9
5599A13n4Rj52j05K32P4k29K6J37J66l4l11L16k22J23l4k36K07N0j89K83Q4l71
5622a17J77J22Q0j56l8p3O6k92J94m5Oj34K14J10N6m2l5l9k6M5k28N4K2J76j16
5647a9J38l84J44K66l67K95j84L01k72o0R5N1j19K14j31N9J63j25j2j72K88q4
$$ plain form
5669 85 173 -142 -14 35 14 -35 64 -5 -126 42 26 116 134 4 116 116 -24 -109 -124 -59 77 -169 133 216 -57
5694 -57 -54 121 290 64 84 -135 39 -99 140 59 133 -42 39 -119 188 56 -12 215 -27 -5 130 -166 -182
5717 -182 -59 67 -18 -173 57 130 126 -176 -210 -12 -34 -76 -178 187 -59 -76 -5 -289 -223 -6 125 122 -21 197
5741 197 -209 -38 -185 353 289 -179 112 -105 71 74 -69 -265 86 -43 102 129 150 189 -121 -177 160 -30
5763 -30 -31 -74 186 197 3 -71 43 78 85 -107 -108 -145 -202 -42 132 -43 -48 22 -259 -116 233 66 200 108 -12 -150
5789 -150 -27 9 -27 50 175 -38 -243 -247 -195 201 -125 202 98 53 186 -264 40 -74 98 83 -131 -249 100
5812 100 159 288 169 -8 117 -245 -211 182 -19 -321 -66 -129 70 137 220 80 -88 -76 -120 47 125 55 116
5835 116 19 113 -217 -113 -58 277 -133 -256 -113 -139 14 -282 -39 -32 -22 -132 -89 -13 -182 15 -63 -68 -148 62
$$ packed form
5669H5Q8l15J28M9k1m9R9o9j21J68j6R0J8j30J12%j40q5j5O5J36k46L02Q3k73
5694e7LJ75J69k26K0k19J74j38K39q1P4j75Q1j58L07j32o8K27k42K2J35k96j6
5717a82J23J26q5j55K30P3ml02l4J98k2m2j02L65k46j7P1k84O6K17J31lj43K18
5741A97m06J71j47N38o4m68K91k17J76Lj43j96L51j29J45K7K1L9l10n6L37j90
5763c0jm3K60J1j94p4J14L5Pj92jl7n7J60J74j75nP0k81J43L49j67J34r2j20j38
5789a50J23L6l6P7J25k13k05mN2L96l26L27j04m5J33m50L04j14J72j5k14j18L49
5812A00N9J29j19j77J25l62L4L93k01l02K55o3J99O7Q3j40j68J2m4J67P8p0O1
5835A16r7R4l30J04N5L35m10j23J43k6J53k96K43PJ0j10M3P6j69J97p8nq0K10
$$ plain form
5859 62 147 131 -57 87 -335 -171 -97 15 -142 -6 -265 -167 61 40 -25 100 253 129 -48 89 -59 38 -76
5882 -76 -56 188 -24 91 173 -22 295 -8 -204 -45 -80 -34 -92 10 57 10 63 -140 -13 -83 17 -45 -39 -25 -107
5907 -107 -27 136 -272 -93 -45 26 105 -63 216 -63 154 33 97 180 -102 -77 -40 -228 -93 -110 -40 -63 -54 -168
5931 -168 -1 151 59 367 -38 -121 7 -71 -53 -121 -6 -87 11 10 -153 -72 -38 273 -141 -5 216 25 -64 121
5955 121 -76 292 -77 -12 -9 -163 -167 286 -43 14 -36 -15 91 1 42 -48 39 -169 -89 -107 -128 -12 -1 5 -144 -165
5981 -165 -135 -13 -132 -179 -104 -76 292 -146 151 -85 -58 -56 12 135 130 -41 25 64 269 99 36 -44 172 46 -80
6006 -80 95 33 -162 -100 -146 -168 148 -86 68 -117 190 32 -64 70 -31 -43 35 -108 78 55 165 -92 130
6029 130 49 168 57 133 160 123 -104 76 120 48 -101 159 -108 -302 -270 38 104 -207 -2 -69 -112 128 4
$$ packed form
5859F2Q5j6j88J44m22J64P4J12j57J36k59R8K28k1o5J25J53j24j77J37j48R7j14
5882g6K0K44k12J15Q2j95L17l03j96J59l5M6n8J02M7m7N3k03J27p0J00o2OJ4q2
5907a07Q0J63m08J79M8P1P9j68K79k79K17j21O4Q3k82K5L7j88J35j7P0k3Rj14
5931a68J67J52r2L08m05q3J28p8J8o8J15q1R8jj63Q1L4L11m14J36K21j91q9J85
5955A21j97L68l69O5Lj54mM53l29N7n0K1J06r0M1r0Q7k08Q0j8k1J16J1Oj49k1
5981a65L0J22j19m7P5K8L68m38K97k36K7KO8J23nj71O6L9K05j70o3q0K16j26j26
6006h0J75o2j95O2m6k2L16k34J54j85L07j58r6J34j01j2P8j43J86k3J10k57K22
6029A30q1J19j11P6K7l7k27J80M4p2j49K60k67j94L2L08O6l11K05o7m3K40j24
$$ [...]
8191D
##END NTUPLES=NMR FID
##END=
