##TITLE=1H_DE-18kTFA
 CDCl3
 8 sc, 
 27.9.2023
##JCAMPDX= 6.0         $$ Bruker NMR JCAMP-DX V2.0
##DATA TYPE= NMR FID
##DATA CLASS= NTUPLES
##ORIGIN= UXNMR, Bruker Analytische Messtechnik GmbH
##OWNER= root
$$ XWIN-NMR		Version 3.5
$$ Wed Sep 27 14:55:38 2023 Russian Standard Time (UT+4h)  she@DPX200
##.OBSERVE FREQUENCY= 200.13135
##.OBSERVE NUCLEUS= ^1H
##.DELAY= (6, 6)
##.ACQUISITION MODE= SIMULTANEOUS
##.ACQUISITION SCHEME= undefined
##.AVERAGES= 8
##.DIGITISER RES= 18
##SPECTROMETER/DATA SYSTEM= spect
##.PULSE SEQUENCE= zg30
##.SOLVENT NAME= CDCl3
##.SHIFT REFERENCE= (INTERNAL, CDCl3, 0, 15.7039)
##AUDIT TRAIL= $$ (NUMBER, WHEN, WHO, WHERE, WHAT)
$$ ##TITLE= Audit trail, XWIN-NMR		Version 3.5
$$ ##JCAMPDX= 5.01
$$ ##ORIGIN= Bruker BioSpin GmbH
$$ ##OWNER= she
$$ F:/spectra/data/she/nmr/H-F/1/audita.txt
$$ ##AUDIT TRAIL=  $$ (NUMBER, WHEN, WHO, WHERE, WHAT)
(   1,<2023-09-27 14:54:40.37 +0400>,<she>,<DPX200>,
      <created by zg, POWCHK disabled, PULCHK disabled
       configuration hash MD5:
       00 E9 B6 7A A2 85 ED C7 34 08 36 98 17 FE 4E 26
       data hash MD5: 16K
       E4 55 ED 05 B3 03 26 7A 26 00 C0 1F C6 D6 AB E5>)
$$ ##END=
$$ 
$$ hash MD5
$$ 65 C9 42 2E 3D DD 22 0D 3B E9 89 88 4A C9 04 97
##$RELAX= 
##$RELAX= 
##$RELAX= 
##$RELAX= 
##$RELAX= 
##$RELAX= 
$$ Bruker specific parameters
$$ --------------------------
##$DU= <F:/spectra>
##$EXPNO= 1
##$NAME= <H-F>
##$PROCNO= 1
##$TYPE= <nmr>
##$USER= <she>
##$AMP= (0..31)
100 100 100 100 100 100 100 100 100 100 100 100 100 100 100 100 100 100 
100 100 100 100 100 100 100 100 100 100 100 100 100 100 
##$AQSEQ= 0
##$AQ_mod= 1
##$AUNM= <au_zg>
##$AUTOPOS= <>
##$BF1= 200.13
##$BF2= 200.13
##$BF3= 200.13
##$BF4= 200.13
##$BF5= 200.13
##$BF6= 200.13
##$BF7= 200.13
##$BF8= 200.13
##$BYTORDA= 1
##$CFDGTYP= 0
##$CFRGTYP= 5
##$CHEMSTR= <none>
##$CNST= (0..31)
1 1 145 1 1 1 1 1 1 1 1 1 1 1 1 1 1 1 1 1 1 1 1 1 1 1 1 1 1 1 1 1 
##$CPDPRG= <>
##$CPDPRG1= <>
##$CPDPRG2= <>
##$CPDPRG3= <>
##$CPDPRG4= <mlev>
##$CPDPRG5= <mlev>
##$CPDPRG6= <mlev>
##$CPDPRG7= <mlev>
##$CPDPRG8= <mlev>
##$CPDPRGB= <>
##$CPDPRGT= <>
##$D= (0..31)
0 1.2 0 0 0 0 0 0 0 0.06 0 0.03 0 0 0 0 0.0002 0 0 0 0 0 0 0 0 0 0 0 0 
0 0 0 
##$DATE= 1695812079
##$DBL= (0..7)
120 120 120 120 120 120 120 120 
##$DBP= (0..7)
150 150 150 150 150 150 150 150 
##$DBP07= 0
##$DBPNAM0= <>
##$DBPNAM1= <>
##$DBPNAM2= <>
##$DBPNAM3= <>
##$DBPNAM4= <>
##$DBPNAM5= <>
##$DBPNAM6= <>
##$DBPNAM7= <>
##$DBPOAL= (0..7)
0.5 0.5 0.5 0.5 0.5 0.5 0.5 0.5 
##$DBPOFFS= (0..7)
0 0 0 0 0 0 0 0 
##$DE= 6
##$DECBNUC= <off>
##$DECIM= 32
##$DECNUC= <off>
##$DECSTAT= 4
##$DIGMOD= 1
##$DIGTYP= 9
##$DL= (0..7)
0 120 120 120 120 120 120 120 
##$DP= (0..7)
150 150 150 150 150 150 150 150 
##$DP07= 0
##$DPNAME0= <>
##$DPNAME1= <>
##$DPNAME2= <>
##$DPNAME3= <>
##$DPNAME4= <>
##$DPNAME5= <>
##$DPNAME6= <>
##$DPNAME7= <>
##$DPOAL= (0..7)
0.5 0.5 0.5 0.5 0.5 0.5 0.5 0.5 
##$DPOFFS= (0..7)
0 0 0 0 0 0 0 0 
##$DQDMODE= 0
##$DR= 18
##$DS= 0
##$DSLIST= <SSSSSSSSSSSSSSS>
$$ [...]
##$SUBNAM2= <"">
##$SUBNAM3= <"">
##$SUBNAM4= <"">
##$SUBNAM5= <"">
##$SUBNAM6= <"">
##$SUBNAM7= <"">
##$SUBNAM8= <"">
##$SUBNAM9= <"">
##$SW= 18.05172834244
##$SWIBOX= (0..15)
0 0 2 0 0 0 0 0 0 0 0 0 0 0 0 0 
##$SW_h= 3612.71676300578
##$TD= 16384
##$TD0= 1
##$TE= 0
##$TE2= 300
##$TE3= 300
##$TEG= 300
##$TL= (0..7)
0 120 120 120 120 120 120 120 
##$TP= (0..7)
150 150 150 150 150 150 150 150 
##$TP07= 0
##$TPNAME0= <>
##$TPNAME1= <>
##$TPNAME2= <>
##$TPNAME3= <>
##$TPNAME4= <>
##$TPNAME5= <>
##$TPNAME6= <>
##$TPNAME7= <>
##$TPOAL= (0..7)
0.5 0.5 0.5 0.5 0.5 0.5 0.5 0.5 
##$TPOFFS= (0..7)
0 0 0 0 0 0 0 0 
##$TUNHIN= 0
##$TUNHOUT= 0
##$TUNXOUT= 0
##$USERA1= <user>
##$USERA2= <user>
##$USERA3= <user>
##$USERA4= <user>
##$USERA5= <user>
##$V9= 5
##$VALIST= <valist>
##$VCLIST= <CCCCCCCCCCCCCCC>
##$VD= 0
##$VDLIST= <DDDDDDDDDDDDDDD>
##$VPLIST= <PPPPPPPPPPPPPPP>
##$VTLIST= <TTTTTTTTTTTTTTT>
##$WBST= 1024
##$WBSW= 4
##$XGAIN= (0..3)
0 0 0 0 
##$XL= 0
##$YL= 0
##$YMAX_a= 132429
##$YMIN_a= -123157
##$ZGOPTNS= <>
##$ZL1= 120
##$ZL2= 120
##$ZL3= 120
##$ZL4= 120
##$ABSF1= 10
##$ABSF2= 0
##$ABSG= 5
##$ABSL= 3
##$ALPHA= 0
##$AQORDER= 0
##$ASSFAC= 0
##$ASSFACI= 0
##$ASSFACX= 0
##$ASSWID= 0
##$AUNMP= <proc_1d>
##$AZFE= 0.1
##$AZFW= 0.1
##$BCFW= 1
##$BC_mod= 2
##$BYTORDP= 1
##$COROFFS= 0
##$CY= 11.3945322036743
##$DATMOD= 1
##$DC= 2
##$DFILT= <>
##$DTYPP= 0
##$F1P= 15.7292609196834
##$F2P= 12.9074282941183
##$FCOR= 0.5
##$FTSIZE= 0
##$FT_mod= 4
##$GAMMA= 1
##$GB= 0.15
##$INTBC= 1
##$INTSCL= 1
##$ISEN= 128
##$LB= 0.24
##$LEV0= 0
##$LPBIN= 0
##$MAXI= 10000
##$MC2= 0
##$MEAN= 0
##$ME_mod= 0
##$MI= 1.114404
##$NCOEF= 0
##$NC_proc= 0
##$NLEV= 6
##$NOISF1= 3.799351
##$NOISF2= 2.8
##$NSP= 1
##$NTH_PI= 0
##$NZP= 0
##$OFFSET= 15.70392
##$PC= 1
##$PHC0= -21711.13
##$PHC1= 11.45271
##$PH_mod= 1
##$PKNL= yes
##$PPARMOD= 0
##$PSCAL= 0
##$PSIGN= 0
##$REVERSE= no
##$SF= 200.130013532006
##$SI= 16384
##$SIGF1= 3
##$SIGF2= 2
##$SINO= 400
##$SIOLD= 16384
##$SREGLST= <1H.CDCl3>
##$SSB= 0
##$STSI= 0
##$STSR= 0
##$SW_p= 3612.71676300578
##$SYMM= 0
##$S_DEV= 0
##$TDeff= 0
##$TDoff= 0
##$TI= <>
##$TILT= no
##$TM1= 0
##$TM2= 0
##$TOPLEV= 0
##$USERP1= <user>
##$USERP2= <user>
##$USERP3= <user>
##$USERP4= <user>
##$USERP5= <user>
##$WDW= 1
##$XDIM= 8192
##$YMAX_p= 0
##$YMIN_p= 0
$$ End of Bruker specific parameters
$$ ---------------------------------
##NTUPLES= NMR FID
##VAR_NAME=  TIME,          FID/REAL,        FID/IMAG
##SYMBOL=    X,             R,               I
##VAR_TYPE=  INDEPENDENT,   DEPENDENT,       DEPENDENT
##VAR_FORM=  AFFN,          ASDF,            ASDF
##VAR_DIM=   8192,          8192,            8192
##UNITS=     SECONDS,       ARBITRARY UNITS, ARBITRARY UNITS
##FACTOR=    0.0002768,     1,               1
##FIRST=     0,             0,               0
##LAST=      2.2672688,     0,               0
##MIN=       0,             -123157,         0
##MAX=       2.2672688,     132429,          0
$$ Real data points
##PAGE= N=1
##DATA TABLE= (X++(R..R)), XYDATA
$$ [...]
1827A112o06n2k17q2m18K32M6l92K2K60m48r8L5j98K75Q2o7M23K66r9J01K86N5
$$ 1112 506 454 237 155 -263 -31 15 -377 -355 -95 -543 -641 -606 -804 -529 -447 -514 -91 175 76 177 463 518
1850E18o5L1R2l35J17or0k8j15pJ49R4m58k54o9M8m42J89K46J90l3j4J4K80m40
$$ 518 453 484 576 241 358 352 262 234 119 112 261 355 -103 -357 -426 -378 -820 -631 -385 -195 -228 -242 -228 52 -388
1875c88N5N65n3o4J68r1J94R3j01P8Q0l67j85k75K95m58M04L3n1o2J23l8n0l69
$$ -388 -333 232 179 115 283 192 386 479 378 456 536 169 -16 -291 4 -454 -50 -17 -68 -130 -7 -45 -95 -464
1899d64L92k73K4q9K56O62k20j4j60J56o9j29k16K30j61l2j99K15Rl3K16j4j91
$$ -464 -72 -345 -321 -410 -154 508 288 274 114 270 201 72 -144 86 -75 -107 -306 -91 -82 -115 101 87 -104
1922a04p8P7q4J49j20K14K27j18L29Mk56k45L80m74R6Kk45L35N5m39J75L8k14
$$ -104 -182 -105 -189 -40 -160 54 281 163 492 496 240 -5 375 -99 -3 -1 -246 89 144 -295 -120 -82 -296
1945b96Q4j98l3L53l06O4L91M1L53k42K41J2pl44kK63J2k8j00K57n13J24k76j50
$$ -296 -212 -410 -443 -90 -396 -332 59 100 453 211 452 464 457 113 111 374 386 358 258 515 2 126 -150 -300
1969c00j66k13J13R4J07k59R0L84k0n2P3K00mk2K43M1o4N22j85j49L37l8m75j14
$$ -300 -466 -679 -566 -472 -365 -624 -534 -150 -170 -222 -149 51 47 25 268 309 245 767 582 433 770 732 257 143
1993A43J15m04N2j25P3j47J61J10n12K26O3o24M80l3L9J88L48k26%N99n15J00
$$ 143 258 -146 -94 -219 -146 -293 -132 -22 -534 -308 -245 -869 -389 -422 -383 -195 153 -73 -73 526 11 111
2015A11L53P4j48j29M56m80j46K88P4r4j55m63L2M00n16l34L04m9K90M7j54J34
$$ 111 464 538 390 261 717 237 91 379 453 359 204 -259 -227 173 -343 -677 -373 -422 -132 -85 -239 -105
2037a05K73J3k62J19K47k14l9M42j71J68k0k4k3j20J2l64o5K41k77J15K09j36
$$ -105 168 181 -81 38 285 71 32 474 303 471 451 427 404 284 296 -68 -133 108 -169 -54 155 19
2059A9K3k94P5j91J98j12N3P5L00j84J02K6J24k43l9L17k81JK05m2k18K78j17
$$ 19 42 -252 -177 -368 -170 -282 -229 -154 146 -38 64 90 214 -29 -68 249 -32 -31 174 132 -86 192 75
2082G5k28J17L22n70J11J93J7j53K30k0k23L34J4o30M78j20j2K38k91O2J77K6
$$ 75 -153 -36 286 -284 -173 20 37 -116 114 94 -129 205 219 -411 67 -53 -65 173 -118 -56 121 147
2104A47j94j17N40m62r9K8P3j8K51n02K65N17k15k35K28Ll12O2M25m43J93J51
$$ 147 -47 -164 376 -86 -185 -157 -84 -102 149 -353 -88 429 214 -21 207 210 -102 -40 385 -58 135 286
2126B86k03L2m9o4k20L82k65l29J8M18j51k78J65J81Q6jk6O0K62l72L5J20J28
$$ 286 83 115 66 2 -218 164 -101 -430 -412 6 -145 -423 -258 -77 9 8 -18 42 304 -68 -33 87 215
2149B15Q1j9Q4J86j53l11J60l39p7K72n0j37M2O3l22n4J87j67k64J42K13M8M3
$$ 215 296 277 361 547 394 83 243 -96 -173 99 49 -88 -46 17 -305 -359 -172 -339 -603 -461 -248 -200 -157
2172a57K69k27L72J3LP7J3k58J13j06J02K82j05l45M18j05l86R8j91J29n44L51
$$ -157 112 -115 257 270 273 350 363 105 218 112 214 496 391 46 464 359 -27 71 -120 9 -535 -184
2194a84J8l19O3J91p6Q6J94k37K18K37j77j30K66q9K52k41L44m07K55J11m60Q8
$$ -184 -166 -485 -422 -231 -307 -221 -27 -264 -46 191 14 -116 150 61 313 72 416 9 264 375 -85 3
2216CJ19k43j62M53o7J44q8l09j09n2J69k07M6L38k03J55o7J22q9L10l78ML98
$$ 3 122 -121 -283 170 103 247 159 -150 -259 -311 -142 -349 -303 35 -168 -13 -80 42 -47 263 -115 -111 287
2239B87K06o71K34K9m6M5J35j98Q9Q2n07L76j16J73m21J13M01m18k82K93J3J43
$$ 287 493 -178 56 85 39 84 219 21 110 192 -315 61 -55 118 -303 -190 211 -207 -489 -196 -183 -40
2261d0m3j81J72j12M65j55J53l57J32k7K94Q0l51J27j76P8L78k16l22L06j02j00
$$ -40 -83 -264 -92 -204 261 106 259 -98 34 7 301 381 30 157 -19 59 437 221 -101 205 103 3
2283CL1j03N4k30j0J19J5K37j75Nk24K04Q4j96J71J84l39K53j65J23J14P7j16
$$ 3 34 -69 -15 -245 -255 -136 -121 116 -59 -54 -278 -74 10 -186 -15 169 -170 83 -82 41 155 232 116
2306A16k74N27m60k5M09l35m4L12j56p7M0o9j95n3N6J03R5J59l73R1M2J81l93
$$ 116 -158 369 -91 -116 293 -42 -86 226 70 -7 33 -36 -231 -284 -228 -125 -30 129 -244 -153 -111 70 -323
2329c23M5L68m57L16J31M1k98L13rj1R4k46K54k10j65K74j26J39j15K7J24k69
$$ -323 -278 90 -367 -51 80 121 -177 136 127 116 210 -36 218 8 -157 117 -9 130 15 42 166 -103
2351a03J24J28m31O59n57pq7K13m9J99j43J79k42k5j8P2O5J06k00m2L38k50K9
$$ -103 21 149 -282 377 -180 -187 -274 -61 -110 89 -54 125 -117 -142 -160 -88 -23 83 -117 -159 179 -71 -42
2374d2N6M89m24J2p9J2J4q8J63q0r1J87J35k61k15M6k4O4KK02k93J22j35L83l1
$$ -42 14 503 79 91 12 24 38 -50 113 33 -58 129 264 3 -212 -166 -190 -126 -124 78 -215 -93 -228 155 124
2399A24n44K31J88L01m86M32j44M8J80k3j79k3K11k73J01j77l1k6J27j20n1M0
$$ 124 -420 -189 -1 300 -186 246 102 150 330 307 128 105 316 43 144 -33 -64 -90 37 -83 -134 -94
2421i4P6l74M02l74jK5J75K50l96L10J84l14K61K6k73K66J71j45N4o0K91K1k96
$$ -94 -18 -392 10 -364 -365 -340 -165 85 -311 -1 183 -131 130 156 -117 149 320 175 229 169 460 481 185
2444A85P0j63j43Pm6K42k42l2n2K9o0K0J4j81JJ91J39r2R3J56m7q7L21k63J08
$$ 185 255 92 -51 -44 -90 152 -90 -122 -174 -145 -205 -185 -171 -352 -351 -160 -21 -113 -20 136 89 2 323 60 168
2469A68J63J19ml79M3o9M7J75k11M5l2j67j36J56pl23KL32J29j0n3R3n44N99r0
$$ 168 331 450 446 67 110 41 88 263 52 97 65 -102 -238 -82 -89 -412 -410 -78 51 41 -12 81 -463 136 46
2494D6k52M89k37m7J24L1l9O6J92l42n9L65J07n90L7q9L7J95L28k88J13l96K0
$$ 46 -206 283 46 -1 123 154 115 181 373 31 -28 337 444 -146 -109 -198 -161 34 362 74 187 -209 -189
2517a89P5R8j74J26J29J65m49K47N6n8J53p6k36L19l5k50M6J35k45K05J85k78
$$ -189 -114 -16 -190 -64 65 230 -219 28 84 26 179 103 -133 186 151 -99 -53 82 -163 42 227 -51
2539e1P9N0N4J3r0K20j52j52K68p5k78N0n9j91M52l48j87J56J48QK10l19K08J36
$$ -51 28 78 132 145 55 275 123 -29 239 164 -114 -64 -123 -314 138 -210 -397 -241 -93 -85 125 -194 14 150
2563A50l11KJ63J24j27j01M33k64J16j92O24l10m13J03J34Nk33J14J15m1Q7l40
$$ 150 -161 -159 4 128 1 -100 333 69 185 -7 617 307 -106 -3 131 136 -97 17 132 91 178 -162
2585a62q4J87Q7l18j2M12l39J23O7n4J47J17p1O8O1j64Q9R4q0K1jK07k21k05J11
$$ -162 -246 -59 28 -290 -302 110 -229 -106 -39 -93 54 171 100 168 229 65 154 248 168 189 188 395 174 -31 80
2610H0j31J06j43p0n1k4J99j48j60L5J50J71j33o6j34M76j77K20j8p0J51Kq2J10
$$ 80 -51 55 -88 -158 -209 -233 -34 -182 -342 -307 -157 14 -119 -185 -319 157 -20 200 182 112 263 265 183 293
2634B93j90n5j82K11R5l31n4J79J19k83L8N5J86l97J55N1J23j20L6Ln5J16j45
$$ 293 103 48 -134 77 172 -159 -213 -34 85 -198 -160 -105 81 -316 -161 -110 13 -107 -71 -68 -123 -7 -152
2657a52O5L11k60K82j47K3O7K3k94J20J73J1k39M2N4L4j20j08oj16L10k02l37
$$ -152 -87 224 -36 246 99 122 189 212 -82 38 211 222 -17 25 79 113 -7 -115 -121 -237 73 -129 -466
2680d66M20j02q7L70J17k47J18k77J78P8L3j86j12L70j65J5k68K93L5k69R8J62
$$ -466 -46 -148 -235 135 252 5 123 -154 24 102 135 -51 -163 207 42 57 -211 82 117 -152 -54 108
2702A08j23p0j31J15P0o0P9j2k5j70QK81j86J7P9k16K25o0o0K01Kk20J85K96l18
$$ 108 -15 -85 -216 -101 -31 -91 -12 -24 -49 -219 -211 70 -116 -99 -20 -236 -11 -71 -131 70 72 -148 37 333 15
2727A5j49M60l18j51K2l5K40j67L53l9k00k23J36n9K49j32j9j09K44l23oK59j2
$$ 15 -134 326 8 -143 -121 -156 84 -83 270 231 31 -192 -56 -115 134 2 -17 -126 118 -205 -211 48 36
2750C6l20L87l17jL00L5j45Q1N1k52K40J50j95L1o8j39L53p3j56K0k6J5k19K58
$$ 36 -284 103 -214 -215 85 120 -25 56 107 -145 95 245 50 81 13 -126 227 154 -2 18 -8 7 -212 46
2774D6k56J06K85k74K3k24K68K0q8m4r7n6K29q9K80O7l87M10j27J22j9k01L06
$$ 46 -210 -104 181 -93 -70 -294 -26 -6 -94 -138 -235 -291 -62 -151 129 196 -191 219 92 214 195 -6 300
2797C00pj24j76K63j07r8o4J64p6j68m9ojJ24j29k20K95l6p2R2J16n2m3K79j82
$$ 300 293 169 -7 256 149 51 -13 151 75 -93 -142 -148 -149 -25 -154 -374 -79 -115 -187 -95 21 -31 -74 205 23
2822B3L7k5l2K20j01L26K0l70m3j16J80k07N1K66j48j05j55K5r7R8O5p2K25j62
$$ 23 60 35 3 223 122 448 468 98 55 -61 119 -88 -37 229 81 -24 -179 -154 -251 -153 -88 -160 65 -97
2846i7k5L0J81j03j31nL46r8j94L38j23n2k52M0K47j29N9j59K28j68K78k43R3
$$ -97 -122 -92 89 -14 -145 -150 196 98 -96 242 119 67 -185 -145 102 -27 32 -127 101 -67 211 -32 61
2869F1j43n8k14K80N1Nj5K27j20k92R4R4p4k0J48N8j7Q3j21R2O3k13M2J74l20
$$ 61 -82 -140 -354 -74 -23 -18 -33 194 74 -218 -124 -30 -104 -124 24 82 65 148 27 119 182 -31 11 185 -135
2894a35J45K12j26p6k12M11l29l9j50L22l8K37k10j07K34k60j2J01J10k71J15
$$ -135 10 222 96 20 -192 219 -110 -149 -299 23 -15 222 12 -95 139 -121 -133 -32 78 -193 -78
2915g8NR4k0m7q3K76o3l29K88p4O1J59j24q0M0k67J60J34K25k01j03j55J50k39
$$ -78 -73 21 1 -46 -129 147 84 -245 43 -31 30 189 65 -15 25 -242 -82 52 277 76 -27 -182 -32 -271
2939b71J33L83m33K76l23L24k71N34m52Q3K6J0O3K5j70J93J24l16M32m01L8n2
$$ -271 -138 245 -188 88 -235 89 -182 352 -100 -17 9 19 82 107 -63 130 254 -62 370 -31 7 -45
2961d5j13J79j6j24n5o8K57J43j31k66L73k89J51k04L29l14R1J43M8K3k17L39
$$ -45 -158 21 5 -119 -174 -242 15 158 27 -239 134 -155 -4 -208 121 -193 -102 41 89 112 -105 234
2983B34k32N8k81N13k77L6J99L1j85R8ok02q8O1q5J91r3K77k06R7j24q3K56l18
$$ 234 2 60 -221 292 15 51 250 281 96 194 188 -14 -102 -41 -126 65 -28 249 43 140 16 -67 189 -129
3007a29j96J65L77k47J19P6m59L0M34n0k69M18k16J03k5j66j4K93k10k02R2J30
$$ -129 -325 -160 217 -30 89 165 -294 -264 170 120 -149 269 53 156 131 -35 -49 244 34 -168 -76 54
3029E4N7p2j02P7Qj58J7j45J08J93k0L0j91RoK04j77j2K46J93q2j97o1J29q1j34
$$ 54 111 39 -63 14 22 -136 -119 -264 -156 37 17 47 -144 -135 -141 63 -114 -126 120 313 231 34 -27 102 21 -113
3055a13K46k49J65j21J26o4j95K78J38m15K11q1j43Q9O7j0N8J01k69J78j54J8
$$ -113 133 -116 49 -72 54 -10 -205 73 211 -204 7 -74 -217 -128 -61 -71 -13 88 -181 -3 -157 -139
3077a39N2q6K75k12J14Q1L38l20n1N5K7k08J93l62L07N3k3k74K7K94l14J6J49
$$ -139 -87 -173 102 -110 4 85 423 103 52 107 134 -74 119 -243 64 117 94 -180 -153 141 -173 -157 -8
3100hk50L32j34l38L25P6O8q8l5Q9j63o0J32j72K34L7m8q5L91j91P1q6j94K24
$$ -8 -258 74 -60 -398 -73 3 71 -17 -52 37 -126 -186 -54 -226 8 45 -3 -88 303 112 183 97 -97 127
3124A27j53j04L1J83m58M98j39J0k03q3L39n8J24l53J46r5K00L0K25m08L21l19
$$ 127 -26 -130 -99 84 -374 124 -15 -5 -208 -291 48 -10 114 -239 -93 -188 12 42 267 -141 180 -139
3146a39N2K64k80J58M6K9m14N74j21Q7l20P6l1J40j76j06K38Q8p3j98J2p7J36
$$ -139 -87 177 -103 55 101 130 -284 290 169 256 -64 12 -19 121 -55 -161 77 165 92 -106 -94 -171 -35
3169c5j50R5M7q9L2P0l6N2K1k26J27J23k71N13l4j14m9L43l49o7K04l03M10k94
$$ -35 -185 -90 -43 -132 -100 -30 -66 -14 7 -219 -92 31 -240 273 239 125 76 419 70 3 207 -96 314 20
3193B0o2J79n57M03l3R7j95M0o6J53r5j13L92k15j83K77p1j1j25K33P9q5J97j44
$$ 20 -42 137 -420 -17 -50 47 -148 -108 -174 -21 -116 -229 163 -52 -235 42 -29 -40 -165 68 147 62 259 115
3217A15p3q6o0N9Q2RQQ7j51J97m06q0L21Oj39qj40J50K34k63J76Q9o9j46K25R1
$$ 115 42 -44 -104 -45 37 46 54 141 -10 187 -219 -299 22 28 -111 -119 -259 -109 125 -138 38 127 58 -88 137 228
3243B28k39k05K97R5J18k36n5m9p3Q3O3P8j20N2J02Jj47p0J8J7m1k32J92J29k84
$$ 228 -11 -216 81 176 294 58 3 -46 -119 -36 27 105 -15 37 139 140 -7 -77 -59 -42 -83 -315 -123 6 -278
3268b78K46j43K25j32j87M34jk58L91j78l40L21K9j94L00j60J72k18%l7J04P7
$$ -278 -32 -175 50 -82 -269 165 164 -94 297 119 -221 100 129 -65 235 75 247 29 29 -8 96 173
3290A73L8l61O0J07r1m7N4J16NN7m6k86K54J10k56J6J3J91k21Q5l7N5k24L28k62
$$ 173 211 -150 -90 17 -74 -121 -67 49 54 111 65 -221 33 143 -113 -97 -84 107 -114 -29 -66 -11 -235 93 -169
3315a69J41J20j30K22j00j00J72j95l7J52j74oQ8k68J83O3k73L07J04l07J67J81
$$ -169 -28 92 -38 184 84 -16 156 -39 -76 76 -98 -104 -16 -284 -101 -38 -311 -4 100 -207 -40 141
3337A41m3o6p4J14m9J81l76L21M2q1L5j34J65j89K08l12J81K47k18k04J40J7J09
$$ 141 98 32 -42 72 23 204 -172 149 191 110 145 11 176 -13 195 -117 64 311 93 -111 29 46 155
3360A55k51j57J53O4j48l0J52J28j02k28K60n4k51J76J82L09l42J81k61K23j93
$$ 155 -96 -253 -100 -36 -184 -214 -62 66 -36 -264 -4 -58 -309 -133 49 358 16 197 -64 159 -34
3381c4J89l09K16j73m7K30j6J41j99j81P0L36k84J15l91L71j06k1j84L89l88J57
$$ -34 155 -154 62 -111 -158 72 56 197 -2 -183 -113 223 -61 54 -337 34 -72 -93 -277 112 -276 -119
3403a19M6l01J77K13j61K75N4l28K69j42j6K4m9J13q3J28k22K90k94m3J80Jl6
$$ -119 -73 -374 -197 16 -145 130 184 -144 125 -17 -33 -9 -58 55 -28 100 -122 168 -126 -169 11 12 -24
3426b4j24L9m3K65k01p0K45j84Q3k9J85k29R5K8J55n5J02n89N12p9j74j1K13m1
$$ -24 -148 -109 -152 113 -88 -158 87 -97 -14 -43 142 -87 8 36 191 136 238 -351 161 82 -92 -103 110 69
3450F9J60m4l04J65k8l1k08J90j29j65K82L42l17k28J36K1L55l79p2M34j23j33
$$ 69 229 185 -119 46 18 -13 -221 -31 -160 -325 -43 299 -18 -246 -110 -89 266 -113 -185 249 126 -7
3472gl01N94L1n55O11m47R7j37J93J1r7n8J46K9k04p7k28K20K46j18J77l67L00
$$ -7 -308 286 317 -238 373 -74 23 -114 79 90 -7 -65 81 110 -94 -171 -399 -179 67 -51 126 -241 59
3495E9k40j34L80j76J30Q0j89J2j05J62K06m22O9M07M4l25j32m1K99j57M4K8J12
$$ 59 -181 -315 65 -111 19 99 -90 -78 -183 -21 185 -237 -168 239 283 -42 -174 -215 84 -73 -29 -1 111
3518A11j53O2k18J49o7l2K12j41P5o5l6K29k33M2K63k77qj6J18K48l98J56J67
$$ 111 -42 20 -198 -49 -116 -148 64 -77 -2 -67 -103 126 -107 -65 198 -79 -87 -103 15 263 -135 21 188
3541A88l5m41N78l0k11J56j95k10QR4O8j95p0M76j70q5J34j18Q5J15j42J29j00
$$ 188 153 -288 290 260 49 205 10 -200 -192 -98 -30 -225 -295 181 11 -74 60 -58 27 142 0 129 29
3564B9J66%m45J26J73O6j99Q0pQ5j9N6J4k46J45J52O1l14K52k72K8P3Or1p3j9
$$ 29 195 195 -250 -124 49 115 -84 -4 -11 74 55 111 125 -121 24 176 237 -77 175 -97 -69 4 10 -81 -154 -173
3590a73J18J3J10O1n8j27O9p9O0K78k42l9J60J23l27J98k08Q4j40J08M3o5N7J58
$$ -173 -55 -42 68 129 71 -56 13 -66 -6 272 30 -9 151 274 -53 145 -63 21 -119 -11 32 -33 24 182
3614A82j34q2j19J90RLj66K7PN0K7J74m04K51j91k4L55P2j97N5j32j4J87n4N4
$$ 182 48 -34 -153 37 46 49 -117 -90 -83 -33 -6 168 -236 15 -176 -200 155 227 30 85 -47 -61 126 72 126
3639A26j41N8P8j12K02j46k33M5K38k52R9K6j07J15O8j13l6M43m93j0K99k15J09
$$ 126 -15 43 121 9 211 65 -168 -123 115 -137 -38 -12 -119 -4 64 -49 -85 358 -135 -145 154 -61 48
3662D8n2j18K05k2l1j34K70k28K35r1J13m9j19K5J21p5j30j2K9j21L46k82k82
$$ 48 -4 -122 83 61 30 -104 166 -62 173 82 195 146 27 52 173 98 -32 -44 -15 -136 210 -72 -354
3685c54K34J56N3k05J44k16L96n3o8j62O0o4K4K81m06J74j28O7O9J5j1O8q5j03
$$ -354 -120 36 89 -116 28 -188 208 155 87 -75 -15 -79 -55 226 -180 -6 -134 -67 2 17 6 74 -11 -114
3709a14J15J8K99k52m74M84k91K46jj4M7l2j22j96L06j09J86j69K57p0J77r5l57
$$ -114 1 19 318 66 -408 76 -215 31 30 16 63 31 -91 -287 19 -90 96 -73 184 114 291 196 -161
3732a61L84k52K4nK22q2k11K03J8k59j0K4m4K57k7j02n2J62k44K35l30M6J62J48
$$ -161 223 -29 -5 -10 212 130 -81 122 140 -119 -129 -105 -149 108 81 -21 -73 89 -155 80 -250 -204 -42 106
3756A06J31jl0k01MJ46n9k35M85k89K35l05R6r6l19L22p4J12L9m7q2k18K46J05
$$ 106 237 236 206 5 9 155 96 -139 346 57 292 -13 83 -13 -332 -10 -84 28 67 20 -62 -280 -34 71
3780G1l14K96j65P3O9K96j83k89O3J42k78L6L25l93M03k68R8J91j51J28k09k35
$$ 71 -243 53 -112 -39 30 326 143 -146 -83 59 -219 -183 142 -251 152 -116 -18 173 22 150 -59 -294
3802b94M35l62K96j12m4K37k83J41o6l9M3J43m2n2oj02J35K35l00o1o0K11j94
$$ -294 141 -221 75 -37 -81 156 -127 14 -52 -91 -48 95 53 1 -5 -107 28 263 -37 -98 -158 53 -141
3825a41M8J55m0j96K20K22j16k9m00K12K10L2jl04K75p5m10L69j50K37k20m3L48
$$ -141 -93 62 22 -174 46 268 152 123 -277 -65 145 177 176 -128 147 72 -338 31 -119 118 -102 -145 203
3848B03j47J01q8j63J78j04l6J29J92n7n4r1N6j01k41K96n5j61J09J7M6J19K0
$$ 203 56 157 69 -94 84 -20 -56 73 265 208 154 63 119 18 -223 73 18 -143 -34 -17 29 148 168
3871A68j86Q1J68l26J91%q5j97J25j99M8J48j81Q5LJ26j41L13j11j9M1j04j70
$$ 168 -18 63 231 -95 96 96 11 -186 -61 -260 -212 -64 -245 -160 -157 -31 -172 141 30 11 52 -52 -222
3894b22K02j07L70M5k31j49K26l38K08j6RK3j77q4L35j51k80J44J10j60J61J94
$$ -222 -20 -127 243 288 57 -92 134 -204 4 -12 -3 20 -157 -241 94 -57 -337 -193 -83 -243 -82 112
3916A12J0m2l25K29M2j58J26l0O7k8o8k0J77j47j21K09R5l10J97l1J4K89j72j12
$$ 112 122 80 -245 -16 26 -132 -6 -36 31 3 -65 -85 92 -55 -176 33 128 -182 15 -16 -2 287 115 3
3940Cl7L3p2O5p1P2j07J04P2J58J0j62l2j93K96J5k7k40J39M9j6m1R8J48p4n00
$$ 3 -34 -1 -73 -8 -79 -7 -114 -10 62 220 230 68 36 -157 139 154 127 -113 26 75 59 18 116 264 190 -310
3966c10L87j19n1MO5P9n3J28K2J63l23lPL06m43Q9k06K69n0P5Q2N3j23r8R9K2
$$ -310 77 -42 -93 -89 -24 55 2 130 152 315 -8 -11 -4 302 -141 -52 -258 11 -39 36 118 171 48 -50 49 71
3992G1j21n7L2j18K63j61J02J12k34J97j29J67r0kr4k3k9K91l0q5N9j16J0o4J28
$$ 71 -50 -107 -75 -193 70 -91 11 123 -111 86 -43 124 34 32 -62 -85 -114 177 147 62 121 5 15 -49 79
4017G9L02l85p6k9K89j52q0j51K13j03P2Q2K1J28p7m2Q8l82J40J06l0o9J19k73
$$ 79 381 -4 -80 -109 180 28 -52 -203 10 -93 -21 61 82 210 133 91 179 -203 -63 43 13 -56 63 -210
4041b10J45J43n35L04J51K55k17R1k45J1L7L9L0j34J34J61j78o5P2M7J08k65J13
$$ -210 -65 78 -457 -153 -2 253 36 127 -118 -107 -70 -31 -1 -135 -1 160 -18 -83 -11 36 144 -121 -8
4064hJ14j49K83l40n0j36L35j87J64o6J56j88J25R0j12k86M64m6J23m00J88J06
$$ -8 106 -43 240 -100 -150 -286 49 -138 26 -40 116 -72 53 143 31 -255 209 163 286 -114 74 180
4086A80l71J28No0k99N56j66K27k55J82p3n8J45L7k72J3J29p5p4J35o9j1J86l90
$$ 180 -191 -63 -58 -118 -417 139 -27 200 -55 127 54 -4 141 178 -94 -81 48 -27 -101 34 -35 -46 140 -250
4110b50K82q9N4p0q8K71j17M8lj15L05q9Q8k59Q6r5j04M78k91j49j66L25j67J00
$$ -250 32 -57 -3 -73 -161 110 -7 41 38 -77 228 139 227 -32 54 -41 -145 333 42 -107 -273 52 -115 -15
4134a5l5j05K84p6K06l70r2K77l74M25j82j79J50q1L17k0jR7l5j76J82k26J11
$$ -15 -50 -155 129 53 259 -111 -203 74 -300 125 -57 -236 -86 -167 150 130 129 226 191 15 197 -29 82
4157H2k58L40j56p3RM6o5O3L62k84L9j10j39K25k76M67l42K0QJj14O8J36k61J97
$$ 82 -176 164 8 -65 -56 -10 -75 -12 350 66 105 -5 -144 81 -195 272 -70 -50 -42 -41 -155 -87 49 -212 -15
4182a5j57L8K19j49P9k92J73R2j33L29j52k47J53K4K74j10k8k21mJ17j55K21p8
$$ -15 -172 -134 85 -64 15 -277 -104 -12 -145 184 32 -215 -62 -38 236 126 98 -123 -127 -10 -165 56 -22
4205b2%J63J18l24pK11k12P4Q7j32k54L03m7o1J88k23J82J97k73n5J57n4J03l8
$$ -22 -22 141 259 -65 -72 139 -73 1 88 -44 -298 5 -42 -103 85 -138 44 241 -32 -87 70 16 119 81
4229H1j04J62r2j11n3J27J4q9O6M8n7J62j48J52j5k19N1p7J61j35J44n4k8L22
$$ 81 -23 139 47 -64 -117 10 24 -65 1 49 -8 154 6 158 143 -76 -25 -102 59 -76 68 14 -14 308
4253C08k58j05M56n26J8J36n6M3R8o3r6J63j36Q0R9k36J5J57m30L44j5j29l2J45
$$ 308 50 -55 401 -125 -107 29 -27 16 114 51 -45 118 -18 62 161 -75 -60 97 -333 11 -4 -133 -165 -20
4277b0J28K48o17J21J43j00M9n3K27pk38qJ3K08k29j6L62k42o5M79k94N5r8LR8
$$ -20 108 356 -261 -140 3 -97 -48 -101 126 119 -119 -127 -114 94 -135 -151 211 -31 -96 383 89 144 46 49 147
4302A47j69N9K3L8mk50K17RQm2R1l01K03J0m7m7K66r1M6j31o1q5j19L86l31m5
$$ 147 -22 37 60 98 94 -156 61 70 78 36 127 -174 29 39 -8 -55 211 120 166 35 -26 -111 -230 156 -175 -220
4328b20L61j62j06Q7L05l59j2J67k98K21J9j44Q3j39K39J2J27l39J76L6p4Q7J45
$$ -220 141 -21 -127 -40 265 -94 -106 61 -237 -16 3 -141 -58 -197 42 54 181 -158 18 54 -20 67 212
4351B12l12K20k64K14j64L73m16L8j9J66r3J44P3l84J19j84J69P3P7n7p7j09M81
$$ 212 -100 120 -144 70 -94 279 -137 -99 -118 48 -45 99 172 -212 -93 -277 -108 -35 42 -15 -92 -201 280
4374B80l17qQJ63j29j07Q4p2J64r3J33Rj39r8K68k19M3k2q5K37P5l17R8J36r3
$$ 280 -37 -45 -37 126 -3 -110 -26 -98 66 -27 106 115 -24 -122 146 -73 -30 -52 -137 100 175 -142 -44 92 -1
4399aq2J40o3k87J98J20jJ37j68L09k32j40K66n8j83o7k2RK9K38j76JP4j32M1
$$ -1 -83 57 -6 -293 -95 25 24 161 -7 302 70 -70 196 138 -45 -112 -134 -125 -96 142 -34 -33 41 -91 -50
4424e0j60K17M5k5m9k8J52l5L9l6m4k39J42j00K44l25J25J24J68j49J59j23r6
$$ -50 -210 7 52 27 -22 -50 102 67 106 70 26 -213 -71 -171 73 -252 -127 -3 165 16 175 52 -44
4447d4K78p6l96K63R9r8l8l9K11J2j26J23p1J2o8L9O8j4j40J9k11J6K15N0jm6
$$ -44 234 158 -238 25 124 26 -12 -51 160 172 46 169 98 110 42 81 149 135 -5 14 -197 -181 34 84 83 37
4473C7j39J7J63J74q0j11j61K68j59P4J69l71K19J98j74n3J5n8KK70m85P8J15
$$ 37 -102 -85 78 252 172 61 -100 168 9 83 252 -119 100 298 124 71 86 28 30 300 -185 -107 8
4496HK45j77k06J13J49p0q0nj92O15m03J02k28K98j06r1J22j9K2j98J22J60n04
$$ 8 253 76 -130 -17 132 62 -18 -23 -215 400 -3 99 -129 169 63 -28 94 75 97 -101 21 181 -323
4519c23K50NJ05j1r2J73M0o8n8N0k3J30m57J94K01j17MO0N6oj05p3j27K02J24
$$ -323 -73 -68 37 26 -66 107 147 79 21 71 48 178 -279 -85 116 -1 3 63 119 113 8 -65 -192 10 134
4544A34j02J08k97J48q1J77j56L1K42j04J7r0k39R3J4J39k36L01j11OO6p5o3R4
$$ 134 32 140 -157 -9 -90 87 -69 -38 204 100 117 27 -212 -119 -105 34 -202 99 -12 -6 60 -15 -78 16
4568A6r0J1J26j56n5J32K69j21l88K31K52k96N8j5J0J26O4j98J33j91J30k28L9
$$ 16 -74 -63 63 -93 -148 -16 253 132 -256 -25 227 -69 -11 -26 -16 110 174 -24 109 -82 48 -180 -141
4591a41J41J28j87j22K52k0O7p5j11j3o2O4om3L85q4k05R6L8j3O2q7j41J45j7
$$ -141 0 128 -59 -181 71 51 118 43 -68 -81 -143 -79 -85 -128 257 173 -32 64 102 89 151 64 -77 68 51
4616E1O3j00j2J50m03J38M4J33k6j17K14j04r9J38PK30l37J00M4O0j85J49q8M6
$$ 51 114 14 2 152 -251 -113 -69 64 38 -79 135 31 -68 70 77 307 -30 70 114 174 -11 138 50 96
4640I6j42m2K60j08Qk6J02K6k28P4P6j51q4J11J41j45k60K24J37kj3o8L5q4R0
$$ 96 -46 -88 172 64 72 46 148 174 -54 20 96 -55 -139 -28 113 -32 -292 -68 69 67 54 -14 21 -63 27
4665B7k67K46j67M04k67J0J47l6p1j15J15k2J3N6R0k11j5N7J82l24J65k1j56J16
$$ 27 -240 6 -161 243 -24 -14 133 97 26 -89 26 4 17 73 163 -48 -63 -6 176 -148 17 -4 -160 -44
4689d4j15j3K33k80K36J23j79K47m14K25K59m46K79K39l94J8K9l5N2N1K2j17N9
$$ -44 -159 -172 61 -219 17 140 -39 208 -206 19 278 -168 111 350 -44 -26 3 -32 20 71 93 -24 35
4712C5J22l01K47l0k79K67j45j85M87j15j45q6J67p6R5o8P1l0k54L24r7k2j8K92
$$ 35 157 -144 103 73 -206 61 -84 -269 218 103 -42 -128 39 -37 58 -10 61 31 -223 101 4 -18 -36 256
4736B56j96j3j17Q8L21m60M8L6O0J54k19j00L58j50Q9j79p9R5n0J73j47o8J81
$$ 256 60 47 -70 18 339 -121 -73 -37 23 177 -42 -142 216 66 155 -24 -103 -8 -58 115 -32 -100 81
4759H1K4N2r8k73M06J03k57j71q2J86K82j40k78J11RP6k64K40J44j39j33O3J10
$$ 81 105 157 59 -214 192 295 38 -133 -215 -29 253 113 -165 -54 -45 31 -233 7 151 12 -121 -58 52
4782E2k62j32K61Q3O1N8m2j36j2r4L6K80NQ7j15q4k02Q5K28k55j3J49l1K03l84
$$ 52 -210 -342 -81 2 63 121 79 -57 -69 -163 -127 153 158 245 130 46 -156 -71 157 -98 -111 38 7 210 -174
4807a74J94J29k9k53J45p2j10P2J3K12j09K10k32O2K9J9k11K27q9j8P1j30j71
$$ -174 20 149 120 -133 12 -60 -170 -98 -85 127 18 228 -4 58 87 106 -105 122 33 15 86 -44 -215
4830b15K16j14K6M6M2K1J78j34j93J11j1J59j69J53k68J20K2j9%j65K35j57Q5
$$ -215 1 -113 -87 -41 1 22 200 66 -127 -16 -27 132 -37 116 -152 -32 -10 -29 -29 -194 41 -116 -31
4853c1J74p7P5j67J44j28K1j07oM67l05j23K69k95L0K69n0pj24n5m8k8J43J17
$$ -31 143 66 141 -26 118 -10 11 -96 -102 365 60 -63 206 -89 -59 210 160 153 29 -26 -74 -102 41 158
4877A58l6j7j0o6M8J57j25k75K9J99j52j29J15kJ9J4L95o2k88q6R1L8o0R4j43
$$ 158 122 105 95 29 77 234 109 -166 -137 62 -90 -219 -104 -106 -87 -73 322 260 -28 -114 -23 15 -45 49 -94
4902i4J68P9q6j86N5J6O0ljn4J75j58j1J80j45O9j55K24j27k11K22J15l2j98O3
$$ -94 74 153 67 -119 -64 -48 12 9 8 -46 129 -29 -40 140 -5 64 -91 133 6 -205 17 132 100 -98 -35
4927c5K30j02L9l12K23J8n8Q8L2K9m75L22l16J54K32k16J38j68J92j40L09j90
$$ -35 195 93 132 -180 43 61 3 91 123 152 -323 -1 -317 -163 69 -147 -9 -177 15 -125 184 -6
4949fJ05j49J43j66j29J17j2N8K8p5N9J7j90J34O0J42k32M62m55O4j21J28j91
$$ -6 99 -50 93 -73 -202 -85 -97 -39 -11 -86 -27 -10 -200 -66 -6 136 -96 366 -89 -25 -146 -18 -209
4972b09K49K13k66o6m7K69j77R4k54O6J78j8L22k56j96M1J45j4k24J69N7J73q2
$$ -209 40 253 -13 -79 -126 143 -34 60 -194 -128 50 32 354 98 -98 -57 88 74 -150 19 76 249 167
4995A67j18o5R3r1Q6J10j76J89K5m85J49J36m3K18o7K4j30O9J12m3k56K67j80
$$ 167 49 -16 77 -14 72 182 6 195 220 -265 -116 20 -23 195 128 152 22 91 203 160 -96 171 -9
5018ik14M24n92L06K23j37K3L8j17n2J96r6M2k32K13j68K40j67J00k57K0K47R0
$$ -9 -223 201 -391 -85 138 1 24 62 -55 -107 89 -7 35 -197 16 -152 88 -79 21 -236 -216 31 121
5041A21m9J92j41l9j39Ol2j30L54l90L69j56J0K48l70J26j96J98l2j14J91J27
$$ 121 72 264 123 84 -55 -49 -81 -211 143 -247 122 -34 -24 224 -146 -20 -216 -18 -50 -164 27 154
5063A54K5j79k18M11k98J14m3J57j89m8K33l51M7K05RJ1N1q4j14m3o0K78J5k9
$$ 154 179 0 -218 193 -105 9 -34 123 -66 -114 119 -232 -185 20 29 40 91 7 -107 -150 -210 68 83 54
5087E4QN2L1k8Q7m19L00j91j27M06l57K07n9n6j9J89j19R0n6J02k23L6kK77k41
$$ 54 62 114 145 117 204 -215 85 -106 -233 173 -184 23 -36 -92 -111 78 -41 49 -7 95 -128 -92 -94 183 -58
5112e8J28k1L12j81k8j78J53r6J90j23k0L7k81L04J09j23m50K22Q4m7M6M25m26
$$ -58 70 49 361 180 152 -26 127 31 221 98 78 115 -166 138 247 124 -326 -104 -20 -67 -21 404 -22
5135b2q2PqL27q2K9l12J43j41L8M6j66J38N7l2J35k96K99q1K08k14Nj07n9K09
$$ -22 -104 -97 -105 222 140 169 -143 0 -141 -103 -57 -223 -85 -28 -60 75 -221 78 -3 205 -9 -4 -111 -170 39
5160C9K2L2j39l7K77k19K80k9k13k17j24L12j9K2L1j11Mj17J37j29K08k90J76
$$ 39 61 93 -46 -83 194 -25 255 226 13 -204 -328 -16 -35 -13 18 -93 -89 -206 -69 -198 10 -280 -104
5183a04kKj20M34k29l8N2J45j66J00j17j39L57j3j5k65K28m1jj75m6J40K86m86
$$ -104 -106 -104 -224 210 -19 -57 -5 140 -26 74 -43 -182 175 162 147 -118 110 69 68 -107 -153 -13 273 -213
5207b13L84L9k78PK24k05LJ03j42j67L28j9j70L55j74j8k24K65j99n4kL5P1RJ20
$$ -213 171 210 -68 -61 163 -42 -39 64 -78 -245 83 64 -106 249 75 57 -167 98 -101 -155 -157 -122 -51 -42 78
5232G8j53J29j04J33p4L5j84M0N4M9m6O2q0j1J03m0j70M52l03k8j15J75lL7J5
$$ 78 -75 54 -50 83 9 44 -140 -100 -46 3 -43 19 -61 -72 31 -9 -179 273 -30 -58 -173 2 -1 36 51
5257E1j88jJ46J2K25k49k8k18N21k67K9J65l8j50J3j65R6K13J43k77k14O7l4J84
$$ 51 -137 -138 8 20 245 -4 -32 -250 271 4 33 198 160 10 23 -142 -46 167 310 33 -181 -114 -148 36
5281C6Pl6m1p9p6J06L11k35Q1J28k27J66k00j18Q0N6p7J79P9k94J25j41J80K1
$$ 36 43 7 -34 -113 -189 -83 228 -7 74 202 -25 141 -59 -177 -97 -41 -118 61 140 -154 -29 -170 10 31
5305C1p1Q3j92J37k16M01O9k91j17J8K78k33J32Q5k66J90k06K29j16L1J03J8j37
$$ 31 -40 43 -149 -12 -228 173 242 -49 -166 -148 130 -103 29 114 -152 38 -168 61 -55 -24 79 97 -40
5328d0l9J98o1k41J97K3j35O0n9jQ8J50k32j61J31J96j9J45q7mN8O3k3j70J87
$$ -40 -79 119 58 -183 14 37 -98 -38 -97 -98 -10 140 -92 -253 -122 74 55 200 113 109 167 230 207 37 224
5353B24l25L56l04P1nR0j35P1q6o3q1J39j36K78m09K64J51j84Q2K13j34J4l19
$$ 224 -101 255 -49 22 17 107 -28 43 -43 -106 -187 -48 -184 94 -315 -51 100 -84 -2 211 77 91 -228
5376b28R9K13q9p3K62j47l7K03r7M1k35K1Q6K56j94j98R8j64J89J82k63P6O4J0
$$ -228 -129 84 -5 -78 184 37 0 203 106 147 -88 -67 19 275 81 -117 -19 -183 6 188 -75 1 65 75
5400G5o7J36j46K30j43j88J67k45K28k43K48n5j12k06J92P5L29j83j11L12j95
$$ 75 8 144 -2 228 85 -103 64 -181 47 -196 52 -3 -115 -321 -129 -54 275 92 -19 293 98
5421I8r7J63l20K73j28L1l2qj72K58L4k70J66R6k27P3p6j6L69m08K95k9k15K05
$$ 98 1 164 -156 117 -11 20 -12 -20 -192 66 100 -170 -4 92 -135 -62 -138 -154 215 -193 102 73 -142 63
5445F3P2k08J58k98N7J60J25Q8L3r1p9K6o5j21J22j40ML48j23j63J89j07l1k22
$$ 63 135 -73 85 -213 -156 4 129 217 250 159 80 106 41 -80 42 -98 -94 254 131 -32 157 50 19 -203
5469b03K06J71p0J8j62m2L3j08K28l00L08r0N6p7J70l28K18M4j89J07r8M6j45
$$ -203 3 174 104 122 -40 -82 -49 -157 71 -229 79 -11 45 -32 138 -190 28 72 -117 -10 -108 -62 -207
5492b07L48j83J6k83N72l03oq5j0K55P9r9k29M5J49L8j54M6R3l7K8J36j30r9M50
$$ -207 141 -42 -26 -309 263 -40 -46 -131 -141 114 193 94 -135 -90 59 97 -57 -11 82 45 73 209 79 -20 430
5517D30j74l75J79J43j39k46N7j42K37o1l5L74l41P6M9J8j41rl9l7K46o7k8J9
$$ 430 256 -119 60 203 64 -182 -125 -267 -30 -91 -126 248 -93 -17 32 50 -91 -100 -139 -176 70 3 -25 -6
5541fl0P3m4P1m2R0m5Q0R4k38j52J48J32l9j73J91l8k9l26J47J23K01n0j58p8
$$ -6 -36 37 -7 64 22 112 67 147 241 3 -149 -1 131 92 -81 110 72 43 -283 -136 -13 188 138 -20 -98
5566i8K49r3N8j52n8J16R5J7j83J14Q3l6j56K77o0J0k13k3o0j7K42j97J08R6l16
$$ -98 151 58 116 -36 -94 22 117 134 -49 65 148 112 -44 233 173 183 -30 -53 -113 -130 112 -85 23 119 -197
5591a97J87L1k20J16K27k81N8J73k41K41j61l12L79J76k80R8J58q3j1j02P6J5
$$ -197 -10 21 -199 -83 144 -137 -79 94 -147 94 -67 -379 0 176 -104 -6 152 69 58 -44 32 47
5613D7K69n35J95K04m30R1O6K31j83J41r7L3R4l73J96j40J93l8K0j28M3K27k7
$$ 47 316 -219 -24 180 -250 -159 -93 138 -45 96 -1 32 126 -247 -51 -191 2 -36 -16 -144 -101 126 99
5636I9P7j18Kk45J12J76j01L4j03J45j21L0J9l1o6p8L35k16k6J00j50R9k18J86
$$ 99 176 58 60 -185 -73 103 2 36 -67 78 -43 -13 6 -25 -91 -169 166 -50 -76 24 -126 -27 -245 -59
5660e9J27k15K01j30J28L26j71k18J8o0m0J52j10M9J33nl09N3K48O9k14j35L43
$$ -59 68 -147 54 -76 52 378 207 -11 7 -53 -93 59 -51 -2 131 126 -183 -130 118 187 -27 -162 181
5683A81o4Mk07l1J62k06k4K13p3k36K54lR6pk74M51l31K6K02m12L27j3j96J7j94
$$ 181 117 121 -86 -117 45 -161 -185 28 -45 -281 -27 -30 66 59 -215 236 -95 -69 133 -279 48 35 -161 -144 -338
5708c38M28K21j24n7l27K18J5j12J51J18mk21Mk4j26m7l4L86k45M7J65K6l11K52
$$ -338 90 311 187 130 -197 21 36 -76 75 193 189 -32 -28 -52 -178 -225 -259 127 -118 -71 94 120 -191 61
5732F1j30J80J31l55J10Pl9l1N0j2P9O6j48J1L5J36l07L19k63J35j7k3J21l16
$$ 61 -69 111 242 -113 -3 4 -35 -66 -16 -28 51 117 -31 -20 15 151 -156 163 -100 35 18 -5 116 -200
5756b00L04L5r2j0On1J25m2M6m26L08J93l8j70J34m3j17J77K5k16J23K41l82J42
$$ -200 104 139 47 37 43 -8 117 75 121 -305 3 196 158 -12 122 79 -38 139 164 -52 71 312 -70 72
5780G2J44k33j0j18O0J35n8J14J66j81l29N7R8K20lk04J27j16K64l99J59K78l76
$$ 72 216 -17 -27 -145 -85 50 -8 106 272 91 -238 -181 -83 137 134 -70 57 -59 205 -194 -35 243 -133
5803a33J97K41l72J10pJ9N8L3L3k99J78J42k9p5k11k5J16K74j33j35J89O0k88
$$ -133 64 305 -67 43 36 55 113 146 179 -120 58 200 171 96 -115 -140 -24 250 117 -18 171 231 -57
5826e7J04J8j27N2m6J44j31J63J24j88o1M1j2m7J9O4M8l7M5l03J37J41k27p0J73
$$ -57 47 65 -62 -10 -56 88 -43 120 244 56 -5 36 24 -23 -4 60 108 71 116 -187 -50 91 -136 -206 -33
5851c3L9o7o9O3%L0k2K28j83J5k00J93Q3j7J2K70j30k67L66k93O4l37Q8K04L1
$$ -33 6 -61 -130 -67 -67 -37 -59 169 -14 1 -199 -6 77 60 72 342 212 -55 311 18 82 -255 -167 37 68
5876F8J53j99p4K02j96K37k31R5j19j8J66m1J90n68L70j52k8J35J44j40k95L96
$$ 68 221 22 -52 150 -46 191 -40 55 -64 -82 84 43 233 -335 35 -117 -145 -10 134 -6 -301 95
5898I5M8m6k30L21k98K80k10P7n9J01k7Q8j72N4p3J62k43j36N45j84k8L7k64J11
$$ 95 143 97 -133 188 -110 170 -40 37 -22 79 52 140 -32 22 -51 111 -132 -268 277 93 65 102 -162 -51
5922e1KL2K15j38j23J81m4j01J84j52j6l2K11N1k81M7R3l07J43K0k28K90j33J19
$$ -51 -49 -17 198 60 -63 118 74 -27 157 5 -11 -43 168 219 -62 -15 78 -229 -86 -66 -294 -4 -137 -18
5946a8M9%K3n9j22L9k06L48J65j02k03N6K43l22j30M35j87pJ60j96P1j70J01j25
$$ -18 31 31 54 -5 -127 -88 -294 54 219 117 -86 -30 213 -109 -239 196 9 2 162 -34 37 -133 -32 -157
5970a57K05K21n2m6j64j76K91j74r3J6K6l95M59j92L04k70j03K86k33K68Q3l11
$$ -157 48 269 217 171 7 -169 122 -52 -145 -129 -103 -498 -39 -231 73 -197 -300 -14 -247 21 104 -207
5992b07M16k91j05J02j43J09K9J06k9m7j27J47J8k03L74j02j4O7k96L15k77K28
$$ -207 209 -82 -187 -85 -228 -119 -90 16 -13 -60 -187 -40 -22 -225 149 47 33 100 -196 119 -158 70
6014G0M4j71ql19J35J53p6J03J28on1n8L9k7j37J09n5j93M47j20L8j06K75k03
$$ 70 114 -57 -65 -384 -249 -96 -172 -69 59 53 2 -56 -17 -44 -181 -72 -127 -320 127 7 45 -61 214 11
6038A1r5J87j21L1J61l95J95q9L15k26j54J1Q6L6j87m2J96J1q5M55j38k31l83
$$ 11 -84 103 -18 13 174 -221 -26 -115 200 -26 -180 -169 -83 -47 -234 -276 -80 -69 -154 301 163 -68 -451
6061d51N58k28K21j28j45K07p7j78J98J32K13l96K02l5j28J31k19J21no2Ko2L7
$$ -451 107 -121 100 -28 -173 34 -43 -221 -23 109 322 -74 128 93 -35 96 -123 -2 -7 -69 -67 -129 -92
6084i2j37J99j8K08j87J08m0J17P6r0N2k35J16j39NM8J1l2j69K85l64M18k05O4
$$ -92 -229 -30 -48 160 -27 81 41 158 234 144 196 -39 77 -62 -57 -9 2 -30 -199 86 -278 140 -65 -1
6108aL0J17k62K05l3O7Q8j7l60rL38k86J42Oj01J81j70J7l4Qnj5K7k9J42J18l41
$$ -1 29 146 -116 89 56 123 211 194 -166 -175 163 -123 19 25 -76 105 -65 -48 -82 -74 -79 -94 -67 -96 46 164 -177
6135a77J73m1j00K98k26J01N1k32P3Q1L1r8J65j52o3K20m61K81m7L90j54j38K8
$$ -177 -4 -45 -145 153 -73 28 79 -153 -80 1 32 -66 99 -53 -116 104 -357 -76 -123 267 113 -25 3
6158CQ5j91R9N8R8o9k72M09j68K0o1P0J1nN7o4K64l22o9Q8P4k35J34j07J28L08
$$ 3 88 -103 -4 54 152 83 -189 220 52 72 11 81 92 87 144 80 344 22 -47 41 115 -120 14 -93 35 343
6184C43k01p2k9l00K03j00K41j01O7J14j98r0J55j32N6N1QJ41R1k74l0K84k64
$$ 343 142 70 41 -259 -56 -156 85 -16 51 165 -33 -123 32 -100 -44 7 15 156 247 -27 -57 227 -37
6207c7M4J8j32K13k33ql7o1K89N1j47o8L5J12O4k36K41j87j81L16K51on66J80
$$ -37 7 25 -107 106 -127 -135 -172 -233 56 107 -40 -108 -73 39 103 -133 108 -79 -260 56 307 301 -265 -85
6231h5L00j55J05J43j91j00j75J71j85o3K65M3j93L20k28j94J34L22m10K78j54
$$ -85 215 60 165 308 117 17 -158 13 -172 -235 30 73 -120 200 -28 -222 -88 234 -176 102 -52
6252e2j7N3j04j03J14J79k44K09k39L01k34P8J40k2K5N0j38l4k2P8q7P4k6J26
$$ -52 -69 -16 -120 -223 -109 70 -174 35 -204 97 -137 -59 81 59 84 134 -4 -38 -60 18 -69 5 -21 105
6276A05k05po0J98j00J15j50m7P5k5o6K63k64K45O5k45J89l7j10J97l04L74k25
$$ 105 -100 -107 -167 31 -69 46 -104 -151 -76 -101 -167 96 -168 77 142 -103 86 49 -61 136 -168 206 -19
6299a9O0k72l6P30m06n2k28K96J89j74j57MR4Ln6m4Q7m2j71K21L6j60J11J04l24
$$ -19 41 -231 -267 463 57 5 -223 73 262 88 -69 -65 29 32 -24 -68 19 -23 -194 27 63 -97 14 118 -206
6324b06j9J29k0J72J02k60N1J41J21k01l8O2j05j43R9K21k06J27k2J16j15n6N5
$$ -206 -225 -96 -116 56 158 -102 -51 90 211 10 -28 34 -71 -214 -115 106 -100 27 5 121 6 -50 5
6347Ej14J83j92J47j25o4K80q6J70j1k29k96J55K73j70o3L71J14l60J52l98K35
$$ 5 -109 74 -118 29 -96 -160 120 34 204 193 -36 -332 -177 96 -74 -137 234 348 -12 140 -258 -23
6369b3kj20J43r5K9P8n9J9J23j64j8o4K79j76j48K21J57j26j60L99o13M52l3j84
$$ -23 -25 -145 -2 -97 -68 10 -49 -30 93 -71 -89 -153 126 -50 -198 23 180 54 -106 293 -320 132 99 -85
6393h5J76n0J3J9k65J51Pj70L14l93K12j63J94N5N7O7l49M84o6k24K0R8j6n4n5
$$ -85 91 41 54 73 -192 -41 -34 -204 110 -283 -71 -234 -40 15 72 139 -210 274 208 -16 4 102 86 32 -23
6418b3j61L50k78k9K10K2R2l46N78m66k2Q7K36k08k1n4R2p8J64j53l9l18N03k88
$$ -23 -184 166 -112 -141 69 91 183 -163 415 -51 -73 14 250 42 21 -33 59 -19 145 -8 -47 -365 138 -150
6442a50K67L2l08J67j31K02j57k4M2J05J6j31J1OoR1l1j59KL95k47J08o2j55J98
$$ -150 117 149 -159 8 -123 79 -78 -102 -60 45 61 -70 -59 -53 -59 32 1 -158 -156 239 -8 100 38 -117 81
6467H1m52L52j10J97Mm25M95j98j30K11J28k60Q4Q8J1k09M43l30r8K58qk11R8
$$ 81 -371 -19 -129 68 72 -353 142 -56 -186 25 153 -107 -23 65 76 -133 310 -20 -118 140 132 -79 19
6490A9j00J94k91M04j11L7j52J8Q1k14K61M0j57j1K5j68L62l45P6j15K1K25j42
$$ 19 -81 113 -178 226 115 152 0 18 99 -115 146 186 29 18 43 -125 237 -108 -32 -147 -126 99 -43
6513d3J07k73k2J99L6K7P1m8J9j28J8K62k43J35N0P6l78J73Mk11L19k37J14j5
$$ -43 64 -209 -231 -32 4 31 102 54 73 -55 -37 225 -18 117 167 243 -135 38 42 -169 150 -87 27 12
6537A2K06l7nn5j98J33l6j1l53K48J97j57j4J29m5r2j1K96l26J21J60l16J01j94
$$ 12 218 181 176 121 -77 56 20 9 -344 -96 101 -56 -70 59 14 -78 -89 207 -119 2 162 -154 -53 -247
6561b47L6RL30k43Q4P8N2m32M58j51m1r8J80N4O4j57J97k04J91k5j71J47J6k10
$$ -247 -211 -202 128 -115 -31 47 99 -333 125 -26 -67 -165 15 69 133 -24 173 -31 160 135 -36 111 127 -83
6585h3j39L00Pk31J14Q7K11j36p5l52J16P5K8N5M5j60m3J08j00M4P0k0J63j14
$$ -83 -222 78 85 -146 -32 55 266 130 55 -297 -181 -106 -78 -23 22 -138 -181 -73 -173 -129 -59 -79 84 -30
6609c0oJ58o5L19k93lJ2j29J19j03J71j6o0K1R5l49P3J04Q3k51P2P6P4j40l0J48
$$ -30 -36 122 57 376 83 80 92 -37 82 -21 150 134 74 95 190 -159 -86 18 101 -150 -78 -2 72 -68 -98 50
6635E0J57j33j30j3Q2k11K14Oj2k62J67Q3J74l91N29l50J36o3n4k31K86K92m03
$$ 50 207 74 -56 -69 13 -198 16 22 10 -252 -85 -2 172 -219 310 -40 96 33 -21 -252 34 326 -77
6658g7K24l44K2K49k86rM82n0k19J71l11J75N7k66K06n8k45K18j29K58p5J23j09
$$ -77 147 -197 -175 74 -212 -221 261 211 -8 163 -148 27 84 -182 24 -34 -279 -61 -190 68 -7 116 7
6681GJ34q8j3m7k29J94j05J84K9J00k57K16q3J22r5j17q9J22o0J63r6q8K56l81
$$ 7 141 53 40 -7 -236 -42 -147 37 66 166 -91 125 42 164 69 -48 -137 -15 -75 88 -8 -96 160 -221
6705b21J25J05J07J04l53O5n6J65J8j0J52m06J84O0j1j48Nk35L70Q7j62J27l7
$$ -221 -96 9 116 220 -133 -68 -124 41 59 49 201 -205 -21 39 28 -120 -115 -350 20 107 -55 72 35
6728C5p7j38J0l7K89k06K94R2l48MJ47j51K9j10Q4j88L98q6K56r0k48j6MJ8J74
$$ 35 -42 -180 -170 -207 82 -124 170 262 -86 -82 65 -86 -57 -167 -83 -271 127 41 297 207 -41 -57 -53 -35 139
6753A39k08R9j73P5O4L2m5j58%K45O4l53J42k2K90j75%l2k01K95L9j31J30j36
$$ 139 -69 30 -143 -68 -4 28 -17 -175 -175 70 134 -219 -77 -99 191 16 16 -16 -217 78 117 -14 116 -20
6777b0N1j10K91j87Lp6J42k82m5K71j04J27k74J75p1Rj66L43p3Jm9J22J11k67
$$ -20 31 -79 212 25 28 -48 94 -188 -233 38 -66 61 -213 -38 -109 -100 -266 77 4 5 -44 78 189 -78
6801g8J59k2j63K03Jn5Rk07L89k33r9q0J76Q1o8l17J02J78O7J67j66N8k99K28
$$ -78 81 59 -104 99 100 45 54 -153 236 3 -96 -176 0 81 13 -304 -202 -24 43 210 44 102 -197 31
6825C1n8j32M6J39QP0k11j6P3J57J94l24p7M10k30o7O7j10r7J88j27J03l7J54
$$ 31 -27 -159 -113 26 34 104 -107 -123 -50 107 301 -23 -100 310 80 13 80 -30 -127 61 -66 37 0 154
6849A54l11L10j69r1M2J16j34K79k45p1m7k21O10l13P0J26k60K05j5q1J84k40
$$ 154 -157 153 -16 -107 -65 51 -83 196 -49 -120 -167 -388 222 -91 -21 105 -155 50 35 -46 138 -102
6871a02J16o1P2k2K69l47j18J21j8J07Q1Q6j47J01k49J86Pj34j09N8N4n7K63J8
$$ -102 14 -47 25 3 272 -75 -193 -72 -90 17 98 184 37 138 -111 75 82 -52 -161 -103 -49 -106 157 175
6895A75o8j9j90n3K59l67L49J8p7k52J4J38J70p0p6P6O6k40K3Q5J55l19K46j55
$$ 175 107 88 -102 -155 104 -263 86 104 27 -225 -211 -73 97 27 -49 27 93 -147 -124 -39 116 -203 43 -112
6919a12K13J08l95K48j07J44j1l40N57k33j30J04o3J60j16m9m2K51o1k06q4K65
$$ -112 101 209 -186 62 -45 99 88 -252 305 72 -58 46 -17 143 27 -22 -64 187 126 -80 -164 101
6941A01k4j66J43L9k96L63j25K19k41kj30J51J49j74J61l3j54k8K6r3K7Q6J20
$$ 101 77 -89 54 93 -203 160 35 254 13 11 -119 32 181 7 168 135 -19 -47 -21 -114 -87 -1 119
6964A19j31J58j44J04j51M1J23j8J78l87J56PPJ48q4k07j05RK86j36l1J25j34
$$ 119 -12 146 2 106 -45 -4 119 101 279 -108 48 55 62 210 126 -81 -186 -177 109 -27 -58 67 -67
6987f7J42j4j55Q0o2P4J78l02l3K44J32l55J64j09OK23k14J69k11J30K7m6j00
$$ -67 75 61 -94 -14 -76 -2 176 -126 -159 85 217 -138 26 -83 -77 146 -68 101 -110 20 47 1 -99
7010i9J18j4J06k32L57k15j51J02K45k9k43O1J1l8m3J08p6M3n6J42j43J56Q4j47
$$ -99 19 5 111 -121 236 21 -130 -28 217 188 -55 6 17 -21 -64 44 -32 11 -45 97 -46 110 194 47
7034D7J62q3j8o9j53K49J00j59j72j47L51k31J64j40J04J6M0J07l6j17k30J03
$$ 47 209 126 108 39 -114 135 235 76 -96 -243 108 -123 41 -99 5 21 61 168 132 15 -215 -112
7056a12K5J52J05J18k65n6p5K82j26M4J6l52J62j46L10Kj15N1k11p3K66rK0Rq4
$$ -112 -87 65 170 288 23 -33 -108 174 48 92 108 -244 -82 -228 82 84 -31 20 -191 -264 2 -7 13 22 -62
7081f2q9J12O7l0j31n8M36j77j12R4r0Q2J28m48O6K57k66N29l57J57J3J16k48
$$ -62 -151 -39 28 -2 -133 -191 245 68 -44 50 -40 42 170 -278 -212 45 -221 308 -49 108 121 237 -11
7104a1L9j94K4J4j92K90m0L11j12Q9j63J06r8l9j25J51m5J4Ok34R7r0J71K06l01
$$ -11 28 -166 -142 -128 -320 -30 -70 241 129 218 55 161 63 24 -101 50 5 19 25 -209 -112 -202 -31 175 -126
7129a26J9J18p7J88p0j12j69qrK06j38P1OJ72r9j31j11pL9L54P3j80n0J45k64
$$ -126 -107 11 -66 122 52 -60 -229 -237 -246 -40 -178 -107 -101 71 -28 -159 -270 -277 -238 116 189 9 -41 104 -160
7154a60K19RnJ9k6K21j16m16J45L25n16L32j22J84k27J75r3j1R8R7O7j54lo3m2
$$ -160 59 68 63 82 56 277 161 -255 -110 215 -301 31 -91 93 -134 41 -52 -63 35 132 199 45 42 -21 -63
7179f3M8R0j25K1j76J62M7J85j72j21O9R7O2j38j86M5K58j14L6k12O4r1K20R8
$$ -63 -15 75 -50 -29 -205 -43 4 189 17 -104 -35 62 124 -14 -200 -155 103 -11 25 -187 -123 -214 6 104
7203A04Q5r1j73K50j95q5J47j65J4L69l8k04M2J59k9p8O6M4k66N2lK5Q5Q0j10
$$ 104 189 98 -75 175 -20 -105 42 -123 -109 260 222 18 60 219 190 112 178 222 -44 8 5 30 115 195 85
7228H5Q4l77L18k16K49k25R4L3k49J38o9K27o0j6R2k09j74L47k46J84J90q9k0
$$ 85 169 -208 110 -106 143 -82 12 45 -204 -66 -135 92 32 16 108 -101 -275 72 -174 10 200 111 91
7251I1j27K4K31j23k14P9J1j52P1k7L27k41J55j55PR0J00J26k06j79J84O2k30
$$ 91 -36 -12 219 96 -118 -39 -28 -180 -109 -136 191 -50 105 -50 -43 47 147 273 67 -112 72 134 -96
7274i6J10l23M25j30n9J99k28J64k81J52j1L0J7k5p1j01L07j4O0j17L7L5j13j07
$$ -96 14 -309 116 -14 -73 126 -102 62 -219 -67 -78 -48 -31 -56 -127 -228 79 65 125 8 45 80 -33 -140
7298a40K05n9l6J3j69J3N16j76p1j55j26K44k58K99j17J21j19q8Q3J84k48K12
$$ -140 65 6 -30 -17 -186 -173 343 167 96 -59 -185 59 -199 100 -17 104 -15 -103 -20 164 -84 128
7320A28j28N3N6k92K07L7K69n04l5J35J84l3o5j06J77j29J66k01J85n1j84Q5r4
$$ 128 0 53 109 -183 24 61 330 -174 -209 -74 110 77 12 -94 83 -46 120 -81 104 53 -131 -46 -140
7343a40R5K97k34Q1J5L1rj10J71l04K20n1j84l9K60m13J72k2J2L46k76r8K96o3
$$ -140 -45 252 18 99 114 145 136 26 197 -107 113 62 -122 -161 99 -314 -142 -164 -152 194 -82 -180 116 53
7367E3K30k24k40J46qk0m2M4k41J94J14k44J94j3J09j47Q3j28J55O8J27r0n0L5
$$ 53 283 59 -181 -35 -43 -63 -105 -61 -302 -108 6 -238 -44 -57 52 -95 -12 -140 15 83 210 120 70 105
7391A05N4n00K52K63l24J46p0j40J93K51l75K31q0k17K9J38K27j80j68L02j50
$$ 105 159 -341 -89 174 -150 -4 -74 -214 -21 230 -145 86 6 -211 -182 -44 183 3 -165 137 -13
7412a3L1R8q4o5j12J91j33R0p4K5J1P8k15j4J42j7J05l08L90L5j06K9K6r0o9n7
$$ -13 18 116 32 -33 -145 46 -87 3 -71 -46 -35 43 -172 -186 -44 -61 44 -264 126 161 55 84 110 20 -49 -106
7438a06q8R9J39J49q7p7j93J67j66K10N6J40k20k9Q0J8QM7k78L26o5j90K17j67
$$ -106 -194 -95 44 193 106 29 -164 3 -163 47 103 243 23 -6 74 92 100 147 -131 195 130 -60 157 -10
7462a0J19N1j26n6J24l39L55k08L3k0j22J98q4L29k50J76k6j13J0j35p1L1J25
$$ -10 109 160 34 -22 102 -237 118 -90 -57 -77 -199 -1 -85 244 -6 170 144 31 41 -94 -165 -134 -9
7485iQ2L4l25J46J29p9p3N4R6j22K8j71K9J13K46j35j74M1K22j15J88k80k1k0
$$ -9 73 107 -218 -72 57 -22 -95 -41 55 -67 -39 -210 -181 -68 178 43 -131 -90 132 17 205 -75 -96 -116
7509a16k41L60j63J62n3Q5o4j02J5J65L4L2j21l4R7N4kj13j35J60J71J13j15J5
$$ -116 -357 3 -160 2 -51 34 -30 -132 -117 48 82 114 -7 -41 56 110 108 -5 -140 20 191 304 189 204
7533B04k33R3j07k61N15j96Q2j35K8m4j7J08J74p3j31j29o5L45q8m42M33K25j07
$$ 204 -29 64 -43 -304 211 15 97 -38 -10 -54 -71 37 211 138 7 -122 -187 158 70 -372 61 286 179
7556A79r9j24L60k46N9n6l07K00J77l27nPK27k17J15K8J16J36k13PM6J66l57J73
$$ 179 80 -44 316 70 129 73 -234 -34 143 -184 -189 -182 45 -172 -57 -29 87 223 10 17 63 229 -128 45
7580D5j3nr9M8j16K28N0j41l0m9K42k45P8kj44L48j47K97l12j54L35j79k05L37
$$ 45 32 27 -72 -24 -140 88 138 -3 -33 -82 160 -85 -7 -9 -153 195 48 345 33 -121 214 35 -170 167
7604A67k07J86k50Rp3M54m60L20j14KL4p4k9K41r9l76M35m7l0k79O8K27j63m5
$$ 167 -40 146 -104 -95 -168 286 -174 146 32 34 68 -6 -35 206 107 -269 166 119 89 -190 -122 105 -58 -103
7628a03j13l0K48j23L65j20k55M5%K06n5k42O7J25pq9J23R3j28m4J68q0o0Q0j24
$$ -103 -216 -246 2 -121 244 124 -131 -86 -86 120 65 -177 -110 15 8 -81 42 135 7 -37 131 51 -9 71 -53
7653e3J7J10j18K0j59J74r5J46l9l3k69L07m7K74k52J46m03K26Q6l5P3Ql5J50
$$ -53 -36 74 -44 -24 -183 -9 -104 42 3 -30 -299 8 -39 235 -17 129 -274 -48 38 3 76 84 49 199
7677A99l84K16qj13K79k85J40m9P7r3J17J21L8l32k01%K32J68q3j72K60L6r9k49
$$ 199 -185 31 23 -90 189 -96 44 -5 72 -21 96 217 255 -77 -278 -278 -46 122 39 -133 127 163 64 -185
7701a85K72j72J22k8k38p2L74j65J86j72J99j39j07P5J69k85J45P4r6K13j59J1
$$ -185 87 -85 37 9 -229 -301 73 -92 94 -78 121 -18 -125 -50 119 -166 -21 53 -43 170 11 22
7723B2l7J9jL6j76k0m2R2J03j97J32K3j89L39o4k02J36L12j84k8j78j72M02j39
$$ 22 -15 4 3 39 -137 -157 -199 -107 -4 -201 -69 -46 -235 104 40 -162 -26 286 102 74 -104 -276 126 -13
7747a3o9J11m2nJ43k95J60Q9l24O1J66n2J18K1j01K3K01k28j6P3M1%j40J79j07
$$ -13 -82 29 -13 -18 125 -170 -10 79 -245 -184 -18 -70 48 69 -32 -9 192 -36 -52 21 62 62 -78 101 -6
7772fj90L27k7N7j35N2k37J17J1j07K64k37L8J13Ok15J85j01j32L45j86J17M9
$$ -6 -196 131 104 161 26 78 -159 -42 -31 -138 126 -111 -73 40 46 -169 16 -85 -217 128 -58 59 108
7795A08L39o11K22mj48J22l2J46m8j73p1L96j99K09j05k45J54j58J82O3o1o7n1
$$ 108 447 -164 58 54 -94 28 -4 142 94 -79 -150 246 47 256 151 -94 60 -98 84 147 86 19 -32
7818c2J36q6K95n35J45K21j23j94K06j37J17P0M3n16P2M06l5j81l7o5M21P4l47
$$ -32 104 18 313 -222 -77 144 21 -173 33 -104 13 83 126 -390 -318 88 53 -128 -165 -230 191 265 -82
7841h2R7N5O1n54O63j50N2k49j2Q6j56K42p1m5J2l17K44N3j6l2J26L4R5k63J17
$$ -82 15 70 131 -423 240 90 142 -107 -119 -33 -189 53 -18 -63 -51 -368 -124 -71 -87 -119 7 41 136 -127 -10
7866a0K8J22k19l5J05M9Lj0q0K11j38n3j06L68l49J06P2k72K45l3J4M3J29l5k93
$$ -10 18 140 -79 -114 -9 40 43 33 -47 164 26 -27 -133 235 -114 -8 64 -208 37 4 18 61 190 155 -138
7891a38K41n9mk9j42J85K8j11o0J81k38K89j56L4p7R0J5O8j62r7j66J43P5J48
$$ -138 103 44 40 11 -131 54 82 -29 -89 92 -146 143 -13 21 -56 34 49 117 -45 -142 -308 -165 -90 58
7915E8M4j19K68j49K34l62q8L99j91K%l85M17r0p5j54J88L2o1LoK4K1K13M2p5
$$ 58 102 -17 251 102 336 -26 -114 285 94 96 96 -289 128 38 -37 -191 -3 29 -32 -29 -35 -11 10 223 265 190
7941A90k4j49%n9N4m5J54j9k01j43J33q8K07Ml56L39k18J43j85R0m1J87K48m22
$$ 190 166 17 17 -42 12 -33 121 102 -99 -242 -109 -197 10 14 -342 -3 -221 -78 -263 -173 -214 -27 221 -201
7965b01M79l39Q5L40m84J66on6J08j04QM5j49J50K2O8pl04J70k0J47R0k82J51
$$ -201 278 -61 24 364 -120 46 40 -16 92 -12 -4 41 -108 42 64 132 125 -179 -9 -29 118 208 -74 77
7989G7j82N8J15J08K6j66L0Oj59J91r5j07j03K37k32J10P3m2J91j34J96k68J5
$$ 77 -105 -47 68 176 202 36 66 72 -87 104 9 -98 -201 36 -196 -86 -13 -55 136 2 198 -70 -55
8012e5J33k31L09k24J86m0k1k9p0J77q7k76M58l12m9J51o3n9J34j56k13L68l0
$$ -55 78 -153 156 -68 118 78 57 28 -42 135 48 -228 230 -82 -131 20 -43 -102 32 -124 -337 31 1
8035AP3j13j53K27j49q5J97j49oO9M9l8m2K03j5l8j16N7P4K41l33K1M8j1M8P7
$$ 1 74 -39 -192 35 -114 -199 -2 -151 -157 -88 -39 -77 -119 84 69 31 -85 -28 46 287 -46 -25 23 12 60 137
8061A37l24L69p3K0l67J58J43Q9l50o7L99j05j30QJ32J39k2m0k36K33k44j01L00
$$ 137 -187 182 109 129 -238 -80 63 152 -198 -265 134 29 -101 -93 39 178 156 116 -120 113 -131 -232 68
8084F8NL1j07M0M5J35k20L77k51k3q6l4K04o08L37O2Q5l4n0l3j21K48j81r9L65
$$ 68 73 104 -3 37 82 217 -3 374 123 100 14 -20 184 -424 -87 -25 60 26 -24 -57 -178 70 -111 -210 155
8109A55k14o8p5j57K75j21K85k93K10Q7r5j61K63j47M4o6L0K93m66L77rl2o3J6
$$ 155 -59 -127 -202 -359 -84 -205 80 -213 -3 84 -11 -172 91 -56 -12 -78 -48 245 -221 156 147 115 52 68
8133F8k52K45r4K38n3K6k16o9K17K6j39m3j20P0r4J83k8j61O3M75m93j45K81n2
$$ 68 -184 61 -33 205 152 178 -38 -107 110 136 -3 -46 -166 -96 -190 -7 -35 -196 -133 342 -151 -296 -15 -67
8157f7m0K90j88j19J15k27L51k05J88J8j01J26K20n16j06J31R4N6m8Q9j35J48
$$ -67 -107 183 -5 -124 -9 -236 115 -90 98 116 15 141 361 -155 -261 -130 -36 20 -28 61 -74 74
8179G4N0k5k24P7M8j49L31k94J75n4J47K19
$$ 74 124 99 -125 -48 0 -149 182 -112 63 9 156 375
8191C75
$$ Imaginary data points
##PAGE= N=2
##DATA TABLE= (X++(I..I)), XYDATA
0@%%%%%%%%%%%qJ6j6J6j6K4l2M0m8N6o7P5q8J05j29J52j74J99k26K61l00L42l88
$$ 0 0 0 0 0 0 0 0 0 0 0 0 -8 8 -8 8 -8 16 -16 24 -24 32 -35 40 -48 57 -72 80 -94 105 -121 140 -160 182 -206
34b06M39m95N57o24O96p77Q67r64J069j188J316j452J603j769J950k148K367k609
$$ -206 233 -262 295 -329 367 -410 457 -507 562 -626 690 -762 841 -928 1022 -1126 1241 -1368
52a368K875l169L501l874M291m769N326n976O749p689Q857j0355J2358j5185J9514
$$ -1368 1507 -1662 1839 -2035 2256 -2513 2813 -3163 3586 -4103 4754 -5601 6757 -8428 11086
67A1086k7045M3841j51039L8182J80809j84629J4321Q3902j2062J3748K8895r7470
$$ 11086 -15959 27882 -123157 -84975 95834 -88795 -74474 9428 -2634 11114 40009 -57461
79e7461N9084J08452q8227p0257J02470J0470k3381L5230m2550m8654P3236k4706
$$ -57461 1623 110075 21848 -48409 54061 64531 41150 76380 33830 -14824 58412 33706
91C3706j05574K4698N7347l2359j5101j5884n215O8867M690r4022K6678Q3123
$$ 33706 -71868 -47170 10177 -22182 -37283 -53167 -58382 10485 15175 -78847 -52169 30954
103C0954m7329m8648M9449L2461J5563J5705k8206J0455N5128l5931n4530L6835
$$ 30954 -16375 -65023 -15574 16887 32450 48155 19949 30404 85532 49601 -4929 31906
115C1906P973m7195N020L326k8910K2902J8471m5774n943L4009k1563k6802J8121
$$ 31906 39879 -7316 -2296 1030 -27880 -4978 13493 -32281 -38224 -4215 -25778 -52580 -34459
128c4459P434K670K0264J008L2K9297J1621j9332k526J2583j044j0917q795M025
$$ -34459 -27025 -24355 -4091 -3083 -3051 26246 37867 18535 16009 28592 27548 16631 7836 11861
142A1861J3859m193j7470J671Q530j3389k1113o406K658k77p043k905J0468J3293
$$ 11861 25720 21527 4057 5728 14258 869 -20244 -26650 -23992 -24269 -31312 -34217 -23749 -10456
156a0456J946j385R936J2203j400p375L793Q815K288K657M744r06M2M28j1483
$$ -10456 -8510 -9895 41 12244 10844 3469 7262 16077 18365 21022 25766 24860 24902 25330 13847
171A3847j2251o51n651j1854l032j483j091P776m63q920R530J1865j0552m930
$$ 13847 1596 945 -4706 -16560 -19592 -21075 -22166 -14390 -14853 -23773 -14243 -2378 -12930 -17860
185a7860J3506M404o02P412M081N994J1010m785q879Q277P90j5346m545J220n855
$$ -17860 -4354 50 -552 6860 10941 16935 27945 23160 14281 22558 23348 8002 3457 4677 -1178
200a178r05l56p494J329J543j3051m386P402l909k031J0518J762R39J4456M372
$$ -1178 -2083 -2439 -9933 -8604 -7061 -20112 -24498 -17096 -21005 -23036 -12518 -10756 -9817 4639 9011
215I011m212R205N828p835J556M211n670J328L605q510j051O586r860j1223K224
$$ 9011 4799 14004 19832 11997 13553 17764 12094 13422 17027 8517 7466 14052 4192 -7031 -4807
230d807n113j0549J256O49j524O818K294l719Q588P163p450Q42R993m30k8Q197
$$ -4807 -9920 -20469 -19213 -18564 -20088 -13270 -10976 -14695 -6107 1056 -6394 -5552 4441 4011 3983 12180
246A2180K512J382M619k550l686K061m732r921j986k411o253K51J374l893J152
$$ 12180 14692 16074 20693 18143 14457 16518 11786 1865 -121 -2532 -8785 -8534 -7160 -11053 -9901
261i901K471m175j610J450k676j32N600J870M062J0162L623r83L854K877m417
$$ -9901 -7430 -11605 -13215 -11765 -14441 -14573 -8973 -7103 -3041 7121 10744 9761 13615 16492 12075
276A2075k369J16k240j296q27r08P13j4m490l434j566m699m857j072o41m37L534
$$ 12075 9706 9822 7582 6286 5459 4551 5264 5250 760 -2674 -4240 -8939 -13796 -14868 -15509 -15946 -12412
293a2412M067M583M907K096K89J265o27k628L25L352P22M47L422K888r92k825
$$ -12412 -8345 -3762 1145 3241 3530 4795 4168 1540 1865 5217 5939 6386 9808 12696 11704 8879
309H879k847k968m398n132k290K18o14O04K334K342J010O87q65j682j37p1K77
$$ 8879 6032 3064 -1334 -6466 -8756 -8538 -9152 -8548 -6214 -3872 -2862 -2175 -3040 -4722 -4859 -4930 -4653
326d653K641L420L573L459L376J215j694k222l898m229m052m55R26j007P6K269
$$ -4653 -2012 1408 4981 8440 11816 13031 11337 9115 5217 988 -3064 -3519 -2593 -3600 -3524 -1255
342a255R17k027r97r4j795k523q22J675L061K378K341M575K782l76p06q44k486
$$ -1255 -338 -2365 -3362 -3456 -5251 -7774 -8596 -6921 -3860 -1482 859 5434 8216 7840 7134 6290 3804
359C804k430j716p79J728K933m07K04K145k395n140j104j953m945j46K032Q46
$$ 3804 1374 -342 -1121 607 3540 3133 3337 5482 3087 -2053 -3157 -5110 -10055 -10201 -8169 -7323
375g323K770M303R17J370K706j318j010R33j631j376L002J145r26L567K064l831
$$ -7323 -4553 -250 667 2037 4743 3425 2415 3348 1717 341 3343 4488 3562 7129 9193 5362
391E362k318n66m346l771j140j558P95L558Q15R0M044L82m191pJ764j649p72J892
$$ 5362 3044 2478 -1868 -5639 -6779 -8337 -7542 -3984 -3169 -3079 965 1347 -2844 -2851 -1087 -2736 -3508 -1616
409a616K292J958K616J777J099R16k410l027p21j576k531m90L64q11J121Q48j149
$$ -1616 676 2634 5250 7027 8126 9042 6632 3605 2884 1308 -1223 -1713 -1349 -2160 -1039 -191 -1340
426a340q44j539l186q30J59n13K460M334J350J092M028J375k406J95M63j817o56
$$ -1340 -2184 -3723 -6909 -7739 -7580 -8093 -5633 -1299 51 1143 5171 6546 4140 4335 4798 2981 2325
443B325j07J97R25O62j278P30J035l564l268q34j253k571K98J611J160J204K3
$$ 2325 2218 2415 3340 4002 2724 3454 4489 925 -2343 -3177 -4430 -7001 -6703 -5092 -3932 -2728 -2705
460b705J298J184p62j441M93K98K46K086K791J587J466O1p31r3j127l136j184
$$ -2705 -1407 -223 -985 -2426 -1933 -1635 -1389 697 3488 5075 6541 6602 5871 5778 4651 1515 331
477C31Pj937j380R63R02m54L71K98j764r87k94p35j007J803K598J230J166J346
$$ 331 338 -1599 -2979 -2016 -1114 -1568 -1197 -899 -2663 -3650 -3944 -4679 -5686 -3883 -1285 -55 1111 2457
495B457L81PP35k037j203K189o68k022J866K445q59J9j490k362L49n19m064L84
$$ 2457 2838 2845 3580 1543 340 2529 1861 -161 1705 4150 3291 3310 1820 -542 -193 -712 -4776 -4392
513d392K744k510n49L720j05J93L061k405k185L202j401k838N314J202l311M839
$$ -4392 -1648 -4158 -4707 -987 -1092 -899 2162 -243 -2428 774 -627 -3465 1849 3051 -260 4579
529D579K058o828J391M330p139j861N413m471j114O638l833l695Q544j436q848
$$ 4579 6637 -191 1200 5530 -1609 -3470 1943 -2528 -3642 2996 -837 -4532 4012 2576 -6272
544f272N432K771p892K892N621n755J915P120m733j625O557l612m554L837k035
$$ -6272 -840 1931 -5961 -3069 2552 -3203 -1288 5832 1099 -526 6031 2419 -2135 1702 -333
559c33l540N535J136n157L473K672n043l65R39l361K314J118m964L285O537l999
$$ -333 -3873 1662 2798 -2359 1114 3786 -1257 -1622 -683 -4044 -1730 -612 -5576 -2291 4246 247
575B47j821N813j357l312K558j319l395M695j44m505M494L375n073J19L301n765
$$ 247 -1574 4239 2882 -430 2128 809 -2586 2109 1965 -2540 1954 5329 256 375 3676 -2089
591b089j927L636l316k946N500J366l215L458K294l910M94K361m188M74M764k136
$$ -2089 -4016 -380 -3696 -6642 -1142 224 -2991 467 2761 -1149 -655 1706 -2482 -2008 2756 620
607F20k087N196J224k708J054J234l193j232p04j311O2j54r46K695P28k268R91
$$ 620 -1467 3729 4953 2245 3299 4533 1340 108 -596 -1907 -1845 -1999 -2945 -250 478 -1790 -799
624g99J274l567j319J518o19M54K810n6R96M921j535l093L586J4n264Q96K525
$$ -799 475 -3092 -4411 -2893 -3512 -3058 -248 -304 692 5613 4078 985 4571 4585 -679 217 2742
641B742k800O69K324k125O56J822l546j892J386l004k630K682P8r27L647J885
$$ 2742 -58 611 2935 810 1466 3288 -258 -2150 -764 -3768 -6398 -3716 -3638 -4565 -918 967
657I67j628J901M41k255Q5L34j344J888K223j332J733K967k193j309J158j727
$$ 967 -661 1240 1681 -574 -489 -155 -1499 389 2612 1280 3013 5980 3787 2478 3636 1909
673A909k533M6j592j111K247p77j133L393L65l746R12J607l149n76K486n51R62
$$ 1909 -624 -578 -2170 -3281 -1034 -1811 -2944 449 814 -2932 -2020 -413 -3562 -4138 -1652 -2203 -1241
690a241L304L42j62K809j214k997R07p4k897Q01J726j314K62J941q10j324L72
$$ -1241 2063 2405 2243 5052 3838 841 1748 1674 -1223 -422 1304 -10 252 2193 1383 59 431
707D31j066j828l54k75p25J101J209K16J774J525j202n92N62j083j097J008P25
$$ 431 -635 -2463 -2817 -3092 -3817 -2716 -1507 -1291 483 2008 806 214 776 -307 -1404 -396 329
724C29J31J535M37K6L35m45k406k58J1k019n46J574m7j44J263L14K64M30j075
$$ 329 460 1995 2432 2458 2793 2348 -58 -316 -305 -2324 -2870 -1296 -1343 -1487 -224 90 354 784 -291
743b91r29M50J45j058J023J901m68L29J375k35j197m08j042j249M54N86k04P18
$$ -291 -1220 -770 -625 -1683 -660 1241 773 1102 2477 2242 1045 637 -405 -1654 -1200 -614 -818 -100
761a00J058o10l11Q7n73p01J18k1n35P56Q03M79L50R10L45j56o62p70l09l23m74
$$ -100 958 348 37 124 -449 -1150 -1032 -1053 -1588 -832 -29 450 800 1710 2055 1899 1237 467 158 -165 -639
782f39k79R24O25j43n92L96p98j100q05L81O11Q7O25R80M99L93p6K43k60j83o66
$$ -639 -918 6 631 488 -104 292 -506 -1606 -2411 -2030 -1419 -1332 -707 273 772 1165 1089 1332 1072 889 223
803B23J75K01K10K94M93m5k02k66p17q47l62j173n51K87q1N89J225K13l23J18
$$ 223 398 599 809 1103 1596 1551 1349 1083 366 -481 -843 -2016 -2567 -2280 -2361 -1772 -547 -334 -657 -539
823e39r1l43j96Q19O15N83P17N92O39o0m29l43R3j027j216l64J95om06K26K75
$$ -539 -630 -973 -1169 -350 265 848 1565 2157 2796 2736 2307 1964 2057 1030 -186 -550 -355 -361 -767 -541 -266
844b66p7j165m01n9q8q58q2J263R49Q64P49P85K52k65p06N22k47m06J79P95L68
$$ -266 -343 -1508 -1909 -1968 -2056 -2914 -2996 -1733 -784 80 829 1614 1866 1601 895 1417 1170 764 943 1738 2106
865B106l27L53o38o04r35o11j149j83m05o27Q28N89n4R41P47m65n65M09m15n9
$$ 2106 1779 2132 1494 890 -45 -656 -1805 -1988 -2393 -3020 -2192 -1603 -1657 -716 31 -434 -999 -590 -1005 -1064
885a064N90Q33Q59J071J75P5N03q69j472k12R7j303k28O62k91N16J46n56K04K16
$$ -1064 -474 359 1218 2289 2464 2539 3042 2173 701 489 586 -717 -945 -283 -574 -58 88 -468 -264 -48
905d8j959n70R61k16o33J361J223M79R52J49j37J00q40j273O21K93o82J058O25
$$ -48 -2007 -2577 -1616 -1832 -2465 -1104 119 598 1550 1699 1562 1662 822 -451 170 463 -219 839 1464
924A464l40J88j3j294p56K66j433l35J043m09K86J693m45j45J521o36j447P75
$$ 1464 1124 1312 1299 5 -751 -485 -1918 -2253 -1210 -1619 -1333 360 -85 -230 1291 655 -792 -17
942a7m36p27J255K23p74K424M61j984O55O83k852r03J633q50m48J601j85j39J434
$$ -17 -453 -1180 75 298 -476 1948 2409 425 1080 1763 -1089 -1992 -359 -1209 -1657 -56 -241 -380 1054
961A054m88j272J493n78j861J047J012r72N86J622p01O08M87j372j99J28k193
$$ 1054 566 -706 787 209 -1652 -605 407 -565 21 1643 942 1550 2037 665 466 594 -1599
978a599l36J628p58k23J506K89j066L67J42j772M97K76k41Q72J263k76N98J347
$$ -1599 -1935 -307 -1065 -1288 218 507 -559 -192 -50 -1822 -1325 -1049 -1290 -418 845 569 1167 2514
996B514o15q65R22q92j362J25M80l86n13K41J002l62o14m14l39q19j66m24j45
$$ 2514 1899 1034 1956 1064 -298 -173 307 -79 -592 -351 651 289 -325 -739 -1078 -1897 -2063 -2487 -2632
1015b632J874N96m78J174J219j349k7N45m83l0P39l26K40P53j21n65M61o14j244
$$ -2632 -758 -162 -640 534 1753 404 377 922 439 409 1148 822 1062 1815 1694 1129 1590 976 -268
1034b68j53m14j213K22L60J61K9O23j76L81q9n74j38N35p7L48J288N36N17M56
$$ -268 -421 -835 -2048 -1826 -1466 -1305 -1276 -653 -829 -448 -537 -1111 -1249 -714 -791 -443 845 1381 1898 2354
1054B354J99q40k00m71o32K13l61n68N60L58j108J0O80o12j307j38J28l15J3M89
$$ 2354 2553 1713 1513 1042 410 623 262 -306 254 612 -496 -486 194 -418 -1725 -1863 -1735 -2050 -2037 -1548
1074a548M96J205M68m51R57M97q83r93P45K55M0j81R56J60n02n7m83q39o10q1
$$ -1548 -1052 153 621 170 1127 1624 741 -252 493 748 788 607 1563 1723 1221 1164 681 -158 -768 -849
1094h49p57L67N81l44L30M91l3r4J87K44r03k0N18j83M80R14J02L51N2m05m28
$$ -849 -1606 -1239 -658 -1002 -672 -181 -214 -308 -121 123 -780 -800 -282 -465 15 929 1031 1382 1434 1029 601
1115F01j1j189j76P61k27n28Q68N16m58j83K4k94k52P2p76K61J251l20m00J426
$$ 601 590 -599 -775 -14 -241 -769 99 615 157 -26 -2 -296 -548 -476 -1252 -991 260 -60 -460 966
1135I66M66q27K03J02j134m03qk02L94Q76k17o6N32k13j220L28P1r14K63J296
$$ 966 1432 605 808 910 -224 -627 -635 -837 -443 433 216 150 682 469 -751 -423 -352 -1266 -1003 293
1155B93j83m9J051M2n12K4j82l73n20N4J89L0K32l65K76L55K8r37l85J41l33p91
$$ 293 110 61 1112 1154 642 666 484 111 -409 -355 -166 -136 96 -269 7 362 390 -547 -932 -791 -1124 -1915
1177a915O92J102k27K51O37J59K4m09m48J73P04m94j71J318l99m06L58N23r74
$$ -1915 -1223 -121 -348 -97 540 699 723 314 -134 39 743 249 78 1396 997 591 949 1472 498
1196D98m52m40p87K05K24j020O03R74k77j35R17n55p54M17j20n15J028O99j43
$$ 498 46 -394 -1181 -976 -752 -1772 -1169 -195 -472 -607 310 -245 -999 -582 -702 -1217 -189 510 367
1215C67J096K35m39k2R7j126J22K86q35j99Q33J42q41J15L17n74l49j72m97K82
$$ 367 1463 1698 1259 1237 1334 208 330 616 -219 -418 415 557 -284 -169 148 -426 -775 -947 -1444 -1162
1235a162M0j02N61J101P0j18K22J91o78n01M31K70L7K61K19L31J94n29n14Kj94
$$ -1162 -1122 -1224 -663 438 508 390 612 803 125 -376 55 325 362 623 842 1173 1367 838 324 326 132
1256A32r05j89K65r9O6O37N5kJ5o5n78m4j52K12L72L46k13Q28M52n73p5N14n73
$$ 132 -773 -962 -697 -796 -730 -93 -38 -40 -25 -90 -668 -712 -864 -652 -280 66 -147 681 1133 560 485 999 426
1279D26q79K35J77J44r1M78pL33q6j013L1M29r04o95J070K97m29L92M55pkk86
$$ 426 -453 -218 -41 103 12 490 483 816 730 -283 -252 177 -727 -1422 -352 -55 -484 -92 363 356 354 68
1301F8k11N5l84n09J82R80r4K6O30n4j56o4m94m47K10K38p2N02K50k45K27L18
$$ 68 -143 -88 -472 -981 -799 181 87 113 743 689 533 469 -25 -472 -262 -24 -96 406 656 411 638 956
1323I56r71J73l07J20m71J06l44L66k9N46R0m1j82l47j36Ln75K75P03K41K10L62
$$ 956 -15 158 -149 -29 -500 -394 -738 -372 -401 145 235 194 12 -335 -471 -468 -1043 -768 -65 176 386 748
1345G48K88r8o86k38r4K78m56m3P57r0k64O2L85l43m13l70l51K11J69n27O89L78
$$ 748 1036 938 252 14 -80 198 -258 -301 456 366 102 164 549 206 -207 -577 -928 -717 -548 -1075 -386 -8
1367hQ1r8M32k2n91j68J8j1J42J95M37M78j00kj41j11m87q2K9j94l26L24K91K27
$$ -8 73 -25 407 385 -206 -374 -356 -367 -225 -30 407 885 785 783 642 531 44 -38 -9 -203 -529 -205 86 313
1391C13l64J09K81n26o91J9J34l2k42N83O88Q8J3k21N36n62l29l05N15J50k25
$$ 313 -51 58 339 -187 -878 -859 -725 -757 -999 -416 272 360 373 152 688 126 -203 -508 7 157 -68
1412f8L58K38L15m37j50K65l61m97n2j64M55j76J00M00l15p3Q8l94r2J13l55J85
$$ -68 290 528 843 406 256 521 160 -337 -389 -553 -98 -274 -174 226 -89 -162 -74 -468 -560 -447 -802 -617
1434f17K72q0L13N37n9j49K53k7p47K79L95l93K39J72J60J96k29r7k27K36l05
$$ -617 -345 -425 -112 425 366 217 470 443 -304 -25 370 -23 216 388 548 744 515 418 191 427 122
1455A22q93L04L22p04J81N07K1%J8k35RM9m05r8O32L81j5M22M87o8m83J64k55
$$ 122 -771 -467 -145 -849 -668 -161 -140 -140 -122 -357 -348 -299 -704 -802 -170 211 196 618 1105 1037 554 718 463
1478D63l90P9J41K1K67j28k75j12J78m79l29K80n26J19J03m3p6M62O52n48K10
$$ 463 73 152 293 314 581 453 178 66 244 -235 -564 -284 -810 -691 -588 -631 -707 -245 407 -141 69
1499F9J48m09P3J07l28P86K59l28J44N49k17m76k39O9k98j26k66J92M64m24j04
$$ 69 217 -192 -119 -12 -340 446 705 377 521 1070 853 377 138 207 -91 -217 -483 -291 173 -251 -355
1520c55J80K32m60k46J02L9j83K58K02L18L78o7m7L93n18m45N03q8j79j10K98
$$ -355 -175 57 -403 -649 -547 -508 -691 -433 -231 87 465 398 351 744 226 -219 284 196 17 -93 205
1541B05L25m8m05n6K7k36k02K25k72L9NM9J46K16K08pP8o77q5M48k88l01M72M16
$$ 205 530 482 77 21 48 -188 -390 -165 -437 -398 -393 -344 -198 18 226 219 297 -380 -465 -17 -305 -606 -134 282
1565B82K09k2k07k8k68k59l68J81O46m32K3Q12O5n94K24N8k20J75l16l38N21J01
$$ 282 491 469 262 234 -34 -293 -661 -480 166 -266 -243 569 634 40 264 322 102 277 -39 -377 144 245
1587B45m07J54O54l62k45J92j44r33J31J86k04J94N57M5M7K6l20P9K08l8l64M97
$$ 245 -162 -8 646 284 39 231 87 -846 -715 -529 -733 -539 18 63 110 136 -184 -105 103 65 -299 198
1609A98K68k42M95L33q47J5L08j08p34l0J31k13J08j97j68N37J37p66L56L07m09
$$ 198 466 224 719 1052 205 220 528 420 -314 -344 -213 -426 -318 -515 -683 -146 -9 -775 -419 -112 -521
1630e21o66Q56N11p2K28J15K84K05k28l47N4M64q64j25N82j77k39K66j42m51j43
$$ -521 -1187 -331 180 108 336 451 735 940 712 365 419 883 19 -106 476 299 60 326 184 -267 -410
1651d10n6j5j81l61L02j18N66j28K65L40m37J20L63m2l00M30L44j28NJ32Q6Q4
$$ -410 -466 -481 -662 -1023 -721 -839 -273 -401 -136 204 -233 -113 250 208 -92 338 682 554 559 691 777 861
1673H61m35n14k5j74mj96p0K04j41k10N42L8n08J46O9%M1K05j72N09M37J8j97
$$ 861 426 -88 -113 -287 -291 -487 -557 -353 -494 -704 -162 -124 -632 -486 -417 -417 -376 -171 -343 166 603 621 424
1696D24L84j47l03k82J79m44L01L91k30M9J05o53N4K15o35j43M78k84k45Q73l14
$$ 424 808 661 358 76 255 -189 112 503 273 322 427 -226 -172 43 -592 -735 -257 -541 -786 87 -227
1717b27j32L81N46m90o0J0m0R1j38L2J07O35k35n20L33j22l59l70M37j66k40M47
$$ -227 -359 22 568 78 18 28 -12 79 -59 -27 80 715 480 -40 293 171 -188 -558 -121 -287 -527 -80
1739h0L4L27K08l49k62M06k27l04K93K13j84J67J33j64j05J44j87k15K29p94K71
$$ -80 -46 281 489 140 -122 284 57 -247 46 259 75 242 375 211 106 250 63 -152 77 -717 -446
1760d46K44l2n23P02J65l5MJ83j15O3K4m8r2K75J51K1L5m4k04J86n39J9m78J20
$$ -446 -202 -234 -757 -55 110 75 79 262 147 210 234 186 94 369 520 541 576 532 328 514 -25 -6 -484 -364
1784c64j5o6j00N1J15r5Q5Q3L4n6k2K94K55J23r7L44K78l95k18L46l72l4J34J09
$$ -364 -379 -445 -545 -494 -379 -474 -389 -306 -272 -328 -350 -56 199 322 225 569 847 452 234 580 208 174 308 417
1808D17J6l18k91o9K10n99J26j48K24l81O7qL16L4mO73l88L90j31L41J3k98l7
$$ 417 433 115 -176 -245 -35 -634 -508 -656 -432 -813 -746 -754 -438 -404 -408 265 -123 267 136 477 490 192 155
1831A55P58k08J03mOn02k38j09P0j25q1J23j34j33k06N3L60l99K07j17K00j10
$$ 155 913 705 808 804 810 308 70 -39 31 -94 -175 -52 -186 -319 -525 -472 -112 -511 -304 -421 -221 -331
1853c31K85J96J80J14O5KO3q4j43j25J48l28k15J72J55J3M0l68k16j6m44K11J01
$$ -331 -46 150 330 444 509 511 574 490 347 222 370 42 -173 -1 154 167 207 -161 -377 -393 -837 -626 -525
1876e25J47J85j61L08M0o5K09P0j45J34k50K62Rj51L35N3m4k75J08j02m00j85
$$ -525 -378 -193 -354 -46 -6 -71 138 208 63 197 -53 209 218 67 402 455 411 136 244 142 -258 -443
1898d43J7J05L40P2j21J54L1o06N49o9j43nj95M61L1p0k4Q7K98m23J08k5k87m9
$$ -443 -426 -321 19 91 -30 124 155 -451 98 29 -114 -119 -314 147 178 108 84 171 469 46 154 129 -158 -207
1922b07j08J04J69M2N1k76L45M7k64Q5j65K84jK57k23L52N8j38j81j44J16l08
$$ -207 -315 -211 -42 0 51 -225 120 167 -97 -12 -177 107 106 363 140 492 550 412 231 87 203 -105
1944a05j43K30Rj45k89J78K82Q7j24j57j20j47K17m0J10L58m5P5J85P7J46m04
$$ -105 -248 -18 -9 -154 -443 -265 17 104 -20 -177 -297 -444 -227 -267 -157 201 156 231 416 493 639 235
1966B35p5LJ95m3j90N2L3l35m8K11N7n64l5k6k60L5L89J07OjL91j2K43k73k39
$$ 235 160 163 358 315 125 177 210 -125 -173 38 95 -469 -504 -530 -790 -755 -366 -259 -253 -254 137 125 368 95 -144
1991a44L09P1j41M59J96j38k16L03l03m30pJ32k64j76J92j00L9j74J07j19K60
$$ -144 165 236 95 554 750 612 396 699 396 -34 -41 91 -173 -349 -157 -257 -218 -392 -285 -404 -144
2012a44o8m49O37j00l39L56L58j6R1K29k57K86p9l16k3J89l6l04L13r5n93M17
$$ -144 -212 -661 -24 -124 -463 -107 251 235 326 555 298 584 505 189 166 355 319 15 328 233 -360 57
2034E7j13m35J60l4m6K73k23R6J5K60k0r9J15J42k35J32K85k63J58K55m5r7K49
$$ 57 -56 -491 -331 -365 -411 -138 -361 -265 -250 10 -10 -109 6 148 -87 45 330 67 225 480 435 338 587
2057E87j22l10k46q2M21k85J53m04L66N4j05m30J07M71l72n9KL25j08K3j48K45
$$ 587 465 155 -91 -173 248 -37 116 -288 78 132 27 -403 -296 175 -197 -256 -254 71 -37 -14 -162 83
2079H3P1pj05j4P3j72l7K35pk67J88J47k04j70K66J3k65J10n3j5L32j0n6J24p8
$$ 83 154 147 42 28 101 -71 -108 127 120 -147 41 188 -16 -186 80 93 -172 -62 -115 -130 202 192 136 260 182
2104A82m61L43r6k23J26J07q5P3L2P4j28Q4n58L45N5k27L02J96J14k50K13K23
$$ 182 -279 64 -32 -255 -129 -22 -107 -34 -2 72 -56 28 -530 -185 -130 -357 -55 141 255 5 218 441
2126D41j94K94n29q3M59j39k80l9M68m13j38L81m38K5q4K0k86M91j87O1J52K0
$$ 441 247 541 12 -71 388 249 -31 -70 398 -15 -153 228 -210 -185 -269 -249 -535 -44 -231 -170 -18 2
2148Bj21K41p4k63R6K00kj35J45K27L4PmJ25m14q2k5j96J09R9k6j73J99k2j80
$$ 2 -119 122 48 -215 -119 81 79 -56 89 316 350 357 353 478 64 -18 -43 -239 -130 -31 -57 -230 -31 -53 -233
2173b33N2J5j73J53j66L20Q9q6M8J19K05l24M36N2k14n1l42N79l39J54J5n0q5
$$ -233 -181 -166 -339 -186 -352 -32 57 -29 19 138 343 19 455 507 293 242 -100 479 140 294 309 259 174
2196A74R4o93L25J80m39J35j42L8P6K11M9o94N53J5p3K77j42J24j17N48m10M5
$$ 174 268 -425 -100 80 -359 -224 -366 -328 -252 -41 8 -686 -133 -118 -191 86 -56 68 -49 499 89 134
2218A34L21k3l28J34R8m08K68j82o5ol6P7J76k91K1j3l4k20k5M37k54j97J80K02
$$ 134 455 432 104 238 336 -72 196 14 -51 -57 -93 -16 160 -131 -110 -123 -157 -377 -402 35 -219 -416 -236 -34
2242c4o6o1P8J80m9N2o5J89Qj24O6O3j29k0J06l8l29p5N0J04%j5j16K88p2k0j59
$$ -34 -100 -161 -83 97 48 100 35 224 232 108 174 237 108 88 194 156 -173 -248 -198 -94 -94 -109 -225 63 -9 -29 -188
2269a88Q7r5P2k58L75N5j60J16K52q0p9o6J01q7N8k5J58j2J62j5j22j88r3J4K32
$$ -188 -101 -196 -124 -382 -7 48 -112 4 256 176 97 31 132 45 103 78 236 224 386 371 249 61 -32 -18 214
2294B14k16k00Q8J67k83o4j1K63J64l12l7m6Q9J84k98J77J70J3o7J28j84K57k64
$$ 214 -2 -202 -114 53 -230 -294 -305 -42 122 -190 -227 -273 -184 0 -298 -121 49 62 -5 123 -61 196 -68
2317f8p1K56m9M1o3J04k55L29m90K32l45J90Q1J60k00Pj33L53j71k4J14j2j50
$$ -68 -139 117 68 109 46 150 -105 224 -266 -34 -379 -189 -108 52 -148 -141 -274 79 -92 -116 -2 -14 -164
2340a64j10J81r9j63K48K93N0o7p8j51K77j87o2M19k30l3j39P3J95l24LK8q7p5
$$ -164 -274 -93 -192 -355 -107 186 236 169 91 -60 217 30 -32 387 157 124 -15 58 253 -71 -68 -40 -127 -202
2364b02K5R1j32N7k96L07J3L43m40K9K70n14K16K63j11J28ML48j07j83j3l2J77
$$ -202 -177 -86 -218 -161 -457 -150 -137 206 -234 -205 65 -449 -233 30 -81 47 51 399 292 109 96 64 241
2387B41j81K31k13o8n9J98l4k1j90n5l3j85J07p4L1j9O8j0J71R9m14M97K37k10
$$ 241 60 291 78 10 -49 149 115 94 -96 -151 -184 -369 -262 -336 -305 -324 -256 -266 -95 4 -410 87 324 114
2411A14l22L70j25M72j14j26m4J04m8r1l92K7K28l1n4o9j34K60k47l6r3K91l7
$$ 114 -208 162 37 509 395 269 225 329 281 190 -202 -175 53 22 -32 -101 -235 25 -222 -258 -351 -60 -97
2434i7n15O07K5J1n8J33o3K54k7j08J10l07M47j79m9N5m1N0k31k13L04l41o3R6
$$ -97 -612 -5 20 31 -27 106 43 297 270 162 272 -35 412 233 184 239 198 248 17 -196 108 -233 -296 -200
2458b00j39R5J90O3k65K7P1k4j08k15O54m0j96J24J14l7J24k44K46J00k77J99
$$ -200 -339 -244 -54 9 -256 -229 -158 -182 -290 -505 149 109 -87 37 151 114 238 -6 240 340 63 262
2480B62q1k19q2J41m4J09k50k60L96J68j40m12L45j1k41J79N8j37L19j74K1K92
$$ 262 181 -38 -120 21 -23 86 -164 -424 -28 140 0 -412 -67 -78 -319 -140 -82 -219 100 -74 -53 239
2502B39k26k30M15m09K45J02K22J2l80p1J30O1k96O6O3J76q6k81M07r4l81L94
$$ 239 13 -217 198 -211 34 136 358 370 -10 -81 49 110 -186 -120 -57 119 33 -248 159 65 -316 78
2524G8p5M2j22N0l0L7j50K9L5L28l78J42L4j58J99l97M22j18j0J40p7o6J63m5
$$ 78 3 45 -77 -27 -57 -20 -170 -141 -106 222 -156 -14 20 -138 61 -336 86 -32 -42 98 21 -45 118 73
2548G3j81R3L1j1n9J49m6r2K9K08m65K44J3n6j74ML76k63O6pn4J49j91M65n65
$$ 73 -108 -15 16 5 -54 95 49 -43 -14 194 -271 -27 -14 -70 -244 -240 136 -127 -61 -68 -122 27 -164 301 -264
2573b64M15k25O6K58K5j54m7J84j0k70O1J11k37J72j63k6j10J72l09L13L78o79
$$ -264 151 -74 -8 250 275 121 74 258 248 -22 39 150 -87 85 -78 -104 -214 -42 -351 -38 340 -339
2595c39K66m40J50Q8K84j74q4O27l85K28Kk94K54J79k72j17K97R5l8k4J35o05
$$ -339 -73 -513 -363 -275 9 -165 -249 378 -7 221 223 -71 183 362 90 -27 270 365 327 303 438 -167
2617a67K90k26L0J17mq4o9k18M33j25k43K33M2PR6J35k65ML15q5N6n1o7K58m94
$$ -167 123 -103 -73 44 40 -44 -113 -331 102 -23 -266 -33 9 16 112 247 -18 -14 301 216 272 221 154 412 -82
2642h2K64J68k22p2K37l82m4J92j82J2k37R9J88L0J01j34j4L1K75k72J01%M7k14
$$ -82 182 350 128 56 293 -89 -133 59 -123 -111 -348 -249 -61 -31 70 -64 -78 -47 228 -44 57 57 104 -110
2666a10O0J44m7J53j33K60j87Pj46Q2q7k63K5K13m1j9RK19k98Qj74J73K80k46
$$ -110 -50 94 47 200 67 327 140 147 1 83 -4 -267 -242 -29 -70 -89 -80 139 -159 -151 -325 -152 128 -118
2690a18N2j9K9k38M5R4J94R9j12j10j3k09L46k04N0J18O4O7J60j42J44l35M3n6
$$ -118 -66 -85 -56 -294 -249 -155 39 138 26 -84 -97 -306 40 -164 -114 4 68 135 295 153 297 -38 5 -51
2714e1J54Q9j84j81L32l07K00J26j61j34p3p5kK20Nr3M9J16Q3l62L6J30j21L78
$$ -51 103 192 8 -173 159 -148 52 178 17 -117 -190 -265 -267 -47 -42 -135 -86 30 113 -249 -213 -83 -204 174
2738A74j69j6K89k30k6J54k30L10j9k73j3m1r0J22L17j50j82k20L54N8m20L9P8
$$ 174 5 -11 278 48 22 176 -54 256 237 -36 -49 -90 -180 -58 259 109 -73 -293 61 119 -301 -262 -184
2761a84J38l09K48K2K61j37j52Q3J00K05l77m6K19q0o9K67r6J4R4l13L49n42K65
$$ -184 -46 -355 -107 -85 176 39 -113 -30 70 275 -102 -148 71 -9 -78 189 93 107 201 -112 237 -305 -40
2784d0n5L7j09K9L9j55K68j43J56k00j19M30j85J3j12M57k02j04M5K0m0k15R5
$$ -40 -95 -58 -167 -138 -99 -254 14 -129 27 -173 -292 138 -47 -34 -146 311 109 5 50 70 30 -185 -90
2807i0J57j37L13k10j28J51j93J65R7l57K08k20J90r9K0J52r4j32N25l31K48p3
$$ -90 67 -70 243 33 -95 56 -137 28 125 -232 -24 -244 -54 -153 -133 19 -75 -207 318 -13 235 162
2829A62j93J39J49l65L59J68j72k03R2P7o7j70K64j20l21J17O8k2l8p4MJ4J48
$$ 162 -31 108 257 -108 251 419 247 44 136 213 146 -24 240 120 -201 -84 -16 -38 -76 -150 -146 -132 16
2852A6nk97M26n6j86J54n7L1q5P6Q5O7K4k94K14j19j4K07j58J8j5j29m0K20Q0
$$ 16 11 -286 140 84 -102 52 -5 26 -59 17 102 169 193 -101 113 -6 -20 187 29 47 32 -97 -137 83 163
2877A63j53P0k22Q4K3N7J22p3k76O6J14j70L06K8j47k8k15K03J49k85j2J79J19
$$ 163 10 80 -142 -58 -35 22 144 71 -205 -139 -25 -195 111 139 -8 -36 -251 -48 101 -184 -196 -17 102
2900A02k95K49m9J96j28j56J41j79P6n4J93r5k13K64j55l53K32R4J41k68J67L
$$ 102 -193 56 7 203 75 -81 60 -119 -43 -97 96 1 -212 52 -103 -456 -224 -130 11 -257 -90 -87
2922h7J56r6j34K40J33m11K52o9j70J57K22k65J34R6j06J40j66L8k42L93j66k76
$$ -87 69 -27 -161 79 212 -199 53 -16 -186 -29 193 -72 62 158 52 192 26 64 -178 215 49 -227
2944b27J15k32K33q1J71n1J69J35m97Q7J16J05o4J4j2J47k21J78k5J53L8j06K25
$$ -227 -112 -344 -111 -192 -21 -72 97 232 -265 -178 -62 43 -21 -7 -19 128 -93 85 60 213 251 145 370
2967C70m49M0L2L8J70j66p2Q9l31L10Q4k10j05J49k75K10o1K77k04j53Q1j35K84
$$ 370 -79 -39 -7 31 201 35 -37 52 -279 31 115 -95 -200 -51 -326 -116 -177 100 -104 -257 -176 -311 -27
2990b7J29J53k96K03p5M0j36j73M16r3J68j24k33j4j31J91K89k02j45j1j44K80
$$ -27 102 255 -41 162 87 127 -9 -182 234 141 309 185 -48 -62 -193 -2 287 85 -60 -71 -215 65
3012F5m65N76j04n0k71J81R4R7j10J11k61K35J32k19J55kNk43J14j22N4K42k3
$$ 65 -400 176 72 22 -249 -68 26 123 13 124 -137 98 230 11 166 164 169 -74 40 -82 -28 214 191
3035A91P0j17o4k53L95n08K28L38j34l25L79j86l82K52K02j7j80m6J50k07J69
$$ 191 261 144 80 -173 222 -286 -58 280 146 -179 200 14 -368 -116 86 69 -111 -157 -7 -214 -45
3056d5j13R5K91j70r3K44O2m37J90r2K80j47J51k97L3j17J48k3K14j93p1R3O5
$$ -45 -158 -63 228 58 -35 209 271 -166 24 -68 212 65 216 -81 -48 -165 -17 -40 174 -19 -90 3 68
3079F8L7m2k21K04j1o6n2p1K03n7M0K3K26k11LM5J32l07j66K72k10K79j66K79
$$ 68 105 63 -158 46 35 -31 -83 -154 49 -8 32 55 281 70 73 118 250 -57 -223 49 -161 118 -48 231
3103B31l27J63m7R0k40j7Q0J26J67l61K29J15l13Q7L0M6k13K21K32m82R2J17K6
$$ 231 -96 67 20 110 -130 -147 -67 59 226 -135 94 209 -104 -17 13 59 -154 67 299 -183 -91 26 52
3126E2K10n6l6l2nk8k45J76k2K1n0j17Jn6J81J1p6J80P8k59J62J67n34M08k82
$$ 52 262 206 170 138 133 105 -140 36 14 35 -15 -132 -131 -187 -6 5 -71 109 187 -72 90 257 -277 131 -151
3151a51J32j33J97R6J1m6k08J56K80j98l24M21p5j76j9J32k19Q3J3r4L70j14L5
$$ -151 -19 -152 45 141 152 106 -102 54 334 136 -188 233 158 -18 -37 95 -124 -41 -28 -122 248 134 169
3174A69k68k38L03j98L49l06MM5N0M0j3Q2j60K86m70N28k89J61l5J4J19j79J41
$$ 169 -99 -337 -34 -232 117 -189 -185 -140 -90 -50 -63 19 -141 145 -325 203 -86 75 40 54 173 -6 135
3197A35k57K48j2j88j62K51j20J59Lj53o2m7L57j51k32J77o2K17rK3k30N2J60
$$ 135 -122 126 114 -74 -236 15 -105 54 57 -96 -158 -205 152 1 -231 -54 -116 101 92 115 -115 -63 97
3220I7k59K89j84K35lj86K42k54p2J74q4j68J76k5j11K08j31L37l41Q1O6O0l53
$$ 97 -162 127 -57 178 175 -11 231 -23 -95 79 -5 -173 3 -22 -133 75 -56 281 -60 21 87 147 -206
3243b06N52m34m1J18J65m03J85J94O0l71K57J71l63L27j75M3P2j48j04M3k49K83
$$ -206 346 -88 -129 -11 154 -249 -64 130 190 -181 76 247 -116 211 36 79 151 3 -101 -58 -307 -24
3265b4j45mJ37O2J05k29J96j24P3j27j40L37l99q6M88j30K66k53P2k67L44j68
$$ -24 -169 -173 -36 26 131 -98 98 -26 47 -80 -220 117 -282 -368 120 -10 256 3 75 -192 152 -16
3287a6p3K17j97J05L02l20j44J75p3p8L0J36j86L9L3Q4r9o8j13O7Q9J62j07j05
$$ -16 -89 128 -69 36 338 18 -126 49 -24 -102 -72 64 -122 -83 -50 34 -65 -133 -246 -179 -90 72 -35 -140
3311a40P3J20nK36l18Q2J00j80j94L72l9j09K22r0j26o2j30L02j75P0K0j42K05
$$ -140 -67 53 48 284 -34 48 148 -32 -226 146 107 -2 220 130 4 -58 -188 114 -61 9 29 -113 92
3334I2k96K64j60K99j91jl8J40j22k42M20k22M3O1k64L31K4j54J74j66j94K5L01
$$ 92 -204 60 -100 199 8 7 -31 109 -13 -255 165 -57 -14 47 -217 114 138 -16 158 -8 -202 -177 124
3357A24kj11n5K08k03j1J17M9Jp4N4r5q7J5J70k6l57K93k17K56K4j39J12j4Kj02
$$ 124 122 11 -44 164 -39 -50 67 116 117 43 97 2 -85 -70 100 74 -283 10 -207 49 73 -66 46 32 34 -68
3383f8K8M19j80k91K4K75l20j73L01N7l86J10qL27j39J00j08J31j3J7k38P9j87
$$ -68 -40 379 199 -92 -68 207 -113 -286 15 72 -314 -204 -212 115 -24 76 -32 99 86 103 -135 -56 -243
3406b43L53l1J99k49J54l90L13j08l1j7J55j49J99qk21J73Q4j57l6j70J48k8p8
$$ -243 110 79 278 29 183 -207 106 -2 -33 -50 105 -44 155 147 -74 99 183 26 -10 -180 -32 -60 -138
3429a38K12j07M1J23l72R3R3J74j32p6K02m1J1r2Qj39K21k33Q0J2PL04J08l50
$$ -138 74 -33 8 131 -241 -148 -55 119 -13 -89 113 72 83 -9 -1 -140 81 -152 -72 -60 -53 251 359 9
3453IJj98J29k8L7k75K94j10K63j62K46j58m2j7l28P7O4J18q9J54m5%J08j22J06
$$ 9 10 -188 -59 -87 -50 -325 -31 -141 122 -40 206 48 6 -11 -339 -262 -198 -80 -169 -15 -60 -60 48 -74 32
3478C2l44M54J04K4k16r3R5n2n8M3o1p4K82l77O1M6J9K30R3j40m0j7j29Q6k7P1
$$ 32 -312 142 246 270 54 -39 56 4 -54 -11 -72 -146 136 -241 -180 -134 -115 115 208 68 28 11 -118 -32 -59 12
3504A2j07P7R1j9k13L37l17L51j77M2Q6m1l6n0k2J19J0Q5k10j08J28k68K40q3
$$ 12 -95 -18 73 54 -159 178 -139 212 35 77 163 122 86 36 14 133 143 228 18 -90 38 -230 10 -73
3528g3J91j11j71J66R9k65K01l48M61j79J43j76J23k47K82r8j49L6J64n1k9K02
$$ -73 118 7 -164 2 101 -164 37 -311 150 -29 114 -62 61 -186 96 -2 -151 -115 49 -2 -31 171
3550A71o3j50J47j87r5J67J17j89J01m5M8l18J73J45j43j8RM4J07o0k83K60K09
$$ 171 108 -42 105 -82 -177 -10 107 -82 19 -26 22 -296 -123 22 -121 -139 -130 -86 21 -39 -322 -62 147
3573A47k17j02K3J54k27P7L02kk41L28n48L40o7J9P5k0m59O16q7k08M3q0L44j85
$$ 147 -70 -172 -149 5 -222 -145 157 155 -86 242 -306 34 -33 -14 61 41 -418 198 111 -97 -54 -134 210 25
3597B5K4r0P3j15R6O1l6k08K18q5q9lj1P4k9J09m5O7l0RR0l27J20p0L17k01J12
$$ 25 49 -41 32 -83 13 74 38 -170 48 -37 -126 -129 -140 -66 -95 14 -31 36 6 15 105 -222 -102 -172 145 -56 56
3624E6K06m39K57j46k61M12r5j58J28ol2R2n7K36k22p8J66l7m9J05o3jn7K29j91
$$ 56 262 -177 80 -66 -327 85 -10 -168 -40 -46 -78 14 -43 193 -29 -107 59 22 -27 78 15 14 -43 186 -5
3649en7N5J3k9k4J97m24K92r4R5k10K32k16J52p0m5O9J6K1n0O4O4q6j45o9J80
$$ -5 -62 -7 6 -23 -47 150 -274 18 -76 19 -191 41 -175 -23 -93 -138 -69 -53 -32 -82 -18 46 -40 -185 -254 -74
3675g4J6J58l44K64o6J72m4mJk3j1n8J78j97J93l9j30J59k29j74R6M5J90q1P2
$$ -74 -58 100 -244 20 -46 126 82 78 79 56 45 -13 165 -32 161 122 -8 151 -78 -252 -156 -111 79 -2 70
3700G0k94JK9Q7N7R6k90N42j2j36j43N4j27k0J88j81J90np8j15J35J59l46j11
$$ 70 -224 -223 -194 -107 -50 46 -244 298 286 150 7 61 -66 -86 102 -79 111 106 28 -87 48 207 -139 -250
3724b50J93J7k05K41l8J26o9k85J6K26K48j51J5J58r3RK7k60J49k55J14K64K0
$$ -250 -57 -40 -245 -4 -42 84 15 -270 -254 -28 220 69 84 242 149 158 185 -75 74 -181 -67 197 217
3747B17k60n9k53N61m82J33J48j27M7j28L2K23M9j31M0J19l06K8J67L44j44k5
$$ 217 -43 -102 -355 206 -276 -143 5 -122 -75 -203 -171 52 101 -30 10 129 -177 -149 18 362 218 193
3769A93j96Q7j73K3O6M9k26J5K32k21J01N1J06k31L94k10k14K8J62J7l7q4J19
$$ 193 -3 84 -89 -66 0 49 -177 -162 70 -151 -50 1 107 -124 270 60 -154 -126 36 53 16 -68 51
3792E1p9K02k1j54P6j92L18o5k43mJ87k57K24L2j71M4l5M9o6K1J12M0j97Q2l6
$$ 51 -28 174 153 -1 75 -117 201 136 -107 -111 76 -181 43 75 -96 -52 -87 -38 -104 -83 29 69 -128 -46 -82
3817h2N7j8M7j68M20m09J51M5j06p8p1J46J09J4j34O9J02O5m3n9P0q3j03K3K76
$$ -82 -25 -43 4 -164 256 -153 -2 43 -63 -141 -212 -66 43 57 -77 -8 94 159 116 57 127 44 -59 -36 240
3842B40l50P5P8m7Q9J61k1j60J54l17J68j50J32k41R8p2P6J82k38M16l88K66j08
$$ 240 -110 -35 43 -4 85 246 225 65 219 -98 70 -80 52 -189 -91 -163 -87 95 -143 273 -115 151 43
3865D3k76L32k19J21L7l11L46j16k45L70j8m2p1J24j89J27K5k03J9K23L8m05M02
$$ 43 -233 99 -120 1 38 -273 73 -43 -288 82 64 22 -49 75 -114 13 38 -165 -146 77 115 -290 112
3888A12j96m9P8J50j90J74j75q3k4J66M1p9J01j1k04K91n9j30L28k55K02j2j98
$$ 112 -84 -133 -55 95 -95 79 -96 -179 -203 -37 4 -75 26 15 -189 102 43 -87 241 -14 188 176 -22
3911b2O6O3j47k2N6j44N9J30J2l66M36q3O4k86J22j04K51J95k88J42j68j20K16
$$ -22 44 107 -40 -62 -6 -150 -91 39 51 -315 121 38 102 -184 -62 -166 85 280 -8 134 -34 -154 62
3934F2O0n7pJ16J28k86q6J49L7j90J83P8j74k62K15J72j19j01J99l10O6K2K3J12
$$ 62 122 65 58 174 302 16 -70 79 116 -74 109 187 13 -249 -34 138 19 -82 117 -193 -127 -105 -82 30
3958C0k47J63o9J9P0K30l05M15k19k07J48J94j52j39J6K03L5j12J23n36L58k53
$$ 30 -217 -54 -123 -104 -34 196 -109 306 87 -120 28 222 70 -69 -53 150 185 73 196 -340 18 -235
3980b35L28K0J26m18l9j04L78p9k14J77N5mM4J4j40J53k15K93Jj03R1k14k7J03
$$ -235 93 113 239 -179 -218 -322 56 -23 -237 -60 -5 -9 35 49 -91 62 -153 140 141 38 129 -85 -112 -9
4004iK08k47p9K03j85j8J05K41l1k10P5j12J37q0k28K62k7J80k41P3j6J5j79J36
$$ -9 199 -48 -127 76 -109 -127 -22 219 188 -22 53 -59 78 -2 -230 32 5 185 -56 17 1 16 -163 -27
4028b7J15j13L45l65q2J19j69K08P4o0j51J86j97JK07k6k61L30P6k55j08K18k65
$$ -27 88 -25 320 -45 -127 -8 -177 31 105 45 -106 80 -117 -116 91 65 -196 134 210 -45 -153 65 -200
4051b00J50RQ4J61k10n6O7r7M15m18j71J96J09K1q7K03k44K24j79r5J50j1j49
$$ -200 -50 -41 43 204 -6 -62 5 -92 323 -95 -266 -70 39 60 -27 176 -68 156 -23 -118 32 21 -128
4074a28q9L00R7j71j73J48n8Q3j28J53m4k28L19l32M06jn9o6pJ76k05k1j81L91
$$ -128 -217 83 180 9 -164 -16 -74 9 -119 34 -10 -238 81 -251 155 154 95 29 22 198 -7 -28 -209 182
4098A82j09J07k35J12k40K94m6n9L9K2j06K85m08K54Q6m45L59k62n2K18m1M5%
$$ 182 73 180 -55 57 -183 111 65 6 45 67 -39 246 -162 92 178 -267 92 -170 -222 -4 -45 0 0
4121@P5O2j18M7qJ20r1k72M71k53k2j75R2q2J40K40j51J68m30J50J14j67L12l99
$$ 0 75 137 19 66 58 178 87 -185 286 33 11 -164 -72 -154 -14 226 75 243 -187 -37 77 -90 222 -177
4145a77K19q0l7q5J07NpM4K5l7j16J04n6n5L16k80K17mN6j89K75p9k11J87l0k07
$$ -177 42 -38 -75 -160 -53 -48 -55 -11 14 -23 -139 -35 -91 -146 170 -110 107 103 159 -30 245 166 -45 142 112 -95
4171i5M4J15k15L8k6L43k11l1q1J24J31l22J46J76q0k90Q4Q4j33O9L89k55l1L3
$$ -95 -51 64 -151 -113 -139 204 -7 -38 -119 5 136 -186 -40 136 56 -234 -150 -66 -199 -130 259 4 -27 6
4195FJ93k85j4K16q4l76Q9M39j62O6j26m7J87j30O5j09J26pq6k9K23j99j0J14
$$ 6 199 -86 -100 116 32 -344 -255 184 22 88 -38 -85 102 -28 37 -72 54 47 -39 -68 155 -44 -54 60
4219F0L0J53j83k3l5Mj36R8j79L12l58J66M0K8o1K6L6J71k9m9j4k1r0L35l29J73
$$ 60 90 243 60 37 2 6 -130 -32 -211 101 -257 -91 -51 -23 -84 -58 -22 149 120 71 57 36 -54 281 -48 125
4245A25l3L6r6K91m38J56mJ48o7j78j10K52J58k83O1M6j08Non9J62l9j61L42k31
$$ 125 92 128 32 323 -115 41 37 185 118 -60 -170 82 240 -43 18 64 -44 -39 -45 -104 58 19 -142 200 -31
4270c1R3j36k1j91J85K1K7p4J56J26j31J61m52j7J94J11L9l20J82j51J86K66j23
$$ -31 62 -74 -95 -286 -101 -80 -53 -127 29 155 24 185 -267 -284 -90 21 60 -260 -78 -229 -43 223 100
4293A00o7K82j35j00M7l02L11l1J34n3l53k2L87l27J97K3j49o6K10N8j89J2j12
$$ 100 33 315 180 80 127 -175 136 105 239 186 -167 -189 198 -129 68 91 -58 -124 86 144 -45 -33 -145
4316a45K20J12r2Q5r6J83j19j35N8ro8J68k37L40j22m39K69rQ3J66l21J77O0N6
$$ -145 75 187 95 180 84 267 148 13 71 62 -6 162 -75 265 143 -296 -27 -36 47 213 -108 69 129 185
4340A85k47k1r3K53m1K55k39m3P0j26J14k03K70k81J64J66m8j98K08m8p4j9j0
$$ 185 -62 -83 -176 77 36 291 52 9 79 -47 67 -136 134 -147 17 183 135 -63 145 97 23 4 -6
4363fJ77r5K4k14pm3J39N1k73K51o8o4J76o8J63j06k5p5P9k0l6l8J88o4j9J24
$$ -6 171 76 100 -114 -121 -164 -25 26 -247 4 -64 -128 48 -20 143 37 12 -63 16 -4 -40 -78 110 46 27 151
4389A51o2r3J63p5j09J47k0l34M11l75J52K67l54J42J01j76K20m72L18o4J70j3
$$ 151 89 -4 159 84 -25 122 102 -232 179 -196 -44 223 -131 11 112 -64 156 -316 2 -62 108 95
4411I5p7j53K01j42J46r1k5J13m8j75J63K58k81l3J3O7k30J72M8o5Kk19L87j72
$$ 95 18 -135 66 -76 70 -21 -46 67 19 -156 7 265 -16 -49 -36 31 -199 -27 21 -44 -42 -261 126 -46
4435d6j3J64n0l21K68J2q6J00k29q5K77N9j44RK8o8J82j31j50Q3m2J82q6l4j0
$$ -46 -59 105 55 -266 2 14 -72 28 -201 -286 -9 50 -94 -85 -57 -125 57 -74 -224 -141 -183 -1 -87 -121 -131
4460a31M6J86J11k31P7n8nk3l2j41K55k04L04m15M9J44Q8K8r5J26%K61k09j79
$$ -131 -85 101 212 -19 58 0 -5 -28 -60 -201 54 -150 154 -261 -212 -68 20 48 -47 79 79 340 131 -48
4484d8J69k68J61rJ17l1k1k6J76j73O4j42L9j20J37N6N8k19L54k45k19o8K45K22
$$ -48 121 -147 14 5 122 91 70 44 220 47 111 -31 8 -112 25 81 139 -80 274 29 -190 -258 -13 209
4508B09l41J9J8R7o3K77p5m64L33j7n0K96j25J54k26n3O0O9k72J33m7P6O2n6r6
$$ 209 -132 -113 -95 2 -61 216 141 -323 10 -7 -57 239 114 268 42 -11 49 118 -154 -21 -68 8 70 14 -82
4533h2j43K65p3r5L06o9k43O5l3K19k7j62n2o9m0K08k0L84j86j27j76k3L6K47
$$ -82 -225 40 -33 -128 178 109 -134 -69 -102 117 90 -72 -124 -193 -233 -25 -45 339 153 26 -150 -173 -137 110
4557A10J0j41j49J47m9q2L83l06L1m5j21J73K02r3j09j2j07L0K58N3j85O0j35
$$ 110 120 -21 -170 -23 -72 -154 229 -77 -46 -91 -212 -39 163 70 -39 -51 -158 -128 130 183 -2 58 -77
4580g7j23P6K64j07k7j66O4M02k98N9M3m8j20ll7p0K76Ok10N5J02l19L07p4k48
$$ -77 -200 -124 140 33 6 -160 -96 306 8 67 110 62 -58 -61 -98 -168 108 114 -96 -41 61 -258 49 -25 -273
4605b73M31n1j70Q7k06J48j15K40j07m3o7K10J1Nj45K09L0j20j69J8J55J08k50
$$ -273 158 107 -63 24 -182 -34 -149 91 -16 -59 -126 84 95 100 -45 164 194 74 -95 -77 78 186 -64
4628f4J34R6k06N9l2j67l7K70J90k71J61j34P8o2O3j85K86j70n7K72j93j45J38
$$ -64 70 166 -40 19 -13 -180 -217 53 243 -28 133 -1 77 15 78 -107 179 9 -48 224 31 -114 24
4651B4J5l0j72O5K01kq6q5J82j20Q7q9k43L02P1l14L49k95K30k75K40J68r3j90
$$ 24 39 9 -163 -98 103 101 15 -70 112 -8 79 -10 -253 49 120 -194 155 -140 90 -185 55 223 130 -60
4675f0n9j64K47K57l40L30k70L1r2J55j10RJ06RL3p7J48j06O7j00P4J54m5K9l76
$$ -60 -119 -283 -36 221 -119 211 -59 -28 -120 35 -75 -66 40 49 82 5 153 47 114 14 88 242 197 226 -150
4700a50K73j44q0J1k3J46J5p9N5j35o3K15M3j05K01j21j32J70k44K19j86P7J46
$$ -150 123 -21 -101 -90 -113 33 48 -31 24 -111 -174 41 84 -21 180 59 -73 97 -147 72 -114 -37 109
4723A09l10L04l65J51N3R1p2O7j86j1K91k21J48pJ21l58L79k27j20R3q7J88k50
$$ 109 -201 103 -262 -111 -58 33 -39 28 -158 -169 122 -99 49 42 163 -195 184 -43 -163 -70 -157 31 -219
4746b19M37k64J67n6Q4k88K78J29l31M39n87M44l24Pr8L2K01k24J49k21L30j61
$$ -219 218 -46 121 65 149 -139 139 268 -63 376 -211 233 -91 -84 -182 -150 51 -173 -24 -245 85 -76
4768g6J8J5J0K59k55K10k17qL5J49k46K01j35n6K00n0P3k26J98j87N0L88n01K92
$$ -76 -58 -43 -33 226 -29 181 -36 -44 -9 140 -106 95 -40 -96 104 54 127 -99 99 -88 -38 350 -151 141
4792A41j22r0J32k29J87j13mJ21J16k02o1K7J71j43j36K37j38K42m1M1r2q7qJ21
$$ 141 19 -71 61 -168 19 -94 -98 23 139 -63 -124 -97 74 -69 -205 32 -106 136 95 136 44 -43 -51 70
4816G0J47k3j97n3J34P6q0m0k01L07j52j91K6K08J0J12j31J92j69n5m1n2m0j5
$$ 70 217 194 -3 -56 78 154 74 34 -167 140 -12 -203 -177 31 41 153 22 214 45 -10 -51 -103 -143 -158
4840a58K09m2K5k03m9M0L01j26j03l5P0K47k55r9L4M5J69l47M23L4j63O3p5j20
$$ -158 51 9 34 -169 -218 -178 123 -3 -106 -141 -71 176 -79 -178 -144 -99 70 -277 146 180 17 80 5 -115
4864a15K19q8r1J92m7J9M3j75j38K98J2m8r1N9J59m30K62j98K8K19K6kM1R2l89
$$ -115 104 16 -75 117 70 89 132 -43 -181 117 129 81 -10 49 208 -222 40 -158 -130 89 115 113 154 246 -143
4889a43J70J68l8m76K25P1j81K05J43k26K8K68k07R9j50Q4m3J51n8J58q4k40k6
$$ -143 27 195 157 -319 -94 -23 -204 1 144 -82 -54 214 7 106 -44 40 -3 148 90 248 164 -76 -102
4912a02J16m3L49k59Q1j96n8j09J94L8K42k52n5j10J6J90l20M35l6l43K20L3j45
$$ -102 14 -29 320 61 142 -54 -112 -221 -27 11 253 1 -54 -164 -148 42 -278 157 121 -222 -2 31 -114
4935a14J3J20m7l3j58L17j06n4j74J82K72j12Jo5m7q2K71j75l4j17N0R8l5r3K17
$$ -114 -101 19 -28 -61 -219 98 -8 -62 -236 -54 218 106 107 42 -5 -87 184 9 -25 -142 -92 6 -29 -122 95
4960I5l65L58k0m1k96K39j8j02J51j58P6K17j58O3m0M7o3J15k11Q6J46l13L80
$$ 95 -270 88 68 27 -269 -30 -48 -150 1 -157 -81 136 -22 41 1 48 -15 100 -111 -25 121 -192 188
4983A88j9k35J46O3k83Lq2J85N7o1k5J45P6j13l18J97k2K10J70l02p6J8J43j0
$$ 188 169 -66 80 143 -140 -137 -219 -34 23 -38 -63 82 158 45 -273 -76 -98 112 282 -20 -96 -78 65 55
5007E5l04K78o5J57q5j54K06J60l80M9J24MJ57j59r8q3O9K00k14J34N3P2k81J20
$$ 55 -249 29 -36 121 36 -118 88 248 -132 -83 41 45 202 43 -55 -138 -69 131 -83 51 104 176 -105 15
5031A5l0r7N2J77O1k47K26m32M08j54O8k8j44K36Jj07o9P1Rm9K8J32J22n34N55
$$ 15 -15 -112 -60 117 178 -69 157 -275 133 -21 47 19 -125 111 112 5 -64 7 16 -33 -5 127 249 -285 270
5056B70m97K80j93J86L0j92R6L58m44P9j02J29l8l7K61l96J83k6P6p3R6N5p4j21
$$ 270 -227 53 -140 46 76 -116 -20 338 -106 -27 -129 0 -38 -75 186 -210 -27 -53 23 -50 46 101 27 -94
5080i4K81k75J12n0j8qL1J6j61N12l03r8p6M0ql44O06N3k62R3P7m5J8J29m04L95
$$ -94 187 -88 24 -26 -44 -52 -21 -5 -166 346 43 -55 -131 -91 -99 -443 163 216 -46 47 124 79 97 226 -178 217
5106B17q3n3l32J45J48o1j8K47l18Q2J70j53k0J68k95r9N71m22K94k84K89j25
$$ 217 134 81 -251 -106 42 -19 -37 210 -108 -26 144 -9 -29 139 -156 -255 316 -106 188 -96 193 68
5128F8j65j31K16P0NJ78l88k1K83n1r8j87L64p9L8J39m91K64r4r5K46l6O5k12
$$ 68 -97 -228 -12 58 63 241 -147 -168 115 64 -34 -221 143 64 102 241 -250 14 -80 -175 71 35 100 -112
5152a12J8K93l57lJ85N9J33j05k14K66k17J8kL1N3l11L58L8L4l03J38N2J21l04
$$ -112 -94 199 -158 -161 24 83 216 111 -103 163 -54 -36 -38 -7 46 -265 93 131 165 -138 0 52 173 -131
5176a31J56J07j16L0n3k3j38N8QK8Lj46POJ36K20l46R8K43l28J63o1N5Q5P6M3
$$ -131 25 132 16 46 -7 -30 -168 -110 -102 -74 -71 -217 -210 -204 -68 152 -194 -96 147 -181 -18 -79 -24 61 137 180
5202A80l27QL33j15m13L70j56K82k82J9L62l71R7J42k36K03O9l03L15m05j0L39
$$ 180 -147 -139 194 79 -334 36 -120 162 -120 -101 261 -110 -13 129 -107 96 165 -138 177 -228 -238 101
5224A01j63l11M41J48o9n9r5j75J5R7n4K51j30J00r2lJ7L5l05K04K2j21J38q7
$$ 101 -62 -373 68 216 147 88 -7 -182 -167 -70 -124 127 -3 97 5 2 19 54 -251 -47 -25 -146 -8 -95
5248i5J03r8J85j38K99j47J18M3k02j27NL07l30R3J08J50l40k8J09j50J80P6j25
$$ -95 8 -90 95 -43 256 109 227 270 68 -59 -54 253 -77 16 124 274 -66 -94 15 -135 45 121 -4
5271do7L04j99P8k97J13p6J95j20qJ13q5l6Q0L8K0K2j53R8L65n18L9j62J25O7
$$ -4 -71 233 34 112 -185 -72 -148 47 -73 -81 32 -53 -89 -9 29 49 71 -82 16 381 -137 -98 -260 -135 -68
5296f8N6q8J16J26m51N4J97J58j77K5J37j35j17QJ80K11k78J38j19O6K9q8k50
$$ -68 -12 -100 16 142 -309 -255 -58 100 -77 -52 85 -50 -167 -159 21 232 -46 92 -27 39 68 -20 -270
5319b70L90k05rP0J62k0j33K9J03M0K95m87M6j62L34oJ06k40p1J59j25Oj85L30
$$ -270 120 -85 -94 -24 138 118 -15 14 117 157 452 -35 11 -151 183 177 283 43 -28 131 6 12 -173 157
5343A57j60j29J8J03Q7%k06q3J76J40J0k36M5J17m5j16K78K4m6k86K56K03m05
$$ 157 -3 -132 -114 -11 76 76 -130 -213 -37 103 113 -123 -78 39 -6 -122 156 180 134 -152 104 307 -98
5366i8K66l10J10j17J76Q1l92L51O4j45p6k5J58J60k25L1j65J00O3k69K24KR7
$$ -98 168 -142 -32 -149 27 108 -284 67 131 -14 -90 -115 43 203 -22 9 -156 -56 7 -262 -38 -36 61
5389F1o8J27o8l39L77M8j09P3l80L25j27O5j55RL04k08j45j22N0L91J63k96K03
$$ 61 -7 120 52 -287 90 138 29 102 -278 47 -80 -15 -170 -161 143 -65 -210 -332 -282 109 272 -24 179
5412A79j57J13p8k3L1k89K95L23n52K77j4j18j27K7J95ll02J94R0m2j80L2K18
$$ 179 22 135 57 34 65 -224 71 394 -158 119 105 -13 -140 -113 82 79 -223 -29 61 19 -161 -129 89
5435H9k3j65J35R3j4j04j12M61l84M1J33j33L7n3k24K07n8K54n00N34j98K7K1
$$ 89 66 -99 36 129 115 11 -101 360 -24 17 150 17 54 1 -223 -16 -74 180 -320 214 16 43 64
5458F4l5j50PrJ1O3j27L51m5L4m94N02K4n3j24M9Kk48R1J32r6J96j48m38L32K86
$$ 64 29 -121 -114 -123 -112 -49 -176 175 130 164 -330 172 196 143 19 68 70 -178 -87 45 -51 145 -3 -441 -109 177
5484A77j78l02K86k79R9L88k82J16k16J24J24K6r4j21J26q1K44l76K24o0q9k8
$$ 177 -1 -303 -17 -296 -197 191 -91 25 -191 -67 57 83 -11 -132 -6 -87 157 -219 5 -55 -144 -172
5506a72J6N9K16k21P4Q7J6j45K5J54j28j7J68k45o9J12J02K70l60j29N08j80j89
$$ -172 -156 -97 119 -102 -28 59 75 -70 -45 109 -19 -36 132 -113 -182 -70 32 302 -58 -187 321 141 -48
5529d8q5Q1l8n0J73r0K17j85j89J48r3K85l08K44j19J52j37M1K22n6R0r1J75o40
$$ -48 -133 -52 -90 -140 33 -57 160 -25 -214 -66 -159 126 -182 62 -57 95 -42 -1 221 165 255 164 339 -301
5553c01M63l41O7K11Q6j22k68J38J52k99K34Q4k03J49j85J77o1J31p9K18j92o6
$$ -301 162 -179 -112 99 185 63 -205 -67 85 -214 20 104 -99 50 -135 42 -19 112 33 251 59 -7
5575gM3L2k86M12k06L9j17q5K62r6kN7P0j13l8j21K85j24J1K3o4j76L57j10m2
$$ -7 36 68 -218 194 -12 27 -90 -175 87 -9 -11 46 116 3 -35 -156 129 5 16 39 -25 -201 156 46 4
5600Dl2N1k80L06l6J80k05P2r4k9j91J15K00L0j28l0K00j42J50k05K74K2K8j23
$$ 4 -28 23 -257 49 13 193 -12 60 -34 -63 -254 -139 61 91 -37 -67 133 -9 141 -64 210 232 260 137
5624A37k96J59J49k1j24k8k60J62q4K63P0j37j40k3J75M0J13j89J30l02O4R9M8
$$ 137 -159 0 149 128 4 -24 -284 -122 -206 57 127 -10 -150 -173 2 42 155 -34 96 -206 -142 -43 5
5647Ej41K23k64K47k79L46j67O0J0J4m3p0J10j91K86j36j8k60L00p4J25k24j5
$$ 5 -136 87 -177 70 -209 137 -30 30 40 54 11 -59 51 -140 146 10 -8 -268 32 -42 83 -141 -156
5670a56m1K10m5r5K93j39L7J65k18j05O8J32J22k84m0J23k9j43o5J04R7O0Q8k6
$$ -156 -197 13 -32 -127 166 27 64 229 11 -94 -26 106 228 -56 -96 27 -2 -145 -210 -106 -9 51 139 113
5694A13K65k69n2k74n0L15j28J33q7O9j19J23O6qq6l21L96j10j69m4J99K0mP2
$$ 113 378 109 57 -217 -267 48 -80 53 -34 35 -84 39 105 97 11 -310 86 -24 -193 -237 -38 -18 -22 50
5718E0j64M4p0K32j89K06k49K20m8O3n1K03k95P6j3n0J17M6o9j23L0p7J51j04
$$ 50 -114 -70 -140 92 -97 109 -140 80 32 95 44 247 -48 28 15 -35 82 128 59 -64 -34 -111 40 -64
5742f4J50j2n2k27K93o5J8m5J32J02q0kk24J79j4k54O8K2r5L0J83j47J20r7J10
$$ -64 86 74 22 -205 88 23 41 -4 128 230 150 148 -76 103 89 -165 -97 -75 -170 -140 43 -104 16 -81 29
5767B9J24k33p4L15l85L35l13L42n2j51J2P7j00J95k26n9J49J37k07J08J10j39
$$ 29 153 -80 -154 161 -224 111 -202 140 88 -63 -51 26 -74 121 -105 -164 -15 122 -85 23 133 -6
5789fJ14n4l1JN0k82L45j5l3j42q9L06j35J06j78N7Q7Rj45N8k38K35K57l5J2j63
$$ -6 108 54 23 24 74 -208 137 122 89 -53 -142 164 29 135 -43 14 101 110 -35 23 -215 20 277 242 254 91
5815I1k16J20k9K55j15J09k63M9J98r6j70j15l53M89K58l6j34J7l64L75j31K94
$$ 91 -125 -5 -34 221 106 215 -48 1 199 103 -67 -182 -535 -46 212 176 42 59 -305 70 -61 233
5837B33j72j33K23m2L7q6O4q5M3K1k40J59K8j5M5J31m65K65J86j95M9k95L72k64
$$ 233 61 -72 151 109 146 60 124 39 82 103 -137 22 50 35 80 211 -254 11 197 2 51 -244 128 -136
5861a36K56O0j74j24J54R1k33J94q4n6K40l21J62j06K79k67K95m62J16J48l22
$$ -136 120 180 6 -118 36 127 -106 88 4 -52 188 -133 29 -77 202 -65 230 -232 -116 32 -290
5882b90O4K04K11j72J36l95J81R8q4q7J34j9M1j37j21l0K15J61l5k11J38J87p4
$$ -290 -226 -22 189 17 153 -242 -61 37 -47 -134 0 -19 22 -115 -236 -266 -51 110 75 -136 2 189 115
5905A15k01N8J20o5k8L9j85mL37k06P9j6Rl1o8J24J56l53J27Nl77K92J34j32m
$$ 115 -86 -28 92 27 -1 38 -147 -151 186 -20 59 43 52 21 -47 77 233 -120 7 12 -365 -73 61 -71 -75
5930g5OR6R1O3m36K2J49j62K80j34K3q9J39j19L42j03j5j84J02j78K40J99j80
$$ -75 -69 27 118 181 -255 -233 -84 -246 34 -100 -77 -166 -27 -146 196 93 78 -106 -4 -182 58 257 77
5953G7k65L69q4j8o2j03M4k1P7Q5k90K44O0k8M9l20L37j32J66m3j82J65j34L49
$$ 77 -188 181 97 79 17 -86 -42 -63 14 99 -191 53 113 85 134 -186 151 19 185 142 -40 125 -9 340
5977C40n65M42j0m10K54j01J07q9O5n6M22m96Q5M04l19Jj01j59K43o0O5j61N7
$$ 340 -225 217 207 -203 51 -50 57 -32 33 -23 399 -97 -12 392 73 74 -27 -186 57 -3 62 -99 -42
6000d2O7j32l9P0j7l4J77r6%Q6k02J08j85J68r0K03n2j43L83k83R9L0k11l5K84
$$ -42 25 -107 -146 -76 -93 -127 50 -46 -46 40 -162 -54 -239 -71 -161 42 -10 -153 230 -53 46 76 -135 -170 114
6025A14J17l9pR2j97j52J62k95J9J37k3r2N8J3J57k09M67l57J34j79m4K72p1j25
$$ 114 231 192 185 277 80 -72 90 -205 -186 -49 -72 -164 -106 -93 64 -145 322 -35 99 -80 -124 148 77 -48
6049d8R6r8n3J20J54l61M33m42m8J57qJ30n4k0j04K19N7j98M5J59N8M1J3l52P8
$$ -48 48 -50 -103 17 171 -190 243 -199 -247 -90 -98 32 -22 -42 -146 73 130 -68 -23 136 194 235 248 -104 -26
6074b6k91L25k6l9j5J42q9k8L5NJ02k28P1J34j39o3L82m94J08K27k80J21kOr9
$$ -26 -317 8 -18 -57 -72 70 -19 -47 -12 -7 95 -133 -62 72 -67 -130 252 -242 -134 93 -187 -66 -68 -62 -161
6099a61M4Q0N2r9J08j4J44rN0n8j04j88R7QN9K18k67J37m4k7k58N6L08K0l49Q3
$$ -161 -117 -37 15 -84 24 10 154 145 195 137 33 -155 -58 -50 9 227 -40 97 53 26 -232 -176 132 152 -197 -114
6125a14J39l4J4kj2J66j78L8j03J44J21o3N6l52L16j64j21J7J62k11L35j83j11
$$ -114 25 -9 5 3 -9 157 -21 17 -86 58 179 116 172 -180 136 -28 -149 -132 30 -181 154 -29 -140
6148a40J31k2K4q0Q6O2k26R4k78M17j3m2k5k1K81k56q5J99j68J8R9n4p5J00j62
$$ -140 -9 -31 -7 -87 -1 61 -165 -71 -349 68 55 13 -12 -33 248 -8 -93 106 -62 -44 55 1 -74 26 -136
6173a36R7j31L0J32k16J32r6p2M58k74O0Q7p4j9K9N7k68M13j74j74K21j62N8N2
$$ -136 -39 -170 -140 -8 -224 -92 -188 -260 198 -76 -16 71 -3 -22 7 64 -204 209 35 -139 82 -80 -22 30
6197C0nrK2o3j45J30j99J64j68K74j82J11k9QK47j20Mj46J30n0j53J26l5O6j92
$$ 30 25 16 38 -25 -170 -40 -239 -75 -243 31 -151 -40 -69 -61 186 66 70 -76 54 4 -149 -23 -58 8 -184
$$ [...]
8191E2
##END NTUPLES=NMR FID
##END=
