##TITLE=1H_DE-17_PH_Gly
 200.13MHz, D2O,
 8 sc
 
 14.2.2025
##JCAMPDX= 6.0         $$ Bruker NMR JCAMP-DX V2.0
##DATA TYPE= NMR FID
##DATA CLASS= NTUPLES
##ORIGIN= UXNMR, Bruker Analytische Messtechnik GmbH
##OWNER= pz
$$ XWIN-NMR		Version 3.5
$$ Fri Feb 14 14:32:25 2025 Russian Standard Time (UT+4h)  she@DPX200
##.OBSERVE FREQUENCY= 200.1313
##.OBSERVE NUCLEUS= ^1H
##.DELAY= (6, 6)
##.ACQUISITION MODE= SIMULTANEOUS
##.ACQUISITION SCHEME= undefined
##.AVERAGES= 8
##.DIGITISER RES= 18
##SPECTROMETER/DATA SYSTEM= spect
##.PULSE SEQUENCE= zg30
##.SOLVENT NAME= D2O
##.SHIFT REFERENCE= (INTERNAL, D2O, 0, 14.3821)
##AUDIT TRAIL= $$ (NUMBER, WHEN, WHO, WHERE, WHAT)
$$ ##TITLE= Audit trail, XWIN-NMR		Version 3.5
$$ ##JCAMPDX= 5.01
$$ ##ORIGIN= Bruker BioSpin GmbH
$$ ##OWNER= she
$$ F:/spectra/data/she/nmr/H-C/1/audita.txt
$$ ##AUDIT TRAIL=  $$ (NUMBER, WHEN, WHO, WHERE, WHAT)
(   1,<2025-02-14 14:30:44.53 +0400>,<she>,<DPX200>,
      <created by zg, POWCHK disabled, PULCHK disabled
       configuration hash MD5:
       00 E9 B6 7A A2 85 ED C7 34 08 36 98 17 FE 4E 26
       data hash MD5: 16K
       1F 9B 44 F2 43 1B 2F 9C B0 8B 47 79 D1 7B 64 31>)
$$ ##END=
$$ 
$$ hash MD5
$$ E2 7D C7 25 F2 95 FA EB F7 F1 D7 73 58 62 AF 67
##$RELAX= 
##$RELAX= 
##$RELAX= 
##$RELAX= 
##$RELAX= 
##$RELAX= 
$$ Bruker specific parameters
$$ --------------------------
##$DU= <F:/spectra>
##$EXPNO= 1
##$NAME= <H-C>
##$PROCNO= 1
##$TYPE= <nmr>
##$USER= <she>
##$AMP= (0..31)
100 100 100 100 100 100 100 100 100 100 100 100 100 100 100 100 100 100 
100 100 100 100 100 100 100 100 100 100 100 100 100 100 
##$AQSEQ= 0
##$AQ_mod= 1
##$AUNM= <au_zg>
##$AUTOPOS= <>
##$BF1= 200.13
##$BF2= 200.13
##$BF3= 200.13
##$BF4= 200.13
##$BF5= 200.13
##$BF6= 200.13
##$BF7= 200.13
##$BF8= 200.13
##$BYTORDA= 1
##$CFDGTYP= 0
##$CFRGTYP= 5
##$CHEMSTR= <none>
##$CNST= (0..31)
1 1 145 1 1 1 1 1 1 1 1 1 1 1 1 1 1 1 1 1 1 1 1 1 1 1 1 1 1 1 1 1 
##$CPDPRG= <>
##$CPDPRG1= <>
##$CPDPRG2= <>
##$CPDPRG3= <>
##$CPDPRG4= <mlev>
##$CPDPRG5= <mlev>
##$CPDPRG6= <mlev>
##$CPDPRG7= <mlev>
##$CPDPRG8= <mlev>
##$CPDPRGB= <>
##$CPDPRGT= <>
##$D= (0..31)
0 0.7 0 0 0 0 0 0 0 0 0 0.03 0 0 0 0 0 0 0 0 0 0 0 0 0 0 0 0 0 0 0 0 
##$DATE= 1739529044
##$DBL= (0..7)
120 120 120 120 120 120 120 120 
##$DBP= (0..7)
150 150 150 150 150 150 150 150 
##$DBP07= 0
##$DBPNAM0= <>
##$DBPNAM1= <>
##$DBPNAM2= <>
##$DBPNAM3= <>
##$DBPNAM4= <>
##$DBPNAM5= <>
##$DBPNAM6= <>
##$DBPNAM7= <>
##$DBPOAL= (0..7)
0.5 0.5 0.5 0.5 0.5 0.5 0.5 0.5 
##$DBPOFFS= (0..7)
0 0 0 0 0 0 0 0 
##$DE= 6
##$DECBNUC= <off>
##$DECIM= 32
##$DECNUC= <off>
##$DECSTAT= 4
##$DIGMOD= 1
##$DIGTYP= 9
##$DL= (0..7)
0 120 120 120 120 120 120 120 
##$DP= (0..7)
150 150 150 150 150 150 150 150 
##$DP07= 0
##$DPNAME0= <>
##$DPNAME1= <>
##$DPNAME2= <>
##$DPNAME3= <>
##$DPNAME4= <>
##$DPNAME5= <>
##$DPNAME6= <>
##$DPNAME7= <>
##$DPOAL= (0..7)
0.5 0.5 0.5 0.5 0.5 0.5 0.5 0.5 
##$DPOFFS= (0..7)
0 0 0 0 0 0 0 0 
##$DQDMODE= 0
##$DR= 18
##$DS= 0
##$DSLIST= <SSSSSSSSSSSSSSS>
$$ [...]
##$SUBNAM0= <"">
##$SUBNAM1= <"">
##$SUBNAM2= <"">
##$SUBNAM3= <"">
##$SUBNAM4= <"">
##$SUBNAM5= <"">
##$SUBNAM6= <"">
##$SUBNAM7= <"">
##$SUBNAM8= <"">
##$SUBNAM9= <"">
##$SW= 18.0517328524113
##$SWIBOX= (0..15)
0 0 2 0 0 0 0 0 0 0 0 0 0 0 0 0 
##$SW_h= 3612.71676300578
##$TD= 16384
##$TD0= 1
##$TE= 0
##$TE2= 300
##$TE3= 300
##$TEG= 300
##$TL= (0..7)
0 120 120 120 120 120 120 120 
##$TP= (0..7)
150 150 150 150 150 150 150 150 
##$TP07= 0
##$TPNAME0= <>
##$TPNAME1= <>
##$TPNAME2= <>
##$TPNAME3= <>
##$TPNAME4= <>
##$TPNAME5= <>
##$TPNAME6= <>
##$TPNAME7= <>
##$TPOAL= (0..7)
0.5 0.5 0.5 0.5 0.5 0.5 0.5 0.5 
##$TPOFFS= (0..7)
0 0 0 0 0 0 0 0 
##$TUNHIN= 0
##$TUNHOUT= 0
##$TUNXOUT= 0
##$USERA1= <user>
##$USERA2= <user>
##$USERA3= <user>
##$USERA4= <user>
##$USERA5= <user>
##$V9= 5
##$VALIST= <valist>
##$VCLIST= <CCCCCCCCCCCCCCC>
##$VD= 0
##$VDLIST= <DDDDDDDDDDDDDDD>
##$VPLIST= <PPPPPPPPPPPPPPP>
##$VTLIST= <TTTTTTTTTTTTTTT>
##$WBST= 1024
##$WBSW= 4
##$XGAIN= (0..3)
0 0 0 0 
##$XL= 0
##$YL= 0
##$YMAX_a= 597086
##$YMIN_a= -599371
##$ZGOPTNS= <>
##$ZL1= 120
##$ZL2= 120
##$ZL3= 120
##$ZL4= 120
##$ABSF1= 10
##$ABSF2= 0
##$ABSG= 5
##$ABSL= 3
##$ALPHA= 0
##$AQORDER= 0
##$ASSFAC= 0
##$ASSFACI= 0
##$ASSFACX= 0
##$ASSWID= 0
##$AUNMP= <proc_1d>
##$AZFE= 0.1
##$AZFW= 0.1
##$BCFW= 1
##$BC_mod= 2
##$BYTORDP= 1
##$COROFFS= 0
##$CY= -3
##$DATMOD= 1
##$DC= 2
##$DFILT= <>
##$DTYPP= 0
##$F1P= 0
##$F2P= 0
##$FCOR= 0.5
##$FTSIZE= 0
##$FT_mod= 4
##$GAMMA= 1
##$GB= 0.15
##$INTBC= 1
##$INTSCL= 1
##$ISEN= 128
##$LB= 0.25
##$LEV0= 0
##$LPBIN= 0
##$MAXI= 10000
##$MC2= 0
##$MEAN= 0
##$ME_mod= 0
##$MI= 1.114404
##$NCOEF= 0
##$NC_proc= 0
##$NLEV= 6
##$NOISF1= 3.799351
##$NOISF2= 2.8
##$NSP= 1
##$NTH_PI= 0
##$NZP= 0
##$OFFSET= 14.38212
##$PC= 1
##$PHC0= -478.729
##$PHC1= 26.19221
##$PH_mod= 1
##$PKNL= yes
##$PPARMOD= 0
##$PSCAL= 0
##$PSIGN= 0
##$REVERSE= no
##$SF= 200.129724274929
##$SI= 16384
##$SIGF1= 3
##$SIGF2= 2
##$SINO= 400
##$SIOLD= 16384
##$SREGLST= <1H.CDCl3>
##$SSB= 0
##$STSI= 0
##$STSR= 0
##$SW_p= 3205.1282051282
##$SYMM= 0
##$S_DEV= 0
##$TDeff= 0
##$TDoff= 0
##$TI= <>
##$TILT= no
##$TM1= 0
##$TM2= 0
##$TOPLEV= 0
##$USERP1= <user>
##$USERP2= <user>
##$USERP3= <user>
##$USERP4= <user>
##$USERP5= <user>
##$WDW= 1
##$XDIM= 8192
##$YMAX_p= 0
##$YMIN_p= 0
$$ End of Bruker specific parameters
$$ ---------------------------------
##NTUPLES= NMR FID
##VAR_NAME=  TIME,          FID/REAL,        FID/IMAG
##SYMBOL=    X,             R,               I
##VAR_TYPE=  INDEPENDENT,   DEPENDENT,       DEPENDENT
##VAR_FORM=  AFFN,          ASDF,            ASDF
##VAR_DIM=   8192,          8192,            8192
##UNITS=     SECONDS,       ARBITRARY UNITS, ARBITRARY UNITS
##FACTOR=    0.0002768,     1,               1
##FIRST=     0,             0,               0
##LAST=      2.2672688,     0,               0
##MIN=       0,             -599371,         0
##MAX=       2.2672688,     597086,          0
$$ Real data points
##PAGE= N=1
##DATA TABLE= (X++(R..R)), XYDATA
0 0 0 0 0 0 0 0 0 0 0 0 0 0 0 -8 0 -8 8 -8 11 -10 16 -16 20 -24 29 -32 40 -45 53 -58 69 -77 85 -98 109 -123 138
37 138 -153 173 -189 212 -235 260 -291 319 -353 390 -427 473 -520 573 -631 696 -771 850 -946
56 -946 1053 -1175 1322 -1493 1706 -1971 2311 -2772 3419 -4417 6121 -9620 19772 -115852
70 -115852 -543695 -599371 -465181 -281825 -18457 359058 597086 528165 248579 -43184
80 -43184 -305277 -487592 -492037 -287102 9448 292884 483105 489363 277494 -15051 -247209
91 -247209 -401019 -472175 -351077 -32684 276234 395494 375515 297797 112253 -187519 -414851
102 -414851 -413880 -248395 -54264 145005 335417 411453 298415 68019 -161651 -324514 -378615
113 -378615 -289853 -95143 117893 287035 368591 305622 103803 -122412 -263184 -310491 -281190
124 -281190 -143504 86446 279195 324759 246839 116768 -49340 -229173 -330276 -281545
134 -281545 -122509 57441 205075 290135 273293 149073 -29105 -189034 -276765 -260288 -142665
145 -142665 22781 167376 251683 252838 156199 -10787 -169265 -248492 -237455 -153781 -15925
156 -15925 140019 244157 245599 154572 20002 -116319 -214532 -234823 -163232 -30431 107442
167 107442 201037 219724 157261 37256 -94859 -190953 -216630 -160778 -44329 85438 180180
178 180180 209107 163503 58316 -67686 -165859 -200241 -160744 -63989 53961 149932 188104
189 188104 156308 66781 -45900 -140807 -181230 -154169 -70629 37469 131343 176348 155237
200 155237 78841 -24838 -118462 -167114 -153062 -82924 13884 103267 155156 148817 85039 -9494
212 -9494 -96081 -144620 -142094 -88127 1165 90305 141988 139829 88969 7371 -77401 -133700 -139394
225 -139394 -93218 -15269 66557 122655 132062 92956 21011 -56747 -113921 -127880 -92322 -22916
237 -22916 51876 106259 123492 95299 30584 -45711 -101943 -118966 -94843 -37439 33764 92161
249 92161 114652 93626 39829 -26741 -82798 -107691 -92031 -42036 22245 77235 103673 90726
261 90726 44041 -17086 -71916 -99863 -90807 -48843 10495 64728 93833 88920 51531 -3777
273 -3777 -57028 -87749 -85284 -51736 -6 51030 82759 83288 52855 3010 -46689 -78908 -82088
286 -82088 -55221 -8353 40648 73828 79742 56685 13304 -34050 -68020 -76032 -56066 -15678
298 -15678 29180 62525 72470 55527 18114 -25605 -58898 -70544 -56120 -21221 20960 54987
310 54987 68426 56643 24505 -15934 -49591 -64588 -55746 -26352 12042 45067 60777 53901
322 53901 27182 -9361 -41769 -58520 -53250 -28475 6057 38080 55822 53109 30893 -2367
334 -2367 -33674 -52441 -51555 -31803 -1058 29402 49000 49563 31824 2892 -26660 -45755 -48454
347 -48454 -32184 -4911 23885 43476 46987 33859 7729 -20368 -40594 -45500 -34102 -10523
359 -10523 16775 37105 43511 33553 11574 -14072 -34201 -41753 -33226 -12826 11544 32325 40531
372 40531 33542 14377 -9362 -29354 -38352 -34042 -16688 7082 26552 35911 32280 17468 -4305
385 -4305 -24146 -34517 -31622 -16964 2842 21679 32687 31318 18402 -1257 -20111 -31089 -30611
398 -30611 -18876 -819 17242 28854 29808 19702 2088 -15331 -26688 -28381 -20079 -3663 13620
411 13620 25528 27740 19493 4731 -11913 -23670 -27059 -20355 -6011 10181 22025 26286 20296
424 20296 7555 -7882 -20467 -24878 -20185 -8027 6541 18575 23901 19916 8506 -5357 -17300
437 -17300 -23075 -20021 -9575 4153 15963 21596 19827 10561 -2479 -14627 -20631 -18846 -10892 1157
451 1157 12914 19464 18642 11155 -347 -12236 -18612 -18282 -11323 -947 10409 18047 18799 11672 1006
466 1006 -8798 -15877 -17832 -13141 -2448 8603 15134 16312 11988 3912 -7031 -14808 -16419 -12361
480 -12361 -3750 5967 13387 15730 12673 4996 -4622 -12463 -15839 -12019 -4791 3194 10502 14931 13462
495 13462 5544 -3803 -9986 -13202 -12348 -7170 1908 10480 13625 11600 6783 -787 -8629 -13036 -12181
510 -12181 -7207 456 8126 12294 11744 7044 723 -6373 -11404 -12443 -7304 131 5877 10071 11286
525 11286 8900 1640 -6073 -10223 -10543 -7804 -2809 4227 9943 11019 8177 2636 -3749 -8891 -10206
540 -10206 -8455 -3369 3168 8262 10394 8122 3254 -2077 -6941 -9849 -9069 -3948 2603 6784 8740
555 8740 8256 5189 -845 -6572 -9043 -7731 -4683 358 5356 8716 8447 4939 -146 -4956 -8232 -7962
571 -7962 -5033 -618 4219 7657 8498 5373 757 -3745 -6883 -7809 -5993 -1372 3702 6720 7392 5615
587 5615 2296 -2607 -6585 -7610 -5866 -1859 2125 5558 7106 5906 2759 -1746 -5165 -7006 -5721
602 -5721 -2825 1138 4481 6635 6191 3383 -684 -4403 -6053 -5927 -3946 173 4073 6156 5660 3678
618 3678 272 -3310 -5609 -6010 -4204 -810 2995 5360 5990 4094 1153 -2123 -4881 -5629 -4206 -1341
634 -1341 1968 4408 5284 4637 1540 -1777 -4046 -5364 -4485 -2024 1119 3733 5087 4162 2338 -918
650 -918 -3151 -4810 -4331 -2610 35 2928 4555 4469 2824 22 -2923 -4352 -4586 -3062 -638 2230
666 2230 4222 4618 3235 513 -2261 -4059 -4508 -3008 -1198 1696 3765 4359 3618 1573 -1419 -3292
682 -3292 -4362 -3446 -1618 1024 3382 4062 3376 1997 -1025 -3117 -4251 -4070 -2179 644 2694 4086
698 4086 4061 2369 -95 -2442 -4047 -3923 -2361 -110 2011 3978 3713 2770 486 -1747 -3368 -3896 -2885
715 -2885 -751 1451 3473 3842 3060 1147 -1225 -3202 -3895 -3175 -1350 829 2797 3522 3417 1526 -722
732 -722 -2731 -3731 -3510 -1913 383 2835 3867 3617 2036 -280 -1867 -3578 -3568 -2280 -106 2093
748 2093 3418 3382 2530 290 -1469 -3078 -3638 -2455 -659 1178 3194 3368 2664 1411 -1057 -2818 -3672
765 -3672 -2806 -1111 984 2673 3510 2907 1567 -835 -2566 -3263 -3139 -1526 518 2631 3485 2876 1728
782 1728 -214 -2044 -3266 -3029 -1797 81 1697 3190 3309 2205 579 -1785 -2979 -3484 -2125 -584
798 -584 1432 2966 3290 2302 611 -1288 -2709 -3364 -2395 -968 1023 2584 2998 2323 1164 -765 -2434
815 -2434 -3318 -2660 -1367 415 2281 2843 2714 1315 -419 -1970 -2780 -2693 -1571 208 2035 2714 2858
832 2858 1710 -336 -1625 -2657 -2722 -1438 -185 1417 3018 2841 1549 157 -1494 -2450 -2822 -2060 -283
849 -283 1222 2435 2900 1967 485 -1296 -2092 -2562 -2296 -592 732 2180 2500 2161 863 -638 -1774
866 -1774 -2601 -2284 -1159 519 1960 2144 2230 1414 -348 -1822 -2413 -2308 -1383 153 1726 2313 2190 1298
884 1298 -126 -1251 -2069 -2279 -1194 -152 1340 2237 2130 1482 99 -1073 -1901 -2197 -1588 -137 1000
901 1000 1807 2273 1261 547 -879 -1909 -2087 -1404 -489 720 1721 2032 1460 775 -928 -1585 -2008 -1735
919 -1735 -818 271 1347 2081 1614 972 -219 -1522 -1753 -1956 -820 182 1315 1808 1675 934 -80
936 -80 -1474 -1852 -1850 -947 210 1104 1669 1868 1154 44 -1035 -1513 -1477 -1147 15 973 1788 1602 1263 283
956 283 -762 -1409 -1490 -1059 -422 442 1400 1806 1061 634 -606 -1101 -1639 -1462 -765 415 1297 1757 1341 585
976 585 -508 -1259 -1320 -1704 -678 227 1206 1546 1121 892 -304 -1155 -1401 -1284 -782 -90 879 1618 1427 646
996 646 207 -866 -1508 -1271 -838 -42 1061 1295 1392 1036 315 -520 -1372 -1401 -794 -303 599 1300 1411 1172
1016 1172 373 -774 -1256 -1228 -1017 -53 320 1115 1501 1042 372 -416 -1215 -1228 -1238 -503 271 991 1461 993
1036 993 606 -353 -821 -1492 -1009 -513 414 940 1105 1224 469 -143 -851 -1024 -1085 -505 169 732 839 677
1056 677 400 -134 -784 -1052 -968 -809 -171 684 1275 1140 790 -298 -332 -864 -1115 -961 116 746 798 836 557
1077 557 305 -492 -950 -760 -931 -130 161 1032 931 506 169 -490 -688 -1081 -618 -44 292 764 1100 721
1097 721 396 -483 -1012 -912 -772 -215 66 553 900 896 400 -196 -644 -830 -628 -383 144 743 693 936 273
1118 273 -180 -569 -951 -841 -453 156 444 980 794 311 216 -510 -915 -696 -475 214 602 819 795 658 61
1139 61 -667 -627 -609 -447 -124 436 859 748 490 93 -606 -930 -754 -318 133 334 452 1010 326 98 14
1160 14 -571 -585 -455 -131 315 448 334 649 -171 -348 -808 -739 -329 -240 627 476 815 627 190 -632 -755
1181 -755 -750 -223 -83 136 543 381 217 210 -84 -211 -815 -515 -55 246 550 213 489 -43 -141 -616 -666 -640
1203 -640 120 211 319 501 644 55 -323 -262 -602 -583 -97 155 252 495 458 359 -99 -421 -367 -574 -547 132 427
1226 427 168 372 169 -210 -155 -415 -749 -159 79 525 459 436 188 13 -294 -531 -478 -406 -159 482 369 465
1248 465 240 60 -242 -266 -488 -355 19 599 405 529 223 -26 -127 -397 -315 -542 -235 331 625 196 196
1269 196 305 -222 -381 -421 -105 -22 307 457 465 200 215 17 -260 -270 -287 -238 140 347 300 158 -228 17 -368
1292 -368 -143 -390 66 210 483 325 309 250 197 -106 -364 -380 246 68 200 243 385 278 -329 -100 -393 54
1314 54 -67 37 257 68 189 -131 -332 -107 -496 -265 -12 -3 257 323 322 359 -233 160 -158 -292 -140 -248
1336 -248 111 433 221 -88 -169 -383 -126 -122 109 237 -141 167 366 286 -151 5 -132 -60 -67 147 -3 363
1358 363 276 151 -92 -78 -170 -318 -98 -77 4 111 30 184 26 -133 70 -135 -188 -73 -240 248 420 57
1380 57 -112 -80 -170 -134 33 -14 -80 112 276 235 116 71 -6 -137 -456 -41 113 304 -42 259 88 -287 -316
1403 -316 -71 95 143 120 -127 285 -123 -86 69 -237 -241 -235 -130 339 -24 12 -138 -223 12 -222 -136 189 -43
1426 -43 244 -58 110 -21 -153 65 -212 -317 -307 138 241 118 220 -122 234 -74 -322 -108 -19 -164 204
1447 204 157 284 127 -185 -180 -123 -318 -294 1 97 353 403 -90 -76 -68 -92 -201 68 -150 139 168 31 33 -23 -350
1472 -350 -312 -88 -163 -114 33 216 103 -361 -87 -13 -56 -349 -12 -3 25 188 44 399 -97 266 -191 -28 -146
1495 -146 -70 7 324 87 -45 21 -151 -420 -334 -130 147 170 21 208 157 -125 -188 -66 -40 -210 -96 105 397
1518 397 61 188 111 -360 49 -120 -219 -150 83 28 -2 58 -163 -22 -50 -201 -54 317 35 276 15 350
1540 350 -6 -19 -201 -64 -175 -219 217 63 -65 132 -9 -144 -311 -150 -175 -144 62 236 409 9 21 126
1562 126 -55 -364 -308 -91 263 133 279 168 77 122 -217 -543 -193 -192 10 222 411 232 86 86 -161 -509
1584 -509 -277 -168 65 -105 74 302 159 -8 -220 -63 -306 16 584 -9 574 237 43 189 -31 -32 -179
1605 -179 -436 -41 98 199 313 436 -22 -150 -162 -316 142 -124 163 152 329 117 98 -159 -327 -372 11
1626 11 91 166 312 458 187 -149 110 -407 104 -163 16 190 238 366 369 58 -197 120 -265 -207 -237 158 282
1649 282 521 153 362 188 -138 -106 -194 7 -381 172 168 57 211 244 -364 -209 -248 19 -104 34 -101 269
1671 269 108 -84 -64 -437 -340 -159 -4 -31 178 -81 439 -98 -118 -185 -241 -21 -52 205 102 -38 179 287
1693 287 -264 -267 -278 67 -86 119 222 110 110 -74 -48 -99 -163 0 -148 -12 360 328 268 24 144 -308 -235 -272
1717 -272 -172 -239 225 42 72 14 321 87 -253 -92 -86 72 188 335 159 120 -100 -72 -250 2 97 -26 97
1740 97 231 89 197 -81 -108 -223 -180 -171 310 311 -62 -147 27 -68 -90 -204 -493 -452 256 93 8 325 101 92 -251
1765 -251 -45 -60 -51 -204 -18 -212 205 259 200 -26 38 -111 -159 45 96 -117 78 148 -177 90 -91 -59 92
1788 92 -185 -25 134 247 -296 110 -126 92 -128 -271 273 74 -10 -193 362 -197 -140 14 44 -257 0
1809 0 -78 -58 -347 47 -32 140 60 141 5 -93 486 -175 -78 -47 -31 -160 -50 -33 -36 63 224 145 -18 -341 7
1834 7 -3 -38 137 76 -180 209 -136 -67 -269 229 -6 87 161 208 4 122 170 106 70 -201 39 -126 133 -154
1858 -154 164 59 -46 -271 -180 -138 51 -15 -88 -53 123 56 -84 -123 16 45 -63 -358 195 14 66 440 276
1881 276 99 -174 -349 -220 -144 -183 -13 43 97 249 -12 -206 -293 -137 -310 -98 -23 265 -44 97 -122 258
1903 258 -182 -304 151 49 -120 -225 266 226 8 259 34 14 -228 267 -239 96 163 203 23 -374 96
1924 96 -204 -39 -122 -183 195 12 68 229 65 155 -119 -331 -209 60 -84 44 276 186 145 -80 -326 -17
1946 -17 -11 -9 -290 -12 270 137 228 47 -27 -202 -168 11 -131 49 143 129 337 99 282 39 -472 -209 319
1969 319 -14 66 94 127 -165 -367 -261 79 -68 409 147 219 -106 25 131 5 -217 -177 195 -32 153 329
1991 329 266 42 -22 -132 -74 -107 105 -145 93 204 179 227 -76 -227 -50 -21 -252 -261 108 121 126 135 84 -84 36
2016 36 -114 109 135 -5 239 218 70 200 -222 -82 -175 -161 46 54 284 411 224 104 -189 -96 -359 -471 -14
2039 -14 -52 286 421 163 350 59 -32 -330 -57 -138 -144 -120 281 291 143 -178 -288 -331 -305 -205 -67 135 168 34
2063 34 339 -172 -232 -236 -215 -122 -144 226 321 -95 160 -12 -125 -91 -399 -114 -94 171 -38 289 90 5 -208 -247
2087 -247 -250 107 -183 -85 82 295 -130 77 -224 -94 -26 -415 -52 -59 90 68 147 -112 -19 162 -263 2 -157
2110 -157 -50 -81 -8 68 -106 85 139 -15 -111 174 -91 113 113 185 180 -90 -50 -328 28 -207 -134 -74 -10 292 144
2135 144 2 -163 -298 -284 -111 -156 -219 11 222 51 214 82 110 12 -150 -55 -34 -11 215 367 207 -37 66
2158 66 -306 57 -74 37 50 152 231 205 -226 -92 193 116 -283 -46 -57 82 183 11 9 -256 -22 -635 -57
2181 -57 158 -15 257 238 16 -1 -69 -1 -165 -355 103 202 72 -12 166 -85 -40 -260 6 13 -23 134 72 18
2205 18 333 -106 47 -124 -386 73 -66 30 226 -35 302 29 73 -77 -90 -102 4 61 182 308 221 -150
2227 -150 -93 -23 -77 -212 61 177 116 119 -34 97 55 -218 -277 137 -194 231 154 -14 163 43 3 -104 -54 120
2251 120 -46 53 345 -240 105 37 43 -17 13 43 -23 -95 34 17 -20 22 65 -116 -155 45 15 -111 -157 273 335 -94
2277 -94 -90 30 -86 108 113 44 -93 -163 63 21 -107 -408 -50 -143 112 9 147 -55 187 -178 49 -164 31
2300 31 306 -21 -103 -86 218 185 -6 -28 66 71 -159 -167 163 -50 -103 -474 -153 128 327 110 -193 -343 -20 54
2324 54 251 20 -42 -23 12 124 -183 17 38 3 157 126 -1 162 -17 -127 -215 72 -95 60 -295 -24 180
2347 180 -148 -161 -112 15 -177 -33 73 239 84 253 -19 -159 84 -285 -123 22 151 -117 -90 52 12
2368 12 92 -320 58 -23 -76 -104 96 318 -184 -114 -145 119 -144 -205 -213 299 142 -117 130 -14 -116 -40 -61 -42
2392 -42 34 52 -173 -105 291 -111 219 161 -184 -61 -62 -313 54 -218 -120 -31 66 -270 -310 -44 171 4 106 -57
2416 -57 -8 210 149 -123 -85 -135 -229 155 -145 -92 143 62 81 -193 -113 -251 -137 -85 180 199 -155 52 -92 -8
2440 -8 -10 111 -154 95 138 190 456 394 -28 78 -44 -283 106 -258 29 -14 -53 107 -111 47 136 53 -135 -108
2464 -108 -45 -30 241 238 -8 187 200 164 97 -47 50 47 129 177 94 58 160 -35 -138 282 -116 117 58 129 183 88
2490 88 -20 53 9 -224 -157 -107 59 225 14 97 -252 -184 -238 -32 101 -20 210 -189 -11 -187 221 21 315
2513 315 -1 -50 -220 -102 15 -182 178 110 72 -127 15 29 -76 -175 -112 196 -166 -143 244 -40 -162 45
2535 45 -112 -34 41 -132 -49 35 238 -62 -83 -32 63 -29 -60 161 -53 124 -214 -180 182 16 63 49 89 0 -120
2560 -120 -43 121 23 36 141 -62 4 -41 98 222 -236 102 -83 97 -249 -40 76 -2 -52 57 -114 -81 -181
2583 -181 -80 -72 94 -148 -151 41 -113 154 383 81 151 -151 32 18 -2 -109 53 280 -15 -112 -129 -177 55
2606 55 135 -223 187 -33 142 114 140 -198 -45 -183 137 214 29 105 -410 -142 -30 -35 -45 -121 149 181 103 96 -153
2631 -153 198 37 60 -89 86 136 -52 204 -90 -57 155 -55 -118 31 91 -236 -280 106 -326 -82 11 94 52
2654 52 118 13 -181 -76 7 -94 -153 38 4 18 193 -41 -65 -168 -161 -190 -83 27 167 404 110 -6 -213
2677 -213 -83 148 96 -82 -43 187 183 157 -83 35 -296 10 -196 91 -82 -81 -67 86 -109 -61 -203 -16 -120
2700 -120 -159 -170 210 -133 39 -140 84 -67 -78 -5 -10 151 198 16 93 -44 -192 221 -172 45 -253 149 159
2723 159 91 18 239 94 77 153 137 139 -39 59 -66 30 -101 -415 88 -32 -120 61 -215 -96 143 292 97
2746 97 80 -124 -155 121 42 -201 61 -324 199 200 -9 242 -170 -22 79 -41 -21 -129 259 94 54 121 -75
2769 -75 -142 -180 -103 69 12 124 65 -122 -12 -130 11 -24 242 -65 -34 -185 -292 46 59 146 -48 129 -60
2792 -60 -286 218 151 -48 -67 187 -149 -243 -198 -222 -127 -102 82 -84 -26 33 170 -49 -229 55 11 -158 -250 -107
2816 -107 -59 226 89 61 -109 -64 79 -20 56 62 175 285 242 4 -179 65 -93 55 1 177 -125 90 -315
2839 -315 -27 -57 89 145 -79 104 -205 20 125 120 285 5 -314 -247 -179 3 303 426 -16 39 -20 49 -59
2862 -59 95 31 -30 139 178 -201 28 -107 115 212 89 68 31 -22 -150 -189 -69 -237 72 -55 -51 -124 -79 82
2886 82 1 -224 -107 133 -263 109 199 185 -92 142 -172 -48 -209 172 -33 -40 54 -148 -43 -103 -227 177 -113
2909 -113 108 41 219 -99 -54 -32 78 34 -79 95 -24 -2 -136 263 -114 166 -252 38 360 -128 15 -244
2931 -244 -1 139 -229 -29 -242 -37 -114 -38 -35 -108 -48 -121 -14 -126 -55 -38 18 -95 143 -173 249 75 -269
2954 -269 -124 147 33 217 -112 -131 87 188 -45 9 236 16 81 204 12 -64 -246 -29 -50 -253 -106 -70
2976 -70 -186 -51 29 -321 -71 172 286 -298 175 145 75 14 -86 -119 27 -150 377 47 -156 41 -45 172
2998 172 -181 -88 -130 -156 129 -33 29 109 -263 87 -10 123 29 -53 -89 -90 -40 -31 134 -32 -18 -89 6 -186 52 -85
3024 -85 -311 -200 8 -218 199 113 0 -38 117 10 68 -71 -237 213 195 14 166 -109 27 -312 59 43
3046 43 -207 135 -95 -1 17 66 68 132 -129 50 -42 47 110 88 294 -145 -198 199 188 -12 -221 -141 141 -57 20
3071 20 75 -46 -311 100 140 142 -31 178 -122 58 63 19 126 -97 -17 -88 23 9 -140 73 110 339 -293 -172
3095 -172 -57 192 -20 109 224 -155 -192 47 18 -126 -29 -171 0 -30 286 -125 67 225 319 218 61 16
3117 16 51 93 56 42 64 264 -220 -20 -112 52 32 -2 37 -7 124 -44 127 -60 74 -257 178 39 -30 19
3141 19 -152 99 178 47 -79 205 -52 -94 -8 -58 157 -32 298 -8 -44 154 -34 -42 -305 161 128 -34 48
3164 48 -73 210 193 4 -17 55 25 59 69 160 231 112 -85 123 -132 -93 -169 -4 -6 80 -222 -229 -11 -1 -181 6
3190 6 -67 59 -6 -185 265 -3 36 447 -53 -130 117 -241 39 -181 122 -64 -98 -37 43 88 68 -240 173 53
3214 53 -48 16 38 160 -23 -239 -181 35 -251 90 -105 -12 94 -154 173 170 -5 99 -200 -80 111 -95
3236 -95 -199 117 83 -133 90 71 -330 -212 284 281 -328 113 -82 92 -12 -201 28 -27 184 52 -63 -22
3258 -22 154 -58 -166 57 29 113 192 -47 58 33 185 37 -303 20 22 157 -188 92 -243 -77 20 -156 192
3281 192 -93 -34 -233 104 178 -220 132 159 207 87 185 116 -26 111 -114 165 68 -66 -120 181 43 114 10
3304 10 -72 22 -150 48 361 79 -78 65 -124 -79 10 19 135 -61 -127 -107 -154 61 46 -63 27 -230 151 94
3328 94 92 87 -55 -35 221 -26 193 231 -149 -63 50 -81 -16 -5 161 -279 229 104 -90 291 177 95 -138 -228
3352 -228 -54 16 -38 173 -111 144 -117 316 171 -84 194 -22 144 171 61 151 19 35 -162 66 -21 -101
3374 -101 23 127 -41 -185 74 62 21 -247 -6 105 -58 -37 -145 277 -14 86 -164 -302 -97 -261 -63
3395 -63 -17 -19 -4 95 -27 -359 148 -24 -82 190 -233 -17 101 -188 -78 139 -44 -135 32 167 -239 83 43
3418 43 -224 -70 211 5 -78 -157 23 -70 -3 255 60 154 156 121 183 -101 144 122 -40 -151 36 326 141 -68
3442 -68 -110 -119 0 -264 193 176 135 -2 55 -296 -99 125 181 197 74 -33 -6 -174 -82 238 -77 -136 34 -136
3466 -136 -13 119 -33 53 148 -88 7 -84 25 50 18 -39 -41 233 -46 192 463 -51 61 -169 297 -286 35
3489 35 164 -63 68 64 -118 -71 29 -32 -145 -36 -80 141 62 -22 55 -7 67 -167 127 -71 -15 -51 90 72 -7
3514 -7 -269 46 139 371 176 -62 45 -70 183 111 10 -19 173 -121 57 -105 -163 -150 -193 -158 -157 -272 23 143
3538 143 -121 108 -62 -71 -33 55 16 -6 -101 -97 391 162 -226 101 -158 -125 123 -40 -30 217 18 -128 54 2
3562 2 119 88 -191 -11 -131 152 13 1 148 -175 167 -63 -200 87 -207 134 -87 199 -107 291 51
3583 51 -187 121 -16 78 -114 30 1 -205 -33 -257 -204 92 -193 -95 -202 38 -148 -288 63 132 -27 -16
3605 -16 229 43 88 0 152 101 -30 2 -100 -161 7 -239 386 -31 -98 -129 34 -165 43 177 -68 229 -88
3628 -88 -25 155 127 -121 -88 308 -103 203 -40 -41 135 -238 -231 61 105 -64 243 -318 31 34 5 235 259 212 -297
3653 -297 133 110 91 15 -175 -208 62 72 243 -108 136 87 -33 -319 163 76 -79 13 33 -88 -15 -185 43
3676 43 137 224 343 172 -111 -176 -232 145 59 147 212 186 161 76 137 93 210 95 223 131 -49 -41 -138 -260 -132 -76
3702 -76 -177 -33 -237 -57 193 75 -78 -42 -35 239 323 -325 -134 127 171 25 -174 183 45 128 133 147 73 -178
3726 -178 -2 -214 289 -146 51 -173 -140 -48 -174 96 -40 277 34 -24 23 -5 82 -202 -61 -142 94 77 51
3749 51 130 230 113 163 49 119 -249 -10 -45 -86 109 209 -33 239 174 51 -125 47 -226 -183 64 85 -341
3772 -341 -72 13 -20 -81 50 -48 -13 -96 225 30 -150 -28 -261 69 -113 -181 -302 104 145 84 134 -60 -7 -102
3796 -102 -69 26 -27 207 171 -142 25 -68 -128 -84 177 -272 -6 -99 83 -87 -172 273 -62 -459 -33 178 25
3819 25 -44 -97 -157 -132 -58 -113 -255 -122 -127 -163 -13 -61 -179 319 -118 -192 -8 332 49 74 184 -119 166 -36
3843 -36 120 190 -142 -7 -85 87 199 -56 -79 -15 -69 267 135 -86 -28 -87 -26 173 291 -46 82 283 -121
3866 -121 -116 40 -14 -54 57 -143 64 -66 -182 -56 86 50 -241 19 53 63 -25 -284 22 3 -29 241 -193
3889 -193 -45 -1 205 29 -162 -28 108 -86 90 -142 -52 58 90 186 -91 117 147 -273 166 103 -216 -103
3911 -103 -77 -119 43 308 7 63 170 -101 14 -37 68 54 123 68 -38 -266 -146 -51 -127 224 211 119 258 -273
3935 -273 -277 -121 -186 -67 58 276 40 -94 164 -51 -33 126 -140 90 224 -129 -151 124 66 -45 -46 26 -223
3958 -223 230 150 9 182 79 -110 131 -193 298 -4 -291 189 286 55 -121 -92 55 21 121 -78 233
3979 233 -24 -30 185 -34 392 161 -279 -261 -142 56 9 56 -114 -91 86 150 -9 44 -80 19 67 104 -113 10
4003 10 97 168 91 -65 -126 227 208 169 14 58 54 -64 -13 -161 35 115 169 -113 123 140 28 56 -15 76 -85 -227
4029 -227 102 -102 -130 -151 28 -113 -270 -95 -217 118 -44 -82 -25 45 -187 -95 -57 -62 323 -76 -27 -123 46 -279
4053 -279 -190 -28 20 -97 130 38 -4 -15 -186 118 -119 35 125 57 -48 146 -69 18 -24 150 -148 319 179
4076 179 29 -141 99 173 138 141 48 -142 -158 -142 142 -80 -13 66 276 134 -188 -151 -90 72 -158 87 -12 2
4100 2 -235 56 -295 125 -154 42 211 165 -178 -128 148 -82 47 -52 -7 131 59 -83 -161 47 -110 -40 -93
4123 -93 -154 77 34 -38 -145 94 275 -112 25 328 -83 43 -79 46 143 344 291 -161 -223 83 269 139
4145 139 28 -47 24 -30 342 15 -15 100 -15 127 -91 -133 -87 45 107 -5 109 -102 -134 82 -19 -207 222
4168 222 -207 84 -17 63 49 138 44 134 -285 22 262 46 -79 -80 -85 104 -31 -371 -8 11 190 148 -176 237
4192 237 78 55 -65 -55 107 217 -73 40 -218 104 22 -93 24 -114 104 131 -119 -162 136 219 -85 -53
4214 -53 44 -425 183 -217 -15 -103 -45 -1 -51 202 79 83 -150 227 -9 -19 127 -320 133 -201 56 92 -301
4237 -301 228 -45 -41 246 183 -188 37 -55 116 -18 9 -78 -13 -195 -31 -195 -56 141 2 -149 -134 -72 22
4260 22 169 30 -140 195 -152 -17 285 -138 -102 -177 167 -277 31 -49 -148 -146 105 -75 -2 -30 108 -61 -152
4283 -152 27 -113 -228 -189 257 -215 -85 -69 15 164 153 73 35 -153 -65 -99 -147 27 53 103 37 156 99 206
4307 206 188 39 -92 -36 -167 49 228 2 315 -96 252 -72 32 -267 -98 142 114 69 -133 -28 -44 121
4329 121 127 64 35 47 4 116 -127 71 -151 77 68 193 20 -124 -163 21 -25 49 -352 23 -135 26 92 -252
4353 -252 103 9 -36 -83 -48 5 -23 -128 -48 132 105 106 -232 261 96 23 -71 220 -184 188 -194 -72 42 -348
4377 -348 -16 175 74 58 214 -68 35 -1 -170 35 -228 19 -202 -20 112 22 -79 12 144 139 -43 273
4399 273 -158 -148 -115 -71 111 3 -26 -276 82 263 295 -37 -397 127 22 106 388 161 -77 71 5 196
4421 196 -30 232 -172 -21 -45 -5 -117 261 173 60 -47 61 45 -293 -23 215 38 137 220 -72 1 -104
4443 -104 8 98 -69 -319 63 -155 -148 123 -150 150 -175 -39 -42 -214 -103 -59 -173 0 199 122 52 -185 106
4466 106 -40 -110 -29 27 -186 -411 59 -116 -270 185 129 164 87 -23 -182 -206 -13 -21 33 33 6 -151 152 156 94
4491 94 40 43 17 25 141 44 96 -123 103 -246 -161 119 140 41 152 -73 -340 -130 158 155 55 -23 304 293 -9
4516 -9 50 79 168 73 -63 23 49 -75 -22 210 20 -196 -30 181 -165 190 140 -217 -101 6 97 37 -7 3 133
4541 133 171 48 -77 -31 297 440 -153 -4 -88 -110 -85 -109 30 142 -65 22 126 5 142 63 -45 111 125
4564 125 34 -107 -41 -210 -179 -128 143 195 117 27 52 199 235 35 272 -12 16 -171 -37 150 -9 -97 -2 -99
4588 -99 -38 135 -3 -66 113 112 -27 213 65 -123 56 -194 -165 73 37 -203 86 127 -230 153 -117 -67 -92
4611 -92 -98 131 -155 -84 157 -41 -222 -139 -121 9 -123 -77 -114 171 73 181 -24 -157 -90 -175 61 -122 -48 -152
4635 -152 -131 108 96 -51 -60 -148 248 -107 -101 64 119 225 -29 -299 -251 -49 90 -297 356 118 111 103 -11 -27 -7
4660 -7 -105 70 -14 -42 -214 103 -336 61 10 -226 83 -127 7 85 42 185 -196 -16 70 12 185 -162 -13
4683 -13 125 -70 -116 14 -76 -56 -96 -84 -47 -91 9 41 20 127 -190 -41 262 149 70 60 173 20 -367 -381
4707 -381 107 -10 41 -9 -21 365 -203 52 85 43 -16 -31 -106 64 -47 -37 -105 33 65 -124 -45 -134 -50 27 211
4732 211 189 -56 115 129 -68 -217 -62 97 64 -37 167 -48 -170 -64 165 35 -45 -17 -31 -305 6 7 -144
4755 -144 63 89 27 94 12 25 -217 -4 -52 -125 -206 -52 295 -204 34 2 64 53 79 -67 -111 35 -124 -21
4779 -21 126 39 -69 -94 6 -159 32 -402 -203 201 -148 -52 150 -106 104 82 -10 246 -156 -120 -265 -45
4801 -45 -120 161 279 127 36 244 184 -70 27 -112 120 -56 -146 96 -17 -150 37 -189 -66 -64 27 -67 -187
4824 -187 62 7 220 179 -289 -183 231 -116 138 -268 -73 48 -113 252 1 -168 -87 -28 62 94 -83 15
4846 15 58 34 63 341 -15 -20 108 60 215 -109 -18 -170 -30 80 329 88 -110 -8 139 -16 -124 -145 -103
4869 -103 17 293 -284 -40 -147 -46 281 -60 -69 86 -41 -21 -93 -77 -79 58 119 -214 -121 -78 -203 229 -32
4892 -32 -228 -6 -153 208 223 -111 -28 -132 20 -146 -114 377 14 282 -43 77 -114 -169 124 -33 367 -213
4914 -213 103 -149 -126 -1 -7 19 -31 -206 103 150 163 -72 241 -25 -70 138 -173 7 -54 89 118 -137 134
4937 134 170 12 -4 -47 -76 107 340 -9 0 -156 40 110 200 208 -28 68 -362 -97 -146 63 103 1 -4 180 62
4962 62 -47 148 -22 -19 -57 -144 40 182 -103 -246 -60 16 1 62 -51 -236 301 107 31 -231 -28 114 45
4985 45 26 26 -25 100 -124 -105 43 -8 -113 52 193 -271 -194 100 -64 72 -50 79 -75 -23 -5 -69 -24 5
5009 5 -129 45 53 -69 41 -274 107 -13 -32 -56 -55 -289 -57 228 -100 -114 -6 -94 -133 -195 -46 -63 -254 -124
5033 -124 -244 -23 -47 -9 -12 93 122 -205 118 -89 -49 -61 125 370 274 11 256 -146 125 123 -89 -34 -208 -8
5057 -8 -46 76 -216 -259 -186 -35 -22 305 50 -55 113 77 -94 197 -42 -202 63 -256 40 -130 -177 -362 58
5080 58 259 -201 -40 132 104 -61 34 193 -90 -204 -35 167 35 235 -180 34 -91 -188 241 143 -61 202
5102 202 191 -78 -57 -181 327 68 151 -33 29 312 -55 -95 -55 156 -40 58 -126 -19 174 -116 34 -73
5124 -73 -65 -106 19 215 -224 -319 -61 -388 -354 -426 -39 1 -25 -61 -32 238 424 -54 -45 -62 -89 -49 -33 138 -215 -79
5150 -79 -256 -219 146 53 85 242 12 84 -147 -66 -83 19 -32 -65 110 -93 -132 195 26 -30 82 -155 96 -18
5174 -18 -58 -19 -7 96 -157 5 -121 37 -30 -26 -127 6 61 16 307 -94 -114 46 -73 -40 149 -62 196 -260
5198 -260 -62 175 53 86 193 6 -9 27 226 -49 166 -78 18 -180 -90 202 218 -54 7 -115 -96 -18 92
5221 92 -133 -230 -392 -258 154 147 15 -50 48 -189 124 24 47 -116 123 -27 -44 -32 65 -7 -334 4 42 -52
5245 -52 -136 -37 73 -61 33 -250 -104 -491 -63 -168 87 -1 197 -212 27 -67 -102 134 -33 -117 -116 -134 -43 -228
5269 -228 -186 116 -14 176 39 -88 -136 481 254 -22 -63 -62 128 80 151 -337 -113 -276 292 65 47 -36 -23
5292 -23 -92 -179 252 33 -207 55 116 178 186 79 82 -75 -284 -55 -204 -109 -149 -55 -121 -59 -25 103 -110 -187 176
5317 176 -116 128 -193 122 -16 -40 -137 -49 267 -110 159 15 33 43 -132 -96 -117 104 181 21 -30 -175 23
5340 23 -76 -105 143 -87 10 -168 -78 121 -77 -53 50 108 -291 184 57 3 74 -29 -30 104 -30 5 -134 -141 150
5365 150 -11 189 -141 93 99 47 -79 118 -135 -48 -47 111 -43 135 217 -143 134 -187 -85 64 50 35 166
5388 166 -8 151 374 10 -4 12 101 219 146 -198 122 -144 265 -60 -144 37 -296 39 197 -6 65 6
5410 6 -35 68 -1 56 63 -85 107 -32 54 -140 -107 -32 244 112 -304 -39 -64 -35 -61 -366 -82 -165 55 24 -40
5435 -40 17 -278 167 164 25 -18 -23 85 -123 6 -81 -327 -176 141 -79 57 -92 57 -196 -242 -18 -31 98
5458 98 132 210 -126 76 301 48 -67 -240 -85 116 -133 149 120 127 -337 -67 -2 -125 -119 -100 95 -158 -123 17
5482 17 176 -53 -35 -295 -199 3 21 66 -32 -146 146 -78 -8 216 37 56 249 -60 -55 39 -156 63 -53 -125
5506 -125 135 -86 -38 211 -48 260 133 -17 -30 254 72 -62 -224 -247 129 -120 152 -65 138 -68 50
5527 50 -103 -40 94 79 -58 -86 249 -194 -46 122 -19 30 -80 -98 -12 -160 -98 29 -480 -17 100 -19 137
5550 137 101 -122 1 101 -91 -206 46 17 -368 110 107 44 -29 -123 81 146 -49 109 74 2 -234 -164 -268 73
5574 73 -154 32 367 -159 -61 -194 79 -36 -123 -236 -96 25 -101 98 -297 91 -316 4 -61 -65 -256 -214
5596 -214 57 38 -355 203 6 20 122 -43 72 -38 -73 -35 65 168 68 -25 -53 -157 34 24 -127 -57 32
5619 32 -177 153 95 -59 86 -5 148 105 -179 -85 183 -58 -24 -169 52 151 -98 -228 -168 2 -34 316 -150
5642 -150 53 127 315 117 44 -120 56 173 -159 -359 16 -111 -92 -181 38 60 16 -205 199 -14 48 -147
5664 -147 -42 51 -125 230 88 62 -52 -132 -120 40 -71 -183 18 -168 -33 10 244 -167 -46 117 241 -54
5686 -54 -191 -125 -22 -212 -123 44 27 40 141 -166 -74 -37 46 -116 -35 -23 -150 -70 -72 -9 -63 -177 44 23 13 -54
5712 -54 -32 19 -14 -144 -17 166 -71 86 -77 -28 -184 75 263 39 -225 134 85 61 5 170 -55 143 -99
5735 -99 -80 -170 -7 8 -27 -47 -191 20 179 -240 4 -70 -64 25 -277 -85 -18 167 264 -1 181 -62 135 -123
5759 -123 19 -141 68 -19 8 -2 -291 -14 -125 -126 -45 -11 -129 -274 19 -55 -134 -20 230 76 -51 219 -104
5782 -104 58 168 176 -41 -134 -46 -4 174 66 -86 40 -43 -93 66 -203 -170 82 -158 -24 291 -3 17 8 124
5806 124 204 -283 -16 162 9 -118 35 -169 -73 -9 -202 173 -170 8 -7 67 -37 -307 187 52 -212 -173
5828 -173 153 -12 -54 25 126 61 348 222 12 -153 -130 69 -256 -163 -28 16 -111 52 -203 148 -130 -79
5850 -79 209 -38 118 -39 12 273 64 59 -194 -59 -145 -13 -77 29 -111 -154 269 -143 -256 71 -120 -53 -59
5873 -59 236 131 39 -6 -102 137 -55 -175 -112 20 -1 -81 -82 84 78 135 52 151 30 61 26 156 60 -170 -123 -110
5899 -110 -211 -139 -67 55 -3 205 105 -40 -29 -13 74 -69 -103 123 57 -219 -193 136 -81 75 -169 59 29
5922 29 -24 -56 -171 -172 -81 92 -155 129 -66 -60 64 72 -95 126 41 236 -74 86 192 -72 -16 180 -100 -111
5946 -111 -364 9 -159 -31 -90 -113 -2 64 47 11 -65 -169 -128 -19 -288 -219 -31 -64 -131 -89 -10 141 233 108
5970 108 6 -235 102 309 85 89 11 -220 -103 -22 57 -100 105 107 100 178 62 277 64 56 116 80 -230 -59 90
5995 90 -69 173 -170 47 214 -352 -56 -96 -227 196 102 109 60 348 -316 -260 38 164 82 78 -58 99 -123
6018 -123 226 106 -7 -232 -221 79 82 204 -91 30 -42 -81 -169 99 -100 113 -135 102 130 -53 -69 -176 -177
6041 -177 -47 -375 -279 117 21 289 -47 30 -342 -37 117 -84 213 -14 -231 -41 83 -133 206 -37 343
6062 343 68 -101 -228 -21 139 180 88 43 -105 292 229 -44 -149 135 -81 2 -19 41 112 95 -53 -83 -212
6085 -212 113 7 75 -106 -26 -87 156 -26 -45 86 285 368 -166 97 227 -9 72 -46 37 50 -312 236 -9
6108 -9 17 -300 -140 -105 30 258 55 43 -186 -80 93 90 26 -10 42 71 -145 -90 -57 -2 -81 29 -247 -14 -36
6133 -36 27 144 107 -155 -8 29 -61 -136 -145 -72 -80 95 -110 -2 -110 -18 -27 222 38 -72 -296 -284 -3 60 120 -193
6159 -193 -186 141 85 51 -164 159 122 -48 -9 -255 -369 132 140 214 -83 25 -178 -150 -33 159 -127 206 170 255
6183 255 39 162 -11 168 28 -226 50 -6 -64 -151 308 43 79 236 -43 -84 -141 80 21 335 61 -178
6205 -178 -203 -36 146 -122 11 46 149 36 19 -55 -81 31 458 162 29 115 327 218 140 -182 -32 -143
6227 -143 124 -185 -15 67 73 -121 -90 -143 -263 63 -137 70 54 -41 118 -5 14 254 -127 196 -162 -9 -6
6250 -6 -143 -9 -18 104 -93 26 163 18 20 -43 13 -279 -48 119 -368 122 -206 -87 -57 186 -240 -31 -135
6273 -135 -86 138 104 251 84 -154 -369 -150 -132 -163 77 -356 -191 -277 -13 81 45 95 -60 250 233 -6 -49
6296 -49 15 194 -179 -181 -120 115 -131 -293 12 -248 231 11 101 -40 107 -83 -106 -332 -73 -81 118 -121 84
6319 84 1 -258 262 -62 237 -75 -121 65 -109 66 -75 -158 -37 129 24 169 211 102 7 12 29 12 149
6342 149 -159 62 -8 137 322 -264 -76 76 -220 -162 115 165 -34 72 30 138 -161 -141 47 169 -96 -78
6364 -78 68 190 7 -181 -24 37 110 -36 128 72 214 -269 126 -148 112 -102 258 61 -131 88 139 181
6386 181 -205 27 -72 -191 -74 14 49 261 1 34 37 33 159 122 -210 8 -183 -8 216 -67 151 -107 58
6409 58 -177 126 224 -211 12 83 207 -176 -104 102 43 -102 72 98 -26 188 -10 164 185 -34 83 -59
6431 -59 30 -86 95 140 122 137 -74 -74 1 -181 167 -47 73 95 191 266 -184 -132 -136 72 -41 -96 50 118 -181
6456 -181 144 190 -358 -30 -134 -101 -177 -67 355 -25 -24 -124 -256 44 -59 32 78 246 15 -89 -32 11 -122
6479 -122 216 10 36 -126 132 58 -71 66 -180 143 61 256 -29 -84 -70 -5 257 247 -208 -25 40 -9 125
6502 125 45 -157 6 4 -110 51 178 131 -3 183 85 252 21 -123 -208 246 -121 238 -21 -32 62 209 -28
6525 -28 58 103 153 28 -13 205 -147 76 -12 -144 59 149 92 -42 -147 -259 125 -104 -4 37 235 73 49
6548 49 23 -148 -99 -212 -167 -196 -84 -174 11 305 -180 -9 -260 231 230 103 236 179 21 7 -46 -203 35 48
6572 48 -48 96 4 -130 113 30 202 41 137 172 106 -87 93 32 -3 267 1 -87 80 21 -9 11 78 37 -70
6597 -70 -81 22 39 -60 -199 42 90 79 57 93 331 -7 -76 -8 143 27 56 -179 -127 -302 -207 -195 -34 -36 108
6622 108 53 -258 137 -245 -333 -113 272 157 -258 -7 -136 -163 211 124 -119 -283 -104 142 156 109 -131 -2
6644 -2 44 -3 -29 -64 18 -95 173 135 -195 63 226 114 32 -260 -214 -2 207 110 75 173 -47 12 -185 20 -223
6669 -223 84 117 -85 5 24 -158 212 148 -10 135 -227 8 -16 -327 177 40 98 -33 -180 -245 83 64 59
6692 59 119 53 -233 221 160 -100 -231 -94 -48 -284 -17 -301 167 -33 191 -40 196 137 143 -164 -13 7 -254
6715 -254 198 -76 83 284 -160 153 -142 136 148 -88 -117 -93 36 65 3 22 71 -110 22 38 40 20 16 -102
6739 -102 38 -134 -171 -15 147 -12 16 183 12 64 74 5 -125 122 51 -54 185 183 115 54 -45 -156 133 71
6763 71 146 87 -68 136 160 334 143 291 7 348 -60 -98 -38 -116 -213 117 268 270 -234 -12 -196 -223 58 73
6787 73 169 -55 -75 -23 -55 -189 137 149 222 -271 -203 -51 241 57 78 85 -16 -93 -35 -129 -90 -129 79 -133 113
6812 113 86 -135 -114 29 50 -170 106 93 7 -12 -124 -15 61 85 -113 111 63 369 1 205 -115 203 -33
6835 -33 -25 8 -1 -48 -58 -166 147 186 33 -351 229 -108 218 -279 -324 8 -183 -15 -133 -117 -243 74 -27 175
6859 175 151 133 -31 83 205 10 -234 -81 191 -161 123 352 -97 -13 105 -164 33 -88 -48 -222 -7
6880 -7 136 -46 -167 -21 -39 65 230 22 139 -85 -29 116 38 -47 -68 -201 -46 135 -98 -3 -268 -42 -118
6903 -118 -60 -97 -18 -73 -85 70 -112 168 -89 -58 -18 104 132 9 105 -52 -83 -91 28 -116 -82 -44 246 72 273
6928 273 135 114 79 -39 -56 66 83 -189 -34 346 55 10 -99 67 -190 114 1 -110 217 -62 81 -168
6950 -168 -223 190 -72 76 -114 -76 -128 -78 126 181 153 114 94 244 130 -169 -4 -59 77 183 -103 -14 176
6973 176 10 27 -1 143 70 5 166 -78 66 -59 213 -64 -35 159 -24 -152 114 -65 281 81 -126 -111
6995 -111 -216 41 44 263 126 -50 -137 -3 22 253 -193 -117 40 -240 -89 115 167 -80 -135 76 -72 94
7017 94 -43 79 211 -226 337 27 -62 -15 42 33 309 93 6 76 -214 -220 -98 232 56 297 36 -112 221
7040 221 46 108 -52 96 103 -80 -205 -97 51 16 144 237 -132 -214 179 -120 45 161 -103 -222 1 68
7062 68 267 -210 119 -102 76 210 56 58 4 -155 80 144 144 141 -31 -133 -147 -19 82 -126 0 111 154 -210
7086 -210 118 -53 -155 97 -87 33 100 64 -15 -138 -55 23 180 -124 73 278 -188 187 24 -32 -144 -77
7108 -77 122 164 4 -8 184 -214 285 131 -277 104 -82 222 -41 145 -193 -2 -145 48 65 85 209 329
7130 329 -69 -93 -28 -102 -75 -309 356 -51 152 48 248 -44 94 112 -28 269 6 -1 -180 -20 86 -147
7152 -147 -75 -206 -26 -79 30 -56 -139 58 17 65 -111 79 100 216 269 -151 -6 -148 6 20 -62 -53 114 322
7176 322 -71 -179 207 -182 24 -48 -14 -355 134 -21 4 -154 -138 -82 -13 42 -245 -127 9 -217 141 -123
7198 -123 -348 137 -23 -89 -76 -123 -271 236 -12 -203 72 -176 -60 -21 -4 67 -103 -71 61 14 99 229 101
7221 101 -30 -238 0 61 204 180 73 -230 -115 266 -101 203 -215 213 300 71 123 -38 139 -75 -66 -279
7243 -279 176 -17 -334 -112 151 310 -103 159 56 -79 196 69 56 -153 -44 -60 -32 62 118 100 56 103 227
7266 227 -308 4 28 -38 4 167 31 242 2 -89 -144 168 293 -7 -107 -137 -69 -133 -9 189 31 75 124
7289 124 37 102 192 -199 -34 -165 -31 -369 8 10 -148 -20 -252 158 50 106 12 292 -81 30 31 170 -68
7312 -68 -491 -109 123 82 -324 76 7 -9 4 98 4 134 -103 128 147 -55 116 100 120 -156 135 439 220
7335 220 -48 252 41 68 -134 61 -22 32 139 -55 95 157 -193 -109 224 -49 -26 -41 -58 -208 -178 118 -38
7358 -38 242 225 207 -63 -118 -160 35 112 188 -101 74 17 251 -37 160 232 153 -180 -139 8 -47 -198 -135 -60 -135
7383 -135 -244 -199 122 -59 116 -169 -97 57 114 314 -65 -193 109 -178 224 -127 -286 -113 173 310 221
7404 221 -191 76 -87 -67 272 -127 -54 -226 -235 95 -109 -76 86 28 0 157 -192 -152 4 -83 -26 -111 233 -68
7428 -68 -6 178 -59 77 198 -58 -114 -83 -145 -52 13 -107 -246 -84 129 -59 44 170 -54 -148 180 -156 123
7451 123 334 -59 -112 214 -225 144 220 22 -50 -376 113 -239 76 10 -36 -60 -140 -31 62 -58 291 -36 11
7474 11 -220 82 110 -188 146 305 -102 -26 21 142 -47 -91 143 77 -138 204 -238 -342 -82 -132 119 21 -21
7497 -21 195 -54 95 72 72 -187 -1 -75 107 -149 11 -63 -151 79 -19 -136 -7 -101 -41 176 95 140 -6 -167
7521 -167 -59 -91 -53 -204 -71 -22 -169 81 -63 145 253 42 -33 -286 -32 -94 -125 198 -83 180 209 -15
7543 -15 -110 -48 162 -114 43 -42 -19 190 138 -252 235 -79 -11 83 136 -78 61 -10 49 85 -33 171 105 216
7567 216 181 -290 -254 71 21 -157 74 57 155 -7 32 43 -97 -293 86 231 -129 -78 101 -292 -69 46 -117
7590 -117 -177 -28 56 -58 -203 -93 -34 132 161 97 -104 -21 -21 171 24 151 -92 -174 -351 106 -104 -5 163
7613 163 -37 139 40 57 23 80 96 -84 32 102 205 66 195 140 167 48 -75 -187 -19 -103 -7 216 -33
7636 -33 -8 -24 -64 -30 138 -70 -147 -183 -69 -121 -72 15 150 -168 -130 53 32 27 -182 109 86 -103 1 54 -45 -101
7662 -101 45 -171 370 -186 327 -22 -308 119 249 124 -393 -71 51 -39 -97 180 -96 148 -161 -154 143
7683 143 47 -47 60 -398 -178 -10 -146 28 -11 -85 121 -75 -139 -168 -100 -98 -105 -85 1 -112 -77 86 232 -233 -195
7708 -195 -265 -58 37 -283 -139 2 483 340 -215 -49 3 210 158 -197 122 97 -167 -36 -105 -49 243 -292
7730 -292 -56 -193 197 91 121 -36 129 -203 -127 139 64 -109 -137 -27 -257 45 223 -364 119 -175 -39
7751 -39 339 -34 27 -39 -230 -109 -42 -142 -165 62 65 129 76 -219 78 -372 218 112 126 139 82 -74 22 131
7775 131 -22 -407 175 -23 231 167 262 138 -34 28 -230 247 -111 20 -196 -366 -239 -100 264 263 114 -227
7797 -227 151 119 -183 -15 71 190 -72 -34 66 -88 -97 7 14 148 211 -149 -229 181 -178 -20 -17 -99 -180 -78
7821 -78 272 -38 263 70 129 -100 -117 -111 -154 -40 180 -6 47 -35 -125 161 -147 35 141 101 -128 156 -124
7844 -124 -236 156 -43 61 109 -5 -76 -385 -75 -31 -128 32 -286 -32 168 -241 -303 88 361 51 48 -258
7866 -258 89 226 57 84 32 86 105 -181 -48 151 -42 135 -112 -211 179 -131 -25 -230 9 141 -141 -136
7888 -136 195 182 109 -14 80 272 -307 66 -117 122 47 -178 107 97 -17 286 -171 209 -99 109 7 -230
7910 -230 -52 -52 -280 177 -118 -256 120 104 -228 -19 63 -165 423 -81 174 170 171 47 72 -58 284 -72 332
7933 332 -179 -28 37 135 74 -248 89 -53 25 -117 261 70 91 -24 91 22 -152 -43 -196 22 -342 55
7955 55 -18 -20 214 109 93 -89 -38 114 43 -60 -318 183 106 173 -27 101 131 -60 -27 -70 -21 -28 -17 64 -69 114
7981 114 32 28 -179 87 -60 -179 193 -14 29 135 -89 -238 -98 -249 271 40 157 -232 -29 -113 -45 -94
8003 -94 248 2 -113 -162 -153 -68 226 225 51 -123 -36 18 -36 44 180 147 300 -89 306 -34 -40 -38 -273 38 85 -60
8029 -60 -184 115 -16 -164 160 32 -251 112 115 -145 -175 29 -109 -130 -209 -55 23 240 -102 72 63 43 -261
8052 -261 -49 -26 -184 -67 -134 -75 -123 -254 -42 103 -238 72 -152 -90 -101 -77 -161 220 -36 137 -236 -56 112
8075 112 -187 6 -197 116 -37 242 -146 -25 -70 100 28 -112 -51 -35 56 273 -108 -24 145 82 270 350 89
8098 89 -201 -222 216 -25 39 -299 -287 124 64 62 -21 101 -203 65 -260 217 38 201 -25 190 2 39 161
8121 161 36 61 90 34 127 42 4 12 110 -192 -220 -20 -119 330 -150 181 263 -37 -17 -152 302 94 -207 197
8145 197 -85 -141 51 50 9 208 -98 12 -165 67 13 380 129 138 -97 184 -168 61 215 29 144 -23
8167 -23 -182 17 209 -16 -91 -187 -59 34 83 -7 -77 92 43 -83 -144 -56 214 -181 85 118 77 -163 106 -110
8191a10
$$ Imaginary data points
##PAGE= N=2
##DATA TABLE= (X++(I..I)), XYDATA
0 0 0 0 0 0 0 0 0 0 0 -8 8 -8 9 -16 24 -24 32 -40 48 -57 66 -82 97 -113 137 -155 183 -211 243 -280 317
31 317 -364 410 -467 529 -592 669 -746 834 -931 1036 -1153 1277 -1414 1566 -1728 1909 -2103
48 -2103 2319 -2555 2814 -3103 3418 -3772 4170 -4617 5126 -5709 6388 -7192 8156 -9344
62 -9344 10838 -12798 15485 -19413 25744 -37655 68102 -326582 -526541 10696 234758
73 234758 466711 567008 524224 147048 -244901 -491520 -508187 -417701 -158795 166185 439236
84 439236 512955 425680 169660 -161632 -428164 -479104 -380995 -196603 66583 375599 517742
95 517742 395911 139259 -76551 -266652 -428930 -434109 -201262 106070 304438 372611 357508
106 357508 219947 -37251 -289824 -401928 -359145 -201289 25731 247329 366263 350591
116 350591 223958 13051 -222816 -362271 -333095 -190155 -17888 163689 321105 353297
126 353297 212248 -6062 -179689 -280236 -313102 -236342 -43049 171054 295499 301964 216305
137 216305 60376 -125436 -265041 -299289 -222245 -66368 113136 245420 276512 208518 73697
148 73697 -89577 -230751 -281055 -212610 -68544 84116 204539 263406 226118 93813 -72216
159 -72216 -197534 -245306 -211346 -104589 44872 177112 237013 205689 100748 -38000 -161575
170 -161575 -223212 -201353 -106127 28488 152760 217729 200528 111022 -14925 -134837 -204978
181 -204978 -198822 -118627 2917 118974 189438 189171 118818 5812 -106936 -177903 -182174 -118388
193 -118388 -11066 98173 169908 178714 121922 20302 -86806 -160703 -175111 -125986 -30841
204 -30841 73730 147298 165342 124625 38896 -61382 -137679 -158419 -119483 -39537 52629 127246
216 127246 155266 122616 43825 -47453 -119034 -148134 -123818 -53853 35564 109199 140939 121353
228 121353 57770 -25822 -97745 -131540 -117619 -60581 19946 91663 126912 113467 61401 -12434
240 -12434 -82774 -123188 -115470 -64785 6635 73091 114054 113617 70117 1314 -65366 -105682 -107009
253 -107009 -69738 -6770 57868 99550 103679 69577 9906 -52916 -95026 -101598 -71792 -15682
265 -15682 45673 89322 99195 72637 20728 -37317 -80949 -94271 -72807 -23867 31502 74573
277 74573 89061 71043 26304 -27459 -70192 -86639 -70834 -29735 22169 64935 83755 71620
289 71620 33535 -15687 -58310 -79015 -70314 -36009 10770 52181 73814 67735 36622 -6876
301 -6876 -47548 -70091 -66429 -37945 3768 43791 67321 65889 40368 760 -38492 -62924 -63941
314 -63941 -41758 -4743 33158 58198 61033 41594 6921 -29548 -54630 -59114 -41693 -9305
326 -9305 26326 51602 57517 42411 11995 -22189 -47834 -56069 -42731 -14742 17709 43484 52740
339 52740 42637 16600 -14880 -39853 -49821 -41586 -17985 12246 37268 48466 41353 19577 -9218
352 -9218 -34065 -46691 -41943 -21259 5716 30439 43411 40640 22963 -3199 -27276 -40835 -39140
365 -39140 -22800 1494 24579 38776 38220 24023 503 -22367 -36928 -37350 -24645 -3613 19242
378 19242 34614 36966 25088 4986 -16287 -31511 -34691 -25516 -6290 14514 29533 33141 24905
391 24905 7594 -12482 -27768 -32838 -25168 -9296 10408 25595 31240 25486 10790 -7790 -23352
404 -23352 -29664 -24870 -11323 5880 21175 28297 24825 11557 -5069 -19497 -26948 -24429 -12776
417 -12776 2852 17986 25982 23980 13406 -1418 -15713 -23822 -23620 -14300 151 14106 22596
430 22596 22435 14512 1079 -12460 -21590 -22285 -14969 -1952 11178 20386 21887 15150 3369 -9184
444 -9184 -18984 -21337 -15541 -4066 7968 17049 20276 15445 4914 -6900 -16171 -19595 -15460 -5695
458 -5695 5921 15042 18750 16072 7162 -4777 -14571 -17903 -14999 -7714 2581 12993 17750 15352
472 15352 7212 -2400 -10671 -16032 -15414 -8243 1630 10318 15074 14811 8505 -427 -9095 -14519 -15156 -9381
488 -9381 27 8816 13329 13648 9737 1847 -7648 -13885 -13259 -8788 -2067 5379 12118 14376 10000 1927
504 1927 -5568 -10999 -12796 -10236 -3355 4675 10842 12728 10178 3520 -3710 -9328 -12112 -10681 -5088
519 -5088 3415 9741 11156 9236 5010 -1503 -8660 -12614 -10111 -4309 1699 6945 10602 10632 5796 -954
535 -954 -6880 -9938 -9856 -5959 38 5896 9859 9839 6379 40 -5942 -9084 -8940 -6692 -1677 5004 9161
552 9161 9424 6264 1701 -3237 -8017 -9706 -6708 -1593 3586 6992 8602 7201 2544 -2935 -7081
567 -7081 -8777 -6839 -2649 2353 6478 8347 7173 3626 -1798 -6252 -8129 -6618 -3442 532 5381
582 5381 7825 7130 3818 -780 -4786 -7057 -7047 -4515 342 4709 6922 6571 4456 511 -3483 -6581
598 -6581 -6658 -4871 -700 3495 5933 6320 4457 1393 -2981 -5943 -6816 -4762 -1397 2117 5261 6411
614 6411 5088 1916 -1629 -4980 -6041 -5051 -2451 1244 4486 5879 5185 2560 -1078 -4064 -5535 -5071
630 -5071 -3056 632 3843 5606 5272 3023 150 -3326 -5440 -5259 -3228 -309 2835 5041 5378 3676
646 3676 579 -2132 -4428 -4620 -3709 -965 1845 4063 4900 3944 1347 -1456 -3809 -4899 -3754 -1662
662 -1662 1415 3524 4694 3998 1729 -1007 -3195 -4661 -3781 -1996 518 3241 4503 4409 2319 -112
678 -112 -2980 -4335 -4153 -2536 -138 2085 4000 4002 2557 351 -2199 -3807 -4472 -2799 -434 1909 3573
695 3573 4169 3235 1068 -1653 -3418 -4178 -3106 -1463 1285 3381 3993 3456 1504 -753 -2891 -3947
711 -3947 -3608 -1800 660 2676 3651 3822 1882 -220 -2584 -3847 -3782 -2216 6 2120 3724 3603 2367
728 2367 566 -2009 -3373 -3773 -2527 -497 1536 3176 3650 3040 861 -1504 -3075 -3711 -2951 -1160
744 -1160 1211 3195 3572 3054 1486 -681 -2946 -3735 -3098 -1712 374 2364 3687 3287 1865 -178
760 -178 -2117 -3328 -3438 -2087 107 2305 3360 3444 2312 -70 -2085 -3036 -3450 -2639 -460 1560 3029
777 3029 3290 2376 610 -1356 -2832 -3490 -2473 -561 1245 2419 3290 2831 992 -943 -2786 -2947 -2971
794 -2971 -1021 559 2463 3234 2755 1647 -313 -1934 -3302 -2951 -1690 97 2141 2972 2993 1730 -331
811 -331 -1859 -3139 -2938 -1799 -409 1532 2965 2952 1626 658 -975 -2438 -3167 -2175 -300 1045 2638
828 2638 3144 2165 605 -1194 -2559 -3051 -2297 -883 896 2507 2700 2082 1095 -844 -1936 -2700 -2468
845 -2468 -902 615 1901 3079 2312 1395 -275 -1767 -2668 -2618 -1460 340 1548 2544 2436 1520 -55
862 -55 -1461 -2398 -2604 -1364 -269 1378 2865 2537 1699 233 -973 -2281 -2446 -1741 -272 841 2142
879 2142 2413 1700 755 -978 -1989 -2344 -1689 -574 624 1619 2250 1797 441 -857 -1174 -2449 -1912 -933
897 -933 482 1400 2453 2060 968 -397 -1446 -2013 -2000 -979 -33 1517 2159 2161 843 -50 -1157 -1998
915 -1998 -2105 -1258 135 1174 1780 1963 1395 18 -936 -2022 -1894 -1301 -88 854 1576 1955 1599 289
933 289 -753 -1670 -2078 -1316 -507 517 1551 1839 1514 382 -272 -1382 -1975 -1292 -622 564 1235 1866
951 1866 1728 866 -297 -1372 -1857 -1422 -669 108 890 1422 1576 678 -91 -1060 -1926 -1280 -920 -185 968
970 968 1612 1567 1017 216 -922 -1719 -1657 -1265 -288 663 1561 1718 1148 388 -678 -1464 -1465 -933 -292 505 1118
991 1118 1590 1663 333 -731 -1276 -1273 -1150 -372 453 878 1442 1267 385 -595 -903 -1347 -1310 -497 396 1248 1522
1012 1522 1153 717 12 -964 -1324 -1287 -718 140 855 1344 1307 785 -18 -621 -1238 -1587 -695 -279 722 1191
1032 1191 1303 680 -99 -711 -1221 -1136 -931 -235 503 1315 1198 960 -71 -530 -906 -1335 -935 -530 490
1051 490 922 1254 642 324 -125 -732 -1165 -836 22 349 790 1059 573 439 -314 -1046 -1067 -811 -196 152
1071 152 775 1046 945 384 -422 -762 -903 -749 -602 200 622 813 775 630 -90 -610 -698 -915 -749 51 701
1092 701 540 1039 507 222 -618 -970 -1161 -419 -3 650 988 704 846 103 -380 -850 -610 -822 -166 632
1112 632 847 1077 757 116 -269 -1024 -864 -911 -78 440 593 715 472 57 -481 -404 -1043 -657 -60 631 736
1133 736 913 436 190 -337 -573 -695 -658 -470 143 597 830 718 346 -37 -456 -925 -620 -228 47 338
1153 338 837 903 96 73 -438 -693 -505 56 59 333 942 259 218 -186 -434 -691 -470 -556 -74 466 699 539
1175 539 55 -86 -571 -662 -742 46 168 602 525 611 -37 188 -331 -582 -565 -420 -234 425 610 449 452 -97
1197 -97 -301 -830 -386 -270 -203 312 893 458 297 167 -522 -569 -696 -604 -147 139 670 678 662 258 93 -426
1219 -426 -600 -352 -448 342 349 472 400 -10 -307 -228 -441 -299 -24 240 387 417 152 35 -55 -657 -236 -389
1241 -389 -434 138 593 576 193 59 -341 -511 -491 -209 -101 140 540 662 712 247 -198 -169 -426 -467 -412 355
1263 355 302 587 248 364 45 -356 -327 -736 -199 255 202 479 381 -72 -164 -195 -648 -592 -340 -229 161 213 394
1286 394 199 -18 -429 -91 -357 -243 -126 523 275 262 212 -68 -270 -415 -421 -145 57 408 229 393 204
1307 204 160 -244 -188 -446 -419 129 178 120 437 335 -22 -16 -307 -305 -307 -9 -208 -13 391 298 65 -88 -22 -122
1331 -122 -307 112 273 216 515 380 112 95 -67 23 -116 -239 317 27 385 224 404 -124 -275 -12 -244
1352 -244 -17 105 105 155 77 14 -163 -125 -255 -344 -201 -83 360 485 2 7 -368 -314 -232 -332 -99 -35 222 412
1376 412 227 -208 -37 -100 1 -174 -66 -12 269 -23 270 285 -14 -66 -15 -181 -39 -144 356 154 96 18
1398 18 -274 -291 78 10 -13 138 193 78 -306 -268 63 -301 107 -133 -189 85 89 61 390 177 4 -121 -225
1421 -225 -60 -79 -11 274 296 323 -5 33 -127 -112 -248 73 374 -32 178 -114 55 117 -126 -120 -238 -117 212
1444 212 271 72 87 -58 -14 -288 -149 -335 -88 290 -30 70 22 52 -119 -117 -98 -96 110 -173 252 -35 133
1467 133 107 -321 194 -108 192 -130 178 248 420 229 72 -34 69 -135 -220 -179 -101 180 347 44 -49 -164
1489 -164 -207 -78 -284 -164 84 181 191 267 62 -41 113 -219 -74 -200 -306 308 227 215 -75 -115 29 93 -90
1512 -90 37 -182 44 31 72 43 163 7 -83 -312 -147 -223 105 134 141 53 -185 159 -275 -464 -173 151 -79
1535 -79 415 61 330 -209 -489 -179 -348 -283 -251 -76 231 226 157 225 1 -399 -215 -116 -205 184 308 535 243
1558 243 253 -130 -201 -165 -103 -284 200 280 196 211 -26 -87 -293 45 -49 244 73 231 276 241 28 -2 17 -211
1582 -211 -265 -87 -44 172 452 405 25 40 -232 -1 -186 -87 36 69 174 273 344 193 -418 -107 40 -275 -264
1605 -264 -120 219 178 134 -52 -204 -403 -8 -1 -91 142 327 331 80 125 -58 -220 -338 -354 89 -121 163 23
1628 23 184 -36 -19 -10 -264 -79 228 18 235 225 159 5 -149 43 -223 -228 -267 122 452 208 184 163 -212 -225
1652 -225 13 -136 -128 48 202 405 182 -50 -129 36 -132 -215 -96 -99 -83 328 38 -47 8 -104 -267 7 -132
1675 -132 13 27 335 383 78 268 -27 -130 -109 -24 68 275 79 210 148 -177 -274 -258 -387 -182 51 -38 434
1698 434 119 125 -206 -163 -301 -110 -376 272 185 167 85 353 -38 -44 -122 -266 -79 115 -44 214 188 42 87 171
1722 171 -57 -230 -273 -55 -52 -21 -55 234 191 137 -424 -148 -211 -266 -31 1 -23 -109 65 -21 -5 -263 -348 39 121
1747 121 55 328 -82 132 132 -54 -136 -37 -17 166 -45 308 187 112 -246 -274 -172 157 86 17 250 333 76 116
1771 116 -91 -18 -212 -47 17 -97 -109 78 71 -101 91 -15 36 -62 -221 -214 9 100 100 25 45 -234 108 -99 -474
1796 -474 187 -130 146 -66 -6 44 -321 -185 114 -179 -233 107 218 161 10 37 -20 112 11 190 -231 64
1818 64 203 -80 108 151 -104 -16 100 -256 222 -17 -332 19 -128 -64 34 2 -62 -14 46 157 301 98 -6
1841 -6 -216 -23 86 -38 -20 24 -231 78 46 -84 -132 -125 -46 304 173 62 171 25 302 -16 -303 27 106
1864 106 14 -85 183 153 42 -98 248 -159 -130 -173 236 -174 46 141 162 -99 -44 215 2 29 -151 117 5
1887 5 41 -257 -201 -3 2 -348 -233 -103 -178 53 126 -2 -111 56 -424 -46 -20 26 136 367 84 4 85 -291
1911 -291 -132 -11 -185 -284 126 -32 135 8 -122 -155 -167 -358 -376 -150 20 531 247 218 179 -59 147 -79
1933 -79 -117 -15 157 209 303 273 34 97 218 -97 26 -232 71 120 -22 251 221 251 -277 -34 -141 -10 102
1956 102 -253 -8 54 266 -291 -121 -265 -357 -36 -28 -208 326 124 202 195 -68 -177 -542 -55 18 235 180 140
1979 140 176 166 21 -134 -221 90 130 151 168 -98 342 207 -188 -97 -96 139 -211 170 324 228 141 105 140 -41
2003 -41 -343 -265 -166 127 257 85 261 -41 -107 -276 -110 -157 -42 124 178 223 138 107 -74 -4 -268 -43 -210
2026 -210 16 379 -29 373 235 365 -129 -110 -246 -254 -343 -5 288 230 172 214 146 -387 219 -383 -104 -22 427
2049 427 337 242 -17 -101 -148 -308 -242 -67 -48 111 279 223 49 -125 26 -451 -312 25 125 122 65 181 -34
2072 -34 309 -120 -186 -223 -173 -125 -26 163 332 295 24 -190 -404 141 129 -51 197 379 83 228 -36 -136 -345
2095 -345 4 9 12 169 247 173 297 -47 -125 -132 -195 191 70 74 -93 242 404 3 -241 169 -228 54 192 31
2119 31 181 89 136 255 -49 -466 68 -309 -299 19 129 310 -30 -179 -171 -324 -350 -238 -43 253 221 176 341
2142 341 244 3 -40 14 17 -148 -89 -54 325 18 161 -11 -130 -117 55 -156 102 16 180 -21 336 -204 -286
2165 -286 26 -107 -64 -47 130 226 145 171 237 -2 -288 32 55 117 147 133 293 120 -156 -203 -195 -32 -98 187 124
2190 124 174 99 36 114 -178 195 -243 32 -139 74 88 -54 -62 182 47 -293 28 -109 -22 50 132 198 52 -18
2214 -18 30 -121 12 88 -187 -52 22 -29 26 -239 0 -18 -93 68 143 -183 435 53 145 93 -14 198 82 -201
2238 -201 33 207 25 -184 57 355 -20 15 -99 -1 239 60 210 15 268 198 -95 180 -68 -78 -146 -333
2260 -333 -27 -105 95 0 36 -58 59 -46 -28 24 -16 -211 -36 37 55 -86 56 101 -89 120 -137 -113 147 92
2284 92 -157 53 22 7 -1 142 -158 146 -249 -78 211 74 137 -123 -25 -113 212 29 252 28 87 -119 -53
2307 -53 -132 -105 -19 -26 -366 -325 136 -62 76 60 -106 10 174 228 128 11 -251 15 -166 -151 -39 -145 117
2330 117 165 320 -110 127 66 -157 -64 20 -140 106 -216 144 -4 -139 121 227 224 -175 -414 -14 80 315
2352 315 294 47 -83 116 258 -63 235 53 210 131 -150 -82 425 18 23 117 100 -96 125 43 73 33 172
2375 172 260 129 12 -235 46 55 293 -322 73 100 148 0 109 -25 144 240 144 198 -129 82 -10 73 -249
2398 -249 123 -60 75 33 106 54 -47 77 -176 -166 128 69 -142 -65 23 170 -186 -179 99 -23 5 89 -29 -9
2422 -9 -288 73 -91 19 -246 -100 93 123 92 -240 10 -149 78 247 29 -3 -63 -104 143 -50 -29 64 -170
2445 -170 -134 137 -6 -35 -60 88 210 -86 265 -18 -137 37 -91 70 -128 -103 142 -6 63 -63 9 72
2467 72 113 40 154 22 225 -66 95 -7 206 278 0 118 -44 -206 -189 -46 -68 -50 -130 -51 61 -81 -146
2490 -146 71 69 -111 -31 -53 -154 32 -206 -12 -197 -34 129 91 201 -135 92 -111 59 158 39 154 173
2512 173 44 23 170 -42 -141 -36 316 32 77 85 195 10 -204 -115 52 -14 287 146 60 98 15 15 -46 23 -335
2537 -335 -100 -107 67 -6 94 -37 -43 -294 48 112 55 213 262 -102 -92 -120 -103 7 -132 -428 -262 38 124 194
2561 194 295 150 -50 -92 169 -139 -78 2 4 -167 41 64 -93 -140 -232 -185 70 56 3 194 -24 -46 137 210
2585 210 -30 10 -78 1 193 -35 119 -252 281 -145 44 24 -241 19 132 334 204 -87 29 48 -162 291
2607 291 185 -280 116 196 349 -165 39 -66 -106 -191 50 53 -81 114 -215 156 -266 -108 -225 -35 101 -119
2629 -119 151 264 264 -164 114 -266 -313 -209 -97 -227 -48 -37 67 -26 221 14 83 -89 -263 124 71 -35
2651 -35 -214 -139 -31 -258 214 -69 -341 -70 -8 -103 249 203 -294 -89 -30 118 9 -38 226 231 26 -116 168
2674 168 77 34 80 -194 -57 291 207 21 197 106 196 -180 -215 73 290 -137 6 258 310 -111 96 -251 -134
2697 -134 -25 -28 250 -51 -69 255 101 36 152 -215 8 -26 20 154 225 -162 -2 -45 -4 -18 -83 -148 -363 -229
2721 -229 115 -26 417 -33 -126 129 -2 -216 1 55 258 -91 36 50 53 -92 -230 -171 -228 -230 11 94 -153
2744 -153 -101 106 180 -251 -144 -197 53 298 187 63 -7 -97 159 -209 -103 -245 -118 -51 -257 129 259 17
2766 17 143 -37 -203 -99 177 171 104 87 -38 -229 -128 230 -180 48 -172 47 -28 8 -73 202 -220 101 187
2789 187 -41 -150 -83 60 -22 56 -76 26 174 11 -130 -311 -94 -200 89 160 68 -137 -90 -119 -97 3 -157
2812 -157 -37 384 -19 -54 101 85 -94 -326 -290 20 -104 -86 -199 6 207 242 -147 -66 -6 41 154 76 -162
2835 -162 273 21 -165 128 -178 -49 -102 -41 2 14 149 26 -170 -23 -92 -91 -344 -70 -28 -16 184 71 134
2858 134 59 250 29 257 177 -131 58 -124 352 -75 265 -258 414 -205 198 141 76 171 22 -6 -308 -67
2880 -67 -85 127 -212 55 0 90 172 53 -101 -35 222 17 -15 56 116 -69 13 171 174 -68 -119 -37 237 68 -52
2905 -52 437 -352 -101 83 -19 -71 -104 83 357 249 61 175 100 -193 -162 -211 162 -199 -100 -8 -126 282 -63
2928 -63 85 16 -138 -287 43 -26 225 131 222 -67 -177 20 -107 -44 -151 -108 -305 135 -90 105 -148 -175 120
2951 120 53 -86 61 -212 173 218 92 14 69 152 156 48 122 253 -60 -20 -75 28 322 -25 53 93 -72 -78 44
2976 44 -24 8 90 36 42 193 -106 -139 -55 -120 103 142 -187 -127 233 -43 -187 89 99 197 -172 -156 -188 54 -33 266
3002 266 71 -101 135 292 22 105 83 32 -105 109 177 194 209 264 254 -216 6 276 -48 256 86 -119 66
3025 66 93 229 124 -87 -60 -27 -97 -246 -36 38 49 72 2 -210 -79 86 -26 2 -118 -15 -173 -84 172 130
3049 130 0 -45 241 -173 -96 65 -20 -28 -249 -157 1 38 -82 -77 -165 20 170 252 -174 -72 -81 196 -129 -36 282
3074 282 -74 207 -88 -29 -63 68 -304 2 -86 156 -162 -134 -96 61 154 110 168 -15 36 55 -244 -3 -10 216
3098 216 146 225 -103 113 73 -77 230 92 -75 -156 94 22 201 51 122 62 -255 27 41 -56 85 61 190
3121 190 2 195 -241 104 143 -71 33 83 -42 -104 -186 -100 238 -232 -127 -347 -7 123 -21 -63 -181 -79
3143 -79 -130 -207 135 -7 86 153 -43 -80 2 12 9 -98 -216 286 -224 -133 -153 7 46 137 107 -180 132 127 -219 -16
3169 -16 104 160 -183 96 86 100 18 125 -265 -31 82 -172 -81 184 -43 61 -46 -241 -335 48 58 217 -156
3192 -156 -351 94 54 35 -124 177 -210 -299 449 27 -15 58 -69 -55 -88 298 -144 35 -118 1 262 -147
3214 -147 -252 -346 62 -87 63 54 264 -225 178 206 -26 -222 83 32 176 198 104 -159 104 280 112 -159
3236 -159 143 152 55 176 158 36 -102 402 -28 -238 26 98 -162 -37 -234 -62 62 -36 -102 -271 -31 -130 -87
3259 -87 -180 71 -45 84 95 -126 46 71 -107 118 -292 5 9 -62 94 -284 1 -26 123 47 33 -74 -106 -23
3283 -23 60 72 48 -152 -262 123 -56 -59 -65 -72 47 -143 138 11 -166 -214 -329 -70 0 -5 348 -17 -90 83 -212
3308 -212 -1 -158 252 126 132 -92 -66 -232 -91 23 91 104 22 -40 40 152 -89 61 -19 70 -201 175 25
3331 25 -72 85 35 160 216 -131 -98 205 -83 -107 91 -22 146 6 -94 56 -179 55 376 245 -69 123
3353 123 73 181 -116 221 -130 25 2 133 -45 99 41 218 -45 83 89 -120 -217 -303 -84 146 141 109 87 -135
3377 -135 183 41 -36 126 -110 144 -148 164 110 -86 -408 29 -137 15 -140 31 236 -139 342 153 -64
3398 -64 -121 -30 -37 -78 -168 48 105 0 -74 132 190 -67 35 -248 153 41 -298 33 -259 -75 8 -86 55 59 -295
3423 -295 140 206 200 203 82 -107 202 117 24 -30 -45 -19 -191 -70 74 245 -237 -255 239 61 44 -13 -119 -120 -149
3448 -149 -94 40 -11 -193 181 -25 29 -20 342 -229 74 -145 -171 74 -24 -19 -167 208 -26 52 88 8 -169 -3
3472 -3 23 78 -67 250 289 -42 30 116 -147 -152 -105 -155 275 -23 -61 210 62 218 -155 -159 -124 33 235 -384 129
3497 129 -67 -80 -88 -4 -38 78 -91 -109 83 268 40 191 -120 113 -34 -104 28 24 59 11 19 -47 349 -83 176
3522 176 -99 96 17 -95 -38 154 -1 82 251 -284 -5 167 84 80 -64 403 135 -246 14 34 -112 36
3544 36 -81 192 94 39 -9 -78 119 161 25 -28 379 -62 -128 193 74 291 80 170 132 171 248 10 -32 40 26
3569 26 -12 -67 -54 150 109 140 32 248 74 -74 -56 177 9 -119 170 219 168 28 -35 -133 -9 -6 338 143
3593 143 -200 205 178 20 -22 36 64 115 115 -224 76 -181 -63 101 174 92 68 27 83 -66 74 339 -48 316
3617 316 -113 -126 246 -47 -9 -26 23 -2 -58 -41 203 -50 -214 54 180 -113 101 -70 243 -182 -110 164 14
3640 14 27 -188 -120 10 -161 -152 -42 -165 81 398 92 -302 -20 -325 -276 391 -136 114 25 158 135 -116 -418
3663 -418 -20 128 -134 77 43 196 -36 142 163 -340 -199 -75 63 -5 -276 -65 86 -56 -12 149 -131
3684 -131 29 -82 -224 -6 -200 -147 -61 102 -59 -192 161 -97 -329 122 177 24 -173 -107 -94 -79 17 -118
3706 -118 -117 363 -186 -108 147 -143 74 135 -15 158 -93 110 -46 338 293 -128 230 76 30 -37 16 -330 33
3729 33 -202 -171 -30 -202 -19 -353 -129 -88 196 -79 -150 288 78 -82 212 -71 171 -159 102 288 27
3750 27 -174 -14 -110 170 -62 -27 -45 -89 -40 -75 -80 -9 160 -222 -221 257 26 54 57 -93 -89 56 180 104 -133 102
3776 102 292 159 -212 35 -79 -256 -126 118 76 372 -154 -19 -54 78 179 83 -447 195 265 -125 138
3797 138 -259 125 185 10 -221 -184 22 121 224 130 38 149 151 -237 -42 72 87 71 53 108 184 -314 156 81
3821 81 -136 56 -126 167 226 195 -128 -127 14 230 -126 -84 244 -81 350 175 -116 -170 89 -24 -66 58 -239
3844 -239 -2 94 86 -80 69 229 133 -102 367 34 -26 223 63 137 6 -92 18 -24 -125 33 -21 -20 -111 138
3868 138 -147 135 49 79 145 -90 29 54 -195 61 191 -206 -159 56 -39 214 -259 119 118 -36 -103 52 178
3891 178 119 -9 -122 17 -138 247 68 22 106 67 77 -101 -171 97 -55 -131 63 -56 -137 50 -281 -135 -212
3914 -212 -360 38 -138 -151 82 165 -109 90 -465 24 -105 53 239 -62 341 -22 48 -199 110 -193 331
3935 331 216 -125 10 -3 -112 154 181 -62 -302 112 122 321 -42 162 -15 -52 80 -196 38 40 104 -44
3957 -44 49 -241 -62 -88 -97 327 -86 -16 88 -173 189 -290 210 217 -5 102 -259 -131 127 149 84 -122 185
3980 185 21 280 233 2 -66 108 34 -87 -64 -139 -116 129 59 75 16 -30 64 -237 23 230 115 -79 -65 -89
4004 -89 164 34 137 -101 -127 116 104 -47 -7 149 -15 -111 -87 91 63 -112 85 -81 -9 -121 -35 1 178
4027 178 28 160 -134 -54 -100 189 217 -392 89 -123 -186 -267 -185 -4 74 136 13 135 -248 -104 131 -61 105
4050 105 251 39 53 115 51 17 36 79 -141 -49 -364 -96 193 -155 -88 58 76 146 408 159 315 108 -163
4073 -163 -269 222 123 111 -4 106 -250 160 193 -61 127 -35 -343 -96 -295 -169 -152 -9 -50 -6 9 -89 -146
4096 -146 -101 137 -27 -178 -59 36 70 286 -211 -73 -109 -54 267 25 -253 85 71 212 150 -112 -128 197 62
4119 62 -4 -339 -278 -59 11 -2 33 -46 116 79 118 -216 -135 -121 -50 -7 211 137 -28 240 8 114 85 73 67 107
4145 107 -178 -12 160 79 -5 179 74 40 270 -42 -106 98 -1 -166 9 156 -216 2 1 -143 106 -86
4167 -86 25 21 -44 -53 -171 -9 -88 -78 -121 100 220 242 48 -334 75 96 -60 -63 -126 215 -36 -58 145 -19 29
4192 29 -156 270 -144 -53 222 131 -7 17 0 176 -58 -2 -126 -109 -31 -74 21 118 -64 -173 -7 100 -124 118
4216 118 -103 42 -6 129 -162 219 49 -129 55 -32 -133 -109 92 48 54 44 84 64 -254 -200 -141 143 11 -62
4240 -62 117 137 -60 195 -103 -46 275 -122 -15 -36 113 -34 18 -13 80 -189 96 138 2 -67 42 -43 244
4263 244 110 -74 -15 -255 45 1 67 14 228 57 -38 147 -44 293 -58 103 -130 -156 18 -34 164 236 22
4286 22 -335 1 -19 -223 135 79 -311 50 123 25 138 117 79 148 414 191 -21 96 -67 39 -49 159 -63
4309 -63 -259 -50 100 29 79 117 328 -113 68 188 39 -7 44 -252 -81 -12 178 74 59 19 99 -13 -48 83
4333 83 30 -211 -73 -105 -22 139 -153 0 42 -205 -50 201 -86 -188 -288 7 169 -3 -91 -167 -195 211 139
4356 139 -55 -181 -50 -81 269 -174 128 -113 -45 133 -116 171 -21 40 -65 -360 -99 313 -78 -51 -44 -287
4378 -287 194 -68 -272 -190 25 -242 13 78 -152 -163 70 -28 178 -147 -76 -76 -93 0 145 -130 203 46 -62
4401 -62 39 15 -286 -70 134 -280 -62 83 218 93 160 178 2 26 227 -130 119 86 14 191 139 4 105
4424 105 161 -182 -2 -33 -53 200 -256 -51 78 -129 4 99 261 -89 -63 -40 220 114 -222 164 -268 -12
4446 -12 2 -163 -72 -43 113 -51 76 -214 -120 -11 38 37 21 106 -373 -30 254 45 29 -173 5 69 87 -7 29
4471 29 165 -152 -46 113 98 -76 33 16 -380 167 100 -48 -235 -10 77 -51 30 148 -65 -130 31 142
4493 142 -37 -168 -270 139 22 137 -116 258 -263 30 -97 -120 45 64 -149 -146 89 273 225 93 -54 -47
4515 -47 78 62 27 -195 -55 -3 100 231 -70 -203 284 -93 178 -51 138 112 -31 -70 55 -344 -246 36
4537 36 -223 278 -53 -99 282 26 -47 11 -121 -99 77 -31 83 -30 -63 127 69 -13 84 -80 -2 12 -33 134
4561 134 18 -147 54 -229 -138 92 20 -94 76 -21 -83 -42 -132 284 -294 -56 -57 82 -4 91 208 -147 -65 -97
4585 -97 112 57 106 30 122 -172 88 -81 238 130 166 -202 -113 -120 188 138 -421 -26 196 -9 80 -64 227 10
4609 10 -111 14 21 137 167 296 -292 286 25 76 141 115 71 149 -7 48 -5 -80 275 -207 -50 -81 -117 -131 -110
4634 -110 44 54 62 10 446 -50 -16 -82 -146 -33 -3 -125 147 -150 -69 -74 202 -15 -54 -122 203 46 25 204 -86
4659 -86 -53 55 29 118 299 -169 25 -115 116 -23 -165 62 198 -30 112 98 61 174 236 3 -28 136 94
4682 94 -123 80 124 92 45 34 108 111 -202 -105 53 87 -188 -106 51 282 -125 -19 32 42 116 154 -218 -23 119
4707 119 -106 -127 80 -404 1 -206 21 -410 75 -242 145 233 0 182 5 -113 -72 223 507 117 -81
4728 -81 -196 76 212 70 -26 -202 -319 282 190 -105 -130 76 6 -301 88 -94 -200 -148 163 161 136 204 3
4751 3 14 36 -171 26 -169 -3 -197 -37 182 92 183 -133 118 25 -364 -126 20 -40 -110 172 -90 0 1 -18
4775 -18 -68 -26 211 -135 53 131 -55 164 -8 36 -291 72 -84 108 -188 69 238 -37 -20 24 136 70 82
4798 82 4 -87 47 4 22 -29 -4 16 -135 -105 -199 33 -2 30 -226 58 544 185 343 5 85 76 182 -71 186
4823 186 104 20 96 58 -120 105 -144 -202 -86 -29 81 -261 169 33 71 209 35 143 -115 -45 133 -41 -185
4846 -185 13 186 189 -80 1 -323 -222 -8 -108 130 40 87 -129 74 -77 -221 83 -74 -6 65 -12 -21 116
4869 116 225 46 119 161 -106 -72 -15 4 -243 44 155 52 136 30 70 230 -192 230 -270 16 -41 41 112
4892 112 150 -286 -119 -391 37 126 -38 -196 56 122 137 -128 8 -118 99 109 -260 -36 273 -66 135 114
4914 114 197 43 45 -163 445 18 43 -105 -165 -353 156 91 40 79 181 40 -47 224 -29 -27 -38 -97 127 136 -27
4939 -27 25 56 129 -32 16 35 -141 -47 -62 222 56 -48 140 136 -124 38 -167 -39 -203 -63 121 69 -260 13
4963 13 127 46 262 280 5 -45 33 -28 171 -114 -106 -51 -258 7 -453 172 339 -40 -94 -132 132 -153 174 -34
4987 -34 -79 -31 40 54 171 -135 318 -157 70 -108 20 86 170 -102 -196 322 -99 226 -19 239 0 56 176
5010 176 68 -84 -115 44 -88 34 -34 312 -41 -43 9 132 -346 58 -86 17 111 112 126 155 253 301 -228 -126
5034 -126 21 102 -198 22 106 -61 -186 74 71 -100 70 274 -177 -39 -29 8 -169 -16 -16 2 -108 70 75 50
5058 50 -28 105 190 -136 101 -66 87 201 -25 -98 42 -19 -265 -138 -24 -114 -44 -107 -74 2 -49 108 -53 77
5082 77 -211 -211 45 -12 47 11 -5 -133 293 -85 0 164 -148 -161 -96 -71 63 90 46 -25 -80 17 171 211 -150 -233
5108 -233 -64 -349 43 54 132 192 -17 60 -251 -162 -33 382 28 26 -148 34 125 0 192 -109 0 -237 51
5131 51 196 -150 -58 -134 6 153 -108 195 10 35 -154 340 393 98 24 -179 -68 66 25 -78 77 14 109
5154 109 -267 -71 -66 -151 -89 -375 273 41 24 84 -186 72 -76 160 53 -227 116 112 31 -66 9 -234 34 -133
5178 -133 -27 125 57 29 52 170 167 77 -104 -121 67 311 -75 11 -21 69 61 -166 -23 247 -52 -197 -127 -131 -64
5203 -64 -94 -296 -281 -141 120 48 204 76 -21 292 37 186 -77 171 108 -100 -159 241 82 83 -134 237 68
5226 68 -112 -19 -84 222 256 15 -214 -275 -55 -13 -102 -4 -84 -177 -197 -33 -85 -35 -280 -66 175 159 20 72 -102
5251 -102 -129 8 -62 -71 -110 142 20 -4 -265 85 169 245 33 255 219 -13 -230 -189 32 -35 -105 -64 -13 160 120
5276 120 269 126 40 16 -271 22 -76 92 -102 42 -73 -118 -73 -260 -57 -195 -16 -11 -8 -229 48 93 -327
5299 -327 -73 38 175 20 145 -106 -160 179 171 -16 95 -4 20 138 165 194 204 -32 -14 -61 -52 -77 -76 -15 -97 158
5325 158 -31 -32 -58 -88 105 144 -11 -24 -215 -47 125 -107 -101 -80 96 184 205 -42 191 19 148 261 -33 131
5349 131 -46 264 42 -52 -99 -41 -20 -46 -81 -60 8 -14 10 -314 29 119 12 -280 128 205 -10 -143 -14 -48
5373 -48 -256 184 62 -153 101 -90 -126 -69 283 136 -70 171 -301 101 -76 112 -3 -101 23 -164 -176 -89
5395 -89 -17 -3 142 62 -106 118 93 -54 157 152 -212 -111 -1 194 -260 52 -106 -80 -256 -108 117 -6 -77
5418 -77 -111 -55 -89 -87 40 4 -74 5 -369 158 150 89 -106 -265 171 20 299 175 -203 -87 87 47 74 42 82
5443 82 -341 106 -16 -139 -16 217 77 259 53 104 2 21 60 159 124 -78 -90 -52 167 -4 25 158 -3
5466 -3 -226 -25 291 -9 -24 232 -21 108 -17 66 -212 43 -42 96 211 -30 182 -159 -60 5 55 -153 120
5489 120 -309 41 56 -64 56 -41 -230 -161 28 -24 -137 399 -160 -91 -363 189 122 -275 140 151 323 36
5511 36 236 -170 134 -20 169 -38 124 -96 -114 67 -243 -38 -293 -67 -7 282 118 -56 119 -230 108
5532 108 -37 -166 -113 -161 -124 219 -160 45 3 70 -117 -133 3 -263 -87 -46 -9 -39 -180 -61 -116 -85 -7 271
5556 271 207 -113 -126 91 -203 78 -81 17 -21 -10 22 -26 90 24 78 9 -212 -138 -124 -171 -177 40 13 122 55 112
5582 112 263 9 -161 -1 72 -130 -95 -32 -107 -4 -150 -41 5 -88 19 -112 -148 -232 113 -64 149 121 168
5605 168 -240 -2 179 -192 -179 109 -102 273 -75 -21 104 -53 14 150 85 -22 12 -70 352 -109 233 48
5627 48 -149 233 95 334 30 -79 114 38 114 22 0 87 -167 -99 -12 -247 39 173 155 -30 -91 46 -17 -30
5651 -30 -41 35 -183 160 -92 -287 -34 118 -128 -53 114 -39 169 -246 -23 28 -7 -107 -81 92 -9 151
5673 151 121 -140 -285 13 -38 147 -123 -41 -11 -212 -190 113 26 356 -4 -123 -112 -127 83 -323 -40 -172 235
5696 235 30 223 -255 -5 -86 -16 196 -201 270 130 131 165 -6 -263 57 -75 -173 6 99 -120 7 114
5718 114 -51 -200 178 -62 56 242 273 -50 -40 168 -102 41 14 -179 65 -226 -153 -93 61 53 -138 246
5740 246 -100 -42 -35 111 85 76 266 64 67 291 -200 -133 239 -107 -106 -91 -310 17 -53 -205 -265 196 -52 -259 70
5765 70 -24 105 -153 -51 -52 -113 -18 -248 -159 -153 -57 -66 23 125 -114 395 -16 -223 -212 48 -26 -12 -9 -140 -38 -57
5791 -57 194 66 42 5 33 94 119 122 77 -1 52 190 -389 -45 36 -16 -198 27 -24 86 20 5 -142 36 24 50
5817 50 -94 195 61 353 -4 -98 -20 90 2 -143 -38 -166 -48 -321 51 -107 -17 225 68 31 -182 -12
5839 -12 29 -180 -177 -90 -288 -104 10 -91 -82 7 70 -186 -25 -160 64 -107 51 -85 145 -160 -4 218 15
5862 15 86 -69 -156 18 87 -16 -128 47 9 -151 -230 4 -114 -134 -118 -82 175 -8 195 -145 23 -137 8
5885 8 20 144 -213 198 4 275 -57 -40 -13 -142 -345 -78 180 -95 55 20 -249 -368 248 -101 198 181
5907 181 -140 111 117 34 -130 59 -25 308 -62 -88 129 80 -101 33 -28 -47 90 122 137 75 -155 36 298 149
5931 149 -195 -111 77 41 132 130 70 -366 259 179 -30 -142 -54 -68 -296 -36 62 369 107 -169 -65 212 16
5954 16 -23 31 -16 190 82 199 33 90 -227 -84 -86 -140 -43 -126 -42 -290 -124 -106 -103 -180 201 248 160 6 102 -43
5980 -43 100 233 -31 -74 214 -111 166 333 -5 80 28 -138 52 93 -31 -61 130 -221 93 -221 -61 97
6002 97 -74 60 94 22 -346 6 -74 44 -214 84 -222 89 239 157 -93 63 -56 -15 -165 6 -103 -142
6024 -142 38 -125 -123 118 247 43 41 -41 140 115 -127 -67 -20 154 -234 284 56 -103 -221 -75 118 -131 88
6047 88 -93 171 -138 43 -172 89 113 120 146 -95 -5 -166 -118 -47 27 -236 -56 -39 -53 -23 5 23 44 98 -21
6072 -21 6 1 -201 -38 -83 -309 -218 -40 110 -291 127 -191 -95 -8 -191 81 176 95 -128 79 -199 62 -51
6095 -51 21 -176 145 51 -174 45 -90 73 21 -69 -31 -8 127 8 -49 235 -22 -168 249 21 81 33 -193
6118 -193 -122 30 157 -19 5 158 -87 -122 -161 109 65 -104 179 20 -253 -19 -134 86 -58 -115 -93 4 -6
6141 -6 -39 -235 51 -87 -278 -31 -177 259 -20 15 154 28 -164 -60 -61 -184 -183 8 114 103 97 -74 298 -80
6165 -80 -64 185 -224 -103 28 102 137 -28 -13 -100 -87 -39 29 -33 -52 -160 41 17 60 27 -170 -186 -71 -57 127
6190 127 127 138 -187 430 -32 -214 -109 -83 132 186 -79 122 -115 -246 24 -38 -37 7 161 -26 -70 57 75 -123
6214 -123 35 209 31 -111 234 110 336 175 -102 318 -54 -2 124 -113 -80 139 -211 48 70 -221 -90
6235 -90 -96 -116 2 -123 92 -48 -149 -137 182 -95 54 149 27 -19 -146 -108 85 32 -69 -183 123 -213 -179
6258 -179 -4 -55 7 -118 -19 -123 4 281 -98 35 80 246 9 -88 241 139 104 -75 -62 190 116 138 -4
6281 -4 -45 -109 69 -260 -68 243 139 -13 -247 56 145 -85 -6 46 -103 46 -155 -30 136 95 137 -137 35
6304 35 -310 -25 65 -268 -127 -183 81 42 71 82 101 -30 45 -75 143 -116 -71 -12 -83 -19 370 -52 -71 -193
6328 -193 83 69 -240 97 58 60 -27 110 -199 -141 1 -31 -74 -36 -41 -38 34 -95 268 -149 123 143 103 115 -179 16
6354 16 101 344 -60 -6 0 91 59 -113 216 53 -177 -329 -77 122 -81 -49 -76 136 157 -70 -269 250 156 -89
6378 -89 -25 8 95 50 102 -299 68 230 -74 -235 -100 42 -94 -43 93 -109 75 -35 145 94 -76 -123 -286
6401 -286 62 -355 4 140 137 63 24 71 42 -171 124 -7 43 -117 -136 -341 71 106 -405 119 137 9 34 -36
6425 -36 -172 81 288 52 -30 -104 92 111 9 19 42 113 69 38 68 -79 53 22 44 -58 84 -29 104 67
6449 67 -109 -38 -249 201 145 -175 54 134 -138 15 207 19 -173 178 -171 -217 -95 -47 -144 63 118 40 -27
6472 -27 236 -78 102 255 -79 77 -108 76 238 -136 -166 -294 30 -197 -309 361 -209 -42 155 291 199
6493 199 164 7 48 199 113 57 -36 -134 74 -31 75 128 221 8 -69 58 -169 146 -263 -162 -12 143 199
6516 199 6 37 99 169 182 15 -120 315 120 182 328 47 171 -189 7 -111 78 -33 62 -215 -230 2
6538 2 -240 -153 98 164 108 3 90 222 -54 -73 -15 -187 -158 43 66 -256 -89 220 1 -187 94 -65 81
6561 81 -52 -222 -9 35 -13 3 -213 26 -13 -54 -68 160 -152 70 -45 -97 124 -110 -114 -94 165 126 -154 -244
6585 -244 127 -83 -57 318 -188 67 13 -144 -140 -14 330 -32 103 -23 -124 146 165 -51 59 273 -203 -307
6607 -307 -128 92 188 -215 91 -1 -124 -50 -157 112 259 -131 88 -57 -239 312 -80 172 -210 182 -196
6628 -196 121 -102 -20 -63 9 -26 38 -177 52 -112 -63 62 -7 190 -78 118 375 47 25 20 309 -53 -133 153
6652 153 -97 123 10 -18 -113 -49 -86 21 77 -13 257 147 -127 16 230 -14 -86 62 -181 248 85 36 163
6675 163 219 138 -171 -165 288 164 -4 256 106 69 211 -2 -28 -82 -179 -27 128 28 135 3 209 182 -211
6698 -211 -7 -145 99 26 -201 180 -106 -87 -43 59 -76 -202 170 -10 62 174 124 -86 186 -36 75 -205
6720 -205 -23 -30 -34 -163 -353 60 245 -88 140 -65 -62 -56 -99 25 170 -48 -166 -19 -6 187 -114 -42 67 -9
6744 -9 78 129 161 90 283 315 196 -142 -65 76 16 -63 -120 -39 -48 -112 -34 246 -125 -217 -121 -358 -120 192 137 -249
6770 -249 156 32 -23 -80 197 136 105 229 -9 -175 220 -37 -212 157 -145 91 -224 96 -12 -315 132
6791 132 189 66 -188 177 4 33 -30 -20 75 213 216 50 -259 -175 50 -90 60 -10 49 57 -51 100 346 125
6815 125 84 31 -113 14 68 50 -26 -189 -77 -29 -338 80 236 80 209 91 -36 174 25 129 -246 -65
6837 -65 -129 -131 -159 81 96 -98 40 23 -46 -50 -22 128 -40 -262 -178 -33 51 97 73 -31 -187 293 -215 223 -180
6862 -180 -33 336 -150 341 277 -73 159 -59 -9 -93 90 -8 124 -166 14 -41 -104 -168 168 2 -126 -58 201
6885 201 114 145 -118 212 49 101 -16 167 -116 63 -126 -154 121 -48 5 -114 -99 -157 72 -42 -134 7 -27
6908 -27 103 28 225 -250 -126 -177 80 28 128 -230 -115 283 -147 -86 -280 293 -212 329 -150 130 20 59
6930 59 51 -78 172 -133 130 -37 126 10 -31 -120 9 116 -11 156 393 116 57 186 -100 -76 -158 29 65
6953 65 -32 -37 26 -111 -61 -110 270 147 -245 -87 218 -27 -56 -22 15 -120 -125 67 41 32 85 -38 -56 -155 -58 -143 -119
6980 -119 60 123 106 -157 28 81 -46 23 280 -60 -37 263 82 298 -228 -133 -263 83 -213 -241 30 109 159
7003 159 198 178 41 -254 -24 -118 282 73 104 -44 144 409 175 289 11 -83 -64 34 11 11 -185 101 12 -197
7027 -197 -59 131 72 57 -96 94 229 -112 -142 -339 195 40 151 -82 -59 45 -106 118 372 263 16
7048 16 -168 -153 -41 -188 -45 -4 151 0 82 14 -108 42 -147 -239 49 254 -148 282 105 -90 164 -142
7070 -142 93 -103 -131 91 -82 -67 -149 -93 37 19 -49 -90 105 -73 -122 -60 -172 -59 -265 19 -53 -687 143
7093 143 130 -91 44 -3 -141 -8 152 130 100 72 -121 -71 -101 349 127 -101 185 146 -12 -8 85 -151 -9 15
7117 15 -40 44 122 79 -52 108 -86 25 115 32 74 84 -162 -146 -109 -55 33 231 -20 -57 100 -10 155 203 160
7142 160 82 -156 -242 15 155 289 57 -58 50 196 79 -39 -122 -242 170 44 -188 -121 52 76 24 -86
7164 -86 -384 -20 215 94 -43 122 -63 206 -91 -80 -200 -228 131 -284 -34 -111 -391 -27 -176 93 -88
7185 -88 -62 -7 -47 -341 119 0 -81 -43 -87 217 -135 -84 -43 -26 -120 32 -235 -39 71 72 56 -8 145 194 208 -173
7211 -173 -28 6 121 -252 -53 -79 -377 -79 284 25 116 105 35 -59 -26 90 204 51 54 188 -352 194 -166
7234 -166 96 171 -191 -124 81 -211 32 -383 200 182 -57 -177 11 215 -24 -133 -134 61 -36 69 26 361
7256 361 -135 -149 191 49 147 117 -95 69 63 89 15 68 -163 -266 4 142 252 -129 419 -291 22 -239 -125
7279 -125 163 -115 29 -89 98 34 273 517 -37 57 55 -144 -10 -480 135 -325 -101 201 -28 4 13 286
7301 286 17 6 -210 -54 -245 -78 -25 -45 -114 -136 -139 -75 31 -34 -82 -269 -40 277 75 133 30 31 100 -154 -3
7326 -3 -220 47 -117 13 242 132 -127 -294 -17 -292 -36 -136 -81 4 -106 199 83 -42 115 45 -138 -127
7348 -127 106 282 -22 156 -52 6 -142 35 60 195 140 140 147 -56 -111 -34 30 -77 -7 -131 47 -130 45 21
7372 21 -71 -63 56 -101 -53 1 -186 -120 170 -15 213 88 -73 -200 -113 -162 -146 -71 -314 84 57 -235 -208 13
7396 13 -111 452 -168 -114 81 -23 69 139 -108 -95 -58 111 200 -47 2 41 -1 -2 39 100 -60 -46 23 -179 -55
7421 -55 148 144 -78 -135 14 124 -131 200 -111 167 169 -91 -62 71 122 -146 42 27 119 -172 -257 165 29 -46
7445 -46 -90 124 -187 77 -96 198 -171 61 301 -150 207 132 17 112 -126 -64 113 -258 -94 286 -80 48
7467 48 5 -148 -18 49 4 -69 -7 -36 -289 -171 -126 -204 -48 -56 81 122 -106 158 -187 -100 -202 135 5 194
7491 194 12 -108 26 -232 18 93 218 -112 23 -128 270 -136 -211 -24 6 -176 -40 -297 -49 134 25
7512 25 -119 -234 -149 -32 -132 192 -139 -264 9 18 281 -255 240 123 -196 152 -198 -280 225 20 -140 -78
7534 -78 -117 226 -22 -66 -14 27 -93 130 58 39 93 48 165 33 -128 -205 6 -284 -158 -47 55 1 35 -205
7558 -205 -120 -169 -123 88 197 83 -69 -63 -87 44 -33 -18 156 31 -308 79 132 -79 -71 23 71 38 -169 -195 6
7583 6 217 6 -141 313 -29 -143 98 -27 50 30 14 -284 58 -86 -150 -267 -5 117 254 -19 -119 -217
7605 -217 292 162 120 -36 -196 -90 -7 -102 -247 20 -406 -203 236 42 58 226 79 -86 92 132 56 199
7627 199 251 46 -68 -205 -9 131 12 449 -151 -218 -21 -194 -106 -75 37 76 -128 -102 -98 -20 -128 -168 -99 -144
7651 -144 96 16 -154 159 198 -277 49 41 54 -49 73 71 208 49 -205 144 -2 184 -25 85 -160 125
7673 125 235 -99 -104 26 -59 185 -35 -259 104 22 -103 -373 -26 -94 25 168 151 102 -51 19 -28 -94 168
7696 168 -68 55 -111 -62 -135 -129 11 112 50 -45 -1 -64 -113 183 3 251 239 -9 276 -59 9 -271 -105 -185
7720 -185 158 -23 50 230 55 223 -86 46 -58 -63 227 -99 -165 71 262 73 -118 27 -160 -179 89 -26
7742 -26 -19 94 -56 54 -124 4 134 127 -42 188 -131 -224 187 -147 149 -120 40 -54 53 -21 113 24 65
7765 65 -18 117 -101 -216 1 64 85 -177 -35 58 -23 -66 40 -75 200 -132 -20 100 16 219 198 105 -93
7788 -93 124 -111 -58 270 -196 105 -1 -20 288 -55 -161 -103 -211 65 -90 -27 -224 -119 -249 -291 183 85
7810 85 -118 -320 -61 59 164 -55 235 -113 -171 128 -122 -221 3 91 -144 5 193 -8 88 189 -59 -125
7832 -125 -60 22 95 -70 217 -152 -44 -158 114 -141 105 -117 389 -301 37 19 -124 51 79 -107 248 149
7854 149 93 174 212 -67 -35 -109 168 -119 140 -39 -248 329 -110 -4 41 -101 60 183 2 167 113 32 109
7877 109 232 -95 92 182 134 -95 -17 179 128 -215 -111 -53 -27 -45 3 35 -92 -172 31 161 107 246 23 14
7901 14 184 -87 -123 -226 -111 102 -42 121 -44 188 151 0 100 -24 -28 78 -83 232 44 -59 -270 45
7923 45 -105 246 304 31 -182 -97 -99 -162 46 -240 -34 207 105 131 -124 56 -64 -26 36 29 -219 -77 217 -285
7947 -285 -5 -27 -125 -130 -143 28 113 199 -13 -129 -152 403 235 43 214 76 -285 280 84 -201 13 -103 227
7970 227 170 -93 37 134 286 49 110 -31 116 78 -59 37 -148 82 -99 4 -23 -148 149 77 17 -294 17
7993 17 112 -80 146 85 -43 -24 13 -82 -48 102 200 -249 -112 -122 128 187 -25 -155 -22 121 -159 91 -76
8016 -76 131 -26 42 38 -128 -88 -202 -106 131 38 25 -76 100 -99 -93 189 -208 124 -285 -78 82 -120 -246
8039 -246 -81 53 179 -257 -87 303 -201 19 -134 26 -151 -173 -148 12 35 -48 212 155 115 16 -193 -12
8061 -12 36 162 64 -144 210 150 191 -104 306 -206 -335 -67 81 210 -176 -72 29 48 61 -39 -95 -72 84
8084 84 -94 100 -92 146 209 162 102 102 114 -61 -131 -49 -74 -99 -31 101 -141 -4 145 -56 -29 -181 -64 36
8108 36 -149 128 35 -42 18 -242 -4 170 -217 126 61 104 159 88 38 4 -201 -136 145 -79 -59 -109 82 -25
8132 -25 -175 41 30 -103 -267 -8 143 96 -187 -103 148 380 -281 -8 3 15 -170 38 152 -145 -13 16
8154 16 -139 -17 5 46 -105 205 -246 89 -66 139 -78 -394 169 141 32 -11 -61 189 143 -340 -147 112
8176 112 178 -160 -212 61 -319 -85 -35 -210 -156 -89 86 180 49 212 -135
8191a35
##END NTUPLES=NMR FID
##END=
