##TITLE=1H_DE-178oil_TFAd6
 200.13Hz, DMSO_CCl4.
 8 sc
 26.8.2026
##JCAMPDX= 6.0         $$ Bruker NMR JCAMP-DX V2.0
##DATA TYPE= NMR FID
##DATA CLASS= NTUPLES
##ORIGIN= UXNMR, Bruker Analytische Messtechnik GmbH
##OWNER= pz
$$ XWIN-NMR		Version 3.5
$$ Wed Aug 26 13:14:12 2026 Russian Standard Time (UT+4h)  she@DPX200
##.OBSERVE FREQUENCY= 200.1313
##.OBSERVE NUCLEUS= ^1H
##.DELAY= (6, 6)
##.ACQUISITION MODE= SIMULTANEOUS
##.ACQUISITION SCHEME= undefined
##.AVERAGES= 8
##.DIGITISER RES= 18
##SPECTROMETER/DATA SYSTEM= spect
##.PULSE SEQUENCE= zg30
##.SOLVENT NAME= DMSO
##.SHIFT REFERENCE= (INTERNAL, DMSO, 0, 14.3821)
##AUDIT TRAIL= $$ (NUMBER, WHEN, WHO, WHERE, WHAT)
$$ ##TITLE= Audit trail, XWIN-NMR		Version 3.5
$$ ##JCAMPDX= 5.01
$$ ##ORIGIN= Bruker BioSpin GmbH
$$ ##OWNER= she
$$ F:/spectra/data/she/nmr/H-C/1/audita.txt
$$ ##AUDIT TRAIL=  $$ (NUMBER, WHEN, WHO, WHERE, WHAT)
(   1,<2026-08-26 13:12:35.98 +0400>,<she>,<DPX200>,
      <created by zg, POWCHK disabled, PULCHK disabled
       configuration hash MD5:
       00 E9 B6 7A A2 85 ED C7 34 08 36 98 17 FE 4E 26
       data hash MD5: 16K
       86 B1 93 F7 F6 26 B5 E0 7A A7 25 1B DB D7 50 8A>)
$$ ##END=
$$ 
$$ hash MD5
$$ 6C F2 88 3D ED 6A 14 08 87 18 9E 43 E8 E2 1F 0B
##$RELAX= 
##$RELAX= 
##$RELAX= 
##$RELAX= 
##$RELAX= 
##$RELAX= 
$$ Bruker specific parameters
$$ --------------------------
##$DU= <F:/spectra>
##$EXPNO= 1
##$NAME= <H-C>
##$PROCNO= 1
##$TYPE= <nmr>
##$USER= <she>
##$AMP= (0..31)
100 100 100 100 100 100 100 100 100 100 100 100 100 100 100 100 100 100 
100 100 100 100 100 100 100 100 100 100 100 100 100 100 
##$AQSEQ= 0
##$AQ_mod= 1
##$AUNM= <au_zg>
##$AUTOPOS= <>
##$BF1= 200.13
##$BF2= 200.13
##$BF3= 200.13
##$BF4= 200.13
##$BF5= 200.13
##$BF6= 200.13
##$BF7= 200.13
##$BF8= 200.13
##$BYTORDA= 1
##$CFDGTYP= 0
##$CFRGTYP= 5
##$CHEMSTR= <none>
##$CNST= (0..31)
1 1 145 1 1 1 1 1 1 1 1 1 1 1 1 1 1 1 1 1 1 1 1 1 1 1 1 1 1 1 1 1 
##$CPDPRG= <>
##$CPDPRG1= <>
##$CPDPRG2= <>
##$CPDPRG3= <>
##$CPDPRG4= <mlev>
##$CPDPRG5= <mlev>
##$CPDPRG6= <mlev>
##$CPDPRG7= <mlev>
##$CPDPRG8= <mlev>
##$CPDPRGB= <>
##$CPDPRGT= <>
##$D= (0..31)
0 0.7 0 0 0 0 0 0 0 0 0 0.03 0 0 0 0 0 0 0 0 0 0 0 0 0 0 0 0 0 0 0 0 
##$DATE= 1787735555
##$DBL= (0..7)
120 120 120 120 120 120 120 120 
##$DBP= (0..7)
150 150 150 150 150 150 150 150 
##$DBP07= 0
##$DBPNAM0= <>
##$DBPNAM1= <>
##$DBPNAM2= <>
##$DBPNAM3= <>
##$DBPNAM4= <>
##$DBPNAM5= <>
##$DBPNAM6= <>
##$DBPNAM7= <>
##$DBPOAL= (0..7)
0.5 0.5 0.5 0.5 0.5 0.5 0.5 0.5 
##$DBPOFFS= (0..7)
0 0 0 0 0 0 0 0 
##$DE= 6
##$DECBNUC= <off>
##$DECIM= 32
##$DECNUC= <off>
##$DECSTAT= 4
##$DIGMOD= 1
##$DIGTYP= 9
##$DL= (0..7)
0 120 120 120 120 120 120 120 
##$DP= (0..7)
150 150 150 150 150 150 150 150 
##$DP07= 0
##$DPNAME0= <>
##$DPNAME1= <>
##$DPNAME2= <>
##$DPNAME3= <>
##$DPNAME4= <>
##$DPNAME5= <>
##$DPNAME6= <>
##$DPNAME7= <>
##$DPOAL= (0..7)
0.5 0.5 0.5 0.5 0.5 0.5 0.5 0.5 
##$DPOFFS= (0..7)
0 0 0 0 0 0 0 0 
##$DQDMODE= 0
##$DR= 18
##$DS= 0
##$DSLIST= <SSSSSSSSSSSSSSS>
$$ [...]
##$SUBNAM0= <"">
##$SUBNAM1= <"">
##$SUBNAM2= <"">
##$SUBNAM3= <"">
##$SUBNAM4= <"">
##$SUBNAM5= <"">
##$SUBNAM6= <"">
##$SUBNAM7= <"">
##$SUBNAM8= <"">
##$SUBNAM9= <"">
##$SW= 18.0517328524113
##$SWIBOX= (0..15)
0 0 2 0 0 0 0 0 0 0 0 0 0 0 0 0 
##$SW_h= 3612.71676300578
##$TD= 16384
##$TD0= 1
##$TE= 0
##$TE2= 300
##$TE3= 300
##$TEG= 300
##$TL= (0..7)
0 120 120 120 120 120 120 120 
##$TP= (0..7)
150 150 150 150 150 150 150 150 
##$TP07= 0
##$TPNAME0= <>
##$TPNAME1= <>
##$TPNAME2= <>
##$TPNAME3= <>
##$TPNAME4= <>
##$TPNAME5= <>
##$TPNAME6= <>
##$TPNAME7= <>
##$TPOAL= (0..7)
0.5 0.5 0.5 0.5 0.5 0.5 0.5 0.5 
##$TPOFFS= (0..7)
0 0 0 0 0 0 0 0 
##$TUNHIN= 0
##$TUNHOUT= 0
##$TUNXOUT= 0
##$USERA1= <user>
##$USERA2= <user>
##$USERA3= <user>
##$USERA4= <user>
##$USERA5= <user>
##$V9= 5
##$VALIST= <valist>
##$VCLIST= <CCCCCCCCCCCCCCC>
##$VD= 0
##$VDLIST= <DDDDDDDDDDDDDDD>
##$VPLIST= <PPPPPPPPPPPPPPP>
##$VTLIST= <TTTTTTTTTTTTTTT>
##$WBST= 1024
##$WBSW= 4
##$XGAIN= (0..3)
0 0 0 0 
##$XL= 0
##$YL= 0
##$YMAX_a= 200788
##$YMIN_a= -189552
##$ZGOPTNS= <>
##$ZL1= 120
##$ZL2= 120
##$ZL3= 120
##$ZL4= 120
##$ABSF1= 10
##$ABSF2= 0
##$ABSG= 5
##$ABSL= 3
##$ALPHA= 0
##$AQORDER= 0
##$ASSFAC= 0
##$ASSFACI= 0
##$ASSFACX= 0
##$ASSWID= 0
##$AUNMP= <proc_1d>
##$AZFE= 0.1
##$AZFW= 0.1
##$BCFW= 1
##$BC_mod= 2
##$BYTORDP= 1
##$COROFFS= 0
##$CY= -3
##$DATMOD= 1
##$DC= 2
##$DFILT= <>
##$DTYPP= 0
##$F1P= 0
##$F2P= 0
##$FCOR= 0.5
##$FTSIZE= 0
##$FT_mod= 4
##$GAMMA= 1
##$GB= 0.15
##$INTBC= 1
##$INTSCL= 1
##$ISEN= 128
##$LB= 0.25
##$LEV0= 0
##$LPBIN= 0
##$MAXI= 10000
##$MC2= 0
##$MEAN= 0
##$ME_mod= 0
##$MI= 1.114404
##$NCOEF= 0
##$NC_proc= 0
##$NLEV= 6
##$NOISF1= 3.799351
##$NOISF2= 2.8
##$NSP= 1
##$NTH_PI= 0
##$NZP= 0
##$OFFSET= 14.38212
##$PC= 1
##$PHC0= -4578.975
##$PHC1= 6.392301
##$PH_mod= 1
##$PKNL= yes
##$PPARMOD= 0
##$PSCAL= 0
##$PSIGN= 0
##$REVERSE= no
##$SF= 200.129724274929
##$SI= 16384
##$SIGF1= 3
##$SIGF2= 2
##$SINO= 400
##$SIOLD= 16384
##$SREGLST= <1H.CDCl3>
##$SSB= 0
##$STSI= 0
##$STSR= 0
##$SW_p= 3205.1282051282
##$SYMM= 0
##$S_DEV= 0
##$TDeff= 0
##$TDoff= 0
##$TI= <>
##$TILT= no
##$TM1= 0
##$TM2= 0
##$TOPLEV= 0
##$USERP1= <user>
##$USERP2= <user>
##$USERP3= <user>
##$USERP4= <user>
##$USERP5= <user>
##$WDW= 1
##$XDIM= 8192
##$YMAX_p= 0
##$YMIN_p= 0
$$ End of Bruker specific parameters
$$ ---------------------------------
##NTUPLES= NMR FID
##VAR_NAME=  TIME,          FID/REAL,        FID/IMAG
##SYMBOL=    X,             R,               I
##VAR_TYPE=  INDEPENDENT,   DEPENDENT,       DEPENDENT
##VAR_FORM=  AFFN,          ASDF,            ASDF
##VAR_DIM=   8192,          8192,            8192
##UNITS=     SECONDS,       ARBITRARY UNITS, ARBITRARY UNITS
##FACTOR=    0.0002768,     1,               1
##FIRST=     0,             0,               0
##LAST=      2.2672688,     0,               0
##MIN=       0,             -189552,         0
##MAX=       2.2672688,     200788,          0
$$ Real data points
##PAGE= N=1
##DATA TABLE= (X++(R..R)), XYDATA
$$ [...]
1838c34j59N23j46J32Q9r0J3j99K25k54Q4j6P1Q7ol3J99j86J25k77l2M59k77O6
$$ -334 -493 30 -116 16 105 15 28 -171 54 -200 -116 -132 -61 26 20 -13 186 0 125 -152 -184 275 -2 64
1862F4K42k88k2np2P8l31L55j35O9l84M61J28l0J40l12o8K61J68j64k31O2mJ51
$$ 64 306 18 -4 -9 -81 -3 -334 21 -114 -45 -429 32 160 130 270 -42 -110 151 319 155 -76 -14 -18 133
1886A33j97j73K69L9j39k1jJ9k5k0O4p8M5K11k35O6j36L24j01Rk53L91k99ML7
$$ 133 -64 -237 32 71 -68 -89 -90 -71 -96 -116 -52 -130 -85 126 -109 -43 -179 145 44 53 -200 191 -108 -104 -67
1911f7K20j73P2j34RJ13r2J60Mj59n3J32j39n4Q1n2J46K08l88P6J7j29M39k96
$$ -67 153 -20 52 -82 -73 40 -52 108 112 -47 -100 32 -107 -161 -80 -132 14 222 -166 -90 -73 -202 237 -59
1935e9J46K3L2j28J01j6n2K50o40N7L01r0Q5J46N5m49J03J79Mq7J2J50L5r2j57
$$ -59 87 110 142 14 115 99 47 297 -343 -286 15 -75 10 156 211 -238 -135 44 48 -39 -27 123 158 66 -91
1960i1J40K5k59K19O9j20K15k72K58j92j51M7L28j92Q1k43J65k4j27L43r7k58
$$ -91 49 74 -185 34 103 -17 198 -74 184 -8 -159 -112 216 24 105 -138 27 3 -124 219 122 -136
1982a36J85j8j69K61m52N53Kl0k06L32n11K55m0j68K23j2m05J84K08O0p8L15m70
$$ -136 49 31 -138 123 -329 224 226 196 -10 322 -189 66 26 -142 81 69 -336 -152 56 116 38 353 -117
2005a17j73L37K1l10N48k90l6Q6J4N1m4j12OP0j27OQ2M5l9n3r2J64j92J87k97
$$ -117 -290 47 68 -242 306 16 -20 66 80 131 87 -25 -19 51 -76 -70 12 57 18 -35 -127 37 -155 32 -265
2030b65K46j9n6K3n4M29l8k50j33M6j10RL40j96J10k74j89M86j22P5k70K44j19
$$ -265 -19 -38 -94 -71 -125 304 266 16 -117 -71 -181 -172 168 -28 82 -192 -381 105 -17 58 -212 32 -87
2053h7K9m3j32M69k32lJ01r4j19K62m37K90j09K6L2j7nK33k96J72K09m71P0J01
$$ -87 -58 -101 -233 236 4 1 102 8 -111 151 -286 4 -105 -79 -47 -64 -69 164 -132 40 249 -222 -152 -51
2077e1J9R9P5q5k02k8M38q2j79r7K69k16jK48l90M43j97n8P5k78M77j01l23p1
$$ -51 -32 67 142 57 -145 -173 265 183 4 -93 176 -40 -41 207 -183 260 63 5 80 -198 279 178 -145 -216
2101b16L62j79J22k41K01P3p5j35K06j13L4j10m4J1r9J13M5k3J45p4j23K52j07
$$ -216 146 -33 89 -152 49 122 47 -88 118 5 39 -71 -115 -104 -203 -90 -45 -68 77 3 -120 132 25
2124B5J69o0p6M8j1l7Q6q6l6j53K45k51M31k11J18k27J01j21r4J85o1r0R6p4J81
$$ 25 194 134 58 106 95 58 144 58 22 -131 114 -137 294 83 201 -26 75 -46 -140 45 -16 -106 -10 -84 97
2149I7l79J73K91j36j66PJ46J83l00K08j39J69k10Q3j25J58r7K7k02J31J99k4
$$ 97 -282 -109 182 46 -120 -113 33 216 -84 124 -15 154 -56 27 -98 60 -37 -10 -212 -81 118 94
2171I4j44O5J15k93L67k26L17j89j10k3k8J74O5J39k71r0j9KL3J62J17l00O5k62
$$ 94 -50 15 130 -163 204 -22 295 106 -4 -27 -55 119 184 323 52 -38 -57 -55 -22 140 257 -43 22 -240
2195b40N4J71L9rj40L22k15J98k66N5J03k23K58j56M46o08L90l99K04L5k79K23
$$ -240 -186 -15 24 15 -125 197 -18 180 -86 -31 72 -151 107 -49 397 -211 179 -220 -16 19 -260 -37
2217c7K05k06PJ42j62j28J77J75m40N2L5K37l58M22o1rp3J91l46J21L35k01Q8
$$ -37 168 -38 -31 111 -51 -179 -2 173 -267 -215 -180 57 -301 121 60 51 -22 169 -177 -56 279 78 166
2240A66l3m00K93R6j08K9j01q9l6L78j91k3j93L26k89K70m44L96Pl9J07J22l54
$$ 166 133 -267 26 122 14 43 -58 -147 -183 195 4 -19 -212 114 -175 95 -349 47 54 15 122 244 -110
2263a10P7l1j0J48Q7j72k94L53O3j5j41L6J7J49j39K21j91m3K8r9J45L29m79J93
$$ -110 -33 -64 -74 74 161 -11 -305 48 111 96 -45 -9 8 157 18 239 48 5 33 -66 79 408 -71 122
2287A22m46L52j99K56j31k45L66k13J64p6j32L35l03L17k96j56J45j27L41j18
$$ 122 -324 28 -171 85 -46 -291 75 -138 26 -50 -182 153 -150 167 -129 -285 -140 -267 74 -44
2307d4Nj43OM9J05K62l87P2J71j12j21PK42l04k3j1J19K30o0j72K4k7K91k14J38
$$ -44 -39 -182 -176 -127 -22 240 -147 -75 96 -16 -137 -130 112 -192 -215 -226 -107 123 63 -109 -85 -112 179 -35 103
2332A03j24J31O7k55O9P5O9o3J03k39j34j24L36j98jJ51M7KJ57r4j72J74n8J3
$$ 103 -21 110 177 -78 -9 66 135 72 175 -64 -198 -322 14 -184 -185 -34 13 15 172 78 -94 80 22 35
2356C5kN2n3j04p4J46K31k83K24k94K43j57j34L05k41L24j98Q0j17j83J55J05
$$ 35 33 85 32 -72 -146 0 231 -52 172 -122 121 -36 -170 135 -106 218 20 100 -17 -200 -45 60
2378F0l09K20k36K33j7k26L49k31P9J61k62K33K55l67j18K21j98M7K69j56P4O0
$$ 60 -249 -29 -265 -32 -49 -275 74 -157 -78 83 -179 54 309 -58 -176 45 -153 -106 163 7 81 141
2400A41j95K20k51L1Po7j5J51r8l02J72L58K9m93O47p7k44o3O2kj9L42k19k34
$$ 141 -54 166 -85 -54 -47 -114 -129 22 -76 -378 -206 152 181 -312 335 258 14 -49 13 11 -8 334 115 -119
2424a19J92p7J07MP5l49J46O1J1j37J54n6r4J79L8L9k23k80L96k98P2J79k10L28
$$ -119 73 -4 103 107 182 -167 -21 40 51 -86 68 12 -82 97 135 174 -49 -329 67 -231 -159 20 -190 138
2448A38m84M11j23J76Q0m90J01L41n0k21L50p6k58J85P0k38J94j38J34Q8k08o5
$$ 138 -346 65 -58 118 198 -292 -191 150 100 -121 229 153 -105 80 150 -88 106 -32 102 190 -18 -83
2470h3M1J93k36J59K48l55J63l33M24Q9k85J20j82j39l9P1K09K2l00L47Q6k96
$$ -83 -42 151 -85 74 322 -33 130 -203 221 310 25 145 -37 -176 -215 -144 65 87 -213 134 220 -76
2492g6L1J33J19k98K96k53m9O6J9O6k17L83j4j02j9r2R9K42j33m09M47l98J81
$$ -76 -45 88 207 -91 205 -48 -97 -31 -12 54 -163 220 206 104 85 -7 92 334 201 -208 239 -159 22
2515B2n7K73j40R4l05J73L1l49J93j24J01P0%K4j20L4L62m64J53J68j10K19k72
$$ 22 -35 238 98 192 -113 60 91 -258 -65 -189 -88 -18 -18 6 -114 -80 282 -182 -29 139 29 248 -24
2538b4j6j7K37j24k39J89K07j85j05L5j73L06M1p3q6m9J30k28K84l26J55p0L33
$$ -24 -40 -57 180 56 -183 6 213 28 -77 -42 -215 91 132 59 -27 -76 54 -174 110 -216 -61 -131 202
2561B02k07k6J51m1J44j67P9j56J97k7j80k1M26l14k12L14l4j23j7J21j63N0j53
$$ 202 -5 -31 120 79 223 56 135 -21 176 149 -31 -52 374 60 -152 162 128 5 -12 109 -54 -4 -157
2584a57o4M6L05l07L12k06l0J01j52K53p6l8K2j69J70r8L14n30O2M58k94J26J6
$$ -157 -221 -175 130 -177 135 -71 -101 0 -152 101 25 -13 9 -160 10 -88 226 -304 -242 216 -78 48 64
2607F4l58M86O0o7K9j58j10l0J15j17K83m06K11l11N08l68Q5L53p2m57J63K00
$$ 64 -294 192 252 185 214 56 -54 -84 31 -86 197 -209 2 -309 199 -169 -84 269 197 -260 -97 103
2629A03j64j49L98k03j82m0K2K41R3o9k76J06R9j49K49j62Q8r3L15m17J82l9L7
$$ 103 -61 -210 188 -15 -197 -237 -215 26 119 50 -226 -120 -21 -170 79 -83 5 -88 227 -190 -8 -47 -10
2652a0k45M03j40l15L44j98L79r4k25K29r7l38J68PN8j57O7P7L12k43N9r2K12
$$ -10 -255 148 8 -307 37 -161 218 124 -101 128 31 -307 -139 -132 -74 -231 -164 -87 225 -18 41 -51 161
2675A61k75J21j51J92j02K15m21J92q0J70r7K3J79j32j57j4K28j30j1J29j63K62
$$ 161 -114 7 -144 48 -54 161 -260 -68 -148 22 -75 -52 127 -5 -162 -176 52 -78 -89 40 -123 139
2697A39j30l3j30l0L50p8j21K51%j19l8p4M1k93N11j18l48K41l3j18L51k95R4
$$ 139 9 -24 -154 -184 166 88 -33 218 218 99 61 -13 28 -265 246 128 -220 21 -12 -130 221 -74 20
2720B0K42j5k03l82K84J89k05K10j17Rn8M3J30l4o0K0k83L01Jq6j20k8N0J18j18
$$ 20 262 247 44 -338 -54 135 -70 140 23 32 -26 17 147 113 53 73 -210 91 92 6 -114 -142 -92 26 -92
2745i2L43j0m8J7l76J62J69j11p4P2j70K97k4l14Q0l5K93k19M5n6Jr0K29m5j47
$$ -92 251 241 193 210 -166 -4 165 54 -20 52 -118 179 155 -159 -79 -114 179 -40 5 -51 -50 -140 89 44 -103
2770a03K67K1l70j4L01O3k3k64Qo1J15kR2q8J00q6K81k69R5j60J0M00k25PO9K24
$$ -103 164 185 -185 -199 102 165 142 -122 -114 -175 -60 -62 30 -58 42 -44 237 -32 63 -97 -87 313 88 95 164 388
2796C88k62k11n8J42k65K35M8r6j9J7P9J02O3o6K3l14n2K57k88J22N40l19o2r3
$$ 388 126 -85 -143 -1 -266 -31 17 -79 -98 -81 -2 100 163 97 120 -194 -246 11 -277 -155 385 66 4 -89
2820h9P7q8j02N7N3K70j46j23N7J8o9k6J07Q6p4j52K62QJ1J63j73j73j07L47j60
$$ -89 -12 -100 -202 -145 -92 178 32 -91 -34 -16 -85 -111 -4 82 8 -144 118 126 137 300 127 -46 -153 194 34
2845C4NJ98j83K23k82m6m8R3j63M10j73j26k11K56J03R2k88Q4L1J35K14m78j09
$$ 34 39 237 54 277 -5 -51 -99 -6 -169 241 68 -58 -269 -13 90 182 -106 -22 9 144 358 -120 -229
2868b29K34K92k57KL20m42N8J56l55L00k10K33k34J05k9L00l18rk06L53r2j95
$$ -229 5 297 40 42 362 -80 -22 134 -221 79 -131 102 -132 -27 -56 244 -74 -83 -289 64 -28 -223
2890b23K71J03K4n33M30N6j77l8K33k16j01L9Q0J17M3k07K01j03K80j16o7j60
$$ -223 48 151 175 -358 72 128 -49 -87 146 -70 -171 -132 -52 65 108 -99 102 -1 279 163 96 -64
2912f4J11K63j45k40L7p3K58m07J40J65K88j42n9j50Q4k9Nn39O49k64l21K68j17
$$ -64 47 310 165 -75 -38 -111 147 -260 -120 45 333 191 132 -18 66 37 42 -497 152 -112 -433 -165 -282
2935b82L41m2j65L25o5p8P4k60J85N2j40J80q7J47J05k92qk23J21j72M46j08N4
$$ -282 59 17 -148 177 112 34 108 -152 33 85 -55 125 38 185 290 -2 -10 -233 -112 -284 162 54 108
2958A08j3j39j43J40k1K92l78l6J99N9k32J37o9K58j67j12L4l1Q1J03K7m07M76
$$ 108 95 -44 -187 -47 -68 224 -154 -190 9 68 -164 -27 -96 162 -5 -117 -83 -114 -33 70 97 -310 166
2981A66j33j42L5K26j61J97k75J01m6K3r1k86L70J4J65R3k47j02K07J5k62o2O6
$$ 166 33 -109 -74 152 -9 188 -87 14 -32 -9 -100 -386 -16 -2 163 256 9 -93 114 129 -133 -195 -129
3004a29l1L30k9K5j53k65j11K74RK32J4k15m9k02J42K24p9L47j33k28l19J78j87
$$ -129 -160 170 141 166 13 -252 -363 -89 -80 152 166 -49 -98 -300 -158 66 -13 334 201 -27 -346 -168 -355
3027c55L66p0K7J46K9n93M67L40j43l70K62j24K40k15j22J13%J9J88Qj74K1k21
$$ -355 11 -59 -32 114 143 -450 17 357 214 -156 106 -18 222 7 -115 -2 -2 17 205 213 39 60 -161
3050a61l5K61M3l0j38j36L24o1J05j02j21K00k79O4O5j15J36L5k03l4L86k27J8
$$ -161 -196 65 108 78 -60 -196 128 67 172 70 -51 149 -130 -66 -1 -116 20 55 -148 -182 204 -23 -5
3073ej51j3Q0n8k7J52R1M9j13m6l1L95k00l43K03L03m17K11j90n1K71J0j07J01
$$ -5 -156 -169 -89 -147 -174 -22 69 118 5 -41 -72 323 123 -220 -17 286 -131 80 -110 -161 110 120 13 114
3097A14k95k2K54l3p3k56M18o7k66M91l57M17l23r1l3K40k0M5J07m44J05q0L49
$$ 114 -181 -203 51 18 -55 -311 107 40 -226 265 -92 325 2 -89 -122 118 98 143 250 -194 -89 -169 180
3120A80j10n0j64J83Ll8Q2q9j75L12l0Q8k52P7J73l22J9j76M56m13K88j22K65
$$ 180 70 20 -144 39 42 4 86 -3 -178 134 104 192 -60 17 190 -132 -113 -289 167 -246 42 -80 185
3143A85j99p1J26l9jk39K81q2l1nq9j1J61J03m06K77O8n2Q7j59p7K25K00P7l94
$$ 185 -14 -85 41 2 1 -238 43 -39 -70 -75 -164 -175 -14 89 -317 -40 28 -24 63 -96 -173 52 252 329 -65
3168f5K44O0l56J44k07J18N2Pl9k42J11J74J4K84p2J3l26n3R4J25j72J42r6J80
$$ -65 179 239 -117 27 -180 -62 -10 -3 -42 -284 -173 1 15 299 227 240 -86 -139 -45 80 -92 50 -46 134
3192A34j78J65q6J32j04m20J58K39K26l81K24j77j85M10p2j30O9P5k27K0J42L
$$ 134 -44 121 35 167 63 -357 -199 40 266 -115 109 -68 -253 157 85 -45 24 99 -128 -108 34 37
3214C7k72K0J0L24k1m63O84l09k22K76k34K04p9m2J58l09J95j51K63m5l5k19o6
$$ 37 -235 -215 -205 119 98 -365 319 10 -212 64 -170 34 -45 -87 71 -238 -43 -194 69 24 -11 -230 -296
3237b96K85J43k37J25n0j2J22J08k97K99o5m1j69K31j35k76J81P8L12l95J96r5
$$ -296 -11 132 -105 20 -30 -42 80 188 -109 190 125 84 -85 146 11 -265 -84 -6 306 -89 107 12
3259A2J55k7J76l31n3K01n5J81n71M50j32q6L8K49j52j95K33J64m04k2k9J32J36
$$ 12 167 140 316 -15 -68 133 78 259 -312 138 6 -80 -42 207 55 -140 93 257 -147 -169 -198 -66 70
3282G0l6j05J74l12K29J16k02k27K74k01K76j92K75r3j7j30J61O5p0k4k24J48
$$ 70 34 -71 103 -209 20 136 -66 -293 -19 -220 56 -136 139 46 29 -101 60 125 55 31 -193 -45
3304d5K11j82Kk18K5L05r4J60q7J15j2k98j7L6K24r0O7j55J08j29K11k7j59K52
$$ -45 166 -16 -14 -232 -207 98 4 164 77 192 180 -118 -135 -99 125 35 102 -53 55 -74 137 110 -49 203
3328B03n28N07m1p8j40j75M01k15j05K98K9k39J20Q0N9r2m11J58L54n68K19J83
$$ 203 -325 182 141 63 -77 -252 149 -66 -171 127 156 -83 37 117 176 84 -327 -169 185 -383 -164 19
3350A9J78n6k59K4o5M3K28rL1j98J38l31L17R4k91J86q6o9J94k3L9q6k2j79P0
$$ 19 197 141 -118 -94 -159 -116 112 103 134 -64 74 -257 60 154 -137 49 -37 -106 88 65 104 18 -4 -183 -113
3375a13Q5K5N0k00K88j24j53K78m30J95P7K4L41k86J7J71m01L70J41n86L49J69
$$ -113 -28 -3 47 -153 135 11 -142 136 -294 -99 -22 2 343 57 74 245 -156 214 355 -231 118 287
3397B87j7q9J12j06p4j20Q1n3K72l62o9N4k1M3J18l7j61K56o5k25Q9J73k16K70
$$ 287 270 181 293 187 113 -7 74 21 293 -69 -138 -84 -105 -62 56 19 -142 114 49 -176 -87 86 -130 140
3421A40l60L56k10o3K35k45K94J40m19L11J01m79K03k2Q2n5J87l08M8K96j06l36
$$ 140 -220 136 -74 -137 98 -147 147 287 -132 179 280 -199 4 -18 64 9 196 -112 -64 232 126 -210
3443b10K50o0J34l40K89j34J71k06L37j47N4o1q5L5K33l81K27j72J56L1j83o6
$$ -210 40 -20 114 -226 63 -71 100 -106 231 84 138 77 -8 27 260 -121 106 -66 90 121 -62 -128
3465a28K21J42j63pJ3k03K32j67j59J83j18L09k91R5j04M3J73r8j10J52K1j80
$$ -128 93 235 72 65 78 -125 107 -60 -219 -36 -154 155 -136 -41 -145 -102 71 -27 -137 15 36 -144
3487a44P8k62L36oj11M9J4N7j85L2K30j67J47j40l0L71n33K92o9Q4l44J89R3J93
$$ -144 -66 -328 8 2 -109 -60 -46 11 -174 -142 88 -79 68 -72 -102 269 -264 28 -41 43 -301 -112 -19 174
3511A74k03J1k69J71R7J6j85p4J76P9j07N7m5j35M83q7j39r9P1o0j29J41J58J7
$$ 174 -29 -18 -287 -116 -19 -3 -188 -262 -86 -7 -114 -57 -102 -237 246 159 20 -79 -8 -68 -197 -56 102 119
3535A19l72L17L5k27J41j31K70j79M88m37j60N9J83j30mk01K32m1J36j28j07J18
$$ 119 -253 64 99 -128 13 -118 152 -27 461 24 -136 -77 106 -24 -28 -229 3 -38 98 -30 -137 -19
3557a9L60m85L07m3k08J78j49L4K75m06J33Kj52J30N8J7lj32n8J18J32p6m6J05
$$ -19 341 -144 163 120 -88 90 -59 -25 250 -156 -23 -21 -173 -43 15 32 29 -103 -161 -43 89 13 -33 72
3581G2k29J76K22k00j20r3L50L1k09Q7k87K2P1K08ON4l68J56l8m9J48j83J98j58
$$ 72 -157 19 241 41 -79 -172 178 209 0 87 -200 -178 -107 101 107 161 -207 -51 -89 -138 10 -173 25 -133
3605a33J70j30K40j47j02n1K52l7k65j0J49L01m8m35K41Nn6N3q2J04J99l11N8
$$ -133 37 -93 147 0 -102 -153 99 62 -203 -213 -64 237 189 -246 -5 0 -56 -3 -85 19 218 -93 -35
3628c5P4q7L04l87J26L6l2rJ9n6K31j05j13j83K73j97k0K33o9k36K93l1rm3L6
$$ -35 39 -48 256 -131 -5 31 -1 -10 9 -47 184 79 -34 -217 56 -141 -161 72 3 -233 60 29 20 -23 13
3653A3K1P2j89j72L13l1q0p9L3K10K02l07J14p4l8J00j25n4J29r2J2j78N9K17
$$ 13 34 106 -83 -255 58 27 -53 -132 -99 111 313 6 120 46 8 108 -17 -71 58 -34 -22 -200 -141 76
3677G6L9m8J85j74j39k20K46j67M84k19K6j77L9M23n54mL63k66P4K6j35M3L34
$$ 76 115 67 252 78 -61 -281 -35 -202 282 63 89 -88 -49 374 -180 -184 179 -87 -13 13 -122 -79 255
3700B55k5m34L20j83l6K08k29Q8n0J21J40r5j28L8O0j72K55l01L47m27nN04k06
$$ 255 230 -204 116 -67 -103 105 -124 -36 -86 35 175 80 -48 -10 50 -122 133 -168 179 -248 -253 251 45
3723D5m9J3O9k51J96k69J38M20k54P1%j94m7J45R4k18O6K9l0L6j46J17J11o1j27
$$ 45 -4 9 78 -173 23 -246 -108 312 58 129 129 -65 -112 33 127 -91 -25 4 -26 10 -136 -19 92 31 -96
3748i6pL94k78N4j20M94j97k25J26j12l2j37K49k63j3M00k34R7n9K04jk88L9q9
$$ -96 -103 291 13 67 -53 441 244 19 145 33 1 -136 113 -150 -163 237 3 100 41 245 244 -44 -5 -94
3772i4L05l62Q0J37k01L1J64J03J00k16l17K62m9M5r4M69m33l3K56k54k84K89
$$ -94 211 -151 -71 66 -135 -104 60 163 263 47 -270 -8 -57 -12 -106 363 -70 -103 153 -101 -385 -96
3794i6J02m6J77pKj18J75j79l25L63R4j97J8Q5O8j79J65J00r0j08lJ14j99K91
$$ -96 6 -40 137 130 132 14 189 10 -315 48 142 -55 -37 48 116 -63 102 202 112 4 1 115 -84 207
3818B07k16J13K6k29J78j67J18k94K03O4j43J58j77L1K4p7J94j98J10J17k09K76
$$ 207 -9 104 130 -99 79 -88 30 -264 -61 3 -140 18 -159 -128 -104 -181 13 -185 -75 42 -167 109
3840A09k15P2L9j69j17L39l4K09n21N04k0j37j4K59k78RJ58k59N4k58K75j98L72
$$ 109 -106 -34 5 -164 -281 58 24 233 -288 216 196 59 45 304 26 35 193 -66 -12 -270 5 -193 179
3863A79Rm83L60k2J20k48J34K20m5j24k90L89j44Q8l48p0L39l4j99M38k88j00
$$ 179 188 -295 65 43 163 -85 49 269 224 100 -190 199 55 143 -205 -275 64 30 -169 269 -19 -119
3885a19P0Q0j29r8Q2J57l4P9J61k2l17LJ61k63K39L4j15j71J86q9K72m71K45k87
$$ -119 -49 31 -98 -196 -114 43 9 88 249 227 -90 -87 74 -189 50 84 -31 -202 -16 -105 167 -304 -59 -346
3909c46M45r8j31r1K84j70O3J01o3L7M9K5l55L27j60L8J28n9J48J4J4j67K41l09
$$ -346 99 1 -130 -221 63 -107 -44 57 -6 31 80 105 -250 77 -83 -45 83 24 172 186 200 33 274 -35
3933c5K5M7m6J15k69Q3j69MK14l07M74k84r7qL32O3p2k84K82J3l06K98J56j97
$$ -35 -10 37 -9 106 -163 -80 -249 -245 -31 -338 136 -148 -245 -253 79 142 70 -214 68 81 -225 73 229 32
3957C2K17j78L9o2j78N1r1J95P7j85K15k14m3MJ92J07j73j16M25j69l76P9K53
$$ 32 249 71 110 48 -130 -79 -170 25 102 -83 132 -82 -125 -121 71 178 5 -111 314 145 -231 -152 101
3980A01m6j71L4p8M25m69N86m50K6m8r3J61J9j67L32j78P8q8J6L0J19j19m5n7
$$ 101 55 -116 -82 -160 265 -204 382 -68 -42 -90 -183 -22 -3 -170 162 -16 62 -26 -10 20 139 20 -25 -82
4004h2p9J02L36j98j0P5r6m6J17j49l3K08J66j28N9j37j22J83p4N9L3%k44K8j77
$$ -82 -161 -59 277 79 69 144 48 2 119 -30 -63 145 311 183 242 105 -17 166 92 151 184 184 -60 -32 -209
4029b09R3L29m7l0P0k09K90m73J10J70j42P6K8j62J13M8j45J02O9j02K72m67L02
$$ -209 -116 213 166 136 206 -3 287 -186 -76 94 -48 28 56 -106 7 55 -90 12 81 -21 251 -216 86
4052H6j20J43m7K1P4k99J17Q8R1K0o6j04L8K18l75J65j36k6Q7J49m81L19Q8r4
$$ 86 -34 109 62 83 157 -142 -25 63 154 174 108 4 42 260 -115 50 -86 -112 -25 124 -357 -38 50 -44
4076d4Q5J58o2O2k70K48j53J57J9j04J16k37N5J14j37J32p1j49p2p5M48j38j16
$$ -44 41 199 137 199 -71 177 24 181 200 96 212 -25 30 144 7 139 68 -81 -153 -228 220 82 -34
4099c4J91K5k27j10J18K85k34r1J72j92J55K8J65m94K56k09K11K3k07L21j87j24
$$ -34 157 182 -45 -155 -37 248 14 -77 95 -97 58 86 251 -243 13 -196 15 38 -169 152 -35 -159
4121a59n8L21l45L14j45P6N6p8l2q1L30k42K09k47K11k79K32k46k07N75j60r5
$$ -159 -217 104 -241 73 -72 4 60 -18 -50 -131 199 -43 166 -81 130 -149 83 -163 -370 205 45 -50
4143e0K28j90L2L01l05J66j44J7k88K10l52L11OM3L1k15K58l46K77K5P7l37P7
$$ -50 178 -12 20 321 16 182 38 55 -233 -23 -375 -64 -58 -15 16 -199 59 -287 -10 15 92 -245 -168
4166a68J6k3J91J5J31o4K08k39J09l49oK61j66L57k39K2j23M6K05L9k08m0j03
$$ -168 -152 -175 16 31 162 98 306 67 176 -173 -179 82 -84 273 34 56 -67 -21 184 223 15 -25 -128
4189a28J59J11j54j49L14J59n45J9L62q2J54j11l06K94J22k33P5j36J37lk39K39
$$ -128 31 142 -12 -161 153 312 -233 -214 148 66 220 109 -197 97 219 -14 61 -75 62 59 -180 59
4211E9J7k10L15n0J40l63J19l3K96J1m1k60j34K83R2m29N9Q8J87k53M8M0O5q7
$$ 59 76 -134 181 131 271 -92 27 -6 290 301 260 0 -134 149 241 -188 -129 -41 146 -107 -59 -19 46 -41
4235d1l7K43k74q3K98M7j46m0K00j47oJ80j55JJ98l27J47J46l40p9J38P4%L1j63
$$ -41 -78 165 -109 -192 106 153 7 -33 167 20 14 194 39 40 238 -89 58 204 -136 -215 -77 -3 -3 28 -135
4260a35M63l27l09K69K1r6qJ20k3J17OJ50o67O87ol51K8O2J01j67K91k90R6o0
$$ -135 328 1 -308 -39 -18 -114 -122 -2 -25 92 98 248 -419 268 262 -89 -61 1 102 -65 226 -64 32 -28
4284b8J08l79L99l00Q4q3K18J31k59N33k56l34J87J35q6J57Kl7p7L47m40O1j16
$$ -28 80 -299 100 -200 -116 -199 19 150 -109 424 168 -166 21 156 70 227 229 192 115 462 22 83 -33
4307c3j68J72m7J45K61l77J82j59n3n9K10L12l14m2rk32O87m45O7J8q8q6P0k32
$$ -33 -201 -29 -76 69 330 -47 135 -24 -77 -136 74 386 72 30 21 -211 476 31 98 116 28 -58 12 -220
4331b20M13l91K9k8L04L9l01rj29K75l80M15k63L67k0j54J6n1J51Ro9Pl8q3j45
$$ -220 193 -198 -169 -197 107 146 -155 -164 -293 -18 -398 17 -246 121 101 -53 -37 -88 63 72 3 10 -28 -111 -256
4356b56L07k12j5J02j57K14q3p6R4K18o2k2KM32o40jK54p6J69q2l37M75m40P0
$$ -256 51 -161 -176 -74 -231 -17 -100 -176 -82 136 74 52 54 486 -154 -155 99 23 192 110 -227 248 -192 -122
4380a22J61k33J72N3j86J14K06k79K23m72L17J46l08R9L50j06j13j49L71k78r3
$$ -122 39 -194 -22 31 -155 -41 165 -114 109 -363 -46 100 -208 -109 241 135 22 -127 244 -34 -127
4401a27P7k6MR0Q6K8k54L88j55j60R0r6O5k61K09n2OL2J00J25l84K28j43J82p8
$$ -127 -50 -76 -72 18 104 132 -122 266 111 -49 41 -55 10 -251 -42 -94 -88 -56 44 169 -215 13 -130 52 -26
4426b6n1J38k77K43p9J29j57m7q5J84N2j76rJ77j7Qj72J01N5ol16J78R6R0oj91
$$ -26 -77 61 -216 27 -52 77 -80 -127 -212 -28 24 -152 -161 16 -1 7 -165 -64 -9 -15 -331 -153 -57 33 27 -164
4452a64M72k85K56k10j99J99j13J17K61l78K23k38K95p3k17o0j31L51j98L37k36
$$ -164 308 23 279 69 -130 69 -44 73 334 -44 179 -59 236 163 -54 -114 -245 106 -92 245 9
4473IR7j90LJ86jL9m37R5L7o2J51k27L01qM8L16o26J08K53k04j00K30j19L5L12
$$ 9 106 -84 -81 105 104 143 -294 -199 -162 -224 -73 -300 1 -7 41 357 -269 -161 92 -112 -212 18 -101 -66 246
4498B46j96J08J13j19k75J79j66j56K30J7J25k35K27j3j65K51l41M73l10p5K64
$$ 246 50 158 271 152 -123 56 -110 -266 -36 -19 106 -129 98 85 -80 171 -170 303 -7 -82 182
4519A82j94k26K28l6K82p4k79J9J52j01k09K16K12q6k74J34N1R9k76J44J09O6
$$ 182 -12 -238 -10 -46 236 162 -117 -98 54 -47 -256 -40 172 86 -188 -54 -3 96 -180 -36 73 139
4541A39p2j05J57Rj13J39k0k98j7K84N5j72n8K20j01k0O3k01L02l87L43k65M02
$$ 139 67 -38 119 128 15 154 134 -164 -181 103 158 -14 -72 148 47 27 90 -111 191 -196 147 -118 284
4564B84k17k04L37j80K37l22L4j31j22L76j40P8N6o6%l04K15k9m9O9q2L27j96
$$ 284 67 -137 200 20 257 -65 -31 -162 -284 92 -48 30 86 20 20 -284 -69 -98 -147 -78 -160 167 -29
4587b9K8N9nN0j54K92m65K23r8O4k4J62k23J77O9k25K61k11k01O0K70j30N3j17
$$ -29 -1 58 53 103 -51 241 -224 -1 -99 -35 -59 103 -120 57 126 -99 162 -49 -250 -190 80 -50 3 -114
4611a14n3J71q3K58k49K92l06m5K24k01j10K25O2q8Q3k50K41J10J6k2j90K7R5
$$ -114 -167 4 -79 179 -70 222 -84 -129 95 -106 -216 9 71 -17 66 -184 57 167 183 161 -29 -2 93
4634I3j00J05k64J88J0j49J46J40J08k25k66K91j66o7Q3r4O6J20L9N4j4N8o9l
$$ 93 -7 98 -166 22 32 -117 29 169 277 52 -214 77 -89 -156 -73 -167 -101 19 58 112 98 156 87 84
4658H4Q5k22n5j75J86P8J48j84J66k46L1n2R8j9o5K27j76R0J65j60o3N7Pk6k70
$$ 84 169 -53 -108 -283 -97 -19 129 -55 111 -135 -104 -156 -58 -77 -142 85 -91 -1 164 4 -59 -2 5 -21 -291
4683b91L40p0n3J14k78J1r7L92k08K13j21L7J77k15J53k3j55J06j57J96J73j21
$$ -291 49 -21 -74 40 -238 -227 -324 68 -140 73 -48 -11 166 -49 104 81 -74 32 -125 71 244 123
4705A23j80J10j73Q2k4L19l19J09j06r3J64j14K19p3N1k0j97j3n3K71j54K15k33
$$ 123 -57 53 -120 -38 -62 257 -62 47 -59 -152 12 -102 117 44 95 75 -122 -135 -188 83 -71 144 -89
4728h9o1J03Pk8J59l15N1nM9O2O4nJ50k80J29J12k54L20j66j13L41j43p4m9O8
$$ -89 -150 -47 -40 -68 91 -224 -173 -178 -129 -67 -3 -8 142 -138 -9 103 -151 169 3 -110 231 88 14 -35 33
4753C3K45n21J58O4r6NK91l59O1N0K42M4Rl19m9k0K21j40Ll0m5R0J01l7k9o3M3
$$ 33 278 -243 -85 -21 -117 -112 179 -180 -119 -69 173 217 226 -93 -142 -162 59 -81 -78 -108 -153 -63 38 1 -28 -91 -48
4780d8l5p2K14j00k15K17k9M1p1J17j96J69j90K55P9j52K9M9k12J54P1j59j68
$$ -48 -83 -155 59 -41 -256 -39 -68 -27 -98 19 -177 -8 -198 57 136 -16 13 62 -150 4 75 -84 -252
4803b52L29M0k09J80j08j86K25J19l32K66p8j51R2j45K58q2K87m11J83j34o1R2
$$ -252 77 117 -92 88 -20 -206 19 138 -194 72 -6 -157 -65 -210 48 -34 253 -158 25 -109 -170 -78
4825g8P6k18o2K44k13J45p6K11R9m88L18j87L53k09L51l06N6j72L73j95K42k06
$$ -78 -2 -220 -282 -38 -251 -106 -182 29 128 -360 -42 -229 124 -85 266 -40 16 -156 217 22 264 58
4847E8j73J10J33O6m02L33j76J5l05N12k00J40O3k90R2J52j04k56L44J80l01j10
$$ 58 -115 -5 128 194 -208 125 -51 -36 -341 171 -29 111 174 -116 -24 128 24 -232 112 292 -9 -119
4869a19P0j0l1L34m19j4M29l32J06j66J23P7j9Q0k55L22j77k59L08k09N5K19L0
$$ -119 -49 -59 -90 244 -175 -189 240 -92 14 -152 -29 48 29 109 -146 176 -1 -260 48 -161 -106 113 143
4892A43j52J07j19L0q6J55Rj39o0J73Q1l5qk26K74l15L33j35Q1j12Q6l2l42L26
$$ 143 -9 98 -21 9 -77 78 87 -52 -112 61 142 107 99 -127 147 -168 165 30 111 -1 85 53 -289 37
4916C7m7jJ03j79J43L24k69l38K38P5q9J91j07o5p0q4L23N4j80l3k3j37l3J18
$$ 37 -10 -11 92 -87 56 380 111 -227 11 86 -3 188 81 16 -54 -138 185 239 59 26 3 -134 -167 -49
4940d9R8j51N7j43j11J58K03q5J36p7J2lj07J15M40o64J81J32q4j75P9L24j81
$$ -49 49 -102 -45 -188 -299 -141 62 -23 113 36 48 45 -62 53 493 -171 10 142 58 -117 -38 286 105
4963A05m0k68M67j84J00j96J38j86N5K2O9O9l96J65K1j4P6J75k76J32k80l32N45
$$ 105 65 -203 264 80 180 -16 122 -64 -9 13 82 151 -245 -80 -59 -73 3 178 -98 34 -246 -578 -33
4986c3Kl64N73k46O9j00nj03P5J38l97R8J61J02L2O8Q8o4R3k80L81k45j39K70
$$ -33 -31 -395 178 -68 1 -99 -104 -207 -132 6 -391 -293 -132 -30 2 70 158 94 187 -93 288 43 -96 174
5010A74m7k13L5ol9J83k02K09l00p3pM85l05O7j07K98j22K3rj32J82k64K69j44
$$ 174 127 -86 -51 -57 -96 87 -115 94 -206 -279 -286 199 -106 -39 -146 152 30 53 44 -88 94 -170 99 -45
5034d5J42j38L5J5j33K24n8L3k58K46j63J39J6o8L7N9k1j52P2O3k98L84k49n7
$$ -45 97 -41 -6 9 -124 100 42 75 -183 63 -100 39 55 -13 24 83 62 -90 -18 45 -253 131 -118 -175
5058a75K86O6k16R4j40mJ78r3K62m07n4J44l4J42O6O6k40L48l53j7J5J8l9P7m
$$ -175 111 177 -39 55 -85 -89 89 -4 258 -149 -203 -59 -93 49 115 181 -59 289 -64 -81 -66 -48 -87 -10 -14
5083a4j94J31J65J6k7o0l08K66l1L58k39J31k73J41j15J51k99K54J50p6k61J26
$$ -14 -208 -77 88 104 77 17 -291 -25 -56 302 63 194 -79 62 -53 98 -201 53 203 127 -134 -8
5105hj30j15J25k26M18N1K7k57N0p0p1K71j42J93J98l32j62K12j69K84j39J11
$$ -8 -138 -253 -128 -354 64 115 142 -115 -65 -135 -206 65 -77 116 314 -18 -180 32 -137 147 8 119
5127A19k43Q6j87J80J60L6j69j16K39n6M9J57k05r1l0J40o9P2J10j69j10K6oj29
$$ 119 -124 -38 -225 -45 115 151 -18 -134 105 49 98 255 50 -41 -71 69 0 72 182 13 -97 -71 -77 -206
5151b06o4J56K85m11P0K60j28K9k8J7j69K76o12M86J48o6k06K2J86j36J69J9k05
$$ -206 -270 -114 171 -240 -170 90 -38 -9 -37 -20 -189 87 -525 -39 109 43 -163 -141 45 -91 78 97 -108
5174a08M35j60j81p0K47P3j97k66J29M5J23O8l3P9M2k12l5j50J84j82J48J5L4
$$ -108 327 167 -14 -84 163 236 39 -227 -98 -53 70 138 105 184 226 14 -21 -171 13 -169 -21 -6 28
5197B8j84J99l15J24K1M0L93n70N58m33l1L14J0j22J87k80k36N36j92l9j57K22
$$ 28 -156 43 -272 -148 -127 -87 306 -264 294 -139 -170 144 154 32 219 -61 -297 239 47 8 -149 73
5219G3k65K29q1q9m5K95k96M27l11K80k83K01kl48L39k16O1K23k31kj75M02n4
$$ 73 -192 37 -44 -133 -178 117 -179 248 -63 217 -66 135 133 -215 124 -92 -31 192 -39 -41 -216 186 132
5242A32j98J59j51J0%j1m6M3J02j67J88L7Q5j40k04J16KP6m0qJ54K0l48N2J62
$$ 132 -66 93 -58 -48 -48 -59 -105 -62 40 -127 61 98 183 43 -161 -45 -43 33 -7 -15 139 159 -189 -137 25
5267B5J22q7K7N5j17k89L16j19j7j9k8m8K94ok06J56k68L09n1j95K8K48l12J17
$$ 25 147 60 87 142 25 -264 52 -67 -84 -103 -131 -179 115 109 -97 59 -209 100 49 -146 -118 130 -182 -65
5291f5j0n6J92q7K24M4j00r2oj19L25l30J56J53j86J08J68m29KK10K63j49k01
$$ -65 -75 -131 61 -26 198 242 142 50 44 -75 250 -80 76 229 43 151 319 -110 -108 102 365 216 15
5314A5q4J54j15o6M4L7J52pj74p0K64M1j64j56K70k16O1j11J59L0J1j66Q2j44
$$ 15 -69 85 -30 -96 -52 -15 137 130 -44 -114 150 191 27 -129 141 -75 -14 -125 34 64 75 -91 -9 -153
5338a53p4J64N8R7n6J99k85J48J6j56p1%j40L18l1K15j26r8K99k41N0j04K23k94
$$ -153 -227 -63 -5 92 36 235 -50 98 114 -42 -113 -113 -253 65 34 249 123 25 324 83 133 29 252 -42
5362d2K1M2J97k29K18j42Q4l96L13j95K90j43j39M5k25K91ol2J5M5k17J04j22
$$ -42 -21 21 218 -11 207 65 149 -247 66 -129 161 18 -121 -76 -301 -10 -16 -48 -33 12 -205 -101 -223
5385b23L71j26Pj25o2K32k70K82j83J28o7J75J52l38N0o7k0J65j07J14l33l8M01
$$ -223 148 22 29 -96 -158 74 -196 86 -97 31 -36 139 291 -47 3 -64 -84 81 -26 88 -245 -283 118
5408A18j73J42j49L29k91l21L30N5N4J52l01l8J7K23j21p3J66j57M0l3o1L5P1
$$ 118 -55 87 -62 267 -24 -345 -15 40 94 246 -55 -93 -76 147 26 -47 119 -38 2 -31 -92 -57 14
5431A4j85L9L10j84j61RK31j20J58k20K05J02k08Jk36L83m4k46J82K4J61k21J08
$$ 14 -171 -132 178 -6 -167 -158 73 -47 111 -109 96 198 -10 -9 -245 138 94 -152 30 54 215 -6 102
5454A02r2r1K16k65L27o7k73L99k92P7k25J18K06j02q2M67m20k34M44k89J22J72
$$ 102 10 -81 135 -130 197 130 -143 256 -36 41 -184 -66 140 38 -44 423 3 -231 213 -76 46 218
5476B18j34l1j37J65J94k15O9m20L05r5J47k18q0K02r4P4K55J33m53K52q6J07
$$ 218 84 53 -84 81 275 60 129 -291 14 -81 66 -152 -232 -30 -124 -50 205 338 -115 137 51 158
5498A58j36j7Q9J39j05j24J99j66K97k05o7mqk9P7p3j82L98L4n2p8j09Q3L80k45
$$ 158 22 5 94 233 128 4 203 37 334 129 62 58 50 21 98 25 -157 241 275 223 145 36 119 499 254
5523B54k26k06L01N1k19M9k57L45M9j83N2P2j45r0L09j55Q8J32k45J50k44o0Q9
$$ 254 28 -178 123 174 -45 4 -253 92 141 -42 10 82 -63 -153 156 1 89 221 -24 126 -118 -178 -89
5546h9L45m51l2J31P5j56k0P8K9nL9N7J24j69K76j33p5n2J27k19J08K57l61m2
$$ -89 256 -195 -227 -96 -21 -177 -197 -119 -90 -95 -56 1 125 -44 232 99 24 -28 99 -120 -12 245 -116 -158
5570a58n4M13k92qJ54q7N9P7j66J26k46J19R7l11L85j68pO2j6J51L04m65j57J93
$$ -158 -212 201 -91 -99 55 -32 27 104 -62 64 -182 -63 34 -277 108 -60 -67 -5 -21 130 434 -31 -188 5
5594En4l1J67l39L46j11K9j50L26k68J02k23R5k9L6N8j52M7J64l53L89k57K51
$$ 5 -49 -80 87 -252 94 -17 12 -138 188 -80 22 -201 -106 -135 -99 -41 -193 -146 18 -335 54 -203 48
5617D8j16N5%M0o3K9k60L20m5%L23l79q6J18J35j88K71l8j17m8j12J18J56j54
$$ 48 -68 -13 -13 27 -36 -7 -267 53 8 8 331 -48 -134 -16 119 -69 202 164 47 -1 -113 5 161 7
5641Gj24j36K77KJ36k2j25K84j50m59J87J90J94j64k36K74k21J37p2k47K49L23
$$ 7 -117 -253 24 26 162 140 15 299 149 -310 -123 67 261 97 -139 135 -86 51 -21 -268 -19 304
5663C04j10j73k50J85K82j84J69K9j69k3J31j40o9M6j85K87j29l04O5L78o1j43
$$ 304 194 21 -229 -44 238 54 223 252 83 60 191 51 -18 28 -157 130 1 -303 -238 140 79 -64
5685f4J85k14L5P7n9l7J9k30M76q5o7k3k54J87lJ35m31L79m7J11j10o2R2L50l35
$$ -64 121 -93 -58 19 -40 -77 -58 -288 188 103 36 13 -241 -54 -57 78 -353 26 -21 90 -20 -82 10 360 25
5710B5R3j69J96J1n0l46J14J40P7j99J37J67L9k46M2m6K71m22P8O7O0j55L07j52
$$ 25 118 -51 145 156 106 -240 -126 14 91 -108 29 196 235 -11 31 -15 256 -166 -88 -21 39 -116 191 39
5734C9j43L22l86P0J35m6K25j66L0J1ok21Q0j5j20K34j61K9L1M10k38m5k24K8
$$ 39 -104 218 -168 -98 37 -9 216 50 80 91 85 -136 -56 -71 -191 43 -118 -89 -58 352 114 69 -155 -127
5758a27J49%J5j4J18J44l91J14k6j6p0K67m1j38K29k18o4J87k0R2m37K60m0J13
$$ -127 22 22 37 23 141 285 -106 8 -18 -34 -104 163 122 -16 213 -5 -69 118 98 190 -247 13 -27 86
5782H6l3j43J43j52J89k29K03R2k14R4k73L34j16P0J47l46k5L91k49k81K43K41
$$ 86 53 -90 53 -99 90 -139 64 156 -58 36 -237 97 -19 51 198 -148 -173 218 -31 -312 -69 172
5804A72j26q0j6p0K05k09J01J25M2L2k23j9j42J44j17L4Q3J55J13k63l2j6J87
$$ 172 46 -34 -50 -120 85 -124 -23 102 144 176 -47 -66 -208 -64 -181 -147 -64 91 204 -59 -91 -107 80
5827H0o2O0J6M5k95L3M66p43M36j45R7N4k10N6J36M2Pk67J90J22k89K13J2q1l07
$$ 80 18 78 94 139 -156 -123 343 -400 36 -109 -12 42 -168 -112 24 66 73 -194 -4 118 -171 42 54 -27 -334
5852c34K93lo1l4J35J50p1k40J66k57K97o2k0LJ2J79O6l29L49j83k33L90p8k33
$$ -334 -41 -44 -105 -139 -4 146 75 -165 1 -256 41 -21 -41 -38 -26 153 219 -110 239 56 -177 213 135 -98
5876i8m1l1n9J74J97l69L58k78l48M29M7l71R5J80Q9L44l05j12l0M06l23K39j40
$$ -98 -139 -170 -229 -55 142 -227 131 -147 -495 -66 -19 -390 -295 -115 -26 318 13 -99 -129 277 -46 193 53
5899E3j94L29R0k80J14j09J23l64J27J07j9J38l4J39n3j94r9R6K9j66K44k80M06
$$ 53 -141 188 278 -2 112 3 126 -238 -111 -4 -23 115 81 220 167 -27 -126 -30 -1 -167 77 -203 203
5922B03p9j47J92J17l84J49k3K0q0K45l07j38K88j55n1K72Q3m06J51K77m93N2
$$ 203 124 -23 169 286 -98 51 28 48 -32 213 -94 -232 56 -99 -150 122 205 -201 -50 227 -266 -214
5944b14QJ07K29k18j28J31K61N4k78K0oJ43o7P5k68j66K66J08j70M12n02J67p2
$$ -214 -206 -99 130 -88 -216 -85 176 230 -48 -28 -34 109 42 117 -151 -317 -51 57 -113 299 -203 -36 -108
5967a08M6n2k8J03l5N5J00l6k87L11j49k06M33l80K8J6J77M5J32k60J55K3j35
$$ -108 -62 -114 -142 -39 -74 -19 81 45 -242 69 -80 -286 147 -233 -205 -189 -12 33 165 -95 60 83 -52
5990e2p8M0J23j80K78o3j75J13J97j51p9J79J5m52O6K14P0q4l32O71m09q1l3L25
$$ -52 -130 -90 33 -147 131 68 -107 6 203 52 -27 152 167 -285 -219 -5 65 -19 -351 320 -89 -170 -203 122
6014A22j90q5L82j43Q6k96Q8j31k10N72k58J45ON8k54j11L69k33ML04l24m4K6
$$ 122 -68 -153 229 86 172 -124 -36 -167 -377 195 -63 82 88 146 -108 -219 150 -83 -79 225 -99 -143 -117
6037a17L5J53J87m82L76j07k8j5q5L69l49j2Q6j9K1M9K6j59Ojm6K25k1k2k36K57
$$ -117 -82 71 258 -224 152 45 17 2 -83 286 -63 -75 11 -8 13 62 88 -71 -65 -66 -112 113 92 70 -166 91
6063I1o6n9O4j78j89M38R5j22K7j06M6pj03%N7J77k75P0J30m31L36J08j41K4K33
$$ 91 25 -34 30 -148 -337 101 196 74 101 -5 41 34 -69 -69 -12 165 -110 -40 90 -341 -5 103 -38 -14 219
6088B19m69K76l3M8r2J96pK03k56n7j91J07L7J08Q5l62N91j93k46R2J72k83J03
$$ 219 -250 26 -7 41 -51 145 138 341 85 28 -163 -56 -19 89 174 -188 403 210 -36 56 228 -55 48
6111D8k56K41q4nJ13j38J0l7L50m7k03Q1j76R9q5l6K84k21J28K1K2J00j54j93
$$ 48 -208 33 -51 -56 57 -81 -71 -108 242 195 -8 73 -103 -4 -89 -125 159 -62 66 87 109 209 55 -138
6135a38M9r8L72r6k76L27j67j53J85p7k10K79j0L5K92m95j05K97O1J01k78R1P
$$ -138 -89 -187 185 89 -187 140 -27 -180 5 -72 -282 -3 -13 22 314 -181 -286 11 72 173 -105 -14 -7
6158gn9L1J26j18r4O9j51K17mJ10k16J98k30j4K57j76j10L26j07Q3j98L14k77
$$ -7 -66 -35 91 -27 -121 -52 -203 14 10 120 -96 102 -128 -142 115 -61 -171 155 48 131 -67 247 -30
6181c0K0K40j12J48l09Q4k48M81k97k66L54q3J50l63L38j35M1M8j13K11J50m55
$$ -30 -10 230 118 266 -43 41 -207 274 -23 -289 65 -18 132 -231 107 -28 13 61 -52 159 309 -146
6203a46J68K02l71K39k9j7j75N9j8K36k74M46j36n0J4j05j49J82k17R4L23k9j62
$$ -146 22 224 -147 92 63 46 -129 -70 -88 148 -126 320 184 134 148 43 -106 76 -141 -47 276 247 85
6226H5k93K45n8m8K6j01o6L7K9K0K30j24J25j08J15j36MMl3q3K98j42p8L3j69
$$ 85 -208 37 -21 -69 -43 -144 -210 -173 -144 -124 106 -18 107 -1 114 -22 -18 -14 -47 -130 168 26 -52 -19 -188
6251a88J36j34K29p3q1L7J42P8j98K08k31Jj1J94O4l6j41k08K01m0K17o1n6j30
$$ -188 -52 -186 43 -30 -111 -74 68 146 -52 156 -75 -74 -85 109 173 137 -4 -212 -11 -51 166 105 49 -81
6275h1j25J61J10j43J40r9J80rk92M2L16N9m00J58J16o8j82j24J76j26J41q6K19
$$ -81 -206 -45 65 -78 62 -37 143 134 -158 -116 200 259 -141 17 133 65 -117 -241 -65 -191 -50 -136 83
6298H3nk30P4L04j97q4K01j59k1j5J10j69J20J31o9k71K15m2j63J46J62O9n07
$$ 83 78 -152 -78 226 29 -55 146 -13 -34 -49 61 -108 12 143 74 -197 18 -24 -187 -41 121 190 -317
6321c17R1O6J97j44O6K4K9M5k00J20r1K25l79J60l35L15J9K45j56k54J93K56l63
$$ -317 -226 -160 37 -107 -41 -17 12 57 -143 -23 -114 111 -268 -108 -443 -128 -109 136 -20 -274 -81 175 -188
6344a88K74o4K9R2k25M0K86j69J22k74K09k19P7J89l29J32K50p0m55M67j82n9
$$ -188 86 22 51 143 -82 -42 244 75 197 -77 132 -87 -10 179 -150 -18 232 162 -293 174 -8 -67
6366f7K9j55P3K00l95K47P3q7l9O8q9J33M4K30o4k08p5K01j65LJ31q9M2j61K5
$$ -67 -38 -193 -120 80 -315 -68 5 -82 -121 -53 -142 -9 35 265 201 -7 -82 119 -46 -43 88 -1 41 -120 -95
6391i5L89k57K23k04q0R6k78J64J89k50K63l48M89l52k0J00j69m0N69l97j59q6
$$ -95 294 37 260 56 -24 72 -206 -42 147 -103 160 -188 301 -51 -71 29 -140 -180 389 -8 -167 -253
6413b53K62j09J41j48J10j32L56m16%K55j44K96l01P5K84Q4m56J84q9k79K71R2
$$ -253 9 -100 41 -107 3 -129 227 -189 -189 66 -78 218 -83 -8 276 360 -96 88 -1 -280 -9 83
6435H3j57P1J77m34L67l42M58j56j87K91l54m0M7R3kKJ02j3k8k07L40l30K02L5
$$ 83 -74 -3 174 -260 107 -235 223 67 -120 171 -183 -223 -176 -83 -85 -83 19 6 -22 -229 111 -219 -17 18
6459A8p4j61P5J00MK8j80L20J9l70L38M3j09l1l17L14j41L19j64L8Mk31K64k15
$$ 18 -56 -217 -142 -42 -38 -10 -190 130 149 -221 117 160 51 20 -297 17 -124 195 31 69 73 -158 106 -109
6483a09P8K52j06m33K15K13j19k08L52l54L05j83J69j35n2J26J52o5k76P0k3K69
$$ -109 -31 221 115 -318 -103 110 -9 -217 135 -219 86 -97 72 -63 -115 11 163 98 -178 -108 -131 138
6505A38r8J37k32L04j61k25o9N98k46j67J49j26j75K84J2j63m8K55o6j42K33l66
$$ 138 40 177 -55 249 88 -137 -206 392 146 -21 128 2 -173 111 123 -40 -88 167 101 -41 192 -174
6527a74J88m6K41j91J0k48k7L30j83LJ48N6k94K09j13j58N19j08k54k0LM6J84
$$ -174 14 -32 209 18 28 -220 -247 83 -100 -97 51 107 -187 22 -91 -249 270 162 -92 -112 -109 -63 121
6550A21j52k1q4J7L47l29L57k85o1J42l08J10L43j46j41K23q0N8j46k36K41J69
$$ 121 -31 -52 -136 -119 228 -101 256 -29 -90 52 -256 -146 197 51 -90 133 53 111 -35 -271 -30 139
6572A39Qm4n1Q1r7K12k10l4m1l1P7J42k05k6k82K51N0N4J87j04K06m14P0j3M9
$$ 139 147 103 52 133 36 248 38 4 -37 -68 9 151 -54 -80 -362 -111 -61 -7 180 76 282 -132 -62 -75 -26
6597b6k42K67O6j8k82K77k84K07M0K2K6j9k0K3p7L6j41J10j0J4J97m5j27L8N3
$$ -26 -268 -1 65 47 -235 42 -242 -35 5 27 53 34 14 37 -40 -4 -145 -35 -45 -31 166 121 -6 32 85
6622H5M6j57J04n3m6j92J59N2Q2n5j10L02q8p9m6k35K35j56J43M0O7j73J04j03
$$ 85 131 -26 78 25 -21 -213 -54 -2 80 25 -85 217 129 50 4 -231 4 -152 -9 31 98 -75 29 -74
6646g4O8J05k13L06k17J83J21k34j87K52k3j91K45k74j69K80K35l83L59q7o0j
$$ -74 -6 99 -114 192 -25 158 279 45 -142 110 87 -104 141 -133 -302 -22 213 -170 189 102 42 41
6668D1j61J93K02r4J0p4k48J52qn0K00J9J04l29J64N7r5kO7l09J80l0Q0j3J14
$$ 41 -120 73 275 181 191 117 -131 21 13 -37 163 182 286 -43 121 178 83 81 148 -161 19 -11 69 56 170
6693A70p7Lk28K50j29J32l3O7j73l3M1J49J04R3n87K94r1r4J57K9r4J42k11K10
$$ 170 93 96 -132 118 -11 121 88 155 -18 -51 -10 139 243 336 -251 43 -48 -142 15 44 -50 92 -119 91
6717I1j93O3Q0k78P3K25r0m4K14R4k91J13R0j63M0j67J91J08l68K92n2m7J37l71
$$ 91 -102 -39 41 -237 -164 61 -29 -73 141 235 -56 57 147 -16 24 -143 48 156 -212 80 28 -19 118 -253
6741b53K47n2L44l51K88n38L47p1O4k5O5p3m8m2j49K45p1J47k52R2j3j81K32K08
$$ -253 -6 -58 286 -65 223 -315 32 -39 25 0 65 -8 -56 -98 -247 -2 -73 74 -178 -86 -99 -280 -48 160
6765A60j88L1KJ75j66n8J25q3j28L9K9K5mLj1j63L28J4j97J02J0L8Pl9p0p5K14
$$ 160 -28 3 5 180 14 -44 81 -2 -130 -91 -62 -37 -41 -38 -49 -212 116 130 -67 35 45 83 90 51 -19 -94 120
6792A20k62M78l53j11L2J32J1j67R7j99K43K7l6N9r5J11l9j87L24k70P7M7k5j71
$$ 120 -142 336 -17 -128 -96 36 47 -120 -23 -222 21 48 12 71 -24 87 48 -139 185 -85 -8 39 14 -157
6816a57K27j12O8K2k01O6K90j83l14L86J49j86p2k60L16j54K61j76LJ08k85o7
$$ -157 70 -42 26 48 -153 -87 203 20 -294 92 241 55 -17 -277 39 -115 146 -30 -27 81 -204 -271
6838b71K61k26K15Q9l17L40k19K5P6j6k1j23K81k80J79j9p0L68l55L03k48j90
$$ -271 -10 -236 -21 68 -249 91 -128 -103 -27 -43 -64 -187 94 -186 -7 -26 -96 272 -83 220 -28 -218
6860b18M5K03k33L32j55j35K4L76k79J18p0J91k22J2J23k38K2J03j08K30j9J21
$$ -218 -173 30 -203 129 -26 -161 -137 239 -40 78 8 199 -23 -11 112 -126 -104 -1 -109 121 102 223
6882B23K7o5j22J7k59K87M5l65M20k21j32Q0J65J18k47J0k3J98KM8k43O4m0L5
$$ 223 250 185 63 80 -179 108 153 -212 208 -13 -145 -65 100 218 -29 -19 -42 156 158 206 -37 27 -13 22
6906B2Q2k12Q7K99m07j92K59k85L06J50Ml2k05K93k02JJ2K32k35n8j46K15J60
$$ 22 104 -108 -21 278 -129 -321 -62 -347 -41 109 113 81 -124 169 -33 -32 -20 212 -23 -81 -227 -12 148
6929A48k54J25J29k53K63l19R1J02J68k07l3K64j61k70K32jo0M1j3J41m42L96
$$ 148 -106 19 148 -105 158 -161 -70 32 200 -7 -40 224 63 -207 25 24 -36 5 -8 133 -309 87
6951H7qR2L7k34L9n3J3J42J7o1j45J44l1m6J4j05K04k51J06L18r3l71J14M4K17
$$ 87 79 171 208 -26 13 -40 -27 115 132 71 -74 70 39 -7 7 -98 106 -145 -39 279 186 -185 -71 -27 190
6976A90k53J53m87L42L10k56k22L40K2j02k70J83M9j66K2j31K44j6L53k55J74
$$ 190 -63 90 -397 -55 255 -1 -223 117 139 37 -233 -50 -1 -167 -145 -276 -32 -48 305 50 224
6997B24k32MP8J9j71J19k46M52j96j02r7l6K93J17k41p0P8K60r4k18K75j48OJ
$$ 224 -8 -4 74 93 -78 41 -205 247 51 -51 -148 -184 109 226 -15 -85 -7 253 159 -59 216 68 74 75
7021G5j02o1J01l58J93R2Q8J43k0j97O9k58M50k24R2k4j95N6P5R2k72J99J48j19
$$ 75 -27 -88 13 -345 -152 -60 28 171 151 -46 23 -235 215 -9 83 59 -136 -80 -5 87 -185 14 162 43
7045D3ll4J02L26o09q6L38j09K94j20j98J1P4l5N1M7lLj67J78o9k59M28O3j05
$$ 43 40 6 108 434 -175 -261 77 -32 262 142 -56 -45 29 -6 45 92 89 92 -75 103 34 -225 203 266 161
7070A61k68K59n6Q6k67J29k66L02n5q2J90k91N64k67J86k87j4J41k11j59L24j59
$$ 161 -107 152 96 182 -85 44 -222 80 25 -57 133 -158 406 139 325 38 24 165 -46 -205 119 -40
7092d0J20j61j30L56L2m71K4J72J61k23K73j16J15k45J36L39o9J65k91l66J09
$$ -40 80 -81 -211 145 177 -294 -270 -98 63 -160 113 -3 112 -133 3 342 273 438 147 -219 -110
7113a10mJ49K7j68K35J5J1o30K31K97L4k26K16j62n2%J45J1k99L48k57K79k64
$$ -110 -114 35 62 -106 129 144 155 -475 -244 53 87 -139 77 -85 -137 -137 8 19 -280 68 -189 90 -174
7136a74K39N3j15Q1o1K19l17K8N4r6K4j61K84j34k2n0M98j32k05O0k8R8l01K12
$$ -174 65 118 3 84 23 242 -75 -47 7 -89 -65 -226 58 -76 -98 -148 350 218 13 73 45 143 -158 54
7160E4n4j75L19j14M4m7nj64K72j41k6J05j42j5j79K65J1LO7k27K57J1q9j91r9
$$ 54 0 -175 144 30 74 27 22 -142 130 -11 -37 68 -74 -89 -268 -3 8 11 78 -149 108 119 30 -161 -260
7185b60L71j42Q3l2j0J50k92k9J25N5o7q1L93N7l03O9P4N7k50r2K2l1K5L51j23
$$ -260 111 -31 52 20 10 160 -132 -161 -36 19 -48 -129 264 321 18 87 161 218 -32 -124 -102 -133 -108 243 120
7210A20R9l88J72K6j82q1M52n80K89J55j7Nm5M6j0J71n20J66j16K03Jj44L07j76
$$ 120 219 -169 3 29 -153 -234 218 -362 -73 82 65 70 25 71 61 232 -288 -122 -238 -35 -34 -178 129 -47
7234d7p6K00l08Q3L4K50k1k63qJ03Q2n7j49J24l2L86j63k12j30J69l4K12k39R1
$$ -47 -123 77 -231 -148 -114 136 115 -148 -156 -53 29 -28 -177 -53 -85 301 138 -74 -204 -35 -69 143 -96 -5
7258eK21l93K29j54J23J4J95l57o3K19k38K91m0P9k16J48j24n7P7J52k56M8Q9
$$ -5 216 -177 52 -102 21 35 230 -127 -190 29 -209 82 42 121 -95 53 -71 -128 -51 101 -155 -107 -18
7281a8p2J44j30J36o9j02Kq9J94j43J78N7j09j61j06J52K10LJ55r4k39J67k05
$$ -18 -90 54 -76 60 -9 -111 -109 -198 -4 -147 31 88 -21 -182 -288 -136 74 77 232 138 -101 66 -139
7304a39n2j21Q15o90K61l8j56J96M8r4P3j28J16j1l8l8J82k06o0J99l77K57l30
$$ -139 -191 -312 503 -187 74 36 -120 76 124 30 103 -25 91 80 42 4 186 -20 -80 119 -258 -1 -331
7327c31L09O5j99N6K75k05J34O1r5N9n4j22J91l03L1L04k88P0N5l18L77N2j49
$$ -331 -22 43 -156 -100 175 -30 104 165 70 129 75 -47 144 -159 -128 176 -112 -42 13 -305 72 124 -25
7350b5jj10K55N1k19K1k18J36J64n9r6L60O2k96N7l81M75j07J06l6O9n24M03l5
$$ -25 -26 -136 119 170 -49 -28 -246 -110 54 -5 -101 259 321 25 82 -299 176 69 175 139 208 -316 87 52
7374E2r2J41j18n0J2N1l49K82n4J29j88M9J23J98l75j5L12j69K28k8J70l59J99
$$ 52 -40 101 -17 -67 -55 -4 -353 -71 -125 4 -184 -135 -12 186 -189 -204 108 -61 167 139 309 -50 149
7397A49k7j17Mr7K04m43K00N9j18L72k40j57K17K58k35K8j99K58mJ66l48j98M14
$$ 149 122 5 9 -88 116 -327 -127 -68 -186 186 -54 -211 6 264 29 57 -142 116 112 278 -70 -268 146
7420A46Rk35J88j44k0J70m38J18P7QJ81J2N4K3J96k79k4R1r7k38J16J28L31j74
$$ 146 155 -80 108 -36 -56 114 -324 -206 -129 -121 60 72 126 149 345 66 42 133 36 -202 -86 42 373 199
7444A99j20L8j83K86l85L01k86K31j56J78k27l5l7K16k02K77k5J2k62J80j19J08
$$ 199 79 117 -66 220 -165 136 -150 81 -75 103 -124 -159 -196 20 -182 95 70 82 -180 0 -119 -11
7466a1L6J20l37J1LL67j53O1J69k73K08l08M2%k7J36j73J21N3p9J0K02J29j63
$$ -11 25 145 -192 -181 -178 189 36 97 266 -7 201 -107 -65 -65 -92 44 -129 -8 45 -34 -24 178 307 144
7490A44O9k75J41l15L38n5J32j40j8k74K87Q9k5k3k56K20k7r5j56K54j65K92K7
$$ 144 213 -62 79 -236 102 47 179 39 21 -253 34 123 98 75 -181 39 12 -83 -239 15 -150 142 169
7513A69l03J46R4L3o3m6PO5k38L91k39J8J26n4m05L35j22K76k83j3L7K26l28K64
$$ 169 -134 12 106 139 76 30 37 102 -136 255 16 34 160 106 -299 36 -86 190 -93 -106 -69 157 -171 93
7537I3k60N17k68J53j2m54K32k12R8p4K14k23O6K08j7J07Pq6m67M17j5j27J37
$$ 93 -167 350 82 235 223 -231 1 -211 -113 -187 27 -196 -130 78 61 168 175 89 -378 39 24 -103 34
7560C4j04j46J41n6M8J63p7j04k0L78k91L69k65j40l30L92Q2L61m41P5p6l82M47
$$ 34 -70 -216 -75 -131 -83 80 3 -101 -121 257 -34 335 70 -70 -400 -8 74 435 -6 69 -7 -389 58
7583E8j66J72j34o8l4N3J89j07K09j7l15K30O0l59J98L5k01L07l15n5N66l19Q2
$$ 58 -108 64 -70 -138 -172 -119 70 -37 172 155 -160 70 130 -229 -31 4 -197 110 -205 -260 306 -13 69
7606F9l0k8J04Kk14M9P1K49k54J05q9J52k21J51Qk69P9R2m1r6J3l3m2J44j27K95
$$ 69 39 11 115 117 -97 -48 23 272 18 123 34 186 -35 116 124 -145 -66 26 -15 -111 -98 -131 -173 -29 -156 139
7632A39l51j17N77m33K3J19K12j53O5j67J52l36M58j25J1J0j53M02m46k50N52
$$ 139 -212 -329 248 -185 -162 -43 169 16 81 -86 66 -270 188 63 74 84 -69 333 -113 -363 189
7653A89k47j4j38R8j69L93pJ24k11o9r8K32K8j82K60k74m0J9O6K22l07L5K10o6
$$ 189 -58 -72 -210 -112 -281 112 105 229 18 -51 -149 83 111 -71 189 -85 -125 -106 -40 182 -125 -90 120 54
7677E4J13qN1n19R7K99O1j07J20l9J02k75j57K9L54k31k6j4K94j52j38J60J51
$$ 54 167 159 210 -309 -212 87 148 41 161 122 224 -51 -208 -179 175 -56 -82 -96 198 46 -92 68 219
7700B19N7l70o3o5L42l27N56m82J08L4j77J15j7L54n38K03n7L06m14K75J85k73
$$ 219 276 -94 -157 -222 120 -207 349 -133 -25 9 -168 -53 -70 284 -254 -51 -108 198 -216 59 244 -29
7722b9O9M4j14K45lj63k08j28L00L2n7J8J61k40M60k61k23J01r1K12m36L36j47
$$ -29 40 84 -30 215 212 49 -159 -287 13 45 -12 6 167 -73 387 126 -97 4 -87 125 -311 25 -122
7745a22j79L32l62K57r9R4J80J62r9M2l02P9l29N00l36K97J35k49K38m11K25k9
$$ -122 -301 31 -331 -74 -173 -79 101 263 164 206 -96 -17 -346 154 -182 115 250 1 239 -172 53 24
7767B4j55p0L3J18j00J17L9j26M18jo92N79k12J24J43j08q8j34j7K09J18n65L37
$$ 24 -131 -201 -168 -50 -150 -33 6 -120 298 297 -395 184 -28 96 239 131 43 -91 -108 101 219 -346 -9
7790iK73k98K21j27n1J7j22j01O7J64n7J60j80K5j08J54l6J1J76l06K37M9k94
$$ -9 264 -34 187 60 9 26 -96 -197 -130 34 -23 137 -43 -18 -126 28 -8 3 179 -127 110 159 -135
7813a35M7K12l81K97n4K07j67K0j62O0K62k67l3J04O1K26m54P2R0R1r9l8j00J78
$$ -135 -88 124 -257 40 -14 193 26 46 -116 -56 206 -61 -94 10 71 297 -157 -85 5 96 -3 -41 -141 37
7837C7m4J13J20k98j80J20N22l29j72J43j85J06L20l19K88l48K9K69L4o03K58
$$ 37 -7 106 226 -72 -252 -132 390 61 -111 32 -153 -47 273 -46 242 -106 -77 192 226 -377 -119
7858a19K51j00K74l75r9L2L30j57R6m51K35P7Q6j36j3J64r4j22Pj01K42k90M16
$$ -119 132 32 306 -69 -168 -136 194 37 133 -318 -83 -6 80 -56 -69 95 1 -121 -114 -215 27 -263 153
7881A53n17K76K28k47J59Jj49J34K7m17K18K27q0l5n4j67L68l28j42R2R3Q7n9
$$ 153 -364 -88 140 -107 52 53 -96 38 65 -352 -134 93 13 -22 -76 -243 125 -203 -345 -253 -160 -73 -132
7904a32K03K0j94L06k42J18p1M6l84N07q3m7j47P1n6L9J77k46k7M46l35J7R3j64
$$ -132 71 91 -103 203 -39 79 8 54 -330 177 94 47 -100 -29 -85 -46 131 -115 -142 304 -31 -14 79 -85
7928h5K1M84k15j13l92J47Q1Q5j29L84j72j59K92j03r3j88J45kj04K76j29p8K0
$$ -85 -64 420 205 92 -300 -153 -72 13 -116 268 96 -63 229 126 33 -155 -10 -12 -116 160 31 -47 -27
7951b7l1K4O6k15m2L70j44k14J93j01J14J55l18M32j26k40l9J11J14k51P9p9J75
$$ -27 -58 -34 32 -183 -225 145 1 -213 -20 -121 -7 148 -170 262 136 -104 -143 -32 82 -169 -90 -169 6
7974FJ11q2J07l39J62R4q1R1P8k73Q7k8k06K20K23K15m36K33l62L15l0j42O7Q3
$$ 6 117 35 142 -197 -35 59 -22 69 147 -126 -39 -67 -273 -53 170 385 -51 182 -180 135 105 -37 30 113
7998A13N4j43j12o6M8J75k51M0L50k66r7o5j12L05J11p2k26O9K35m5J95l6m0l37
$$ 113 167 24 -88 -154 -106 69 -182 -142 208 -58 -155 -220 -332 -27 84 12 -214 -145 90 45 240 204 164 -173
8022a73M28j34k9l94L44j1Q8n1J37k23Pk87J11J42J02J29j73J91j08K2j40j17
$$ -173 255 121 92 -302 42 31 119 68 205 -18 -11 -298 -187 -45 57 186 13 204 96 118 -22 -139
8044a39K99j51L8O5j67j34J24M53o11K09j1J07q6j0k28J42j42K85P7k97J96L1
$$ -139 160 9 47 112 -55 -189 -65 388 -223 -14 -25 82 -4 -14 -242 -100 -242 43 120 -177 19 50
8066E0Q2j25r9K02Q1n9o4J6n1j59J59N9j75Q3l1p3J68L7l27p1K42K63j85j95M3
$$ 50 132 7 -92 110 191 132 68 84 33 -126 33 92 -83 0 -31 -104 64 101 -226 -297 -55 208 23 -172 -129
8091a29K31k31m3L84l96O6K77j38k56K19j5n4K0M18m41L9j04R5Q4J3m3J51k94
$$ -129 102 -129 -172 212 -184 -118 159 21 -235 -16 -31 -85 -65 353 -88 -49 -153 -58 26 39 -4 147 -147
8114a47J08k19K05K98k69K49q7k36j3N1j1K86l32N5J38j84J19j38J20qj91K67
$$ -147 -39 -258 -53 245 -24 225 138 -98 -111 -60 -71 215 -117 -62 76 -108 11 -127 -7 -15 -206 61
8136F1Q9n3Mj8r5m7r4O1l03M56j16J55K7l86l8L94j24j3J06K02k42K8J04k3k45
$$ 61 150 97 101 83 -12 -59 -153 -92 -395 61 -55 100 127 -259 -297 97 -27 -40 66 268 26 54 158 135 -110
8161a10J44k64M72k49k92L04J47j92m1J37k8J06j44j72L98k92j00J55J74j7n4
$$ -110 34 -230 242 -7 -299 5 152 -40 -81 56 28 134 -10 -182 216 -76 -176 -21 153 136 82
8182H2M3j95K61k15M0J17lM9l50
$$ 82 125 -70 191 -24 16 133 130 179 -171
8191a71
$$ Imaginary data points
##PAGE= N=2
##DATA TABLE= (X++(I..I)), XYDATA
0@%%%%%%%%%%%Qj6J6j6K4l2M0m8N6p2Q0q8J12j36J52j76K08k40K72l12L60m08
$$ 0 0 0 0 0 0 0 0 0 0 0 0 8 -8 8 -8 16 -16 24 -24 32 -40 40 -48 64 -72 80 -96 112 -128 144 -168 192 -216
33b16M59n18N87o60P41q28R25j034J147j271J408j560J727j905K099k315K551
$$ -216 243 -275 312 -348 393 -435 490 -544 603 -668 740 -820 907 -998 1101 -1214 1337
50A337k809L096l415L766m157M600n101N673o337P116q045R176j0586J2402j4847
$$ 1337 -1472 1624 -1791 1975 -2182 2418 -2683 2990 -3347 3769 -4276 4900 -5686 6716 -8131
65h131J8331k3724L3270n5171J99718L6495l35325N2032L7344o252Q6294R3477
$$ -8131 10200 -13524 19746 -35425 164293 200788 -134537 -82505 -45161 -51413 34881 128358
77A28358j12652q3441m5985o1700N4358K09285O0390p9082o1836p4341p0132R2161
$$ 128358 15706 -67735 -113720 -175420 -121062 88223 148613 69531 7695 -66646 -136778 -44617
89d4617J13193K9571L5111j3508j46327q7046N1666P7372N5931K1134p6697j03556
$$ -44617 68576 98147 133258 119750 -26577 -113623 -61957 15415 71346 92480 15783 -87773
101h7773l8086q12L0325J13109R3672l5393q0274n0236k8087M7842R7623L8246
$$ -87773 -125859 -126671 -96346 16763 110435 75042 -5232 -55468 -83555 -35713 61910 100156
113A00156j1543k7708p7736o7047K4976P2744N7494J9429n4839j03953m5208K8099
$$ 100156 88613 60905 -16831 -83878 -58902 13842 71336 90765 35926 -68027 -113235 -85136
125h5136L2281M7466P3558M427q0929o3913J197N4493P6741L7711k0757m3593
$$ -85136 -52855 -5389 68169 72596 -8333 -72246 -71049 -16556 60185 97896 77139 33546
137C3546m9829m2612M228O3863O4417M665n5868p3356l9136J7004M8193M6894
$$ 33546 -16283 -58895 -54667 9196 73613 78278 22410 -50946 -90082 -73078 -24885 22009
149B2009K6896j6016m5876l6626j3260L1400Q0000M9822l4652n9489k9155j2099
$$ 22009 48905 32889 -12987 -49613 -62873 -31473 48527 98349 63697 4208 -24947 -37046
161c7046P496M3646L9596p95k7034n3340n8239J2533P0539L5157l751j0141l2491
$$ -37046 -29550 14096 53692 52897 25863 -27477 -85716 -73183 -2644 32513 28762 18621 -13870
174a3870l5073O447L0769L4368M3495P851o4396o0026J2972L3333J7013K6530
$$ -13870 -48943 -42496 -11727 22641 66136 73987 9591 -50435 -37463 -4130 12883 39413
186C9413J0794l3475m3552k9052p49M3765M9656N11l3843k7999j6098j402L1560
$$ 39413 50207 16732 -26820 -55872 -56621 -12856 36800 37311 3468 -24531 -40629 -42031 -10471
199a0471M6837J9814j1321l2262m2164j5321K9522L9336J7629j1049k9966k6352
$$ -10471 36366 56180 44859 12597 -29567 -44888 -15366 23970 41599 30550 584 -25768
211b5768j5166K448L0541L8593P584l1675l8635j3186J6126K9760K7028J1445
$$ -25768 -40934 -38486 -7945 30648 38232 6557 -32078 -45264 -29138 622 27650 39095
223C9095o329k0899l2728j4166K5160L5883J3173j5306l1921k2063n72R644J5400
$$ 39095 32766 11867 -20861 -35027 -9867 26016 39189 23883 -8038 -30101 -30673 -21029 -5629
236e629K3472J6334j6654m2171k0173K1838L0663J7307M046p711j6087j9758j0088
$$ -5629 17843 34177 17523 -24648 -44821 -22983 7680 24987 29033 21322 5235 -14523 -24611
249b4611J5545K9651J6630j1721l0934k4377k468J3830K3679J6257j622j3518
$$ -24611 -9066 20585 37215 25494 -5440 -29817 -32285 -18455 5224 21481 19859 6341
261F341j9261j7581K868K7223L0213M106k3234k1309n562K259J1587J8114J1793
$$ 6341 -12920 -30501 -27633 -410 29803 33909 10675 -10634 -16196 -13937 -2350 15764 27557
274B7557m945k4900k7203k836K0788K1974P998o304j1690j4661j0215P160J9151
$$ 27557 22612 -2288 -29491 -32327 -11539 10435 18433 12129 439 -14222 -24437 -17277 1874
287A874J9062N534j6532k2901n957R695J3240R733N132j421j7390k2335m133J6858
$$ 1874 20936 26470 9938 -12963 -18920 -9225 4015 13748 18880 17459 69 -22266 -26399 -9541
301i541K0146O333q310j0262r442p301L981J5479J5934M020j3040j8147o767N474
$$ -9541 10605 16938 8628 -1634 -11076 -18377 -14396 1083 17017 21037 7997 -10150 -16917 -11443
315a1443J5284J5538Q48j0465j1597j0966o858N418J9450J4455p081j8914j1200
$$ -11443 3841 19379 20227 9762 -1835 -12801 -19659 -14241 5209 19664 12583 -6331 -17531
328a7531K198J1253J0512N027L436n028j7766j2525O882J9713J3507j910j0584
$$ -17531 -15333 -4080 6432 11459 14895 9867 -7899 -20424 -13542 6171 19678 17768 7184
341G184j1390p075J529N824P076Q171j558j4827j3906J537J4422J3097K659k242
$$ 7184 -4206 -11281 -9752 -3928 3148 11319 9761 -5066 -18972 -17435 -3013 10084 12743 10501
355A0501m686r882p902J867J1600J1847M06r363q551m942N88P329Q500L575n674
$$ 10501 5815 -4067 -11969 -10102 1498 13345 13751 4388 -4163 -9105 -8517 -1188 7312 10887 5213
370E213j1119o717j440M597J2783R647j972r808p736o72K336M914R430L951q202
$$ 5213 -5906 -12623 -14063 -9466 3317 12964 10992 1184 -6552 -7224 -4888 26 9456 13407 5205
385E205j2355o218N403J0543M629q87n58o658j1246l756J0252J2754K449l888
$$ 5205 -7150 -13368 -7965 2578 7207 6320 5762 -896 -12142 -15898 -5646 7108 9557 5669
399E669n668o924k53N675M995M784K672o510j0117n230M513R660N537j540n498
$$ 5669 1 -6923 -7176 -1501 3494 8278 10950 4440 -5677 -10907 -6394 3266 8803 7263 1765
414A765n159l200j884K784R057N713l999n949m525r02N269O245K907j164n114
$$ 1765 -3394 -6594 -8478 -5694 3363 9076 5077 -872 -5397 -6299 -1030 5215 8122 6958 1844
429A844m572k454n95M734Q302L306o585q933k794L253J461L107M012M83m740o032
$$ 1844 -2728 -5182 -5777 -1043 7259 10565 3980 -4953 -7747 -4494 -3033 74 4086 4569 -171 -6203
445f203j996O225Q030K423k549m117m898l951R04O675N603O5l397n263m853J922
$$ -6203 -8199 -1974 6056 8479 5930 1813 -3085 -7036 -6132 543 6146 6211 2814 -2449 -7302 -5380
461e380M853L003J554k392m896m231L48O404N639K072j128m212l937j260P33L478
$$ -5380 -527 2476 4030 1638 -3258 -7489 -7141 -737 4902 6974 5846 1634 -2303 -3563 -2830 648
477F48M029K1m153m686p33K206K437L685J108l533m252j423k70J457M972M303
$$ 648 4677 4698 545 -4141 -4874 -2668 -231 3454 4562 1029 -3223 -4646 -4916 -3459 1513 5816
493E816l48m608l755O33K786J787L51j03q1m044n624J616O764L554j372k642k138
$$ 5816 5468 860 -2895 -2262 524 2311 2662 2559 2478 -1566 -7190 -5574 1190 4744 3372 730 -1408
510a408k399j279L098L966K280j91l180l694J44K566L485K338k286m145k109j275
$$ -1408 -3807 -5086 -1988 1978 4258 4067 887 -2807 -2663 -97 3388 5726 3440 -705 -2814 -4089
526d089J97L843L439M77l005k917j799L84L185L210q03n67k206k369J903K233
$$ -4089 -3892 -49 3390 3867 862 -2055 -3854 -3470 -285 2925 2122 1555 -651 -3020 -1117 1116
542A116N61K142J104m772m111J333K096m75J840K387k540l302L3N35J480K731
$$ 1116 1677 3819 4923 151 -3960 -2627 -531 -1006 834 3221 681 -2621 -2588 -2053 -573 2158
558B158j59j611M83k612l123M146M991j375k170M26j674l031Q79L259J021J38
$$ 2158 1999 388 871 -1741 -4864 -718 4273 2898 728 1154 -520 -3551 -2672 587 1608 1746
574A746q26l188j319J571J864J839P36j807k510n44N93J188K655K752j314l509
$$ 1746 920 -2268 -3587 -2016 -152 1687 2423 616 -1894 -2438 -1845 -657 1998 4750 3436 -73
590g3j656J72J3K145J301j121j577p30Q7M03J146J719Q99k169k908r19K197K198
$$ -73 -1729 -1557 -1544 601 1902 781 -796 -1526 -1439 -1036 110 1829 2728 559 -2349 -3268 -1071 1127
608A127k23M66J614j097k473j12P22J108K86j249j244p83j86K62J563K648J12
$$ 1127 904 1370 2984 1887 -586 -698 24 1132 1418 169 -1075 -1858 -2044 -1782 -219 2429 2541
625B541k423k67n32k218J130L146L03j295k97o64j2J299J284m11l36o59l049j182
$$ 2541 118 -149 -681 -2899 -1769 1377 1680 385 88 -576 -588 711 1995 1584 1248 589 -2460 -3642
643c642J707J741P75J257o87k189j90J210O24JK26l41j839j178J380J291J296
$$ -3642 -1935 -194 581 1838 1151 -1038 -1228 -18 606 607 833 492 -1347 -2525 -1145 146 1442
660A442R67o96j350j602m57R47P86n35K68j46l3o34l2K227J259j228j593M09j62
$$ 1442 2409 1713 363 -1239 -1696 -749 37 -498 -230 -376 -409 -1043 -1075 1152 2411 1183 -410 -1 -163
679a63r59n3K031J151j100j003n7p09j9O08M75Q84j758j034P22J203o90Q83J634
$$ -163 -1122 -1175 856 2007 907 -96 -153 -862 -881 -273 202 1086 -672 -1706 -984 219 -471 412 2046
698B046n75j669j181R30P26N54P29j156n28p6m71O5J047L45n53k82j326j57J577
$$ 2046 1471 -198 -1379 -449 277 831 1560 404 -124 -200 -671 -606 441 786 233 -49 -1375 -1532 45
717D5J124k02r7L01j492o79J036J32j44R13m65j003O3m44M08J395Q5j960J94O86
$$ 45 1169 967 870 1171 -321 -1000 36 168 24 937 472 -531 -468 -912 -504 891 976 -984 -790 -104
737a04q76m95J189J562k27n77j79p79N08K85r54P34Q22j471m69N14K32J83O52
$$ -104 -980 -1475 -286 1276 1049 472 293 -486 22 307 -647 87 909 -562 -1031 -517 -285 -102 550
756E50N66j172j019O7R2R10R15l30k52L05q14n06J117O64r9m86j129o28N48J200
$$ 550 1116 -56 -1075 -1008 -916 -6 909 579 327 632 -182 -688 429 1093 994 508 -621 -1249 -701 499
776D99Q5k06J11L6r65m49N11N96L25o35l94M22K92j61N42O29k19j070r2k4j30
$$ 499 584 378 489 525 -440 -889 -378 218 543 -92 -486 -64 228 67 609 1238 1019 -51 -143 -167 -297
797b97m57O80Q52o10n36J46K67J48m52k7Q90m38p05j52P10N83m35N40J00j129
$$ -297 -754 -74 778 168 -368 -222 45 193 -259 -286 604 166 -539 -691 19 602 167 707 807 -322
817c22j28K10k88M83J17j46N4n66o46R19P30K88k97l44j69m1k06R00K4o11M45
$$ -322 -450 -240 -528 -45 72 -74 -20 -586 -1232 -313 417 705 408 64 -105 -146 -352 548 572 -39 406
838D06l61r67M27P86L91l92p48j31L22j13p4M49M02j01p59Q9L98rj12N84m7j35
$$ 406 45 -922 -495 291 682 290 -458 -589 -267 -380 -454 -5 397 296 -463 -374 24 15 -97 487 440 305
860C05l52Q4K90l99n09Q49K08r37r4J36R44m12k92K53J84j75r5n37P41M03k05
$$ 305 -47 37 327 -72 -581 268 476 -461 -555 -419 525 113 -179 74 258 83 -12 -549 192 595 390
881C90L69o47j18j6L15J05j98j59j70k45k50J13R67J41o7l70j90m6j68L57n4k11
$$ 390 759 112 -6 -22 293 398 200 41 -129 -374 -624 -511 456 597 530 160 -30 -76 -244 113 59 -152
903a52m2M36k84K70k86M03M13p51r03L22N69j26j57L9M47r0n86P73J26n26N4J00
$$ -152 -194 242 -42 228 -58 345 758 7 -896 -574 -5 -131 -288 -249 198 108 -478 295 421 -105 -51 49
925D9j02k06j82M32L95l39k49L72N66r24l83Q4N94l40J39j57L40l50L29J34J08
$$ 49 -53 -259 -441 -9 386 47 -202 170 736 -188 -571 -487 107 -233 -94 -251 89 -261 68 202 310
946C10K88n46J6k72j50qO10J45o68J76J55l52K21J42J24l7m45o7J11J75N05Q6
$$ 310 598 52 68 -204 -354 -362 248 393 -275 -99 56 -296 -75 67 191 154 -291 -358 -247 -72 433 519
968E19k60q34L98K97rj1m56K40L43m90J29M18J51l30m23lN42m11K90J74k6r2n0
$$ 519 259 -575 -177 120 111 100 -356 -116 227 -263 -134 284 435 105 -318 -321 221 -190 100 274 248 156 106
991A06L4N1l13m11M44N8m8j72j70Q19m99n0j7M73On41r0k06O74j72M03j7j6lk61
$$ 106 140 191 -122 -533 -89 -31 -79 -251 -421 398 -101 -151 -168 305 311 -230 -320 -526 148 -24 379 362 346 343 82
1016H2j50j69J82J47j90n01L61M12q4K9K04q5k16l90K42K00n89L29M32j94k91
$$ 82 -68 -237 -55 92 -98 -599 -238 174 90 119 323 238 22 -368 -126 74 -515 -186 246 52 -239
1037b39N31mj19j90l16K37Q9m52J15O69j13j82R2K09n2j65j63P3O0j17N3J00p5
$$ -239 292 288 169 -21 -337 -100 -11 -463 -348 321 208 26 118 327 275 110 -53 20 80 -37 16 116 41
1060D1k55J86M38k14k31k62K22k94M4N32J4o5J45l31k40K06K84J01K0l30l86O92
$$ 41 -214 -28 410 196 -35 -297 -75 -369 -325 207 221 156 301 -30 -270 -64 220 321 341 11 -375 317
1082C17n10J07L83q7j73K9j56j14K35k59K34m0k43K96n5K54l55o4L29Pk46L1j78
$$ 317 -193 -86 297 210 37 66 -90 -204 31 -228 6 -34 -277 19 -36 218 -137 -201 128 135 -111 -80 -258
1105b58M16k27j79r1L62j33M4m47L55P1k11K31K55j41j93j24N07n9k54n5J17r6
$$ -258 158 -69 -248 -339 23 -110 -66 -513 -158 -87 -298 -67 188 47 -146 -270 237 178 -76 -131 -14 -110
1127a10m17M60K09j41n6Lj43L32j19J17k13J44j15J2J13m9KL06j75n18K36K13
$$ -110 -527 -67 142 1 -55 -52 -195 137 18 135 -78 66 -49 -37 76 27 29 335 160 -358 -122 91
1149I1J37l04J14q8N8m5J27J82l76J72j58J2m8k00P04o9L0l47J39L9q4o14N48
$$ 91 228 -76 38 -50 8 -37 90 272 -104 68 -90 -78 -126 -326 378 309 339 -8 131 170 86 -528 20
1172B0n3K82l70M71k43j96j00K34K77j72Qm99K23K3j09N12M5j68k76K85j89m2
$$ 20 -33 249 -121 350 107 -89 -189 45 322 150 158 -341 -118 -95 -204 308 353 185 -91 194 5 -37
1194c7L18j92j91L7K17m18L41K0l5k13Q4n3J66J16l65K32nJ41j23p4M87o6n43
$$ -37 281 89 -102 -65 152 -266 75 95 60 -153 -69 -122 44 160 -205 27 22 163 40 -34 453 387 -156
1217a56K01J97j94J90m04K27M0j48J11l51L23p0j86M7J15j87n2N96q8j92R6j62
$$ -156 45 242 48 238 -166 61 101 -47 64 -287 36 -34 -220 -173 -58 -245 -297 299 211 19 115 -47
1239d7L10j05k05j93L08j22j45R0j07L70qpJ43l08k08M74p9k68j4K23M8M2j7j38
$$ -47 263 158 -47 -240 68 -54 -199 -109 -216 154 146 139 282 -26 -234 240 161 -107 -121 102 150 192 175 37
1263C7j63J22J25j91j50J30K69k78q4K02L58k08j42m04M26J15l93K01j6K56l02
$$ 37 -126 -4 121 -70 -220 -90 179 -99 -183 19 377 169 27 -377 49 164 -229 -28 -44 212 -90
1284i0J24lq7p3N7K51Ol0n8J40l59J01j85J54L41m29L2K25k91J88j36q1J42J53
$$ -90 34 31 -56 -129 -72 179 185 155 97 237 -122 -21 -206 -52 289 -140 -108 117 -174 14 -122 -203 -61 92
1308I2k45K30%J7k15j76L58M9k95M09k33N2R3P7r9p2j58k07M72n85L87Pq3J80
$$ 92 -153 77 77 94 -121 -297 61 110 -185 224 -9 43 136 213 114 42 -116 -323 149 -436 -49 -42 -125 55
1332E5J92n43J89L05j10k58L44r3n6J14l24K64j21P8j27l8K43k52O3MK66j06k2
$$ 55 247 -296 -107 198 88 -170 174 81 25 139 -185 79 -42 36 -91 -129 114 -138 -75 -71 195 89 67
1355F7J68r3j59J33nr6q6j00K05L9m4j43jK07p7J86l33k40N06l03L97k80m1j77
$$ 67 235 142 -17 116 111 15 -71 -171 34 73 29 -114 -115 92 15 201 -132 -372 134 -169 228 -52 -93 -270
1379b70J35J13P5k60L20l4Mj19j31K54J0J80k79R7k24kJ62O4k6l0k14r5oN78k03
$$ -270 -135 -22 53 -207 113 79 83 -36 -167 87 97 277 -2 95 -129 -131 31 95 69 39 -175 -270 -276 302 99
1404I9j41j19K54R5O7k36j24L14j67j83J21K8J16l5j0Q8l05M1J5J71K06j63n1
$$ 99 -42 -161 93 188 255 19 -105 209 42 -141 -20 8 124 89 79 167 -138 -97 -82 89 295 132 81
1427H1J27j45Q9p3m8k9m7P5J45k84P0K80k22r2K33L4R2m51K29R3k26J5o9J42O9
$$ 81 208 63 152 79 31 2 -45 30 175 -109 -39 241 19 -73 160 194 286 -165 64 157 -69 -54 -123 19 88
1452H8k03K1R4%j33L5J23M9l63M33j50P7J94k75j53Q1k08j03M83J15Mk11K63k37
$$ 88 -115 -94 0 0 -133 -98 25 74 -289 144 -6 71 265 -10 -163 -82 -290 -393 90 205 209 -2 261 24
1476B4k2l15J94j1L04j23R9j3p7j11M0J1K8k50K30K91m73K6J46k21J95j30O0j20
$$ 24 2 -313 -119 -130 174 51 150 137 60 -51 -11 0 28 -222 8 299 -174 -148 -2 -223 -28 -158 -98 -218
1500b18K41k93j06M53K40m53J07K95k55L5j95J49N0J79P0k51m88N73j01j73K10
$$ -218 23 -270 -376 77 317 -136 -29 266 11 46 -149 0 50 229 299 48 -440 133 32 -141 69
1521F9J95k38M2p6K82n52J94o9J68L05m03p2l0L1K33L2j4j43K55k61NM1J5K3j5
$$ 69 264 26 68 -8 274 -278 -84 -153 15 320 -83 -155 -185 -154 79 111 97 -46 209 -52 -47 -6 9 32 17
1546A7L4k92J15PL91k07k64J62P3J10J7l34J36J12P3j15J2m2j21K95N2q2Qk11
$$ 17 51 -241 -126 -119 272 65 -199 -37 36 146 163 -171 -35 77 150 35 47 5 -116 179 231 149 157 -54
1570e4q9o9Q6J90j81M7J10K9p3k7L67n02Q7J65m23M88j86j12K20J73o29J65K09
$$ -54 -143 -212 -126 64 -117 -70 40 69 -4 -31 336 -166 -79 86 -337 151 -35 -147 73 246 -383 -218 -9
1593iK26k30k0N2p2kr2J83k63pK46L3J73j46n7m3P8J64k19J77l94J62N6J32n2
$$ -9 217 -13 -33 19 -53 -55 -147 36 -227 -234 12 45 218 72 15 -28 50 214 -5 172 -222 -60 -4 128 76
1618G6j02J34j97J70R9k84R0J6k4L50k74j80N5J04K04l03j42J33Q0m3k55L76l11
$$ 76 -26 108 -89 81 180 -104 -14 2 -22 328 54 -126 -71 33 237 -66 -208 -75 5 -38 -293 83 -228
1641b28K95k28L49j16Kj94Q3j0k23K73J60no6k63K2j36K62P1r4J62k83J32J51
$$ -228 67 -161 188 72 74 -120 -37 -47 -270 3 163 158 92 -171 -149 -285 -23 48 -46 116 -167 -35 116
1664A16l78L56R1j70l6p1K8q5K15k13L64m08J02N7k25K01J7j97M38k91n7L18M9
$$ 116 -262 94 185 15 -21 -92 -64 -149 66 -147 217 -191 -89 -32 -257 -56 -39 -236 202 -89 -146 172 221
1687B21k50J25j10M2L29m73J10k7k92K38L17l48K63O8l25K32k72j35K94k42L22
$$ 221 -29 96 -14 28 357 -116 -6 -33 -325 -87 230 -118 145 213 -112 120 -152 -287 7 -235 87
1708H7j9j68J03O7p4j82J50N3J57m56K93J01m28J95j73K57J80m1J05j21L5k63
$$ 87 68 -100 3 70 -4 -186 -36 17 174 -282 11 112 -316 -121 -294 -37 143 102 207 86 121 -142
1730a42L40k27J1J17O3j91K40l02K86j86jm2k7P5Q0o2m7J23m61M70m41K34N83
$$ -142 198 -29 -18 99 162 -29 211 -91 195 9 8 -34 -61 14 94 32 -15 108 -353 117 -324 -90 493
1753D93o96K24k19L66J22r1l47K48j03n1R2oj81K99k79K51K7J9j83r6pqK8k6L02
$$ 493 -203 21 -198 168 290 199 -148 100 -3 -54 38 32 -149 150 -129 122 149 168 -15 -111 -118 -126 -98 -124 178
1778A78l03o0L20j48R1O2l06p4L17J14j34K8j93J51j17L7K59k8m18L32O3N7n3
$$ 178 -125 -185 135 -13 78 140 -166 -240 77 191 57 85 -108 43 -74 -37 222 194 -224 108 171 228 175
1801A75k33j77L45J04j83j3m5O3q8o1OJ96n1o1J93j65J19j71K15j88J42k9N3n4
$$ 175 -58 -235 110 214 31 18 -27 36 -52 -113 -107 89 38 -23 170 5 124 -47 168 -20 122 93 146 92
1825I2l52K07M34l15m2j2j43j41L95k09O0J15j95N3p5K11Q3l33P0J40o8J10j58
$$ 92 -260 -53 381 66 24 12 -131 -272 123 -86 -26 89 -106 -53 -128 83 166 -167 -97 43 -25 85 -73
1848g3J34p6L98k65j18j30l0L00m08L10k5qK8j24J73k88K11q1J02j55J44jo8K68
$$ -73 61 -15 383 118 0 -130 -160 140 -268 42 17 9 37 -87 86 -202 9 -72 30 -125 19 18 -50 218
1872B18m12M4j49N30q5J69p44L15j8j37N60k70k35j03K13j02j69L05N3j40J71
$$ 218 -194 -150 -299 231 146 315 -429 -114 -132 -269 291 21 -214 -317 -104 -206 -375 -70 -17 -157 14
1893A4J41j96q7L02k97K75k74J53L73m78k22M15l46K51j6m6K2R4m1L6J22k97J79
$$ 14 155 -41 -128 174 -123 152 -122 31 404 -74 -296 119 -227 24 8 -38 -16 78 37 73 195 -102 77
1916G7k0j80qJ05q9Q4J01N5J38k30Rj71Q4N1k02q4J18L9k3J79L4K27l62j17K34
$$ 77 57 -123 -131 -26 -115 -31 70 125 263 33 42 -129 -45 6 -196 -280 -162 -123 -146 33 67 294 -68 -185 49
1941D9p3j29O2k7N3N2J6q7P0J01j73kO9K86k69k7L8o7j36K06j02j21N35k5l50
$$ 49 -24 -153 -91 -118 -65 -13 3 -84 -14 87 -86 -88 -19 267 -2 -29 9 -58 -194 12 -90 -211 324 299 -51
1966e1Q6K2r5J01k52L00l72J87P0K04j42j01qj64L82o1N5k73J41j88J65j80J33
$$ -51 35 57 -38 63 -189 111 -261 -74 -4 200 58 -43 -51 -215 167 106 161 -112 29 -159 6 -174 -41
1989d1j9L8m0J22K3j8n1K01o3j87oj78K06j87L9K5n4J58k7o3L13k04L7R7q5o2
$$ -41 -60 -22 -62 60 83 65 14 215 152 -35 -41 -219 -13 -200 -161 -136 -190 -32 -59 -122 191 -13 24 121 36 -26
2015b6P0L6L23k08j16j45J79k90K77J2j31j8l1K2K01j61M1J28k97K19k28J16j13
$$ -26 44 80 403 195 79 -66 113 -177 100 112 -19 -37 -68 -46 155 -6 35 163 -134 85 -143 -27 -140
2038a40J82l76K36J36L60l59O6J1l2J06k27N4J49k88K34j08n4J48k87K16R7k24
$$ -140 42 -334 -98 38 398 39 105 116 84 190 -37 17 166 -122 112 4 -50 98 -189 27 124 -100
2060a00L11j86j8j88J10p1K90j14j34J80j75J59k39K2n3M9K41J15j93k32N39p37
$$ -100 211 25 7 -181 -71 -142 148 34 -100 80 -95 64 -175 -153 -206 -157 84 199 6 -226 313 -424
2082d24M85Kl22K75J80k27j24J86N6Jk02p3L66M4k62J14k56K08j39M95l49J6J44
$$ -424 61 63 -259 16 196 -31 -155 31 87 88 -114 -187 179 223 -39 75 -181 27 -112 383 34 50 194
2105A94k07k37L72p3M0j56J12k1kn8l1J33j33o9K31r1L14l92K19k89j67L32K9
$$ 194 -13 -250 122 49 89 -67 45 24 22 -36 -67 66 -67 -136 95 4 318 -74 145 -144 -311 21 50
2128E0k9NJ03j47k26K85L2j24lL27j50l59J45m8L10k30l15J78J06L79j78KO8k06
$$ 50 21 26 129 -18 -244 41 73 -51 -54 273 123 -236 -91 -139 171 -59 -374 -196 -90 289 111 113 181 -25
2152b5p1J68j50J06J58L7p6J1k24J94l31J07M48m04m22N08j12j64M54j55p9M14
$$ -25 -96 72 -78 28 186 223 147 158 -66 128 -203 -96 352 -52 -474 34 -78 -242 212 57 -22 392
2174C92m72M68l07j0kj36J84j59j36J46m1J07k9l49L57J34j32N6J38m01K13J53
$$ 392 -80 388 81 71 69 -67 117 -42 -178 -32 -73 34 5 -344 13 147 15 71 209 -192 21 174
2196A74q5jp1j86k3J70O9m8j04l1K77m26K18N6r1K67l27L55q8l35J50m1L61n80
$$ 174 89 88 17 -169 -192 -22 47 -1 -105 -136 141 -285 -67 -11 -102 165 -162 193 105 -230 -80 -121 240 -340
2220c40K81K35m43L78q7J78j95J16L4m95J56J22Q0o5q6J9J31k45K55p4k6J30j21
$$ -340 -59 176 -267 111 24 202 7 123 157 -338 -182 -60 20 -45 -131 -112 19 -226 29 -45 -71 59 -62
2243f2J21k35K19J72m4k50j4j03L86k96L16k41j30J15J12Mo2R9m11M37k79p8K26
$$ -62 59 -176 43 215 171 -79 -93 -196 190 -106 210 -31 -161 -46 66 70 8 107 -304 133 -146 -224 2
2266Br3nM10k2k53K5j21P6o6m7J25m2j6l09L03N4J52l86K64K2m5J5j32j25J86
$$ 2 -91 -96 314 292 39 64 -57 19 -47 -94 31 -11 -27 -336 -33 21 173 -213 51 73 28 43 -89 -214 -28
2291b8J78k39K14n8K0k91M05k75K52R6k96l6K28k12K96l19P5p5P8k28K78p6R1
$$ -28 150 -89 125 67 87 -204 201 -74 178 274 -22 -58 170 -42 254 -65 10 -65 13 -215 63 -13 78
2314G8j2N8k27o0K09l37M08l46K10Q5p8N6j5J61k0j10M8k84K2K35m0j64l26J20
$$ 78 66 124 -103 -163 46 -291 117 -229 -19 66 -12 44 29 190 170 60 108 -176 -154 81 41 -123 -449 -329
2338c29N06k70Q7j49Q0j4K46K8j23n0k3k56K99l9J30k62K91l41L02j85k31O56
$$ -329 177 -93 -6 -155 -75 -89 157 185 62 12 -11 -267 32 -7 123 -139 152 -189 113 -72 -303 353
2360C53k48l73K88r1o9Rj77M12k37J87k38J99K18j38N3j26n0MN8j1K57k32J50
$$ 353 105 -268 20 -71 -140 -131 -308 104 -133 54 -184 15 233 95 148 22 -28 -24 34 23 280 48 198
2383A98k93J35L78k83R2j00k19j35J28J20J26l18J21K58l12L5J49k94R4j33j01
$$ 198 -95 40 418 135 227 127 -92 -227 -99 21 147 -171 -50 208 -104 -69 80 -214 -120 -253 -354
2404c54L39K1Jj3K73k77rP5j53J41j21KN3R9l5N8j18o0j77O3K26k2m7L01l86J16
$$ -354 -15 6 7 -6 267 -10 -19 56 -97 44 -77 -75 -22 77 42 100 -18 -78 -255 -192 34 12 -35 266 -120 -4
2430dJ36j64n1J1j06K93j09N4O0k50k01M15j04J52j64r6L7J7O5j42P7L42o46O78
$$ -4 132 -32 -83 -72 -178 115 6 60 120 -130 -331 84 -20 132 -32 -128 -91 -74 -9 -151 -74 268 -378 300
2454C00j45j92j74P2P6J87l49O3L39Qq9No1k15L10J6k15p3l0K34j14p0L60l94
$$ 300 155 -37 -211 -139 -63 124 -225 -162 177 185 96 101 40 -175 135 151 -64 -137 -167 67 -47 -117 243 -151
2478a51K3K52l12M64l64O0J77l03L18q6j13j1O1j73j47K83L5j25J6Q8L57l13J03
$$ -151 -128 124 -188 276 -88 -28 149 -154 164 78 -35 -46 15 -158 -305 -22 13 -112 -96 -8 349 36 139
2501A39M2l54m4J56j16K15j40J4o4m9K2M83m39K56m16L86J68m15j58J50J88p3
$$ 139 181 -173 -217 -61 -177 38 -102 -88 -152 -201 -179 304 -135 121 -295 91 259 -156 -314 -164 24 -49
2523d9k13L19J08j34l4j98J81M5k83N47l19K0k4N6Q7M2j26j17o1K74J25l43J70
$$ -49 -262 57 165 31 -3 -201 -20 25 -258 289 -30 -10 -34 22 109 151 25 -92 -153 121 246 -97 73
2546G3K9J49k26n3LJ27jp1J72o2k32K63k40jL69l39j41K84qK99l55K8j49J26o8
$$ 73 102 251 25 -28 -25 102 101 30 202 140 -92 171 -69 -70 299 -40 -181 103 95 394 39 67 -82 44 -24
2571b4O8K8l05L32j51L1p1K46k03l11K80J51J2k91J18K5k33K88n3J19no6r1K23
$$ -24 44 72 -233 99 -52 -21 -92 154 -49 -360 -80 71 83 -208 -90 -65 -298 -10 -63 56 51 -15 -106 117
2595A17j0o0j38L80k05k86J71qKl8M84n11J43J3j93K1J17K0j10K4J37J05k36m9
$$ 117 107 47 -91 289 84 -202 -31 -39 -37 -75 409 -102 41 54 -139 -118 -1 19 -91 -67 70 175 -61 -110
2619a10L8j3K20n7J46j14j84K04j65J20k40K30J10m32J12j12L77L3j07K16m44
$$ -110 -72 -85 135 78 224 110 -74 130 -35 85 -155 75 185 -247 -135 -247 130 163 56 272 -172
2640a72J86M4R9l11J80J21j18mno9q6K60m8K79n13J23J34j68M3M6j03j63K13J23
$$ -172 14 58 157 -154 26 147 29 25 20 -49 -135 125 77 356 -157 -34 100 -68 -25 21 -82 -245 -32 91
2664I1o0K1k88J15K16j20L10l70J21J68n6O8k19K4l1k45M66j18O2j33Q6j35J08
$$ 91 31 52 -236 -121 95 -25 285 -85 36 204 148 216 -3 21 -10 -255 211 93 155 22 108 -27 81
2687H1J58l15J52Q6k18J62J62l94K39O1p2J13j85R5Qj17Q3j80L32j72j32R3n2
$$ 81 239 -76 76 162 -56 106 268 -126 113 174 102 215 30 125 133 16 99 -81 251 79 -53 40 -12
2710a2r0N55l49j36M0k17L72l36M7J98N5k96Q8L00k65o8P3P9J09L6m15L92lj56
$$ -12 -102 453 104 -32 8 -209 163 -173 -126 72 127 -169 -81 219 -46 -114 -41 38 147 183 -232 160 157 1
2734AJnj16L6L7K99l60n1K45l3L41o45M13P3l69J70N5m1k09K46r1j71L12m4p4
$$ 1 2 -3 -119 -83 -46 253 -107 -158 87 54 395 -250 163 236 -133 37 92 51 -158 88 -3 -174 138 94 20
2759B0J60l09L9J84K22k30j24N5p7K85j34N4j95N7j03K21o4j54K94k94J03J10
$$ 20 180 -129 -90 94 316 86 -38 17 -60 225 91 145 -50 7 -96 125 61 -93 201 -93 10 120
2781A20l14J78r7j83K00j22M76l31j68L02k64L11n1J02O9k70K33j96n1J27M8J6
$$ 120 -194 -16 -113 -296 -96 -218 258 -73 -241 61 -203 108 57 159 228 -42 191 -5 -56 71 119 135
2803A35j04k29J82r7R4K53p5k93Oo9K29rq6J85o2k45j01L64%l36K11O2k10K93
$$ 135 31 -198 -16 -113 -19 234 159 -134 -128 -197 32 23 -63 122 60 -185 -286 78 78 -258 -47 15 -195 98
2827I8l31K19J0J98n8m71J50J40L72k07l2j44J89j25K72o59L62j12K57j30J94
$$ 98 -233 -14 -4 194 136 -335 -185 -45 327 120 88 -56 133 8 280 -379 -17 -129 128 -2 192
2848A92k49J49j25J08J50l08O2M0o2J1j53M88k09l0J56k45P7k2k30N1K24L8n2
$$ 192 -57 92 -33 75 225 -83 -21 19 -43 -32 -185 303 94 64 220 -25 52 30 -200 -149 75 113 61
2871F1l22N15k22K52j74l36L41k94J27P3j09J29J47j00j5j21J79k83L37k63J07
$$ 61 -261 254 32 284 110 -226 115 -179 -52 21 -88 41 188 88 73 -48 131 -152 185 -78 29
2892B9M98o88J96l04Q2K28kJJ6l07K92k39J03R3q0K00k08K42k25n0j5M7J84l71
$$ 29 527 -161 35 -269 -187 41 39 40 56 -251 41 -198 -95 -2 -82 118 -90 152 -73 -123 -138 -91 93 -278
2916b78L09K31l20j5O8J7j03%K83k56k26N28l33Kn4R9n3K7L32p2r1l86N20k83
$$ -278 31 262 -58 -73 -5 12 -91 -91 192 -64 -290 238 -95 -93 -147 -48 -101 -74 258 186 95 -291 229 -54
2940e4N1k3o2j11J86QJ58j13j21N2Q7o6K67o04J31J83p3R1k2N8P8Op8q5j1k3j26
$$ -54 -3 -26 -88 -199 -13 -5 153 40 -81 -29 58 -8 259 -345 -214 -31 -104 -13 -35 23 101 107 29 -56 -67 -90 -216
2967b16K13p9J50k65K47j21R6L9l9K86l94K60j15p8p5J98l97J40K66O5k01n3K83
$$ -216 -3 -82 68 -197 50 -71 25 64 25 311 -83 177 62 -16 -91 107 -290 -150 116 181 -20 -73 210
2990B10m33L29j80K31n39L40J7j25p5k54O96j50j27k2R7L7J86l53K38J79k20J39
$$ 210 -223 106 -74 157 -382 -42 -25 -150 -225 -479 217 67 -60 -82 15 52 238 -115 123 302 82 221
3012B21j58j32j0m3J55k08L48O6j60k32N9O6n4m6M46j95m2j29l6Q4j94M7K87j94
$$ 221 63 -69 -79 -122 33 -175 173 239 79 -153 -94 -28 -82 -128 318 123 81 -48 -84 0 -194 -147 140 -54
3036e4J21j59J61J31l67jJ85k75J64J6L32m07q6L25J05j3p7k24j73K64N0J11K2
$$ -54 67 -92 69 200 -167 -168 17 -258 -94 -78 254 -153 -239 86 191 178 101 -123 -296 -32 18 129 151
3059A51l27J40K1J32j80J20R6k55K1L2J36JP1k98J90j92N1m3K33l1j34k4m2J02
$$ 151 -176 -36 -15 117 -63 57 153 -102 -81 -49 87 88 159 -139 51 -141 -90 -133 100 69 -65 -89 -131 -29
3083b9k1K2K25k10n9L5N19m41l30M91o6Pj79M9j45K74j8k17J62m4k0q8K51m47
$$ -29 -50 -28 197 -13 -72 -37 482 41 -289 202 136 143 -36 13 -132 142 124 -93 69 25 5 -83 168 -279
3107b79L47L17l78nj4l00K40K66j75P2J1k8R7j52J20r6n2Rj25J08j08N4N7j6k86
$$ -279 68 385 7 2 -12 -312 -72 194 19 91 102 74 171 19 139 43 -9 0 -125 -17 -125 -71 -14 -30 -316
3132c16K20K18j87L30k58J08K34m65P3q5j52L76k58O5K11r1j93J07k56K41j1p8
$$ -316 -96 122 -65 265 7 115 349 -116 -43 -128 -280 96 -162 -97 114 23 -170 -63 -319 -78 -89 -167
3154a67L07k31j15j45M13j51n0J78j75P1N5Q4lk68J78P3K19k20rRj63J43J06j01
$$ -167 140 -91 -206 -351 62 -89 -139 39 -136 -65 -10 74 71 -197 -19 54 273 53 44 53 -110 33 139 38
3178C8j27mj16L55k36K57q1nm6M5l04j52L15J93k29j73L7L2l2Q3L50k49M29p18
$$ 38 -89 -93 -209 146 -90 167 86 81 35 80 -224 -376 -61 132 -97 -270 -233 -201 -233 -150 200 -49 380 -338
3202c38L02m0M9n3k0k2K66OR9l5n87J91O7J9R4J02R7j39j31JJ34j19K39j76k37
$$ -338 -36 -76 -27 -80 -100 -122 144 150 249 214 -373 -182 -115 -96 -2 100 197 58 -73 -72 62 -57 182 6 -231
3227b31M7J45Q2N2j71J10p1L0q5K42%j88k41K59k87K86j83Q6m6J34k02K06j00
$$ -231 -184 -39 43 95 -76 34 -37 -7 -92 150 150 -38 -279 -20 -307 -21 -204 -118 -164 -30 -232 -26 -126
3250a26L11j32r7k0j47K7J38m4j03L20j3k20M67n17O7K07l68P8M5M2J63J49j82
$$ -126 185 53 -44 -64 -211 -184 -46 -90 -193 127 114 -106 361 -156 -89 118 -250 -172 -127 -85 78 227 45
3273D5j72j69K24m5K84k71J57k41K60m37K90n4O6K5L8k43K18j6k06L85k79J4J67
$$ 45 -127 -296 -72 -117 167 -104 53 -188 72 -365 -75 -129 -63 -38 0 -243 -25 -41 -247 138 -141 -127 40
3296D0J7j55L9K31j98K19n73O59k84J28J6M2m54J30Q1J16j08L0j76L44J19l03
$$ 40 57 -98 -59 172 -26 193 -380 279 -5 123 139 181 -273 -143 -62 54 -54 -24 -200 144 263 -40
3318d0J29J0k8q7J86k00J67j2P2l58J14J64j18R5p4J04j83j0K04L0J97k43k54
$$ -40 89 99 71 -16 170 -30 137 125 197 -161 -47 117 -1 94 20 124 -59 -69 135 165 362 119 -135
3341a35J34N8l40K62L9J45k62L00p1k29L7Kp7l2J92j75K65j12J6j90J33j02p3
$$ -135 -1 57 -283 -21 18 163 -99 201 130 -99 -62 -60 -137 -169 23 -152 113 1 17 -173 -40 -142 -215
3364b15N9K17R8j22j34l1J18o0J91j83O5q5rQ6j87M62k52R9p7K76l34k7j52L19
$$ -215 -156 61 159 37 -97 -128 -10 -70 121 -62 3 -82 -91 -5 -192 270 18 117 40 316 -18 -45 -197 122
3388A22Q2k10k17Q4n3N13m10J19j9k69K05M0k4K11j85J66j29j03J14n3p2j27M76
$$ 122 204 -6 -223 -139 -192 321 -89 30 11 -258 -53 -13 -37 174 -11 155 26 -77 37 -16 -88 -215 261
3411B61m37K01j66K8J23J18k26L59o48M43j87M6R3K5R5l74N2L37j28j03M8O0n5
$$ 261 -176 25 -141 -113 10 128 -98 261 -387 56 -131 -85 8 33 128 -246 -194 143 15 -88 -40 20 -35
3434c5K49l61J06qj44K63r2r1K15Qj15q5J56k2K25l51J66k75m8K28m92N13R2L89
$$ -35 214 -147 -41 -49 -193 70 -22 -113 102 110 -5 -90 66 44 269 -82 84 -191 -239 -11 -503 10 102 491
3458D91o21M0K73j26o4k3j04L32o6m61R4J79o0K22k17P5K20k03K65m26J77N8J70
$$ 491 -130 -90 183 57 -7 -30 -134 198 132 -329 -235 -56 -116 106 -111 -36 184 -19 246 -180 -3 55 225
3481B25k03P1k80K17P8k30j0j15k7K16K63m47L35k62L7Q4j05O4J04K07n86L44
$$ 225 22 93 -187 30 108 -122 -132 -247 -274 -58 205 -242 93 -169 -132 -48 -153 -89 15 222 -364 -20
3503b0Q5l%l9P5J03m39J73K28k8P1k75j03L25j87L09k91K04j95J43M2j93J8k54
$$ -20 65 62 62 23 98 201 -238 -65 163 135 206 -69 -172 153 -34 275 -16 188 -7 136 178 -15 3 -251
3527b51M58l42M11m35J59j52J49k40M81l1j95j09Q9R5J30j50j4k38K14Jm76L43
$$ -251 207 -135 276 -159 0 -152 -3 -243 238 207 12 -97 -8 87 217 67 53 -185 29 30 -446 -103
3549a03j16L39n1j51J92j7l20L9k03M24Q9l93K15J48o0j86R0j0n8r4J9J10J58
$$ -103 -219 120 69 -82 110 93 -227 -188 -391 33 122 -271 -56 92 32 -154 -64 -74 -132 -226 -207 -97 61
3572F1M9j00q1N8N9o4JJ29L4k95J29R7j59j14L45j32L25m19j11K60r8J94j13k25
$$ 61 110 10 -71 -13 46 -18 -17 112 146 -149 -20 77 -82 -196 149 17 342 -77 -188 72 -26 168 55 -170
3596a70k3M5j18L51J53l33L19r2k9J67m37J00n8M2j25K71J37L4j99m4K9O9K1j51
$$ -170 -193 -148 -266 85 238 -95 224 132 103 270 -167 -67 -125 -83 -208 63 200 234 35 -9 20 89 110 -41
3620d1O6Q0Qk69R1J43l14M9j15J45J29M3j1j9L0k13N18m28K77l24K18O3j9k6k26
$$ -41 25 105 113 -156 -65 78 -236 -187 -302 -157 -28 15 4 -15 15 -198 320 -108 169 -155 63 126 107 81 -145
3645a45K51k43L53k99K6J00Oj28Q5J91j68O8m13P82m95J64n6K87l70O5J74l36
$$ -145 106 -137 216 -83 -57 43 49 -79 6 197 29 97 -316 466 -29 135 79 366 -4 61 235 -101
3667a01K83j55O5R4m92K90p7J89p5q6N0j28K40j36n5K46M5P6j40N3j44K99m18
$$ -101 182 27 92 186 -306 -16 -93 96 21 -65 -15 -143 97 -39 -94 152 197 273 133 186 42 341 -77
3690g7J19l13K13q1mK20o1j53J43l8k84N43j83j50k02L42M9j85J2M16m02J27k10
$$ -77 42 -271 -58 -139 -143 77 16 -137 6 -32 -316 227 44 -106 -308 34 83 -102 -90 326 -76 51 -159
3713a59K23j19L07j77j47R2l22K95N7l4L3k03jO6K8J43R0q6l48M44nk78m5L05
$$ -159 64 -55 252 75 -72 20 -302 -7 50 16 49 -154 -155 -89 -61 82 172 86 -262 182 177 -101 -146 159
3737A59jr9j8k04r2K20N9o3Q6J8Q1l84K09l8k09K08J37k83J07J52j33K66l19L66
$$ 159 158 59 41 -163 -255 -35 24 -39 47 65 146 -238 -29 -67 -276 -68 69 -214 -107 45 -88 178 -141 225
3761B25j4k93K49J3o6k58J5M1J35j01K4J61j0o6Q5r2K6m6k86L26l95M57l93M4
$$ 225 211 -82 167 180 114 -144 -129 -88 47 -54 -30 131 121 55 140 48 74 28 -258 68 -327 130 -263 -219
3785b19J73K50k02Lm5J07J9m7j23K52m32M16j72p4K52k79N0L24k42L1k2r1K38
$$ -219 -46 204 2 5 -40 67 86 39 -84 168 -264 152 -20 -94 158 -121 -71 253 11 42 20 -71 167
3808A67k35k0j51K59k3l3j10K30k44R7M49m45K07m9J16j92J39j86k12L85j91k32
$$ 167 -68 -88 -239 20 -3 -36 -146 84 -160 -63 386 -59 148 99 215 23 162 -24 -236 149 -42 -274
3830b74K22MO9K77m22K13p0j50J59l6K6J16k19QK01o8k40J79j50L36l50M09L0
$$ -274 -52 -48 21 298 -124 89 19 -131 28 -8 18 134 -85 -77 124 56 -184 -5 -155 181 -169 240 270
3853B70j95p8p6J61j53J48p7k5j0J84l90K73q2J46r9j91K95j12j3J1N2L0p5j69
$$ 270 75 -3 -79 82 -71 77 0 -25 -35 149 -241 32 -50 96 -3 -194 101 -11 -24 -13 39 69 -6 -175
3877a75K8O5Q9m8K96k49K06k41J84j50K9j63jJ37J4%K7J28l28L71j86R7m33N39
$$ -175 -147 -82 7 -41 255 6 212 -29 155 5 34 -129 -130 7 21 21 48 176 -152 219 33 130 -303 236
3901B36j04j09k49J82M6j3K24m30J05J98K25l08j08K15j10k24L16Q7q5k80M35
$$ 236 132 23 -226 -44 2 -11 213 -217 -112 86 311 3 -105 110 0 -224 92 179 94 -186 249
3922B49l83J36n9N3J87r2Jr4q2J09q0K8K19k94L25k77O8L6qk31M21k86o0L04j79
$$ 249 -134 2 -57 -4 183 91 92 -2 -84 25 -55 -27 192 -102 223 -54 14 50 42 -189 232 -54 -114 190 11
3947A1J01l2q9j33J26R2P8p0Ok30J61Pp2J88j49q4J40lL3k62j50L84j28Q7n9Q0
$$ 11 112 80 -9 -142 -16 76 154 84 90 -140 21 28 -44 144 -5 -89 51 48 81 -181 -331 53 -75 12 -47 33
3973C3j15j5L0J45j15j1k0L50m28K16m1r7Q7j32K27j25o5L44l51K29k89P4K58
$$ 33 -82 -97 -67 78 -37 -48 -68 282 -146 70 29 -68 19 -113 114 -11 -76 268 -83 146 -143 -69 189
3996A89l31M9K02N3l62m2K55K5k7j7O6k30K60j35K22k73N2j10K80l22K22P2k28
$$ 189 -142 -93 109 162 -200 -242 13 38 11 -6 60 -170 90 -45 177 -96 -44 -154 126 -196 26 98 -130
4019a30J75p8J39k02k7M67j51l88N04j03k01k16K18O7O7o4p2K72m87K89k99J71
$$ -130 45 -33 106 -96 -123 344 193 -195 309 206 5 -211 7 74 141 77 5 277 -210 79 -220 -49
4041d9L29j62m61J02M09k28M3K66l00J34j64j85L89k27j51M12k35K21m8j77J65
$$ -49 280 118 -343 -241 168 -60 -17 249 -51 83 -81 -266 123 -104 -255 157 -78 143 95 -82 83
4062H3j35J8r9K25j90K19l3J5j59q9J90j37J79j35L86m01j27J6J35J68l48J80
$$ 83 -52 -34 -133 92 -98 121 88 103 -56 -145 45 -92 87 -48 338 -63 -190 -174 -39 129 -219 -39
4084c9k5k0M80k75m5k95N8L09j86n5l1J78O2j11k11J78n1j67L33j56P9J33k22
$$ -39 -64 -84 396 121 76 -219 -161 148 -38 -93 -124 54 116 5 -206 -28 -79 -246 87 -69 10 143 -79
4107g9J54J04O3k18j99K94k45j47L40k45M03j36Ml04L04o6K62r9j15j30J67k59
$$ -79 75 179 242 24 -175 119 -126 -273 67 -178 225 89 93 -211 93 27 289 190 75 -55 112 -147
4129a47j48J16J01J32j95J47j44j2L92l15q8J05L2J44k6R9j92K03m1k37LK04K2
$$ -147 -295 -179 -78 54 -141 6 -138 -150 242 -73 -161 -56 -24 120 94 193 1 204 163 -74 -71 133 155
4152A55oR5j45m51M50k09K33k4J7j93Ql0K99k11m6P2m4j7j34K49l8M9j6QJ00r2
$$ 155 149 244 99 -352 98 -111 122 98 115 -78 -70 -100 199 -12 -58 14 -30 -47 -181 68 30 79 63 71 171 79
4178G9j5J32K2l34L2k6J53k0k9J03m04L74O7m12L68l18L8K30m6j00L0J80k74K00
$$ 79 64 196 218 -116 -84 -110 43 23 -6 97 -307 67 134 -278 90 -228 -190 40 -6 -106 -76 104 -170 30
4202C0o3K61j52r7j04R8K61m4l23J69q6r8J46J5Q2p7J22o4j69o8J5m6K82k03n5
$$ 30 -33 228 76 -21 -125 -27 234 190 -133 36 -50 -148 -2 13 95 18 140 76 -93 -161 -146 -192 90 -113 -168
4227a68n1J47J24J21o5j98K91l0l52J55J72p6j59j11M24j82j53J03j01K10l7R3
$$ -168 -219 -72 52 173 108 -90 201 171 -181 -26 146 70 -89 -200 224 42 -111 -8 -109 101 64 157
4249A57Q6k95j58j3L16j18J22j2J1J01l35n5J46L47k84R2p7K71k10n6M2k1O5k25
$$ 157 243 -52 -210 -223 93 -25 97 85 96 197 -138 -193 -47 300 16 108 31 302 92 36 78 57 122 -103
4273a03L59j74k19j51M13r7j33K22j13j83J28L0o0Q4J50P7j61k50J74J89j73J89
$$ -103 256 82 -137 -288 125 28 -105 117 4 -179 -51 -21 -81 3 153 230 69 -181 -7 182 9 198
4295A98n63M44k29J78j34OO6j21K26L9J00j38j8M7l21J3L82j18J77l17J48l0O5
$$ 198 -365 79 -150 28 -106 -100 -34 -155 71 110 210 72 54 101 -220 -207 175 57 234 -83 65 35 100
4318A00j35l5M0NlK82k96K00m30J98j10N13l82q4p8K91J57m35Q6J08j46J4j10
$$ 100 -35 -70 -30 -25 -28 254 -42 158 -272 -74 -184 329 -53 -137 -215 76 233 -202 -116 -8 -154 -140 -250
4341b50K73L1j97j6M12k92K44l27L23k97r9M11k76k8J26l67K95m4kK05k30K14
$$ -250 23 54 -143 -159 253 -39 205 -122 201 -96 -195 216 -60 -88 38 -329 -34 -78 -80 125 -105 109
4363A09l19N76k99L8j36QP3j1j98J21p6J92j18M7j6R9N2j52J21J52j56m7j27j13
$$ 109 -210 366 67 105 -31 -23 50 39 -159 -38 -114 78 -40 7 -9 90 142 -10 111 263 107 60 -67 -180
4387a80M13l42K97j74l01M11n03L34k9m8j61O3K71l0J40k23j5O0j59L07r5j3R3
$$ -180 233 -109 188 14 -287 124 -379 -45 -74 -122 -283 -220 51 21 161 -62 -77 -17 -176 131 36 23 116
4410A16j01p8l7j17J05K22J55k19k09K60m5l4K2n2K6j7j16J29k0m6l2L7k68J92
$$ 116 15 -63 -100 -217 -112 110 265 46 -163 97 52 18 40 -12 14 -3 -119 10 -10 -56 -88 -51 -319 -127
4434a27K03Q4j87M2J11pK9l1m3K06l93L98l07j6R8m05M73k21J96l21K98R5l32
$$ -127 76 160 -27 15 126 119 148 117 74 280 -113 285 -22 -38 60 -345 128 -93 103 -218 80 175 -157
4457a57K58r4k02O8J65k08J14K3j56K33j98J93K6O2O1k75Kq9K60j22k26M59k21
$$ -157 101 7 -195 -127 38 -170 -56 -33 -189 44 -154 39 65 127 188 -87 -85 -174 86 -36 -262 197 -24
4480b4n1p6L04K0l11J64j31j24M73l07K47k53J51j68K11o3o8J22q7j85K79J1J17
$$ -24 -75 -151 153 173 -138 26 -105 -229 244 -63 184 -69 82 -86 125 62 -6 116 29 -156 123 134 251
4503B51J37m92K05k63L12l54K21j17j19L46j36K0kN7Q3k10NL0m0J79j23j85J91
$$ 251 388 -104 101 -162 150 -204 17 -100 -219 127 -9 11 9 66 149 -61 -56 -26 -66 113 -10 -195 -4
4526dj7j09L19p8m5K9l38L28J49o8l31K76j57N6mj53J93J77j34j68J9J58l66R4
$$ -4 -21 -130 189 111 66 95 -243 85 234 166 -165 111 -46 10 6 -147 46 223 89 -79 -60 98 -268 -174
4550a74n1K90P1o3K1k86J11J60k52L58k72N5L5k18K08Pj45MK17R1m5k0M7K13l46
$$ -174 -225 65 136 73 94 -192 -81 79 -173 185 -87 -32 3 -215 -7 0 -145 -141 76 167 122 102 149 362 16
4575A6j23J71j34J46%J23j75R8Nk7pj99K4o9J6J62K5j51L67j19k13j04J40J34
$$ 16 -107 64 -70 76 76 199 24 122 127 100 93 -106 -82 -151 -135 27 52 -99 268 149 -64 -168 -28 106
4599A06j57k4P9L0K13m99L96Kk11L22m45N9k93K18K36r6J05P7j40n5K08j55LJ6
$$ 106 -51 -75 4 34 247 -252 144 146 -65 257 -188 -129 -422 -204 32 -64 41 118 -22 -77 131 -24 -21 -5
4623eJ09k99L67j45ko9M5K23l56K08Qj3j65j41J19M6J0K33m26j21L91LJ95Q0m26
$$ -5 104 -195 172 27 25 -44 1 224 -132 76 84 71 -94 -235 -116 -70 -60 173 -253 -374 17 20 215 295 -131
4648a31J91P0J1k38J09J1j18R4R1j70L28k62j23L27k31J97j52m08L74j90o1M16
$$ -131 60 130 141 -97 12 23 -95 -1 90 -80 248 -14 -137 190 -41 156 4 -404 -30 -220 -281 135
4670A35J00m23J54k6L5P3P0l4k20J34j41K85k95K55Ol2k04J71j96L71l00J29J7
$$ 135 235 -188 -34 -60 -25 48 118 84 -136 -2 -143 142 -153 102 108 76 -128 43 -153 218 -82 47 64
4693F4o2R3l8j13o5nN6j38K33R7j27p9oP0J37j59J62k0j16J45n7J32n0p8j46K51
$$ 64 2 95 57 -56 -121 -126 -70 -208 25 122 -5 -84 -90 -20 117 -42 120 100 -16 129 72 204 154 76 -70 181
4719A81k43L34k69j96r3K30NK39n53L46j50L16j34o6J05p0J66l6N7j43J28k24
$$ 181 -62 272 3 -193 -286 -56 -51 188 -365 -19 -169 147 13 -53 52 -18 148 112 169 26 154 -70
4741g0J1K08N3o06M83l52M04o8l0Q2k6j58J0J9J88j09J43q5j58Q1n8J30r1J15
$$ -70 -59 149 202 -404 79 -273 131 63 33 115 89 -69 -59 -40 148 39 182 97 -61 20 -38 92 1 116
4765A16k62J53L25k57J03j44P6k44K55m05L01J35m72K55K18j68L5k79L14%M8k2
$$ 116 -146 7 332 75 178 34 110 -134 121 -284 17 152 -320 -65 153 -15 20 -259 55 55 103 81
4787H1j5J4k2j68J6K69j27k8K4J61j81j62J67j2M3k95K05M4j31P7J22k29R0K15
$$ 81 66 80 58 -110 -94 175 48 20 44 205 24 -138 29 17 60 -235 -30 14 -117 -40 82 -147 -57 158
4811A58k97L06n38J44M31k14K05J18j29k31q4L1J50q4Q8q6O9m3l01kL4M29j64
$$ 158 -139 167 -371 -227 204 -10 195 313 184 -47 -131 -100 50 -34 54 -32 37 -6 -307 -309 -275 154 -10
4834a0j29P5k0K43M5k09r8J6J09l0O1j76J17K6j30M02k08j62J15N9p9K7l51L29
$$ -10 -139 -64 -84 159 204 -5 -103 -87 22 -8 53 -123 -6 20 -110 292 84 -78 37 96 17 44 -307 22
4858B2k5l1N2j81L9J72Lr8J0L0Jm8l0q0P4M13l38j32J72r3L11l88R8Q8P4k36K19
$$ 22 -3 -34 18 -163 -124 48 51 -47 -37 -7 -6 -54 -84 -164 -90 323 -15 -147 25 -68 243 -145 -47 41 115 -121 98
4885I8k19N0o1Q5J09j11j28L67k0r1o8j9m8L4Nj02J04J19Q2k24J97J21k90K1J15
$$ 98 -121 -71 -132 -47 62 -49 -177 190 170 79 11 -8 -56 -22 -17 -119 -15 104 186 -38 159 280 -10 11 126
4910A26p1k33L69l72lL75j25p8mR6j64O7J67l24M94j18j48p8P7k56J60OJ33k11
$$ 126 55 -178 191 -181 -184 191 66 -12 -16 80 -84 -17 150 -174 320 202 54 -24 53 -203 -43 -37 96 -115
4934a15J49J01j12j2J05j61k12J99K25N9Jl51L22q7l13M17j35n0K03M3m49M41
$$ -115 34 135 23 11 116 -45 -257 -58 167 226 227 -124 198 111 -202 215 80 30 233 276 -173 268
4956B68k43j45o5L31j04j64K90j61o9l2K98j89p7k7K85l50J91k42l7L75k76L27
$$ 268 25 -120 -185 146 42 -122 168 7 -62 -94 204 15 -62 -89 196 -154 37 -205 -242 133 -143 184
4978A84O9k33R8Ql8k10J34q2J8K49j24R8l61J56J93l38J24R1j44J45k25J5O6K60
$$ 184 253 20 118 126 88 -122 12 -70 -52 197 73 171 -190 -34 159 -179 -55 36 -108 37 -188 -173 -107 153
5002A53K3j78J31k8j76J20J8J22J6j06j85J54jN4Rkk31q2J67No9p9NJ03L42l05
$$ 153 176 -2 129 101 -75 45 63 185 201 95 -90 64 63 117 126 124 -107 -189 -22 -17 -86 -165 -160 -57 285 -20
5028b0k9J97P8n19K89J23MNj38R3Q8j14J45k82jN4r1r9N02k68j68n4N67m87N5
$$ -20 -49 148 226 -293 -4 119 123 128 -10 83 171 57 202 -80 -81 -27 -118 -217 285 17 -151 -205 362 -125 -70
5053g0J6R0N0l53m7K02p0r2K14J91p7j64K64j07N2k04q0J89K63m53N43j53k61
$$ -70 -54 36 86 -267 -314 -112 -182 -274 -60 131 54 -110 154 47 99 -105 -185 4 267 -186 357 204 -57
5076e7j02L48l81K10L2l12M60l03J94l98O9N16m60K35j37J5J37p0J81k06J38j79
$$ -57 -159 189 -192 18 50 -262 198 -105 89 -309 -240 276 -184 51 -86 -71 66 -4 177 -29 109 -70
5098g0r7M30N8l93J17j47J19J98k70K27p3r0j08L97m70L30j69R4j71K39k03j21
$$ -70 -167 263 321 -72 45 -102 17 215 -55 172 99 9 -99 298 -172 158 -11 83 -88 151 -52 -173
5120a73N6j77L17P8j70k7K6L08L6j18K21l97K50l48L46j55l60K77k64J77J13k7
$$ -173 -117 -294 23 101 -69 -96 -70 238 274 156 377 -20 230 -118 228 73 -287 -10 -274 -97 16 -11
5142a1M9j44L18k81k44M31j08mk17L08NJ25N5k60p6qJ62L1j72J62k14j71K35m2
$$ -11 38 -106 212 -69 -313 118 10 6 -211 97 102 227 282 22 -54 -62 100 131 -41 121 -93 -264 -29 -71
5166g1J76l57J13m2J91K53rk94J35j06L1ol15M38J7j10j66kJ06j46J94m6J78j87
$$ -71 105 -252 -139 -181 10 263 254 -40 95 -11 20 14 -301 137 154 44 -122 -124 -18 -164 30 -16 162 -25
5190b5K96l20q1K09M6m82J30R3J93l8p0j49J46p2J70k39P9K85k35J62j09j27J22
$$ -25 271 -49 -130 79 125 -357 -227 -134 59 21 -49 -198 -52 -124 46 -193 -114 171 -64 98 -11 -138 -16
5213a6L1L24l04j52j4J56J14j43J31r6P9j20J64k74j3K71k62R1K92l54J05k9M4
$$ -16 15 339 35 -117 -131 25 139 -4 127 31 110 -10 154 -120 -133 138 -124 -33 259 -95 10 -19 25
5236B5rK06Pk67q0k00L04J29k76N43n12J45k03J07K33p4lj26q5L06m80N5L18j40
$$ 25 16 222 229 -38 -118 -318 -14 115 -161 382 -130 15 -188 -81 152 78 75 -51 -136 170 -310 -255 63 -77
5260g7j13J50J6P7J24j07j10P2m5l37N99n4k42j28J79M2j27n6J24L09n29M4K82
$$ -77 -190 -40 -24 53 177 70 -40 32 -13 -350 249 195 -47 -175 4 46 -81 -137 -13 296 -233 -189 93
5283I3j04P1J74l77J61N9k03J27J59k51P5J72m48M28p3lN8j78P2R3k62K70P8j00
$$ 93 -11 60 234 -143 18 77 -126 1 160 -91 -16 156 -292 136 63 60 118 -60 12 105 -157 113 191 91
5307I1p0nQ8l26M50l49K23J7j33J58l48M94j96j83L59o26O90m06J87q5n8r6L39
$$ 91 21 16 104 -222 228 -121 102 119 -14 144 -204 290 94 -89 270 -356 334 -72 115 30 -28 -124 215
5330B15k71O9j49K08nj9k9J43l61O5J37J77j97j7j3p2J58j39K04j67R1k24K85
$$ 215 -56 13 -136 72 67 48 19 162 -199 -134 3 180 -17 -34 -47 -119 39 -100 104 -63 28 -196 89
5353H9j63L60l02J1k77L76j53J88j65M2r4M78n53N5J25j34O0MJ37m6L3k4M7k77
$$ 89 -74 286 -16 -5 -282 94 -59 129 -36 6 -88 390 -163 -108 17 -117 -57 -53 84 38 71 47 94 -183
5377a83q6K83l2J33R3m2q8J46J48l15j80L08k38p3Q8J64k16J71K3k55K86l67M29
$$ -183 -269 14 -18 115 208 166 78 224 372 57 -123 185 -53 -126 -38 126 -90 81 104 -151 135 -232 197
5400A97k24J53j24l9N7J24ok29j65O3P4J50k1Nm4K03l19k2M8J63m6r1l7J78J50
$$ 197 -27 126 2 -37 20 144 138 -91 -256 -193 -119 31 10 15 -29 174 -145 -167 -119 44 -2 -93 -130 48 198
5425A98k6l82K24Rj06p6M05m87K0L74k16J54j41N6j32K81k64J6N8Qj07J48k21
$$ 198 172 -210 14 23 -83 -159 246 -241 -221 153 -63 91 -50 6 -126 155 -109 -93 -35 -27 -134 14 -207
5448b07K87J4j74L55n5q3k4k32J69J44j83k1M5nJ01m75L19J6o7L18P4k96j05J54
$$ -207 80 94 -80 275 220 137 113 -119 50 194 11 -10 35 30 131 -344 -25 -9 -76 242 316 20 -85 69
5472F9k06j6p9K04k76K48j01j8J68j49L79l50p1K64r1J17J59k54n8O2j54k8L01
$$ 69 -137 -153 -232 -28 -304 -56 -157 -175 -7 -156 223 -127 -198 66 -25 92 251 -3 -61 1 -153 -181 120
5495A20k25K70j21j0O0q4J70k71J1J19PM7L4n7j97N46l84k8jq1J43k94L72j91
$$ 120 -105 165 44 34 94 10 180 -91 -80 39 46 93 127 70 -127 419 35 7 6 -75 68 -226 146 -45
5519d5LJ22j13O5k03J21K05l65L18p3l01J50M3M6J61k52Q5P0J5l80N37J12k45
$$ -45 -42 80 -33 32 -171 -50 155 -210 108 35 -266 -116 -73 -27 134 -118 -33 37 52 -328 209 321 76
5542G6R9Q5j3m49nK00r3P3k55M29j46NPk59K29M1K9q0P7k65K03J27n0K1o0N7l76
$$ 76 175 260 247 -202 -207 -7 -100 -27 -282 147 1 6 13 -246 -17 24 53 -27 50 -215 -12 115 65 86 26 83 -293
5569b93J99J65m2r0j9K64J96l59K68l52p2n5K8K55j64j68L76ko7k20J8j78K61
$$ -293 -94 71 29 -61 -80 184 380 21 289 -63 -135 -190 -162 93 -71 -239 137 135 68 -152 -134 -312 -51
5592e1Q5M6m7J9O4M7l74L93k75L4L4j23N1NJ81j37L2K03n45L99lj46K03k34K32
$$ -51 34 80 33 52 116 163 -211 182 -93 -59 -25 -148 -97 -92 89 -48 -16 187 -358 41 38 -108 95 -139 93
5617I3J15k49ln7lJ49N0j26j12J09p2j49J84O0K05j03j49J36N6J42m10J82j57
$$ 93 208 -41 -44 -101 -104 45 95 -31 -143 -34 -106 -255 -71 -11 194 91 -58 78 134 276 -134 48 -109
5640a09j72N02j75p8rM3j86m1J50p0K63m82K77m8J40J83j4l97P1L7J0J86Q6o1
$$ -109 -281 221 46 -32 -41 2 -184 -225 -75 -145 118 -364 -87 -135 5 188 174 -223 -152 -115 -105 81 167 106
5664A06r6k09L05p1J19j23j97K04LN8l64J85jm3QQ4J49Q0r8j21j26K13j64J13
$$ 106 10 -199 106 35 154 31 -166 38 41 99 -265 -80 -81 -124 -116 -32 117 197 99 -22 -148 65 -99 14
5688A4m5r2j14L07J35o0J1n0jj52r8P1Rj44Q8J41j16J47j57J60r7KN9p7K68j59
$$ 14 -31 -123 -237 70 205 145 156 106 105 -47 -145 -74 -65 -209 -121 20 -96 51 -106 54 -43 -41 18 -59 209 50
5714E0qk02jK1M90k02k54M0Q3j32PM3J53%J41k75K37l92K29L6Q0l86L82P6j06
$$ 50 42 -160 -161 -140 350 148 -106 -66 17 -115 -108 -65 88 88 229 -46 191 -201 28 64 144 -242 140 216 110
5739A10K7k55M8j3K38k97J78O4l43K23J24j39J18L1k48J06L17l86M5j43K28j07
$$ 110 137 -118 -70 -83 155 -142 36 100 -243 -20 104 -35 83 114 -134 -28 289 -97 -52 -195 33 -74
5761g4jn0l3J2J85r3J68k71K41l3k7J22j31L68l11j20O1J91l87J55O8k80k5J42
$$ -74 -75 -125 -158 -146 39 -54 114 -157 84 51 24 146 15 383 72 -48 13 204 -183 -28 40 -240 -265 -123
5785a23P4P8J12q3M19l88k35J19J94k7j72j13L8L13j02k26J47J22J6k10j16K95
$$ -123 -49 29 141 58 477 89 -146 -27 167 140 -32 -145 -107 206 104 -122 25 147 163 -47 -163 132
5807A32m06J38K69k91J14Rj68J58K0j9K65K84n45J79p4m8J46k09j61K87j47J51
$$ 132 -274 -136 133 -158 -44 -35 -203 -45 -25 -44 221 505 -40 139 65 17 163 -46 -207 80 -67 84
5829H4l54J61K50r5MP2j5n9j84L85Q5l68J41j69q9OL16j41K36l97k92M65m2j51
$$ 84 -270 -109 141 46 50 122 107 48 -136 249 334 -34 107 -62 -151 -145 171 30 266 -131 -423 42 0 -151
5853a51P2L7k5j13J75L6j64J70r1J63J26m8j02r3R4Jp0r1K98j12j07J39j31o9
$$ -151 -79 -42 -67 -180 -5 31 -133 37 -54 109 235 187 85 -8 86 87 17 -74 224 112 5 144 13 -56
5877e6mlj59J24K14k62o6N28l68O3j22Q1J51QJk14j37J02R6m4J03K75l18k91J53
$$ -56 -60 -63 -222 -98 116 -146 -212 316 -52 11 -111 -30 121 129 130 -84 -221 -119 -23 -67 36 311 -7 -298 -145
5902a45M5J04k8K8j61L14k19J05p8J54q1J03k08J18j09j0N2M8q9p4J10J6j45j5
$$ -145 -100 4 -24 4 -157 157 -62 43 -35 119 38 141 -67 51 -58 -68 -16 32 -57 -131 -21 -5 -150 -165
5926a65M89l11L8J9K1J01j2m62J29K08j36J11L9j86L14m32J88L3M0j98J58J22
$$ -165 324 13 51 70 91 192 180 -282 -153 55 -81 30 69 -117 197 -235 -47 -14 26 -172 -14 108
5948A08j74K54n0q7j2j56J96j45L59J4k79J94J01l44L43j46l35J88k32M96k33
$$ 108 -66 188 138 51 39 -117 79 -66 293 307 28 222 323 -21 322 176 -159 29 -203 293 60
5969F0k05J54J6O5l06Q5J76j70J02j45J77k32L62r6j62N5Q0j25K5L8q0K56J27
$$ 60 -145 9 25 90 -216 -131 45 -125 -23 -168 9 -223 139 43 -119 -64 16 -109 -84 -46 -126 130 257
5992B57k46j57n8K66p7J1P3j33K35j10N1k94N2J15k55M36j15k02Q9R5J08k45P0
$$ 257 11 -146 -204 62 -15 -4 69 -64 171 61 112 -182 -130 -15 -270 166 51 -151 -62 33 141 -104 -34
6015c4K52k77O7J28j7k58L53k29Q5j90J15J68l6j75K24j48MK9j97L93m87J59J01
$$ -34 218 -59 8 136 119 -139 214 -15 70 -120 -5 163 127 -48 176 28 32 61 -136 257 -230 -71 30
6038C0J9q8r8J96J2j7nN1j92K40o67M25p0K07kL09m06J4K66k78q6N1K09R3l15
$$ 30 49 -39 -137 59 71 54 49 100 -92 148 -519 -94 -164 43 41 350 -56 -42 224 -54 -140 -89 120 213 -102
6063a02J6J83k52P5r4L16k97l8L81m6j38Q3j46J14m8J54n4p0k70L74k42oJ38q8
$$ -102 -86 97 -155 -80 -174 142 -155 -193 188 142 4 87 -59 55 7 161 107 37 -233 141 -101 -107 31 -57
6087e7J48j35l4J54o7R3j3j42n9k5J78q8j66J86L7J32k39k56N26k96J68J04k37
$$ -57 91 -44 -78 76 9 102 89 -53 -112 -137 41 -47 -213 -27 10 142 -97 -353 173 -123 45 149 -88
6110h8j02J37J04Q7j9j55J34j28N2N0L0K72n41k8J94j88L21l60Q8J53J4k89J82
$$ -88 -190 -53 51 138 119 -36 98 -30 22 72 102 374 -167 -195 -1 -189 132 -228 -140 13 27 -262 -80
6133h0K14j65j56N8J41j53r1M6M72j31k43J08j13L47l5k16p1j03O14k37n16M12
$$ -80 134 -31 -187 -129 12 -141 -232 -186 286 155 -88 20 -93 254 219 3 -68 -171 443 206 -310 102
6155A02n36O46k39Q3j59j2J80j94J02K48k18M7m2J09q7j14J13l5L2J1j8J77k25
$$ 102 -434 212 -27 56 -103 -115 65 -129 -27 221 3 50 8 117 30 -84 29 -6 26 37 19 196 -29
6178b9r3L27l8j92k5J72l94J97J08k39M95j10P4j82J0Q9k18o3N3r7J68k0J98O5
$$ -29 -122 205 167 -25 -50 122 -272 -75 33 -206 289 179 253 71 81 170 -48 -111 -58 -155 13 -7 191 256
6202B56k50j97K56m0k10L46r5j51K76l60J28J94j16J09j94j61K98n2r7j14J73
$$ 256 6 -191 65 25 -185 161 66 -85 191 -169 -41 153 37 146 -48 -209 89 37 -60 -174 -1
6223aJ8k28J85l9O6j43J45rk23L02L18j77j48j50K14k7r5j25o1J46k10M04j68
$$ -1 17 -211 -26 -65 1 -142 3 -6 -229 73 391 214 66 -84 130 103 8 -117 -178 -32 -242 162 -6
$$ [...]
8191A30
##END NTUPLES=NMR FID
##END=
