##TITLE=1H_DE-177-TFAd6
 200.13Hz, DMSO+CCl4.
 8 sc
 24.8.2026
##JCAMPDX= 6.0         $$ Bruker NMR JCAMP-DX V2.0
##DATA TYPE= NMR FID
##DATA CLASS= NTUPLES
##ORIGIN= UXNMR, Bruker Analytische Messtechnik GmbH
##OWNER= pz
$$ XWIN-NMR		Version 3.5
$$ Mon Aug 24 14:05:21 2026 Russian Standard Time (UT+4h)  she@DPX200
##.OBSERVE FREQUENCY= 200.1313
##.OBSERVE NUCLEUS= ^1H
##.DELAY= (6, 6)
##.ACQUISITION MODE= SIMULTANEOUS
##.ACQUISITION SCHEME= undefined
##.AVERAGES= 8
##.DIGITISER RES= 18
##SPECTROMETER/DATA SYSTEM= spect
##.PULSE SEQUENCE= zg30
##.SOLVENT NAME= DMSO
##.SHIFT REFERENCE= (INTERNAL, DMSO, 0, 14.3821)
##AUDIT TRAIL= $$ (NUMBER, WHEN, WHO, WHERE, WHAT)
$$ ##TITLE= Audit trail, XWIN-NMR		Version 3.5
$$ ##JCAMPDX= 5.01
$$ ##ORIGIN= Bruker BioSpin GmbH
$$ ##OWNER= she
$$ F:/spectra/data/she/nmr/H-C/1/audita.txt
$$ ##AUDIT TRAIL=  $$ (NUMBER, WHEN, WHO, WHERE, WHAT)
(   1,<2026-08-24 14:04:04.01 +0400>,<she>,<DPX200>,
      <created by zg, POWCHK disabled, PULCHK disabled
       configuration hash MD5:
       00 E9 B6 7A A2 85 ED C7 34 08 36 98 17 FE 4E 26
       data hash MD5: 16K
       73 36 28 80 F3 2B 42 36 BE ED 7B 7A 63 1D 26 22>)
$$ ##END=
$$ 
$$ hash MD5
$$ 48 C9 9D 15 73 2A 4D 52 BD 35 66 48 40 94 1F 23
##$RELAX= 
##$RELAX= 
##$RELAX= 
##$RELAX= 
##$RELAX= 
##$RELAX= 
$$ Bruker specific parameters
$$ --------------------------
##$DU= <F:/spectra>
##$EXPNO= 1
##$NAME= <H-C>
##$PROCNO= 1
##$TYPE= <nmr>
##$USER= <she>
##$AMP= (0..31)
100 100 100 100 100 100 100 100 100 100 100 100 100 100 100 100 100 100 
100 100 100 100 100 100 100 100 100 100 100 100 100 100 
##$AQSEQ= 0
##$AQ_mod= 1
##$AUNM= <au_zg>
##$AUTOPOS= <>
##$BF1= 200.13
##$BF2= 200.13
##$BF3= 200.13
##$BF4= 200.13
##$BF5= 200.13
##$BF6= 200.13
##$BF7= 200.13
##$BF8= 200.13
##$BYTORDA= 1
##$CFDGTYP= 0
##$CFRGTYP= 5
##$CHEMSTR= <none>
##$CNST= (0..31)
1 1 145 1 1 1 1 1 1 1 1 1 1 1 1 1 1 1 1 1 1 1 1 1 1 1 1 1 1 1 1 1 
##$CPDPRG= <>
##$CPDPRG1= <>
##$CPDPRG2= <>
##$CPDPRG3= <>
##$CPDPRG4= <mlev>
##$CPDPRG5= <mlev>
##$CPDPRG6= <mlev>
##$CPDPRG7= <mlev>
##$CPDPRG8= <mlev>
##$CPDPRGB= <>
##$CPDPRGT= <>
##$D= (0..31)
0 0.7 0 0 0 0 0 0 0 0 0 0.03 0 0 0 0 0 0 0 0 0 0 0 0 0 0 0 0 0 0 0 0 
##$DATE= 1787565843
##$DBL= (0..7)
120 120 120 120 120 120 120 120 
##$DBP= (0..7)
150 150 150 150 150 150 150 150 
##$DBP07= 0
##$DBPNAM0= <>
##$DBPNAM1= <>
##$DBPNAM2= <>
##$DBPNAM3= <>
##$DBPNAM4= <>
##$DBPNAM5= <>
##$DBPNAM6= <>
##$DBPNAM7= <>
##$DBPOAL= (0..7)
0.5 0.5 0.5 0.5 0.5 0.5 0.5 0.5 
##$DBPOFFS= (0..7)
0 0 0 0 0 0 0 0 
##$DE= 6
##$DECBNUC= <off>
##$DECIM= 32
##$DECNUC= <off>
##$DECSTAT= 4
##$DIGMOD= 1
##$DIGTYP= 9
##$DL= (0..7)
0 120 120 120 120 120 120 120 
##$DP= (0..7)
150 150 150 150 150 150 150 150 
##$DP07= 0
##$DPNAME0= <>
##$DPNAME1= <>
##$DPNAME2= <>
##$DPNAME3= <>
##$DPNAME4= <>
##$DPNAME5= <>
##$DPNAME6= <>
##$DPNAME7= <>
##$DPOAL= (0..7)
0.5 0.5 0.5 0.5 0.5 0.5 0.5 0.5 
##$DPOFFS= (0..7)
0 0 0 0 0 0 0 0 
##$DQDMODE= 0
##$DR= 18
##$DS= 0
##$DSLIST= <SSSSSSSSSSSSSSS>
$$ [...]
##$SUBNAM0= <"">
##$SUBNAM1= <"">
##$SUBNAM2= <"">
##$SUBNAM3= <"">
##$SUBNAM4= <"">
##$SUBNAM5= <"">
##$SUBNAM6= <"">
##$SUBNAM7= <"">
##$SUBNAM8= <"">
##$SUBNAM9= <"">
##$SW= 18.0517328524113
##$SWIBOX= (0..15)
0 0 2 0 0 0 0 0 0 0 0 0 0 0 0 0 
##$SW_h= 3612.71676300578
##$TD= 16384
##$TD0= 1
##$TE= 0
##$TE2= 300
##$TE3= 300
##$TEG= 300
##$TL= (0..7)
0 120 120 120 120 120 120 120 
##$TP= (0..7)
150 150 150 150 150 150 150 150 
##$TP07= 0
##$TPNAME0= <>
##$TPNAME1= <>
##$TPNAME2= <>
##$TPNAME3= <>
##$TPNAME4= <>
##$TPNAME5= <>
##$TPNAME6= <>
##$TPNAME7= <>
##$TPOAL= (0..7)
0.5 0.5 0.5 0.5 0.5 0.5 0.5 0.5 
##$TPOFFS= (0..7)
0 0 0 0 0 0 0 0 
##$TUNHIN= 0
##$TUNHOUT= 0
##$TUNXOUT= 0
##$USERA1= <user>
##$USERA2= <user>
##$USERA3= <user>
##$USERA4= <user>
##$USERA5= <user>
##$V9= 5
##$VALIST= <valist>
##$VCLIST= <CCCCCCCCCCCCCCC>
##$VD= 0
##$VDLIST= <DDDDDDDDDDDDDDD>
##$VPLIST= <PPPPPPPPPPPPPPP>
##$VTLIST= <TTTTTTTTTTTTTTT>
##$WBST= 1024
##$WBSW= 4
##$XGAIN= (0..3)
0 0 0 0 
##$XL= 0
##$YL= 0
##$YMAX_a= 214580
##$YMIN_a= -159900
##$ZGOPTNS= <>
##$ZL1= 120
##$ZL2= 120
##$ZL3= 120
##$ZL4= 120
##$ABSF1= 10
##$ABSF2= 0
##$ABSG= 5
##$ABSL= 3
##$ALPHA= 0
##$AQORDER= 0
##$ASSFAC= 0
##$ASSFACI= 0
##$ASSFACX= 0
##$ASSWID= 0
##$AUNMP= <proc_1d>
##$AZFE= 0.1
##$AZFW= 0.1
##$BCFW= 1
##$BC_mod= 2
##$BYTORDP= 1
##$COROFFS= 0
##$CY= -3
##$DATMOD= 1
##$DC= 2
##$DFILT= <>
##$DTYPP= 0
##$F1P= 0
##$F2P= 0
##$FCOR= 0.5
##$FTSIZE= 0
##$FT_mod= 4
##$GAMMA= 1
##$GB= 0.15
##$INTBC= 1
##$INTSCL= 1
##$ISEN= 128
##$LB= 0.25
##$LEV0= 0
##$LPBIN= 0
##$MAXI= 10000
##$MC2= 0
##$MEAN= 0
##$ME_mod= 0
##$MI= 1.114404
##$NCOEF= 0
##$NC_proc= 0
##$NLEV= 6
##$NOISF1= 3.799351
##$NOISF2= 2.8
##$NSP= 1
##$NTH_PI= 0
##$NZP= 0
##$OFFSET= 14.38212
##$PC= 1
##$PHC0= -4580.424
##$PHC1= 8.192299
##$PH_mod= 1
##$PKNL= yes
##$PPARMOD= 0
##$PSCAL= 0
##$PSIGN= 0
##$REVERSE= no
##$SF= 200.129724274929
##$SI= 16384
##$SIGF1= 3
##$SIGF2= 2
##$SINO= 400
##$SIOLD= 16384
##$SREGLST= <1H.CDCl3>
##$SSB= 0
##$STSI= 0
##$STSR= 0
##$SW_p= 3205.1282051282
##$SYMM= 0
##$S_DEV= 0
##$TDeff= 0
##$TDoff= 0
##$TI= <>
##$TILT= no
##$TM1= 0
##$TM2= 0
##$TOPLEV= 0
##$USERP1= <user>
##$USERP2= <user>
##$USERP3= <user>
##$USERP4= <user>
##$USERP5= <user>
##$WDW= 1
##$XDIM= 8192
##$YMAX_p= 0
##$YMIN_p= 0
$$ End of Bruker specific parameters
$$ ---------------------------------
##NTUPLES= NMR FID
##VAR_NAME=  TIME,          FID/REAL,        FID/IMAG
##SYMBOL=    X,             R,               I
##VAR_TYPE=  INDEPENDENT,   DEPENDENT,       DEPENDENT
##VAR_FORM=  AFFN,          ASDF,            ASDF
##VAR_DIM=   8192,          8192,            8192
##UNITS=     SECONDS,       ARBITRARY UNITS, ARBITRARY UNITS
##FACTOR=    0.0002768,     1,               1
##FIRST=     0,             0,               0
##LAST=      2.2672688,     0,               0
##MIN=       0,             -159900,         0
##MAX=       2.2672688,     214580,          0
$$ Real data points
##PAGE= N=1
##DATA TABLE= (X++(R..R)), XYDATA
$$ [...]
$$ plain form
1576 -245 112 -63 -109 239 -126 -103 -130 41 27 -179 -89 137 199 -50 275 122 36 -71 -50 110 -112 -120 -31 62
1600 62 -61 166 90 204 -82 77 -93 -3 88 36 -34 -112 -13 -63 -89 -89 342 95 56 -112 52 66 -16 180 140
1625 140 152 8 102 75 49 239 209 88 32 -40 93 -191 149 196 -206 219 57 147 1 47 -58 -8 32 0
1649 0 54 -67 177 -24 -4 -159 -40 -30 -177 -146 -157 7 -154 -75 -90 -110 43 105 14 60 -4 64 -219 -118 26
1674 26 52 85 62 115 171 84 -137 91 -94 11 -272 -106 119 5 8 10 31 -253 -13 56 -85 42 -1 7 -113
1699 -113 -20 -105 -162 -23 -119 47 59 84 -94 -215 323 108 -99 -2 -45 24 -124 197 82 109 216 64 -21 21
1723 21 9 -44 -54 125 126 -21 -137 187 -11 75 115 -97 -8 -13 40 -101 134 -180 -41 106 -50 73 14 -10 19
1748 19 75 39 -38 -86 208 -60 -10 91 12 79 30 -48 5 -195 228 -131 138 32 67 -68 -117 211 -208 78
$$ packed form
1576b45L57j75m6L48l65K3k7J71j4k06R0K26O2k49L25j53q6j07K1J60k22qQ9R3
1600F2j23K27p6J14k86J59j70R0R1n2p0p8R9n0k6%M31k47l9j68J64J4q2J96m0
1625A40J2j44R4k7k6J90l0j21n6p2J33k84L40M7m02M25j62R0j46M6j05N0M0l2
1649@N4j21K44k01K0j55J19J0j47L1j1J64j61P9j5k0J53O2r1M6o4O8k83J01J44
1674B6K6L3k3N3N6q7k21K28j85J05k83J66K25j14LKK1k84K40O9j41J27m3Qj20
1699a13R3q5n7J39r6J66J2K5j78j21N38k15k07R7m3O9j48L21j15K7J07j52q5M2
1723B1j2n3j0J79Jj47j16L24j98Q6M0k12Q9nN3j41K35l14J39J47j56J23n9k4K9
1748A9N6l6p7m8K94k68N0J01p9O7m9p8N3k00M23l59K69j06L5j35m9L28m19K86
$$ plain form
1772 78 -14 -7 154 211 -195 -98 -71 53 -23 0 -20 65 35 -53 145 -91 39 242 -108 27 177 -83 -21 -80 43
1797 43 -55 -117 -72 12 -72 -10 195 30 105 -49 -109 20 -30 -21 -224 -37 -40 136 107 -51 57 -170 10 6 -168 -100
1823 -100 -28 13 91 55 105 159 -18 27 19 -160 44 -152 55 -71 18 20 99 77 44 91 -39 -257 -102 14 -60 39
1849 39 80 -184 -82 -133 -158 -14 99 -16 -260 125 -155 34 -244 39 -79 -110 36 -173 60 3 -119 -72
1871 -72 130 28 45 -8 235 -174 99 103 -127 68 -177 70 -323 60 -38 8 -41 184 11 -46 226 5 98
1894 98 -82 -138 -142 -92 -168 30 171 -37 -3 -29 -32 -112 -63 150 -71 10 -33 -24 -50 -65 81 -150 -51 -21 4 -113 -110 83
1922 83 50 -127 -42 -39 81 60 -62 170 -111 -23 -281 92 -14 73 -14 58 57 -4 -17 -168 -128 -25 -167 -92 -92 -52
1948 -52 -33 22 14 37 14 -65 37 63 27 -90 93 43 -17 -116 5 -88 -21 142 -94 -50 238 -139 -120 -36 -22 -77 -169
$$ packed form
1772G8r2PJ61N7m06R7K7J24p6K3k0Q5l0q8J98k36J30K03l50J35J50k60O2n9J23
1797D3r8o2M5Q4q4O2K05j65P5j54o0J29n0Rk03J87lJ76k9j58J08k27J80mj74O8
1823a00P2M1P8l6N0N4j77M5qj79K04j96K07j26Q9KP9k2l3M7j30k18J55J16p4R9
1849C9M1k64J02n1k5J44J13j15k44L85k80J89k78K83j18l1J46k09K33n7j22M7
1871g2K02j02J7n3K43m09K73Mk30J95k45K47l93L83r8M6m9K25j73n7K72k21R3
1894I8j80n6mN0p6J98J41k08L4k6lq0M9K13k21Q1m3Rk6j5J46k31R9L0K5j17LJ93
1922H3l3j77Q5LJ20k1j22K32k81Q8k58L73j06Q7q7P2jo1j3j51M0J03j42P5%M0
1948e2J9N5qK3k3p9J02K6l6j17J83n0o0r9J21r3O7J63k36M4K88l77J9Q4J4n5r2
$$ plain form
1975 -169 -220 -27 -180 219 84 -152 69 113 123 -38 65 1 97 -13 -127 -74 22 108 15 132 -19 218 110
1998 110 -14 80 181 137 67 68 -40 -1 195 -23 30 127 70 -49 115 2 33 -69 -58 -127 -7 -35 174 16
2022 16 42 -230 6 -17 47 19 76 -10 -80 -94 54 -131 -80 30 33 -66 18 155 -10 6 120 97 -30 -88 -136 12
2048 12 -40 -1 -104 -93 -6 -2 -92 -3 8 165 -145 145 -146 -13 -88 -104 -24 17 -156 -46 -83 -41 43 127 11 -85
2074 -85 298 -22 -72 117 -14 67 64 19 -187 137 7 -106 11 130 -4 5 -81 -4 75 21 185 -10 169 -56
2098 -56 -81 -130 179 -241 130 108 87 -148 188 -95 -30 -35 -66 -187 186 20 -143 169 12 164 72 76 39 74 75
2123 75 66 -34 -65 -68 109 63 1 -191 -88 -49 -16 6 191 58 36 85 -94 -146 -29 -71 228 -3 -167 -11 -198
2148 -198 177 172 -104 88 44 13 149 -47 -202 7 44 -150 11 297 -77 -59 23 -77 -58 -4 -17 76 89 -4
$$ packed form
1975a69n1J93j53L99j35k36K21M4J0j61J03o4R6j10j14N3R6Q6r3J17j51K37j08
1998A10j24R4J01m4p0Jj08L9J96k18N3R7n7j19J64j13L1j02J1o9J20k8K09j58
2022A6K6k72K36k3O4k8N7q6p0j4J48j85N1J10Lr9Q4J37j65J6J14k3j27n8m8J48
2048A2n2L9j03J1Q7Mr0Q9J1J57l10K90k91J33p5j6Q0M1j73J10l7M2Q4Q4j16r6
2074h5L83l20n0J89j31Q1lm5k06L24j30j13J17J19j34Rq6P7P9n4J64j95J79k25
2098e6k5m9L09m20L71k2k1k35L36k83O5nl1j21L73j66j63L12j57J52r2Ml7L5J
2123G5rj00l1lJ77m6o2j92J03L9L3K2J85j33k2M9j79n2J17m2K99k31j64J56j87
2148a98L75nk76J92m4l1J36j96j55K09L7j94J61K86l74J8Q2j00J9N4j3R3J3r3
$$ plain form
2172 -4 36 -172 -200 -96 -163 -97 -144 -80 164 77 -91 7 -59 -197 41 47 82 58 -200 -103 181 -194 35 -230 -99
2197 -99 70 -30 -22 10 99 2 286 56 25 -165 60 16 133 85 89 56 54 0 26 4 -32 -59 1 27 -18 -177 -242 102
2225 102 -33 3 6 -77 -103 -56 -36 -192 5 38 27 -152 -110 17 -129 8 -210 -100 -13 -32 -145 74 -119 85
2249 85 115 -60 26 258 -85 -64 71 -87 73 203 76 306 86 202 16 -78 -45 -51 -4 88 -41 -148 193
2272 193 -170 -61 -219 -157 72 78 97 144 -135 -80 60 22 124 -8 -146 109 48 130 247 -120 -117 10 91 73
2296 73 -184 -11 211 23 -49 7 29 73 88 -98 -46 -140 82 -230 36 -81 -184 57 -237 39 -46 -183 -85
2319 -85 54 12 -32 3 107 74 -30 30 -6 132 100 48 103 43 -120 -123 128 -57 -6 220 53 54 13 -134 48 129
2345 129 110 -188 -118 49 7 10 84 -29 -33 -85 -113 -66 -114 -212 54 69 174 98 28 231 62 -11 12 -52 113 211 -46
$$ packed form
2172dM0k08k8J04o7O6m7O4K44q7j68R8o6j38K38OL5k4k58R7K84l75K29k65J31
2197i9J69j00QL2Q9r7K84k30l1j90K25m4J17m8Ml3kn4K6k2l6k7O0K6m5j59o5L44
2225A02j35L6Lq3k6M7K0j56J97L3j1j79M2J27j46J37k18J10Q7j9j13K19j93K04
2249H5L0j75Q6K32l43K1J35j58J60J30j27K30k20J16j86r4L3oM7R2j29j07L41
2272A93l63J09j58O2K29OJ9M7k79N5J40l8J02j32j38K55o1Q2J17l67LJ27Q1j8
2296G3k57J73K22j88p2N6K2M4J5j86N2r4K22l12K66j17j03K41k94K76q5j37R8
2319h5J39m2m4L5J04l3j04O0l6J38l2n2N5o0j63lK51j85N1K26j67Jm1j47J82Q1
2345A29j9k98P0J67m2LP4j13mn2k8M7m8r8K66J5J05p6p0K03j69p3K3o4J65R8k57
$$ plain form
2372 -46 -302 111 206 83 329 176 -140 64 -128 -220 -25 -108 137 241 -55 19 -122 -52 5 -95 -87 -117 48
2395 48 -15 -8 1 -169 -4 37 76 -318 -94 126 -225 51 45 -199 -23 76 102 -29 -100 132 45 3 -98 9 323
2420 323 88 -195 46 47 120 -91 -44 -13 -222 69 -27 135 16 26 -29 7 -219 -113 98 -134 -130 -38 -143 -183
2444 -183 108 -29 46 -70 81 93 212 -7 111 120 -102 89 -200 -116 200 9 -21 -8 219 35 -48 144 -176
2467 -176 72 0 -142 -26 158 21 10 -103 14 -7 -43 -148 -261 -76 -143 -92 38 -99 49 -30 -205 -46
2489 -46 -52 24 -42 9 135 18 -42 38 111 -87 157 165 -151 41 -8 58 217 145 -106 -65 -44 116 171 -100 165 -147
2515 -147 -58 60 -79 4 -121 149 35 -20 -2 188 -53 -184 81 48 327 -93 23 64 -22 -162 -69 72 -82
2538 -82 225 56 -150 34 124 39 52 110 -44 118 60 -16 -201 75 -126 51 -94 60 238 -116 132 -19
$$ packed form
2372d6k56M13R5j23K46j53l16K04j92r2J95q3K45J04k96P4j41P0N7j00Ql0J65
2395D8o3PRj70J65M1L9l94K24K20l51K76ok44J76R9K6j31p1K32q7m2j01J07L14
2420C23k35k83K41JP3k11M7L1k09K91r6J62j19J0n5L6k26J06K11k32MR2j05m0
2444a83K91j37P5j16J51J2J19k19J18Rk22J91k89Q4L16j91l0J3K27j84q3J92l20
2467a76K48p2j42J16J84j37j1j13J17k1l6j05j13J85o7N1J30j37J48p9j75J59
2489d6oP6o6N1J26j17o0Q0P3j98K44Ql16J92m9O6J59p2k51M1K1J60N5k71K65l12
2515a47Q9J18j39Q3j25K70j14n5J8J90k41j31K65l3K79m20J16M1q6j40R3J41j54
2538h2L07j69k06J84R0q5J3N8j54J62n8p6j85K76k01J77j45J54J78l54K48j51
$$ plain form
2560 -19 -115 -83 6 133 45 -159 -68 26 -7 -55 32 35 37 -24 202 -58 -99 62 105 -123 -231 -213 17 121 42 70 -8
2587 -8 -106 9 85 121 -9 95 -4 -115 -3 114 -96 -145 -31 -85 -61 -108 -370 23 -15 10 9 -141 70 -43 151
2612 151 88 -164 4 -111 -56 -14 -103 64 -67 102 69 71 -59 -41 -187 180 -220 -15 -56 64 43 35 -108 88
2636 88 -30 25 59 127 124 -7 -47 239 91 -49 -98 -36 -27 -172 -43 17 41 -327 57 -117 13 -184 105 -21
2660 -21 39 -23 -13 100 151 23 -5 90 125 84 17 -140 -115 -172 -127 -190 257 204 6 118 -57 -37 -61 -164 73 165
2686 165 -47 145 177 -263 -103 194 138 32 79 -74 -46 -127 -103 -76 -187 -128 -237 27 218 -14 95 288 -9
2709 -9 -203 173 -24 -50 81 95 -45 222 87 -263 -30 -192 271 41 229 -114 56 -176 181 1 41 17
2731 17 11 43 34 -49 -34 2 -69 173 -208 129 35 92 -176 -49 -99 83 -24 26 -140 57 -199 36 253 -190 38
$$ packed form
2560a9r6L2Q9J27q8k04R1R4l3m8Q7LKo1K26k60m1J61M3k28j08J8K30J04p9K8p8
2587hr8J15P6L6j30J04r9j11J12J17k10m9J14n4K4m7k62L93l8K5jj50K11j13J94
2612A51o3k52J68j15N5M2q9J67j31J69l3Kj30J8j46L67m00K05m1J20k1qj43J96
2636H8j18N5L4O8lj31m0K86j48j40m9O2Rj45J29O0K4l68L84j74J30j97K89j26
2660b1O0o2J0J13N1j28k8R5L5m1o7j57K5n7M5o3M47n3j98J12j75K0k4j03K37R2
2686A65k12J92L2m40J60K97n6j06M7j53K8q1K4K7j11N9j09K64J91k32J09J93k97
2709ij94L76j97k6J31J4j40K67j35l50K33j62M63k30J88l43J70k32L57j80M0k4
2731A7oL2rq3J5L6p1K42l81L37r4N7k68J27n0J82j07N0j66J97k56K35K17m43K28
$$ plain form
2756 38 78 -50 11 169 149 45 51 -33 -107 -47 -196 -36 -61 -136 45 -69 158 -22 -114 29 -85 350 -8 -32
2780 -32 -29 54 -25 -1 -41 -1 -11 -110 -23 48 46 -89 -102 152 25 0 -85 115 63 -30 -51 -33 104 96 121 -88 -54 -1 54
2809 54 -34 107 -36 -29 67 -85 -27 -87 -43 -88 217 30 250 -289 102 -86 -38 55 56 148 75 272 -81 -21 -124
2834 -124 16 -37 -91 -8 -170 -237 -104 -96 -51 30 27 173 22 89 112 209 141 -6 -91 29 -87 -12 -8 66 -49 5 6
2861 6 56 -118 -84 -87 57 -171 41 98 -86 132 129 -26 65 -51 -94 -40 -256 184 -65 47 -51 -11 -128 -51 71
2886 71 -84 65 64 -79 140 5 -37 78 -77 -13 52 170 18 -76 -74 26 -28 -257 -52 204 45 -99 -97 -289
2910 -289 -85 130 80 33 -12 181 117 -99 55 14 50 118 -125 -29 29 1 -26 -86 -65 53 -46 22 200 34 141
2935 141 8 -68 135 -53 -73 162 -49 -108 -148 164 36 8 -163 -164 117 0 -85 -3 123 -64 81 56 -72
$$ packed form
2756C8M0j28O1J58k0j04Oq4p4O0j49J60k5p5J81j14K27j80r2J43j14M35l58k4
2780c2LQ3p9K4m0M0j0r9Q7P1kj35j3K54j27k5q5K00n2r3k1J8J37qK5k09L4N3N5
2809E4q8J41j43PR6j52N8o0M4m5L05j87K20n39L91j88M8R3JR2p3J97l53O0j03
2834a24J40n3n4Q3j62o7J33QM5Q1lJ46j51O7K3R7o8j47q5J20j16P5MP4j15N4J
2861FN0j74L4lJ44k28K12N7j84K18lj55R1j16m3N4k16M40k49J12r8M0j17P7J22
2886G1j55J49jj43K19j35m2J15j55O4O5J18j52r4KJ00n4k29K05K56j59j44Kj92
2910b89K04K15n0m7m5J93o4k16J54m1L6O8k43R6N8k8k7o0K1J18r9O8J78j66J07
2935A41j33p6K03j88k0K35k11n9m0L12j28k8j71jK81j17q5Q2J26j87J45k5j28
$$ plain form
2958 -72 14 -131 -48 55 14 2 1 -52 -173 -309 -62 -156 44 -124 168 15 -293 42 106 192 -30 -141 64 45
2982 45 -244 10 -50 41 80 -22 -58 42 -102 -34 -18 -22 138 139 -128 224 -61 -130 -94 -93 167 77 -85 -236 158
3007 158 166 126 142 -79 10 -214 -36 150 86 -96 27 63 -63 62 -34 -32 128 118 -145 14 61 121 114 90 -133
3032 -133 -20 -36 41 154 -76 -37 -5 9 22 263 -95 -193 98 67 6 -50 93 39 -88 64 -85 -98 133 -38
3056 -38 12 -282 131 177 -127 7 110 86 -86 13 45 116 221 253 7 44 -176 -277 61 8 83 54 -46 45
3080 45 55 -55 -59 127 -27 87 -50 28 -110 115 148 260 67 53 -11 -47 -14 -93 71 -206 -13 67 49 -193
3104 -193 -50 -120 -86 77 9 161 -174 29 -123 68 111 156 -115 -65 -200 41 308 70 32 218 122 -73 93
3127 93 -90 42 -49 31 -62 83 -12 -183 0 193 219 142 81 95 15 57 -32 10 -103 97 -76 -117 -38 -23 42 -36
$$ packed form
2958g2Q6j45Q3J03m1j2jn3j21j36K47r4K00j68K92j53l08L35O4Q6k22j11K05j9
2982D5k89K54o0R1L9j02l6J00j44O8J6mJ60Jk67L52k85o9L6JK60r0j62j51L94
3007A58Qm0J6k21Q9k24J78J86o4j82J23L6j26J25r6KJ60j0k63J59M7O0pk4k23
3032a33J13j6P7J13k30L9L2J4J3K41l58r8K91l1o1n6J43n4j27J52j49j3K31j71
3056c8N0k94M13M6l04J34J03k4j72R9L2P1J05L2k46L7k20j01L38n3P5k9j00R1
3080D5J0j10mJ86j54J14j37P8j38K25L3J12j93j4o4l6L3p9J64k77J93Q0j8k42
3104a93J43p0L4J63o8J52l35K03j52J91M3M5k71N0j35K41K67k38l8J86r6j95J66
3127I3j83J32r1Q0r3J45r5j71J83J93K6p7o1J4q0M2q9M2j13K00j73m1P9J5O5p8
$$ plain form
3153 -36 85 -29 -8 -249 -82 9 67 189 170 -76 7 -7 -22 0 43 208 80 77 -77 -293 -49 -213 79 45
3177 45 -14 302 11 151 55 -141 3 18 -114 -234 124 112 -184 -187 -370 106 -48 -65 22 -50 -11 0 -58 10 -103
3202 -103 -37 -133 -50 109 20 4 -40 -134 -37 -16 -90 92 61 -35 -89 -36 26 144 98 -74 -64 -37 -14 -130 210 34
3228 34 -50 -161 -146 61 200 -66 -76 -134 40 34 -51 124 -64 -25 50 102 -56 91 -3 277 144 -221 37 113
3252 113 106 40 117 -109 94 -27 149 151 13 -159 -77 256 -152 -139 -1 -9 188 157 -57 154 82 -23 -52 -2 -44
3277 -44 -13 -6 323 134 153 119 116 134 67 99 -197 -85 -214 -6 -133 -66 103 116 -157 -136 -181 -61 38 -105 -10 -5
3303 -5 155 149 130 28 16 105 -85 32 -84 78 -18 131 111 40 130 -14 42 21 -99 -103 -50 -86 -37 205 143 -85
3329 -85 21 152 -74 -90 74 123 -37 3 23 30 -94 50 22 34 31 -47 128 -224 56 -236 33 130 111 -64 104
$$ packed form
3153c6J21j14K1k41J67R1N8J22j9k46Q3j4j5K2M3J65j28lj54k16K44j64K92l4
3177D5n9L16k91J40r6j96J44J5j32j20L58j2k96lj83M76j54j7Q7p2L9J1n8O8j13
3202a03O6r6Q3J59q9j6m4r4R7K1p4J82l1r6n4N3O2J18m6j72J0K7K3j16L40j76
3228C4q4j11J5K07J39k66j0n8J74oq5J75j88L9P5N2j58J47r4K80j33l65K58P6
3252A13po6P7k26K03j21J76Kj38j72Q2L33m08J3J38qJ97l1k14K11p2j05k9N0m2
3277d4L1PL29j89J9l4lJ8o7L2k96J12j29K08j27O7J69J3k73K1m5J20R9j43R5N
3303eJ60oj9j02j2Q9j90J17j16J62r6J49k0p1R0j44N6k1j20mN3l6M9K42o2k28
3329h5J06J31k26j6J64M9j60M0K0Pj24J44k8J2lp8J75l52K80k92K69R7j9j75J68
$$ plain form
3354 104 76 -276 11 72 -24 -89 -79 16 -63 -61 -5 90 188 139 -194 87 43 -11 4 102 -71 50 18 156 -165 -14
3380 -14 15 -61 51 211 -153 -18 -42 -153 9 19 36 91 -68 10 241 -91 19 -34 149 -6 -162 -17 -24 45
3404 45 -219 59 -47 175 -216 -47 63 159 -137 169 116 -52 204 -124 -99 7 68 123 91 322 113 -217
3426 -217 -9 8 53 -91 -6 -75 113 64 -48 6 125 83 322 -15 110 35 233 -59 72 -275 -6 5 -45
3449 -45 150 -76 151 -60 305 144 -53 -87 -40 47 47 -10 58 61 108 -111 -115 -83 6 65 75 171 63 -29 -101 -40 -35 -27
3477 -27 -54 -114 -58 -44 72 234 -126 -100 -23 -99 -4 37 -160 191 -36 -31 84 63 -161 136 -43 -36 -222 47 56 -140
3503 -140 -37 10 124 -22 124 87 -30 -24 83 104 163 -93 -136 -54 68 188 -24 -167 84 4 -14 -112 13 -118
3527 -118 -47 -171 35 175 -105 3 86 37 68 -101 -44 -52 -112 58 -143 -76 5 90 -111 -96 -46 -163 3 28 95
$$ packed form
3354A04k8l52K87O1r6o5J0R5p9KN6R5R8m9l33K81m4n4J5R8j73J21l2J38l21J51
3380a4K9p6J12J60l64J35k4j11J62J0J7N5j59P8K31l32J10n3J83j55j56J45pO9
3404D5k64K78j06K22l91J69J10R6k96L06n3j68K56l28K5J06O1N5l2K31k09l30
3426b17K08J7M5j44Q5o9J88m9j12N4J19m2K39l37J25p5J98k92J31l47K69J1n0
3449d5J95k26K27k11L65j61j97l4M7Q7%n7O8LM7k19mL2Q9N9J0R6j08r2p2O1NQ
3477b7k7o0N6J4J16J62l60K6P7p6R5M1j97L51k27NJ15k1k24K97j79Pj86K69Rj96
3503a40J03M7J14j46J46l7j17OJ07K1N9k56m3Q2J22J20k12j43K51q0j8r8J25j31
3527a18P1j24K06J40k80J08Q3m9L1j69N7qo0J70k01O7Q1Q5k01J5N0j17J66K5O7
$$ plain form
3552 95 61 -85 -41 -155 164 168 158 33 64 112 5 -25 233 -38 -12 99 -49 36 45 2 -40 44 -134 -101 20 328
3578 328 189 183 36 36 123 -130 5 -90 -13 -14 -155 -72 -138 5 -89 12 -14 149 84 364 -217 71 -168 -38 37
3603 37 117 -38 -70 -63 -41 -277 54 -112 -33 78 16 -14 -126 -6 25 117 -93 -41 70 36 120 51 4 214 -75
3628 -75 109 13 -250 41 -89 -40 95 139 24 15 0 -72 -2 -238 -238 151 -82 -51 201 343 -112 -94 -35 -82 66
3653 66 129 76 30 316 -18 -143 175 -97 -35 253 40 35 14 -39 177 -231 32 234 -46 368 0 164 95
3676 95 -100 174 -64 41 47 -28 127 -40 -94 63 55 117 4 -221 -139 59 -112 121 -84 135 80 -142 133
3699 133 -49 -40 -44 222 44 248 -295 -103 -113 67 23 -57 59 20 30 131 288 -112 -157 -88 20 -121 -322 -105
3723 -105 -28 -197 -25 29 -109 229 44 -29 218 -62 -139 -31 -177 -42 18 6 -39 -30 -38 35 -60 -113 -65 -82 107
$$ packed form
3552I5l4j46M4j14L19Mj0j25L1M8j07l0K58k71K6J11j48Q5Rm3m2Q4j78L3J21L08
3578C28j39oj47%Q7k53J35r5P7jj41Q3o6J43r4J01k6J63o5K80n81K88k39J30P5
3603C7Q0j55l2PK2k36L31j66P9J11o2l0j12J20L1R2k10N2J11l4Q4o9m7K10k89
3628g5J84r6k63K91j30M9J35M4j15rj5p2P0k36%L89k33L1K52J42m55J8N9m7J48
3653F6O3n3m6K86l34j25L18k72O2K88k13nk1n3K16m08K63K02k80M14l68J64o9
3676I5j95K74k38J05Op5J55j67n4J57qO2j13k25Q2J98j71K33k05K19n5k22K75
3699A33j82RmK66j78K04n43J92j0J80m4q0J16l9J0J01J57m00m5O9J08j41k01K17
3723a05P7j69J72N4j38L38j85p3K47k80p7J08j46J35O0j2m5RqP3r5n3M8j7J89
$$ plain form
3748 107 104 -21 -23 -147 -117 -128 169 -160 -72 -28 8 -3 141 81 -66 -109 -4 3 -89 -129 30 -182 -18 99 -179
3773 -179 189 -20 -5 166 23 -138 53 -133 -67 61 -213 64 151 -12 -126 -79 -23 66 47 220 -1 -159
3795 -159 55 10 18 201 45 -10 245 158 -52 37 55 200 128 100 75 92 -187 81 0 -93 57 -160 -137 55 111
3820 111 -33 53 -90 -179 -3 103 166 30 -41 -141 220 71 -14 146 -173 28 -45 -104 -64 71 -125 -39 10
3843 10 106 394 -99 -30 -36 95 10 55 -85 63 69 -58 -7 -80 142 -87 -18 11 -3 -54 -18 -127 20 -91 33
3868 33 -51 -18 7 -74 49 -51 -46 82 32 -64 23 145 30 -49 -100 126 20 -270 -7 -109 -68 -213 -39 -31 66
3893 66 103 -49 65 -108 44 -73 -155 132 -155 42 247 -19 3 -4 86 -80 -17 -114 -78 195 239 36 71 108
3917 108 31 145 -149 -38 -33 107 -439 -91 -126 202 33 -147 253 104 -126 -76 -227 -1 -64 172 -16 3
$$ packed form
3748A07lj25kj24L0j1K97l29Q8M4L6j1J44o0j47m3J05Pr2m0J59k12J64J17k78
3773a79L68k09J5J71j43j61J91j86O6J28k74K77Q7j63j14M7N6Q9j9J73k21j58
3795a59K14m5QJ83j56n5K55q7k10Q9J8J45p2k8k5J7k79K68q1r3J50k17K3J92N6
3820A11j44Q6j43q9J76J06O3j36p1j00L61j49q5J60l19K01p3n9M0J35j96Q6M9
3843A0R6K88m93O9oJ31q5M5j40J48Oj27N1p3K22k29O9K9j4n1L6j09J47j11J24
3868C3q4L3K5q1J23j00NJ28n0r6Q7J22j15p9n1K26j06k90K63j02M1j45J74QR7
3893F6L7j52J14j73J52j17q2K87k87J97K05k66K2pR0j66O3r7L6K73M4k03L5L7
3917A08p7J14k94J11NJ40n46L48l5L28j69j80M00j49k30N0j51K26o3K36j88J9
$$ plain form
3939 3 10 -98 -34 -43 177 142 -90 22 23 -39 -68 -79 35 200 135 24 63 -86 -86 98 183 -30 97 173 58 72 44
3966 44 64 -5 -263 -162 -39 -144 41 -223 6 -103 -122 137 93 -39 55 -86 68 -96 -149 66 39 -29 -190
3989 -190 -63 -23 -103 -85 50 -31 167 -40 203 -94 22 -143 -168 15 181 116 11 84 -32 -208 87 -17
4011 -17 -136 -31 125 -112 -60 -123 -138 -75 -113 122 -45 55 27 186 6 -95 93 85 221 110 -153 221 68
4034 68 67 6 -29 -33 125 94 -61 115 70 -120 -86 196 12 -57 -58 -14 -253 113 -68 -151 -27 -40 -79 30 -94 75
4060 75 174 -226 179 -87 -131 -8 5 17 158 50 4 -189 -54 83 19 -188 -119 3 150 131 98 88 138 -98
4084 -98 6 229 -100 135 182 211 -49 55 -89 -15 -13 -132 -16 177 72 -103 -3 92 -32 -44 87 -160 42
4107 42 60 -63 -71 -41 -72 69 -13 -229 67 54 52 -43 120 -7 24 28 -12 -109 -23 77 28 55 107 -85 -181 -242 -6
$$ packed form
3939CPj08O4rK20l5k32J12Jo2k9j1J14J65o5j11L9j49%J84Q5k13J27P6j15J4k8
3966D4K0o9k58J01J23j05J85k64K29j09j9K59m4j32R4j41J54j64n3K15k7o8j61
3989a90J27M0q0J8J35q1J98k07K43k97J16j65k5J83J66o5j05P3j16j76K95j04
4011a7j19J05J56k37N2o3j5O3l8K35j67J00k8J59j80j01J88qJ36j11k63L74j53
4034F8jo1l5mJ58l1j55J76m5j90L4K82j84o9jM4k39L66j81q3J24j3l9J09j24J69
4060G5R9m00M05k66m4J23J3J2J41j08m6j93J35J37o4k07O9J22J47j9l3j0N0k36
4084i8J04K23l29K35M7K9k60J04j44P4Kj19J16J93j05j75J00R5j24j2J31k47K02
4107D2J8j23qL0l1J41q2k16K96j3kr5J63j27L1Mm0r7Q6J00m9K7N2j92r6o1K36
$$ plain form
4134 -6 237 13 126 -118 63 -178 148 -126 -176 -30 -91 -6 173 -40 9 -27 93 104 -94 54 -148 -31 -400
4157 -400 42 -132 112 -285 127 18 101 42 -5 54 -108 -115 191 409 89 30 -80 187 -220 -13 3 6 254
4180 254 67 -118 -100 -136 -70 -235 113 -42 148 -153 29 -78 -123 100 27 150 177 -91 -5 -39 -112 74 -107
4203 -107 68 -122 -108 49 149 -211 59 -55 62 259 36 89 -37 -144 -102 42 -101 41 -69 69 25
4224 25 98 100 -52 -214 82 -12 142 81 203 77 -266 -5 4 -128 74 -14 -34 -1 -47 19 -108 3 -211 138
4248 138 6 111 -130 10 62 -100 -4 67 -8 36 -26 141 61 210 -131 -170 66 -218 -108 -136 124 -11 8
4271 8 -93 60 60 -160 217 -103 -209 -116 170 -182 16 -21 -105 114 20 -25 -58 192 23 -47 108 -42 137 124
4295 124 -170 -28 192 -234 -142 -102 -206 145 67 -122 57 -93 -19 -82 57 -70 -33 -159 -87 -193 8 -65 -92
$$ packed form
4134fK43k24J13k44J81k41L26k74n0J46o1Q5J79k13M9l6J20J1j98J48k02J17l69
4157d00M42j74K44l97M12j09Q3n9m7N9j62pL06K18l20n9j10K67m07K07J6LK48
4180B54j87j85J8l6O6j65L48j55J90l01J82j07m5K23p3J23K7k68Q6l4p3J86j81
4203a07J75j90J4J57J00l60K70j14J17J97k23N3j26j07M2J44j43J42j10J38m4
4224B5P3Kj52j62K96r4J54o1J22j26l43K61Rj32K02q8k0L3m6O6j27J11k14L49
4248A38j32J05k41J40N2j62R6P1p5M4o2J67q0J49l41l9K36k84J10k8K60j35J9
4271Hj01J53%k20L77l20j06R3K86l52J98l7q4K19r4m5l3K50j69p0J55j50J79j3
4295A24k94J42K20m26R2M0j04L51p8j89J79j50P4o3J39j27L7j26P2j06K01p3k7
$$ plain form
4318 -92 172 158 164 158 -107 115 -2 115 -139 -26 83 -136 -85 29 20 0 63 -72 13 -29 -17 -75 219 -65 71
4343 71 -234 172 87 -76 -138 -23 31 -85 54 124 -137 79 -7 146 90 171 -90 -3 79 -77 -97 -127 47 -51
4367 -51 -29 64 -134 95 284 108 -292 52 -102 65 -5 92 74 -51 56 32 -68 -84 214 185 -112 196 25
4390 25 -56 -183 -107 1 139 52 -35 -139 59 86 93 -25 -25 28 -46 -53 26 -336 27 -107 -12 27 -104 43 -71 25
4416 25 -53 76 48 147 -117 1 10 227 -10 21 -73 -147 34 101 156 -30 -65 -148 -26 26 30 -75 -81 -150 -4 -13 13
4443 13 28 -23 142 87 254 54 -3 -101 0 -51 -78 -97 140 -6 152 106 25 83 -2 -31 0 89 288 177 148 -65
4469 -65 12 -75 -36 29 -72 32 -8 41 81 -44 109 37 121 -32 54 -252 41 -57 -100 -20 -43 -160 -89 84 135 -13
4495 -13 -157 3 35 81 31 69 55 -111 -70 19 -167 47 -247 -82 -139 154 -42 73 -37 -50 -160 -88 -94 99
$$ packed form
4318i2K64j4Ook65K22j17J17k54J13J09k19N1J14rk0O3j35Q5m2J2n8K94k84J36
4343G1l05M06q5j63o2J15N4j16J39P0k61K16q6J53n6Q1k61Q7Q2j56k0l0J74r8
4367e1K2R3j98K29J89j76m00L44j54J67p0R7j8j25J07k4j00j6K98k9k97L08j71
4390B5q1j27P6J08J38q7q7j04J98K7Pj18%N3p4pP9l62L63j34R5L9j31J47j14R6
4416B5p8J29k8R9k64J18RK17k37L1r4p4J81O7N5j86l5q3J22N2Mj05oo9J46rK6
4443A3J5n1J65n5J67k00n7r8J01n1k7j9K37j46J58m6q1N8q5k9L1Q9J99j11k9k13
4469f5P7q7L9O5j01J04m0M9M0j25J53p2Q4j53Q6l06K93r8m3Q0k3j17P1J73N1j48
4495a3j44J60L2M6n0L8j4j66M1Q9j86K14k94J65n7K93j96J15j10j3j10P2oJ93
$$ plain form
4519 99 -120 -104 0 38 -115 -75 5 -102 59 1 185 94 17 -88 -221 4 186 91 -203 -99 -76 -117 26 20
4543 20 59 23 163 -142 -47 -179 -11 39 58 -218 -152 218 -126 25 -9 12 -177 -34 129 144 93 -24 106 112
4567 112 159 201 -43 -86 68 208 -25 198 13 -44 -14 -2 280 41 158 146 -115 61 -22 -2 14 -77 36 -46
4591 -46 57 -9 176 117 -15 -59 -159 -61 -229 -44 -26 -88 135 23 -57 9 -209 33 -94 -45 -11 -101 -108 -20 44
4616 44 5 -31 -42 -11 -185 -78 96 -83 49 -256 153 -52 78 -194 -154 26 94 184 -84 -140 -334 59 244
4639 244 155 28 -56 -130 71 -153 139 44 -113 189 80 -126 -132 -67 -176 -205 -208 3 56 -26 -42 90 -19 235
4663 235 329 -116 78 -70 -77 158 20 2 -14 3 -88 0 69 -36 67 30 151 102 36 -47 -126 87 -108 -213 -122
4688 -122 -78 5 282 227 1 201 59 41 9 150 -228 70 -205 -23 -188 -234 -144 115 10 92 -27 147 -120
$$ packed form
4519I9k19J6J04L8j53M0Q0j07J61n8J84r1p7j05j33K25J82r5k94J04K3m1J43o
4543B0L9l6J40l05R5j32J68N0J9k76O6L70l44J51l4K1j89J43J63J5n1j17J30O
4567A12M7M2k44m3J54J40k33K23j85n7L0J2K82k39J17j2k61J76q3K0J6r1J13q2
4591d6J03o6J85n9j32m4j00R8j68J85J8o2K23j12q0O6k18K42j27M9L4r0pQ8O4
4616D4l9l6j1L1j74J07J74j79J32l05M09k05J30k72M0J80O8R0k68n6j94L93J85
4639B44q9j27q4p4K01k24K92r5j57L02j09k06oO5j09k9lK11N3q2j6J32j09K54
4663B35R4m45J94j48pK35j38j8j6J7r1Q8O9j05J03l7J21m9o6q3p9K13j95j05R1
4688a22M4Q3K77n5k26K00j42j8l2J41l78K98k75J82j65m6R0K59j05Q2j19J74k67
$$ plain form
4711 -120 -145 -67 68 121 171 -17 71 -127 279 42 14 99 -94 47 40 -39 -209 0 40 222 37 116 -35 88
4735 88 49 0 -16 -117 -17 -2 -86 -183 228 -80 82 38 55 -66 117 59 148 194 227 -4 -176 -137 -86 -39 -31 -22 71
4762 71 -131 -57 -75 114 -114 -159 -31 -97 146 -25 -56 104 -203 -76 -45 -90 -18 -150 -31 -130 -62 11 37 -30 -176
4787 -176 108 144 -71 248 190 -3 -6 25 -10 41 -24 77 -124 -170 23 45 -182 -46 10 108 -124 24 -70 -28 92
4812 92 -253 61 -26 -178 180 53 3 27 27 -15 -41 -71 22 123 -136 -47 -100 36 101 151 -166 140 -153 -66 -183
4837 -183 -97 165 -149 23 33 -43 -181 115 79 -18 -154 -39 -146 129 -141 168 -129 82 -41 -61 -18 67 55
4860 55 -118 293 109 61 101 -103 -131 -8 -121 -128 23 34 -81 39 25 0 160 23 -103 64 -74 93 -47
4883 -47 -59 67 -48 179 -70 -3 11 -25 48 40 -170 64 -29 -63 -32 -234 101 -170 129 169 14 -100 28 128
$$ packed form
4711a20k5P8J35N3N0j88Q8j98M06k37k8Q5j93J41pp9j70K09M0J82j85P9j51J23
4735H8l9m9j6j01J00J5q4r7M11l08J62m4J7j21J83n8Q9M6L3k31j72L9N1M7QRR3
4762G1k02P4j8J89k28m5J28o6K43j71l1J60l07J27L1m5P2j32J19r9O8P3K6o7j46
4787a76K84L6k15L19n8j93lL1l5N1o5J01k01m6J93K2k27J36N6R8k32J48r4M2J20
4812I2l45L14q7j52L58j27n0K4%m2k6l0R3J01k59Q9n3J36O5N0l17L06k93Q7j17
4837a83Q6K62l14J72J0p6j38K96l6r7j36J15j07K75k70L09k97K11j23k0M3Q5j2
4860E5j73M11j84m8M0k04k8J23j13pJ51J1j15J20j4k5J60j37j26J67j38J67j40
4883d7j2J26j15K27k49O7J4l6P3qk10K34r3l4L1k02L35k71K99M0j55j14J28J00
$$ plain form
4907 128 205 165 -19 228 105 -98 -175 205 -12 -201 -116 -51 211 -206 -73 -65 -43 196 -1 -47 63 93 -44
4930 -44 -55 239 47 44 178 147 -123 139 15 -125 -86 -56 82 39 -40 289 -32 -30 55 27 -62 64 14 -1 189
4955 189 53 249 -162 -52 118 11 59 38 124 -63 31 -129 -85 71 -131 -97 -94 -110 17 -59 -23 33 -3 90 63
4980 63 -30 103 178 132 60 -52 82 -58 129 82 92 6 75 -29 -26 125 -10 360 35 -24 186 31 -9 -77 16
5005 16 -29 -143 136 71 -40 -19 -9 45 -86 -9 106 23 -59 -115 -83 -102 13 101 165 -47 84 -107 -164 124 -23
5030 -23 -85 92 253 289 79 -77 178 -36 28 -34 30 1 -92 -144 -51 142 -100 -138 -61 19 233 -80 -198 104
5054 104 155 -132 46 -133 51 -143 -275 33 -34 -111 44 -117 136 270 -149 56 57 81 16 -96 71 95 -45
5077 -45 143 103 42 52 -3 -64 -35 201 1 69 -24 -199 -39 103 -25 -129 110 28 92 55 -191 -143 61 -148
$$ packed form
4907A28P7m0j84K47j23k03p7L80k17j89Q5O5K62m17J33QK2K39j97m6J10L0j37
4930d4j1K94j92lJ34l1k70K62j24j40L9L0J38m3p9L29l21KQ5k8q9J26n0j5J90
4955A89j36J96m11J10J70j07M8k1Q6j87R4j60M4J56k02L4Lj6J27p6L6N6l6R3k7
4980F3r3J33P5m6p2j12J34j40J87m7J0q6O9j04LJ51j35L70l25n9K10j55m0o8R3
5005A6m5j14K79o5j11K1J0N4j31P7J15q3q2n6L2j9J15Q8O4k12J31j91n7K88j47
5030b3o2J77J61L6k10j56K55k14O4o2O4k9r3n2R3J93k42l8P7Q0K14l13j18L02
5054A04N1k87J78j79J84j94j32L08o7p7J55j61K53J34m19K05JK4o5j12J67K4j40
5077d5J88m0o1J0n5o1K9K36k00O8r3j75J60J42j28j04K39q2O4l7k46M8K04k09
$$ plain form
5101 -148 90 -92 -95 31 -92 99 -45 -75 -17 -114 -96 -197 75 52 0 -167 -69 -102 27 -42 58 59 18 17 -95
5126 -95 -8 -94 122 -42 36 64 4 -45 106 -11 152 -14 152 -20 -243 -165 -194 104 -168 -33 173 -59 50
5149 50 -27 -28 167 -120 -73 -243 -70 -130 20 -65 72 -108 -14 115 65 64 -4 30 -26 55 88 58 -37 112 -6 -117
5175 -117 -37 -107 -4 -113 12 83 88 -130 20 -5 15 84 12 22 191 3 46 61 -78 -104 -81 153 -53 26 -136
5200 -136 62 4 -113 15 110 35 46 31 73 -110 -192 49 54 3 -40 -25 -117 118 130 -21 -116 0 -109 -82 -61 114
5226 114 74 19 -16 -14 197 188 -174 35 11 -66 13 40 59 48 -74 108 -150 36 197 90 122 94 -18 40 30 -166
5252 -166 78 58 -37 115 -172 85 69 39 142 30 -238 -25 -16 49 68 -32 -233 -41 -142 -136 -87 -110 -76 -133 268
5277 268 -131 44 -91 11 -156 -107 180 72 -52 -284 55 80 201 11 162 19 137 109 -143 -12 -15 62
$$ packed form
5101a48K38j82lJ26j23J91j44l0N8r7J8j01K72k3n2j67R8l3J29o9J00Jm1jj12
5126i5Q7q6K16j64P8K8o0m9J51j17J63j66J66j72k23P8k9K98k72J35K06k32J09
5149E0p7jJ95k87M7j70J73o0J50q5J37j80R4J29n0jo8L4n6Q1L3l0r5J49j18j11
5175a17Q0p0J03j09J25P1Nk18J50k5K0O9p2J0J69j88M3J5j39k6K3K34k06P9j62
5200a36J98n8j17J28R5p5J1j5M2j83q2K41Nn1m3J5r2K35J2j51r5J16j09K7K1J75
5226A14m0n5l5KK11rl62K09k4p7P9K7J9j1j22J82k58J86J61j07L2k8j12N8j0j96
5252a66K44k0r5J52k87K57j6l0J03j12k68K13RO5J9j00k01J92j01OM9k3L4n7M01
5277B68l99J75j35J02j67M9K87j08j24k32L39K5J21j90J51j43J18k8k52J31lP7
$$ plain form
5299 62 93 -88 6 155 -2 69 152 -33 -66 18 -23 -45 -149 -155 -17 -97 -73 -29 -72 23 -57 186 94 -26 -106 17
5325 17 122 -30 136 79 19 -109 80 40 -68 -137 261 -116 -110 -30 -165 -152 -24 -90 -147 -179 62 -128 -34 36 -29
5350 -29 -11 52 129 92 81 -70 128 -134 185 -27 -94 143 -279 48 13 50 241 9 147 75 -103 -193 -87 10
5374 10 51 113 5 -51 204 -10 88 181 59 141 -38 93 14 63 -83 -88 106 -48 300 166 7 3 -181 -190 -76
5399 -76 -180 -143 -224 87 -51 41 140 -98 -2 2 125 14 74 138 3 48 124 49 -96 -23 121 113 -4 98 20 176
5425 176 74 -8 -111 -46 36 -1 -268 -2 -42 163 56 -46 73 -12 110 124 16 -148 114 -69 29 121 -169
5448 -169 101 -128 -216 -8 -4 -160 -127 -187 43 -155 11 137 2 -64 161 -65 -100 2 22 -95 -29 223 -167
5471 -167 10 4 -122 -26 -88 -65 -192 -69 81 -47 54 87 -44 82 19 3 138 -27 -54 -197 171 7 157
$$ packed form
5299F2L1j81R4J49j57P1Q3j85l3Q4m1k2j04oJ38q0K4M4m3R5q0K43r2j20q0J23
5325A7J05j52J66n7o0j28J89m0j08o9L98l77OQ0j35J3J28o6n7l2K41j90R4P0o5
5350b9J8O3P7l7j1j51J98k62L19k12o7K37m22L27l5L7J91k32J38p2j78r0J06R7
5374A0M1O2j08n6K55k14R8R3j22Q2j79J31p9M9j46nJ94j54L48j34j59mj84rJ14
5399g6j04L7q1L11j38R2R9k38R6MJ23j11O0O4j35M5P6p5j45P3J44qj17J02p8J56
5425A76j02q2j03O5Q2l7k67K66m0K05j07j02J19q5J22J4j08j64K62j83R8R2k90
5448a69K70k29q8K08Mj56L3o0K30j98J66J26j35o6K25k26l5J02K0j17O6K52l90
5471a67J77oj26R6o2K3j27J23J50j28J01L3j31J26o3j6J35j65k7j43L68j64J50
$$ plain form
5494 157 -44 -91 136 99 -21 -32 -207 28 -101 23 -131 100 92 -63 65 35 -31 -77 -127 -5 -220 -50 93
5517 93 -221 70 32 91 -25 2 131 -133 -210 -34 -132 -72 -122 -10 14 -25 177 33 -4 14 78 -98 -244 -141
5541 -141 60 169 -29 -153 17 206 11 -20 -16 97 160 -128 46 53 201 138 2 -210 -46 -116 99 -101 13
5564 13 97 -228 109 119 106 -154 -41 4 74 -41 84 -87 -55 166 110 -76 -29 -116 -92 -83 -74 -21 -130 64 59 119
5590 119 55 -91 288 21 -19 209 -10 18 136 -64 -20 -139 34 -25 101 77 -77 -28 -4 -114 83 143 -25
5613 -25 217 98 172 -90 12 237 -16 -47 125 -4 40 90 66 -14 -133 -101 106 -56 -29 -9 130 23 -86
5636 -86 -154 0 -211 111 -57 43 45 -165 12 -120 27 -36 17 101 102 66 -13 304 186 87 15 -122 -35 -89 -45
5661 -45 81 -37 -43 171 74 241 188 187 57 164 -34 -70 224 52 381 -63 -73 207 60 23 -62 -148 32 -157
$$ packed form
5494A57k01m7K27l7j20j1j75K35j29J24j54K31qj55J28l0o6m6n0J22k15J70J43
5517I3l14K91l8N9j16K7J29k64p7J76r8O0n0J12K4l9K02j44l7J8O4j76j46J03
5541a41K01J09j98j24J70J89j95l1MJ13O3k88J74PJ48o3j36k12J64p0K15k00J14
5564A3Q4l25L37J0j3k60J13M5P0j15J25j71L2K21n6j86M7q7K4RRN3j09J94nO0
5590A19o4j46L79k67m0K28k19K8J18k00M4j19J73n9J26k4j54M9K4j10J97O0j68
5613b5K42j19P4k62J02K25k53l1J72j29M4N0k4q0j19L2K07j62K7K0J39j07j09
5636h6o8J54k11L22j68J00Kk10J77j32J47o3N3Q4Jl6p9L17j18r9p2j37Q7n4M4
5661d5J26j18oK14r7J67n3jj30J07j98l6K94j72L29m44j0K80j47l7q5q6J80j89
$$ plain form
5685 -157 -44 -4 -19 52 125 -20 -363 18 -100 215 -92 159 95 -48 54 163 135 -40 68 38 -87 347
5707 347 -9 -153 -79 140 61 -176 -29 37 -110 99 55 52 -91 2 71 116 217 -75 271 -60 55 39 -40 91
5731 91 -291 145 -146 -56 5 33 -92 -22 47 -123 35 43 -160 -27 -123 86 149 43 -125 -63 39 22 76 19 -52
5756 -52 50 -253 340 62 23 -17 45 58 144 78 142 100 22 176 122 -104 39 219 -137 -101 -128 -21 1 -36 78
5781 78 -15 59 29 -98 73 156 1 242 50 155 177 -186 81 -114 13 -105 56 -24 192 -158 -133 -43 -62
5804 -62 50 14 52 -170 -68 136 252 34 -253 195 -119 40 -161 -103 -143 52 -27 28 -154 -176 -147 -115 224
5827 224 107 27 -34 -210 142 210 131 -46 -253 -60 44 97 142 -125 -30 262 97 -97 36 -60 -153 50 -180
5850 -180 -134 -3 41 -83 43 46 60 -65 -255 -63 93 -33 -124 81 78 4 -90 97 80 -18 -47 107 29 -143 85
$$ packed form
5685a57J13M0j5P1P3j45l43L81j18L15l07K51o4j43J02J09k8j75J08l0j25M34
5707C47l56j44P4K19p9k37J47O6j47K09m4lj43R3O9M5J01k92L46l31J15j6p9J31
5731I1l82M36k91R0O1K8j25P0O9j70J58Qk03J33r6K09O3j06j68O2J02j7N4n7p1
5756e2J02l03N93k78l9m0O2J3Q6o6O4m2p8J54n4k26J43J80l56L6k7J07K2l7J14
5781G8r3P4l0j27J71Q3j55K41j92J05K2l63K67j95J27j18J61q0K16l50K5R0j9
5804f2J12l6L8k22J02K04J16k18k87M48l14J59k01N8m0J95p9N5j82k2K9L2L39
5827B24j17q0o1j76L52O8p9j77k07J93J04N3M5k67R5K92j65j94J33r6r3K03k30
5850a80M6J31M4j24J26LJ4j25j90J92J56j26r1K05lp4r4J87j7r8k9J54p8j72K28
$$ plain form
5875 85 121 209 -119 44 74 95 240 -48 86 133 -100 -96 64 -6 46 -131 -12 70 -23 39 -153 145 -29 -89 -137
5900 -137 -51 197 8 78 75 134 130 133 75 -19 -51 142 -24 332 19 -55 -25 -71 118 10 -154 -199 8 11 173 48
5926 48 77 -13 289 24 -139 41 -47 -53 42 40 70 0 -84 28 44 148 -1 41 -23 453 -68 33 42 4 52 -217
5952 -217 -84 -20 -107 -68 230 -148 -45 -159 37 -46 -18 12 -64 279 -52 17 -40 -14 -103 -159 162 -118 -36 -10 106
5977 106 -155 -20 -11 -179 -23 11 116 -82 18 -4 11 266 -85 -50 -48 265 107 -104 140 -133 -11 36 9
6000 9 64 -38 48 116 -52 94 109 -72 -82 -3 -145 113 21 289 17 7 -209 87 -55 -148 35 -168 -246 -89
6024 -89 -59 246 -1 -42 47 -84 174 -98 20 38 91 -157 -75 -87 -129 -5 108 -238 -21 -126 -36 -27 77 11
6048 11 16 94 66 -82 -129 -152 -15 75 153 -15 -266 -80 80 45 -10 -191 -196 -166 -44 -79 -193 254 -219 26 -10
$$ packed form
5875H5L6Q8l28J63L0K1J45k88J34M7k33MJ60p0N2j77J19Q2r3O2j92K98j74o0m8
5900a37Q6K48j89P0lN9mLn8r4l2J93j66L56l13p4L0m6J89j08j64m5K07LJ62j25
5926D8K9r0L02k65j63J80q8oR5kL0p0q4J12J6J04j49M2o4M76n21J01Rl8M8k69
5952b17J33O4q7L9K98l78J03j14J96q3K8L0p6L43l31O9n7K6q9n6L21k80Q2K6J16
5977A06k61J35Rj68J56L4J05j98J00k2J5K55l51L5KL13j58k11K44k73J22M7k7
6000IN5j02Q6O8j68J46J5j81j0P9j42K58r2K68k72j0k16K96j42r3J83k03p8J57
6024h9L0L05k47m1Q9j31K58k72J18J8N3k48Q2j2m2J24J13l46K17j05R0RJ04o6
6048A1NP8k8j48m7k3J37R0P8j68k51J86J60l5n5j81nL0J22l5j14M47m73K45l6
$$ plain form
6073 -10 145 48 1 142 81 22 -36 110 -173 74 -150 -158 -194 -157 -19 11 -46 41 102 -248 122 39 75 -79 -82 81
6099 81 25 -36 202 -59 196 -18 125 49 -47 115 256 56 -23 3 -17 -99 82 115 -3 8 40 11 135 42 20
6124 20 -24 -70 205 -62 136 33 -121 -168 -36 97 -124 69 21 -167 45 44 18 -13 118 -34 95 11 -25 -122
6148 -122 -11 -41 -189 108 -27 -28 130 148 -244 299 -6 121 79 177 338 121 74 19 100 -96 -46 -67 -115 -33
6172 -33 27 -146 17 -20 88 58 75 108 10 -113 -101 -113 26 21 -147 199 145 104 25 24 -61 -63 134 -32 -72 -21 141
6199 141 199 -24 -267 -174 94 -75 88 119 34 -35 31 -141 -113 -78 -92 -208 17 -95 -173 13 50 97 -89 72
6223 72 -40 61 -89 -99 -66 -188 -281 1 -1 253 -111 -319 -88 186 -89 -31 -23 -92 -88 4 30 -199 132 146 -147
6248 -147 -113 -68 115 112 287 83 -57 -151 34 118 63 104 -58 -76 126 -200 -87 -40 -178 143 -49 -19 -221 -24
$$ packed form
6073a0J55r7m7J41o1n9n8J46k83K47k24ql6L7J38L0n7Q7O1l50L70q3L6j54lJ63
6099H1n6o1K38k61K55k14J43p6r6J62J41k00p9K6k0q2J81L3j18J1L2k9J24r3k2
6124B0m4m6K75k67J98j03j54m7J32J33k21J93m8j88K12jk6l1J31j52J29q4l6r7
6148a22J11l0j48K97j35jJ58J8l92N43l05J27m2R8J61k17m7n5Q1j96N0k1m8Q2
6172c3O0j73J63l7J08l0J7L3r8j23J2j2J39nj68L46n4m1p9jq5kJ97j66m0N1J62
6199A41N8k23k43R3K68j69J63L1q5o9O6j72K8L5j4j16K25j12p8J86L7M7j86J61
6223G2j12J01j50j0L3j22r3K82kK54l64k08K31K74k75N8Qo9MR2K6k29L31J4k93
6248a47L4M5J83lJ75k04j40r4J85Q4n5M1j62j8K02l26J13M7j38L21j92L0k02J97
$$ plain form
6272 -24 -16 -88 38 392 124 -23 32 -57 7 48 100 46 -145 169 11 140 157 166 14 171 -9 -75 -19 155 136
6297 136 7 -50 42 -42 47 -35 -88 -19 109 -117 -123 -138 -43 178 -132 -119 37 -89 63 20 104 42 -117 -6 242
6322 242 -104 33 -37 31 -104 71 231 -37 65 18 39 172 -191 118 -45 -7 -2 62 -165 134 4 111 14
6345 14 130 42 -62 129 -33 186 157 -260 129 -99 -101 12 98 260 -40 -17 150 -131 -151 31 -82 -234 -90
6368 -90 -171 105 125 -134 -1 -68 275 -207 -117 -223 236 -79 132 28 30 -7 -132 142 -108 188 205 7 37
6391 37 48 -4 -82 113 241 67 -195 -11 188 -115 60 -185 -82 -246 -171 -60 -29 -144 -139 111 -126 53 -10
6414 -10 63 139 4 48 136 83 34 -11 -27 181 152 -279 -139 -114 181 -167 -142 109 171 -26 -14 254 174 67 -118
6439 -118 107 197 -89 21 258 133 133 -109 50 14 -23 119 -291 165 91 -347 173 75 -19 -152 -20 144 0
$$ packed form
6272b4Qp2J26L54k68j47N5q9O4M1N2n4j91L14j58J29J7Rj52J57j80o6N6J74j9
6297A36j29n7R2q4Q9q2n3O9J28k26oj5R5K21l10J3J56j26J52m3Q4o2j59J11K48
6322B42l46J37p0O8j35J75J60k68J02m7K1J33l63L09j63L8NO4k27K99j30J07r7
6345A4J16q8j04J91j62K19k9m17L89k28kJ13Q6J62l00K3J67k81k0J82j13j52J44
6368i0q1K76K0k59J33o7L43m82R0j06M59l15K11j04Kl7j25K74k50K96J7j98L0
6391C7J1n2p8J95J28j74k62J84J99l03J75k45J03j64P5J11L1j15NK50k37J79o3
6414a0P3P6j35M4Q8n3m9m5j6K08k9m31J40K5K95l48K5K51O2j97J2K68q0j07j85
6439a18K25R0k86J10K37j25%k42J59l6l7J42m10M56p4m38N20r8r4j33J32J64j44
$$ plain form
6462 0 -93 185 117 -50 56 160 146 -76 -35 59 89 -118 123 -38 51 -5 -93 174 -45 -74 -83 -55 -110 -248 84
6487 84 -180 75 45 -33 -51 6 140 -48 82 50 6 174 -14 196 -12 74 76 40 -178 -2 23 119 -141 -4
6511 -4 -123 -162 10 -103 -90 140 -17 -30 153 -33 -77 103 176 -29 39 -80 136 -20 21 56 -122 14 -168
6534 -168 113 43 92 39 28 88 -14 148 -33 -14 196 -38 190 5 78 -116 47 154 200 -41 125 -23 -160
6557 -160 -14 -48 185 -79 -17 220 117 -216 82 -192 24 -89 71 -107 -90 31 -157 43 86 48 -211 -14
6579 -14 -99 98 84 248 101 -33 -80 103 -175 -9 42 -110 93 125 33 -3 71 34 0 -97 -46 118 -102 -64 -21
6604 -21 -29 109 143 19 307 -44 77 10 32 -159 -34 67 -53 31 90 -52 -213 -83 218 124 4 12 150 -156
6628 -156 214 -181 55 70 -83 -93 -290 -96 -216 -237 -49 76 -29 62 -92 -207 -132 77 -42 173 37 -32
$$ packed form
6462@r3K78o8j67J06J04j4k22M1R4L0k07K41j61Q9n6q8K67k19k9rK8n5j38L32
6487H4k64K55l0p8j8N7J34j88J30l2m4J68j88K10k08Q6Kl6k18J76K5R6k60J37
6511dj19l9J72j13J3K30j57j3J83j86m4J80P3k05O8j19K16j56M1L5j78J36j82
6534a68K81p0M9n3j1O0j02J62j81J9K10k34K28j85P3j94J63J07M6k41J66j48j37
6557a60J46l4K33k64O2K37j03l33K98k74K16j13J60j78J7J21j88K00M3l8k59J97
6579a4q5J97j4J64j47j34m7J83k78J66N1j52K03L2r2l6P4l7l4r7N1J64k20L8M3
6604b1qJ38L4j24K88l51J21o7K2j91J25J01j20Q4N9j42j61J30L01r4j20QJ38l06
6628a56L70l95K36J5j53j0j97J94j20k1J88J25j05R1j54j15P5K09j19K15j36o9
$$ plain form
6650 -32 -50 -84 95 159 89 27 -45 132 -56 -46 142 -111 137 -35 53 7 123 32 -104 -59 176 28 58 195
6674 195 -56 -131 20 -80 138 80 96 45 -62 171 58 -30 -30 26 -171 -209 146 -134 236 -94 110 216 -116
6697 -116 -63 51 14 -43 104 -28 -27 -183 155 -77 -162 71 -54 259 157 41 46 -31 130 -276 -94 49 64
6720 64 177 109 135 -155 -67 -111 -69 -190 -8 156 -230 -86 85 -156 -67 97 49 -116 275 169 21 31 66
6743 66 -2 31 57 22 -79 -213 92 -34 -40 15 -10 -46 -177 225 34 -192 0 -53 -117 153 58 -148 207 -202
6767 -202 -127 84 -104 -209 -173 -30 -98 -12 28 17 15 46 52 86 -127 -21 15 -138 49 114 62 -51 116 48 -30 -20
6793 -20 12 33 211 -111 -99 -117 47 -75 -75 40 -29 -89 -43 -32 -33 54 -42 29 35 147 13 5 -184 38 -20 -210 73
6820 73 179 65 85 73 -73 27 50 180 -101 51 -38 -97 119 28 47 -49 113 185 18 -32 38 131 8 109
$$ packed form
6650c2j8l4J79O4p0o2p2J77j88J0J88k53K48j72Q8m6J16r1j36M5K35j48L0J37
6674A95k51p5J51j00K18n8J6n1j07K33j13q8%N6j97l8L55k80L70l30K04J06l32
6697a16N3J14l7n7J47j32Jj56L38k32q5K33j25L13j02j16Np7J61m06J82J43J5
6720F4J13o8K6k90Q8m4M2j21J82J64l86J44J71k41Q9J64m8j65L91j06j48J0L5
6743F6o8L3K6l5j01j34L05j26oN5k5l6j31M02j91k26J92n3o4K70r5k06L55m09
6767b02P5K11j88j05L6J43o8Q6M0j1kL1OL4k13J06L6j53J87O5n2j13J67o8p8J0
6793b0L2K1J78l22J2j8J64j22%J15o9o0M6J1jQ7r6P1OJ12j34qj89K22n8j90K83
6820G3J06j14K0j2j46J00K3J30k81J52q9n9K16r1J9r6J62P2j67n0P0R3j23J01
$$ plain form
6844 109 -42 157 -141 -87 -17 191 -197 -191 -302 9 71 80 -63 -165 25 -20 219 156 66 200 -77 34 -95
6867 -95 13 -15 32 38 -17 -18 60 -111 0 -81 26 -212 -167 -58 -124 69 -44 171 95 -28 -170 -246 -25 79 98
6892 98 -42 -301 -5 42 20 157 -22 -60 251 -56 20 -84 116 91 -14 68 -78 7 72 8 151 -84 -2 -56
6916 -56 -58 102 -176 65 -35 105 63 44 39 43 25 1 -55 11 51 -93 -29 -38 -60 -80 182 -33 -15 -147 -97 -51 25 -134
6944 -134 7 -28 -125 85 51 126 -82 66 164 -97 -268 134 25 22 233 74 11 -5 -41 -142 -183 87 -25 -287
6968 -287 -103 -41 227 130 -90 -123 -224 -215 68 58 108 -99 32 -33 141 110 -176 144 226 38 -128 -69 -57 -61 30
6993 30 -106 -34 4 -26 116 147 -167 98 42 5 97 100 -213 14 72 -95 33 148 22 133 -25 -3 8 -5 97
7018 97 -184 134 49 -75 -201 65 3 -39 -91 -163 -128 -77 -28 -14 -74 -64 -144 -73 159 -70 84 -74 -30 195 300
$$ packed form
6844A09j51J99k98N4P0K08l88Oj11L11O2Rj43j02J90m5K39o3r0J34k77J11j29
6867i5J08k8M7On5jP8j71J11q1J07k38M5J09o6J93j13K15p6j23j42p6K21J04J9
6892I8j40k59K96M7k2J37j79l8L11l07P6j04K00k5j05Q2j46Q5O5o4J43k35Q2n4
6916e6kJ60k78K41j00J40m2j9nMj8k4n6O6M0j44O4rk2k0K62k15J8j32N0M6P6j59
6944a34J41l5r7K10l4P5k08J48R8k61j71M02j09lK11j59o3j6l6j01m1K70j12k62
6968b87J84O2K68r7k20l3j01RK83j0N0k07J31o5J74l1k86L20Q2j88j66N9J2mR1
6993C0j36P2L8l0J42L1l14K65n6l7R2Ll13K27N8j67J28J15j26J11j58K2J1j3J02
7018I7k81L18q5j24j26K66o2m2n2p2L5N1M9J4o0J0q0P1K32k29J54j58M4K25J05
$$ plain form
7043 300 47 -19 99 -261 -66 -13 17 -58 -212 64 -97 124 274 -50 104 -59 -23 -246 46 169 -82 -64
7065 -64 -39 30 -137 81 -33 172 -120 -172 -59 -39 79 142 -20 -191 29 165 -34 20 87 -69 -74 142 72 -149
7089 -149 -131 -227 -82 -66 -140 -20 65 23 -136 153 -25 129 81 30 47 -68 -92 -21 38 95 48 39 -280 -15 39 21
7115 21 103 -54 159 -68 111 -59 70 -114 -51 -36 -109 -40 -19 -167 -44 -19 31 121 0 -44 91 7 -103 -54
7139 -54 -36 177 -3 -120 -37 159 103 -51 -98 105 127 -103 167 233 172 -68 121 -75 -65 -80 -52 79 -140 149
7163 149 94 127 63 95 24 58 -44 -45 -11 140 311 34 23 -9 -47 71 11 -176 68 49 -195 264 -48 -38 -161
7188 -161 46 -115 58 54 99 -23 144 210 -62 13 -189 -78 -149 -72 158 -81 -186 83 199 94 -8 45 -7
7211 -7 -178 -48 32 -357 -82 52 -82 -56 -146 -48 -42 51 221 185 -10 -146 -101 -275 93 -69 -44 -1 98 -34 49
$$ packed form
7043C00k53o6J18l60J95N3L0p5j54K76j61K21J50l24J54j63L6k23K92J23k51J8
7065f4K5O9j67K18j14K05k92n2J13K0J18O3j62j71K20J36j99N4O7j56nK16p0k21
7089a49J8r6J45J6p4J20Q5m2j59K89j78J54m8n1J7j15k4P1N9N7m7rl19K65N4j8
7115B1Q2j57K13k27J79j70J29j84O3J5p3O9K1j48J23K5N0R0j21m4J35q4j10M9
7139e4J8K13j80j17Q3J96n6j54m7K03K2k30K70O6o1k40J89j96J0j5K8J31k19K89
7163A49n5L3o4L2p1L4j02jL4J51J71k77j1l2l8J18o0j87K44j9k44M59l12J0j23
7188a61K07j61J73mM5j22J67O6k72P5k02J11p1P7K30k39j05K69J16j05j02N3n2
7211gj71J30Q0l89K75J34j34K6r0R8OR3J70l6j95j36M5j74L68j62K5M3R9j32Q3
$$ plain form
7236 49 22 -31 -100 194 -275 -105 200 -34 222 79 -25 142 89 88 -133 5 -7 43 49 61 -62 -223 179 12
7260 12 -61 -42 67 -34 243 -148 -109 62 166 -30 -188 22 152 63 -5 -167 87 -43 70 221 -156 -33
7282 -33 45 101 -56 2 10 -55 13 -21 -124 24 67 -27 -6 68 -66 154 65 -179 154 -258 0 -100 -105 -94 -25 -160
7308 -160 128 -214 172 -89 -45 308 60 261 -183 -73 -126 1 177 -16 39 -54 30 122 -172 -197 -30 -235
7330 -235 -47 256 169 107 0 53 -55 -75 170 45 -92 -184 49 -54 65 23 -83 -8 -150 37 56 -26 -67
7353 -67 -55 85 -168 7 79 12 75 249 121 144 -22 106 14 60 -112 76 8 -25 -106 8 130 -16 12 -73
7377 -73 99 104 -4 -94 -116 240 -36 -14 -151 3 -128 -180 -52 77 -61 -181 -203 137 182 5 -162 -211 66
7400 66 -57 -23 47 288 -147 112 -158 199 67 105 55 -42 -66 175 102 -29 214 22 2 -21 206 -170 -116 -20
$$ packed form
7236D9k7n3o9K94m69J70L05k34K56j43j04J67n3jk21J38j2N0OJ2j23j61M02j67
7260A2p3J9J09j01K77l91L9J71J04j96j58K10J30q9o8j62K54j30J13J51l77J23
7282c3P8N6j57N8Qo5O8l4j03J48M3r4K1P4j34K20q9k44L33m12K58j00nJ1O9j35
7308a60K88l42L86k61M4L53k48K01m44J10n3J27J76j93N5r3Q4R2k94k5J67k05
7330b35J88L03q7o2j07N3j08k0K45j25j37r2K33j03J19m2j06P5j42J87J9q2m1
7353f7J2J40k53J75P2o7O3J74j28K3j66J28r2M6j72J88o8l3q1J14J22j46K8q5
7377g3J72Nj08r0k2L56k76K2j37J54j31n2J28J29j38j20k2L40M5j77j67m9K77
7400F6j23L4P0K41m35K59k70L57j32L8n0r7k4K41p3j31K43j92k0k3K27l76N4R6
$$ plain form
7424 -20 -28 -35 111 -171 80 7 -3 -5 27 149 -89 34 84 73 -219 -83 -63 -18 9 107 46 259 135 73 0 9 245
7451 245 -42 -108 -72 176 -11 41 62 69 279 23 -166 -144 98 129 -160 221 -63 174 -45 -18 -5 -16 81 -51
7475 -51 9 117 -135 102 0 16 -143 -6 -104 -73 244 83 87 115 73 -203 -218 -37 153 -133 -188 154 57 -32
7499 -32 -115 54 98 57 54 20 59 21 73 -29 8 -51 115 198 202 56 37 55 -147 -105 -36 89 -6 44 -100 229 -24
7526 -24 80 0 128 149 -25 77 -116 -1 167 -88 78 30 95 124 139 93 88 10 84 265 14 -89 42 -84
7550 -84 195 67 19 -51 -134 -81 59 -9 111 -42 -138 -33 -90 -318 -82 206 -25 224 -247 25 -50 24 106 98
7574 98 -49 42 34 13 -25 250 -46 -114 -143 129 30 54 12 169 -72 -76 -29 9 -119 53 -21 -58 117 -52 -85 -110
7600 -110 -127 -105 71 82 -168 45 -49 -86 119 23 10 -1 114 -63 -15 9 53 -29 151 -107 174 -39 -50 154
$$ packed form
7424b0qpJ46k82K51p3j0kL2J22k38J23N0j1k92J36K0M5K7R8o1K13j24o2p3RK36
7451B45k87o6L6K48j87N2K1PK10k56j89K2K42L1k89L81k84K37k19K7J3j1R7j32
7475e1O0J08k52K37j02J6j59J37r8L1L17j61MK8m2k76j5J81J90k86n5L42r7q9
7499c2q3J69M4m1ll4L9l8N2j02L7n9J66Q3Mj46j9J8k02M2O9J25r5N0j44L29k53
7526b4J04q0J28K1j74J02j93J15J68k55J66m8O5K9J5m6np8P4J81k51j03J31j26
7550h4K79j28m8p0q3N3J40o8J20j53r6J05n7k28K36K88k31K49m71K72p5P4Q2q
7574I8j47R1qk1l8K75k96o8k9K72r9K4m2J57k41mM7L8j28J72p4l7J75j69l3k5
7600a10j7K2J76J1k50K13r4l7K05r6j3j1J15j77M8K4M4q2J80k58K81k13j1K04
$$ plain form
7624 154 -2 -65 183 -190 -181 -106 82 36 -108 -56 126 64 -38 -67 171 -26 11 -44 71 -34 47 -154 105 32
7648 32 -7 86 -27 -40 -48 -38 65 -243 -97 165 27 16 65 102 268 84 -135 -11 90 41 -193 -125 -107 -8 -36
7673 -36 -103 -166 -108 22 26 23 42 -82 -4 111 -233 118 -169 -88 148 -58 94 -198 183 -101 -2 50 48 -125 121
7698 121 -90 -109 141 24 -19 88 276 71 -38 -7 92 -22 107 113 -102 12 -30 74 42 -125 14 77 -18
7721 -18 -91 156 58 45 -220 66 -292 -239 106 -149 -82 -77 90 -34 281 195 136 -34 1 168 182 -313 181 -75
7745 -75 13 -168 46 -32 7 6 174 33 39 185 42 107 125 66 37 -16 -304 -82 46 -1 200 -59 -103 -279 1
7770 1 -48 -116 74 190 72 45 90 -130 248 8 78 -155 -1 140 126 94 158 -23 95 -98 -87 -144 -118 -4
7794 -4 26 -41 -107 77 -155 -37 39 -40 -117 -110 -69 19 -27 -141 -95 17 -12 53 -217 76 -27 -209 199 134 103 -69
$$ packed form
7624A54j56o3K48l73RP5J88m6j44N2J82o2j02k9K38j97L7n5J15j05Q1k01K59p3
7648C2l9R3j13j3qJ0J03l08J46K62j38j1M9L7J66j84k19J24J01m9k34O8J8R9k8
7673c6o7o3N8J30MlJ9j24P8J15l44L51k87Q1K36k06J52k92L81k84R9N2kj73K46
7698A21k11j9K50j17m3J07J88k05j09L1R9j14J29Ok15J14m2J04l2j67J39O3r5
7721a8p3K47r8j3k65K86l58N3L45k55O7NJ67j24L15q6n9j70L5J67J4m95M94k56
7745g5Q8j81K14p8L9jJ68j41OJ46j43O5J8n9k9n3k88K22J28m7K01k59m4j76K80
7770Am9o8J90J16j18k7M5k20L78k40P0k33J54J41j4l2O4j81J18j93J1n7K6J14
7794dL0o7o6J84k32J18P6p9p7PM1Q8m6j14M6J12k9O5k70K93j03j82M08o5l1j72
$$ plain form
7820 -69 -11 -63 -85 202 79 -73 -149 -143 1 -32 6 -98 -328 -32 50 -123 86 -173 -178 49 40 42 29 16 7 -162 78
7847 78 160 -81 -61 -56 48 119 -131 -225 21 161 -4 -96 -209 5 104 -56 72 -69 0 -147 17 -74 132 6
7871 6 -96 122 72 192 23 55 -130 -154 -128 -55 -75 -176 204 -171 105 2 53 46 -151 212 9 18 -223 90
7895 90 -18 34 -23 166 -216 -91 -169 -64 50 -97 231 71 22 131 -103 51 -13 32 184 18 -15 -13 34 -120
7919 -120 183 -14 -163 -57 186 160 85 106 46 107 -127 -15 -113 -154 78 -39 36 -103 -24 127 20 -123 -128 115
7943 115 83 -201 -29 -108 121 -15 -133 89 91 -178 95 -19 189 77 3 208 26 29 -243 -69 -146 -132 -111
7966 -111 -77 86 -72 160 -214 144 -106 22 -23 -72 68 -36 20 151 -56 -160 181 -183 -154 105 -32 -118
7988 -118 -167 -34 -115 -13 12 -54 112 -71 46 115 -167 -186 70 80 -97 113 122 -245 -53 -100 83 -65 112
$$ packed form
7820f9N8n2k2K87j23j52p6OJ44l3L8j04k30K96Q2j73K09k59nK27rKj3j3rj69K40
7847G8Q2k41K0NJ04P1k50r4K46J40j65r2j13K14R9j60J28j41O9j47J64r1K06j26
7871Fj02K18n0J20j69L2j85k4K6P3k0j01L80l75K76j03N1pj97L63k03Rk41L13
7895I0j08N2n7J89l82J25p8J05J14j47L28j60m9J09k34J54o4M5J52j66l3KM7j54
7919a20L03j97j49J06K43k6p5K1o0O1k34J12r8m1K32j17P5j39P9J51j07j43nK43
7943A15l2k84J72p9K29j36j18K22Kk69K73j14K08j12p4K05j82Lk72J74p7J4K1
7966a11L4J63j58K32l74L58k50J28m5m9J40j04N6J31k07j04L41l64K9K59j37q6
7988a18m9J33q1J02K5o6J66j83J17O9k82j9K56J0j77K10Rl67J92m7J83j48J77
$$ plain form
8011 112 14 -205 -1 -49 46 1 -84 75 -43 -99 162 163 69 135 66 54 16 -70 24 -41 137 -94 -102 111 253 202
8037 202 110 82 37 128 0 -115 -40 15 44 -162 -68 13 26 -35 -60 -92 7 11 -141 7 149 -11 27 -135 -11 167
8063 167 -260 -104 -93 -28 6 263 92 -25 69 -2 -34 282 23 -103 147 128 34 -59 -55 -85 -47 29 149 213 -161
8088 -161 -17 -25 -91 -77 -26 -129 -25 -69 -216 -183 -102 126 -152 37 -34 -31 16 7 115 -3 -93 1 74 107 29 231
8114 231 161 -138 15 101 -105 15 -150 153 78 -262 171 22 -75 -97 -28 -113 -156 21 234 20 157 -8 -3
8137 -3 78 32 -52 0 25 108 93 26 27 -146 2 -151 11 -69 132 68 -13 -44 -178 41 -55 88 -60 -55 94 -96
8163 -96 53 -93 66 -75 -13 -36 67 30 -50 221 -156 -156 20 156 -122 34 -62 53 -123 190 27 -63 -130
8186 -130 -217 71 231 182 -15
$$ packed form
8011A12r8k19K04m8R5m5q5J59j18n6K61Jr4O6o9j2l8q6R4o5J78k31qK13J42n1
8037B02r2k8m5R1j28j15P5N5K9k06R4Q1J3o1k5l2R9Mj52J48J42j60L8j62J24J78
8063A67m27J56J1O5L4K57j71j17R4p1l2L16k59j26K50j9r4r3Ml0L8P6J20O4l74
8088a61J44qo6J4N1j03J04m4j47L3Q1K28k78J89p1LM7rJ08j18r0R4P3L3p8K02
8114B31p0k99J53Q6k06J20j65L03p5l40M33j49r7k2O9q5m3J77K13k14J37j65N
8137cQ1m6q4N2K5Q3j5o7Jj73J48j53J62q0K01o4q1l1j34K19r6J43j48NJ49j90
8163i6J49j46J59j41O2k3J03l7q0K71l77%J76J36k78J56r6J15j76L13j63r0o7
8186a30q7K88J60m9j97
8191a5
$$ Imaginary data points
##PAGE= N=2
##DATA TABLE= (X++(I..I)), XYDATA
$$ plain form
0 0 0 0 0 0 0 0 0 0 0 0 0 8 -8 8 -8 16 -16 24 -24 32 -32 40 -48 56 -71 80 -96 106 -125 144 -162 185 -210
33 -210 240 -271 304 -341 383 -426 476 -530 589 -654 724 -799 884 -975 1077 -1185 1305
50 1305 -1438 1585 -1747 1929 -2132 2359 -2622 2919 -3268 3681 -4175 4785 -5552 6561 -7941
65 -7941 9963 -13214 19311 -34736 161174 214580 -116064 -94465 -56332 -64337 -1833 116352
77 116352 25191 -86830 -103549 -132667 -159900 22838 183638 103981 -19388 -21693 -66310
88 -66310 -90808 27939 135307 96916 60579 37173 -66588 -119857 6710 100087 47394
99 47394 6584 -11008 -109306 -149936 -53899 18790 25956 65632 60511 -51106 -92776 6335
111 6335 65825 51678 78598 76450 -26012 -81017 -34773 124 23085 67979 41650 -55747
$$ packed form
0@%%%%%%%%%%%Qj6J6j6K4l2M0m8N6o4P2q8J04j27J51j76K02k31K69l06L47l95
33b10M50n11N75o45P24q09R02j006J119j243J378j523J683j859K052k262K490
50A305k743L023l332L676m061M491m981N541o187O949p856Q960j0337J2113j4502
65g941J7904k3177L2525n4047J95910N3406l30644K1599L8133q005O2504J18185
77A16352r1161j12021j6719k9118k7233J82738J60800p9657j23369k305m4617
88f6310k4498J18747J07368l8391l6337k3406j03761n3269J26567R3377n2693
99D7394m0810j7592r8298m0630R6037P2689P166L9676n121j11617m1670R9111
111F335N9490j4147K6920k148j02462n5005M6244L4897K2961M4894k6329r7397
$$ plain form
123 -55747 -84747 -46047 -41531 -23237 51324 62412 -14722 -52463 -32385 -13217 28818 83819
135 83819 72332 14679 -9569 -22591 -46183 -18113 47264 47832 -5624 -34204 -47947 -57894 -24620
148 -24620 26647 34281 16784 7622 -17964 -45774 -16919 41262 54732 33138 13263 -14121
160 -14121 -33342 -16370 10869 19615 25146 21335 -18822 -56822 -39724 -192 13718 16501 15057
173 15057 -5222 -23643 -19174 -3446 16718 41945 44051 6849 -26939 -22176 -6135 1035 13146
186 13146 19956 3433 -20200 -30883 -26612 -6010 21163 28081 7681 -12867 -17864 -16934 -7110
199 -7110 16515 30055 21200 3904 -11987 -20017 -8852 13184 20979 9531 -5574 -15691 -26055
212 -26055 -23473 -2944 16141 18781 8796 -7531 -16243 -8643 5971 14551 15855 12846 1843 -15484
$$ packed form
123e5747k9000L8700M516J8294P4561J1088p7134l7741K0078J9168M2035N5001
135H3819j1487n7653k4248j3022k3592K8070O5377N68n3456k8580j3743r947L3274
148b4620N1267P634j7497r162k5586k7810K8855N8181J3470k1594j9875k7384
160a4121j9221J6972K7239Q746N531l811m0157l8000J7098L9532J3910K783j444
173A5057k0279j8421M469J5728K0164K5227K106l7202l3788M763J6041P170J2111
186A3146O810j6523k3633j0683M271K0602K7173O918k0400k0548m997R30R824
199g110K3625J3540q855j7296j5891q030J1165K2036P795j1448j5105j0117j0364
212b6055K582K0529J9085K640r985j6327q712P600J4614Q580J304l009j1003j7327
$$ plain form
226 -15484 -20241 -5699 10913 17194 11195 -2837 -13177 -13663 -9757 -3131 7876 14701 6533 -11027
240 -11027 -16743 -6685 6011 14075 15940 9869 638 -8066 -12711 -7103 4782 12895 8345 -4854
254 -4854 -13668 -12509 -5307 4388 10594 9807 4571 -4077 -12001 -10240 1668 12956 13105 3579 -4739
269 -4739 -7891 -6496 -1106 4630 8339 7042 -2494 -12743 -12959 -3668 5904 8564 5727 1498 -3491
284 -3491 -6887 -4848 2187 8532 9587 2088 -6509 -8705 -5295 -240 4129 6808 5216 -1231 -7999
299 -7999 -8141 -2792 3716 6719 4273 -846 -4062 -5647 -3578 1349 6839 7941 3477 -3483 -6722
314 -6722 -4764 567 5128 4229 1340 -1749 -5234 -6787 -3491 3329 8018 5494 -837 -4313 -3598 -189
330 -189 2806 3817 4382 2147 -3695 -7577 -5336 1200 5707 4637 1057 -1381 -2968 -2718 -823 2218
$$ packed form
226a5484m757J4542J6612O281n999j4032j0340m86L906O626J1007O825q168j7560
240a1027n716J0058J2696Q064J865o071r231q704m645N608J1885Q113m550j3199
254d854q814J159P202R695O206p87n236q648p924J761J1908J1288J49r526q318
269d739l152J395N390N736L709j297r536j0249k16R291R572K660k837m229m989
284c491l396K039P035O345J055p499q597k196L410N055M369K679j592o447o768
299g999j42N349O508L003k446n119l216j585K069M927N490J102m464o960l239
314f722J958N331M561q99k889l089l485j553L296O820M689k524o331l476P15L409
330a89K995J011N65k235n842l882K241O536M507j070l580k438j587K50J895L041
$$ plain form
346 2218 4488 3424 -1588 -5404 -4567 -378 2917 3787 3206 1050 -2029 -3659 -2880 -212 2869 3426
362 3426 491 -2899 -3691 -2163 851 2614 3691 2474 -320 -2447 -3779 -2280 1543 3757 2256
377 2256 -653 -1972 -2168 -1815 -133 2490 2920 515 -2704 -4115 -2465 837 2794 2729 2135 549 -1822
394 -1822 -2622 -427 2467 2751 492 -1054 -2855 -2788 -846 834 2009 2601 1221 -1457 -2755 -1161
410 -1161 1038 1615 1563 1100 -838 -1476 -698 -189 1145 2475 1717 -695 -2234 -1969 -882 219 1344
427 1344 891 -421 -651 -856 -1439 -99 2366 2355 424 -955 -850 -636 172 1001 1378 555 79 -1084
445 -1084 -2317 -756 1067 1150 344 -179 -557 -1511 -604 1008 1139 756 580 -604 -1594 -537 353 706
463 706 656 747 -344 -1667 -657 327 153 374 522 -547 -1477 -616 -185 155 982 994 252 -741 -254 -3
$$ packed form
346B218K270j064n012l816Q37M189L295Q70n81k156l079j630P79K668L081N57
362C426k935l390p92J528L014J763J077j217k794k127j332J499L823K214j501
377B256k909j319j96L53J682K623M30k405l219j411J650L302J957o5n94j586k371
394a822q00K195K894K84k259j546j801O7J942J680J175N92j380k678j298J594
410a161K199N77n2m63j938o38P78N09J334J330p58k412j539K65J087J101J125
427A344m53j312k30k05n83J340K465j1j931j379J05K14Q08Q29L77q23m76j163
445a084j233J561J823Q3q06n23l78r54R07J612J31l83j76j184r90J057Q90L53
463G06n0R1j091j323J010R84j74K21J48j069r30Q61M31L40Q27J2p42r93M87K51
$$ plain form
483 -3 113 461 495 -469 -651 -323 -190 -256 654 1223 239 -426 -512 -281 -181 272 401 -213 -6 162 -371 -313
505 -313 952 935 62 -266 -356 -952 -913 -186 347 0 90 212 -546 -133 869 1038 961 411 -135 -817 -706
526 -706 -1 190 240 349 33 -1042 -681 11 316 276 -42 -148 -1009 -949 32 253 609 878 586 -298 -564
547 -564 65 303 308 186 150 -816 -758 -483 -167 117 453 529 -88 -364 -518 -598 -205 756 514 -169 -6 19 -111
570 -111 -242 516 754 265 -454 -364 -772 -592 80 324 -16 104 -264 -278 -178 560 721 586 198 -134 -548
591 -548 -675 56 834 473 -44 53 -533 -303 -88 237 165 493 154 -639 -498 -23 -66 135 208 378 210 71
613 71 115 42 310 484 67 -346 -450 -357 -385 -221 369 308 -202 -207 -85 -362 -182 500 294 78 -98 -239 -81
636 -81 -120 383 261 162 24 -217 -651 -388 -12 183 -181 -129 -31 -298 52 121 272 -15 205 142 -257 -151 134
$$ packed form
483cJ16L48L4r64j82L28J33o6R10N69r84o65q6K31J00M53J29o14K07J68n33N8
505c13J265j7q73l28r0n96L9P27N33l47R0J22p58M13J002J69p7n50n46o82J11
526g06P05J91N0J09l16j075L61O92L05m0l18j06q61O0R81K21L56K69k92q84k66
547e64O29K38Nj22l6r66N8K75L16K84L36P6o17k76j54q0L93R61k42o83J63K5j30
570a11j31P58K38m89p19R0m08J80O72K44l40J20l68j4J00P38J61j35l88l32m14
591e48j27P31P78l61n17R7n86K30K15L25p2L28l39p93J41M75m3K01P3J70j68j39
613G1M4p3K68J74m17m13j04R3k8J64N90o1n10nJ22k77J80O82k06k16j76j41J58
636h1l9N03j22r9j38k41m34K63L76J95l64N2R8k67L50O9J51k87K20o3l99J06K85
$$ plain form
659 134 122 132 163 132 -277 -10 129 46 -101 199 -177 -340 38 -106 129 34 284 154 -34 204 71 75 217
682 217 277 108 -291 -132 -120 -270 -117 83 45 -72 39 123 32 -198 -32 192 61 29 -48 -164 175 242 145
705 145 167 -18 28 -81 -166 142 35 -145 -153 -329 -162 185 144 155 85 96 -59 -101 -184 191 183 31 -37 -157 -76
730 -76 48 -134 -65 164 -178 -162 -8 -78 -39 -130 -79 70 20 92 65 112 -118 77 245 -87 -63 -68 -104 22 71 125
756 125 58 -72 -271 -146 21 116 -29 -70 61 37 -36 -74 249 188 21 -23 -138 -97 170 278 77 -74 -52 -236
780 -236 -71 -235 93 9 196 112 98 -45 -111 107 49 -142 12 -18 -122 -11 -37 57 -164 -22 288 -35 1
803 1 45 -130 -66 4 -27 103 -6 -127 -60 59 -33 -132 6 32 -221 197 47 75 -64 -136 -87 162 -148 270 97
828 97 205 74 -143 27 113 4 -220 33 181 -197 -100 -50 25 175 86 52 120 -192 -53 -150 -67 -1 56 51 -78
$$ packed form
659A34j2J0L1l1m09K67J39q3j47L00l76j63L78j44K35r5K50j30j88K38j33MJ42
682B17O0j69l99J59J2j50J53K00l8j17J11Q4r1k30J66K24j31l2p7j16L39O7r7
705A45K2j85M6j09q5L08j07j80qj76J67L47m1J1p0J1j55m2q3L75qj52o8j20Q1
730g6J24j82O9K29l42J6J54p0L9r1N1J49n0P2k7M7k30J95J68l32K4nl6J26M9N4
756A25o7j30j99J25J67R5j45m1J31k4p3l8L23o1j67m4j15M1K67J08k01j51K2j84
780b36J65j64L28q4J87q4j4j43o6K18n8j91J54l0j04J11k6R4k21J42L10l23L6
803AM4j75O4P0l1J30j09j21O7J19r2r9J38K6k53M18j50K8j39p2M9K49l10M18j73
828I7J08j31k17J70Q6j09k24K53J48l78R7N0P5J50q9l4O8l12J39r7Q3O6N7nj29
$$ plain form
853 -78 230 155 10 259 0 -4 -84 82 29 -131 -19 37 -21 176 -125 -165 -52 196 70 -11 -105 163 26 -25
877 -25 -98 111 73 58 123 27 36 184 34 -23 -228 27 102 94 -156 91 -24 -145 100 -143 -154 92 -89 102 9
902 9 -54 29 -219 103 -180 52 10 120 -5 -69 -130 -154 207 -35 -17 -71 19 -181 -155 -111 -174 29 -163 -28 -93
927 -93 -156 19 -204 -217 -47 18 -43 61 19 -41 169 129 1 33 -8 -40 76 17 70 -131 121 -19 262 -11 -143
952 -143 72 -36 -41 -116 164 144 104 -125 41 19 -28 175 129 192 -96 -9 75 -183 -3 -87 -59 62 22 -180 -41
977 -41 99 60 69 -141 -69 -165 -90 -43 147 -103 51 46 -33 81 -15 -72 -92 46 139 65 -183 91 -29 5 -146 -97
1003 -97 -81 -9 109 115 156 -176 -35 -100 -3 76 117 -143 138 36 -159 -110 205 -2 91 -42 -59 -44 58 -1 -107
1028 -107 -20 88 -64 192 -128 -118 -145 -183 -134 49 -44 -8 -154 40 64 67 53 -67 -12 -50 14 7 73 -57 -70 125
$$ packed form
853g8L08p5j45K49k59mq0J66n3j60J12N6n8J97l01m0J13K48j26q1r4K68j37n1
877b5p3K09l8j5O5r6RJ48j50n7k05K55P5qk50K47j15j21K45k43j1K46j81J91r3
902Io3Q3k48L22k83K32m2J10j25o4o1k4L61k42J8n4R0k00K6M4o3K03j92J35o5
927i3o3J75k23j3J70O5o1J04m2o0K10m0j28L2m1l2J16n9N3k01K52j40K81k73j32
952a43K15j08np5K80k0m0k29J66k2m7K03m6O3k88Q7Q4k58J80q4K8J21m0k02J39
977d1J40l9Rk10P2r6P5M7J90k50J54np9J14r6n7k0J38R3p4k48K74j20L4j51M9
1003i7J6P2J18OM1l32J41o5R7P9M1k60K81j02j95M9L15k07R3j33j7J5J02n9j06
1028a07Q7J08j52K56l20J0k7l8M9J83r3L6j46J94K4Lj4j20N5l8O4pO6j30j3J95
$$ plain form
1054 125 28 148 71 -330 180 -354 -4 -80 -181 -138 128 -161 9 -1 -82 19 -132 61 -12 -41 -87 18 26 -56
1078 -56 198 -123 -227 64 -139 -58 -236 28 -29 -254 -134 -256 27 167 61 -51 -153 -16 190 33 113
1099 113 -63 -12 120 -12 69 -86 -263 11 37 -33 -14 111 -34 -37 -58 92 -108 -110 72 199 174 89 -169 -50
1123 -50 -59 -293 6 143 -11 -16 82 122 42 90 224 106 133 88 -67 -166 33 182 12 122 3 -180 1 -110
1147 -110 -4 -35 32 -111 72 48 -85 -190 -75 -191 188 -99 -83 -45 40 -54 -72 -88 -58 28 53 64 -266 -245 33
1172 33 -41 -151 -64 -88 -169 61 -46 55 -2 56 158 -305 75 17 -212 91 159 -200 -107 24 114 215 60 163
1196 163 -117 133 -126 19 -143 64 -130 172 -17 -107 -154 154 81 153 151 -15 -40 -47 16 -104 175 24 -317
1219 -317 -54 -109 236 93 -94 -98 14 158 -247 -74 -174 -9 -132 -28 -53 -57 16 86 55 69 23 20 -174 -38
$$ packed form
1054A25r7J20p7m01N10n34L50p6j01M3K66k89J70j0q1J01j51J93p3k9m6J05Qq2
1078e6K54l21j04K91k03Q1j78K64n7k25J20j22K83J40j06j12j02J37K06j57Q0
1099A13j76N1J32j32Q1j55j77K74K6p0J9J25j45lk1J50k00kJ82J27k5q5k58J19
1123e0rk34K99J37j54nR8M0q0M8J34j18K7m5j55r9J99J49j70J10j19j83J81j11
1147a10J06l1O7j43J83k4j33j05J15j16L79k87J6L8Q5r4j8j6L0Q6K5J1l30K1K78
1172C3p4j10Q7k4q1K30j07J01n7N8J02m63L80n8k29L03O8l59R3J31R0J01j55J03
1196A63k80K50k59J45j62K07j94L02j89r0m7L08p3P2kj66k5pO3j20K79j51l41
1219c17K63n5L45j43j87mJ12J44m05J73j00J65j23J04k5mP3P0l1J4m6lj94J36
$$ plain form
1243 -38 88 45 15 -70 -106 -71 -141 -97 -30 194 -20 -98 269 -129 100 106 18 111 -116 -43 67 49 110 27 -175 -87
1269 -87 56 -44 -21 -49 -82 36 -101 -34 -4 86 -39 -42 168 131 119 79 -16 -83 58 61 -85 -93 153 -42 130 45
1295 45 -106 -58 -95 30 55 82 -64 -55 -111 -280 -1 -25 74 -30 33 153 164 7 -73 49 158 82 122 -132 97
1320 97 22 36 100 -96 -1 287 -86 -96 120 -97 -7 -156 70 133 -171 55 -123 -304 57 34 -13 19 27 -38 152
1345 152 143 105 -86 -6 -156 -45 204 8 1 -168 120 -308 191 -91 -47 -22 17 61 28 -83 263 97 -245 -12
1369 -12 14 5 207 -68 59 39 -120 181 -59 91 71 -128 17 -165 28 27 56 -10 -82 -32 -87 -37 -67 15 198
1394 198 94 166 4 -190 82 -55 136 113 159 10 101 48 139 -37 168 46 42 56 175 8 -64 -3 -14 54
1418 54 15 -25 46 -30 -106 -55 15 -62 79 -139 -5 -67 -138 -86 -139 37 19 13 121 -125 -17 -51 -15 108 -57 -65 -91
$$ packed form
1243c8J26m3l0q5l6L5p0M4O7K24k14p8L67l98K29Oq8R3k27P3J10j8O1q3k02Q8
1269h7J43j00K3k8l3J18j37O7L0R0j25lK10l7j2m0r5o7J41Lj46qK46j95J72q5
1295D5j51M8l7J25K5K7j46Rn6j69K79k4R9j04O3J20J1j57q0J22J09p6M0k54K29
1320I7p5J4O4j96R5K88l73j0K16k17R0j49K26O3l04K26j78j81L61k3m7L2Qo5J90
1345A52rl8j91Q0j50J11K49j96pj69K88m28M99k82M4K5L9M4l3j11L46j66l42K33
1369a2K6rK02k75J27k0j59L01k40J50k0j99J45j82J93jK9o6p2N0n5N0l0Q2J83
1394A98j04P2j62j94K72j37J91k3M6j49R1n3R1j76K05j22mJ4J19j67p2O1j1O8
1418E4l9m0P1p6p6N1P0p7J41k18J34o2p1N2n3J76j8oJ08k46J08l4L6J23j65qk6
$$ plain form
1445 -91 52 -76 -198 -90 -32 10 118 44 35 -144 -200 -10 144 215 -87 1 82 25 -72 -16 -27 -110 74 -136 9
1470 9 169 -86 16 220 -213 -65 -38 185 -58 142 -48 -36 -58 -160 -19 50 -110 -83 -8 -34 -67 -15 -99 53
1494 53 67 6 -115 12 0 180 61 199 132 -131 17 -135 2 86 110 -122 16 69 169 -174 86 -288 -111
1517 -111 -81 124 80 -121 12 -13 35 -75 28 -51 -182 21 -149 -40 -27 191 -60 -127 72 -121 -53 90 -120
1540 -120 130 -59 -139 -3 -267 -141 -218 93 34 -129 66 -75 -55 -98 113 76 -3 -122 25 183 -259 -47
1562 -47 -98 -38 -98 116 100 106 -63 -166 12 35 -78 98 -128 6 64 -51 -24 97 93 36 39 33 -38 238 -52 194
1588 194 -133 91 40 -41 -155 65 -19 -61 131 130 -148 -80 -237 -14 92 124 -23 -92 -7 164 43 30 28 -4 85
1613 85 74 66 -235 -59 122 -130 -18 80 -77 -145 -113 132 60 66 186 -62 -41 -115 -118 -112 104 121 -88 33 -27 -33 192
$$ packed form
1445i1J43j28j22J08N8M2J08p4rj79n6J90J54P1l02Q8Q1n7r7N6j1q3J84k10J45
1470IJ60k55J02K04m33J48K7K23k43K00j90J2k2j02J41O9j60K7P5k6l3N2q4J52
1494E3J4o1j21J27j2J80j19J38o7k63J48j52J37Q4K4k32J38N3J00l43K60l74J77
1517a11L0K05m4k01J33k5M8j10J03p9j31K03j70J09J3K18k51o7J99j93O8J43k10
1540a20K50j89q0J36k64J26p7L11n9j63J95j41K0m3K11l7p9j19J47J58m42K12
1562d7n1O0o0K14j6Oj69j03J78K3j13J76k26J34N8j15K7J21mn7Lop1K76k90K46
1588A94l27K24n1q1j14K20q4m2J92jk78O8j57K23J06L2j47o9Q5J71j21j3kl2Q9
1613H5j1ql01J76J81k52J12R8j57o8L2K45p2OJ20k48K1p4lOK16J7k09J21o0oK25
$$ plain form
1640 192 179 73 106 -73 57 144 0 -300 -47 69 -156 -144 130 116 11 50 -82 98 -31 139 99 161 -43
1663 -43 177 -80 187 162 -141 97 63 40 -243 120 140 28 -174 34 52 215 68 -72 -21 129 45 -11 148
1686 148 -126 126 -52 92 -24 78 154 18 -70 -11 93 96 69 -21 93 -39 -59 -70 59 12 142 37 -52 -149
1710 -149 80 32 -147 -97 -69 186 108 -81 -97 -220 -54 40 -166 -16 212 -54 -28 -62 264 -153 -15 -20 40 151
1734 151 153 97 52 88 -183 98 -68 104 -209 -35 71 -44 52 36 84 -71 29 -45 154 11 49 -141 -56 166
1758 166 -30 -170 80 -22 -1 48 -6 40 -75 -141 -93 80 -232 27 139 8 3 86 -43 -46 37 -56 200 53
1782 53 29 -7 -26 -170 82 108 27 -89 -105 74 20 -132 -57 -301 159 -186 271 53 -138 72 18 117 -89 199
1806 199 39 121 25 -159 -33 66 -72 43 -109 42 76 -12 -143 -60 109 110 32 -3 -70 49 59 -59 24 -82
$$ packed form
1640A92j3j06L3j79J30Q7j44l00K53J16k25J2K74j4j05L9j32J80j29J70m0O2k04
1663d3K20k57K67k5l03K38l4k3k83L63K0j12k02K08J8J63j47j40N1J50q4n6J59
1686A48k74K52j78J44j16J02P6j36q8N9J04Lk7r0J14j32k0j1J29m7J30j05q9r7
1710a49K29m8j79N0K8K55p8j89j6j23J66R4k06J50K28k66K6l4L26m17J38nO0J11
1734A51Kn6m5L6k71K81j66J72l13J74J06j15R6j6M8j55J00p4J99j43L8j90Q5K22
1758A66j96j40K50j02K1M9n4M6j15o6M8J73l12K59J12j31nQ3j29lQ3r3K56j47
1782E3k4l6j9j44K52K6q1j16j6J79n4j52P5k44M60l45M57k18j91K10n4R9k06K88
1806A99j60Q2r6j84J26R9j38J15j52J51L4q8j31Q3J69Jp8l5o7J19J0j18Q3j06
$$ plain form
1830 -82 117 7 -79 -6 101 110 -76 5 21 -62 66 162 205 124 -84 23 14 -41 102 72 96 71 -225 56 9 92
1856 92 -38 -283 -90 -120 -43 -44 -5 -20 -74 -30 -166 40 57 -49 -126 -190 -25 174 -116 -93 134 -15 19 -202 -110
1881 -110 62 133 135 -53 -214 149 28 -91 49 43 -56 39 122 -81 12 -229 -4 -66 26 -31 -92 -41 62 34 -93
1906 -93 -69 87 -97 45 38 94 -4 114 5 -24 43 -185 -210 -66 11 -59 -53 114 94 1 96 61 96 237 226 -214
1932 -214 205 10 -169 90 -136 -146 -78 -28 123 179 -190 89 -58 -39 163 188 80 -50 24 118 59 124 -134
1955 -134 -62 37 66 -28 -268 330 102 -117 85 -42 -38 -85 92 156 296 9 104 -196 -73 -4 38 60 -148 -164
1979 -164 6 -25 86 124 194 44 39 57 289 119 -67 -108 -145 112 -162 -95 -216 -91 85 110 -58 57 78 14
2003 14 69 -9 -17 -60 -93 152 -135 91 34 -91 148 165 53 19 36 -13 120 96 117 73 -8 -181 36 -16 -7 165
$$ packed form
1830h2J99j10q6P3J07Rj86Q1J6q3J28R6M3q1k08J07rn5J43l0K4k5k96K81m7Q3
1856I2j30k45J93l0P7jL9j5n4M4j36K06J7j06p7o4J65J99k90K3K27j49L4k21R2
1881a10J72P1Kj88j61L63j21j19J40or9R5Q3k03R3k41K25o2R2n7o1N1J03k8j27
1906i3K4J56j84J42pN6r8J18j09k9O7k28k5J44P7p0OJ67k0r3R5l5L5J41j1m40
1932b14M19j95j79K59k26j0O8N0J51N6l69K79j47J9K02K5j08j30P4R4n9O5k58
1955a34P2R9K9r4k40N98k28k19K02j27Mm7J77O4J40k87R5l00J23O9M2K2k08j6
1979a64J70l1J11L8P0j50nJ8K32j70j86m1l7K57k74O7j21J25J76K5j68J15K1o4
2003A4N5p8qm3l3K45k87K26n7j25K39J7j12l4J7m9J33k4K1m4q1j73K17n2RJ72
$$ plain form
2029 165 -82 11 -90 14 171 -132 -83 -37 -85 -14 -95 -107 39 -175 -41 -90 42 -20 -5 -176 -112 -137 -2 120
2053 120 125 -43 184 12 -145 187 -13 -42 38 -149 101 260 143 -92 -157 252 132 -77 -31 53 -80 8 -32
2076 -32 183 -33 60 -43 -76 84 -71 -144 98 -200 109 -49 192 48 246 -23 -166 -159 -55 -59 7 31 154
2099 154 46 16 60 -140 199 -20 22 -91 -121 31 57 -90 256 88 34 -1 5 -53 123 -25 28 103 -143 160
2123 160 6 165 127 77 6 20 -116 216 -63 -263 -50 -49 -93 -83 -57 16 -153 269 114 194 -1 -174 170 0
2147 0 27 -101 -73 -157 107 57 0 222 -219 133 114 -110 44 -42 150 -48 64 -24 -42 -126 -214 102 37 -11 3
2172 3 82 -164 62 129 -32 -168 -28 -168 110 -18 18 41 -91 -47 44 7 -25 -154 32 86 16 21 136 -31 -54
2197 -54 39 31 191 312 -71 -173 161 -56 51 74 29 -18 -51 199 117 48 -10 -92 42 20 -157 -7 19 231 89
$$ packed form
2029A65k47R3j01J04J57l03M9M6m8P1q1j2J46k14J34m9J32o2J5j71O4k5J35J22
2053A20Nj68K27j72j57L32k00k9Q0j87K50J59j17k35o5M09j20k09M6Q4j33Q8m0
2076c2K15k16R3j03l3J60j55p3K42k98L09j58K41j44J98k69j43PJ04mO6K4J23
2099A54j08l0M4k00L39k19M2j13l0J52K6j47L46j68n4l5On8J76j48N3P5k46L03
2123A60j54J59l8n0p1J4j36L32k79k00K13Jm4J0K6P3j69M22j55Q0j95j73L44j70
2147@K7j28K8q4K64n0n7K22m41L52j9k24J54q6J92j98J12q8j8q4q8L16o5m8J4
2172CP9k46K26O7j61j36J40j40K78j28L6K3j32M4R1l7l2j29J86N4p0NJ15j67k3
2197e4R3qJ60J21l83j02L34k17J07K3m5m7l3K50q2o9n8q2J34k2j77J50K6K12j42
$$ plain form
2222 89 145 49 29 22 -281 -63 -57 55 -104 -32 87 99 -8 -137 -48 -7 -160 207 -10 268 77 -182 33 144
2246 144 -51 39 35 -139 96 -55 -71 54 135 9 125 -43 73 42 80 12 -54 -217 32 156 0 -11 -20 -32
2270 -32 -98 136 -7 109 -11 6 98 -186 -17 -61 -74 -22 -278 -282 42 113 80 -29 109 -153 77 -60 -2 31
2294 31 -35 5 -88 -248 -115 84 95 38 -34 -5 55 -127 -286 9 -236 1 157 -58 36 -73 -79 -24 -41 -221 -95
2319 -95 -331 -85 -18 112 -35 -2 44 -153 2 13 11 23 87 -33 -58 -62 18 -133 14 -9 17 -24 120 143 -69 59
2345 59 -57 -115 -87 21 114 -74 167 -38 -41 -79 42 76 -33 109 178 71 -4 -4 -54 -64 -185 55 103 -5 224
2370 224 -72 143 -83 20 -80 -207 -50 -96 8 3 -116 95 48 -81 105 -39 -16 20 -133 13 -64 -34 -96
2393 -96 -24 139 -88 69 -147 -21 136 278 108 -25 -118 79 -31 -197 151 10 79 -78 91 180 59 77
$$ packed form
2222H9N6r6k0pl03K18OJ12j59P2J19J2j07j29Q9M1j53L67k17K78j91k59K15J11
2246A44j95R0mj74K35j51j6J25Q1j26J16j68J16l1L8o8o6j63K49J24j56j1rj2
2270c2o6K34j43J16j20J7R2k84J69m4j3N2k56mL24P1l3j09J38k62K30j37N8L3
2294C1o6M0r3j60J33J99J1n7p2K9O0j82j59K95k45K37J56k15R4j09oN5j7j80J26
2319i5k36K46O7J30j47L3M6j97J55J1kJ2O4j20k5mQ0j51J47k3K6m1J44K3k12J28
2345E9j16n8K8J08R3j88K41k05ll8J21L4j09J42O9j07p5%n0j0j21K40M8j08K29
2370B24k96K15k26J03j00j27J57m6J04nj19K11m7j29J86j44K3L6j53J46p7L0o2
2393i6P2J63k27J57k16J26J57J42j70j33r3J97j10j66L48j41O9j57J69Q9j21J8
$$ plain form
2415 77 -115 35 48 198 59 184 4 -76 -116 175 10 48 -1 133 135 -25 -48 -144 62 17 -111 -24 203 91
2439 91 30 88 -148 8 200 -53 -52 -293 129 136 55 45 134 -272 65 43 34 57 -66 65 138 -299 -72 151 134
2464 134 179 -161 80 181 -215 100 -49 -87 -15 0 -101 -91 -133 -109 86 -18 41 356 116 23 47 -154 -52
2487 -52 38 20 -20 123 7 79 48 28 -23 -183 151 3 47 68 8 30 70 82 25 -237 -12 -39 99 163 -103 54
2513 54 129 -111 -143 20 -11 -76 125 97 -6 -55 -139 60 -115 30 251 -36 90 10 -72 106 49 24 70 4 43
2538 43 8 -27 -32 32 -37 62 -6 -37 -134 -81 155 -55 259 67 58 48 -144 45 -124 177 102 244 141 75 -23 116
2564 116 -31 -27 120 -46 -119 17 114 169 -33 55 122 -166 -126 33 -80 -163 65 85 -4 92 105 -70 140 -147
2588 -147 -18 227 123 -72 83 -9 36 -40 -108 8 -472 -89 46 -76 100 11 70 60 56 55 179 -139 43 39
$$ packed form
2415G7j92J50J3J50j39J25j80q0m0K91j65L8m9J34Kj60k3r6K06m5j28Q7K27j12
2439I1o1N8k36J56J92k53Jk41M22Pq1j0Q9m06L37k2rK3j23J31P3m37K27K23j7
2464A34M5l40K41J01l96L15j49l8P2J5j01J0m2K4J95j04N9L15k40r3K4k01J02
2487e2R0j8m0J43j16P2l1k0n1j60L34j48M4K1o0K2M0J2n7k62K25k7J38O4k66J57
2513E4P5k40l2J63l1o5K01k8j03m9q4J99j75J45K21k87J26q0q2J78n7k5M6o6L9
2538D3l5l5nO4o9R9o8l1r7N3K36k10L14j92rj0j92J89j69L01p5J42j03o6r8J39
2564A16j47MJ47j66p3J36R7N5k02Q8O7k88M0J59j13q3K28K0q9R6J3j75K10k87
2588a47J29K45j04j95J55r2M5p6o8J16m80L83J35j22J76q9N9j0mjJ24l18J82m
$$ plain form
2612 39 53 78 53 -159 76 -178 -103 22 -49 -37 29 90 33 41 -82 -11 -41 -11 43 148 217 118 29 102 -168 -57 -183
2639 -183 45 -131 -3 73 -1 137 -142 -51 -208 14 119 -75 -139 -58 99 108 130 -109 -74 -37 -35 -18 59 94 6
2664 6 50 -152 -7 -215 155 -51 105 -101 -122 -60 -181 94 138 92 50 -15 -113 -51 66 139 -43 -91 10 122
2688 122 -79 -56 0 -31 33 -52 90 65 -30 -30 98 38 -51 -2 85 -12 15 0 -202 209 75 -133 97 -194 -88
2713 -88 -105 49 -87 20 -81 -24 -232 -137 187 -47 16 -152 163 107 -118 -24 -145 78 -51 70 -32 -201
2735 -201 115 56 -5 107 37 -120 -40 92 104 55 -86 -83 -74 193 176 6 -56 -18 3 148 78 20 180 -97 114
2760 114 -209 -83 -63 -137 44 59 -81 52 201 202 205 39 -43 99 135 -63 27 -17 138 -54 -46 93 271 -11
2784 -11 3 43 130 -146 54 16 -125 -175 -171 19 -88 -34 -139 34 21 26 118 89 92 1 -37 -47 -101 -222 81 180 193
$$ packed form
2612C9J4K5k5k12K35k54P5J25p1J2O6O1n7Qj23P1l0L0N4J05O9r9q9P3k70J11j26
2639a83K28j76J28P6p4J38k79R1j57K22J05j94o4Q1J57RK2k39L5L7KJ7P7L5q8
2664FM4k02J45k08L70k06J56k06k1O2j21K75M4m6m2o5r8O2J17P3j82m8J01J12
2688A22k01K3N6l1O4q5J42k5r5%J28o0q9M9Q7r7K7j5k02M11j34k08K30k91J06
2713h8j7J54j36J07j01N7k08R5L24k34O3j68L15n6k25R4j21K23j29J21j02j69
2735b01L16n9o1J12p0j57Q0J32J2m9j41LRK67j7j70o2L8K1J45p0n8J60k77K11
2760A14l23J26K0p4J81J5j40J33J49JLj66q2J42L6j98R0m4J55j92QJ39J78k82
2784a1J4M0Q7k76K00l8j41n0MJ90j07N4j05J73j3NR2k9Lr1l8j0n4j21L03R9J3
$$ plain form
2811 193 115 -5 -184 -128 96 -5 25 26 58 11 -21 -37 79 -9 -24 62 -12 21 -82 -179 148 -19 -68 -59 -9 -17 -84
2838 -84 31 -53 43 -119 -7 -52 -13 -147 -85 27 -33 -67 -20 69 80 227 45 23 3 -41 142 -231 -103 34 -190
2863 -190 -65 223 -14 60 -257 24 37 -114 103 66 97 41 -145 -104 -17 83 -100 -106 -190 -153 108 48 -4 -100 -36
2888 -36 -4 -28 -88 -194 82 -73 26 -57 3 42 74 128 239 -91 138 273 -29 46 -39 191 107 79 -106 159 171
2913 171 104 239 15 -32 -108 -48 28 -157 25 126 56 -174 -16 53 -55 14 -65 8 266 -88 -189 -19 -99 39
2937 39 -16 -44 -74 88 7 18 -89 130 38 -165 81 -129 -28 138 -70 49 -106 -89 -116 7 168 45 134
2960 134 -13 37 -50 -164 58 70 -4 3 -47 -51 -88 74 5 -27 -28 104 -43 -136 3 69 228 -36 48 -58 -118 22
2986 22 -51 -39 200 -161 -144 46 36 209 165 -73 67 108 -117 342 101 25 -163 68 170 -2 -49 -121 154
$$ packed form
2811A93p8j20j79N6K24j01L0JL2m7l2j6J16q8j5Q6p4L3j03r7L27j67m9RN0qo7
2838h4J15q4R6j62J12m5L9j34O2J12o0l4M7Q9J1J47j82k2k0m4J83l73J28J37k24
2863a90J25K88k37P4l17K81J3j51K17l7L1n6j86M1Q7J00j83oq4L7K61o0n2r6O4
2888c6L2k4o0j06K76j55R9q3O0L9L2N4J11l30K29J35l02P5q5K30q4k8j85K65J2
2913A71o7J35k24m7p6O0P6j85J82J01p0k30J58O9j08O9p9P3K58l54j01J70q0J38
2937C9n5k8l0J62q1J1j07K19r2k03K46k10J01J66k08J19j55J7k7J23J61j23Q9
2960A34j47N0q7j14K22J2p4Pn0ml7J62o9l2jJ32j47r3J39O6J59k64Q4j06o0J40
2986B2p3J2K39l61J7J90j0J73m4k38J40M1k25M59k41p6j88K31J02j72m7p2K75
$$ plain form
3009 154 173 -78 -67 39 -172 1 -88 124 -230 24 61 -35 38 21 -121 -50 1 -46 313 90 -58 45 116 187
3033 187 -150 185 142 -67 21 -102 -5 74 -85 -42 53 -112 -123 -42 -75 -71 17 61 28 82 171 54 -30 -336 -100 166
3059 166 -231 -56 -10 26 -1 -167 69 -87 54 16 -113 -120 201 72 -155 -144 -87 113 23 -34 61 154 -7 -31
3083 -31 -15 84 114 -88 63 -88 -38 -73 49 197 31 32 -99 -139 -3 45 46 -108 53 -22 -22 1 140 -117 -92 -62
3109 -62 -157 207 144 -87 138 -18 -14 -94 -47 117 -136 -1 34 -150 129 -120 -178 164 51 126 118 -155 46 -15
3133 -15 31 96 125 -111 108 -26 -135 -59 -166 211 25 132 -86 13 -81 -55 64 -13 -21 18 1 40 90 43 46 25
3159 25 9 99 204 248 246 101 12 -53 146 -48 68 -108 -236 75 151 -32 14 -229 66 0 89 -102 39 -34
3183 -34 -74 -116 -197 49 -73 -6 147 -23 113 97 154 3 101 -16 -63 -64 -66 51 -200 109 25 -126 -25 62 43
$$ packed form
3009A54J9k51J1J06k11J73q9K12l54K54L7r6P3j7j42P1N1m7L59k23j48J03P1P1
3033A87l37L35m3k09Q8j23R7P9j59M3R5j65j1Q1l3MQ8M4l3N4Q9j17q4l06K36K66
3059A66l97J75M6L6k7j66K36j56J41l8j29pL21j29k27J1N7K00r0n7R5R3j61k4
3083c1J6R9L0k02J51j51N0l5J22J48j66Jj31m0J36M8Jj54J61p5%K3J39k57K5L0
3109f2r5L64o3k31K25j56Mq0M7J64k53J35L5j84K79k49n8L42j13P5qk73K01o1
3133a5M6O5K9k36K19j34j09P6j07L77j86J07k18R9r4K6J19p7qL9j7L9N0m7Lk1
3159B5j6R0J05M4kj45q9o5J99j94J16j76j28L11P6j83M6k43K95o6Q9j91J41p3
3183c4m0m2q1K46j22O7J53j70J36j6N7j51R8j17m7jkJ17k51L09q4j51J01Q7j9
$$ plain form
3208 43 -313 103 -73 -62 213 9 43 -177 -124 -203 70 -120 -42 79 -105 -123 -3 70 -61 110 -48 -112 139
3231 139 -149 19 64 91 -211 -66 204 224 204 -170 -279 178 221 -221 55 -1 -79 31 50 -175 -43 10 65
3254 65 -101 -25 -146 -23 30 -10 -49 -1 76 -61 -58 -42 -68 130 -235 107 78 -79 -150 -37 165 20 29 55 162
3279 162 -35 -64 100 -46 105 58 -34 -15 -160 -23 173 -52 73 29 -69 -19 136 107 -114 10 54 51 -80 170
3303 170 145 5 48 -87 88 2 -100 81 -25 -103 -120 75 207 25 -183 -28 154 -114 115 101 20 39 -14
3326 -14 -161 -97 218 -99 119 67 77 -190 191 -20 -57 194 -52 69 -155 50 -2 2 -31 -149 94 -7 74
3349 74 -168 136 101 -106 -96 -11 151 13 -29 -64 -73 -61 49 -76 -120 -161 -95 0 57 235 38 -145 199 20 -212
3374 -212 -21 -129 -64 9 -11 91 -171 -187 -125 48 66 -136 -186 -81 -191 170 134 -136 -25 -5 -57 -8 123 -79
$$ packed form
3208D3l56M16j76J1K75k04L4k20N3p9K73j90P8J21j84j8J20P3j31J71j58o4K51
3231A39k88J68M5K7l02J45K70K0k0l74j09M57M3m42K76n6p8J10J9k25J32N3N5
3254F5j66P6j21J23N3m0l9M8P7j37LJ6k6J98l65L42k9j57p1J13K02j45RK6J07
3279A62j97k9J64j46J51m7r2J9j45J37J96k25J25m4r8N0J55k9k21J24M4lj31K50
3303A70k5j40M3j35J75q6j02J81j06p8j7J95J32j82k08J55J82k68K29j4q1J9n3
3326a4j47O4L15l17K18n2J0k67L81k11l7K51k46J21k24K05n2Ml3j18K43j01Q1
3349G4k42L04l5k07J0Q5J62j38m2l5rJ2J10j25m4m1O6R5N7J78j97j83L44j79k32
3374b12J91j08O5P3k0J02k62j6O2J73J8k02n0J05j10L61l6k70J11K0n2M9J31k02
$$ plain form
3398 -79 -66 154 -85 11 141 242 45 37 0 -138 -16 -73 57 -108 32 -97 75 43 159 -42 116 200 -197
3421 -197 -97 -174 -169 37 -73 -66 31 40 29 -118 79 138 72 -79 -67 64 159 -34 163 -179 -77 -109 36 -91 38
3446 38 19 25 -134 191 108 18 -157 56 168 162 -188 46 -56 53 132 -220 27 -15 74 -23 253 54 150 -82
3470 -82 65 -100 -57 84 37 -44 -124 16 15 7 231 -89 121 23 -38 -97 95 8 7 169 -79 74 83 21 -101 14
3496 14 29 -116 100 -1 35 -41 -168 -68 -63 -97 -113 -24 101 27 12 -22 -151 -165 56 -79 159 122 -106 220 -21
3521 -21 -48 118 170 27 95 32 -24 -97 83 -188 -94 -125 -24 -21 -72 -42 114 55 -7 -141 -54 -8 130 106 -64 190
3547 190 -101 -198 -6 102 -133 -201 -97 -94 20 1 -63 -2 -129 -33 -21 207 20 -91 92 -92 259 -37 20
3570 20 86 12 3 37 0 -43 -34 -54 -209 30 206 -46 -6 48 -64 -109 37 27 128 -85 -177 -36 146 4 79 17
$$ packed form
3398g9J3K20k39R6J30J01j97ql7j38J22n7J30j65J40j29J72l2J16k01J58Q4l97
3421a97J00p7NK06j10PR7Rj1j47J97N9o6j51J2J31R5j93J97l42J02l2J45j27J29
3446C8j9Oj59L25q3r0j75K13J12ol50K34j02J09P9l52K47m2Q9r7K76j99R6k32
3470h2J47j65M3J41m7q1q0J40jqK24l20K10r8o1n9J92q7jJ62k48J53Ro2j22J15
3496A4J5j45K16j01L6p6j27J00Nl4j6Q9J25p4j5l4j29j4K21j35K38l7k28L26k41
3521b1k7J66N2j43O8o3n6p3J80k71R4l1J01Ln1L0J56n9o2j34Q7M6J38k4j70K54
3547A90k91r7J92J08k35o8J04LJ14j9o4O1j27R6J2K28j87j11J83j84L51k96N7
3570B0O6p4rL4l7m3Rk0j55K39J76k52M0N4j12m5J46j0J01k13r2J41J82j42P5o2
$$ plain form
3596 17 15 198 -64 -73 7 31 220 116 131 -105 -26 45 203 -329 -141 -144 63 32 253 28 284 167 94 45 -140
3621 -140 -34 -7 19 24 13 85 -6 8 41 -119 -142 -44 32 78 -35 156 -282 54 122 271 271 -76 28 93 13 -22
3647 -22 -4 -123 90 -10 -56 92 14 46 -8 -22 211 -46 -216 116 8 -15 37 -19 -183 21 182 70 233
3670 233 -65 66 -89 -83 257 -236 -40 197 60 73 138 9 191 122 -26 79 76 5 -39 14 -94 124 -144
3693 -144 37 316 162 27 102 1 10 130 79 -19 124 -268 -42 -61 -167 -7 -14 -67 -93 27 70 120 232 -13
3717 -13 84 -9 135 71 27 -184 -264 -10 -11 -18 -147 89 -161 148 40 57 -57 -111 33 149 10 9 -178 5 30
3742 30 -29 -12 129 2 -70 -54 -8 -13 -60 23 -99 30 19 13 -41 49 -34 -82 -26 42 -207 21 33 120 -40 8 64 -10
3770 -10 -37 144 -16 124 138 -47 -13 -87 119 3 -238 129 158 -3 16 187 87 62 293 90 -19 72 -27
$$ packed form
3596A7kJ83k62rQ0K4J89j04J5k36P9P1J58n32J88lK07l1K21k25K56j17p3m9j85
3621a40J06K7K6Nj1P2r1J4L3j60k3R8P6M6j13J91m38L36O8J49%l47J04O5q0l5
3647b2J8j19K13j00m6J48p8L2n4j4K33k57j70L32j08k3N2n6j64K04J61j12J63
3670B33k98J31j55OL40m93J96K37j37J3O5j29J82o9j48J05lp1m4N3j08K18k68
3693a44J81K79j54j35P5j01RJ20n1r8J43l92K26j9j06J60pn3k6J20M3N0J12k45
3717a3R7r3J44o4m4k11q0K54jpj29K36k50L09j08J7j14n4J44J16j39jj87J83K5
3742C0n9J7J41j27p2J6M6nm7Q3j22J29j1on4R0q3m8N6O8k49K28J2Q7j60M8N6p4
3770a0k7J81j60J40J4j85L4p4K06j16k41L67K9j61J9J71j00k5K31k03j09R1r9
$$ plain form
3793 -27 45 6 -234 -86 -303 -161 240 0 -32 62 -325 -56 26 -175 -81 166 -126 -107 73 75 40 125 -19 158
3817 158 62 -209 209 94 -15 -148 21 121 -233 -16 234 -143 183 -101 19 248 -238 -68 80 53 13
3838 13 -110 -24 -75 -5 95 1 -39 -18 -99 -157 -170 -29 -53 -38 217 -21 237 -124 -93 -243 155 -109 -7 162
3862 162 -273 168 127 4 76 193 106 -138 -65 -91 37 69 234 85 93 -238 -41 -119 -83 -13 -187 -193 104 49 -128
3887 -128 -94 47 217 111 60 -16 -48 41 13 -17 9 -29 -233 82 -145 4 194 -128 92 94 151 92 -88 -67 -106
3912 -106 221 12 106 74 -60 62 133 -61 114 82 89 40 149 171 -100 65 -81 -17 -99 57 96 172 -122 218
3936 218 22 -90 30 176 -165 -79 -3 68 123 33 -183 49 61 -89 -121 72 -105 97 -132 77 26 137 163
3959 163 7 126 41 -25 -113 49 -165 101 -1 70 -46 99 -139 -8 -365 -4 -57 85 63 47 -70 56
$$ packed form
3793b7P2l9k40J48k17J42M01k40l2R4l87K69Q2k01R4K47k92J9J80Kl5Q5j44J77
3817A58r6k71M18j15j09j33J69J00l54K17K50l77L26k84J20K29m86J70J48k7m0
3838A3j23Q6n1P0J00r4m0K1q1n8j3J41k4J5K55k38K58l61L1j50L98k64J02J69
3862A62m35M41m1j23P2J17q7k44P3k6J28L2J65j49Ql31J97p8L6P0j74oK97n5j77
3887a28L4J41J70j06n1p6l2Q9k8l0K6l8k04L15k27J49J90l22K20KN7n9j80K1l9
3912a06L27k09R4l2j34J22P1j94J75l2Pm9J09K2k71J65j46O4q2J56L9P6k94L40
3936B18j96j12J20J46l41Q6P6P1N5r0k16K32J2j50l2J93j77K02k29K09n1J11K6
3959A63j56J19q5o6q8J62k14K66j02P1j16J45k38J31l57L61n3J42k2j6j17J26
$$ plain form
3981 56 33 39 80 -162 -93 185 79 97 166 -129 7 -109 -30 -75 1 -78 95 356 -16 -59 -9 -90 -28 -135 104
4006 104 147 14 -50 68 62 86 269 67 -33 124 30 -20 -145 -76 30 187 18 -48 183 3 -2 120 138 160
4030 160 56 -33 -24 -32 187 -45 -205 29 -41 66 82 -4 -32 78 -122 12 95 -88 49 -36 -75 105 9 -32 -196
4055 -196 -208 -13 34 39 -34 53 77 -191 -63 178 82 -124 -137 -161 236 62 -166 -181 -61 -110 131 127 -89 4 69
4080 69 26 172 -103 -191 61 -143 82 13 54 -109 -12 -49 -126 17 -163 -13 -113 -46 214 -171 -106 -23 116 -213
4104 -213 5 249 -4 -19 -10 -2 32 76 -132 -9 -87 62 213 270 -152 -278 87 -22 47 -93 -43 -129 100 -11
4128 -11 35 119 36 82 -14 146 111 -27 -220 11 255 -79 -193 162 -65 2 -82 91 -99 102 12 -26 88 -56
4152 -56 -168 170 46 57 201 -142 -246 -170 59 -103 -143 -64 35 99 -74 80 81 -46 -76 18 -111 16 -64 35
$$ packed form
3981E6k3OM1k42O9K78j06J8O9k95J36j16P9m5P6p9J73K61l72m3N0q1O2j07K39
4006A04M3j33o4J18oK4J83k02j00J57r4n0j25O9J06J57j69o6K31j80nJ22J8K2
4030A60j04q9RqK19k32j60K34p0J07J6q6k8J10k00J34Q3j83J37q5l9J80r6m1j64
4055a96j2J95M7Np3Q7K4k68J28K41r6k06j3k4L97j74k28j5J20m9K41mk16R3O5
4080F9m3J46k75q8K52k04K25o9M1j63R7l7p7J43j80J50j00O7K60l85O5Q3J39l29
4104b13K18K44k53j5RQL4M4k08J23p8J49J51N7m22j26L65j09O9j40N0q6K29j11
4128a1M6Q4q3M6r6J60l5j38j93K31K44l34j14L55k27O7q4J73j90K01r0l8J14j44
4152e6j12L38j24J1J44l43j04P6K29j62m0P9R9O4j73J54Jj27l0R4j29J27q0R9
$$ plain form
4176 35 38 4 -45 10 234 37 77 -87 -146 72 -16 -13 122 11 209 8 93 -13 -184 -17 40 -41 126 27 4
4201 4 134 -22 179 -35 -161 73 -40 120 -49 -185 -21 91 -105 251 29 -44 68 -4 272 -81 174
4222 174 135 7 66 -65 37 0 188 71 74 -54 100 113 39 -36 -216 -22 41 -59 -32 -76 51 -221 -68 49
4246 49 28 -78 -7 -147 -35 -55 51 28 -23 142 74 25 27 -5 -90 2 166 -10 175 41 -43 -12 97 67 112 131
4272 131 68 -210 -110 -52 -68 -60 108 -5 -176 145 -68 55 -55 30 -68 -118 65 116 -85 133 38 -115 51
4295 51 -7 156 -4 35 221 118 97 -178 101 134 -81 45 -215 -62 83 -290 83 -25 -133 -107 28 -183
4317 -183 0 -42 170 -56 -153 -35 168 270 -193 119 114 264 -106 0 75 -110 85 148 -80 -70 12 -25 44
4340 44 162 -28 123 -74 38 38 -138 -71 82 -97 -4 -186 106 71 -15 92 21 43 228 131 132 50 -234 -163 -30
$$ packed form
4176C5Ll4m9N5K24j97M0j64n9K18q8LJ35j11J98k01Q5j06j71J67N7q1J67r9k3
4201DJ30j56K01k14j26K34j13J60j69j36J64J12j96L56k22p3J12p2K76l53K55
4222A74l9j28N9j31J02l7J88j17Lj28J54J3p4p5j80J94O3j00K7m4J27k72J53J17
4246D9k1j06P1j40J12k0J06k3n1J65o8m9Kl2q5R2J64j76J85j34q4L1J09l0M5J9
4272A31o3k78J00N8j6QJ68j13j71L21k13J23j10Q5r8n0J83N1k01K18r5j53J66
4295E1n8J63j60L9J86j03k1k75K79L3k15J26k60J53J45l73L73j08j08K6J35k11
4317a83J83m2K12k26r7J18K03J02m63L12nJ50l70J06P5j85J95O3k28J0Q2l7O9
4340D4J18j90J51j97J12%j76O7J53j79R3j82K92l5q6J07p1K2J85r7Jq2k84P1J33
$$ plain form
4365 -30 -96 110 164 -102 -149 159 -117 -323 -124 58 90 51 11 -405 87 166 106 -49 145 -14 195 -65 118
4388 118 86 152 20 46 138 -37 -167 57 -256 29 163 29 -76 51 132 -67 -139 -131 26 -57 -15 105 67 19
4412 19 34 -103 79 -19 -18 -74 -289 73 31 -39 -19 -421 -109 -29 154 104 133 -68 -34 19 87 58 150 -67 70 100
4438 100 -102 58 71 38 203 -52 -95 -6 7 46 79 23 -88 -71 55 140 -51 50 61 -163 32 -53 57 -61
4462 -61 22 66 -154 -105 24 -160 73 120 41 118 -315 190 113 11 79 38 2 107 84 -333 -286 -16 37 -37 -177
4487 -177 88 -45 1 -155 54 -129 -126 -11 234 23 127 75 -194 -129 -179 3 -125 204 -50 -183 104 57
4509 57 -85 -50 98 68 55 -48 -45 -141 -102 90 131 45 -5 86 -27 92 3 -45 67 -57 222 -151 -10 20 -92
4534 -92 -230 -55 -27 28 -139 -41 -92 -126 205 95 -153 147 85 6 -193 44 209 170 18 -54 131 61 -40 135
$$ packed form
4365c0o6K06N4k66m7L08k76k06J99J82L2l9m0m16M92P9o0j55J94j59K09k60J83
4388A18l2O6j32K6R2j75j30K24l13K85J34j34j05J27Q1j99p2QJ57q3M2J20l8m8
4412A9J5j37J82r8Jn6k15L62m2p0K0m02L12Q0J83n0K9k01L4N3O8k9R2k17J37L0
4438A00k02J60J3l3J65k55m3Q9J3L9L3n6j11J7J26Q5j91J01J1k24J95q5J10j18
4462f1Q3M4k20M9J29j84K33M7p9P7m33N05p7j02O8m1l6J05k3m17M7K70N3p4j40
4487a77K65j33M6j56K09j83LJ15K45k11J04n2k69O5n0J82j28L29k54j33K87m7
4509E7j42L5J48l0j3j03Lr6L9J92M1q6n0R1j13J19q9m8J12j24K79l73J41L0j12
4534i2j38J75K8N5j67R8n1l4L31j10k48L00o2p9j99K37J65l9j52p2J85p0j01J75
$$ plain form
4558 135 -102 95 -1 -194 -125 5 228 -70 60 -18 -61 -25 -93 83 34 318 -20 -91 -67 -24 139 -149 62
4581 62 -23 -100 -135 -132 26 49 -146 52 13 97 -158 -39 244 31 163 -46 -142 -38 -15 -163 -125 -12 -20 43 -145
4606 -145 -102 104 -6 -151 -168 93 41 191 -118 154 245 34 147 -80 251 -39 -65 10 -48 -189 -171 -56 88
4629 88 -65 -38 -224 -97 5 -44 4 -14 143 -18 100 210 -12 -107 -64 -17 -121 -17 60 -11 -35 -130 128 -24
4653 -24 -123 -97 -204 -84 -3 -98 -116 -82 -70 -151 -206 174 -54 -21 -72 -125 -40 -113 -3 -195 15 193 -44 146 6
4678 6 -120 50 154 76 -124 172 -148 -154 -76 -16 -21 -80 74 -171 -87 -19 -102 42 -54 176 -40 23 -48 240 -81
4703 -81 -28 -61 -111 90 -88 -46 -18 -46 159 -51 80 42 -89 76 50 34 36 -163 -183 157 -99 -154 152 -30 -189
4728 -189 13 -41 135 -33 -198 -48 26 -22 79 -38 98 -11 66 72 -41 3 -11 -101 -60 -12 -290 -71 -87 107
$$ packed form
4558A35k37J97r6j93O9J30K23k98J30p8m3L6o8J76m9K84l38p1K4M3J63k88K11
4581F2q5p7l5LJ58K3j95J98l9Q4k55J19K83k13J32k09r6J04K3j48L8J13qO3j88
4606a45M3K06j10j45j7K61n2J50l09K72R1k11J13k27L31k90k6P5n8j41J8J15J44
4629H8j53K7j86J27J02m9M8j8J57j61J18J10k22r5M3M7j04J04P7p1k4r5K58j52
4653b4r9K6j07J20Q1r5j8L4J2q1n5L80k28L3n1n3Q5p3J10j92K10J78k37J90j40
4678Fj26J70J04p8k00K96l20oP8O0nn9J54k45Q4O8q3J44r6K30k16O3p1K88l21
4703h1N3l3n0K01j78M2K8k8K05k10J31l8j31J65k6j6Kj99k0L40k56n5L06j82j59
4728a89K02n4J76j68j65J50P4m8J01j17J36j09P7Oj13M4j4r0M1M8k78K19j6J94
$$ plain form
4752 107 -142 -112 56 47 72 -43 82 30 126 88 42 34 133 -38 -28 -171 -86 101 199 -150 14 -140 175 171 93 245
4778 245 11 292 -2 -88 52 211 -3 83 95 19 -78 70 -134 101 40 124 -118 23 -165 211 -162 -36
4800 -36 -89 -61 -102 32 -61 1 284 -221 -54 98 -103 27 -41 92 -55 -85 21 -251 150 -57 -40 103 -27
4823 -27 -101 -255 162 142 -59 35 -99 -47 -116 -80 6 -44 138 437 -115 34 -26 -7 -35 -58 -7 -88 48 64 128 -135
4849 -135 -43 -22 23 -104 -157 -43 -107 -13 -95 -71 -128 12 -114 74 44 -11 -21 123 -12 98 5 49 -104 -59 -157
4874 -157 92 -65 14 -86 -107 -79 -3 45 -36 -9 41 64 -20 -86 -133 -46 6 139 -109 -118 -93 46 190 -89 -31 -119
4900 -119 132 -127 196 55 16 167 133 56 -66 166 -50 21 -80 84 -16 213 93 4 -48 28 -119 -1
4922 -1 33 -14 -87 -162 40 -91 118 86 -202 -54 -195 -89 83 128 2 -82 261 53 -90 7 113 -14 -74 -99
$$ packed form
4752A07k49L0J68rK5j15J25n2R6l8m6qR9j71J0j43Q5J87R8l49J64j54L15mp8J52
4778B45k34K81k94q6J40J59k14Q6J2p6r7J48k04K35o1Q4k42J41j88L76l73J26
4800c6n3K8m1J34r3O2K83n05J67J52k01J30o8J33j47l0J06k72M01k07J7J43j30
4823b7p4j54M17k0k01R4j34N2o9L6Q6n0J82K99n52J49o0J9k8k3N1q1J36J6O4k63
4849a35R2K1M5j27n3J14o4R4q2K4n7J40j26J88l0n5j0J44j35J10r3M4j53M5r8
4874a57K49j57P9j00k1K8P6M8q1K7N0K3q4o6m7Q7N2J33k48rK5J39J44k79N8q8
4900a19K51k59L23j41l9J51l4p7j22K32k16P1j01J64j00K29j20q9n2P6j47J18
4922aL4m7p3p5K02j31K09l2k88J48j41J06J72M5j26q4L43k08j43R7J06j27o0k5
$$ plain form
4946 -99 15 -139 -22 147 281 -27 -71 191 94 105 -49 23 -156 98 -70 167 -96 66 -66 18 -177 61
4968 61 -221 -32 -203 -39 79 -154 33 -62 -82 -30 -11 -101 -90 -29 -142 -45 -175 -134 77 -10 92 -117 -227 -241
4992 -241 75 -158 -36 -2 -30 -1 72 81 248 230 77 -72 54 -95 183 -75 -152 44 -52 50 27 -19 -112 70
5016 70 47 65 -197 40 127 -66 -26 94 71 57 -23 4 52 -3 91 67 66 -101 21 -70 -61 -7 -117 45 46 141 194 -174
5044 -174 -15 2 83 -111 78 -242 -93 101 57 179 179 89 -104 88 -142 151 -47 41 -9 -218 1 23 -4
5067 -4 109 -44 171 12 37 138 39 -256 43 -57 -70 -9 -49 -6 35 -34 -47 180 -94 -33 -166 -41 192 18
5091 18 -61 -145 -38 0 -128 -246 140 69 68 30 72 43 -123 -31 -92 -1 -31 127 42 150 98 -58 113 27 66 57 -123
5118 -123 92 -151 -88 -52 -132 191 185 38 11 138 -35 59 -143 -175 -91 44 228 124 -129 109 -46 129 -101
$$ packed form
4946i9J14j54J17J69J34l08m4K62r7J1j54P2j79K54j68K37k63J62j32Q4j95K38
4968F1k82J89j71J64J18k33J87r5k0N2J9r0J1O1j13R7j30M1K11q7J02k09j10j4
4992b41L16k33J22L4k8K9P3RJ67j8j53j49J26j49K78k58p7J96r6J02k3m6r3J82
5016G0k3J8k62K37Q7j93M0J20k3j4q0K7M8n5R4k4jj67J22r1RN4j10J62JR5N3l68
5044a74J59J7Q1j94J89l20J49J94m4J22%r0j93J92k30K93j98Q8n0k09K19K2k7
5067dJ13j53K15j59K5J01r9k95K99j00j3O1m0M3M1o9j3K27k74O1j33J25K33j74
5091A8p9q4J07L8j28j18L86p1jl8M2k9j66R2o1R1l0J58q5J08n2j56J71q6L9rj80
5118a23K15k43O3L6q0L23oj47k7J27j73R4k02l2Q4J35J84j04k53K38j55J75k30
$$ plain form
5141 -101 -28 175 64 157 -89 -70 -235 -29 119 22 18 79 -55 -151 -47 -36 208 -175 -12 -54 27 -151 70 65
5165 65 -135 80 -59 -56 135 -89 15 -59 -62 -61 -290 -140 15 31 53 -206 -127 -98 -64 83 -217 67 113 -148 0
5190 0 -114 37 -42 64 124 35 -86 -112 125 -32 59 -28 0 -151 -230 -89 -233 -104 -10 -108 -134 -23 53 -84 -87
5215 -87 -105 185 -60 -63 -166 -128 -20 -11 47 81 -261 30 -13 -126 68 76 104 41 -168 -116 -163 -24 120 76 136 92
5241 92 -63 117 -12 -58 54 214 30 -69 154 5 -61 -51 -51 92 -38 -84 -130 44 -80 78 175 144 -90 -128
5265 -128 -191 -50 146 -73 14 -96 -44 101 -247 -14 144 31 -15 -200 -8 -31 -75 10 -50 218 148 105 -6
5288 -6 55 -67 -77 -40 -218 113 20 5 47 -138 208 35 -30 14 -62 155 -87 -60 -87 28 79 -52 -98 35 -26
5313 -26 -124 41 145 -47 99 -36 44 -4 -36 -23 -77 49 -155 -50 75 152 44 79 -112 -64 62 -89 121
$$ packed form
5141a01P3K03j11R3k46J9j65K06J48r7mO1j34r6J04J1K44l83J63m2Q1j78K21n
5165F5k00K15j39LJ91k24J04p4lJk29J50J55J6K2k59P9K9L4J47l00K84M6k61J48
5190@j14J51p9J06O0q9j21k6K37j57R1q7K8j51p9J41j44J29R4r8k6J11P6j37l
5215h7j8K90k45lj03L8J08RN8L4l42K91m3j13J94QK8o3k09N2m7J39J44m4O0m4
5241I2j55J80j29m6J12J60j84r9K23j49o6J0%J43j30m6m6J74j24J58R7l1k34l8
5265a28o3J41J96k19Q7j10N2J45l48K33J58j13m6j85J92k3m4Q5o0K68p0m3j11
5288fO1j22j0L7j78L31r3j5M2j85L46j73o5M4p6K17k42K7k7J15N1j31m6J33o1
5313b6r8J65J04j92J46j35Q0m8l2J3n4J26k04J05J25P7j08L5j91M8J26j51K10
$$ plain form
5336 121 -43 105 73 49 -35 -83 205 -9 86 105 45 -198 2 187 19 47 -71 -50 28 -188 -59 -187 -11
5359 -11 154 -45 -160 -75 -89 -19 53 -243 -89 116 -110 12 -30 94 -60 106 43 -35 104 -149 -27 19 -56
5382 -56 -34 37 34 28 46 6 150 -87 -54 -27 17 -77 -6 27 -157 17 -153 -91 -57 63 -38 100 68 -111 -181 35
5408 35 -56 -2 -56 -30 110 32 -87 -5 -88 -82 125 -155 130 -29 49 6 -47 -19 -197 -163 -15 85 -22 -180 -54
5433 -54 2 124 -108 22 -126 -124 41 -146 41 -42 144 266 92 -114 38 -31 19 138 -50 1 89 -90 53
5456 53 325 -62 89 -55 -27 100 -23 217 79 18 -129 -144 -120 -17 47 43 -46 -3 -52 128 118 -116 47 -21
5480 -21 -12 214 -2 -52 50 -162 234 32 -197 -21 -38 -242 16 75 -45 120 -26 -22 192 -73 132 -17 -197
5503 -197 44 78 48 61 -61 -57 -260 98 -155 191 139 90 -51 -52 -52 116 2 -111 45 -168 -22 -68 -329 99
$$ packed form
5336A21j64J48l2k4q4m8K88k14R5J9o0k43K00J85j68K8j18K1P8k16J29j28J76
5359a1J65j99j15Q5j4P0P2k96J54K05k26J22m2J24j54J66o3p8J39k53J22M6p5
5382e6K2P1loJ8m0J44k37L3K7M4r4P1L3j84J74j70O2L4J20j01J38l2j79p0K16
5408C5r1N4n4K6J40p8j19Q2q3OK07k80K85j59P8m3n3K8j78L4J48J00j07j58J26
5433e4N6J22k32J30j48KJ65j87J87q3J86J22j74k06J52o9N0J19j88N1Q8j79J43
5456E3K72l87J51j44K8J27j23K40j38o1j47j5K4J03O4mq9M3m9J80j0k34J63o8
5480b1RK26k16n0J02k12L96k02k29J76j7k04K58N9j20J65j46MK14k65K05j49j80
5503a97K41L4l0J3j22Mk03L58k53L46n2m9j41j%J68j14j13J56k13J46m6k61M28
$$ plain form
5527 99 4 -54 295 -161 -25 23 177 54 -15 141 -135 -48 93 -40 -64 88 50 -98 208 56 195 -94 -97
5550 -97 70 129 221 -165 -90 47 67 4 66 107 -11 139 -11 -214 -8 16 125 28 38 -43 -55 -74 -245 6 -40
5575 -40 -14 -21 14 105 50 186 143 -80 -175 20 -285 -24 -40 117 24 112 -243 4 51 40 -69 -51 125 -198 -151
5600 -151 73 31 141 224 -46 65 -106 9 102 30 118 -27 -98 -101 92 86 119 28 35 117 -69 -274 22 -100 -22
5625 -22 -77 -3 -17 225 282 327 131 -88 245 1 -100 61 -2 -43 -7 -18 271 24 85 -43 39 -5 -182 -120 -95
5650 -95 139 104 203 -45 241 -46 19 128 -38 29 21 27 35 255 9 -38 -8 -68 -159 84 -207 -195 -76 92 -49
5675 -49 49 71 -230 -54 70 326 20 -219 27 4 -172 134 -34 156 -13 47 17 -44 130 -35 -265 201
5697 201 -215 55 -51 -68 40 -30 -83 60 -72 102 14 255 23 36 14 109 -199 102 -129 -64 51 -116 -152
$$ packed form
5527I9r5n8L49m56J36M8J54j23o9J56k76Q7J41j33k4J52l8j48L06j52J39k89l
5550i7J67N9R2l86P5J37K0o3O2M1j18J50j50k03K06K4J09r7J0q1j2j9j71K51m6
5575d0K6pL5R1n5J36m3k23r5J95l05K61j6J57r3Q8l55K47M7j1j09J8J76l23M7
5600a51K24m2J10Q3k70J11j71J15R3p2Q8j45p1lJ93oL3r1PQ2j86k05K96j22P8
5625b2n5P4j4K42N7M5j96k19L33k44j01J61o3m1L6j1K89k47O1j28Q2m4j77O2K5
5650i5K34l5R9k48K86k87O5J09j66O7qOQK20k46m7L0o0r1K43k91J2J19J68j41
5675d9R8K2l01J76J24K56l06k39K46k3j76L06j68J90j69O0l0o1J74j65k30M66
5697B01m16K70j06j7J08p0n3J43j32J74q8K41k32J3k2R5l08L01k31O5J15j67l6
$$ plain form
5720 -152 -21 -56 49 -176 -46 58 93 -36 49 -66 -54 -123 67 35 50 113 226 -148 -71 -24 13 43 -107 41
5744 41 -36 187 -178 48 82 -48 -109 51 106 28 -190 -20 -42 47 -155 72 33 39 -164 -171 34 -231 -109 -126 -113
5769 -113 -25 16 -61 -26 -64 -47 52 -7 70 -13 54 343 62 101 -46 76 122 31 149 134 328 -167 2 88 11 9
5795 9 -91 -7 -59 13 -85 -67 -85 -38 -121 43 -151 -29 121 -53 226 -33 175 -158 4 -32 -75 -16 187 0
5819 0 -81 -23 97 106 65 463 -24 54 28 17 17 -11 -7 -45 220 -120 -26 -26 115 -85 -37 116 -88 110 72 -90 73
5846 73 118 -58 -106 -206 -15 -48 81 163 156 -22 160 16 -77 8 3 -54 73 99 -91 20 321 20 -119 133
5870 133 -40 -135 33 5 33 -76 -128 70 -8 -47 250 22 77 34 -78 65 -155 134 34 -55 3 148 -213
5893 -213 41 123 22 253 -56 156 -16 119 -29 -89 113 -43 53 146 -20 -44 228 -20 -95 103 -32 9
$$ packed form
5720a52J31l5J05k25J30J04L5j29Q5j15J2o9J90l2J5O3J13l74P7M7L7L0j50J48
5744D1p7K23l65K26L4j30o1J60N5p8k18J70k2Q9k02K27l9Ok03pK05k65J22j7J3
5769a13Q8M1p7L5l8J7R9n9P7q3O7K89k81L9j47J22M6r1J18j5J94m95J69Q6p7k
5795Ij00Q4n2P2r8J8j8M7q3J64j94J22J50j74K79k59K08l33J62l6m3N9K03j87
5819@q1N8J20Rm1L98m87P8k6j1%k8Ml8K65l40R4%J41k00M8J53k04J98l8j62J63
5846G3M5j76m8j00J91l3J29Q2pj78J82j44r3Q5nn7J27K6j90J11L01l01j39K52
5870A33j73r5J68k8K8j09n2J98p8l9K97k28N5m3j12J43k20K89j00q9N8J45l61
5893b13K54Q2j01K31l09K12j72J35j48o0K02j56R6R3j66k4K72k48p5J98j35M1
$$ plain form
5915 9 65 70 -51 -75 25 64 -188 22 -67 -92 288 82 -107 -13 -30 49 -8 -182 -98 84 -112 -339 -147 -93 82
5940 82 -60 235 -59 2 271 10 -39 66 -21 -112 33 -39 -16 -108 97 110 -139 69 -33 264 23 80 193
5963 193 103 -60 -277 147 -61 133 -64 -40 -58 4 -25 -105 174 83 -124 168 -19 -115 68 -192 -385 -71 -11
5986 -11 -89 17 28 218 228 153 -47 -172 101 160 -112 15 -39 -6 -10 77 -13 -22 88 -133 -16 -128 -14 -56 -303
6011 -303 -209 98 41 213 -88 26 -159 21 20 -17 30 -199 86 87 229 95 -82 14 -15 -11 42 143 131 98 11
6036 11 12 -7 -33 -266 4 -23 35 -23 204 -59 -182 100 141 -88 -49 247 -56 12 163 -110 56 -10 -75 169
6060 169 41 -18 41 -10 -58 60 108 155 -21 84 133 181 143 -2 -7 70 -138 -18 -58 -48 -105 121 6 -127 67
6085 67 -143 166 -228 -47 133 71 -26 14 54 -146 39 54 -32 15 198 -50 -312 90 119 78 -48 -66 34 8
$$ packed form
5915IN6Nj21k4J00L9k52K10q9k5L80k06j89R4j7P9n7j74Q4J82j96k27J92N4J75
5940H2j42K95k94O1K69k61m9J05q7r1J45p2K3r2K05J3k49K08j02K97k41N7J13
5963A93r0j63k17M24k08J94j97K4j8O2k9q0K79r1k07K92j87r6J83k60j93L14O0
5986a1p8J06J1J90J0p5k00j25K73N9k72J27n4L3mQ7r0rJ10k21J17j12J14m2k47
6011c03R4L07n7J72l01J14j85J80jl7M7k29K85JJ42j34j77R6k9MN3J01j2l3q7
6036A1Jj9k6k33K70k7N8n8K27k63j23K82M1k29L9K96l03O8J51k73J66o6o5K44
6060A69j28n9N9n1m8J18M8M7j76J05M9M8l8j45nP7k08J20m0J0n7K26j15j33J94
6085F7k10L09l94J81J80o2r7M0M0k00J85J5q6M7J83k48k62M02K9m1j26j8J00k6
$$ plain form
6109 8 113 -33 -49 33 -126 44 81 -41 4 89 33 31 -98 43 -151 -112 -142 -299 -129 -6 32 -57 -59 143 -76
6134 -76 148 -193 -63 201 172 -69 65 -87 41 39 -40 87 166 -57 75 50 -98 -23 -97 17 123 26 34 69
6158 69 -32 53 -48 -24 36 -68 36 -68 49 78 184 -78 73 -145 -130 146 -96 -62 39 -96 -179 201 -209
6181 -209 -108 -147 -6 -60 16 -179 -135 101 59 197 26 -55 21 95 -47 -99 135 47 70 127 -130 174 -64 137
6205 137 -43 28 25 23 -19 -198 -94 -66 -47 -109 53 37 77 136 -44 49 -39 -33 -57 41 160 -108 143 126 -43 359
6231 359 -110 -3 169 -41 -43 103 -334 -93 -42 -135 62 -4 70 -56 -204 -234 -88 -96 -99 68 73 -80 -54 57 57
6256 57 118 7 -97 72 56 -198 -67 146 -210 18 7 -157 21 227 10 -26 -117 -44 8 117 -115 118 129
6279 129 192 139 142 69 75 31 54 -86 40 140 -10 -23 -26 81 -3 -67 48 42 -46 -135 -140 73 -20 110 -167 75 13
$$ packed form
6109HJ05j46j6Q2j59J70L7j22M5Q5n6kj29J41j94L9l0j57J70J23L8q9kK02k19
6134g6K24l41J30K64k9k41J34j52J28kp9J27P9k23J32k5j48P5p4J14J06r7QL5
6158F9j01Q5j01K4O0j04J04j04J17K9J06k62J51k18J5K76k42L4J01j35q3L80m10
6181b09J01l9J41n4P6j95M4K36m2J38j71q1P6P4j42n2K34q8K3N7k57L04k38K01
6205A37j80P1lkm2j79J04K8J9o2J62j6M0N9j80R3q8Ok4R8J19k68K51j7j69M02
6231C59m69J07J72k10kJ46m37K41N1r3J97o6P4j26j48l0J46qlJ67Nj53K6J11%
6256E7O1j11j04J69j6k54J31K13l56K28j1j64J78K06k17l6r1P3N2J09k32K33J1
6279A29O3n3Lp3Om4K3j40J26J00j50j3lJ07q4o4J15oq8q9nK13r3J30k77K42o2
$$ plain form
6306 13 -35 63 7 -21 -156 -11 -115 -6 205 -171 -72 13 -192 -31 103 180 -83 -98 -89 -61 -119 209 171 -178 -45
6331 -45 -53 80 -28 -43 61 -36 179 -33 -43 -2 38 3 -145 -40 -208 -39 77 -20 -66 12 114 -70 -137 -172 -28
6356 -28 -72 0 -104 -71 -20 195 -108 -21 110 -23 -15 -111 167 92 47 164 -8 -31 -80 -25 -53 1 32 1 78 -301
6382 -301 60 64 -38 124 -14 116 119 6 -160 1 -42 -135 211 75 -10 103 46 122 218 -4 0 3 162 36 -63
6407 -63 23 -124 92 30 -34 -114 7 -208 116 55 -81 -28 -23 222 126 -103 -39 59 -77 -100 131 -203 -12 173
6431 173 105 -6 -217 -103 -211 258 79 16 -93 -177 -12 203 118 2 229 -6 -98 112 -31 -48 174 131
6453 131 -86 -149 -282 59 -33 22 178 20 30 105 -93 -28 -22 -159 32 -34 -8 -101 -8 24 -26 -167 7 80 18
6478 18 274 104 90 126 21 -168 -127 77 -211 -61 -166 -203 21 16 143 -61 -47 -140 63 -122 14 -109 -165
$$ packed form
6306A3m8R8n6k8j35J45j04J09K11l76R9Q5k05J61J34P7k63j5RK8n8L28l8l49J33
6331d5qJ33j08j5J04r7K15k12j0M1M0l5j48J05j68J69J16r7m6P8J02j84o7l5J44
6356b8m4P2j04L3N1K15l03Q7J31j33Qr6K78p5m5J17j72k3m9N5k8N4L1l1P7l79
6382c01L61Mj02J62j38J30Lj13j66J61m3r3L46j36q5J13n7P6R6k22MLJ59j26r9
6407f3Q6j47K16o2o4q0J21k15L24o1j36N3NK45r6k29O4R8j36k3K31l34J91J85
6431A73o8j11k11J14j08M69j79o3j09q4J65K15q5j16K27k35r2K10j43j7K22m3
6453A31k17o3j33L41r2N5J56j58J0P5j98O5Oj37J91o6K6r3R3L2n0j41J74P3o2
6478A8K56j70j4L6j05j89M1K04k88J50j05l7K24nJ27k04J4r3K03j85J36j23n6
$$ plain form
6501 -165 69 -100 59 -72 234 17 -124 87 -50 -62 -201 -71 -87 -17 -103 -145 39 -11 48 14 -62 -15 162
6524 162 -157 -120 82 50 16 -78 -206 33 25 76 -103 -57 133 19 -99 117 148 -141 -23 149 -103 -76 19 -191
6548 -191 11 -135 -151 -197 227 134 28 -61 84 -54 -141 -100 87 224 186 -29 7 173 158 66 -187 88 -29
6571 -29 -123 -64 66 -10 -94 271 -277 -12 187 -103 -2 -21 28 74 214 -146 -36 -46 -95 -39 19 14 -9 -37 116
6596 116 -154 -2 -157 77 85 -42 149 -130 166 -139 156 31 -167 31 -47 178 -170 -134 -178 -38 201 -116
6618 -116 59 224 155 144 -74 7 -178 -8 -140 -144 12 198 -60 -155 70 25 83 -141 3 -31 -76 -177 -222 -44
$$ packed form
6501a65K34j69J59j31L06k17j41K11j37j2j39J30j6P0q6m2J84n0N9l4p6M7J77
6524A62l19L7K02l2l4r4j28K39qN1j79M6J90j14j18K16L1k89J18J72k52K7R5k10
6548a91K02j46j6m6M24r3j06q9J45j38q7M1J87J37l8k15L6J66j5r2k53K75j17
6571b9r4N9J30p6q4L65n48K65J99k90J01j9M9M6J40l60J10j0m9N6N8nk3k8J53
6596A16k70J52j55K34Qj27J91k79K96l05K95j25j98J98p8K25l48L6m4J40K39l17
6618a16J75J65o9j1k18Q1j85J70j32mJ56J86k58r5K25m5N8k24J44l4m5j01m5J78
$$ [...]
8191B65
##END NTUPLES=NMR FID
##END=
