##TITLE=1H_DE-175_oil_TFA_d6`
 200.13Hz, DMSO-d6.
 8 sc
 17.8.2026
##JCAMPDX= 6.0         $$ Bruker NMR JCAMP-DX V2.0
##DATA TYPE= NMR FID
##DATA CLASS= NTUPLES
##ORIGIN= UXNMR, Bruker Analytische Messtechnik GmbH
##OWNER= pz
$$ XWIN-NMR		Version 3.5
$$ Mon Aug 17 13:55:17 2026 Russian Standard Time (UT+4h)  she@DPX200
##.OBSERVE FREQUENCY= 200.1313
##.OBSERVE NUCLEUS= ^1H
##.DELAY= (6, 6)
##.ACQUISITION MODE= SIMULTANEOUS
##.ACQUISITION SCHEME= undefined
##.AVERAGES= 8
##.DIGITISER RES= 18
##SPECTROMETER/DATA SYSTEM= spect
##.PULSE SEQUENCE= zg30
##.SOLVENT NAME= DMSO
##.SHIFT REFERENCE= (INTERNAL, DMSO, 0, 14.3821)
##AUDIT TRAIL= $$ (NUMBER, WHEN, WHO, WHERE, WHAT)
$$ ##TITLE= Audit trail, XWIN-NMR		Version 3.5
$$ ##JCAMPDX= 5.01
$$ ##ORIGIN= Bruker BioSpin GmbH
$$ ##OWNER= she
$$ F:/spectra/data/she/nmr/H-C/1/audita.txt
$$ ##AUDIT TRAIL=  $$ (NUMBER, WHEN, WHO, WHERE, WHAT)
(   1,<2026-08-17 13:53:54.89 +0400>,<she>,<DPX200>,
      <created by zg, POWCHK disabled, PULCHK disabled
       configuration hash MD5:
       00 E9 B6 7A A2 85 ED C7 34 08 36 98 17 FE 4E 26
       data hash MD5: 16K
       D7 C9 40 CE E7 49 0B 19 D6 6B 0B 02 78 A1 A8 77>)
$$ ##END=
$$ 
$$ hash MD5
$$ 70 E5 FC AB EA 35 FC 19 DF C9 23 35 D5 35 C3 54
##$RELAX= 
##$RELAX= 
##$RELAX= 
##$RELAX= 
##$RELAX= 
##$RELAX= 
$$ Bruker specific parameters
$$ --------------------------
##$DU= <F:/spectra>
##$EXPNO= 1
##$NAME= <H-C>
##$PROCNO= 1
##$TYPE= <nmr>
##$USER= <she>
##$AMP= (0..31)
100 100 100 100 100 100 100 100 100 100 100 100 100 100 100 100 100 100 
100 100 100 100 100 100 100 100 100 100 100 100 100 100 
##$AQSEQ= 0
##$AQ_mod= 1
##$AUNM= <au_zg>
##$AUTOPOS= <>
##$BF1= 200.13
##$BF2= 200.13
##$BF3= 200.13
##$BF4= 200.13
##$BF5= 200.13
##$BF6= 200.13
##$BF7= 200.13
##$BF8= 200.13
##$BYTORDA= 1
##$CFDGTYP= 0
##$CFRGTYP= 5
##$CHEMSTR= <none>
##$CNST= (0..31)
1 1 145 1 1 1 1 1 1 1 1 1 1 1 1 1 1 1 1 1 1 1 1 1 1 1 1 1 1 1 1 1 
##$CPDPRG= <>
##$CPDPRG1= <>
##$CPDPRG2= <>
##$CPDPRG3= <>
##$CPDPRG4= <mlev>
##$CPDPRG5= <mlev>
##$CPDPRG6= <mlev>
##$CPDPRG7= <mlev>
##$CPDPRG8= <mlev>
##$CPDPRGB= <>
##$CPDPRGT= <>
##$D= (0..31)
0 0.7 0 0 0 0 0 0 0 0 0 0.03 0 0 0 0 0 0 0 0 0 0 0 0 0 0 0 0 0 0 0 0 
##$DATE= 1786960434
##$DBL= (0..7)
120 120 120 120 120 120 120 120 
##$DBP= (0..7)
150 150 150 150 150 150 150 150 
##$DBP07= 0
##$DBPNAM0= <>
##$DBPNAM1= <>
##$DBPNAM2= <>
##$DBPNAM3= <>
##$DBPNAM4= <>
##$DBPNAM5= <>
##$DBPNAM6= <>
##$DBPNAM7= <>
##$DBPOAL= (0..7)
0.5 0.5 0.5 0.5 0.5 0.5 0.5 0.5 
##$DBPOFFS= (0..7)
0 0 0 0 0 0 0 0 
##$DE= 6
##$DECBNUC= <off>
##$DECIM= 32
##$DECNUC= <off>
##$DECSTAT= 4
##$DIGMOD= 1
##$DIGTYP= 9
##$DL= (0..7)
0 120 120 120 120 120 120 120 
##$DP= (0..7)
150 150 150 150 150 150 150 150 
##$DP07= 0
##$DPNAME0= <>
##$DPNAME1= <>
##$DPNAME2= <>
##$DPNAME3= <>
##$DPNAME4= <>
##$DPNAME5= <>
##$DPNAME6= <>
##$DPNAME7= <>
##$DPOAL= (0..7)
0.5 0.5 0.5 0.5 0.5 0.5 0.5 0.5 
##$DPOFFS= (0..7)
0 0 0 0 0 0 0 0 
##$DQDMODE= 0
##$DR= 18
##$DS= 0
##$DSLIST= <SSSSSSSSSSSSSSS>
$$ [...]
##$SUBNAM0= <"">
##$SUBNAM1= <"">
##$SUBNAM2= <"">
##$SUBNAM3= <"">
##$SUBNAM4= <"">
##$SUBNAM5= <"">
##$SUBNAM6= <"">
##$SUBNAM7= <"">
##$SUBNAM8= <"">
##$SUBNAM9= <"">
##$SW= 18.0517328524113
##$SWIBOX= (0..15)
0 0 2 0 0 0 0 0 0 0 0 0 0 0 0 0 
##$SW_h= 3612.71676300578
##$TD= 16384
##$TD0= 1
##$TE= 0
##$TE2= 300
##$TE3= 300
##$TEG= 300
##$TL= (0..7)
0 120 120 120 120 120 120 120 
##$TP= (0..7)
150 150 150 150 150 150 150 150 
##$TP07= 0
##$TPNAME0= <>
##$TPNAME1= <>
##$TPNAME2= <>
##$TPNAME3= <>
##$TPNAME4= <>
##$TPNAME5= <>
##$TPNAME6= <>
##$TPNAME7= <>
##$TPOAL= (0..7)
0.5 0.5 0.5 0.5 0.5 0.5 0.5 0.5 
##$TPOFFS= (0..7)
0 0 0 0 0 0 0 0 
##$TUNHIN= 0
##$TUNHOUT= 0
##$TUNXOUT= 0
##$USERA1= <user>
##$USERA2= <user>
##$USERA3= <user>
##$USERA4= <user>
##$USERA5= <user>
##$V9= 5
##$VALIST= <valist>
##$VCLIST= <CCCCCCCCCCCCCCC>
##$VD= 0
##$VDLIST= <DDDDDDDDDDDDDDD>
##$VPLIST= <PPPPPPPPPPPPPPP>
##$VTLIST= <TTTTTTTTTTTTTTT>
##$WBST= 1024
##$WBSW= 4
##$XGAIN= (0..3)
0 0 0 0 
##$XL= 0
##$YL= 0
##$YMAX_a= 178023
##$YMIN_a= -197056
##$ZGOPTNS= <>
##$ZL1= 120
##$ZL2= 120
##$ZL3= 120
##$ZL4= 120
##$ABSF1= 10
##$ABSF2= 0
##$ABSG= 5
##$ABSL= 3
##$ALPHA= 0
##$AQORDER= 0
##$ASSFAC= 0
##$ASSFACI= 0
##$ASSFACX= 0
##$ASSWID= 0
##$AUNMP= <proc_1d>
##$AZFE= 0.1
##$AZFW= 0.1
##$BCFW= 1
##$BC_mod= 2
##$BYTORDP= 1
##$COROFFS= 0
##$CY= -3
##$DATMOD= 1
##$DC= 2
##$DFILT= <>
##$DTYPP= 0
##$F1P= 0
##$F2P= 0
##$FCOR= 0.5
##$FTSIZE= 0
##$FT_mod= 4
##$GAMMA= 1
##$GB= 0.15
##$INTBC= 1
##$INTSCL= 1
##$ISEN= 128
##$LB= 0.25
##$LEV0= 0
##$LPBIN= 0
##$MAXI= 10000
##$MC2= 0
##$MEAN= 0
##$ME_mod= 0
##$MI= 1.114404
##$NCOEF= 0
##$NC_proc= 0
##$NLEV= 6
##$NOISF1= 3.799351
##$NOISF2= 2.8
##$NSP= 1
##$NTH_PI= 0
##$NZP= 0
##$OFFSET= 14.38212
##$PC= 1
##$PHC0= -4222.305
##$PHC1= 15.7923
##$PH_mod= 1
##$PKNL= yes
##$PPARMOD= 0
##$PSCAL= 0
##$PSIGN= 0
##$REVERSE= no
##$SF= 200.129724274929
##$SI= 16384
##$SIGF1= 3
##$SIGF2= 2
##$SINO= 400
##$SIOLD= 16384
##$SREGLST= <1H.CDCl3>
##$SSB= 0
##$STSI= 0
##$STSR= 0
##$SW_p= 3205.1282051282
##$SYMM= 0
##$S_DEV= 0
##$TDeff= 0
##$TDoff= 0
##$TI= <>
##$TILT= no
##$TM1= 0
##$TM2= 0
##$TOPLEV= 0
##$USERP1= <user>
##$USERP2= <user>
##$USERP3= <user>
##$USERP4= <user>
##$USERP5= <user>
##$WDW= 1
##$XDIM= 8192
##$YMAX_p= 0
##$YMIN_p= 0
$$ End of Bruker specific parameters
$$ ---------------------------------
##NTUPLES= NMR FID
##VAR_NAME=  TIME,          FID/REAL,        FID/IMAG
##SYMBOL=    X,             R,               I
##VAR_TYPE=  INDEPENDENT,   DEPENDENT,       DEPENDENT
##VAR_FORM=  AFFN,          ASDF,            ASDF
##VAR_DIM=   8192,          8192,            8192
##UNITS=     SECONDS,       ARBITRARY UNITS, ARBITRARY UNITS
##FACTOR=    0.0002768,     1,               1
##FIRST=     0,             0,               0
##LAST=      2.2672688,     0,               0
##MIN=       0,             -197056,         0
##MAX=       2.2672688,     178023,          0
$$ Real data points
##PAGE= N=1
##DATA TABLE= (X++(R..R)), XYDATA
0@%%%%%%%%%%%%%%%%JrJ6j6J6j6K0k8L2l6M4n1N9o8P7q8J00j13J28j45J63j85
38i9K08k32K60k89L21l55L94m36M80n29N83o43P09p82Q62r50J049j159J282j424
58g50J584j770J992k258K583k991L525m254N318p058J0588l1308L0982r4185j09054
73a97056J36883Q0404k2250M5431M4976n9873j1619K089r2532l9128J00870L3307
85B1502k8104O6100O5787l9406k6972j2271p7515o6677R390M624r175M8958Q2624
98C8865L1543j2334j3436j4023k9509m1580k6203J6005L1704L0844M2834K5376
110H0086o446j583k7013p9117m5615J7590j455j3357M4432N4667Q912J4064J2218
123E7383m2387k9438J5470l0404m1638N2993O2109j5778j553L8687j3160m6490
$$ plain form
0 0 0 0 0 0 0 0 0 0 0 0 0 0 0 0 0 0 1 -8 8 -8 8 -8 12 -16 16 -20 24 -27 32 -36 41 -47 53 -60 68 -77 86 -99
38 -99 109 -123 137 -152 169 -186 208 -228 252 -277 306 -337 372 -410 452 -498 551 -608 674 -750
58 -750 834 -936 1056 -1202 1381 -1610 1915 -2339 2979 -4079 6509 -24799 6183 -88002 -197056
73 -197056 -60173 20231 -2019 43412 88388 28515 16896 18985 -73547 -112675 -11805 21502
85 21502 -6602 59498 125285 85879 58907 46636 -30879 -97556 -88166 -83542 -92717 -43759 38865
98 38865 70408 58074 44638 30615 1106 -40474 -66677 -50672 -18968 11876 54710 80086
110 80086 73640 72057 45044 -34073 -79688 -62098 -63553 -76910 -32478 22189 31101 45165 57383
123 57383 14996 -14442 1028 -29376 -71014 -18021 44088 28310 26757 65444 52284 5794
135E794j2134k0037l7456J3292L0047j0652J5495N4732N154k8745R0q043l1969
148b4432k093J4988o996R767M2164J3445k1221k887J404k6959k8500j3095l198
161d7613J5479K5996J2378O727J5055P650j6570k7341j3042K269J956j191J0235
174h012K6677K0714k801j1855j4516j7124j1069j1705j3944J2112L2003J0042
186A0522l268J4846J0956j6715k0033o804q387k697J3493P017M514K0690Q794
199C2928j7908j0840r09j4533j4153K763L707N027J8003J3545m495m78N437j2097
213E997j8480k143L393K346O838N891N411R147J834j2373j3315m064k997o213
227a8728l28Q726J3822J1579n52o875J347p39j2639j1120K88P080P936M559K438
$$ plain form
135 5794 -6340 -26377 -63833 -50541 -20494 -31146 -15651 39081 44235 15490 15580 7537 -24432
148 -24432 -26525 -11537 -18533 -8766 33398 46843 25622 22735 24139 -2820 -31320 -44415 -47613
161 -47613 -32134 -6138 6240 12967 28022 35672 19102 -8239 -21281 -19012 -17056 -18247 -8012
174 -8012 18665 39379 36578 24723 10207 -6917 -17986 -29691 -43635 -31523 480 10522
186 10522 7254 22100 33056 16341 -3692 -10496 -18883 -21580 -8087 -1070 3444 24134 32928
199 32928 15020 4180 3271 -11262 -25415 -22652 -18945 -13918 4085 17630 13135 12657 18094 5997
213 5997 -12483 -14626 -11233 -8887 -2049 3842 9253 18400 20234 7861 -5454 -9518 -12515 -18728
227 -18728 -19056 -10330 3492 15071 14519 7644 8991 8252 -4387 -15507 -15219 -8139 -203 4356 6794
242F794O676M561q276j5753n996K150k767j401P451Q918O318N083k446n987k688
257B637m649p482k738M740O389N146M688J223k447j432l737q759n182J925L153
272f525K514L475N762N910l73o159n420j320j926l512j033N757O557K371J89o23
288E644L46k294q558n942K453L907J142K087N085M946r6m376m599k323j032k739
304f349j916M079O902K916K33j63j540l125l990l712o26J698L592L535J737J438
320D709J645p28l803n225k336J822J370j25J836M132L343j640m332j073L97k137
336b145l557J35L881L727Q84k45J113M3k298l308j795N66J154M66P39K207K028
353C595L31j983j737j270j685m66L25J058K603J673M52k24l03j271k191j861l48
$$ plain form
242 6794 13470 18031 9755 -5998 -11994 -9844 -12611 -14012 -6561 2357 8675 13758 11312 5325 2637
257 2637 -2012 -9494 -12232 -7492 -1103 4043 8731 9954 7507 6075 2338 -6421 -11603 -9678 -6525
272 -6525 -4011 -536 5226 11136 10763 4604 -816 -2136 -4062 -7574 -8607 -2850 3707 6078 6267 5644
288 5644 5990 3696 -4862 -10804 -8351 -4444 -3302 -1215 3870 8816 8720 4344 -255 -2578 -3610 -6349
304 -6349 -8265 -4186 2716 5632 5865 5702 4162 1037 -2953 -6665 -7291 -5593 -2001 1534 3271 4709
320 4709 6354 5626 1823 -3402 -5738 -3916 -2546 -2671 -835 3297 6640 5000 668 -405 -8 -2145
336 -2145 -5702 -5567 -1686 2041 2925 2680 3793 3836 1538 -1770 -3565 -2999 -1845 -1379 -640 1567 3595
353 3595 3926 1943 206 -1064 -2749 -3215 -2890 -1832 771 2444 2896 2672 2369 1098 -1093 -2954 -3302
370c302L34J241K183J761N01L23m68k693k182p05M05L5O57K159K138Q37l45j808
388A071q67m81j880j855J257L037P91K37L82J094n17j543j955j088N02P53n50
405a612Q96K236J107m83j413o21k30j074o60J18P69J307P39j77M61M10r21j395
423e43n58m22J72N10Q72R22k4N56j3j034j156m50k2R3M3R51J143P04k08q04o11
444A21k27r10j006O71J091J74K18R79M07o08j049o29k75k68K27R3J189R41J80
463A319q36J30L98j050q00m55N54K45K69Q90j25J67L73p38p59K87l27l12K94L98
483g8K14K56N07P0q12n79L07n00l01L16L70L30K94k5j32j55M32q68p63P24O44
504B51k04k56P54M10m06p16m4j95j4L0M5L50L59J60j58j9Q7q72j94L73Q4k21L17
$$ plain form
370 -3302 -2968 -1727 456 2217 2718 3041 2573 -120 -2302 -3007 -2602 -2567 -1910 249 2387 3224 2879 1071
388 1071 204 -277 -2157 -4012 -2755 282 1073 1310 1692 2786 2269 726 -1229 -2317 -1815 -1062 -1612
405 -1612 -716 1520 2627 2144 731 110 -120 -1194 -1854 -1736 -967 340 1079 902 1363 1773 852 -543
423 -543 -1101 -1523 -1351 -841 31 953 929 1485 1472 438 -718 -1168 -1190 -1097 -1054 -103 1040 1744 1536 732 121
444 121 -106 -1016 -2022 -1351 -260 -86 132 1111 1518 910 -139 -768 -1043 -1311 -1084 -991 198 1139 1319
463 1319 483 613 1011 -39 -839 -1294 -740 -495 -226 664 539 706 1079 341 -418 -131 -458 -770 -476 -78
483 -78 136 392 899 969 157 -422 -115 -615 -916 -600 -230 100 394 369 237 82 514 -354 -1117 -393 251
504 251 47 -209 545 955 549 -167 -211 -406 -420 -390 -345 5 364 524 366 347 434 -438 -632 -259 -175 -396 -79
527g9O02r4j93K37l08l16l14K46l20J55O87j32K25j58M05p94o9J89M8m03L08L77
549B99j40J09P0L2k21q7k20k15O0K28k6k09P01n3l48M0J43k73l17K31K11K3R6
572A34L31j76l19L44l05k35K7J35k24J40M76j92K6J88j03o84J91J70j66L81p6
593F3J28j53P5j72l0j49L05k05n4K9L78j19K14n7l0l9k33N0j67j09L09P4l9J3
617H2O4j33k46O46l44j26p5J25J02j76j17K72J61k83K00k46j06J05K5J33J59N0
639B72k68J89j12j64K8N1j8Q5o1K13j26p8j57J03k7m2j18n2K09L45j61o5j21j4
663h9o5J77J7j64o8K93k24L5J33k6r3p8J67k12J62k19J57K64n0j31M3J28j8l38
687a99M1j7j11J37J6J54j6l0j25L20q0p4J8P1J61l58j4K11j61k1Kn5O3m1J51j15
$$ plain form
527 -79 523 429 236 473 165 -151 -465 -219 -539 -384 303 171 396 238 643 -151 -220 -31 17 -386 -78 299
549 299 159 268 338 370 149 62 -158 -373 -313 -85 -111 -320 381 328 -20 20 163 -110 -427 -196 15 38 134
572 134 465 289 -30 314 9 -226 -199 -64 -288 -148 328 136 162 350 247 -437 -246 -76 -242 139 63
593 63 191 38 113 -59 -89 -238 67 -138 -192 -163 215 96 310 253 223 184 -49 1 -166 -275 34 108 69 82
617 82 146 13 -233 413 69 -57 -132 -7 95 -81 -198 74 235 -48 152 -94 -200 -95 -70 63 222 272
639 272 4 193 81 -83 -55 -4 -22 63 2 215 89 11 -146 -43 -70 -112 -230 -282 -73 272 111 46 -75 -89
663 -89 -154 23 40 -124 -192 101 -123 -88 45 19 -74 -152 15 -197 -35 -254 -97 167 117 -14 29 157 139 -199
687 -199 -158 -175 -286 -149 -133 21 5 -25 -150 170 90 16 34 105 266 -92 -106 105 -56 -77 -75 -130 -67 -108 43 -72
713g2J69J7j53k1K5O4m1n4m6J73j3j50J66J76q8k00j29p1K47P9j45P4J26j07J97
738B23j92k6Q1K5j71j1K86j69J38Kj8l0k4J10k22MJ53j75Q3K1j77K74j52jj76
763a44K50j80J07o4j62J43r9J67o3K5j01K1J44J22k51O4J26O5q5l27K17qO7J79
787B13m04o1L43JJ32k81J30j88l5K61R7j71L9mq7N4N8j48J16k4k35J66j51K97
811A18Jj08J84l18J36r6O1j33k1K75k35O4J41n9Q5K1k14R1o7J78K7k23k5o8L30
836A45r2J77j83J29k19j8J74j15J89n85L43J55p5l1p1O6Jj52J18O4o5J36R8k24
860c5J48k54k9K13O2k3j8J29k33K27p2j42j6KomK31j3j78J52k38J38r7J65j88
885g9L15k07J0J61j94m0J21J32l88K25r4R1k1qPK5j44j3J7K60k43q4J82J2Q9J07
$$ plain form
713 -72 97 114 -39 -60 -35 29 -12 -66 -112 61 48 -102 64 240 152 -48 -177 -248 -1 78 -67 7 133 26 223
738 223 31 5 86 111 -60 -71 215 46 184 186 168 138 114 224 2 6 159 -16 67 88 -89 185 33 32 -144
763 -144 106 -74 33 -31 -193 -50 -149 18 -45 -20 -121 -100 44 166 -85 -21 105 170 85 -242 -25 -33 34 213
787 213 -191 -252 91 92 224 -57 73 -115 -150 111 208 37 76 72 -15 39 97 -51 65 41 -194 -28 -179 118
811 118 119 11 195 -123 13 -83 -22 -155 -176 99 -136 -72 69 10 95 116 -98 -7 -74 104 131 -92 -117 -185 145
836 145 53 230 47 176 -43 -61 113 -2 187 -398 -55 100 25 -6 -77 -11 -10 -162 -44 20 -45 91 189 -35
860 -35 113 -141 -170 43 105 82 64 193 -40 187 115 -27 -43 -41 -47 -51 180 167 -11 141 -97 41 -56 109 -79
885 -79 236 29 39 200 6 -34 87 219 -169 56 -38 53 32 24 31 56 -88 -101 -84 176 -67 -151 31 43 132 239
911B39j77mK4j96J01j62R1L9j1M4j47M0P6o5J99k52L14Oj64J18j23n8K44j83j36
936a43P4J81P6j42n4R1j04l7O5JLJ03p6p6K1N0n9J01n7K26k64LM0k2Rk6K05k24
964c5J65k27J52q5j85K16r4j10K67m7o4N8k25K46N4p0j71J46K47j99J51j65ln8
988c6L7J28j92m5J66k0j82J90j91J20k42J71N0J21j84l6L38r0j45o2O2N0R9o9
1012C8o4j04J97M0j8j04j86L07O4j53o0J25J7M7p1o0m8R3p7j5N3P7j80J74k65
1037a73J61k43L96Llj81j27K35k37QJ47J12O6q9J5r8o1o7J41J26j64N5j69j9K77
1062A11r2kj33J84J41j23k57J67N1q6q9o6J89j70K71k17N5q3L10k6k20N8j84P6
1086a35k6Q3m5J09JJ08j94J14K21l07M5q5J96R0n4j84j14Q5K29l00J23K3K11p7
$$ plain form
911 239 62 58 82 -114 -13 -175 -84 -45 -56 -12 -159 -119 -43 -108 91 -161 153 159 -5 113 -10 -68 176 -7 -143
936 -143 -69 112 188 46 -8 83 -21 -58 7 8 11 114 38 -38 -17 33 -26 75 18 244 -20 -17 23 1 10 -16 189 -35
964 -35 130 -97 55 -30 -215 1 -93 -203 64 17 -47 11 -214 32 86 16 -155 -9 238 39 190 25 22 -36
988 -36 1 129 -63 -108 58 38 -144 46 -145 -25 -267 -96 -46 75 -109 -145 193 103 -42 -104 -42 8 107 38
1012 38 -26 -130 67 107 89 -15 -201 106 170 17 -43 82 99 146 75 15 -33 60 -17 -32 21 98 -82 92 -173
1037 -173 -12 -255 141 144 141 -40 -167 68 -169 -161 -14 98 164 75 90 -8 -69 -136 5 131 -33 22 -147 -166 111
1062 111 19 17 -116 68 209 86 -171 -4 47 -39 -128 -194 -5 -175 96 -121 -66 -149 161 135 -85 -27 -211 -135
1086 -135 -161 -78 -123 -14 -13 95 -99 15 236 -71 -26 -111 85 175 121 -63 -177 -92 137 -163 -40 -17 194 117
1110A17N4j55o8J46j47J64M8k78K51p4j37N3J00J9r3N0q4J24k49J76K1R0m4j44
1134f0j5J3o5K88j28l44L08j11K12l49K44j35J64j34J50k6j67L24l02J19O6R9
1156A51r6j39j05L55j64N2jQr4J76j05m2j26O0J74j62J44L0j38M0J2n2J16J10
1180B04j11k7k29J77j14M9j41L63l39K77n8j49J29J20j29J8m4o0j45J07K02M2
1202A42j28p6J02l5J31j44M9j85J08N8k13L33r4n3M3j31K48k5k37J58K5r5J55
1225A36rj64r2J16p4J77j9j02j49K24j31%Q8o0J99Pj06N4o1K09l03l5J15j78O1
1250i7J83j35K10l40P6J08K16q4j33L0j61K9Q4Nk2q3Q7J23j6j24K2M9j3r7J75
1275I2K7j12J23o9m2P2j80J27Rq4J37j54k5%J49K6jr8j02k8MQ5n5NK01j0J4k67
$$ plain form
1110 117 171 16 -52 94 -53 111 159 -119 132 58 -79 -26 74 93 0 50 -34 90 -159 17 38 128 84 -60
1134 -60 -75 -62 -127 161 33 -311 -3 -114 98 -251 -7 -142 22 -112 38 12 -155 169 -133 -14 52 151
1156 151 55 -84 -189 166 2 54 53 61 -33 143 38 -4 -130 -70 104 -58 86 116 -22 18 30 -22 94 204
1180 204 93 66 -163 14 -100 -51 -192 171 -168 109 51 -98 31 151 22 40 -4 -64 -209 -102 100 142
1202 142 14 -62 40 5 136 -8 41 -144 -36 22 -191 142 48 -5 38 -93 155 130 -107 51 76 -19 136
1225 136 127 -37 -129 -13 -87 90 71 -31 -180 44 -87 -87 1 -59 140 147 41 95 34 243 -60 -95 20 -158 -97
1250 -97 86 -49 161 -179 -103 5 221 137 4 34 -127 -98 -14 -9 -31 -114 -27 96 80 -44 -22 27 14 -83 92
1275 92 119 7 130 61 19 91 -89 38 47 -37 100 -54 -79 -79 70 96 95 -3 -105 -133 -129 -44 -99 -94 107 97 111 -156
1303a56M3J44J32k14r9j6K79q6J89p4j58j1L6j77K99j88q5L09k35J86k05O4rN6
1327B4k73L29q3j13J40k46L17m1P6j31Rm5J36j99L64m95K31m6r2p1K51P2j37p3
1351i6J46j9l8j55J44l5q4K41J24j37j76K07j45k4K3P5%j87nJ46J04l2r2K44k50
1376b1j57K70j14J96j28q9Qn1l5J66mj17Q7M2n0L5j7l6q3J72p4k17J32J07J62
1401A84m29K19j08J08J22k14R8l1j18J81j0J28j35L6N0p7O1k08j1nK36Kj12J00
1425F7l04L9J92k19L84j5j19Pm3N2n7K96j49p1r7K47p6k06j04J80k8KK26k27o
1450b9J71j29P8m6q3o0J55O3J43m47J76k0O1L0J04j19j45J33j50M8J13k14M01
1473B34k04l2J08L0j62J80l25J51p9J5K65k43K60m09M12k00L7P2n2J61l21OJ7
$$ plain form
1303 -156 -113 31 163 -51 -150 -166 113 27 216 142 -16 -27 9 -168 131 -57 -142 167 -68 118 -87 -23 -32 24
1327 24 -249 80 -3 -116 24 -222 95 54 130 -1 8 -37 99 -100 264 -231 0 -46 -138 -209 42 114 -23 -96
1351 -96 50 31 -7 -162 -18 -53 -137 104 228 91 -85 122 -23 -47 -24 51 51 -136 -141 5 109 77 -15 229 -21
1376 -21 -178 92 -22 174 46 -43 -35 -86 -121 45 41 -76 11 53 3 38 21 -15 -98 74 0 -217 -85 22 184
1401 184 -245 -26 -134 -26 96 -118 -20 -51 -169 12 2 130 -5 31 81 4 65 -143 -154 -159 77 79 -33 67
1425 67 -237 -198 -6 -225 159 144 25 32 -11 41 -16 280 131 60 -37 210 134 -72 -176 4 -24 -22 204 -23 -29
1450 -29 142 13 91 45 -38 -98 57 120 263 -184 -8 -28 33 63 167 48 -97 36 -114 -66 47 -167 234
1473 234 30 -2 106 136 -26 154 -171 -20 -99 -84 181 -62 198 -211 201 1 38 110 58 219 -102 -96 -79
1496g9N5J27j10J42l2%j85J41k8J87l3k42Q9N6o2n5M1O5o0q3k3J0M4K6k09K81
1522F3L0M8n1q0k9Q5k02J99j08j82J66rl1L04k83N6J86n2j14J08j49J1o6J3J58
1547G1j10J54j31L42l01n0J00m9L3k29K65j21lL02k86L46l10l7m3o4OR0K1R4m4
1572D6l74K68J90L9k14L1R9l05L53L5j58k07K55o1O2l8Jp6j11J13l5j6L01j92
1596FJ36k10J7K1N3j00J23j01JN0m2O0j69J44K9j12J90j47J98j38K4L4j49J14
1620C2k5o9J53k53J02Q1K6M3j19p%K60l71J00j26J65q2J33Or4P4K3J40j83q5K65
1646A89k50j39L27m8R3j22O5l73K29J31n3j87J19k35M02j05k53L31k02R8j69J94
1668D2P1Q0k9j70J0k29K48j39J86r6K12k84Q2Q7oL2j17l5pR0j39L07k12M4q4o1
$$ plain form
1496 -79 -24 103 -7 135 103 103 -82 59 31 218 185 -57 32 88 26 -29 12 77 17 -66 -89 -79 -35 -9 -218 63
1522 63 93 141 90 10 -19 66 -136 63 -45 -227 -61 -70 -101 203 -80 -24 162 110 -4 104 -45 -34 -100 -87 71
1547 71 -39 115 -16 326 25 -25 75 26 59 -170 95 -26 -29 273 -13 333 23 -14 -57 -121 -115 -25 -4 90 46
1572 46 -328 -60 130 169 -45 -14 85 -220 133 168 10 -197 58 -3 59 21 22 -54 -165 -52 -87 -103 198 6
1596 6 142 -68 -51 -30 23 -77 46 -55 -54 -4 -46 14 -155 -11 18 -94 96 -51 147 9 33 67 -82 32
1620 32 7 -62 91 -162 -60 21 47 90 -29 -36 -36 224 -147 -47 -173 -8 -90 43 49 -45 29 52 192 9 -76 189
1646 189 -61 -200 127 79 172 50 115 -258 -29 102 49 -138 -19 -254 148 43 -210 121 -81 17 -152 42
1668 42 113 193 164 -6 4 -225 23 -116 70 -26 186 -98 -16 71 65 97 -20 -55 -62 28 -111 196 -16 28 -56 -117
1694a17L35k51j35J25JJ43j68Q2k00K10p1J05J13k67J0j14K98k6j44K9o2J81j05
1717b8j5K6p9l6n6K56k2q9k3L6K04r6r0N9L1k25J17O3j49q3R5J51j34O7K51k79
1743d8K22M5l42Q1L1n1J52j52M1J29r1r7n3Q6J81k31j22K88L1n8m9k1R8j47q0
1768a57J15Q2K00k48J59Mk41j15K91Kn6k13K84j07R6P3k63J14j06m8K03R8k14
1791d7J73j31q9J78J48j79J87l70J51J50k05JP0m7P5k22Q9M2N1P5L0p5p7Qp3J00
1817A3p3O6J52m24J16K90k79J92k2R6Mq6K43l43P7K8j46j19J14K54m93M09KK3
1841I4l11J36J6R7k15K15Rl59M52m8k33M12n5r9n3j43L46k45k20PJ31j96K41m6
1865f7K07j95L42k53k11J89K62l24M5J2O3j82J81J1k7o8J8J69j80m7J6pJ58k76
$$ plain form
1694 -117 218 -33 -168 -43 -42 101 -67 15 -185 25 -46 59 172 -95 -85 -199 99 73 -71 -42 -104 77 -28
1717 -28 -43 -17 -96 -132 -188 68 46 -43 -66 -30 174 78 -12 47 78 -147 -30 33 -116 -199 -104 47 -87 -20 231 -48
1743 -48 174 219 -123 -42 -11 -62 90 -62 -21 108 17 -80 -133 -47 134 -97 -219 69 100 42 -7 -28 70 -77 -157
1768 -157 -42 40 240 -8 151 155 -86 -201 90 92 36 -177 107 0 96 169 -94 20 -86 -134 69 167 -47
1791 -47 126 -5 -94 84 232 53 240 -130 21 171 -34 -33 37 -10 65 -157 -68 -26 25 100 130 55 -22 -14 -87 13
1817 13 -60 6 158 -266 -150 140 -139 53 31 127 131 45 288 -55 22 50 -96 -215 -101 153 -340 69 71 94
1841 94 -217 -81 -65 32 -183 32 41 -318 134 86 -147 265 210 111 58 -85 261 16 -204 -197 -66 -262 -21 -67
1865 -67 140 -55 287 34 -177 12 274 -50 -5 7 70 -112 69 80 53 -15 3 172 -8 -55 -39 -46 112 -164
1889a64K14q1l55L65M2N7j1J16j80o1J01k70J74J96j65PL0j13O9K3j27P0L81l35
1913a7n9J81m2Q9l26K24j8k8O2r0P9m0j89P1J67O2j9j29J25j02j06L7k5J37j20
1938g6o1J45Q9k04kM4M1J68j45L6L7l08K21j95K77j03P4q1j36J22M2q9j17L75
1962A54k63q8J64J18j92J4K72k93jJ27K78l86K65k13P0l4m3nq7R9j16K71J8j35
1986fJ39j88P8o4PL39j62j61J02J3K4L1k0M9k98Q2J49LO7j0l84K93k27J57Q3r3
2012Cj5q1P1j80J49J60r9j26J68Pr9NK50K4k76K2o0Q6j02lJ97j48K0N0k18K92
2038I7l7m4j26K10m5m3K25k58K60j58j91J36O8P8l03P7K5j65J31J74r9n3o1j3
2062a15K51j24q6k1M0k56N50k23J53k81K39k79L51k18j62P7K49l48R6q0K10j86
$$ plain form
1889 -164 50 -31 -386 -21 21 78 67 183 3 -58 43 -227 -53 143 -22 -15 15 -98 -29 -6 -133 -63 318 -17
1913 -17 -76 105 63 152 -174 50 32 4 66 -24 55 15 -174 -103 64 126 107 -22 103 1 -105 -68 -93 44 -76
1938 -76 -137 8 97 -107 -109 -65 -24 144 -1 35 72 -236 -15 -210 67 -36 38 -43 -179 -57 -15 -104 -221 154
1962 154 -109 -197 -33 85 -107 -93 179 -114 -115 12 290 -96 169 -44 26 -8 -51 -56 -143 -44 -160 111 129 -6
1986 -6 133 -55 23 -41 -34 305 143 -18 84 97 121 152 132 181 -117 -35 114 117 184 174 -210 83 -144 13 96 3
2012 3 -12 -93 -22 -202 -53 107 8 -118 50 57 -42 -37 213 237 -39 -17 -77 9 -93 -96 101 -47 -27 23 -195 97
2038 97 60 16 -110 100 55 12 237 -21 239 81 -110 26 94 172 -131 -54 -29 -194 -63 111 12 -41 -102 -115
2062 -115 136 12 -74 -95 -55 -311 239 16 169 -112 127 -152 199 -19 -181 -104 145 -203 -107 -187 23 -163
2084a63L2k9J88j37J05j8m2%J28l4m6L8J90j51j89L53j44k61pK14j50J59q7P0
2108A9L3M9P3l72M38k36j32J45j50J41k2K3J3J06r7J4j59N1Q2k40R2q8L20j35
2132c2P9J00k17J77j65j29J09j05L25k07q0J03j73K04K69m52J78J98k75K17k06
2153h2K3J06J02j43p0m1M4J60j05L35l57R0r6o9P7J09M4j74j4K16l09J79J10R3
2177B28k10Oj47k4L43m06K09m4Q6J9j45OJ46j69K83j11P0k82J95Q0m2j25J45k38
2201a27QJ44q2PQ2Po9J2j80K35j48K64j75j8K5L25m52K79j69R9m1j75K83j66K0
2226a2P9J56l55J94p3K6j08n5J63J71k31K10l3k47K23k06J91l1j67L15k61O0j37
2249a28n9L20q4J58l26J93k1J03k83J55l0RL0j68K08j1N6j17j4L1Q8j89q7J11
$$ plain form
2084 -163 -131 -160 28 -109 -4 -22 -64 -64 64 30 -16 22 212 61 -128 225 81 -180 -187 27 -123 36 -51 19
2108 19 52 101 174 -198 240 4 -128 17 -133 8 -14 9 22 128 31 45 -114 -63 19 -221 -129 -217 103 -32
2132 -32 47 147 -70 107 -58 -187 -78 -183 142 -65 -145 -42 -215 -11 258 -194 -16 182 -93 124 -82
2153 -82 -59 47 149 6 -64 -105 -61 99 -6 329 -28 62 -34 -103 -26 83 127 -47 -61 155 -154 25 135 228
2177 228 18 24 -123 -147 196 -210 -1 -45 41 60 -85 -79 67 -102 181 70 140 -142 53 133 91 -34 111 -127
2201 -127 -119 25 -57 -50 32 39 -30 -18 -198 37 -111 153 -22 -40 -15 310 -142 137 -32 67 26 -149 134 -32 -12
2226 -12 67 223 -132 62 -11 15 -93 -148 15 186 -45 165 132 -115 108 -98 93 62 -105 210 -51 9 -128
2249 -128 -187 133 49 207 -119 74 53 156 -127 28 -2 7 37 -131 77 66 122 5 -9 22 110 -79 -166 -55
2273e5L47l23J94j30R0l02J63j25K01j62p1J17p5KJ41m2r4M8J86j55J41l29L01
2296F8J3n0J00p8J7j49j11L83j68o2N2Q4n7l5j08N2K6kQ5j07N2q3O7j50l8J33
2322f6J59J23l45K67k15J69j59J64j13J00k88K52j12N9N0o5K5p8J39j03O6q3J09
2345E5L7j05j17K41k48L6J02p0l7rQ9n8J7N4l4j9K3L2M5j11m4N6L3pJ88n8n3M
2373D2j26J5J46r1K8m7J00Q4j27K25m28K21j31P0k07K28j97L02k48J34J73k02
2395c6N1M1m9J30l27J89J85j64r8m0m3J32J56k40O7l8J14j02K94j88l9J54j45
2418Dm0l7K22l15J27m7N2L3M7LJ31Q9k31R3m15K12k2J53j58J36N8l18lK40M6j95
2444a35P3K4n9J49J78k71Q1j34P3Q2J18k02O9j34J15o2o8n3J96k17P3P5L18l26
$$ plain form
2273 -55 292 -31 163 33 123 -179 -16 -141 60 -102 -173 -56 -131 -129 12 -30 -124 -76 110 -45 96 -233 68
2296 68 81 31 131 53 70 -79 -190 193 25 -37 15 99 42 7 -101 -49 -23 -25 60 -47 5 -78 -11 -161 -199 -66
2322 -66 93 216 -129 138 -77 92 -67 97 -16 84 -204 48 -64 -5 45 -20 5 -73 66 -37 29 -54 55
2345 55 92 -13 -130 111 -137 -101 1 -69 -106 -115 -26 -84 -67 -13 -47 -66 -43 -11 34 -77 -121 -65 -32 -39 149 91 38 42
2373 42 -84 -69 77 -14 14 -33 67 151 24 249 -179 42 -89 -19 -226 2 -195 107 -141 -7 166 -36
2395 -36 15 56 7 137 -190 -1 184 20 -78 -118 -161 -29 127 -113 -46 -84 30 -72 222 34 -5 149 4
2418 4 -36 -73 149 -166 -39 -86 -34 -1 46 49 180 269 38 131 -284 -72 -94 59 -99 37 95 -223 -226 14 60 -135
2444 -135 -62 -38 -97 52 230 -41 40 -94 -21 61 179 -23 46 -88 27 -35 -103 -156 40 -177 -104 -29 289 -37
2468c7K15j09M1n9k49J08L5M5n7K68m02K32J68l53Q4K0N6l02K46J44Pn5J28j75
2492aP2o0l9J79j59Q8J41j10k50Q3N2M4K1j08N6j5j48K27q4J0k3l8j09J73j61
2517a59K17J15j88j2Pl9j8J21N6j14j05J31R1l74L85r9J07j81OJ12l3j52q9kK69
2542E2j47O8k6q8j01L12k88K67j64L1J82q7j15J17q8j3J95k53K87p1k16J58K1
2565C3j55J04K9o2m0M8J16K8k7j95K9J02j20n1J75oR2o2j21J07m6j1o0j23K19
2590Ck3J2L5J41l23L04k57j95K74J10j68K53k15j26L54k54j84L43j76K58j81q9
2612a04J75q7j2J37r7J78o6k31K1J48j4K7J02l56L11j06l90L82R9j1j21KN8R7
2636A42k41P2L8P4j65k5J16k04K02P5p2kR6l2o4j6j37K25j5k53L10k3j55K28l36
$$ plain form
2468 -37 178 69 110 51 -198 -90 -55 -10 -67 201 -201 31 199 -154 -70 -50 6 -296 -50 94 101 46 174 -1
2492 -1 71 11 -28 151 -8 80 221 111 -139 -56 -4 40 61 -47 9 -6 -154 73 -11 -1 -24 -62 -171 2 -159
2517 -159 58 173 -15 -27 -20 -59 -77 44 100 -14 -119 12 103 -271 114 15 122 -59 -53 59 26 -126 -215 -217 52
2542 52 -95 -27 -53 -141 -242 70 -218 49 -115 -84 98 11 -104 13 -75 -88 107 -146 141 70 -146 12 33
2565 33 -122 -18 11 -51 -91 -43 73 101 74 -121 -92 10 -110 -161 14 8 100 38 -83 24 -22 -33 -93 -216 3
2590 3 -20 -8 27 168 -155 149 -108 -303 -29 81 -87 166 -49 -175 179 -75 -259 84 -92 166 -15 -104
2612 -104 71 -16 -28 109 12 190 124 -107 -86 62 48 75 177 -179 132 26 -364 18 117 106 -15 -13 45 142
2636 142 -99 -27 11 85 -80 -105 11 -193 9 84 12 10 106 74 10 -6 -143 82 67 -186 124 101 -54 174 -162
2661a62j35Q8K23N0m0j02R1j00J46n7n0O9n9j42J83J27m3l6r1N2L4m0L8L3l23
2686b46M44j47n7J76j89j12K14k57J53L8j42J44m1j9R9JK2k18J12p2k16J57J90
2709C4R1o2R9k59L4K00j49np1J57l0o0k1J67k32J89j3m3j49O2K12j05j37n6K60
2734A13n2j61M7M6J9j09P9j93K34K10l03J28Jl5O7n8p6n9L12j52k46K25L5j23
2758e1M0j5j6J9l7J51p9LJ8J0P3l28L71o3j10M2k30J20p7J36N7k05R8J71K2O0
2784A80j99J7J53p1L7k54J98J6j40M8n3Q7j02J20M0j27J23l62K70J31j85J98j84
2807e9J06j2O8j13k5J85j26j51M07l89J77l1m9J69j33n6j46O5L0j05J19K00l57
2830b26L23M7q6q7K69m04K80j58J57j88J23q5rJ41j36l2J2j59K20K8j18J08O2
$$ plain form
2661 -162 -297 -209 14 64 24 -78 13 -87 59 2 -48 21 -38 -180 3 130 87 51 -40 12 46 6 44 77 -246
2686 -246 198 51 -6 170 -19 -131 83 -174 -21 17 -125 19 -22 -41 58 59 81 -137 -25 -97 -313 -156 34
2709 34 125 63 162 -97 -63 137 -12 -17 -88 69 39 -21 -42 125 -107 82 69 26 -123 -61 151 46 -91 -147 113
2734 113 61 -100 -53 -7 12 -97 -18 -211 23 233 -70 58 59 24 91 33 -43 -102 210 58 -188 37 72 -51
2758 -51 -11 -26 -42 -23 -60 91 12 15 33 43 116 -212 159 96 -14 28 -202 -82 -159 -23 34 -171 -73 98 120 180
2784 180 -19 -2 151 80 117 -137 61 77 -63 -15 -68 19 -83 37 77 -50 73 -289 -19 112 -73 125 -59
2807 -59 47 35 103 -10 -35 150 24 -127 280 -109 68 37 -12 157 24 -32 -178 -113 -83 -188 -69 131 -226
2830 -226 97 144 58 -29 240 -164 116 -42 115 -73 50 -35 -44 97 -39 -71 -59 -218 2 30 -88 20 82
2853H2o8J1P8L0K7k13P3p8k3M3J67p8j21R7j37l2J98j44Q6P2Kk36J35n8L12l51
2879a26l8M8M0L45k49j12j09K27r0j80Q8J61j3j2O4N3k33K68k00L2N3l4Q1r0O9
2904D3k12J74k3J59j34L8K3j14J42l9k61K32L9l20J47J25M1m3l1l9j3P8J54m04
2928b38L36j65O3r7K0L38m20J43k9Q2J25k3m7O5j59J08M9k70J00n2R5r3J26k0
2952C7l17K38R2j87K24j13J6rj60J71P4o7L6K43j18j44P8r3j25K21k48Q9R6j68
2976a34M4K29l1j94J09Pk0j95J26J00M0N8l3j00k3L5j23P3oJ13o9k22K58j69Q4
3001d3j05j5J54lq5Q4Q6j18m3J3k15N89l08r5J63j43O5J46m7q3j77J26N5k6J22
3026I7j77J51j25J8J79jl63K49j7M7j29K01j98j00J53K0j81J11o8J96k98J44J17
$$ plain form
2853 82 14 25 103 133 160 -53 20 -58 -81 -38 129 51 -70 27 -110 -142 56 -88 -2 70 72 -164 -29 -87 225 -126
2879 -126 -164 -116 -76 269 20 -92 -201 26 -64 -244 -156 5 -8 -20 44 97 -136 132 -68 -36 17 -17 64 -26 43
2904 43 -169 5 -18 141 7 45 68 -46 96 57 -204 28 67 -253 -106 19 60 17 -14 -53 -66 12 166 -238
2928 -238 98 -67 -4 -101 -81 257 -163 -20 -49 33 158 135 88 153 -6 102 151 -119 -19 -71 24 -69 57 37
2952 37 -280 -42 50 -137 87 -26 -10 -19 -179 -8 66 -1 35 278 160 16 94 1 -124 97 -151 -62 34 -134
2976 -134 -90 139 108 -86 23 30 10 -185 -59 41 81 139 106 6 -17 18 -105 -32 -38 75 6 -216 42 -127 -43
3001 -43 -148 -163 -9 -12 -97 -13 73 -45 -88 -75 -290 299 -9 -104 59 -84 -19 127 80 -3 -180 -54 1 -25 97
3026 97 -80 71 -54 -36 143 142 -221 28 11 58 -71 130 -68 -168 -15 5 -176 -65 -133 63 -235 -91 26
3049B6K65j91k28J37N9k16J24N0j3Q4j07J67j21N4K1k48O9Q3j62J66o9K18l14
3072a46J25oM6j5o3J0Q1M7j34J74j38J08j41K8J03l5Q1k05O2O9j8p2J25o3k06
3097a83J49k28K77j5j75L1n0J67j11j29L27j95J42j34j28J27mK98l29Q4o4N4J10
3120B1J18k01K9k1Q3k4k20Q6o6K28Q7Qj30l8k55L16j44K82k47J50P6j31P9Nj10
3145a9j02Q2J13m1K1M2n8j94nL17l78L30j99L37k36j03R0J47j59Q2J16kq0p0j60
3170a29k0J40l6J32j70J65j64K59J4j55k9J48l7k57J77q0j05L52o5q1K42l85J65
3193H1j7o1l9Q3j95J90K7j36L9L3J85l28K29j8k83K44j49K0K74k32J09j95J36
3216cQ1j35P6q7Q6p5K14j8j80K9r0J76O2r1j47J40M0j85J43r6J49P4K6l23J48
$$ plain form
3049 26 291 100 -128 9 68 -148 -24 26 13 97 -10 157 36 90 111 -137 -68 15 -147 19 -50 168 -146
3072 -146 -21 -27 19 4 -59 -49 32 79 -55 119 -19 89 -52 -24 79 44 125 -80 -18 51 33 -39 86 23 -183
3097 -183 -34 -262 15 0 -175 -144 -194 -27 -138 -267 60 -135 7 -127 -255 -128 -132 166 -163 -79 -143 -89 21
3120 21 139 -62 -33 -54 29 5 -215 -129 -195 33 120 128 -2 -40 -295 21 -123 159 -88 62 138 7 86 91 -19
3145 -19 -121 -39 74 33 54 96 38 -156 -161 156 -222 108 -91 246 10 -93 -3 144 -15 67 183 181 101 31 -129
3170 -129 -149 -9 -45 87 -83 82 -82 177 191 36 7 155 118 -139 38 -42 -147 205 140 59 301 -84 81
3193 81 64 3 -36 47 -148 42 69 -67 -28 5 190 -138 91 73 -210 34 -115 -95 179 -53 56 -139 -3
3216 -3 78 -57 19 -68 18 -57 157 139 -41 -12 -102 74 136 45 -102 38 78 -107 36 -60 89 163 189 -134 14
3241A4j15j3J29k51J12J66k24j08M46j49L4K73m61L19ql49M6J98L8j94R8Qj20
3264a11O8R9l8k35M02j89r9K10pk8j11J5o4M7j0J18j92K30k5j82m2K57q5j51K21
3289I8q9k01K18k21Q2J75Q5k73J75j57K5J09j47K85j01K9k80J98n8J26p8k18K98
3312H0j83J0J82P0l31n0K28J51o7k61J58M2R2M3m12M36Nk22O2J41k06J63l15L
3336a81K96j17N9J14k47J66N5m5k16J97j59L1R1q9p4Q1p4O9r9J01J59K1P6n2k28
3361f5k05M28l02K44j52N6p0J46k97J13L8m1L08j88%l7n5P1N9K8j63J1O1m2r6
3386a50K25k34L27k84O1k3Q8K05l49K41k57L17k17j6J96j18j70K04q0K7N9q3J32
3409A01l18J96P4R4m9k11Q2K11j84q5Q9n0K24j31J55j12k38M34l64J8J77j9l0
$$ plain form
3241 14 -101 -114 15 -236 -124 42 -182 -290 156 7 41 314 -147 172 164 -185 -139 59 97 -97 1 9 -111
3264 -111 -43 56 18 -217 185 -4 -103 107 100 72 -39 -24 -88 -41 -51 67 -125 105 80 -102 -144 113 28 -123 98
3289 98 9 -192 26 -195 -113 62 147 -126 49 -108 -83 26 -121 164 63 92 -188 10 -48 78 0 -218 80
3312 80 -103 -93 89 159 -172 -222 6 157 90 -171 -13 29 121 164 -248 188 193 -29 33 174 -32 131 -184 -181
3336 -181 115 -2 57 171 -76 90 145 100 -116 81 -78 -47 44 -45 -119 -38 -112 -43 -142 -41 118 139 215 163 -65
3361 -65 -270 158 -144 100 -52 4 -66 80 -217 -104 -66 -107 201 13 13 -24 -79 -8 51 79 -84 -73 -12 -54 -150
3386 -150 75 -159 168 -116 -55 -78 10 215 -134 107 -150 167 -50 -66 130 12 -158 46 -34 -7 52 -31 101
3409 101 -217 -21 53 147 98 -113 -31 180 -4 -89 0 -50 174 43 198 86 -152 282 -82 -64 113 94 64
3432F4j15J01o0J04j39J77o0J5k39P5J20k11J53L9k3J12j25j76K87n2j76K9J16
3455A6j81K6RN2J96p3j20O6K7o7j80K39j96L33l55J23R6j26rP5Q1K9j84OjM5N3
3482b0K2k2j98K34J04j23O0J30l6k34J49k13K09nk02O7l7K79j56j28J57J93k38
3505h%j56j05K51j14K39m29J94J81j72K97k1k02R0J6j20K8P3O7j94J1q8R9J57
3529I4M7k51j46K57l3J16Kj33o8j6K7J20q5q1L3J27M9n1r1M5J16L0j3mr7j5K76
3556B55l69j32J88P6j32J60j5K2j21p0J60N6nl5m1J82k37M8R7j0j9K03l09n3J88
3581H7M6j75k0l5K33o0q7j68L24j14rL02l65N4k33Q9K3p4J99L7J1j82J74N4j15
3606d%P1j02p5R2o2L78l18J19n7K5j81LJ73k33L12j54O2m0O2r7J65j14j14J73
$$ plain form
3432 64 -51 50 -10 94 -45 132 72 87 -152 -77 43 -168 -15 24 1 113 -12 -188 99 47 -129 -100 16
3455 16 -165 -139 -130 -78 118 45 -75 -9 18 -49 -229 10 -186 147 -208 -85 11 -115 -124 -49 32 61 -123 -117 -118 -73 -20
3482 -20 2 -20 -218 16 120 -3 57 187 151 -83 66 -147 62 57 -145 -78 -115 164 8 -120 37 230 -8
3505 -8 -8 -164 -269 -18 -132 107 -322 -128 53 -119 178 157 -45 45 61 -59 -31 42 109 -85 -74 -162 -63 94
3529 94 141 -110 -256 1 -32 84 86 -47 -115 -131 -104 16 -69 -150 -117 10 59 8 -83 -38 78 108 95 91 -6 -21 255
3556 255 -114 -246 -58 18 -114 46 31 53 -68 -138 22 78 73 38 -3 179 -58 -10 87 77 58 261 -48 -101 87
3581 87 133 -42 -62 -97 136 76 -11 -179 145 31 22 324 -41 13 -220 -131 -108 -182 17 54 65 -117 57 111 -4
3606 -4 -4 67 -35 -110 -18 -80 298 -20 99 42 67 -114 -111 62 -171 141 -13 49 9 71 -26 139 25 -89 84
3631H4m7rK9j02j76K22j43K36j6n2J28n7K1j10o9r7K87ol99K42J62l16K17j13
3655h4J37K2J3j75J08K3l8J2K43l39K6O0j86q8J62j7L19k38o7J24N2J04r2pk21
3680a47Q1K14m9j63p4L0r3K72j10K65k85J85q9j9k39J45M2m3O6r6K12k08J29k32
3704b06L10j95K11j71K93k29j68K79j16J28J5j26q0N9Q2k66J28k12P2K74l9p8
3726c5J10j18K18P2k33q1L5m4j02J76n3K49k03l65L26J11j00K0L0J02j90n8RN
3750a19O7K32r5k78K60j65R3L7J60j69j22p7J83Ro0Q6O8r0J2j52J68l5o2O7k76
3775b58R0L19j76j07j38L44j15J86p4l8o7Q9M6n3j37O3J36J0k00P8l3j62J31K15
3799A49l39L24L4l08J81k55L58l78J23J20K33q6k69q3RK24M3L7k60J60k34M00
$$ plain form
3631 84 37 28 57 -45 -221 1 -142 94 78 26 154 97 118 8 -61 -158 129 123 -276 -34 128 -188 29 -84
3655 -84 53 75 88 -87 21 44 6 18 261 -78 -52 8 -178 -266 -104 -121 198 -40 -107 17 69 173 81 74 -147
3680 -147 -66 148 99 -64 -138 -108 -201 71 -39 226 -59 126 37 18 -221 -76 -34 -77 -11 -107 105 -103 26 -206
3704 -206 104 -91 120 -51 242 13 -155 124 8 136 151 25 -55 4 86 -180 -52 -264 -192 82 43 -35
3726 -35 75 -43 175 247 14 -67 -32 -76 -178 -2 -55 194 -9 -374 -48 63 -37 -17 13 115 -75 -133 -124 -119
3750 -119 -52 180 85 -193 67 -98 -5 32 192 23 -99 -176 7 16 -44 42 110 20 32 -120 48 13 -49 18 -258
3775 -258 -168 151 -25 -132 -270 74 -41 145 71 33 -34 55 101 48 -89 -26 110 120 -80 -2 -35 -197 -66 149
3799 149 -190 134 168 -140 41 -214 144 -234 -111 9 242 156 -113 -196 -187 37 80 117 -143 17 -217 183
3821A83j78J98l36L27j90j10n3K86j30j27K02k0m7j01k7P5pj17q1K36l5m2K8J75
3845A09k30L3M2J49p2j8J2j28K70j10q4J68Nl68L05k10J65o5J7P6j51J51j7j08
3869e9j99L86m0r3P8m2q3j60K06l7O1R2k26K1j27L14j16j66J49J66j16o8J5L6
3893hj84J22J6P7o9o6J44r2k1K70j16N0Kj68k10R4M10k98J20p0m3J4M8j25o5R5
3919g3K27l8j23m2m0M8P8J4k33J48j7J01k2j16P5O6o0J62k97j73L46J10j44Nl
3944ap4J52j46K14k04J07j07J59orj15Q6J4r6j9j78J62J73j16J02n4k0o2k5Q7
3969B4r9J21nO4o9j27L6P4R6r3j8K66k81j6P4r4K1R8j18k7pJ53k17J15r4O5L32
3996B74k98qk4K23l10L32m00L03p6J9J65j77j6N5k1k25K07on4j34K13P1r2M8k45
$$ plain form
3821 183 5 203 -133 194 4 -106 -159 127 -3 -130 72 52 5 -96 -123 -48 -55 -172 -253 -17 -52 -94 -66 109
3845 109 -121 -88 -46 103 31 13 25 -103 167 57 -27 141 146 -222 83 -127 38 -27 -10 66 -85 66 49 -59
3869 -59 -258 128 88 -5 73 31 -52 -212 -6 -43 18 110 -116 -95 -222 92 -24 -190 -41 125 9 -59 -44 -8
3893 -8 -192 -70 -54 23 -46 -112 32 -60 -81 189 73 123 125 -43 -253 -159 251 -47 73 3 -40 -26 22 -103 -168 -73
3919 -73 154 116 -7 -49 -89 -41 37 51 -182 -34 -51 50 28 -88 -13 53 -7 155 -142 -315 31 141 -3 2 -1
3944 -1 -75 77 -69 145 -59 48 -59 100 94 85 -30 56 70 -26 -45 -223 -61 112 -4 98 44 24 -38 -63 24
3969 24 -75 46 41 105 36 -91 -55 19 115 22 4 270 -11 -27 47 -47 -26 72 -46 -73 -80 73 -144 -29 -123 -58 274
3996 274 -24 -32 -56 167 -143 189 -211 92 16 35 200 23 7 62 41 -184 23 17 -37 -171 42 113 21 69 -176
4021a76K55l3l0m9K99j73J24j13j54K04j89O9O3j59N1j67M3K87o6j0k22J37J46
4044A37l07N4J28JJ17N3k56J46j89J27P6J9j33O2L1k17o0L03k66M1L3K81j24o0
4068cr0rk4lK40J7j55J29m9m9j42J86O6j07o7QJ12P5q4J40j48p3j1Q3j20K53j44
4095C1j39m1N3O9j74J74j52K28J9l14N48p8k24j3N2p8J23j50J27l3J26l18J83
4118A9J67k08K5j28o6q8M02j90J18MJ1p7j7q9O2J29j7K21l07N7P2p6k83K13J86
4143A40J32m86J47o5J18r8Q1J7j17LL4Q6J40k99K07L7nq1L2j73J55P2j6n7K16
4168B20j43k84J23Q7k5J31j39Q9j48R6L9k9k09J52J31k34Q9l6J42Rp0L2R6k85
4192a66q0M01k35K22j5j46L8q9K35k18R4J41j34j60P9q0R7pQ0j43K46j48q9j53
$$ plain form
4021 -176 79 46 16 -33 266 93 217 104 -50 154 -35 34 97 -62 -11 -178 -135 152 86 76 -146 -9 137
4044 137 -170 -116 12 13 130 183 -73 73 -116 11 87 106 -27 35 66 -151 -211 92 -174 -133 -100 181 57 -3
4068 -3 -93 -102 -126 -129 111 128 -27 102 53 4 -138 48 114 7 -60 -52 60 135 51 191 43 -30 -41 42 -78 175 31
4095 31 -108 -149 -96 -27 -201 -27 -179 49 68 -246 302 224 0 -13 39 -39 84 -66 61 28 154 -164 19
4118 19 186 -22 3 -125 -191 -279 123 -67 51 55 66 -11 -28 -117 -55 74 57 278 -29 28 100 24 -259 -46 140
4143 140 272 -214 -67 -132 -14 -112 -31 -14 -131 -128 -94 -8 132 -167 40 77 72 -9 23 -150 5 77 61 4 220
4168 220 77 -207 -84 3 -22 109 -30 59 -89 7 46 17 -192 -40 91 -143 -54 -90 52 61 -9 23 119 -166
4192 -166 -246 155 -80 142 127 -19 19 -70 165 -53 41 182 48 -112 -33 -113 -16 -23 57 -86 160 12 -77 -230
4216b30J12J59j30K23j8j17j73N5O2K12j75J60j97K90m02J68J86m69N83m00J79
4237G8Q7M8l87J22Q1l2j7J58M1q5k8j1N6k05J24n3M4n5J51l07K47L5j4p3l6j03
4263a34Q4P0j55J78j43J54J9p9j38O2K8J24k7LK1M0q7j37K67j41N2J3l49J92J42
4288E9P3M9j92n0P4n2R6j70P1R5j33J33j52K38k08n6K21N1J07j42j09K7J39q1
4312H8J5M0j19j08K4L33m14Q2P2o2K9k03K25J43k32K6q1Q4P9K5j55j44K96r1J5
4337c3m9L0O7M4P0k88l9RJ57J89j77J41o7j26N8m2L2q3N2K21k47N6j8J36j55J08
4363D6n0p8L92r2k83J22k5J1P1n1J68k52r2J7J39j76J56j76K03j13NJ06l7K3j71
4388a37k7J87%k68J58O2j9K54k79Q1j42J59J87j82K3p5K1J21k07P1q7oK43k24
$$ plain form
4216 -230 -118 41 -89 134 116 -1 -174 -119 -57 155 -20 140 -57 233 -169 -1 185 -284 299 -101 78
4237 78 165 213 -174 -52 29 -3 -20 138 179 94 66 55 111 -94 30 -23 21 -34 117 -190 57 92 78 5 -31 -134
4263 -134 -50 20 -135 43 -100 54 73 -6 -144 -82 -54 70 43 46 67 107 20 -117 150 9 61 74 -275 -83 59
4288 59 132 181 -11 -61 13 -39 57 -113 -42 53 -80 53 -99 139 -69 -125 96 147 254 112 3 30 169 88
4312 88 103 143 24 -84 -60 273 -141 -59 13 -49 -20 -223 2 145 -87 -61 -142 -58 21 46 -109 -253 43 -48 -33
4337 -33 -82 -52 15 59 129 -159 -198 -189 -32 157 -20 121 54 -72 -14 -56 -24 -107 -55 166 -81 -25 -43 93 -62 46
4363 46 -4 -82 310 218 -65 57 32 43 114 63 231 -21 -113 -96 43 -133 23 -153 50 -63 -58 48 11 34 -137
4388 -137 -164 23 23 -245 -87 -25 -44 210 -69 12 -130 29 216 34 57 -18 3 124 -83 -12 -99 -105 138 -86
4412h6q9J81j61J70j06J19r0J99l20K81p9j44Q1J55k13J64n9p2J43o8p7J37p6
4435a0m2L0J61r6j15lJ64k67J40J10l1n3k80L54k29K32j04KP1Kj42K19j17j12
4459a16L2O7r7N8q4K51k72L45l34K37M4j08j98J15r8J08lJ30J9j08j50J5M12j07
4483A58p1j26kn9o2L65l07Q0O9J67j0rl43J82R0j05k39P6J68k32L30k92J88j44
4507a28J06j16O8j55L61k48K70q3q5r4Q6O5j88l0K42k00M1j9K33j81k9K63m33
4530b54oM35l53mJ32J09K0p7N8j0j27J47K3n1k37J25N9K22O3l89K71l07K22m5
4554B6L4j46J77J14m9j44P5j15Q2k22M05k32J22k24P6J51j53o1K55j97l7J6q3
4577a30M4J85l8j3R3J8j40J36n8k61K74n9O1j54J07k00J26J26l01L3K17m2k9L7
$$ plain form
4412 -86 -175 6 -155 15 -91 28 -62 137 -183 98 19 -125 -44 111 -102 62 3 -69 74 6 -71 66 -10
4435 -10 -52 -22 139 43 -72 -75 89 -178 -38 72 41 -12 -292 62 -167 65 -39 -37 34 36 -106 113 -4 -116
4459 -116 -84 -17 -114 -56 -140 111 -161 184 -150 87 131 23 -175 -60 -158 -50 -53 77 96 -12 -162 -147 265 158
4483 158 87 -39 -41 -100 -162 203 -104 -24 45 212 202 193 -150 32 122 17 -222 -146 22 -210 120 -172 16 -128
4507 -128 -22 -138 -70 -225 136 -112 158 75 -10 -104 -18 47 -141 -171 71 -129 -88 -107 126 -55 -84 179 -254
4530 -254 -260 175 -178 -182 -50 59 79 2 60 50 -77 70 93 42 -195 -70 -11 211 274 -115 156 -151 71 26
4554 26 60 -86 91 205 156 12 87 -28 54 -168 237 5 127 -97 -21 130 -23 -84 171 -26 -63 -47 -130
4577 -130 -86 99 61 48 141 159 19 155 97 -164 110 51 112 -42 65 -135 -9 117 -184 -151 66 24 -5 32
4601C2j34K22j94J09M4o5J61j64oj31J72J76k70q5J30O3k01M7p3J20J43j97K8
4624g3OJ20K8n5p0n6O1j29J04l8J45J09j82n5q5M24l09p9L1K8Q9J13J11j83r0
4649c5k10K28J28r6L6K35m12K58o0J3j29pm4R3Q0k11N7O2j0J51Lj02J04j05j81
4674a54r5K61j75J40q6K43L0j13p0o0p7K28k51Q0Q5j91K91k57j0J11k0L65k94
4697a9J73l58J51j25K29r5K05k38L19k02j05k5KR2j48K18j64j3J01o0N6P2qp2
4721a4o8J94l6o2m7N4j23o9K7L32j93k30L06j7rq4K2J4k04K50j90O1QL01k87J95
4747A31j1k00J61j10j9N2K1l01K42J06O5j19J5n0j55Q6M7P6j01K64j53Q5p8k6
4771B8k6j73K58k7M0l2o6j31O1M4J23rj9j16K05K5j74J02M9k77K21j98KL6j07
$$ plain form
4601 32 -102 120 -74 35 79 14 175 11 5 -126 46 222 -48 -133 -3 60 -141 -94 -167 -47 96 -101 -73
4624 -73 -67 53 81 26 -44 -100 -39 -168 -64 -102 43 152 -30 -85 -170 254 -55 -134 -103 -75 14 127 238 55 -35
4649 -35 -245 -17 111 15 51 286 -126 132 72 85 -44 -51 -95 -2 78 -133 -76 -14 -24 127 130 28 132 27 -154
4674 -154 -249 12 -163 -23 -109 134 164 51 -19 -79 -156 72 -179 -99 -14 -205 86 -171 -181 -70 -90 275 -19
4697 -19 154 -204 -53 -178 51 -44 161 -77 242 40 -65 -90 -88 4 -144 74 -90 -103 -2 -62 -6 66 58 -14
4721 -14 -82 112 76 14 -33 21 -102 -171 -144 188 -5 -235 71 54 45 -39 -17 -3 -207 43 -147 -86 -78 223 -64 131
4747 131 120 -80 81 -29 -48 4 25 -276 -34 72 137 18 33 -17 -172 -86 -39 37 -64 200 47 132 54 28
4771 28 2 -171 87 60 100 68 2 -129 -68 -24 99 90 71 -45 160 185 11 113 162 -115 106 -92 -90 -54 -161
4796a61K65j01q3k3R1o2k3J26K2r2J57k26m5L42k17k6j06L67j36m8R7j23J66o2
4820I9k78MJ82L9L0P8o4n4oO8Q8k83R3J08k87K08K4j88K36j65o5n4M40l45Q8K5
4846B1k05L55j58J6j00L9R3j34J9P3p7L1q4L6J61J03m01L55j35m5J35j02K22n44
4870c26K4K61J26k78K58n6K3j93L59l63K65K6j18k7k01J01J55Qn9K04j30j67q
4893a16N8j80N6K59l6N0L1r3K55k21m6J38n6j54J55O9j39J9P9O8l01P2r1J19O6
4918F1k77J53J20j21rK40m61L71k4k29K10Qq5k9J33j08R8K1l23M09k67j09M33
4941B15k67l9M1K6K49l21K93k58J20R1k39K19j34R3n7k33K36O4j38J59K9k57R9
4964ipK36k15j2j40J15J26Mq3J4J10r2pj72J12O9j75Q7K7M0k76Q9J44K78k29k6
$$ plain form
4796 -161 104 3 -80 -103 -12 -74 -97 29 51 -41 116 -110 -155 187 -30 -56 -162 205 69 21 118 -5 161 99
4820 99 -179 -175 7 46 76 154 90 36 30 98 186 -97 -4 104 -183 25 49 -139 97 -68 -133 -187 253 -92 -4 21
4846 21 -184 171 13 29 -71 -32 61 -73 -54 19 -58 -27 -111 -75 86 189 -212 143 8 -37 98 -4 218 -326
4870 -326 -302 -41 85 -193 65 9 32 -161 198 -165 100 126 8 -19 -220 -119 36 44 -15 189 59 -108 -116
4893 -116 -58 -238 -182 77 41 91 122 29 284 63 17 155 99 -55 100 169 30 49 128 196 -105 -33 -124 -5 61
4918 61 -216 -63 57 -64 -73 167 -294 77 53 -176 34 42 -43 -72 61 -47 51 72 -251 158 -109 -218 215
4941 215 -52 -91 -50 -24 225 -96 197 -61 59 150 -89 130 -4 89 32 -201 35 99 -39 120 149 -108 -9
4964 -9 -16 220 5 -7 -147 -32 94 98 15 29 139 47 40 -132 -20 49 -126 -39 -12 28 -248 -159 -15 263 34 8
4990HR5l95K53l5J64j68n4K93k90m4J52J04M9j95Q3j31lJ72l9j33J29K08l37O0
5014e4J85m8K2R2j32q3OJ5m7j7j23K03R5pp3j05J33j3j33n8K60j0p2j74J63j54
5040a29J88j8j64K74j05j85L36k93M6n9J35j2o7j6J12mJ0j21N8l4R2K7K5j72J49
5065G3l89L26oJ2Nl0P6n3J59j50L2o2j0J59l19K05n3n9j33J29Q9N0o7L1J48j52
5091A1k34K53n2oJ02l02M5N4J19L1k7l5J00J49j69j67K50Rk0lk6k52J06RJ25j83
5117a13J85l1P6j73P9R9k13l1K32j98R9k25M32j75j61j25L69P6l60N0O8O6j40
5140a14K57j83K89j95j03j16J09L4L78k43k31p1J06J55k20M06m29K8R5N5J33j43
5162cM2j17J43j60k7jK03Q0k17k8J04l0q6P3l6P5J14r2j47Q5r6K03n3m4j3J72
$$ plain form
4990 8 103 -292 -39 -74 90 -78 -132 161 -129 -173 -21 83 132 -63 20 -111 -114 58 19 -114 15 223 -114 -54
5014 -54 131 83 105 197 65 -18 -12 3 -44 -61 -184 19 114 107 34 -71 62 49 -84 -142 118 108 36 -138 25 -129
5040 -129 59 41 -123 151 46 -139 197 -96 -50 -109 26 14 -53 -69 43 39 49 -72 -14 -48 44 71 96 -76 73
5065 73 -316 10 4 16 21 -9 67 14 173 23 55 -7 -17 142 -177 28 -25 -84 -217 -88 1 51 -16 15 163 11
5091 11 -223 30 -22 -28 74 -228 -183 -129 -10 21 -6 -41 59 208 39 -128 122 131 111 108 82 -170 -64 -55 70 -113
5117 -113 72 41 117 -56 23 122 -91 -122 110 -88 11 -214 218 43 -118 -243 126 202 -158 -108 -40 26 -114
5140 -114 143 -40 249 54 -49 -165 -56 -22 356 113 -118 -189 -83 72 -148 258 -171 -143 -48 7 140 -3
5162 -3 39 -78 65 -95 -122 -123 80 160 -57 -85 19 -11 -97 -24 -60 15 129 37 -110 -25 -121 82 29 -15 -28 144
5188A44j51M1j54K50R3k71J46j%M8k56J64r7k36M19p5Jj10K51k51R4J10j03r2
5212c6P2l5J3m3L3R9j03K7n2J23k25J39j24j9J22R8j13M0o1OM1J64j32j61J9P5
5238c3R4m8p7J52K6j28j54L7K21j34N4J05j23j36N0K14j77K27k92Q9n3K05j28
5261ij4J16J22k19m4K6o8J4O4J56J5k62J47j27j03J53m7L0J22L5j62R6j04N9k4
5286b8L0J20k29L04j86j70J70K17k88qK51j32J33k00K32k98J62L7k76J80L6K8
5308H5q7j26n8J21K62r3j51R7J7J21j27o8J0j06J50n4K8k2j21J3K24j90K35m8
5332A12m3J75j27k23J76Lo5j80L42k36j9R4J60k34l5k7mJ54L0Q2j05L2k35J50
5356b3j89J19J56j11o7J83j72J14j22P0N9kJ61l6j35P4j34Q6Q8p6Q2j22l1Q9o7
$$ plain form
5188 144 -7 34 -120 130 223 -48 98 97 97 145 -111 53 -44 -280 139 64 65 -45 206 -45 49 159 56 -36
5212 -36 36 1 14 -29 4 103 0 27 -25 98 -127 12 -112 -131 -9 89 -24 16 -45 -39 2 166 34 -127 -108 -33
5238 -33 61 13 -64 88 114 -14 -168 -131 90 -44 10 115 -8 -144 -94 120 -57 170 -122 -33 -86 119 -9
5261 -9 -23 93 215 -4 -48 -22 -90 -76 -12 144 159 -103 44 -83 -186 -33 -80 -50 72 107 -55 41 -63 -4 -28
5286 -28 2 122 -107 197 11 -159 11 228 -60 -68 183 51 184 -16 216 -82 80 117 -159 21 57 85
5308 85 -2 -128 -186 -65 197 104 -47 50 67 188 61 -7 3 -103 47 -7 21 -1 -122 -109 115 -75 160 112
5332 112 69 244 117 -106 70 73 8 -172 170 -66 -85 9 169 -65 -100 -127 -131 23 53 135 30 62 -173 -23
5356 -23 -212 -93 63 -48 -115 68 -104 10 -112 -42 17 15 176 140 5 79 -55 31 119 43 125 3 -28 61 -6
5381fJ80K4k44j99M08j47OM1j91J52M4l0O8lk33J91j98J58J95l87J63R0o8K4n3
5406a5n9O1J34j00M7k37K08J4r6O3Mk4j71K35o8k1R2L2k44K04o5L9o5m7Q2j31
5432a28K29k17j59L29M9j90jK30j05j26K04k36QK5K7J10L9k0j87J67o4J51k15
5455h0J56Pk14J45k1l2J49j22j34J13R0P9k68qJ36K6j15Q9J95q3o2q0J03M8k42
5480a25J5K20K9L2k53k43L96L4l15M02l91M12l81J49ko9J56r2P0J46j24O8j4o5
5504E5j54K0K81k74O7l1k80K36K05j72q9K1J48j35K02k59J01K33q9j02J00j17
5526c3J18j02J86q2r5J87j81J79l15R1l6J3O3m1o1J44N4K05k95j3J37k6j27k9
5550e9K59l62M9l0K86j57Q5m6L3Mn0l9J7j97L14L8j71j01K5J79j19mK7l7J31j31
$$ plain form
5381 -6 174 198 -46 -245 163 16 22 63 -128 24 68 38 106 103 -130 61 -137 21 216 -171 -8 82 14 38 -15
5406 -15 -74 -13 121 21 68 -169 39 53 -43 20 24 0 -171 64 -4 -25 67 99 -145 59 -6 33 -32 -79 3 -128
5432 -128 101 -116 -275 54 103 -87 -88 142 37 -89 115 -121 -113 -88 -61 49 88 68 -119 48 -16 135 -80
5455 -80 76 83 -131 14 -7 -39 110 -12 -146 -33 57 136 -132 -140 -4 22 -93 -4 191 108 46 -34 69 117 -125
5480 -125 -110 110 139 171 -82 -325 71 105 -210 192 -199 213 -168 -19 -21 -90 66 -26 44 190 66 134 120 55
5504 55 -99 -79 202 -72 -5 -36 -316 -80 125 -47 -136 -115 33 -102 100 -159 -58 175 86 -16 84 -33
5526 -33 85 -17 169 87 -8 179 -2 177 -138 -47 -83 -70 -7 -48 -109 35 89 294 -1 -14 123 97 -30 -59
5550 -59 200 -162 -113 -143 143 -14 71 25 58 62 12 -27 -10 -207 107 145 -26 -127 -102 77 -42 -46 -19 -56 75 -56
5576e6J79j0k2p5k0P6K1j85J40l05L33j88K04l5m9r7K08k34qJ41J40R2k80k8R6
5601C8L0q7m5L7M3k13L55j98J49j09q2j46N17j97o6j36J76k4J6qj34m3K10Mn3
5626C4K02k62k01L26k1J3k8j7j81J18K96k54o4K17m56L57r9J65j94j08K31l5m3
5649dn6J92l50J8L12pL3K35m31R9j85J49Q3R4l99K74J55k85J35m6J5O8j19J55
5673A35l12J76m9J92rn4j58J47qj55p6K52k07P3j36K42j02l5L35k15Q2m5n5J06
5697A24j4k23K24j83J86j44J11k3j23N5P6j41Q3j02J19J75j23Q6r9j72PQ1QJ41
5721A29Q4k67J9Q2k47o6M80l69kJ16r1L29j64ql56K66pJ79j06k4QM1o6K1RM2J65
5748A97j39j13k5R8j32M27l04n2K06j07p0r6J36R2j35Oj7q9MP9k17K61l2J86j55
$$ plain form
5576 -56 123 113 91 16 -4 72 93 -92 48 -257 76 -112 92 57 8 -89 119 -115 -123 18 158 250 -30 -58 38
5601 38 68 -19 -64 -27 16 -197 158 -40 109 0 -82 -228 289 92 26 -110 66 42 58 50 -84 -127 83 87 34
5626 34 236 -26 -227 99 78 91 63 46 -135 -17 279 25 -39 178 -278 79 -20 145 -49 -157 74 39 -4
5649 -4 -60 132 -218 -200 112 105 138 373 -58 41 -144 5 88 182 -217 57 212 -73 62 16 31 99 -20 135
5673 135 -177 -1 -50 142 133 79 -79 68 60 -95 -171 81 -126 -53 -189 53 -49 -84 251 36 118 73 18 124
5697 124 110 -113 111 -72 114 -30 81 58 -65 -10 66 -75 8 -94 25 200 77 163 64 -108 -101 -20 -12 129
5721 129 213 -54 -35 47 -200 -266 214 -155 -157 -41 -132 197 33 25 -331 -65 -72 107 1 -23 -15 26 -40 -19 -10 32 197
5748 197 58 -55 -80 18 -114 313 9 -43 163 56 -14 -110 26 118 -17 -11 -28 -117 -113 -34 -251 10 -22 164 9
5773Iljm4j65J5K86l2j1k67P1J60j43j14L95k02J27j06n1O7R3j33K03k18j30J94
5798@q4K98j19lj73J20o4J12j87J66LrK0J3l1p0q9n0k8Q9j15K53j67K34j9j19
5824a9L4k23L48n0J68m17J64Ol7J63j98L7j80L73k55J67k28J41k4l5o6J56J05
5847A30k07J10q1J86q3Ro7l2k5J31j22J20JK3j0r6J5l7j10K50j09J93j57j44Q4
5872b8k28K56R6k41J11L3N8j22J26N4k2j23J25m7l6r9M61m09k13J73L4j42J39
5895d4K03j25j50J86j32pK51k50N4p0PJ07l0jn6oN5J27l0j16k67K28J33rJ79l53
5921a16J67p6p4J16j40L25q9l17J87k8N3P2k63L64k73K1PK8J12j5j05J10K46m47
5945a35oK78j34M5R8j71J58k3j14l8j92K59M7j83L15j60j67R9J31j14q1J2K18
$$ plain form
5773 9 6 5 -39 -204 -189 97 65 54 -213 -142 18 -125 -239 156 -46 81 -25 -76 -9 84 -49 154 -64 -194 0
5798 0 -84 214 95 92 -81 39 -25 87 -100 66 69 60 80 93 62 -8 -97 -147 -175 -86 -201 52 -115 119 100 -19
5824 -19 15 -208 140 90 258 -159 5 11 -26 137 -61 -24 -204 169 -86 81 -147 -6 -30 -65 -131 25 130
5847 130 -77 33 -48 138 55 64 -3 -35 -60 71 -51 69 70 93 83 -13 2 -35 -145 105 -4 189 32 -112 -28
5872 -28 -256 0 96 -145 -34 -1 57 -65 61 115 93 -30 95 48 12 -87 374 -35 -248 -75 -41 -183 -44
5895 -44 159 34 -116 70 -62 -69 182 -68 -14 -84 -77 30 0 -1 -57 -63 -8 119 89 -27 -294 -66 67 58 237 -116
5921 -116 51 -25 -99 17 -123 202 113 -204 -17 -45 8 80 -183 181 -92 -71 -64 -36 76 61 -44 66 312 -135
5945 -135 -141 137 3 48 146 -25 133 110 -4 -42 -234 25 72 -111 204 44 -123 -24 107 -7 -88 -76 142
5968A42k70J29R7m08J10L87k65J4n4K22p7J18k64l8J71q3J53j81j36J23J02J14
5990A06j7k36J51J39j71M5o4J63l6j83o4J25J33R1j92k92J57J79k6J35k79K24
6012H8m0k77K62k06K11j67j41L10J94l08L2lK02r5j06K33k96J63n8k7k8p8l9L23
6036A49p8m3mQ4j52n2R0j9J84j22p2r9J37K28j74pq6k0j02K58j75L2Ql2N1o9K30
6063A45p1q2J39jM8k37P5j6O3m9k10J52m4J37O5j28l9J70n8n7j1J05k68K90n4
6088F4J6j9p1M5k9L4nk20K17j6J13q4j77L8K9L4J08j63J3O0q0N8J62o9l07K66
6114A7N2j45K2j69K07K60k85j9J9K80o9j71rN4q7M3k23J18J12j67K15l7MJ1r6
6139f3O5R2j16p7J73k63K89L0O7j75q9J05No7p5p6jJ12K06j00k00J51j60OJ99
$$ plain form
5968 142 -128 1 98 -310 -200 187 -78 -64 -118 104 27 145 -119 -157 14 -69 84 -97 -233 -110 -8 106
5990 106 89 -147 4 143 -28 17 -47 116 80 -103 -167 -42 91 182 -10 -302 -145 34 8 143 -136 88
6012 88 48 -229 33 -173 38 -129 -270 40 234 -74 -42 -45 157 62 -44 189 -107 56 -2 -29 -57 -135 -174 149
6036 149 71 28 24 108 -44 -96 -6 -25 159 37 -35 -134 3 231 57 50 -36 -56 -158 100 -75 -43 -35 -67 -16 -85 145
6063 145 74 -8 131 130 178 -59 16 0 63 14 -196 -44 -88 49 114 -14 -53 117 59 2 -9 96 -172 118 64
6088 64 80 61 -10 35 6 40 35 -185 32 16 129 45 -132 -94 -65 -31 77 -86 -73 -13 -93 -35 127 58 -249 17
6114 17 69 -76 -54 -223 -16 244 -41 -60 -41 239 170 -1 -10 44 -43 0 -223 -105 7 -160 55 18 22 33 -63
6139 -63 2 94 -22 -99 74 -189 100 130 197 22 -67 38 43 -24 -99 -175 -176 -64 142 42 -158 -7 -167 -161 38
6164C8j75P8P6K55k81R4j89m1K11r6j48r8K53j14J10q3J60j08J88j01l1l7J01
6187F2o2J7P0J58k84K40l79J93n6m4J37r8M8N0Kj21R5j31J89j17Q5j4K1k64J93
6212a0P8j71J4P8K8J73j03k48K23j49J19lJ35n5M2R6l63j95M41l30L01k20J32
6235A3P1k2K3J1j47L9j34J99j44R0q9M78j65k07J17j84K01k11P1p4l2J26J39j73
6259dk3l07M71r2L3j24nN7J43k16M4J6j16o2K28N2M5j84j40K89j99J82Mj11l1
6284e0pN6j8L1jO0j50O9p9J9J05j20K41j72J47J04k74K4L6j40M9j62M77l35J77
6309H7q4mJ30p1R2j87J7k2j63K95k67n4L10j13rL0N7P1O8j71k9N7j78K32k8k8
6335C8r2N4J4l0j12J19o2J05Q9l20R3K02k24M4j7K1Q7j99O1r7K69j26L45k41J83
$$ plain form
6164 38 -137 -59 17 272 -9 85 -104 -145 66 -30 -178 -276 -23 -137 -27 -110 50 -58 130 29 -2 -39 62
6187 62 0 17 87 245 -39 201 -178 15 -41 -85 52 -46 2 52 54 -67 28 -103 86 -31 54 40 61 -203 -10
6212 -10 68 -103 -89 -11 17 190 87 -161 62 -87 32 29 164 109 151 247 -116 -311 130 -200 101 -119 13
6235 13 84 62 85 96 -51 -12 -146 53 -91 -1 -90 388 223 16 133 -51 150 -61 10 -64 -96 30 169 -4
6259 -4 -27 -334 137 45 78 -46 -51 6 149 -67 -23 -7 -123 -185 43 95 140 -44 -184 105 -94 88 92 -19 -50
6284 -50 -57 -1 -19 12 11 71 -79 -10 -89 -70 35 -85 156 -16 131 235 -39 -15 21 -119 -70 -232 245 -90 87
6309 87 3 -1 129 58 150 -37 -20 -42 -205 90 -177 -231 79 -34 -43 -13 44 115 183 12 -17 40 -138 94 66 38
6335 38 -54 0 14 -16 -128 -9 -71 34 123 -197 -104 98 -126 -82 -99 -78 9 -190 -129 -226 43 -83 262 21 204
6360B04q0l1j62R4j16L5J08p8JJ59q4L5q2m6J68l1r2P5j7j84M15k24r0Q3k50L8
6386a52l4K00o1O4k8r5M0J11k50K89JR7k61q3Q3M7l0M35m18J05k65P4J70k20L05
6411A24J21k10j54L5J70L6j23l0K2J24q2J20j82K39n2l92L65j80K59j80P4k15
6433a11J74k07K23k57J17K9RK08l50j7J70n8L3L6R7J06l99J79q0L61j89Oj1q1
6457a2m4P8j9j20O2J69l05L42j81J62j51P6J9R2l5q5l8p8k2p1K47n9M8j27J48
6482I6j85J12K6j70k2J19k80K91l16K91L0l2J6K30m03K82j64J27n5l9k1J00q4
6505e1N7J39j58j5j0Q2k11M3k5K30j02K5R3k62L57j67J07p1o9j21J2J31j54K17
6529G7j45J22j39M1Q9j10kJ12k6O3j56Q5k2k1J36j47N4j35J11j7J25j4k5l10K20
$$ plain form
6360 204 124 93 -69 25 -91 -56 52 -26 -25 134 50 85 3 -43 125 94 2 77 60 -124 291 67 -23 60 -190 -152
6386 -152 -186 14 -47 17 -11 -106 -66 45 -205 84 85 182 -79 -162 -79 -32 -62 373 -45 60 -205 -131 39 -181 124
6411 124 245 35 -119 -84 86 122 -1 -31 -9 115 33 153 -29 210 158 -234 131 -49 210 30 104 -111
6433 -111 63 -144 79 -178 -61 -32 -23 185 -165 -182 -12 -70 -37 -1 96 202 -197 -18 -98 263 74 80 69 -12
6457 -12 -56 22 3 -117 -55 114 -191 151 -30 132 -19 57 76 168 133 48 10 -68 -90 -161 86 27 75 -52 96
6482 96 -89 23 49 -121 -143 -24 -304 -13 -329 -38 -8 -40 -24 206 -197 85 -79 48 -7 -46 -67 33 -51
6505 -51 6 145 -13 -28 -38 44 -167 -124 -149 81 -21 4 97 -165 192 25 132 61 -8 -129 -117 14 -140 77
6529 77 -68 54 -85 -44 45 -65 -67 45 19 82 -74 11 -11 -32 104 -43 11 -124 -13 -30 95 81 56 -254 -34
6554c4Q9j51o2K39k81R2r3M07j23r0k78K10j39P9K41k4m6j43K72j17j64K30k96
6577a82L79l33j10K86o7J09j73j7J03J59l48J78K7L1o0J29j43Q1N8j24J25k22
6599a14J92j66PQ5P9k48k3K72l55K49J73j02J2p9J61q2j17j3r1J59k48M17l59
6622a91K95N0j94J73k7j50j7o0J04q0jm2L53k99J23J9M3j28J51L6k42P7P9j91
6646a19L2Q9l6o6J90o4j33J36J29r4j19n8P0n4P4K6J13j58n6K4O4p6K06l8k21
6671a39K60k77J74j17K45j53o5J49RJ0k04L60r0m22K21nn7J23J13j95Q0r3K42
6694A69j10jN2k25N6%N6k1K35j41Q9k29J65j63J54p5j5P2J5r6J94k26L76k87k3
6719B1m5jJ6q7J82l76K40J70l50j17M54m2q4j09R1K3O5q5o9J91J1r4m6ON4j13
$$ plain form
6554 -34 55 -96 -158 81 -200 -108 -201 206 83 -7 -285 -75 -214 -135 106 82 36 -107 165 48 -116 114 -182
6577 -182 197 -136 -246 40 -27 82 -91 -108 -5 154 -194 -16 11 42 -18 111 -32 49 107 -17 108 -114
6599 -114 78 -88 -81 4 83 -165 -188 84 -271 -22 151 49 61 -18 143 61 -56 -69 -160 -1 -249 168 -191
6622 -191 104 154 -40 133 106 -44 -61 -121 -17 -97 -98 -140 213 -86 37 56 99 -29 122 158 -84 -7 72 -119
6646 -119 -87 2 -34 -100 90 26 -107 29 158 64 -55 -113 -43 -97 -23 3 116 -42 -98 -74 -10 -86 120 82 -139
6671 -139 121 -156 18 -99 146 -7 -72 77 86 96 -108 252 162 -260 -39 -44 -101 22 135 -60 20 -73 169
6694 169 59 58 110 -115 -59 -59 -3 -24 211 70 159 -70 95 -68 86 11 -4 68 83 -13 181 -45 331 44 21
6719 21 -24 -25 -9 -96 86 -290 -50 120 -230 -347 107 65 -19 -128 -37 -14 51 -34 -103 88 99 5 -41 -35 19 -94
6745i4O3m9J60j93M7P8l1J03R2j18m2l3J03J2j79R5j10o0K84r7K45k35l71L21
6769iJ01N2k69M4J59q8j73J70k1j50Q4j36J39K55l73K08j15J26R3j07m9J69k12
6792a02J79l4k26J87O3J3j53K57q3q5J22k20J15J52q5j3r1Nj7J75j19N9j74R6
6816B1O6k45M58k78q6K54k8j39j85J39l2K06j30J2p0j55L10j84M8p8K26o1n2R8
6840A15k03O4n5N4J47o5J36j26k12j5K28n8Q6k47j01L28K4j02j24M8J19P6l8j16
6864c7%k5m5JJ31J0j34p9J74K89j66q9j6j36J03p4JK2r7K74p5j04N3n7j6j20L00
6891H8qmo6j4r9J69j18lQ4J49k91K62k91M2K9J94J5j23j09pM0k53L76l9L9k0j84
6918a42J15mp7K23k57J13j06L35k45J21k2J1l2j4j69J95j38kP2l1k1J4Q2L6j0
$$ plain form
6745 -94 -31 -80 80 -113 -66 12 -19 84 176 58 16 -17 86 98 -81 14 -96 -156 128 31 276 41 -330 -9
6769 -9 92 144 -125 -81 78 -10 -183 -13 -34 -184 -100 -236 -97 158 -215 -7 -122 4 97 -10 -59 110 -102
6792 -102 77 43 -183 4 67 80 -73 184 101 16 138 -82 33 185 100 87 -4 1 -16 159 40 99 -75 21
6816 21 87 -158 300 22 -64 190 162 23 -162 -23 -55 151 21 33 -37 -192 118 -66 -18 -96 130 69 17 115
6840 115 -88 -24 -79 -25 122 57 193 67 -145 -160 68 10 96 -151 -252 76 100 -2 -126 -78 41 117 79 -37
6864 -37 -37 -62 -107 -106 25 35 -99 -178 -4 285 119 30 14 -122 -19 -93 -92 -70 -167 107 32 -72 -19 -76 -92 -212 88
6891 88 80 76 10 -4 -103 66 -52 -55 29 178 -113 149 -142 -100 -71 123 138 15 -94 -101 -61 -314 62 23 62 42 -142
6918 -142 -27 -31 -108 115 -142 -29 -135 200 -45 76 54 65 33 19 -150 45 -93 -95 -23 -54 -75 -61 21 57 47
6943D7J12j98N3k24J18P5l9O6K68j68j96K15j88M5O3k09J41q3K2L5P0N1j74L93
6967B95l11n3P4k59M60k85J47j38J45O1l29K32j04P5j7LQ3j47J1m3L8RK54l27
6991a26J26J94j27j22N4J02m2L5j5JJ12k82L5J40j50j7P2j28j5M5L9K78r6o7j58
7016a12P3J5j04R7J59j54k4J46P8p9l26K31j39K33p9L2j10k3M8m8P2L1J2k7J46
7041A48j30J10j04j59J49J35j54K4q0J68ll89J68M6M5O9q0j36J87r8J54J2J09
7064A91Kj41J9j52J85j17Q4j15o7J48K11k24M3j28k7j8R8Q3q5J60j24o5J49r3
7088A7q6r5M4J38K9j32J05r2p4J50l0j34J79J24j66J33p2N2O4r7m5P6l6P0l0q2
7114A0k21J46J69n9J28p3l36J2L00J12j95j50J21M3j01K21k08K58j23q1K48l88
$$ plain form
6943 47 159 -39 14 -210 -92 -17 -56 10 278 110 -86 129 -59 -14 49 -160 -19 -102 -80 -45 25 76 -98 295
6967 295 -16 -69 5 -254 206 -79 68 -70 75 136 -193 39 -65 10 -7 -4 79 -68 -57 -100 -62 -53 201 -126
6991 -126 0 194 67 -55 -1 101 59 94 79 80 192 -90 -55 85 -65 -82 -10 -138 -153 -108 -69 209 113 46 -112
7016 -112 -39 -24 -128 -31 128 -26 -50 96 174 95 -231 0 -139 94 15 47 -63 -86 -38 -86 -14 17 29 2 148
7041 148 18 128 24 -135 14 149 -5 19 -61 107 104 -285 -117 -71 -26 43 -37 -173 14 -84 70 82 191
7064 191 193 52 71 -81 104 -13 71 -44 -111 37 248 24 67 -61 -88 -106 -8 75 -10 150 26 -39 110 17
7088 17 -69 -164 -120 18 47 -85 20 -72 -146 4 -26 -160 19 143 -23 110 38 90 154 57 12 88 52 122 92 10
7114 10 -211 -65 104 45 173 100 -236 -224 76 188 -7 -157 -36 7 -94 127 -81 177 54 -27 221 -167
7136a67K69j09N0J7r1J13q7j26N9K61l57K54J2o1j67J84n1q5K10k5N9O1J8k45
7160dp2J04j54L01m13K73P3k31J47N2k08J67O0n9J1M8k32r4M03l33R8J32p4k09
7184b14K28q7J2J49j5j83P6J27k42J38M3N0K1j24k9j45J05j1M9K39j71j34J81
7207F3j28O9kj24k5J45j18K1J36K2o4j24J03kJ5J68q2n0P2j32Q9j33J52k0j19
7232f8J74j41j67J09N0N7N2r1m4J48m6j18J34p1J44j8m0N5j16m9q6J4o2K14J33
7257A67l15K44k30J17j05J26k0P5j40N7J9p1J61q3O6r3k2k83M97j70QMOo0L6J98
7283A89L1k15j4J9N6k35K33N2j03q3J41m5J47r4m4P7Q2k28j00K46l11L07m2o4
7307BJ84m5l41N82l88pN3O6j1j9j49O5O2K1j53J06j04J49j41J74k06J18j17Q0
$$ plain form
7136 -167 102 -7 43 60 -31 82 -5 -131 -72 189 -168 86 98 37 -130 54 3 -82 128 103 162 223 241 -4
7160 -4 -76 28 -126 175 -238 35 108 -123 24 76 -132 35 95 36 47 95 -137 -231 172 -161 -63 69 -5 -214
7184 -214 14 -73 -61 88 73 -110 -34 93 -149 -11 32 82 103 -21 -50 -195 -90 -101 -52 187 16 -118 63
7207 63 -65 4 2 -122 -147 -2 -120 -99 37 59 -5 -129 -26 -28 -13 155 73 23 95 -37 52 -81 71 51 -68
7232 -68 106 -35 -202 -93 -43 14 66 -25 -69 79 33 -85 49 -22 122 104 64 119 3 -46 -132 -118 -180 34 167
7257 167 -148 96 -134 -17 -122 4 -16 59 -81 -24 -5 -76 85 2 68 -25 -47 -330 167 -3 5 9 15 -45 -9 189
7283 189 220 5 -9 10 66 -169 64 116 13 -70 71 26 173 79 35 112 194 -34 -134 112 -199 108 66 2
7307 2 186 141 -200 382 -6 -13 40 106 95 76 -73 -8 54 75 -78 28 -76 73 -68 106 -100 18 -99 -19
7331a9J15k39J15M1j21J91k78Q4rJ31L3j2o3J26j06J25j13j43J43pj7o5K45j67
7355a0O3k51P6K91j46Jp7L2j13K05l5J0K6L9j2l12K65k3j14j40K44N5j36j06J73
7380Ej74Q9O0j49K31j9L8j54P0k38J82R5J04k28K04j77L8l8Q7j31L6J78k28j05
7404b24L10p8ol1O8p3J02l5J08n9m9o0Pn3P1p3P7j37K02M1k54L41j28k9P3k40
7430a29J35O4jj65J11K06k89k7K99j77L4r9J9K45j90j2J95j24k3k07K31p8N2j3
7454E7n1j19L18j72K08k82m6M4K21j17r1N3k63J52O2m3J7R9p3r5K77k54P7j54
7478a75K21k05J53j20L4j4J18J12j76K87l59PR3P3O9r6q8O2MO6j70J13k6O9j15
7503f3oJ33J13j17k4J79m8j85J43k09n2J21l5O5j20J06j37Q4J86j89JR0R2j47
$$ plain form
7331 -19 96 -143 -28 13 -108 83 -195 -111 -120 11 44 32 -31 95 -11 114 1 -142 1 -6 -23 -88 157 -10
7355 -10 53 -198 -122 169 23 24 -53 -21 -134 71 36 46 72 111 99 -213 52 29 -85 -225 19 74 -62 -168 5
7380 5 -169 -80 -20 -169 62 43 81 -73 -3 -241 -59 36 140 -88 116 -61 -23 -61 26 -105 -69 109 -119 -224
7404 -224 86 8 2 -29 39 -34 68 33 141 82 33 -27 -20 -73 -2 -75 2 -135 67 108 -146 195 67 38 111 -129
7430 -129 6 70 69 -96 15 221 -68 -95 204 27 61 -38 -19 226 36 24 219 95 72 -135 96 18 70 57
7454 57 6 -113 205 33 241 -41 -87 -43 178 61 -30 23 -240 -88 -26 -69 -52 47 -26 -121 156 -98 -21 -175
7478 -175 46 -159 -6 -126 -92 -106 12 124 -52 235 -124 -117 -24 49 118 22 -66 -4 0 66 -104 9 -17 52 -63
7503 -63 -69 64 177 60 36 215 167 -18 125 -84 -136 -15 -50 15 -105 1 -136 -52 134 -55 -54 36 128 -19
7527a9M6K49n83M73m19N33m80M14k4l00K10q3M4lJ17k54QJ49q9j36J96K11j28
7550A32N8k35j6J27p9M2J8j8r9R1r4o1J59K40k70K2j41n4J66%N0j45K04k93O1
7575a35K16k31K98j23k4O0p0m2j65M8K07j04K78l6j72j63K01llj95J27k3O4Mj06
7600i2J93n9J71k46k06K76k53L10j03j06p1K83k07J15RJ18k11O0j7j1J33j1N1
7623A26k37K09p1J43k81L6J39o0q7j07K65kk03O1J26p4j13qrJ22K4k1Q5q8L1k6
7649b0o9Ll5J50R7j64R0j52R0m7j70L26j32P5K9k08J81k54M06ml49M06o9j80j24
7674a24K50k53R1Q1l8L08k60j05Q0r8m0K30o0j05n9J74j08J45p0L7k13J06P7J49
7698A95k09j42j79L40J43q1N8o0j91J4np7J78L9j25N7J13j07N3J56k82L7N3J66
$$ plain form
7527 -19 27 276 -307 166 -253 280 -200 214 190 -110 100 17 61 58 175 -79 -71 78 -11 -147 49 260 132
7550 132 190 -45 -61 66 -13 29 47 29 -70 21 -73 -134 25 265 -5 17 -124 -178 -12 -12 38 -107 97 -196 -135
7575 -135 81 -150 148 25 1 61 -9 -51 -216 -168 39 -65 213 177 5 -158 43 40 37 -158 -31 -54 10 14 -92
7600 -92 101 42 213 -33 -239 37 -216 94 -9 -115 -186 97 -110 5 14 132 -79 -19 -36 -47 86 75 126
7623 126 -111 98 27 170 -111 -75 64 4 -83 -190 75 73 -130 -69 57 -17 -130 -138 -147 -25 -1 -22 63 -25 6 -20
7649 -20 -89 -86 -121 29 126 -38 52 -100 -10 -57 -227 99 -33 42 71 -137 44 -210 196 192 -157 249 180 0 -124
7674 -124 126 -127 -36 45 7 315 55 -50 30 -68 -108 122 62 -43 -102 72 -36 109 39 76 -137 -31 46 195
7698 195 -14 -156 -335 5 148 67 125 65 -126 -112 -117 -194 -16 23 -102 -45 68 -39 14 170 -112 -75 -22 144
7722A44j54M3K7o4o9O6n4m6J36J34l75K35j46n6M78p7l8q5j77l6J21ONj84J91
7747B5M0j74k55K97K35j01m3m5K6O5m0j05P5J97k22p7K27q5o4K0J25k08n1O0P4
7772dj19J61k82J63K7L93m92M01l80MJ28n7J91j38l8J80Jk09N3n2N5Q0o0N6k52
7797a90K49K5J23k63N9K18k67J20o6R3k09P1l7j38J08J76%q1Q2k72P5k5K52j44
7821d1m5J96j90J47O2j46K28k22J00k8k71L49J39k35J6J12k65K64j41P9n8j88
7843a38K55j33m7P2qj60p5K93j82j06J63L17k32po0L8P6k00J72O3k63J78L1j1
7867C6l3R1K3o6N8J78k51k03j5O2K15j00N4P2j26J03P4j96K60Rk55M7l0K97m81
7892a77K35O9j71P6J75j25o7K08j91J08Lk6N9j19j8m2J3r7L7O7p4J88n0j34K25
$$ plain form
7722 144 -10 33 60 -4 -73 -7 -61 -107 29 163 -212 23 -123 -179 299 222 184 99 -78 -114 7 13 18 -166 25
7747 25 65 -109 -364 -67 168 67 24 -21 5 70 30 -75 0 197 -25 -102 125 40 -24 -4 121 -87 -138 -78 -4
7772 -4 -123 38 -244 -81 -54 339 -153 248 -132 -128 0 -57 134 -4 -42 138 139 -70 -17 -69 -14 66 6 62 -190
7797 -190 59 84 207 -56 3 221 -46 74 8 101 -108 -37 -74 -212 -104 72 72 -9 73 -199 -124 -149 103 -41
7821 -41 -86 110 -80 67 129 -17 211 -11 89 61 -210 139 278 43 59 171 -94 170 29 108 50 -138
7843 -138 117 -16 -63 9 1 -159 -234 59 -123 -229 -66 251 19 12 -48 -10 66 -134 38 101 -162 16 47 36
7867 36 3 94 117 51 109 287 36 -167 -182 -120 95 -5 49 121 -5 98 172 -24 236 245 -10 37 7 304 -177
7892 -177 58 127 -44 32 207 82 15 223 32 140 143 117 176 57 39 -3 10 -87 -50 17 -57 131 81 -53 172
7917A72k55J69m4n5J22j14j7k44N59k57j32l0N2K61j08k00M3J00O6m4JL6RK6K3
7942A39l10Q2P7J86k07j19K76j33J46j22J33k01O3q0J23J87j50OJ7%j15P2j89
7965a19j3P1k0K06M2p3rl8m1R5N9k51N1r9N2K14o0O0o1n5O7j32J12j1q6o2J07
7992Fj06K6J07K6p3J25o7n7K11q1j71j70K52K2L2J8o6k20M5K56j79j64R3K51m9
8017F7j98J37j67J93L05l70m0J57j17M6j35l1K54J20j34K6m0j31Oj16M3J19J07
8040A01j00K9J40N9k97J75j18K8j23J9J29m3R9P2p0k97J65q6J65N4q3l8P2o7J13
8065I8j09M3j72K35j21k1Q7kk79L65n4r6r3R5O7KJ1j69K28k45J99%j53j11J99
8090DL2J6J5j34M1L2L1k09QK47j26j73K30J84j00j53J44M3Q4j26k48K36r5j27
$$ plain form
7917 172 -83 86 42 -13 109 -5 -22 -266 293 36 -96 -126 -74 187 79 -121 -78 22 88 44 45 81 90 116 139
7942 139 -171 -89 -12 174 -33 -152 124 -9 137 15 148 -53 10 -70 53 240 90 96 113 113 -2 70 -119
7965 -119 -132 -61 -81 125 167 94 85 47 6 101 160 -91 -40 -139 -87 127 67 127 66 11 78 -54 58 47 -39 -101 6
7992 6 -100 -74 33 59 -14 111 44 -13 198 117 -54 -224 28 50 82 100 34 -186 -141 115 -64 -228 -135 116 67
8017 67 -131 6 -161 32 337 -33 -73 84 -33 13 -122 -153 101 221 87 113 73 -58 -52 -168 -125 -6 101
8040 101 1 30 170 229 -68 107 -11 17 -106 -87 42 -1 98 170 100 -197 -32 -118 47 101 18 -20 52 -15 98
8065 98 -11 32 -140 95 -26 -47 40 38 -241 124 70 -26 -119 -24 43 45 56 -113 115 -130 69 69 -84 -195 4
8090 4 36 52 67 -67 -26 6 37 -172 -164 83 -43 -216 14 198 98 -55 89 132 216 90 -158 78 -17 -144
8114a44Q5N9m0jR8R9p2j22MR3Mo7M1J5j75L9K00k27J13J49j50j45K30q2j3p0K78
8141A99j82J65j78l2M9R3j45RP1p9j39K3J47q0j9O9j71J63m2R1j27L6j2M8M0j1
8167a4J22Qm01K69J3L4Q4P0k43j13R1J48l56L69j09J65j35Rl7%K58k78pN1
$$ plain form
8114 -144 -59 0 -40 -41 57 156 84 -38 -34 59 63 -4 37 52 -123 -84 116 -111 2 151 1 -144 86 4 -9 -79 199
8141 199 17 182 4 -28 21 114 -31 -22 49 -30 -169 -146 1 -79 -98 -29 -200 -37 -79 12 -115 -79 -91 -43 -3 -14
8167 -14 108 116 -285 -16 -3 31 115 185 -58 -171 -80 68 -288 81 -28 137 2 11 -26 -26 232 -46 -53 -2
8191b
$$ Imaginary data points
##PAGE= N=2
##DATA TABLE= (X++(I..I)), XYDATA
0@%%%%%%%%%%%Qj6J6j6J6k4L2l2M0n2O0p2Q8j04J20j39J63j88K13k44K80l17L60
34A92m08M60n19N82o49P23q06Q97r97J105j221J350j491J643j811J996k199K423
52A270k670K946l253L598l992M441m961N571o298P185q293R721j1643J4383j8636
67a0631K6184m3568J59290M6748k45878M9814k495j04931j8193R8278J3575N3385
79B1578P1389l5156o3840M4115l3964j16318j912Q0646O496L4351Q0403J4622
91A02410k6278R664l4004q5037l7915K0897j906j0487L0063N3531K6680q700k7529
104A1389j7860j7907k5513m227J8537J9628M4302M2164j0825j1668K1490k5891
116D3619p2389k5216J0313j2758J0048M5850J2304M995L6339j7798o6804J783
$$ plain form
0 0 0 0 0 0 0 0 0 0 0 0 0 8 -8 8 -8 8 -16 16 -16 24 -28 32 -40 48 -56 64 -75 88 -100 113 -131 149 -168 192
34 192 -216 244 -275 307 -342 381 -425 472 -525 580 -641 709 -782 861 -950 1046 -1153 1270
52 1270 -1400 1546 -1707 1891 -2101 2340 -2621 2950 -3348 3837 -4456 5265 -6378 8005 -10631
67 -10631 15553 -28015 131275 178023 -67855 -18041 -20536 -125467 -143660 -45382 -31807 21578
79 21578 92967 57811 -6029 38086 4122 -112196 -114108 -33462 -26966 7385 87788 102410
91 102410 76132 85796 51792 -33245 -71160 -50263 -52169 -62656 -32593 20938 47618 38918 11389
104 11389 -6471 -24378 -49891 -54118 -35581 -15953 28349 70513 59688 48020 69510 43619
116 43619 -28770 -53986 -43673 -56431 -46383 -533 11771 16766 53105 35307 -31497 -29714
128b9714K3554m4667j8341O1830L8549J66K9759J6420l6600k3677r407n0231k8937
141g1296L5104J7309p098L3554L3899j1219q836k172l5342l0251J4079J0823o730
154b8176K6055M4040R106j0326o647j7668k0483j3717j7551r881J7028K5554J1421
167H755K745P810N087j2103k4804j5539M411R644K977Q461J9224J2752N039o293
181B8166k1776j3773J14j4282j7172J5008K6657M660l31J1532l23j3867p809j0546
195a3742j2645R341J4519r69J0775K2993J034j4568p356j0612j6939l812L872
208a8109j340R054K2597O435p628J448l46j3863j2380n609O12J1812J2617M201
222I501L739Q465Q8j3795j4441o062j444J97q19K913J4821J4280k783q600j634
$$ plain form
128 -29714 -6160 -50827 -69168 -7338 31211 31377 61136 77556 40956 17279 7872 -42359 -71296
141 -71296 -36192 -18883 -25981 7573 41472 30253 21417 19245 -16097 -46348 -32269 -21446 -28176
154 -28176 -2121 41919 51025 40699 34052 16384 -4099 -17816 -35367 -45248 -28220 -2666 8755
167 8755 11500 19310 24397 12294 -12510 -28049 -23638 -13994 -11017 -2556 16668 29420 34459 28166
181 28166 6390 -7383 -7269 -21551 -38723 -23715 2942 7602 7271 18803 18480 4613 -3196 -13742
195 -13742 -26387 -17046 -2527 -3496 7279 30272 31306 16738 9382 -1230 -18169 -21981 -18109
208 -18109 -19449 -10395 12202 18637 11009 12457 12111 -1752 -14132 -19741 -19129 -7317 5300 9501
222 9501 13240 21705 21793 7998 -6443 -12505 -13949 -13752 -14571 -11658 3163 17443 14660 6060 4426
237D426k633o836q225k958P579J2326L762j572M625O590o422j4095n762k194j385
252a2774K922M422M298R106M863l945n787k792l518n151j671K026M606Q500O609
267A1714j140l107q12n074q178n188M21N548M407J730M116N423P03n891p135k535
283d998n79j567M05M479P436M628k097l463r6j702o779n330J044M397L085J752
299F15L157L288P90m387n833j920R75p91j047L459M079K674M65q39k201k605k923
316c044k036j617J407M074L975R83k07j09M49k182m837k672J331K542J040M20
332d83L669L997j318m855k880m59r21j913L0L461M033J736J24n90l73k355l713
349b810k221P35J989J852J413J782J720n49k021k050j844j168j41q8K136K334
$$ plain form
237 4426 1793 -5043 -13268 -16226 -8647 3679 7441 5869 10494 17084 10662 -3433 -9195 -11389 -12774
252 -12774 -9852 -5430 -1132 7974 12837 8892 3105 313 -3205 -8356 -10027 -8001 -3395 5105 11714
267 11714 10574 7467 6655 1581 -6597 -11785 -11364 -5816 -1409 321 4437 9860 10563 4672 -2463 -4998
283 -4998 -5577 -7144 -6739 -2260 5176 9804 7707 4244 4148 2446 -4333 -9663 -8619 -4222 -1137 615
299 615 3772 7060 7850 3463 -2370 -4290 -3315 -4106 -5153 -1694 2385 5059 5524 4685 2484 -121 -3044
316 -3044 -5080 -6697 -5290 -1216 2759 3742 3535 3426 3875 1693 -3144 -5816 -4485 -1943 -903 -483
332 -483 3186 7183 5865 1010 -1870 -2329 -3250 -5163 -5133 -1672 2361 4097 4221 3631 3258 903 -2810
349 -2810 -5031 -4296 -2307 -455 958 2740 4460 3911 1890 -160 -2004 -3172 -3313 -3401 -1265 1069
365A069K203L87q75r55j404j867q76l52J56J589J931L80N04Q62m55k093k267l12
383b375K76Q0Q44R04J587J780r23k021k16L35j542j921N06K357J541o8O22J03
401A869k84j101k125j214J167R07J54J49J826J044P1j647j260r25l42j98k84J377
419h16J840P60j85j93k11r43j006p46l14K16R74J478K50J69K70m35r94j117n26
438a529M26M76j9M84R46Q12k33p44m80P6r72j006P51P77N03M3J98O89l25q27l39
459b93n22q5R5k48Q19J206J80m09l80J13p62o85M8J84J64Q52K72P9J56n8q38q41
481i53J11r4L3P98R03l54J90N66m84j062q7o4l86J89M79K65M17O57m21q71o3L61
503A30n91o48N92P41p7j2M19K14r4l83m99k86N3K71l71L46P40k99J4K37j99n46
$$ plain form
365 1069 3272 3659 2784 1829 425 -1442 -2318 -2670 -2514 -925 1006 1386 1890 2752 2297 204 -2063 -2375
383 -2375 -2099 -2019 -1175 -271 1316 3096 2173 152 -64 271 -1271 -3192 -2686 -329 1212 1144 1766 1869
401 1869 1585 484 -1641 -2855 -1688 -781 -627 -478 1348 2392 2463 816 -444 -1369 -1711 -1909 -2193 -816
419 -816 1024 1784 1599 1406 1195 252 -754 -1500 -1814 -1598 -624 854 1104 1273 1543 1108 114 -1003 -1529
438 -1529 -1103 -627 -646 -162 784 1596 1363 619 139 215 -757 -1763 -1012 -235 268 311 509 1198 873 46 -293
459 -293 -815 -900 -805 -1053 -234 972 1152 743 363 476 -286 -971 -923 -739 -575 277 549 628 784 726 -112 -953
481 -953 -842 -936 -903 -105 798 444 634 1200 716 -346 -433 -497 -883 -694 -215 50 467 1124 703 -168 -231 130
503 130 -461 -1109 -517 224 147 135 554 768 674 291 -208 -494 -441 -170 -541 -195 545 246 260 497 298 -248
525b48j92M0J3j0K87N82k01J80N9l00m84K97k45l02K78M80j33r0M05J5o94lJ28
548a38l75K9J80L92J36J65k51J01j03J36m91m49O28K54l65L92K53m1m98p3J94
569G6k94j74K97j00M0M34M1o6L3j86m89M63J20l93L8J16L04l45J09K33k19k29
591a91K66j15j18J05j00K43o5J95k67J67l83J43J65N8k0k77J32O1M0j39J46q8
613d2K6k99Q6K53M2p2K24k5k93K04j4l29rR0K42RQ0P5k68O7L4k41j37L86J3j82
639h0pK03j10K14j0j15Kk82K01l9o7n3J44j36r0K82j71K4l1J85j74j68J85J76
663H3j10NL8j85J85R3R7k75m0mN2K9n6J91k32K0k9K90j94O0J06n0L6l1k03J72
689D8J29l10J55j7k54K55n3J93o1j75l3N0P4j42O7R9qP5o4O6k16K4K7p7J71J2
$$ plain form
525 -248 -440 -400 -387 -397 -110 472 271 451 510 210 -274 23 -222 -524 -246 234 101 11 416 431 -263 -266 -138
548 -138 -513 -484 -304 88 224 389 138 239 136 272 -219 -668 -40 214 -151 241 494 453 -45 -118 76
569 76 -218 -392 -95 -195 -155 279 320 254 287 101 -388 75 195 -198 -160 -44 260 -85 24 257 38 -191
591 -191 75 -40 -158 -53 -153 90 25 220 -47 120 -263 -120 45 103 83 -194 -62 -1 39 -100 46 -42
613 -42 -16 -315 -229 24 66 -6 218 193 -100 104 90 -239 -248 -158 84 93 173 248 -20 47 81 -160 -297 89 102 -80
639 -80 -87 116 6 220 210 95 97 -185 16 -23 -90 -143 1 -135 -225 57 -114 -90 -121 64 -110 -278 -93 83
663 83 -27 -22 16 -169 16 109 206 -69 -109 -113 -61 -32 -88 103 -129 -109 -138 152 -42 18 124 74 110 79 -124 48
689 48 177 -133 22 5 -249 6 -47 146 85 -90 -123 -73 1 -141 -74 25 17 92 28 94 -122 -98 -71 -148 23 35
715C5K9N9p2Q8l01K06N4j05L2j23J36q2M6R3P9j59l9o7J9r8K72L0j17nq0m9K22
742A03k11L10k17O0J78o0L9j44K38l17l5j08m0K01J41P0l12K12q7k18K50o9j53
765a69J67k1j4m0J1L5O0M1k54K31J9p1p3K58l53J03J20n8qj20p5J66K1L03k11
790F8L9o7O1j22j02l5J22J30k37J24J08Rj33J29p7o0O6k07K26K56l63J51Q5M6
814B17j79o7K6r7L86l02m6j14J00R9j09J64j56N4M3K34j13j92M8%j25K44p0K02
838B47j89l1J48k60m8J24o7P6J10r1KJ86k10J30j97j17J92k9r6L17l73K07k04
861a73L99k87M2N9l1r3k6K87j43ORK2n7o0R4j07L4O0j4Q5K5N4k19o9n9J25L5O7
889F5q4j4o2o8J92J19r4k64K63j8L7J8j66R2J11Nk60K8K25k7k49rK29j61j8j8
$$ plain form
715 35 64 123 51 139 -162 44 98 -7 25 -98 38 -44 2 95 174 15 -24 -91 -72 -170 102 132 15 10 -70 -119 103
742 103 -108 202 -15 45 223 163 202 58 296 -21 -56 -164 -204 -3 138 208 -104 108 21 -197 53 -16 -169
765 -169 -2 -23 -37 -77 -66 -31 29 70 -184 47 66 -5 -78 180 -173 -70 50 -8 -16 -136 -211 -45 -24 279 68
790 68 107 40 101 -21 -123 -158 -36 94 -143 -19 89 98 -35 94 17 -43 23 -184 42 298 -65 86 171 217
814 217 38 -29 -3 -100 286 -16 -62 -176 -76 23 -86 78 -78 -24 19 253 140 -52 -4 -4 -129 115 45 247
838 247 58 27 175 -85 -133 -9 -76 0 110 19 21 207 -3 127 -70 -187 5 -24 -120 197 -176 31 -173
861 -173 226 -61 -19 40 9 -84 -110 177 34 40 49 71 14 -46 48 -59 -25 35 21 106 131 185 -34 -103 -162 -37 -2 65
889 65 -19 -33 -95 -163 29 148 54 -210 53 35 72 90 -76 16 127 132 -128 -100 125 98 -151 -160 69 -92 -110 -128
915a28L2P4N5K28l77k6J35k41K93k98L19q5J08k98J77m5o1R1j19L13k64J78k0
938D1j57M0mJ1J28l12L90j28J51O3m11J72J1r3M7K26j22K1M3Q6j69o5j90K63j48
963a06O7J56r3p1L15l34P4K2nj01n0R5m1K07m2lJ19j77J78k1j47j04J33r7O0l
989C1P6o2j20J31k02J10k27L25j97p4R4RNJ7J52j29Oj21K21nP4k08K68q2Nj20
1015b3N8j61K28l44L25r8J5j17J54k1l3Q8N7k03m7K40k12J99k08J55j36o0K10
1038F6j42l5K44j31J2j09J64Qp9R9k22J59Jm4K2P5j4k73J40J84j80J12J12k47
1062g8o0J55q2J47r4P6m9j7L6Pk6mK4p5K04k13j01J15J70k85K34j59K68r9j46
1087e2m5Q7K8j20K47j76O3r1LK11l04J39J04o4j03J58n6r4K97k11j37K06l46K26
$$ plain form
915 -128 -96 -22 33 261 -116 -142 -7 -248 45 -253 66 -19 89 -209 -32 -77 -138 -47 -166 147 -117 61 41
938 41 -116 -76 -80 -69 59 -253 137 9 160 223 -188 -16 -5 -98 -51 175 53 74 117 203 34 -31 -221 42 -106
963 -106 -39 117 24 -47 268 -66 8 30 25 -76 -126 -31 -72 135 93 90 209 32 210 189 42 -62 71 -26 34 31
989 31 107 45 -75 56 -146 -36 -263 62 -135 -209 -115 -106 -101 -84 68 -61 -55 -176 45 40 114 -94 174 92 97 -23
1015 -23 35 -126 102 -242 83 -15 0 -117 37 16 -17 71 128 -75 -122 118 -94 105 -103 52 -84 -144 66
1038 66 -76 -111 133 2 14 -95 69 77 -2 97 -125 34 35 -9 13 88 74 -199 -59 125 -55 57 169 -78
1062 -78 -138 17 -65 82 -12 64 15 -2 34 41 15 11 35 -40 164 -49 -150 -35 135 -150 84 -75 193 94 -52
1087 -52 -97 -10 18 -102 145 -31 32 -59 -56 155 -149 -10 94 30 -73 85 29 -65 232 21 -116 90 -256 -30
1111c0jJ05k17J96Q6m20L4P0O3K90l8J1k45l4J47K04j10j18j72K36n8p5J79m2
1135F1o8r8K14j60O0N1k8j4r5J18k3J34j63QNj8j73K32l9J01j39r7J9J04K9q6
1161f5M5Q6nr6J26j63J30M3m6J55j22o0o0J02j83M6R1j3o8j26L32j67J47j34L7
1186C2r4Q1l6J15n8K4j19j3JJ5p0j98M37m1k00K9J83k63J38M0L6j33L2KJ77o9
1212D8o0p0J46j56P7j73M9L11j03J2j26n7K91l16K05J2j19MR3J5m9J82k83J66
1236I9j99N4M2l3M1p7l9K07j22j33K06n0n6K9K07j10k14J36o0K9q2K81l28J31
1260d1Pj75J69P2j68j10M04j53r2K42k02l8J45j53J90o0oo0j95J85L7k0j15m2
1284a79K12m9M5K20j8k59j27L73j16l7j03J28o4j95K81k86MK50k65J71j06K47
$$ plain form
1111 -30 -31 74 -143 53 139 -281 -247 -177 -114 176 138 149 -96 -130 17 221 111 -7 -179 57 -1 -76 103 61
1135 61 -7 -105 109 -51 9 60 32 18 -77 41 18 152 -11 -3 2 -16 -189 43 4 105 -34 -131 -112 -8 21 -65
1161 -65 -20 66 61 -35 91 -72 58 101 55 210 88 28 -32 70 -113 -67 24 11 -57 -183 149 -18 129 -5 32
1186 32 -62 19 -17 98 40 64 -55 -68 -67 -52 -122 -320 117 76 -124 -95 88 -175 -37 3 39 -94 -62 -60 117 48
1212 48 -12 -82 64 -92 -15 -188 -139 172 69 81 -45 -102 189 -127 78 90 -29 -25 68 83 34 216 -67 99
1236 99 -100 -46 -4 -37 4 -73 -112 95 -27 -160 46 -4 -60 -31 176 66 -148 -12 -72 -43 -125 156 -172 -41
1260 -41 -34 -209 -40 32 -136 -246 158 5 -87 155 -47 -85 60 -93 97 37 31 -29 -224 -39 -2 -22 -137 -179
1284 -179 33 -16 29 249 231 -28 -155 218 102 65 -38 90 26 -169 112 -174 -170 80 -185 -14 -120 127
1306A27k32K8J98j0j76J2R4j9L10j88j7Q1j69r1L4lL7J38j24L7j05O0J60j41J13
1331A54p3j70K63k03K9j74m6J52J18K2k89Q7J45L2l9L2j04P7Pm1K10j71j18N5
1355d5J61p4r8KJ40R0M4k18O1j48Q6P1l40K63J03P3l45N3J41k7j0j71N6j8M49
1380B99l80J17R0N6k64J05o7J20m3J46r7Oo5Rl00K83J35l50L67l30J37J6N9J18
1404A67j54R7k02J37k20K98j6k0j7j9m4j36NK4JK11nr8j61J60k8M0k15K4LK17
1430D9P2J04k94j28J77N0j26P6o6j07K13K7j71jK18k5j06J74l9m5p5jK2R0k19
1455a31J05K50k21r7J16q8J34k2L5M8k46J4JP6m2J80J34j25j27j30J40j3J20j45
1479c4RO9j0k88J99J29q0l8R1j13J16j03K67j23k34OQ7LJ34j4m5L20m17J73q6
$$ plain form
1306 127 -105 -77 121 111 -65 -53 41 22 332 144 127 208 39 -52 -18 -21 16 154 30 67 -38 22 182 41 154
1331 154 81 -89 174 -29 0 -174 -220 -68 50 72 -217 -130 15 47 8 40 -64 13 20 -21 189 18 -100 -45
1355 -45 116 42 -56 -54 86 176 220 2 63 -85 1 72 -268 -5 98 171 -174 -121 20 -7 -17 -188 -132 -150 299
1380 299 -81 36 126 182 -82 23 -44 76 33 179 82 88 23 32 -268 15 150 -200 167 -163 -26 -10 49 167
1404 167 13 110 -92 45 -175 123 107 87 70 51 7 -129 -124 -100 -99 112 107 9 -152 8 -20 20 -195 -171 -168 49
1430 49 121 225 -69 -197 -20 30 -96 -20 -86 -193 20 47 -124 -125 93 68 -38 136 97 52 -23 -24 -2 88 -131
1455 -131 -26 224 3 -94 22 -66 68 46 81 129 -117 -103 -102 -26 -68 112 246 121 -6 -136 4 -9 111 -34
1479 -34 -25 44 34 -254 -55 74 -6 -44 47 -66 50 -53 214 91 -143 -137 -50 -47 87 73 28 348 -69 104 18
1504A8j47K5J91j71J18r9J98qj07q4RmL2nM7j30M3P3J4J4K18k36O4j32n0P5L7
1531CR4N1j31J18j01k17K13k5r6N8J07l23J59K02j76L0J33j75P5l8Q4l81M51k95
1555a80K71J4k64P6K56j58n2J65j63Nj41J04k6J05Q4j33J78k51j27K43j0%j97
1578b01K99p3K6j97N6J31p2n4K05j29J19l73J95J8O7m8J66j90J48j2Q1j29p4O9
1602B8j36N0n1j18L54k26J46j21l7O5N9oJ42q6o5k9N9n8j38K75l07K65m4j98K21
1627D4j77J29J9L5K41l16K00l3m6Mj64J21N6o1R0q2k71K28j53K0mK5nK9J98o8
1653E9k57J54J54j74K05j96R7Pj02J60j1p2j54l4J75J32k92J69n9o3r0K11n3Q2
1677D8J6j87J72r8R3q3o9J78j73K5j7J4o8J78j25l9M36k89O0ok44K48Q2l64L06
$$ plain form
1504 18 -129 -104 87 -84 34 -65 133 125 18 -66 -57 -61 -29 -34 13 -117 -74 -1 13 27 245 9 73 -59 -109 -34 3
1531 3 97 148 17 135 34 -183 30 5 -91 -33 74 -249 -90 112 -64 -34 99 -76 -1 -39 45 -336 115 -180
1555 -180 91 105 -159 -83 173 15 -37 128 -35 -30 -171 -67 -93 12 96 -37 141 -110 -237 6 -4 -4 -201
1578 -201 98 25 51 -146 -90 41 -31 -85 120 -9 110 -263 -68 -50 17 -31 135 -55 93 81 162 33 -41 28
1602 28 -108 -58 -109 -227 127 -99 47 -74 -111 -46 13 7 149 63 -2 -31 28 -30 -168 107 -200 65 21 -177 44
1627 44 -133 -4 15 50 291 -25 175 142 96 100 -64 57 113 52 142 60 -211 17 -136 -116 -120 -95 -100 -71 127 59
1653 59 -198 -44 110 -64 141 -55 42 49 -53 107 96 24 -130 -164 11 143 -149 20 -39 -102 -192 19 -34 48
1677 48 64 -123 49 -49 44 -39 -108 70 -103 -78 -95 -81 -149 29 -96 -135 301 12 72 66 -178 70 152 -212 94
1702I4n9j59K22j08LRJ0P5k5k71K72L0j2%p3k83M72K7j87Q5j68OJ59j48n9l0J89
1729G1j94J03J3j51J63K64l08O2k28L30k53P7J44k05k9Q0j06N1K81m9k5k29J51
1752A3O8k9k76J85R4J18j27M5j53K00k88M9J67l0J2j80j2J15o0J06k54J56K56
1775A75k77K5J10N6n8o9K03j50K9P7k8P0j11j01j30J94r4J31J57l54K31l5m6N2
1799E7j11J54j9j2K8R1j56M6k17J29L5J85j05k51M17m38J78J66j86p3K07N7k60
1822g8Q3P8k4k39K11q8p0K44q4j62o5J65n6P0M4j67J53K1K6p4J1o3o3J06L7j03
1848h7J20l8M4M3j40O8J49j81j05J0J49O4k2k9l6N8n7k5l9M9J74k83p2J78J0p3
1874g1K03k46N8J95p9Qk1r4J80J7k36J15k1L0Q9qn4j29O2R7k12JJ17J00l72K69
$$ plain form
1702 94 35 -124 98 -10 -7 2 12 87 62 -209 63 93 81 81 8 -275 197 224 37 122 -46 -40 119 -29 -88 -118 71
1729 71 -123 -20 -7 -158 5 269 -39 23 -205 125 -128 -51 93 -112 -141 -61 -167 -116 165 116 91 -138 13
1752 13 81 52 -224 -39 55 173 46 91 -62 138 -150 -101 66 36 48 -132 -144 -29 -89 17 -237 -81 175
1775 175 -102 -77 33 89 31 -38 165 15 44 121 93 163 52 -49 -179 15 -79 52 209 -145 86 51 5 57
1799 57 -54 100 81 69 97 188 32 78 -139 -10 25 210 105 -146 271 -167 11 177 -9 -82 125 182 -78
1822 -78 5 83 59 -180 31 -57 -127 117 33 -129 -194 -29 -85 -15 29 -138 15 36 62 -12 -1 -64 -127 -21 16 -87
1848 -87 33 -5 39 82 -58 10 159 -22 -127 -117 32 96 74 45 9 67 10 -15 -54 -5 169 -114 -186 -8 2 -71
1874 -71 132 -114 -56 139 60 68 47 -47 133 150 -86 29 8 38 127 119 65 -64 -2 95 -117 -116 1 101 -271 -2
1900bl67K17R1J79M7j49m7J0j0r4K41n3l2k7O7n5J44k14P0n4o4J44k14K72j10
1925a0O5P1j65J83P2k50o7N9J55k09J04J8l7m9q1nK24j80J23J85j71J28l68J17
1949h8q8K06P8l4j94J74k3j78L30l03P7j66J59J62j73N9K7J5K3k05L12k68J75
1972G7L3k3j25L7j27J75N1q4L3m6k6rJ14j57J01Rm6j30P3J23k0J82k22o2K39k16
1998d6j93J46J92j67J68l9k4j01p9J27n5m7J80M1j98K53J6j54L3O6k53N7M2J7
2022a8k48R6j9J40J41r5O0k10K36q6k50J80K19k36K08l56K47j15J87j30o3K04
2044I2q9K11k25KJ45l52J50J70n5P7k42K95m2q0j43J20k4M9On1q1M3J97r0j32
2069d9K26j00k5j32r6J61j9R1k70P2L59j04j50P2J9Q3m7j31J52j47J61k26k2J43
$$ plain form
1900 -2 -369 -152 -61 118 165 16 -31 -21 -31 -125 116 63 31 4 71 16 160 -54 16 -38 -102 42 -172 100 -10
1925 -10 55 126 -39 144 216 -34 -101 -42 113 -96 8 26 -11 -60 -141 -146 78 -102 21 206 35 163 -205 -88
1949 -88 -176 30 108 74 -120 54 31 -147 183 -120 -43 -209 -50 112 -61 -2 25 40 63 -142 170 -98 77
1972 77 110 87 -38 -1 -128 47 98 14 47 1 -25 -34 80 -77 24 33 -13 -143 -70 53 33 215 -7 -69 170 -46
1998 -46 -239 -93 99 -68 100 61 37 -64 -143 -16 -71 -118 62 103 -95 158 174 20 53 119 -134 -77 -35 -18
2022 -18 -266 -170 -189 -49 92 -3 57 -153 83 -3 -253 -73 146 -90 118 -238 9 -106 81 -49 -112 92
2044 92 3 214 -11 -9 136 -216 -66 104 49 126 -116 179 137 57 -86 34 10 59 65 14 -67 -24 173 83 -49
2069 -49 177 77 52 -80 -176 -15 -34 57 -213 -141 218 114 -36 36 55 138 91 -40 112 -35 126 -100 -122 21
2093B1j7l1o7N0O4k28K21r6J82j42J43j09j3K5M5p7J54j15J64m65K2K29J82p8
2117F4r8R2K4r5K7r5J76k9j13J35j8Q4Q6l6j72O7j1K1n9j74J95K7j25J22k22L06
2143A79n6j27j70J45n4J30j1N3n1j4j36P8k58K24J67j44j26J45J6j13K65j97L8
2166a7Q5k36J39JR6j74K00R5l19N2J73j25p6J76k7k00K5J09Pj08q7J48l3L5O1
2191@O2l0j0j01J9J39k10J30O6P3j88R8K9o4mj74J55j91L73k31J13P6p1q0o0J5
2217f6o0kJ16J00j76R5m0J14q4o4o4K3J38j2J52r2m9o0K21l31K42q8R6j93O6N8
2243D0J46j70j82J63jnP2j75o4J82O8M3k91J85l1K57m61J92N2J10n7j70Q1O5j78
2268a29J57j07J03K81k74L7l30J81K00m2j45jQ8K38k29J9j40O7r2J71j0J22k94
$$ plain form
2093 21 4 -27 -94 -44 20 -208 13 -83 99 -43 100 -9 -22 3 48 -29 125 10 174 -291 -269 -40 142 64
2117 64 -34 58 82 -13 14 -81 95 66 -47 88 70 154 240 204 32 99 88 109 50 -124 71 98 -27 95 -127 179
2143 179 123 -4 -174 -29 -83 47 36 89 38 24 -112 -34 -292 -68 99 -45 -171 -26 -10 -123 142 -55 -17
2166 -17 68 -168 -29 -28 68 -106 94 189 -130 -78 95 -30 -106 70 43 -157 -132 -23 -16 -124 -211 -63 -96 -61 0
2191 0 62 32 22 -79 -60 79 -131 -1 65 138 -50 48 77 13 9 -165 -10 -201 172 -59 54 130 59 -21 -81 -66
2217 -66 -126 -128 -12 88 -88 7 -33 81 -3 -67 -131 -108 30 18 170 78 29 -31 190 -141 101 13 109 -84 -18 40
2243 40 186 16 -166 -3 -4 -9 63 -112 -176 6 74 117 -174 11 -20 237 -224 -32 20 130 73 -97 -16 49 -129
2268 -129 28 -79 24 305 31 68 -262 -81 119 77 -68 -69 19 257 28 47 -93 -26 -118 53 43 165 -129
2291a29J58j5J6K13j21k54O5J4O7j93J67R2J47j43O5j00j6j40l7J66n6L48l71
2314e7K33k19J55j5N8k36K16j65k3K8J16m0j95J50l8K52p4j82pL55l77K2o1J11
2338GM4q0J42J9r6l1j29K14Q8r8N3ll9j01p1R6P0N5j31N7q2j02K91k25J11j83
2364a24J39K6j60J49o4J5k8O3L0r6O4j92J46J69o2O4k82l1J68%O4j60J45K0j9
2389D4j76J18K4J8M8j66J15j92K50k05Q4N7j39j2j4J69k2M2K1q2p5L11j67J35
2413A86l12J58r9L3J28j68J39j19J02p0L9p4O3Q0K5K2j75K76l8k12P8K1n7om6
2438b6J38P7k80m3O0K23m02L57m4j54J03o2J52o8j36J43J58k95K19j27q8K23k95
2461a67J46K6r1p7J52K13j95J4n1l5J41j78J72l2k05M29l60J77n2p3k7J8j1K22
$$ plain form
2291 -129 29 14 30 243 122 -132 -67 -53 14 -179 -12 80 227 84 149 49 33 -107 -144 22 -34 314 -57
2314 -57 176 -43 112 97 155 -81 135 -30 -53 -25 91 51 -144 6 -32 220 146 -36 -43 312 -65 -43 -104 7
2338 7 51 -29 113 132 36 5 -124 90 178 80 133 130 91 -10 -81 15 85 140 9 66 -16 -118 173 -52 59 -124
2364 -124 15 41 -119 30 -34 -19 -47 16 46 -50 14 -178 -32 137 75 139 -143 -174 -6 -6 58 -102 43 63 44
2389 44 -132 -14 10 28 76 -90 25 -167 83 -122 -38 19 -120 -132 -146 23 1 43 64 -18 -93 218 51 186
2413 186 -126 32 -67 -34 94 -74 65 -54 48 -22 17 -57 6 86 111 133 -42 234 196 -16 62 83 26 20 -26
2438 -26 112 189 -91 -134 -74 149 -253 104 60 -94 9 -53 99 31 -105 38 196 -99 120 -7 -95 128 -167
2461 -167 -21 5 -86 -163 -11 202 7 21 -30 -65 76 -102 70 38 -167 262 -98 79 27 -46 -73 -55 -66 156
2485A56K2j00O3j14Q4j28r5J72k04J38O6q9j03J06J61q5j01K58j18m6m2k04L01
2508I8k07R9NJ67j88J76k92K4L67l29%P7N4P0j06L0l3J98l23L1P0J07Oj85L05
2533B21k29l8J60j25Nj73K78n9k2j9J02j68J34P5j95J91j28j68J31n0Q7O7j19
2556d2L58l40O4nMj7m26N97k30J31q2J49k2j19r3J45op9j76K99O2k21J72j67O3
2581A9lJ03j3l8L4n2m3j62K05o8k08L82j89O4N4j16P9Lj4J33r7N6j06n8J40k36
2607a31LL4l4QJ87o1l9O7N6j16P9j08L84k64m2J17j71K4q2O3P0J21k82J40L7r5
2633c5J25K7k33K42k38O4J57N9j43m1k8K8j1J88k73Lj59K37Q6k29K70k1k73k7
2657b25K51k6j2l9r9K42r2J34q4k21J09O9M7J73m09J41L9k39O4J95J11p9mj25
$$ plain form
2485 156 178 78 141 27 111 -17 -112 60 -144 -6 60 -29 -132 -26 135 50 -51 207 89 43 1 -203 98
2508 98 -109 -10 -5 162 -26 150 -142 -118 249 -80 -80 -3 51 121 15 45 12 210 -113 -82 -12 95 101 -84 221
2533 221 -8 -46 114 -11 -6 -179 99 40 18 -1 101 -67 67 142 -53 138 10 -158 -27 -77 10 77 -42
2556 -42 316 -24 40 35 39 22 -404 193 -37 94 12 161 139 20 -73 72 66 -13 -189 110 172 -49 123 -44 19
2581 19 16 119 106 68 102 50 7 -155 50 -18 -226 156 -33 31 85 -31 48 51 37 170 73 129 23 -35 105 -131
2607 -131 -128 -94 -128 -120 67 6 -33 34 90 -26 53 -55 329 65 23 140 -31 -7 -89 -26 44 165 -117 23 60 -35
2633 -35 90 117 -116 126 -112 -48 109 168 25 -16 -44 -16 -27 161 -112 -109 -268 -31 55 -174 96 75 -198 -225
2657 -225 26 0 -12 -51 -150 92 0 134 50 -171 -62 7 54 227 -182 -41 -2 -241 -177 18 129 50 46 -79
2681g9J41k8k8k7N9n6j71J01J46k52K75j79J40K35l10M2R3q2J59o4j38j40J9J54
2705A0J62l09J13J0J68l01J39J53j10qO6j66J93r5M6j40K6J09j08J87j14j07K09
2728A33M3q5Lj33Ol1J41J01l13n6R0R6lJ03R1k08o2K66k78K52k17M0l0J33j9j21
2754e8p5J96J27o2r5J06L8l94J11Q4P6P4r9Kl1J19j97J27n3J82m44K65L6j63J01
2779b7L6J11j47K5R3j74P8n3K5m3Q3j07n0K79k86K11m8J50j53J17J7k22N7J19
2803I1L1j33J15p6J03j11o5J1M6J0l4R2j6j20k9R1K06l39N2P9R6k69J3K42k09
2828a23lJ14K26k66r5j00L21p8R1j78J77J01k13r5R3MO4q0N7R9k25L5%p6K04j94
2854a40J28N7OL5r0q5P6Mj34K50j15l0N7k6l1r9J50n9K14m30K61o0p8J45k8N4
$$ plain form
2681 -79 62 34 6 -21 38 -18 -189 -88 58 -194 81 -98 42 277 -33 9 102 20 179 115 -23 -163 -144 10
2705 10 172 -137 -24 -14 154 -147 -8 145 35 27 93 -73 120 25 71 -69 -43 66 -42 145 31 -76 133
2728 133 176 91 94 -39 -33 -64 77 178 -135 -191 -101 -5 -8 95 186 -22 -84 182 -96 156 -61 -21 -51 82 63 -58
2754 -58 -133 63 190 128 33 139 177 -217 -106 -22 54 128 29 31 0 119 -78 49 -4 178 -266 -1 35 -128 -27
2779 -27 9 120 -27 -2 91 -83 -5 -58 -33 -76 7 -100 -150 129 -157 54 6 156 3 120 137 -85 -28 91
2803 91 122 -11 104 28 131 20 -45 -34 12 22 -12 80 64 -56 -85 6 212 -127 -75 4 100 -169 -156 86 -123
2828 -123 -126 -12 214 -52 -147 -247 74 -4 87 -91 86 187 -26 -121 -28 -24 40 -40 17 116 -109 -74 -74 -150 54 -140
2854 -140 -12 45 51 86 -4 -89 -13 -9 -143 107 -8 -38 19 -7 -38 -137 13 -46 168 -262 -1 -61 -139 6 -22 32
2880C2j47K52n2l85M40j68o0O0R4J22k42p1K50P3j00j55P4n2j49K77m7j80K24
2903I0n7k7p5J60l07K34j40j15N52k83j45n4N2K20l01J01J2J01m3r3r5J61J72
2926A20j18q4K30l20J84k34J68K69k51J07k53M06q7j38N6O0q6L3j29M2K6m1j57
2949a97J23j46J1L36k7j44J71j45OqN8J64l53K38j5l1j69J40L0j29K59m87K97
2972a8J04OQ8j45j65K30o4J50k66J86J8p9K6L3r1k1j01LM5J60k17lJ96N7Q3k01
2998A4l01L18q0j26L43j23j8M3Qj15l1j16K47q0M3j07j3M8j55J44N5n9Q2j32N2
3023e9J45oj34J76j4j21j25K36n1j18L5M1j86J23L9J47m4j14J56m0pj32J2j7M9
3048iM6o9J08j01k2L5R7J48l16J43j11J33j21q9K74j20O8j23o0J04l0Lj79L23
$$ plain form
2880 32 -115 137 85 -300 140 -28 -88 -28 66 188 -54 -125 125 198 98 -57 17 -35 -184 93 46 -134 90
2903 90 33 6 -69 91 -216 18 -122 -237 315 32 -113 -167 -115 105 -196 -95 -83 18 -25 -118 -213 -52 120
2926 120 2 -82 148 -172 12 -222 -54 215 -36 71 -182 224 137 -1 55 115 29 62 -67 -25 1 -40 -197
2949 -197 -74 -220 -209 127 100 -44 127 -18 -12 -20 38 202 -151 87 72 41 -128 12 42 -87 172 -315 -18
2972 -18 86 92 180 35 -130 100 36 186 -80 106 124 45 71 104 13 -8 -109 -106 -61 99 -118 -121 75 132 215 14
2998 14 -287 31 -49 -175 168 45 27 70 78 -37 -68 -184 63 -17 26 -81 -94 -46 -201 -57 -2 -61 21 -111 -59
3023 -59 86 80 -54 122 108 -13 -138 98 47 -71 -36 5 -181 -58 -19 128 84 -30 126 86 79 -53 -41 -58 -9
3048 -9 37 -32 76 -25 -47 -12 85 233 -83 60 -51 82 -39 -128 146 26 94 -29 -89 15 -15 -12 -191 132
3072A32q7K4N5m09L94k44L34j81N5L8N9k32n9l6K7L3J29K42n7m2k43Q0Mk39L01
3097G8j8q4J08j6r6l8l4Q1J61r6j76J48j35K60O1l14K38j06J2o1J55l00K51m0
3121C9l1L3j19L16k23j07K1p8l8K61m2l7P6M2K4k77K77j95M8j68O8O0l7K48p4
3146H7k6j2q5J7m2K3J87j9K2j93l8K85L5o3j36p3j67K52k34K35j57J25m8J44R2
3171B11j68o6qj11J17N3k8r0K69j98j15P9o7K08j57M6J05r6K8J32j88J62j44j05
3195a31m8J07J93n3mn6J84k17N4j60L64j91J4k58K30O0j19J74l38K00J27j66K2
3218a2k10J86Q1L7P8K8k34J98m5j63N4j83k2J34n7o9L55l75K22K05k49N3j29L53
3242B36p9k50jK06o0j07j9K0J65k31K20m3k40L50k58J81j70m1K45Q6j58r3J20
$$ plain form
3072 132 45 69 124 -285 109 -135 199 18 73 111 170 -62 -121 -157 -130 -97 32 274 217 175 -68 12 16 -223 78
3097 78 60 -24 84 68 -28 -66 -100 -19 142 46 -130 18 -117 143 204 -110 128 22 34 -27 128 -172 79 39
3121 39 8 41 -78 238 15 -92 -71 -149 -187 74 32 -5 71 113 137 -140 137 -58 -10 -178 -110 -50 -87 161 87
3146 87 61 49 -36 -19 -61 -38 149 130 152 -41 -79 206 241 178 42 -31 -198 54 -180 55 -102 23 -25 119 211
3171 211 43 -23 -31 -142 -25 28 0 -90 179 -19 -134 -55 -122 86 -71 -25 80 -16 12 144 -44 118 -26 -131
3195 -131 -179 -72 121 68 64 8 192 -25 29 -131 233 42 56 -202 28 88 -31 143 -195 5 132 -34 -12
3218 -12 -222 -36 45 82 160 188 -46 152 107 -56 -2 -185 -207 -73 -130 -199 156 -219 3 208 -41 12 -117 236
3242 236 157 -93 -94 112 52 -55 -74 -54 111 -120 100 57 -183 167 -91 90 -80 -121 124 210 52 -41 79
3265G9O5p4q5o0J31j09J11j12J27l6J16j86K10L6l17J77j54J26k5J0n7n5K07p5
3289E0J95j28J28k61p1J8J6J17q2j13L9K28j44K3J55j38q0jJ69m0j29N7l9k8J87
3314A28k73r8J30p9J79n5KN3nL7j0r9K65l08K31k88L00j26J03j38RO5j63J92J7
3339F9j7p1J7o0Q7J12ll77M9P3J7nJ20J87j49j1l21J50J60k3j19K17k29K63p8
3364E8l1OJ9k8o8J29k99P9K66j75J67j45Q9O9K0o9k79J76O2j6m5l9Jk3q4J61J27
3391A28n1l47RJ26K61k1j41N4J01o0n4Q0j07j39K75j00K12k57J71j34nO3k91J74
3415e3J55mK2l00K53j46R6pN9M6J80l8j90k38K96j27R6m1k28Q4J52R3k02J10N4
3440A22J1j25n5J40N8l7nj75R3m8n5nJ08Q2j61r4J95n9k21K47k04M7j8L07j75
$$ plain form
3265 79 144 70 -15 -75 56 -53 58 -54 73 37 153 -33 177 213 -104 73 -81 45 20 30 -27 -82 125 50
3289 50 245 117 245 -16 -87 -69 -53 64 -18 -131 -92 136 -8 15 170 32 -48 -49 120 80 -49 8 -31 -59 128
3314 128 -145 -243 -113 -192 -13 -68 -66 -13 -18 19 9 -90 175 -133 98 -190 110 -16 87 -51 -42 23 -140 52 69
3339 69 52 -19 -2 -62 25 137 134 -243 -194 -121 -104 -109 11 198 49 38 -283 -133 27 4 -115 102 -127 136 58
3364 58 27 33 52 24 -44 85 -214 -135 131 -44 123 -22 67 136 156 87 -192 -16 46 30 -15 -54 -53 -76 -160 1 128
3391 128 77 -270 -261 -135 126 105 -36 18 119 59 5 85 -22 -161 114 14 226 -31 140 6 1 64 -227 -53
3415 -53 102 98 120 -180 73 -73 23 16 75 121 301 263 73 -165 131 4 100 59 -169 -85 67 160 -42 68 122
3440 122 133 8 -47 93 151 114 109 -66 27 -21 -76 -81 27 109 -52 -146 49 -10 -231 16 -188 -141 -159 148 -27
3465b7j18j4J51J97J0k37J19m1R0l58J73O1jP3k08M7J12M0j69J20Q3l6j41K4K09
3490A59l58J59K9j09K16j51k12L48k30J15Q9LK9j37K39p5k74K58K17j05k46j62
3512a98K87j7M6j54l7Q8o5j6J57q9N0n0J76j50k9q1R6j76%J55q2J50j55R6l4J5
3538a7p1P3K8k82K83K8R9Kq3o1o4J53m4k57J74K62l02N8O1J20k74K15k17K04q1
3563GJ9j27Q3JJ26p5J47j12j37M5J14j53J25j30j21J99j62R4J82j39j7J23j82
3586i0K5K23k81O0j09J26P1j91n5L05j39q3P5l7R0j06L03k94J39J79k33j09M1
3609i0L5J7K27k00j01J63j09J53j33p6P6J45k98K75j94J92j47r6Q3%k0J05K0n2
3633b5r9k8O0J72j93J62K8M6k84L76k11K9K55l92J20P0m4P5j45J93m05K08J04
$$ plain form
3465 -27 -145 -159 -8 189 199 -38 81 40 130 -228 -55 6 5 78 -130 -83 29 69 -100 20 103 67 -74 -50 159
3490 159 -199 -40 -11 -120 96 -55 -267 81 -149 -34 55 58 87 -50 189 114 -160 98 315 210 -36 -198
3512 -198 89 72 118 -36 -73 15 -50 -66 91 2 52 2 178 28 -1 -82 14 -162 -162 -7 -89 61 -94 2 -32 -17
3538 -17 -88 -15 13 -269 14 42 141 143 60 -1 -65 88 44 -213 -39 223 -79 -21 40 160 -114 101 -116 88 7
3563 7 26 -101 -18 -17 109 34 181 69 -68 -23 91 -62 63 -67 -188 11 -151 -57 125 -14 -31 92 -90
3586 -90 -65 158 -123 -63 -172 -46 25 -166 -221 84 -55 -138 -63 -100 -10 -116 187 -107 32 211 -22 -131 -90
3609 -90 -55 -38 189 -11 -112 51 -58 95 -38 -114 -38 107 -191 84 -110 82 -65 -161 -78 -78 -98 7 27 -25
3633 -25 -124 -152 -92 80 -113 49 77 123 -161 215 4 33 288 -104 16 86 42 117 -28 165 -240 -32 72
3656G2o7J96j30Q8r3O5j22o7M9J27j37J65k14j56K09M3m5O5l8P2K19n32L41J3
3680A23l22J53P6p7K2M14m86J32k34K34l9n2K3r5K52q4o3j8L2J77j97l5o0L19
3704A95l64J62j17J92j92K84j17j28P3n3J59j42J19J16k20K9j8r3J79ll6J4J45
3727A84o7P4j24j35J92k15K03j33K5LQ3k88R7K16j40j97J78K84k36J81k81L26
3749B30m76K81l6K15k71J53j68P4j31J22K32k72J19l3R5k35J59ro8M6j60Q6M5
3772bj61L50k57mJ47K9k2m3J32k71K00k0m2J07k45J02J20J66k66r1O4J2l4J52
3796A23j22N9j25J93j33j01Q2l4J33j60R2k05K08P9k14J85j03J77k15O7l5P8R
3819C8q6k6n9K15J07l43m7K45k47L41J98l07p4j34J07J93j81m6P1m2R8K4N0r0
$$ plain form
3656 72 5 201 71 159 66 131 9 -58 -9 118 -19 146 -68 -224 -15 28 -17 48 10 82 301 -231 110 123
3680 123 -199 -46 30 -47 -25 389 -97 35 -199 35 -4 -56 -33 -128 124 40 -23 -41 -9 168 -29 -64 -124 195
3704 195 -169 -7 -124 68 -124 160 43 -85 -12 -65 94 -48 71 187 -33 -4 -22 -115 64 61 25 39 184
3727 184 117 191 67 -68 124 -91 112 -21 4 7 90 -198 -101 115 -25 -222 -44 240 4 185 -96 230
3749 230 -246 35 -1 214 -57 96 -72 2 -129 -7 225 -47 72 39 134 -101 58 49 -19 27 -133 -47 -2
3772 -2 -163 187 -70 -74 73 102 80 37 169 -102 98 78 36 143 -102 0 120 286 20 -71 -7 5 -29 123
3796 123 1 60 -65 128 -5 -106 -24 -58 75 -85 7 -198 10 89 -125 60 -43 134 -81 -14 -49 29 38
3819 38 -48 -74 -133 82 189 -154 -201 44 -203 138 336 29 -45 -179 -72 121 -60 -106 -35 -77 21 45 95 5
3843EK48l01PM1k03J78J00J73l00J58n2j37q2J45q0k4R1r0K99k26J47j01n6l9
3867i9j6J37j20N4p5K1Q4k08K15j32R1M6N6j89P4J08r3o4L63l71q0L56p2j82J81
3892H5k01k03N76k24R8j42j21J8L67j82J3l6L0j32J52p7j63J74MK13k70K2L0O5
3916I6p0o1K77k51P8K3k07L97k16J30l74J33L54l39R2l16J76J29m9O9pj63J72
3939G3p8lj06M3rJ79J52m90L41k7k03j8J03K14l57K45K3k04K21j88j88L29m1L9
3963E0j56j07K01j11J32j35M14l39N6J19j90J74l9p5LO1L6l8n1m2o1L4N9j33L7
3988a01J94j66J95q1J10k46Q7n5M5mL3j20J30n9q3j39K73J25j99K27j00q3j6J00
4012F7Q5j15j16J50r0Q2k35J96k8J61j98J07o8j99J36J19j03R3Lp8Q1J76j37r2
$$ plain form
3843 5 253 -48 -41 0 -203 -25 75 248 -52 106 54 -83 -165 -20 -100 -124 -33 -123 176 -50 97 -4 -60 -99
3867 -99 -115 22 -98 -44 -119 -98 -14 -222 -7 -139 -48 -2 54 -135 -61 47 -46 -110 253 -118 -198 158 86 -96 85
3892 85 -116 -319 257 33 131 -11 -132 -114 253 71 84 48 78 -54 98 21 -142 32 36 249 -21 1 31 96
3916 96 26 -35 242 -9 69 92 -115 282 66 196 -178 -45 309 -30 62 -254 -78 51 2 71 64 -99 73
3939 73 -5 -8 -114 -71 -80 99 251 -239 102 75 -128 -146 -43 171 -186 59 82 -122 99 -89 -277 52 11 50
3963 50 -106 -213 -12 -123 9 -126 288 -51 5 124 -66 108 69 -6 -3 58 94 56 5 -37 -98 -64 -5 -138 -101
3988 -101 93 -73 122 41 151 -95 -8 -63 -18 -22 11 -109 21 -38 -121 -260 13 138 -61 166 66 -17 -33 67
4012 67 152 37 -79 71 -19 63 -172 24 -4 157 -41 66 -2 -201 -65 54 -49 44 47 -31 50 226 89 -3
4036cJ2R5p0K2k3J37j30l8r8J74n3o4J15K9j3k43K58k84J15J0J14k1K71l57J86
4061A41r8k30P9P2P6oJ68k45R0J21m1k2p7j17l0K02j36K8n0K50k57j04J37j83
4085b32Q8L7P2J1k5J52J03r1k08L46k5k19O1o4l4j05K11K0j57j12J34qP5J35j04
4110F1j78J4J13N4J0PQ6j58M5n3J9n7P4r6oM9n7L9j72N5K14J83j53j04j13J70
4136D6o8J55p0Qj5k64Q7O7K9J82k39j3J86j87J66j65j56J3K26L4p5P2j73J27j49
4161a76K07o2K2j23L32j05J0m5m39J30M13K02j83o5K6l90K61J2J69o8k73K20N8
4184A33j37R4q3J39j68J07j50R8J0j25j04J12J56k80K60l5M0p8Q1k81L24%k81
4207a68J21k3K72k64K84l07Q1J07j40o1R8m7J52l08ML28l6j03j00M7p3M58k16
$$ plain form
4036 -3 9 104 34 56 33 170 40 2 -96 78 25 -39 76 105 92 -151 107 -177 -62 -52 62 41 312 -45 141
4061 141 43 -187 -108 -36 40 34 202 -43 47 168 127 105 28 -89 -119 83 -53 -25 -75 175 -82 -186 -49 -232
4085 -232 -144 -107 -35 -24 -49 103 206 115 -93 253 228 9 70 6 -28 -133 78 98 -59 -171 -37 -45 30 165 61
4110 61 -117 -103 10 64 74 81 167 9 54 1 20 -37 37 -59 -65 -16 -73 -34 -206 -151 63 246 93 -11 -124 46
4136 46 -22 133 63 71 56 -208 -121 -54 -25 157 -82 -95 91 -96 70 -95 -251 -238 -12 22 -53 19 -154 -27 -176
4161 -176 31 -31 -9 -132 200 95 105 60 -379 -249 164 366 183 118 144 -246 15 27 196 128 -145 75 133
4184 133 -4 90 7 146 -22 85 -65 33 43 -82 -186 -74 82 -198 62 27 67 -11 70 -211 113 113 -168
4207 -168 -47 -70 202 -62 222 -85 -4 103 -37 -98 0 -47 105 -203 -199 129 93 -10 -110 -63 -136 322 106
4230A06k82J28Q7L1P1q1j19M6r6J56j65L5p9l0J63J61k71L64k32K51l87Q9m8n5
4254a57J99j88J20N2o7J58j01J53j69n2J38m7pJ66k69O1j5J03j20p5L3J67m4p3
4278c4J32q4p6k3J49k01j29M08p2j32J45o6m00J25J61M1J53j74JM3pj31Q9J28
4302D6N4o3j34J64l5l6M5k17K64k18L1K02r0j19J16J38k01R8r7J30Jj63K00k85
4326a69K12j6No0O6K8k16K82qj53R9j26M0K2j71J96j03J47k58K58k14J45K32m12
4350a74J40Q3k13J73N0K5M1N9o6q3j54L19j01kK8j0j78q9J08J82Nj87N4K60l05
4375c5j66R6QK86l32L01j23j0k0n4J6K31k39J44k17J52J38j76L63l60k06J64J27
4398H8j84n6L63k28R7j37k17N39pj85r0j90J28l8J5M2Q1J40r4J9k84K91P6m2J5
$$ plain form
4230 106 -176 -48 39 70 141 60 -59 -13 -109 47 -118 -83 -162 -192 -29 132 -139 225 -7 244 -143 -54 -102 -157
4254 -157 42 -146 -26 26 -41 117 16 169 0 -52 86 39 32 198 -71 -10 -25 78 -42 -117 -84 83 39 -34
4278 -34 98 14 -62 -85 64 -137 -266 142 70 -62 83 17 -383 -258 -97 -56 97 -77 -76 -33 -40 -171 -82 46
4302 46 100 37 -97 67 32 -4 41 -176 88 -130 -99 103 13 -106 10 148 -53 45 -52 78 79 -84 116 -169
4326 -169 43 27 32 -28 38 66 -150 132 124 -29 70 -56 -16 6 -165 31 -72 75 -183 75 -139 6 238 -174
4350 -174 -34 49 -164 9 59 84 125 184 118 35 -119 200 99 97 125 115 -63 -152 -44 138 143 -44 10 270 -35
4375 -35 -201 -105 -97 189 -143 158 35 25 5 -49 -33 198 -41 103 -114 38 176 0 363 3 -203 -39 88
4398 88 -96 -152 211 -17 80 -57 -274 265 258 73 -17 -207 -79 -117 -102 -60 21 161 67 86 -198 93 169 127 142
4423A42j07j7J12m0j42K07l0j81J62k11J19j61K50K3k37N4K62k40R7L9q1m5K89
4446B64m11J98n8K9j30K11q1j5N8o3J01k54K93l09K25l5l8k5l2K05j71L1J2m8
4470d3J06J47j29j62m6R2J53l14J64Kk4K29k06p1L29k49Q4k38P7j4L7l9L30j78
4494C7o6K18k55J6J73l08L49j12j71J50K2n4P5j11M4j7j1m7K72k09j1J24n4k41
4518a87N0J38j16OJ67j64J23J9j09P3O5Nj73M5O4J19k67J91r7K08r5j24N1K8k68
4543b48K06Q4k9R1j66j33J42J73k23J04r1J15l6j76J60KQk2J19l7m1K28q6j33
4567A1Q4J79k95j19J06K7J04l25J55J91k12J23n1p2R2J4j20J42k12n6K35p3n4
4590a26L8r5J83J22k11K1%lk0l5l0J27p3l9J86O9J19k89K9r6n4J50Q5L3q6r9j06
$$ plain form
4423 142 35 18 130 90 -52 155 125 -56 106 -105 14 -147 103 126 -111 -57 205 -35 62 101 20 -25 264
4446 264 -147 51 -7 22 -108 103 22 7 65 2 103 -151 142 -167 58 23 -15 -40 -72 133 -38 -7 5 -43
4470 -43 63 210 81 -81 -127 -35 118 -196 -32 -30 -54 175 -31 -102 227 -22 62 -176 -99 -113 -76 -115 215 37
4494 37 -29 189 -66 -50 123 -185 164 52 -119 31 53 -1 74 -37 7 -10 -21 -68 204 -5 -16 108 54 -187
4518 -187 -137 1 -115 -109 58 -106 17 36 -73 0 65 70 -103 -58 6 125 -142 49 -48 160 65 -59 -8 20 -248
4543 -248 -42 42 13 104 -62 -195 -53 120 -103 1 -90 25 -11 -187 -27 -25 -17 -39 80 43 2 230 144 11
4567 11 95 274 -21 -140 -34 -7 97 -228 -73 118 -94 29 -22 -94 -2 12 -108 34 -178 -234 1 -72 -126
4590 -126 -88 -183 0 122 -89 -68 -68 -71 -91 -126 -156 -29 -102 -141 45 114 233 -56 -27 -123 -177 -27 58 91 5 -94 -200
4617b00J26K31r9Pk3j03R3J0r4j49P2J16J10%j98P5L5j96L62k7n5j26j7p2L7K27
4643A42j01j53J3L2m9L1J49J80l28RLL39k86n8M5p9j6Q8m6J09K2r9j83L39j3j12
4669b2J2J72n6j59OJ47j52K2kR0L4j65J45mn6J13K0m9j42kL4J24j57N7r8qk46
4696c42L55j03qK36j68J05P6q5N0J6L9j63R2o9l1Lj3O6P4j57R0j43j74K06J66
4721A18j94R6j26j49J31K27n5l1j85K16l8o4J11L8j35j8K6J8m1O8o8j11L7P2o1
4746a18N4k4M8J51j31m9n6j94M52j02k88Q4J00M6k5P4P7j14m2j41N7J66l18L51
4770E8m9Mj61MJ9J18m5J57j85o2K65j88M8P4q4O5k40M58j29j20K39l19Q6j61L16
4795A68r9j45K08j49J4j10J46M9j8l7k43M52j19j5o6N1q3n6n9J65q3L02q9l35
$$ plain form
4617 -200 -74 157 58 65 42 -61 32 42 -52 -201 -129 -13 97 97 -101 -26 9 -187 175 148 93 -33 -50 -122 -85 142
4643 142 41 -112 -99 -67 -116 -85 64 244 -84 -75 -72 267 -19 -77 -32 -111 -127 -39 -85 24 46 -53 -236 103 90 -22
4669 -22 -10 162 106 -53 -47 100 -52 -30 -32 58 92 -73 72 68 12 125 145 96 -46 -48 -14 110 -47 10 -88 -96 -342
4696 -342 13 -90 -98 138 -30 75 151 66 116 132 171 8 100 31 0 3 -10 56 130 -27 63 -80 -254 -48 118
4721 118 -76 20 -106 -255 -124 103 48 17 -168 48 10 -54 57 95 -40 -58 -32 -14 -55 13 -55 -166 -129 -57 -118
4746 -118 -64 -88 -40 111 -20 -69 -125 -319 133 31 -257 -173 -73 -27 -52 22 99 -15 -57 -198 -141 25 -293 58
4770 58 9 13 -148 -144 -125 -7 -52 105 -80 -142 123 -65 -17 57 -27 38 -202 256 127 7 246 -73 13 -148 168
4795 168 69 -76 132 -17 -3 -113 33 82 64 27 -216 236 117 102 36 87 4 -52 -111 54 -29 273 184 -151
4819a51J04K8P1Jj80J81j2l3P4n9J60l20R0K5K1J41k48J12pj7N1m4j59J01q9J28
4845c1J38l35K87j6j12j24J02J53j77O5Q3j19P1K32j63n2k76L13k29J12J54J5
$$ plain form
4819 -151 -47 -19 52 53 -127 54 42 9 83 24 184 -136 -46 -21 0 141 -107 5 -2 -19 32 -12 -171 -70 -159 -31
4845 -31 107 -228 59 43 -69 -193 -91 62 -115 -50 33 -86 -15 217 54 2 -274 39 -190 -78 76 91
$$ [...]
8191c5
##END NTUPLES=NMR FID
##END=
