##TITLE=1H_de-174_oil_TFA
 200.13Hz, DMSO_CCl4.
 8 sc
 13.8.2026
##JCAMPDX= 6.0         $$ Bruker NMR JCAMP-DX V2.0
##DATA TYPE= NMR FID
##DATA CLASS= NTUPLES
##ORIGIN= UXNMR, Bruker Analytische Messtechnik GmbH
##OWNER= pz
$$ XWIN-NMR		Version 3.5
$$ Thu Aug 13 15:01:43 2026 Russian Standard Time (UT+4h)  she@DPX200
##.OBSERVE FREQUENCY= 200.1313
##.OBSERVE NUCLEUS= ^1H
##.DELAY= (6, 6)
##.ACQUISITION MODE= SIMULTANEOUS
##.ACQUISITION SCHEME= undefined
##.AVERAGES= 8
##.DIGITISER RES= 18
##SPECTROMETER/DATA SYSTEM= spect
##.PULSE SEQUENCE= zg30
##.SOLVENT NAME= DMSO
##.SHIFT REFERENCE= (INTERNAL, DMSO, 0, 14.3821)
##AUDIT TRAIL= $$ (NUMBER, WHEN, WHO, WHERE, WHAT)
$$ ##TITLE= Audit trail, XWIN-NMR		Version 3.5
$$ ##JCAMPDX= 5.01
$$ ##ORIGIN= Bruker BioSpin GmbH
$$ ##OWNER= she
$$ F:/spectra/data/she/nmr/H-C/1/audita.txt
$$ ##AUDIT TRAIL=  $$ (NUMBER, WHEN, WHO, WHERE, WHAT)
(   1,<2026-08-13 14:59:49.15 +0400>,<she>,<DPX200>,
      <created by zg, POWCHK disabled, PULCHK disabled
       configuration hash MD5:
       00 E9 B6 7A A2 85 ED C7 34 08 36 98 17 FE 4E 26
       data hash MD5: 16K
       11 22 0E 44 08 F3 55 19 9C 6F 3A B6 94 A6 4D 67>)
$$ ##END=
$$ 
$$ hash MD5
$$ 0E D6 F5 E7 86 DB 2C DF 21 7D D4 93 15 DD 17 52
##$RELAX= 
##$RELAX= 
##$RELAX= 
##$RELAX= 
##$RELAX= 
##$RELAX= 
$$ Bruker specific parameters
$$ --------------------------
##$DU= <F:/spectra>
##$EXPNO= 1
##$NAME= <H-C>
##$PROCNO= 1
##$TYPE= <nmr>
##$USER= <she>
##$AMP= (0..31)
100 100 100 100 100 100 100 100 100 100 100 100 100 100 100 100 100 100 
100 100 100 100 100 100 100 100 100 100 100 100 100 100 
##$AQSEQ= 0
##$AQ_mod= 1
##$AUNM= <au_zg>
##$AUTOPOS= <>
##$BF1= 200.13
##$BF2= 200.13
##$BF3= 200.13
##$BF4= 200.13
##$BF5= 200.13
##$BF6= 200.13
##$BF7= 200.13
##$BF8= 200.13
##$BYTORDA= 1
##$CFDGTYP= 0
##$CFRGTYP= 5
##$CHEMSTR= <none>
##$CNST= (0..31)
1 1 145 1 1 1 1 1 1 1 1 1 1 1 1 1 1 1 1 1 1 1 1 1 1 1 1 1 1 1 1 1 
##$CPDPRG= <>
##$CPDPRG1= <>
##$CPDPRG2= <>
##$CPDPRG3= <>
##$CPDPRG4= <mlev>
##$CPDPRG5= <mlev>
##$CPDPRG6= <mlev>
##$CPDPRG7= <mlev>
##$CPDPRG8= <mlev>
##$CPDPRGB= <>
##$CPDPRGT= <>
##$D= (0..31)
0 0.7 0 0 0 0 0 0 0 0 0 0.03 0 0 0 0 0 0 0 0 0 0 0 0 0 0 0 0 0 0 0 0 
##$DATE= 1786618788
##$DBL= (0..7)
120 120 120 120 120 120 120 120 
##$DBP= (0..7)
150 150 150 150 150 150 150 150 
##$DBP07= 0
##$DBPNAM0= <>
##$DBPNAM1= <>
##$DBPNAM2= <>
##$DBPNAM3= <>
##$DBPNAM4= <>
##$DBPNAM5= <>
##$DBPNAM6= <>
##$DBPNAM7= <>
##$DBPOAL= (0..7)
0.5 0.5 0.5 0.5 0.5 0.5 0.5 0.5 
##$DBPOFFS= (0..7)
0 0 0 0 0 0 0 0 
##$DE= 6
##$DECBNUC= <off>
##$DECIM= 32
##$DECNUC= <off>
##$DECSTAT= 4
##$DIGMOD= 1
##$DIGTYP= 9
##$DL= (0..7)
0 120 120 120 120 120 120 120 
##$DP= (0..7)
150 150 150 150 150 150 150 150 
##$DP07= 0
##$DPNAME0= <>
##$DPNAME1= <>
##$DPNAME2= <>
##$DPNAME3= <>
##$DPNAME4= <>
##$DPNAME5= <>
##$DPNAME6= <>
##$DPNAME7= <>
##$DPOAL= (0..7)
0.5 0.5 0.5 0.5 0.5 0.5 0.5 0.5 
##$DPOFFS= (0..7)
0 0 0 0 0 0 0 0 
##$DQDMODE= 0
##$DR= 18
##$DS= 0
##$DSLIST= <SSSSSSSSSSSSSSS>
$$ [...]
##$SUBNAM0= <"">
##$SUBNAM1= <"">
##$SUBNAM2= <"">
##$SUBNAM3= <"">
##$SUBNAM4= <"">
##$SUBNAM5= <"">
##$SUBNAM6= <"">
##$SUBNAM7= <"">
##$SUBNAM8= <"">
##$SUBNAM9= <"">
##$SW= 18.0517328524113
##$SWIBOX= (0..15)
0 0 2 0 0 0 0 0 0 0 0 0 0 0 0 0 
##$SW_h= 3612.71676300578
##$TD= 16384
##$TD0= 1
##$TE= 0
##$TE2= 300
##$TE3= 300
##$TEG= 300
##$TL= (0..7)
0 120 120 120 120 120 120 120 
##$TP= (0..7)
150 150 150 150 150 150 150 150 
##$TP07= 0
##$TPNAME0= <>
##$TPNAME1= <>
##$TPNAME2= <>
##$TPNAME3= <>
##$TPNAME4= <>
##$TPNAME5= <>
##$TPNAME6= <>
##$TPNAME7= <>
##$TPOAL= (0..7)
0.5 0.5 0.5 0.5 0.5 0.5 0.5 0.5 
##$TPOFFS= (0..7)
0 0 0 0 0 0 0 0 
##$TUNHIN= 0
##$TUNHOUT= 0
##$TUNXOUT= 0
##$USERA1= <user>
##$USERA2= <user>
##$USERA3= <user>
##$USERA4= <user>
##$USERA5= <user>
##$V9= 5
##$VALIST= <valist>
##$VCLIST= <CCCCCCCCCCCCCCC>
##$VD= 0
##$VDLIST= <DDDDDDDDDDDDDDD>
##$VPLIST= <PPPPPPPPPPPPPPP>
##$VTLIST= <TTTTTTTTTTTTTTT>
##$WBST= 1024
##$WBSW= 4
##$XGAIN= (0..3)
0 0 0 0 
##$XL= 0
##$YL= 0
##$YMAX_a= 193609
##$YMIN_a= -158004
##$ZGOPTNS= <>
##$ZL1= 120
##$ZL2= 120
##$ZL3= 120
##$ZL4= 120
##$ABSF1= 10
##$ABSF2= 0
##$ABSG= 5
##$ABSL= 3
##$ALPHA= 0
##$AQORDER= 0
##$ASSFAC= 0
##$ASSFACI= 0
##$ASSFACX= 0
##$ASSWID= 0
##$AUNMP= <proc_1d>
##$AZFE= 0.1
##$AZFW= 0.1
##$BCFW= 1
##$BC_mod= 2
##$BYTORDP= 1
##$COROFFS= 0
##$CY= -3
##$DATMOD= 1
##$DC= 2
##$DFILT= <>
##$DTYPP= 0
##$F1P= 0
##$F2P= 0
##$FCOR= 0.5
##$FTSIZE= 0
##$FT_mod= 4
##$GAMMA= 1
##$GB= 0.15
##$INTBC= 1
##$INTSCL= 1
##$ISEN= 128
##$LB= 0.25
##$LEV0= 0
##$LPBIN= 0
##$MAXI= 10000
##$MC2= 0
##$MEAN= 0
##$ME_mod= 0
##$MI= 1.114404
##$NCOEF= 0
##$NC_proc= 0
##$NLEV= 6
##$NOISF1= 3.799351
##$NOISF2= 2.8
##$NSP= 1
##$NTH_PI= 0
##$NZP= 0
##$OFFSET= 14.38212
##$PC= 1
##$PHC0= -4222.09
##$PHC1= 16.3923
##$PH_mod= 1
##$PKNL= yes
##$PPARMOD= 0
##$PSCAL= 0
##$PSIGN= 0
##$REVERSE= no
##$SF= 200.129724274929
##$SI= 16384
##$SIGF1= 3
##$SIGF2= 2
##$SINO= 400
##$SIOLD= 16384
##$SREGLST= <1H.CDCl3>
##$SSB= 0
##$STSI= 0
##$STSR= 0
##$SW_p= 3205.1282051282
##$SYMM= 0
##$S_DEV= 0
##$TDeff= 0
##$TDoff= 0
##$TI= <>
##$TILT= no
##$TM1= 0
##$TM2= 0
##$TOPLEV= 0
##$USERP1= <user>
##$USERP2= <user>
##$USERP3= <user>
##$USERP4= <user>
##$USERP5= <user>
##$WDW= 1
##$XDIM= 8192
##$YMAX_p= 0
##$YMIN_p= 0
$$ End of Bruker specific parameters
$$ ---------------------------------
##NTUPLES= NMR FID
##VAR_NAME=  TIME,          FID/REAL,        FID/IMAG
##SYMBOL=    X,             R,               I
##VAR_TYPE=  INDEPENDENT,   DEPENDENT,       DEPENDENT
##VAR_FORM=  AFFN,          ASDF,            ASDF
##VAR_DIM=   8192,          8192,            8192
##UNITS=     SECONDS,       ARBITRARY UNITS, ARBITRARY UNITS
##FACTOR=    0.0002768,     1,               1
##FIRST=     0,             0,               0
##LAST=      2.2672688,     0,               0
##MIN=       0,             -158004,         0
##MAX=       2.2672688,     193609,          0
$$ Real data points
##PAGE= N=1
##DATA TABLE= (X++(R..R)), XYDATA
$$ plain form
0 0 0 0 0 0 0 0 0 0 0 0 0 0 0 0 0 0 3 -8 8 -8 8 -8 11 -16 16 -19 24 -24 31 -35 40 -45 51 -59 67 -75 83 -93
38 -93 106 -117 131 -146 162 -179 199 -218 242 -266 295 -325 357 -393 433 -478 528 -583 648 -720
58 -720 804 -902 1018 -1159 1333 -1558 1859 -2280 2920 -4042 6568 -26076 10127 -43982 -158004
73 -158004 -107081 -76194 -109864 -120011 -111069 -118617 -80918 -58108 -86956 -76167 -9781 450
85 450 -11165 8540 10484 9200 44999 38882 4348 29955 65513 46167 34877 53519 66557
98 66557 73241 74258 55542 50164 70549 65578 36164 36883 42891 25228 15157 3866 -18034 -12037
112 -12037 -11135 -53645 -77376 -58334 -54075 -71119 -75652 -69738 -57428 -40101 -41700 -52043 -22640
125 -22640 12053 -7326 -26339 5815 31459 24907 16860 15235 27076 45735 36508 13494 24141
$$ packed form
0@%%%%%%%%%%%%%%%%Lj1J6j6J6j6J9k7L2l5M3m8N5o6P5q5R6j10J26j42J58j76
38i3J99k23K48k77L08l41L78m17M60n08N61o20O82p50Q26r11J006j111J231j368
58g20J524j706J920k177K492k891L417m139N200o962J0610l2644L6203n4109j14022
73a58004N0923L0887l3670j0147Q942p548L7699K2810k8848J0789O6386J0231
85D50j1615J9705J944j284L5799o117l4534K5607L5558j9346j1290J8642J3038
98F6557O684J017j8716n378K0385m971k9414P19O008j7663j0071j1291k1900N997
112a2037R02m2510k3731J9042M259j7044m533N914J2310J7327j599j0343K9403
125b2640L4693j9379j9013L2154K5644o552q047j625J1841J8659r227k3014J0647
$$ plain form
138 24141 49025 40284 15490 16913 32113 36244 30651 16858 10396 24502 25826 2789 -7241
151 -7241 -999 -944 -10317 -28755 -41786 -30867 -19867 -36468 -56022 -46588 -28785 -30606 -34974 -29641
165 -29641 -21140 -5779 650 -11765 -6830 20488 24524 9069 8167 20615 30411 30487 20861 13832
179 13832 24069 33920 17342 219 14934 28398 13424 -391 4592 14728 16453 4246 -5871
192 -5871 744 6188 -6828 -21274 -18334 -8830 -14550 -27466 -28233 -21347 -16227 -15862 -21708 -21979 -13483
207 -13483 -8275 -10015 -12269 -5848 8769 12076 2915 3848 18278 26338 18357 6950 9058 18341
221 18341 17615 7653 2196 9298 18362 10277 -2215 1752 10505 10041 392 -9358 -7054 2803 1214
236 1214 -10986 -15214 -4393 1771 -11404 -21260 -11752 -2537 -8272 -18463 -19050 -8237 -1227 -5855
$$ packed form
138B4141K4884q741k4794J423J5200M131n593j3793o462J4106J324k3037j0030
151g241O242N5r373j8438j3031J0919J1000j6601j9554R434J7803j821m368N333
165b9641Q501J5361O429j2415M935K7318M036j5455r02J2448R796P6r626p029
179A3832J0237R851j6578j7123J4715J3464j4974j3815M983J0136J725j2207j0117
192e871O615N444j3016j4446K940R504n720j2916p67O886N120L65n846k71Q496
207a3483N208j740k254O421J4617L307r161R33J4430Q060p981j1407K108R283
221A8341p26r962n457P102R064q085j2492L967Q753m64r649r750K304R857j589
236A214j2200m228J0821O164j3175r856R508R215n735j0191n87J0813P010m628
$$ plain form
250 -5855 -8884 -2267 6546 6079 394 3236 11429 11732 8409 7192 7230 11551 14426 9968 5211 5808
266 5808 8830 6009 -124 304 4704 3316 -1374 -5096 -3590 2736 583 -8302 -8455 -2942 -2810 -8381
282 -8381 -10736 -5462 -1874 -6442 -10808 -9037 -3186 -126 -5359 -9430 -4029 2656 2352 -1345 -516 8005
298 8005 11409 3663 -107 5867 11694 9006 882 85 7273 9550 4135 81 3169 7202 2253
313 2253 -4401 -3370 -507 -432 -2029 -5231 -5684 -1300 1451 -1123 -4987 -4515 -1288 -2140 -6223 -7125 -3278
330 -3278 387 -1281 -6353 -3259 4304 4338 -818 -1688 2029 3923 619 -896 2848 5387 4619 2643
346 2643 2134 4957 6741 3665 413 -344 906 600 -2540 -2655 834 964 -1760 -3677 -2101 973
362 973 -243 -5197 -5320 -1725 -692 -3596 -4572 -455 2125 -920 -3144 -1037 696 1568 318 -1893
$$ packed form
250e855l029O617Q813m67n685K842Q193L03l323j217L8M321K875m458m757N97
266E808L022k821o133M28M400j388m690l722J506O326k153q885j53N513J32n571
282h381k355N274L588m568m366J771N851L060n233m071N401O685l04l697Q29Q521
298H005L404p746l770N974N827k688q124p97P188K277n415m054L088M033m949
313B253o654J031K863P5j597l202m53M384K751k574l864M72L227q52m083r02L847
330c278L665j668n072L094P563L4n156q70L717J894l304j515L744K539p68j976
346B643n09K823J784l076l252p57J250l06l140j15L489J30k724j917J576L074
362I73j216m954j23L595J033k904r76M117K580l045k224K107J733Q72j250k211
$$ plain form
378 -1893 -1080 1048 2400 2099 284 1948 4185 3465 1292 250 2671 5856 2654 -2497 -480 4273
394 4273 3885 -832 -2301 1061 1391 -2022 -3212 -2276 -30 129 -2867 -4670 -1713 561 -555 -2676
410 -2676 -2678 -1126 -347 -847 -1329 -54 1335 1085 -1768 -918 1687 1511 -122 -255 617 964 588 595 2362
429 2362 1996 533 594 501 659 436 328 558 -40 -892 488 1023 104 -413 27 -361 -1695 -3152 -969
448 -969 796 -1463 -3109 -700 1071 992 -870 -530 1534 549 -956 -1667 95 2301 1595 -536 224
465 224 1375 1864 1797 -14 -329 635 467 -487 -707 544 1708 929 -866 -150 762 1395 332 -1535
483 -1535 -1194 -312 -971 -1134 -383 -461 -244 -218 -824 -1430 -1360 -317 -300 -1274 -1157 -484 528 1275 417 249 1242
504 1242 1352 -601 -239 1429 1582 -100 -368 649 794 414 861 865 89 -483 -575 388 1006 164 -803 -285
$$ packed form
378a893Q13K128J352l01j815J664K237p20k173j042K421L185l202n151K017M753
394D273l88m717j469L362L30l413j190R36K246J59k996j803K957K274j116k121
410b676kJ552P79n00m82J275J389k50k853Q50K605j76j633j33Q72L47l76PJ767
429B362l66j463O1r3J58k23j08K30n98q52J380N35r19n17M40l88j334j457K183
448i69J765k259j646K409J771p9j862L40K064r85j505p11J762K206p06k131P60
465B24J151M89o7j811l15R64j68r54k20J251J164p79j795P16R12O33j063j867
483a535L41Q82o59j63P51p8K17K6o06o06P0J043J7r74J17O73J012P47q58j68R93
504A242J10j953L62J668J53j682k68J017J45l80M47Mp76n72r2R63O18q42r67N18
$$ plain form
524 -285 566 359 -681 -302 274 -491 -1096 -526 -764 -340 607 -160 -1325 -732 308 462 -747 -560 41
543 41 -1 -274 -355 203 1155 1275 122 -256 -266 -235 427 631 145 -1023 -250 1039 404 -838 135 748 -861
564 -861 -1558 -677 387 245 -605 -744 -106 535 258 -112 182 130 -483 -527 189 68 -153 -77 536 231 -221
585 -221 199 592 210 -2 -170 -585 -203 693 873 127 1219 730 -173 -77 13 15 4 -199 -980 -623 94 571
607 571 -240 -50 208 -619 -177 234 -26 -885 -601 -329 168 23 137 375 391 223 -712 -430 605 174
627 174 -1152 -811 328 223 140 -167 545 877 -94 -288 -322 386 107 30 213 533 -51 -56 733 518 122
648 122 -283 -319 -383 -489 -196 393 37 -327 -328 -64 374 208 20 -263 -120 -21 220 102 -47 59 194 160
670 160 -72 -156 556 826 -254 -297 98 36 -97 233 318 -164 -352 83 313 64 18 327 181 142 -590 -664
$$ packed form
524b85Q51k07j040L79N76p65o05N70k38M24R47p67j165N93J040J54j209J87O01
543D1m2k73q1N58R52J20j153l78j0L1O62K04m86j168P73J289o35j242R73O13j609
564h61o97Q81J064j42q50j39O38O41k77l70K94n2o13m4P16j21k21P6O13l05m52
585b21M20L93l82k12j68m15L82Q96J80p46J092m89r03R6R0Kj1k03p81L57P17M77
607E71q11J90K58q27M42M11k60q59K84K72M97j45J14K38J6j68r35K82J035m31
627A74j326L41J139j05q3l07P12L32r71j94l4P08k79p7J83L20n84nP89k15l96
648A22m05l6o4j06K93N89l56l64jK64M38j66j88k83J43R9K41j18j49J06J35l4
670A60k32q4P12K70j080m3L95o2j33L30Q5m82j88M35K30k49m6L09j46l9p32p4
$$ plain form
692 -664 221 65 -906 -854 -365 126 39 -160 254 -91 -14 -115 3 -4 183 -137 93 161 -160 346 517 726
714 726 -371 59 388 265 -40 -172 75 -235 151 217 -54 202 589 274 68 -254 8 385 -37 -576
734 -576 307 -127 141 76 310 333 81 -325 -60 -119 -336 -6 -196 119 63 -228 312 791 121 -138 -209 -143
756 -143 82 -482 -99 13 102 -132 -171 98 613 46 -71 -26 92 -39 15 116 236 21 134 122 -152 14
778 14 312 66 -287 -220 -300 -113 345 303 135 -68 -161 411 98 -115 69 -5 37 283 -146 6 290 212 -86
801 -86 -173 92 -20 -141 -70 -67 -237 -363 68 -42 310 -207 -203 69 -320 -182 199 378 87 -120 -353 222 362
824 362 -205 -365 -113 -400 -392 -190 -108 83 99 159 -18 -226 -53 225 152 -37 -104 2 303 296 199 60 245 -180
848 -180 -64 67 -120 122 -34 -113 -311 -153 242 422 80 -8 103 125 -7 -185 -119 275 -87 -77 -230 14
$$ packed form
692f64Q85j56r71N2M89M91q7j99M14l45P7j01J18pJ87l20K30O8l21N06J71K09
714G26j097M30L29j23l05j32K47l10L86O6k71K56L87l15k06l22K62L77m22n39
734e76Q83m34K68o5K34K3k52m06K65n9k17L30j90L15n6k91N40M79o70k59p1O6
756a43K25n64L83J12Q9k34l9K69N15n67j17M5J18j31N4J01J20k15J13j2k74J66
778A4K98k46l53O7q0J87M58m2j68k03r3N72l13k13J84p4M2K46m29J52K84p8k98
801h6q7K65j12j21P1Lj70j26M31j10L52n17MK72l89J38L81J79k91k07k33N75J40
824C62n67j60K52k87QK02Q2J91J6O0j77k08J73K78p3j89o7J06L01pr7j39J85m25
848a80J16J31j87K42j56p9j98J58L95J80l42q8J11K2j32j78O6L94l62J0j53K44
$$ plain form
870 14 362 75 19 -255 -338 -178 -140 -159 64 53 4 172 167 -86 35 10 73 -163 -379 136 116 -14 93 -133
894 -133 189 109 -32 -40 -57 -101 -186 -69 121 -70 218 231 -29 -47 109 58 36 80 -247 -30 -5 -27 98 -142 273
919 273 27 -268 -297 -164 107 -34 161 -65 68 -74 41 72 89 114 173 -149 -238 250 -109 -61 -271 -138 53
942 53 230 -72 50 -92 -155 -180 -77 65 -95 -220 151 144 -99 -39 194 229 -52 -130 -234 107 148 233 5 -60
966 -60 -135 -152 -45 -201 64 -170 7 -174 -68 74 -19 126 -9 -144 -105 -191 -153 215 116 43 78 -198 -60 121
990 121 -146 69 -220 -54 -277 138 -89 -5 56 5 30 225 -170 23 -136 -175 -35 49 31 -11 144 103 -22
1013 -22 -20 -158 296 144 -158 -3 1 -15 104 120 -40 162 -68 -17 -51 -230 156 -115 -313 -361 -79 -12 -11 -70 -137
1038 -137 162 34 -112 -163 107 182 -245 -327 -94 -61 103 -35 82 44 111 168 46 -7 -44 81 -32 231 -83
$$ packed form
870A4L48k87n6k74q3J60L8j9K23j1m9J68nk53J21k5O3k36k16N15k0j30J07k26
894a33L22q0j41qj7m4q5J17J90j91K88J3k60j8J56n1k2M4l27K17K5k2J25k40M15
919B73k46k95k9J33K71j41J95k26J33j42J15L1J7K5N9l22q9M88l59M8k10J33J91
942E3J77l02J22j42o3k5J03J42j60j25L71pk43O0K33L5k81p8j04L41M1Q5k28o5
966f0p5j7J07j56K65k34J77j81J06J42r3J45j35j35L9q6L8L68r9p3L5k76J38J81
990A21k67K15k89J66k23M15k27Q4O1n1K5J95l95J93j59l9J40Q4j8m2J55m1j25
1013b2Kj38M54j52l02J55Mj6J19J6j60K02k30N1l4j79L86k71j98m8K82O7Jn9o7
1038a37K99j28j46n1K70P5m27q2K33L3J64j38J17l8O7N7j22n3l7J25j13K63l14
$$ plain form
1061 -83 -13 47 211 -253 -137 -41 7 12 10 168 65 302 129 102 116 128 79 205 28 -280 -71 243 22 -93
1085 -93 -181 -3 5 216 -8 86 -24 3 -60 -14 122 307 -198 68 -149 103 113 146 94 51 87 -109 126 33 202
1110 202 101 -163 20 152 -33 29 -136 291 -69 143 98 38 19 -38 -65 -63 215 -14 -24 -95 237 146 -42 60
1134 60 109 -129 44 -142 -61 -199 22 -56 -170 14 3 -160 -63 -137 -193 -72 -349 65 -159 46 172 -186 153
1157 153 257 -23 37 -112 -266 -283 -108 262 116 -106 40 59 126 -129 150 -280 -103 -77 56 245 159 -123
1179 -123 76 24 -131 -52 312 255 -218 11 83 248 19 127 -146 24 -262 -186 201 261 -126 18 -128 -121 71
1202 71 -89 63 -129 -273 -99 -55 -236 -8 -173 -95 -123 -239 -78 -175 -49 -90 202 -213 -179 -76 188 -52
1224 -52 -24 14 177 87 26 -27 140 146 87 297 108 -123 -424 -17 -108 25 21 -378 -21 204 51 102 -148 23
$$ packed form
1061h3P0O0J64m64J16R6M8NkJ58j03K37j73k7J4J2m9J26j77l08K09L14k21j15
1085i3q8J78QK11k24R4j10K7o3M6J36J85n05K66k17K52J0L3n2m3L6j96K35r3J69
1110B02j01k64J83J32j85O2j65M27l60K12m5o0j9n7k7KK78k29j0p1L32r1j88J02
1134F0M9k38J73j86Q1j38K21p8j14J84j1j63R7p4n6J21k77M14k24K05J26l58L39
1157A53J04k80O0j49j54j7J75L70j46k22J46J9O7k55K79m30J77K6J33J89q6k82
1179a23J99n2j55P9L64n7m73K29P2J65k29J08k73J70k86P6L87O0l87J44j46PJ92
1202G1j60J52j92j44J74M4j81K28j65P8k8j16J61r7J26m1K92m15L4J03K64k40
1224e2K8L8J63r0o1n3J67On9K10j89k31l01M07r1J33ml99L57K25j53N1k50J71
$$ plain form
1248 23 101 -61 -59 151 261 -208 110 -103 210 -126 -150 30 -395 79 -103 67 45 162 203 358 -42 -81 -82
1271 -82 57 94 58 161 127 -2 113 -12 -241 -21 -59 -217 -53 81 -379 -124 120 -38 117 -44 52 -227
1293 -227 -106 -90 1 77 -307 227 94 -80 -110 7 -48 -92 -295 86 -40 -158 210 92 -105 136 185 259 -185
1316 -185 -84 88 -83 145 -138 94 147 -129 36 81 -184 80 79 191 78 -102 -40 -50 -4 -87 42 25 -132
1339 -132 26 -188 -379 -63 -106 -187 -192 -256 240 176 46 -222 298 109 101 -119 -77 -204 0 64 -361 119 66 -126
1363 -126 -196 88 -182 -148 -69 -42 -73 184 -41 -171 -73 -47 -113 27 108 -5 -117 100 67 33 -48 -38 187 278 147
1388 147 -145 56 -169 -51 -80 167 -96 25 -95 152 -85 11 178 -77 -29 208 41 110 -148 -67 54 -18
1410 -18 -18 26 53 -88 -181 56 -144 -23 -418 -133 64 -158 4 167 -38 -88 -173 -24 86 233 119 257 -54
$$ packed form
1248B3P8j62KK10J10m69L18k13L13l36k4J80m25M74j82J70k2J17M1J55m00l9j
1271h2J39L7l6J03l4j29J15j25k29K20l8j58J64J34m60K55K44j58J55j61R6k79
1293b27J21J6R1P6l84N34j33j74l0J17n5m4k03L81j26j18L68j18j97K41M9P4m44
1316a85J01J72j71K28k83K32N3k76J65M5k65K64jJ12j13j80O2j0M6q3J29j7j57
1339a32J58k14j91L16m3q1no4M96o4j30k68N20j89qk20M2j27K04O4m25M80n3j92
1363a26p0K84k70L4P9K7l1K57k25j30R8K6o6J40Q1j13j12K17l3l4q1J0K25R1j31
1388A47k92K01k25J18k9K47k63J21j20K47k37R6J67k55M8K37j67O9k58Q1J21p2
1410a8%M4K7j41r3K37k00J21l95K85J97k22J62J63k05n0q5J49J10J47j14J38l11
$$ plain form
1433 -54 -18 -17 284 218 -254 -261 225 -152 157 -61 -133 -11 29 11 52 181 248 -29 -42 -65 28 150 -251 -126 55
1458 55 119 130 26 -182 48 191 -114 -94 285 -193 -192 175 -263 -100 189 320 -25 266 155 107 95 73 -89
1481 -89 -204 223 -53 -146 26 -83 -62 -72 -43 -28 123 151 116 -106 280 -44 18 -17 10 144 -119 -76 -278 -133
1505 -133 22 56 -42 -166 -132 -108 -179 -241 -47 -5 -153 68 24 83 -181 -247 74 91 -88 80 85 0 75 -178 183
1530 183 -25 -72 165 -99 -188 4 -128 -143 89 43 -90 8 219 -189 187 212 -100 138 21 155 122 -261
1552 -261 321 -155 172 323 335 -89 152 164 120 -31 -143 -169 164 -157 80 290 -31 -34 -305 39 38 -64 -56
1575 -56 52 185 117 46 -268 -202 110 107 -81 -150 92 15 -61 -302 -43 -31 54 -67 189 95 -312 149 181 -360
1599 -360 -58 84 -65 -90 -111 195 82 67 335 159 -122 -167 90 -130 279 -117 52 72 128 -56 -81 136
$$ packed form
1433e4L6JL01o6m72pM86l77L09k18p2J22M0j8M1J29O7k77j3k3R3J22m01J25J81
1458E5O4J1j04k08K30J43l05K0L79m78JL67m38J63K89J31l45K91j11m8j2k2j62
1481h9j15M27k76r3J72j09K1j0K9J5J51K8l5k22L86l24O2l5K7J34k63M3k02J45
1505a33J55L4r8j24L4K4p1o2J94M2j48K21m4N9k64o6L21J7j79J68Nq5P5k53L61
1530A83k08m7K37k64q9J92j32j5K32m6j33R8K11m08L76K5l12K38j17J34l3l83
1552b61N82m76L27J51J2m24K41J2m4j51j12k6L33l21K37K10l21lk71L44jj02Q
1575e6J08J33o8p1l14O6L12lj88o9K42p7p6k41K59J2Q5j21K56r4m07M61L2n41
1599c60L02J42j49k5k1L06j13j5K68j76k81m5K57k20M09l96J69K0N6j84k5K17
$$ plain form
1621 136 -118 65 -266 75 133 -47 22 254 -19 -3 -246 -109 152 107 -13 255 -55 229 229 -53 59 81
1643 81 90 30 -97 117 213 -106 191 -243 47 -2 -52 -133 265 248 -215 236 36 -172 -323 -51 215 -59 -92
1666 -92 51 186 -27 30 35 -163 -42 -4 64 386 -260 0 84 -53 -84 80 -23 -162 47 -37 4 47 -262 187
1690 187 -85 -110 -40 -130 263 -16 159 -135 115 156 -112 -57 -137 -45 189 51 208 -2 248 -149 -87 115 121
1713 121 79 46 -73 -4 92 197 -229 15 -29 134 -33 49 173 111 -53 293 150 163 -15 123 -111 6 13
1736 13 -78 -11 -84 -28 -52 200 107 -73 156 -183 -20 -78 179 100 -210 164 -22 96 13 186 -49 -34 171 25
1760 25 -375 128 116 -40 -66 83 68 30 -76 -17 188 22 113 90 15 -42 151 70 -36 198 1 -40 -59 285
1784 285 -46 141 56 -35 -95 159 33 -176 -152 265 -118 253 -212 31 7 83 -28 -164 -74 166 185 104 -167
$$ packed form
1621A36k54J83l31L41N8j80O9K32k73J6k43J37K61m5j20K68l10K84%k82J12K2
1643H1Ro0j27K14R6l19K97m34K90m9n0q1L98j7m63M51k00k08j51K72K66k74l3
1666i2J43J35k13N7Nj98J21L8O8L22o46K60Q4j37l1J64j03j39K09q4M1M3l09M49
1690A87k72k5P0r0L93k79J75k94K50M1k68N5q0R2K34j38J57k10K50l97O2K02O
1713A21m2l3j19O9R6J05m26K44m4J63j67Q2J24o2j64L46j43J3j78J38k34J17P
1736A3r1O7p3N6k4K52r3j80K29l39J63n8K57p9l10L74j86J18q3J73k35J5K05j46
1760B5m00N03j2j56k6J49j5l8j06N9K05j66R1k3p5n7J93q1j06K34j97m1j9L44
1784B85l31J87q5r1o0K54j26k09K4M17l83L71m65K43k4P6j11j36R0K40J9q1k71
$$ plain form
1807 -167 -1 1 -50 59 143 -35 -131 193 80 -41 -34 -237 -40 -57 84 -189 21 -340 38 -148 109 278 -102
1830 -102 152 -43 -87 -85 65 118 -155 5 310 84 -161 -200 40 -61 54 -280 29 -121 -71 -98 -37 -39 57 120
1854 120 98 135 -167 61 81 -124 100 -247 98 -112 -172 114 -63 10 229 0 -265 -149 32 441 73 88
1876 88 -191 -65 108 -7 125 -70 -30 64 318 -45 30 -35 104 -61 -17 102 -36 -77 -201 204 170 225 102
1899 102 55 -189 11 -53 120 -71 -58 -18 82 -44 -91 103 30 -75 417 87 -4 -50 -185 -37 163 -83 7
1922 7 70 -78 -49 48 208 -102 26 5 -115 150 -27 202 36 -336 19 113 144 96 75 -232 -99 -104 42 79
1946 79 59 -46 89 176 65 273 -67 -66 -131 177 76 -147 103 97 -123 32 2 -28 -57 223 -111 -252 70 7
1970 7 -24 157 136 177 181 87 224 -236 170 -309 -168 74 -136 77 30 -187 419 -59 -30 -20 -11 -216 -20 269
$$ packed form
1807a67J66Kn1J09Q4j78r6L24j13j21Pk03J97j7J41k73K10l61L78j86K57J69l80
1830a02K54j95m4KJ50N3k73J60L05k26k45l9K40j01J15l34L09j50N0k7O1kR6O3
1854A20k2L7l02K28K0k05K24l47L45k10o0K86j77P3K19k29k65J16J81M09l68J5
1876H8k79J26J73j15J32j95M0R4K54l63P5o5J39j65M4J19j38m1j24M05l4N5j23
1899A02m7k44K00o4J73j91J3M0J00j26m7J94p3j05M92l30r1m6j35J48K00k46R0
1922GO3j48K9R7J60l10J28k1j20K65j77K29j66l72L55R4L1m8k1l07J33nJ46L7
1946G9k0j05J35Q7j11K08l40Jo5L08j01k23K50ok20J55l0l0k9K80l34j41L22o3
1970Gl1J81k1M1Mr4J37m60M06m79J41K42k10K13m7k17O06m78K9J0Rk05J96K89
$$ plain form
1994 269 299 -108 92 1 -132 -12 134 -32 128 61 -68 -64 375 107 19 140 101 -19 -46 165 -47 137 250
2017 250 40 -26 113 18 142 -197 -172 289 16 -161 187 -207 -63 -45 109 249 -358 -142 -70 -151 118 -128
2039 -128 -152 142 -151 -184 -114 168 282 -133 175 112 227 242 72 -243 169 13 -4 -40 19 -114 108 123 26
2062 26 -73 454 4 -9 -1 35 133 38 -79 -199 218 -111 -17 121 -135 -53 -14 94 55 107 128 -61 73 -116 -60
2087 -60 -218 -76 216 170 5 79 -215 -109 -216 22 -155 -142 15 204 18 64 136 -38 249 6 -2 67 202
2110 202 373 221 -39 67 132 229 156 -110 -89 8 -5 149 83 -113 119 102 -38 179 63 289 53 -70 188
2133 188 -71 -199 44 -42 85 214 112 38 -83 -12 -142 -44 111 131 -85 -107 162 -102 22 -34 105 138 -71
2156 -71 71 -72 43 -58 66 10 22 -36 -121 -192 38 -234 -56 122 9 -23 -213 -63 97 156 -158 -206 48
$$ packed form
1994B69L0m07K00r1j33J20J46j66J60o7j29MM39k68q8J21l9j20k7K11k12J84J13
2017B50k10o6J39r5J24l39K5M61k73j77L48l94J44J8J54J40o07K16P2q1K69k46
2039a28k4K94k93l3P0K82J14m15L08o3J15J5j70l15M12j56j7l6N9j33K22J5r7
2062B6r9N27m50j3QL6R8r5j17j20M17l29R4J38k56Q2L9J08l9N2K1j89J34j89N6
2087f0j58J42K92m6j65P4k94J06j07K38j77J3J57J89j86M6P2j74K87k43qO9J35
2110B02J71j52k60J06O5R7p3k66K1R7j3J54o6j96K32j7j40K17j16K26k36j23K58
2133A88k59j28K43q6J27J29j02p4j21P1j30R8J55K0k16k2K69k64J24n6J39L3k09
2156g1J42j43J15j01J24n6J2n8q5p1K30k72J78J78j13l2j90J50J60N9l14m8K54
$$ plain form
2179 48 189 179 214 22 -30 224 30 332 30 4 -52 -72 58 -159 -205 -249 -37 -123 75 -13 154 180 -72 -135
2203 -135 6 50 -29 -39 -59 285 13 -165 140 -95 34 -211 -60 10 130 -136 -23 -44 4 -247 348 150
2225 150 -133 70 142 201 117 219 -7 65 -171 44 -79 -113 -156 42 314 162 -171 -34 -31 -184 127 39 -65
2248 -65 -3 -88 -191 -98 -126 -135 -200 237 -132 88 246 -132 251 -269 133 13 -166 114 166 28 -142 23 -65
2271 -65 22 28 -51 -308 -78 -415 232 -216 -44 -59 -134 -274 289 116 -121 48 -57 221 116 -59 -49 85 -179
2294 -179 196 -13 -93 9 -241 -142 -15 -38 47 -52 188 39 -23 263 122 -162 -170 79 -110 -211 -146 157 139
2317 139 -48 -281 42 185 -170 -87 -75 -57 -74 96 442 -30 62 -77 -70 -149 9 154 177 68 5 14 272 218
2341 218 -46 -87 -113 -167 44 -49 24 -78 -4 237 -34 -173 56 -90 -77 -82 3 97 40 241 133 -86 37 63
$$ packed form
2179D8J41j0L5j92n2K54j94L02l02k6n6k0J30k17m6m4K12q6J98q8J67K6k52o3
2203a35J41M4p9j0k0L44k72j78L05k35J29k45J51P0J20k66J13k1M8k51N95j98
2225A50k83K03P2N9q4J02k26P2k36K15j23l4m3J98K72j52l33J37Lj53L11q8j04
2248f5O2q5j03R3k8ro5M37l69K20J58l78L83n20M02j20j79K80N2j38j70J65q8
2271f5Q7Op9k57K30l37O47m48J72j5p5j40N63j73k37J69j05K78j05j75J0J34k64
2294a79L75k09q0J02k50R9J27k3Q5r9K40j49o2K86j41k84qK49j89j01O5L03j8
2317A39j87k33L23J43l55Q3J2J8j7J70L46m72R2j39Pp9J58J45K3j09o3RK58n4
2341B18k64m1k6n4K11r3P3j02P4K41k71j39K29j46J3nQ5R4n7K01j08k19J23K6
$$ plain form
2365 63 -115 266 -2 -75 -151 30 18 52 32 106 29 -208 163 113 -28 227 274 -37 134 108 -256 15 -132 -10
2389 -10 84 -55 20 -63 -124 314 60 -138 -145 18 145 24 -53 154 -192 221 4 -283 146 -86 -173 -20 -107
2412 -107 76 32 221 -102 -96 15 -271 -57 197 -208 122 -108 -203 -42 -160 -28 344 -199 -77 5 -19 -91
2434 -91 -183 -61 -263 -156 11 326 -155 -50 269 26 152 55 114 102 -75 -59 21 -100 -215 124 -28 214
2456 214 -44 -22 93 62 -29 35 -64 -190 1 -69 -21 -120 -6 -25 -100 -279 -99 239 24 -80 -66 207 72 188
2480 188 -57 -68 -16 50 -71 -68 20 39 65 -135 -146 -26 -122 67 -172 125 -264 -109 -3 14 -100 170 9 -27
2504 -27 -55 92 145 -30 -66 12 -85 90 62 -312 28 5 219 56 76 -43 -61 -95 -95 -23 232 -38 523 -35 168
2529 168 -22 59 56 136 128 140 130 -23 147 38 -63 -316 -208 -164 137 -81 46 -9 -143 7 77 6 156 -256
$$ packed form
2365F3j78L81k68p3p6J81j2L4k0P4p7k37L71n0j41K55M7l11J71k6l64K71j47J22
2389a0R4j39P5q3o1M38k54j98pJ63J27j21p7K07l46M13k17k87M29k32q7J53q7
2412a07J83m4J89l23OJ11k86K14K54m05L30k30r5J61j18J32L72n43J22Q2k4p2
2434i1r2J22k02J07J67L15m81J05L19k43J26r7N9j2j77J6Q0j21j15L39j52K42
2456B14k58K2J15l1r1O4r9j26J91p0M8r9J14j9p5j79J80L38k15j04J4K73j35J16
2480A88k45j1N2O6j21LQ8J9K6k00j1J20r6J89k39K97l89J55J06J7j14K70j61l6
2504b7k8J47N3j75l6P8r7J75k8l74L40k3K14j63K0j19j8l4%P2K55k70N61n58K03
2529A68j90Q1lQ0qJ2j0j53J70j09j01k53J08M4L01k18J27n5j34J50P0p1J50m12
$$ plain form
2553 -256 -72 -169 152 340 209 -8 104 32 270 -98 80 3 -8 65 -84 23 38 76 231 196 -131 194 196
2576 196 279 28 155 36 -112 -62 34 189 -30 -390 -289 -182 130 -112 3 35 -33 26 -115 93 30 39 70
2599 70 85 87 -15 -12 63 281 -76 -215 176 176 -103 -185 177 -31 -49 1 -26 102 46 76 173 -100 -170 36 3 -118
2625 -118 -190 176 -113 48 -312 43 -38 138 -73 123 243 -197 110 64 67 -195 -7 -122 125 18 -257 234
2647 234 -101 -103 39 -47 -16 -200 77 150 -81 -212 49 59 -69 41 -237 16 -207 106 -245 40 -193 91
2669 91 -67 164 -22 12 336 -117 76 -229 165 -114 -51 -61 275 46 -77 -28 -122 -97 37 26 -9 -42 -245
2692 -245 -111 128 0 41 57 55 -66 -45 -123 53 198 -103 195 -17 -100 220 52 193 92 -325 -65 109
2714 109 357 128 -35 -34 158 -82 62 9 -89 -10 -125 -56 36 102 -139 -237 -90 -59 65 -141 143 93 -29 189
$$ packed form
2553b56J84r7L21J88j31k17J12p2K38l68J78p7j1P3j49J07J5L8J55l5l27L25K
2576A96Q3k51J27j19j48N0R6J55k19l60J01J07L12k42J15L2o8N9j41K08o3RL1
2599G0J5Kj02LP5K18l57j39L91%k79q2L62k08j8N0k7J28n6L0R7k73p0K06l3j21
2625a18p2L66k89J61l60L55q1J76k11J96J20m40L07m6Lk62J88j15K47j07k75M91
2647B34l35kJ42q6L1j84K77P3k31j31K61J0j28J10k78K53k23L13l51K85k33K84
2669I1j58K31j86L4L24m53J93l05L94k79O3j0L36k29j23M9r4K5J34j1l5l3k03
2692b45J34K39j28M1J6kj21K1p8J76J45l01K98k12q3L20j68J41j01m17K60J74
2714A09K48k29j63JJ92k40J44n3r8P9j15O9R2O6k41r8J47L1J24k06K84n0j22K18
$$ plain form
2738 189 31 45 194 -164 41 111 79 81 -192 66 57 246 111 -172 -16 -109 -34 -126 -359 105 -181 53 -224
2761 -224 148 -96 61 -287 -96 -45 -36 11 -50 39 5 -23 34 47 26 -20 113 -8 -1 -210 149 102 1 178 46
2786 46 197 122 243 33 -4 90 -86 12 -87 155 166 -238 -401 -81 -3 -124 -188 -109 160 36 71 -156 46 48
2810 48 -142 -142 36 -142 157 113 10 127 249 372 -31 96 -134 -65 175 -87 135 65 66 140 -57 -303 111
2833 111 -148 -405 -21 95 -73 -146 -65 -154 -287 -46 127 61 318 41 -116 109 -33 249 1 -323 3
2854 3 -80 28 8 -81 -11 145 -120 -70 49 146 43 47 22 -274 -268 -207 53 169 -159 -59 17 37 -11 -224 -101 -46
2880 -46 99 -71 -40 -75 -303 -49 -89 -148 -28 -158 -292 -74 -31 101 -79 -207 183 -33 34 -13 -54 -69 -218
2903 -218 141 -36 134 -144 -22 246 107 -22 -68 -150 -9 436 -57 82 -125 239 -172 185 74 -36 -213
$$ packed form
2738A89j58J4J49l58K05P0l2Kk73K58rJ89j35k83J56r3P5r2k33M64k86K34k77
2761b24L72k44J57l48J91N1RM7o1Q9l4k8N7J3k1m6J33j21Pk09L59m7j01J77j32
2786D6J51p5J21k10l7R4j76R8r9K42J1m04j63L20P8j21o4P9K69j24L5k27K02K
2810D8j90%J78j78K99m4j03J17J22J23m03J27k30O9K40k62K22p0JP4j97k46M14
2833A11k59k57L84J16j68p3Q1q9j33K41J73o6K57k77j57K25j42K82k48l24L26
2854Cq3J08k0q9P0J56k65N0J19R7j03Mk5k96OO1K60J16l28J00P6K0m8k13J23N5
2880d6J45j70L1l5k28K54m0n9J20j30j34K18M3J32j80j28L90k16O7m7m1j5j49
2903b18L59j77J70k78J22K68j39j29m6q2J41M45m93J39k07L64m11L57j11j10j77
$$ plain form
2924 -213 404 102 -436 -287 172 -253 -51 -33 -100 -222 -155 -24 157 -27 -139 102 -177 -16 -103 46 50 -116
2946 -116 -18 93 69 -47 167 620 -163 231 -15 -58 197 -38 257 -210 49 -94 114 17 169 -183 18
2967 18 202 -93 215 134 -170 -267 -31 -218 122 19 145 -26 11 177 -225 171 -151 57 -307 -174 50
2988 50 4 -72 -167 180 170 80 93 45 -176 59 105 111 -147 4 -164 -22 6 -220 84 -67 165 91 147 56 -89
3013 -89 54 -87 19 151 -146 26 98 1 -267 122 58 164 -45 -30 31 -52 37 178 29 -86 14 -50 189
3036 189 88 212 168 -174 -55 -161 -14 -280 -2 -188 -11 -109 -140 127 62 -50 10 -159 -158 85 -55 71
3058 71 67 144 -85 88 -102 -189 20 28 -117 263 -181 107 -169 200 77 -212 -90 174 163 -124 58 136 28
3081 28 -66 128 107 188 80 -150 -108 135 10 7 -165 -137 139 -171 -330 -199 -95 138 -65 -75 150 -82 -129
$$ packed form
2924b13O17l02n38J49M59m25K02J8o7j22O7J31J81j84j12K41k79J61q7J49Mj66
2946a16R8J11k4j16K14M53p83L94k46m3K55k35K95m67K59j43K08r7J52l52K01
2967A8J84k95L08q1l04r7K36j87L40j03J26j71L7J66m02L96l22K08l64J33K24
2988E0m6p6r5L47j0r0J3m8k21K35M6Ok58J51j68J42K8k26L04j51K32p4N6r1j45
3013h9J43j41J06J32k97J72P2r7k68L89o4J06k09J5O1q3Q9J41j49j15J00o4K39
3036A89j01J24m4l42J19j06J47k66K78j86J77r8l1K67o5j12O0j69JK43j40J26
3058G1mP7k29J73j90q7K09Qj45L80m44K88k76L69j23k89J22K64j1k87J82P8j08
3081B8r4J94k1Q1j08k30M2K43j25lj72K8K76l10j59J31J04K33k03j0K25k32m7
$$ plain form
3104 -129 -416 179 77 -295 -303 105 174 111 227 153 -36 -32 -114 -171 -210 -99 -215 -271 -215 -29 87 248 -94 -44
3128 -44 -22 67 54 -150 -254 30 59 48 9 43 -61 -141 -90 118 20 167 235 -127 132 -77 248 -195 -25 15
3152 15 -46 36 -240 73 49 40 50 -61 -328 -260 37 5 134 73 -125 70 -81 -7 88 -69 -74 47 -178 -72 -22
3177 -22 -65 -16 -49 26 -91 -74 84 0 158 -122 35 483 -10 39 -50 -80 25 -108 -234 -42 -172 197 84
3200 84 -174 -103 -160 87 406 -50 -47 287 -3 74 53 -7 20 26 -339 -109 85 -33 -194 -132 2 -92 -15 -33 -80
3225 -80 -97 -61 255 -12 9 116 -100 -67 131 63 115 -29 -202 181 -165 138 111 -84 5 -95 65 -33 80
3248 80 172 -12 -258 -352 14 26 287 228 -73 -383 349 146 32 92 -57 2 128 12 91 -291 -16 81 46
3271 46 3 -51 -71 -10 21 362 -72 7 113 86 51 215 -152 33 28 -33 135 182 -96 54 -22 56 203 86 146
$$ packed form
3104a29k87N95j02l72qM08O9o3J16p4j89Mq2n7l9J11j16n6N6J86J16J61l42N0
3128d4K2Q9j3k04j04K84K9j1l9L4j04q0N1K08r8J47O8l62K59k09L25m43J70M0
3152A5o1Q2k76L13k4rJ0j11k67O8K97l2J29o1j98J95j51P4R5j57nJ21k25J06N0
3177b2m3M9l3P5j17J7J58q4J58k80J57M48m93M9q9l0J05j33j26J92j30L69j13
3200H4k58P1n7K47L19m56LL34k90P7k1o0K7Ol65K30J94j18j61O2J34r4P7j8m7
3225h0j7L6L16k67K1J07k16L3J98o8N2j44j73L83l46L03k7j95Q9j00J60r8J13
3248H0R2j84k46r4L66J2K61n9l01l10P32k03j14O0j49N9J26j16P9l82K75R7l5
3271D6m3n4k0O1L1L41m34P9J06k7l5J64l67J85no1J68M7k78J50p6P8J47j17O0
$$ plain form
3296 146 -69 -136 -129 -70 -45 45 73 -78 102 274 80 -10 72 -71 -123 -16 252 26 245 62 -145 158 105 69
3320 69 151 -28 44 -50 -47 -46 -231 66 -197 234 -195 -168 187 240 115 88 -71 -89 136 19 -122 65 -144 96
3344 96 -120 278 82 -18 -114 -38 -2 -173 127 20 17 114 341 -123 -65 145 283 5 202 -18 -107 62 -73
3367 -73 23 152 130 6 -129 -16 230 55 265 12 31 -6 -265 -63 93 -35 161 193 36 59 -51 81
3389 81 7 -125 -63 -6 166 5 22 52 -181 -92 115 -34 68 -253 -60 -76 42 -87 -130 -157 58 63 -116 -151
3413 -151 61 -114 150 29 -94 -31 -91 211 -156 20 187 -27 80 122 -11 -110 40 -35 85 166 114 75 -132
3436 -132 78 257 17 -123 -52 -237 63 -332 -103 19 18 167 82 -64 145 49 -83 -52 279 116 112 117 76 303
3460 303 -60 -82 34 158 -193 -14 -79 -383 147 -120 -213 109 22 68 45 31 114 -348 -99 -107 -17 94 76 -140
$$ packed form
3296A46k15o7PN9K5R0K8j51J80J72j94r0Q2j43n2J07K68k26K19j83k07L03n3l6
3320F9Q2j79P2r4LJj85K97k63M31m29K7L55N3j25k7j59j8K25j17j41J87k09K40
3344I6k16L98j96j00r6P6L6j71L00j07lR7K27m64N8K10J38k78J97k20q9J69j35
3367g3R6J29k2j24j35J13K46j75K10k53J9l7k59K02J56j28J96L2j57K3j10J32
3389H1p4j32O2N7J72j61J7L0k33Q9K07j49J02l21J93j6J18j29m3k7K15Nj79l5
3413a51K12j75K64j21j23O3o0L02l67J76J67k14J07M2j33r9J50p5J20Q1n2l9k07
3436a32K10J79k40j40P1j85L00l95K29J22jJ49q5j46K09r6j32L1L31j63mNm1K27
3460C03l63k2J16J24l51J79o5l04N30k67r3L22q7M6k3j4Q3m62K49qR0J11j8k16
$$ plain form
3484 -140 156 89 -86 -199 8 -57 109 51 -102 117 -122 106 13 17 -76 -1 108 8 215 -103 -135 196 159
3507 159 -22 -23 18 150 307 -136 -20 -101 -224 394 75 -211 28 -24 -259 -63 -117 192 -234 19 18 -258 -109
3530 -109 -265 268 181 -40 372 76 97 -275 -74 -161 19 -103 353 -1 -144 34 -33 41 -117 349 261 89
3552 89 -33 -245 -5 -6 -25 83 -117 143 -25 -323 103 -2 -93 -4 236 -7 8 176 112 52 113 134 -111 -150
3576 -150 25 -221 39 224 70 24 -16 59 -101 -180 113 158 -64 57 67 132 38 -96 51 271 5 146 34
3599 34 91 -145 -58 -26 -24 -121 239 48 51 14 -241 -127 -48 148 -72 128 6 272 -34 -15 -119 -87 -46 126 46
3624 46 -82 -78 173 60 106 95 -9 -74 -50 187 -227 139 -79 171 -223 -76 -88 -23 -53 -51 -91 -66 238 154 189
3649 189 -108 -36 -89 -129 132 -90 -90 179 -34 -11 -180 -346 -42 83 76 -206 -397 -147 -85 -88 103 50 -65 -38
$$ packed form
3484a40K96o7j75j13K07o5J66n8j53K19k39K28r3Mr3P5J09j00K07l18l2L31l7
3507A59j81jM1J32J57m43J16q1j23O18l19k86K39n2k35J96n4L09m26K53jk76J49
3530a09j56N33q7k21M12k96K1l72K01q7J80j22M56l54j43J78o7P4j58M66q8j72
3552H9j22k12K40jj9J08k00K60j68k98M26j05r1Q9K40k43J5J68o4o0O1K1k45l9
3576a50J75k46K60J85j54m6m0P5j60p9K93M5k22J21J0O5r4j34J47K20k66J41j12
3599C4N7k36Q7L2Kr7L60j91Ll7k55J14P9J96k20K00j22K66l06J9j04L2M1J72q0
3624D6j28MK51j13M6j1j04o5K4K37m14L66k18K50l94J47j2O5l0Km0K5L04q4L5
3649A89k97P2n3m0K61k22%K69k13K3j69j66L04J25pk82j91K50O2lJ91n3j15K7
$$ plain form
3673 -38 53 24 -94 -163 206 73 -404 -3 194 0 161 51 -88 298 -39 96 -15 -144 1 154 -110
3694 -110 -47 35 -156 228 -146 -43 -177 -185 -169 -7 -127 50 -152 12 95 180 -69 -263 66 -225 -6 284
3716 284 106 -60 79 -42 107 -14 128 87 -221 47 -82 16 -152 75 248 11 20 149 -54 136 12
3737 12 47 50 288 -155 53 61 186 -177 -125 -29 45 85 -299 -25 28 -22 -242 90 268 -225 -66 -60 -117 -105 -42 -172
3763 -172 26 -46 -95 24 -103 -172 274 -20 -282 40 -365 42 65 -111 -34 -144 170 163 -104 -207 -257 39 2
3786 2 85 -229 -50 -10 43 -270 -318 52 30 224 -384 240 -237 -57 -64 -87 68 -47 -9 115 119 -75 -40 49 192
3811 192 -8 -173 -113 390 99 -142 -15 186 89 138 32 55 33 -214 -24 228 -37 204 -119 140 57 -131
3833 -131 79 205 340 60 248 -4 0 190 -115 -27 244 35 -41 -19 139 215 201 246 103 2 113 -204 -102
$$ packed form
3673c8R1k9j18o9L69j33m77M01J97j94J61j10j39L86l37J35j11j29J45J53k64
3694a10O3Q2j91L84l74J03j34qJ6J62j20J77k02J64Q3Q5k49j94L29k91K19K90
3716B84j78j66J39j21J49j21J42m1l08K68j29R8j68K27J73k37RJ29k03J90j24
3737A2L5LK38m43K08QJ25l63N2R6P4M0l84K74N3n0k20L32J78m93J59On7J2O3j30
3763a72J98p2m9J19j27o9M46k94k62L22m05M07K3j76P7j10L14pk67j03n0K96l7
3786BQ3l14J79M0N3l13m8L70k2J94o08O24m77J80pk3J55j15L8J24Mj94L5Q9J43
3811A92k00j65O0N03k91k41J27K01r7M9j06K3k2k47J90K52k65K41l23K59q3j88
3833a31K10J26J35k80J88k52MJ90l05Q8K71k09p6K2J58P6j4M5j43j01J11l17J02
$$ plain form
3856 -102 -142 -134 -252 49 -65 -76 30 -92 149 171 199 188 80 356 -17 -132 38 -343 136 -70 120 82 2
3879 2 -35 -19 -82 193 13 35 128 -273 -49 -83 167 -12 -172 -187 92 161 88 50 -45 -27 -211 -261 125 134 17 -10
3905 -10 -286 62 -284 -61 11 138 28 -230 62 -216 -131 209 -43 95 147 -17 -241 159 31 202 -242
3926 -242 191 -286 133 127 -84 4 -33 171 143 224 -292 -130 -80 113 -133 262 -40 101 -103 11 -40 71 -98
3949 -98 -180 35 118 -132 -28 -71 37 -38 113 -6 -168 240 58 26 81 41 186 149 -65 172 237 111 -190
3972 -190 19 -108 -88 -103 -279 -442 66 2 -192 117 122 -148 -310 -241 -273 164 233 -176 -215 -52 287 85 237
3995 237 151 -163 243 116 128 -222 36 -254 -95 137 166 -210 105 -148 212 109 15 -153 -46 11 -91 -163
4017 -163 -96 65 4 -27 -166 -49 95 -212 -84 -141 -163 175 130 -61 302 99 -121 78 -99 -89 -77 -234 75
$$ packed form
3856a02m0Qj18L01j14j1J06j22K41K2K8j1j08K76l73j15J70l81M79k06J90l8q0
3879Bl7J6o3K75j80K2R3m01K24l4K50j79j60j5K79O9p3l8r5J8j84n0L86Rj17k7
3905a0k76L48l46K23P2J27j10k58K92k78Q5L40k52J38N2j64k24M00j28J71m44
3926b42M33m77M19ok11Q8l7K04k8Q1n16J62N0J93k46L95l02J41k04J14n1J11j69
3949i8q2K15Q3k50J04m3J08p5J51j19j62M08j82l2N5m0J45l7k14K37O5j26l01
3972a90K09j27K0j5j76j63N08o4j94L09Nk70j62O9l2M37O9m09l9J63L39k02J52
3995B37q6l14M06j27J2l50K58k90J59K32K9l76L15k53L60j03r4j68J07N7j02p2
4017a63O7J61o1l1j39J17J44l07J28n7k2L38m5j91L63k03k20J99j77J0J2j57L09
$$ plain form
4040 75 -100 -105 85 -20 -300 197 223 110 65 -298 -115 93 -68 167 -18 -3 139 236 -13 32 216 369 -47
4063 -47 -131 -61 142 -25 127 85 41 16 177 55 -144 117 -152 63 22 47 110 -48 -124 48 40 37 -292 -228 -83
4088 -83 174 -48 -149 -108 -130 29 14 114 347 58 -87 -203 -86 88 52 82 -23 29 -25 178 20 -17 61
4111 61 -16 -137 0 -11 64 410 -67 -153 225 45 -94 298 73 47 90 102 82 90 -7 41 222 28 60 261 -284
4136 -284 84 -20 -28 -74 -481 191 -185 -166 63 166 20 85 -45 -273 194 -184 10 -47 -99 222 398 -223
4158 -223 -193 -168 -207 -205 -70 -77 338 93 -7 -120 154 -63 130 -53 -46 -226 -146 54 -190 -185 1 23 133 185 36
4183 36 45 -32 388 88 -78 117 -111 190 -119 241 25 -138 -51 -185 239 39 24 -64 144 -320 151 -74
4205 -74 -116 142 -32 85 -224 -53 -119 -187 29 80 113 54 75 212 -101 69 -18 110 -28 -155 -168 196 -11
$$ packed form
4040G5j75nJ90j05k80M97K6j13m5l63J83K08j61K35j85J5J42R7k49M5J84J53m16
4063d7q4P0K03j67J52m2m4k5J61j22j99K61k69K15m1K5O3j58p6J72qll29O4J45
4088h3K57k22j01M1k2J59j5J00K33k89j45j16J17J74l6L0j05N2n4K03j58l7P8
4111F1p7j21J37j1P5L46m77q6L78j80j39L92k25k6M3J2k0Qr7M8J81j94L2K01n45
4136b84L68j04qm6m07O72l76J9K29J03j46O5j30k28M67l78J94n7n2L21J76o21
4158b23L0K5l9KJ35pM15k45j00j13K74k17J93j83Pj80Q0K00k44NJ86K2J10N2j49
4183C6Rp7M20l00j66J95k28L01l09L60k16j63Q7j34M24k00j5q8K08m64M71k25
4205g4m2K58j74J17l09J71o6o8K16N1L3n9K1J37l13J70q7J28j38j27j3L64k07
$$ plain form
4228 -11 209 236 -8 -169 79 197 198 65 289 -292 -32 -116 185 -76 113 28 -40 -140 -34 301 -56 -163
4250 -163 15 -9 -58 173 -113 146 34 -242 -22 143 -69 148 -243 34 127 136 -158 -100 -81 -233 -181 135 -144
4273 -144 -33 106 -169 315 -43 47 -27 124 -18 -64 -179 47 14 -277 158 -62 -126 -8 -141 95 30 122
4295 122 41 -79 -73 -120 -373 -250 -147 113 80 -94 -251 129 -177 2 -248 226 270 -54 23 221 51 165
4317 165 -273 239 62 80 167 -62 223 -2 -100 -66 155 142 -70 -123 249 15 76 80 -131 -49 81 -176 -188 -41
4341 -41 -12 104 -37 -41 22 45 131 254 347 11 -87 -85 -158 1 -198 0 -105 -92 44 113 -174 -164 -103 -200 91 66
4367 66 -222 -278 -184 -3 38 -48 46 95 18 135 -142 40 13 -136 -158 -116 -169 149 17 -33 165 160 -163 -34 -196
4392 -196 222 50 -7 101 -49 59 23 43 -45 -3 -186 105 -136 -92 -103 -157 -45 61 206 96 -211 101 112
$$ packed form
4228a1K20K7k44j61K48J18Jj33K24n81K60q4L01k61J89q5o8j00J06L35l57j07
4250a63J78k4m9K31k86K59j12k76K20J65k12K17l91K77R3Rk94N8J9j52N2L16k79
4273a44J11J39k75M84l58R0p4J51j42m6j15K26l3k91M35k20o4J18j33K36o5R2
4295A22q1j20Om7k53J23J03K60l3j74j57L80l06J79k50M74M4l24P7J98j70J14
4317A65m38N12j77J8Q7k29K85k25r8L4K21j3k12n3L72k34O1Mk11Q2J30k57j2J47
4341d1K9J16j41mO3K3Q6J23R3l36r8Kp3J59j99J98j05J3J36O9k87J0O1r7K91k5
4367F6k88n6R4J81M1q6R4M9p7J17k77J82k7j49k2M2n3L18j32n0J98nl23J29j62
4392a96M18j72n7J08j50J08l6K0q8M2j83K91k41M4j1n4J12J06J45j10l07L12J1
$$ plain form
4415 112 -22 -196 -74 -124 -63 -91 123 -162 -47 179 -182 -109 -234 15 11 40 125 4 37 -2 33 -44 21 -164
4439 -164 -20 -24 144 -100 12 -40 -184 241 -60 -81 -139 433 17 -75 108 -393 72 145 -135 -63 203 -51 -17
4462 -17 -59 -48 -52 -109 -202 -213 -5 -238 -71 111 89 -9 49 187 -114 68 -21 133 23 279 -31 -218 148 -176
4486 -176 -57 111 -3 27 278 127 -103 341 -11 -61 63 88 9 138 108 36 -3 70 -229 -50 79 98 -70
4509 -70 362 86 -7 188 0 45 -1 63 -153 -192 -18 -133 -65 -35 -58 44 -70 -165 223 -123 44 130 -471 -82
4533 -82 -57 -61 73 56 198 -49 -63 -104 -385 347 -68 154 30 -254 40 -136 156 -56 -76 14 -59 -87 61 -5
4557 -5 -55 -48 84 138 147 -210 -161 -121 62 -68 166 -35 -252 14 316 200 -159 366 17 -37 -17 40 269 -131
4581 -131 306 -110 -109 -149 12 -49 -151 10 -218 19 -26 -43 96 -70 242 165 84 -202 -27 11 -176 64 -211
$$ packed form
4415A12j34j74J22n0O1k8K14k85J15K26l61P3j25K49mK9Q5j21L3l9L5p7O5j85
4439a64J44mJ68k44J12n2j44M25l01k1n8N72m16r2J83n01M65P3k80P2K66k54L4
4462a7m2J1mn7r3j1K08k33J67J82k2r8N8J38l01J82q9J54j10K56l10j87L66l24
4486a76J19J68j14L0K51j51k30M44l52n0J24K5p9J29l0p2l9P3k99J79J29J9j68
4509g0M32k76r3J95j88M5m6O4k16l9J74j15O8L0k3J02j14r5L88l46J67Q6o01L89
4533h2K5mJ34j7J42k47j4m1k81P32m15K22j24k84K94j76K92k12k0R0p3k8J48o6
4557en0PJ32N4Rl57M9M0J83j30K34k01k17K66L02j16l59N25l49n4K0N7K29m00
4581a31M37m16Jm0J61o1j02J61k28K37m5j7J39j66L12p7q1k86J75L8j87K40k75
$$ plain form
4604 -211 -119 -155 -303 47 310 -144 132 75 -44 103 -199 117 -30 51 -234 -211 41 213 70 -83 -51 315
4626 315 -29 -108 84 -147 -362 345 -114 -356 69 -13 296 183 -111 -34 -92 -68 -265 142 -231 183 -101 -11
4648 -11 -167 186 36 78 -122 -185 162 -65 90 -127 -18 -5 -165 -81 102 108 -78 2 80 100 231 52 -76
4671 -76 -67 -11 -42 -61 65 -7 133 -36 51 -47 191 90 -58 -53 -66 -35 -254 -67 3 -76 -85 -191 181 96 -47 -8
4697 -8 15 -5 47 194 -65 -93 -16 74 184 -96 -18 -258 75 273 -91 -97 -133 45 -188 129 -203 86 140 -17
4721 -17 -5 107 -30 -75 26 94 -72 -101 -21 -29 -173 -152 -183 40 64 38 -177 -143 -163 31 -32 -79 -229 -86 -112 110
4747 110 -34 31 198 199 62 -285 1 4 80 -331 -124 66 132 -217 -88 240 144 -210 -130 -62 168 -33 24 -3
4771 -3 -144 171 -197 88 -46 236 -30 127 -122 -175 -95 59 -10 292 -80 25 147 -49 -29 -316 50 -228
$$ packed form
4604b11R2l6j48L50K63m54K76n7j19J47l02L16j47Q1k85K3K52J72j43j53L2L66
4626C15l44p9J92k31k15P07m59k42M25q2L09j13k94P7n8K4j97M07l73M14k84R0
4648a1j56L53j50M2k00o3L47k27J55k17J09J3j60Q4J83Oj86Q0P8K0J31j79j28
4671g6RN6l1j9J26p2J40j69Q7r8K38j01j48Nj3L1k19J87P0p9rj06L72q5j43L9
4697hK3k0N2J47k59k8P7R0J10k80P8k40L33J98l64ol6J78k33L17l32K89N4j57
4721a7J2J12j37m5J01O8j66k9Q0qj44K1l1K23K4k6k15L4k0J94o3m7j50J43k6K22
4747A10j44O5J67Jj37l47K86LP6m11K07J90O6l49J29L28r6l54Q0O8K30k01N7k7
4771cj41L15l68K85j34K82k66J57k49n3Q0J54o9L02l72J05J22j96K0k87L66k78
$$ plain form
4793 -228 17 -102 -233 -69 52 -182 306 92 -115 -230 -11 -208 -52 287 308 -228 18 -73 -89 -166 158
4814 158 16 82 81 114 75 -160 15 0 151 -75 -231 41 -50 137 122 4 376 -364 126 54 234 2 -36
4837 -36 -37 164 -155 -201 -17 56 -5 -209 -165 88 244 30 128 -5 36 85 11 277 -173 87 71 -70 271 -74
4861 -74 106 -35 -213 33 -158 82 31 77 32 46 135 -231 220 -193 -162 -23 30 194 73 10 92 118 96 195
4885 195 64 -236 -102 207 -151 24 51 -255 -55 -79 50 -8 105 -71 79 101 -123 -35 -85 105 -13 -150
4907 -150 -115 -28 37 256 -69 9 320 76 -11 144 193 102 -167 140 -81 -92 -138 102 64 -27 -195 -25 -118 -134
4931 -134 -52 18 73 255 -124 52 44 -14 -447 64 -244 -69 72 152 161 40 59 -173 -6 -64 -58 -164 21 -133
4955 -133 -125 59 27 -33 -159 -126 3 -12 -282 33 248 -134 278 39 80 136 74 -247 391 99 25 368 -80
$$ packed form
4793b28K45j19j31J64J21k34M88k14k07j15K19j97J56L39K1n36K46r1j6p7L24
4814A58j42O6jL3l9k35J75j5J51k26j56K72r1J87j5j18L72p40M90p2J80k32l8
4837c6jK01l19m6J84P3o1k04M4K53J56k14R8j33M1M9p4K66m50K60j6j41L41l45
4861g4J80j41j78K46j91K40n1M6m5J4Q9l66M51m13L1J39N3J64j21o3Q2K6k2R9
4885A95j31l00J34L09l58J75K7l06K00k4J29n8J13j76J50K2k24Q8n0J90j18j37
4907a50L5Q7O5K19l25P8L11k44q7J55M9r1k69L07k21j1m6K40l8r1j68J70r3j6
4931a34Q2P0N5J82l79J76qn8m33N11l08J75J41Q0Rj21J9k32J67n8Oj06J85j54
4955a33QJ84l2o0j26L3J29j5k70L15K15l82M12k39M1N6o2l21O38k92p4L43m48
$$ plain form
4978 -80 176 -82 477 -17 15 503 -113 185 121 -99 -37 155 -121 -67 -232 58 85 58 -27 23 69 -151 246
5001 246 64 294 -88 34 -35 4 108 65 -75 -16 44 64 -40 34 38 234 19 -37 80 21 201 -219 39 13
5025 13 -88 110 -6 -178 11 80 184 167 -156 153 14 130 -379 -36 -354 -51 -109 60 -190 -10 7 9
5047 9 -49 78 -79 -179 -159 -161 52 -7 151 134 351 -133 77 -5 -214 -15 -88 -117 -236 -14 -71 280 99 -63
5071 -63 28 123 36 -372 -56 141 -137 -43 -61 8 86 -35 -31 103 -7 9 148 -100 -9 76 -79 96 5 23 -149
5096 -149 -7 193 -60 117 121 7 -14 -114 36 -300 76 142 -103 -66 320 22 -44 -128 -14 -95 -89 200 28
5119 28 -81 -12 -91 -14 -237 123 -121 -151 4 255 257 -85 171 -28 137 52 23 -211 188 -310 12 -113 177
5142 177 -140 -26 211 -71 -57 -92 -153 176 -39 175 60 -65 -162 -179 -41 -87 -24 -163 103 -163 -75 -209 -169
$$ packed form
4978h0K56k58N59m94L2M88o16K98o4k20O2J92k76N4j65K90K7k7q5N0M6k20L97
5001B46j82K30l82J22o9L9J04m3j40N9O0K0j04P4MJ96k15n6J17n9J80m20K58k6
5025A3j01J98j16j72J89O9J04j7l23L09j39J16n09L43l18L03n8J69k50J80J7K
5047In8J27j57j00K0kK13n9J58j7K17m84K10q2k09J99p3k9j19K22n7L51j81j62
5071f3R1R5q7m08L16J97k78R4j8O9P8j21MJ34j10J6J39k48R1Q5j55J75r1J8j72
5096a49J42K00k53J77Mj14k1j00J50l36L76O6k45L7L86k98o6q4J14q1OK89j72
5119B8j09O9p9P7k23L60k44l0J55K51Kl42K56j99J65q5k9k34L99m98L22j25K90
5142A77l17J14K37k82J4l5o1L29k15K14j15j25r7j7J38m6O3j39K66k66Q8j34M0
$$ plain form
5165 -169 43 155 44 -138 246 -105 102 29 141 69 55 27 38 81 99 -58 -161 -93 134 170 -331 37 54
5188 54 75 -70 91 133 -60 -190 158 74 -62 -19 73 127 113 173 84 45 7 -46 8 -132 -31 -5 15 -13 55 -89
5214 -89 148 -356 -31 71 -153 -108 287 -41 166 50 -244 -28 -225 -51 -149 -184 -105 -1 60 215 27 -9
5236 -9 -133 -96 60 55 299 21 46 1 -17 -273 -70 -78 249 -24 55 342 -291 -285 -49 -208 -11 146 -63 73
5260 73 166 -103 -136 -26 -231 -168 -88 -157 83 99 -8 -106 41 101 -81 45 39 -117 101 48 -128 324 156 -42
5284 -42 -246 305 247 -103 171 114 87 -35 -135 134 93 -330 -275 152 132 -64 6 -333 241 -170 36 -315 -284
5307 -284 32 -42 77 32 6 4 -65 98 -45 -313 142 189 -47 -221 -226 15 69 61 257 75 -180 -152 301 -8
5331 -8 64 -63 -73 -32 -318 11 -135 23 38 -8 132 9 35 -362 -113 100 380 -66 122 -385 -34 -187 33
$$ packed form
5165a69K12J12j11j82L84l51K07p3J12p2j4k8J1M3J8j57j03O8K27L6n01L68J7
5188E4K1j45J61M2j93j30L48q4j36M3R2N4j4O0q9l9l8n3N4j40J01K6K0k8O8j44
5214h9K37n04L25J02k24M5L95l28K07j16k94K16j97J74r8l5P9J04O1J55j88l6
5236ij24L7J56nK44k78K5m5j8k56K03qL27k73P9K87o33OK36j59J97J57k09J36
5260G3R3k69l3J10k05O3Q0o9K40J6j07r8J47O0j82J26oj56K18n3j76M52j68j98
5284d2k04N51n8l50K74n7k7j22j00K69m1m23N5M27k0j96P0l39N74m11K06l51L1
5307b84L16p4J19m5k6ko9J63j43k68M55M7k36j74nK41N4qJ96j82k55K8M53l09
5331hP2j27j0M1k86L29j46J58J5m6J40j23K6l97K49K13K80m46J88n07L51j53K20
$$ plain form
5354 33 96 -252 -4 -69 -48 -130 147 39 -203 240 -325 -190 -94 69 -140 168 258 137 276 -122 -118 130 74
5377 74 307 133 398 -13 -21 167 -58 -182 -210 58 -72 -109 75 87 173 -13 87 156 -133 -367 -9 -5 -100 122
5401 122 -215 270 -20 55 37 -25 -216 309 21 46 -12 13 -124 -48 137 15 -17 119 30 -114 -118 -47 167 -27
5425 -27 -108 32 -97 -61 148 -80 123 305 -171 -124 25 137 -59 -46 15 105 -82 33 -170 -170 177 193 146 154
5449 154 -22 -106 76 -191 88 -80 16 122 -13 -15 68 -25 24 -51 11 -119 203 -83 -93 166 -166 -33 79
5472 79 -244 128 199 7 0 -291 94 165 -509 -94 269 129 -44 -9 181 17 -8 61 -50 -73 -80 -140 5 -166
5496 -166 -108 301 -183 -63 -86 16 51 53 -2 -49 -27 99 142 -7 -50 -59 330 235 -137 -15 168 -118 -441 104
5520 104 -63 -179 -46 47 4 -156 -104 115 32 285 97 38 -50 -213 -101 46 -4 72 54 -106 -59 103 143 -290
$$ packed form
5354C3O3l48K48o5K1q2K77j08k42M43n65J35R6J63k09L08R0j21J39l98MK48n6
5377G4K33j74K65m11qJ88k25j24k8K68j30l7J84J2Q6j86J00O9k89k34L58Mr5K22
5401A22l37M85k90P5j8o2j91N25k88K5n8K5j37P6J85j22l2J36q9j44mP1K14j94
5425b7q1J40j29L6K09k28K03J82m76M7J49J12j96J3O1R0j87J15k03%L47J6m7Q
5449A54j76q4J82k67K79j68R6J06j35kQ3r3M9p5O2j30L22k86j0K59l32J33J12
5472G9l23L72P1j92pk91L85P1o74M15L63j40j73L5J90j64k5O9j11k3po0J45j71
5496a66N8M09m84J20k3J02L5Kn5m7K2J26M3j49m3rL89r5l72J22J83k86l23N45
5520A04j67j16J33R3m3j60N2K19q3K53j88n9q8j63J12J47n0P6j8j60M7J62M0m33
$$ plain form
5544 -290 71 51 -32 157 59 249 70 133 98 -5 219 -218 54 -25 -184 128 -133 -191 27 30 100 85 -56 44
5568 44 82 -229 -60 -62 202 -267 -111 210 274 64 -69 -28 -5 107 -356 56 -75 -140 -31 -21 -70 -97 -67 285
5592 285 100 -185 250 209 -5 120 25 15 -66 -11 -207 26 15 145 -100 133 -135 -118 -140 -105 -185 2 -79 -76
5616 -76 135 -167 -23 -99 89 16 102 74 -125 2 138 -173 73 -18 -77 -139 -2 26 179 -10 -94 -45 -115 192
5640 192 -114 128 -105 233 -201 -84 -99 -10 54 46 -282 277 22 156 82 52 -74 -279 165 -67 185 -153
5662 -153 -250 91 -79 -134 -103 -206 150 1 164 -173 242 221 242 60 -97 60 111 -98 -60 -207 4 237
5684 237 -86 190 92 -407 -55 -55 -100 -131 250 -21 68 -95 -41 -2 124 59 -33 25 -101 86 -100 132 -63 -175
5708 -175 38 -5 113 -40 78 -85 -123 152 -28 141 -11 -51 127 79 -16 474 -85 95 158 -67 -16 -54 26
$$ packed form
5544b90L61k0q3J89r8J90j79O3l5j03K24m37K72p9j59L12k61n8K18LP0j5j41J00
5568D4L8l11J69kK64m69J56L21O4k10j33M1K3J12m63M12j31o5J09J0m9k7L0L52
5592B85j85k85M35m1k14J25r5j0q1N5j96K33j1J30k45K33k68J7k2L5q0J87q1L
5616g6K11l02J44p6J88p3Q6k8j99J27J36l11K46r1n9o2J37K8J53j89q4M9p0L07
5640A92l06K42k33L38m34J17j5Q9O4ql28N59k55J34p4l0j26k05M44k32K52l38
5662a53r7L41j70n5L1j03L56j49J63l37M15k1K1j82j57J57N1k09L8j47K11K33
5684B37l23K76r8m99L52%m5l1L81k71Q9j63N4L9J26o5r2N8j26J87j86K32j95j12
5708a75K13m3J18j53J18j63l8K75j80J69j52m0J78m8r5M90n59J80O3k25N1l8Q0
$$ plain form
5731 26 -47 68 159 -62 -19 -56 -80 -32 384 -57 102 14 -32 45 -70 37 -125 -217 -34 -138 16 185 59 260
5755 260 -71 303 -90 59 -243 54 10 -144 148 -136 -60 -90 -181 -223 -69 -5 165 -87 151 -69 83 51
5777 51 142 -37 8 129 218 35 125 43 72 226 330 172 42 -176 -77 -19 -16 -74 7 -131 -272 -20 -91 124 12
5802 12 -235 -249 99 80 -171 -59 -141 -112 9 110 -166 -345 282 272 -127 -75 -242 -17 -54 -122 -36 -203 98
5825 98 -92 -89 36 157 241 2 -151 59 53 -98 122 -167 -5 -73 407 77 62 -115 -103 175 -9 88 111 -37
5849 -37 -108 -215 149 -82 -22 -10 161 139 -139 -11 33 -2 -6 82 -85 91 -53 -200 -57 -167 90 178 -404 -184
5873 -184 -217 -122 5 -108 35 -331 -100 -39 345 6 -15 138 -44 12 16 83 -2 95 76 -129 -112 -8 218 20
5897 20 292 82 -29 -207 71 -88 -222 -133 133 -91 115 58 26 117 -118 -83 169 82 3 -81 -12 -7 17 210
$$ packed form
5731B6p3J15R1k21M3l7k4M8M16m41J59q8m6P7j15J07j62r2J83j04J54J69j26K01
5755B60l31L74l93J49l02K97m4j54K92k84P6l0r1m2J54O4J70k52K38k20J52l2
5777E1R1j79M5J21Q9j83R0q2K9J54J04j58j30k18R9N8Ln8Q1j38j41K52p1K15j12
5802A2k47j4L48j9k51J12q2K9J21J01k76j79O27j0l99N2j67K25l7o8Q6j67L01
5825I8j90LJ25J21Q4k39j53K10oj51K20k89J62o8M80l30j5j77J2K78j84R7K3j48
5849c7p1j07L64k31O0J2J71k2k78J28M4l5mQ8j67J76j44j47J43j10K57Q8n82K20
5873a84l3R5J27j13J43l66K31O1L84l39k1J53j82N6MO7q5R7j9k05J7J04K26j98
5897B0K72k10j11j78K78j59j34Q9K66k24K06n7l2R1k35L5K52q7p9q4O9NK4J93
$$ plain form
5921 210 242 -207 117 51 47 86 -63 -224 13 -56 -168 174 171 138 -11 -259 -142 -199 181 -150 -133 -59 133 -239
5945 -239 -102 -82 -42 89 -49 18 -152 -268 110 221 -23 134 282 409 -174 -112 29 -116 -116 112 -152 250
5967 250 -19 21 -312 -132 -142 236 349 4 -150 -28 147 148 -46 -136 79 3 80 -169 -258 -298 -173 18 -300
5990 -300 -64 -78 -203 -140 127 -26 147 -88 -183 48 213 78 79 -167 259 37 31 9 85 243 -216 -157 -112 -17
6014 -17 2 155 19 -99 -26 48 -127 113 109 -36 49 -26 174 -139 -92 -88 -214 -4 -33 -51 156 207 -62 13 -57
6039 -57 97 91 80 -96 68 -118 129 -21 -10 -7 123 80 235 -19 152 6 93 203 45 -61 41 152 -66
6062 -66 357 -8 -68 -2 105 35 -109 -60 -206 267 -137 -66 29 -177 -169 177 -99 -80 218 -93 22 -89 -47 89
6086 89 119 -19 55 93 -135 -138 -9 60 10 -32 -42 -13 194 -132 -29 175 -70 87 170 133 103 -1 12 24 -17 91
$$ packed form
5921B10L2m49L24o6mL9j49j61K37o9j12L42ll3j49k48J17n7L80l31J7P4J92l72
5945b39J37K0M0J31j38O7j70j16L78J11k44J57J48J27n83O2J41j45%K28k64M02
5967B50k69M0l33J80j0L78J13l45j54J22J75Jj94r0K15p6P7k49q9m0J25J91l18
5990c00K36j4j25O3K67j53J73k35r5K31J65j35Jk46M26k22ok2P6J58m59N9M5R5
6014a7J9J53j36j18P3P4j75K40mj45Q5p5K00l13M7Mj26K10k9j8K07N1k69P5p0
6039e7J54oj1j76J64j86K47j50J1LJ30m3J55k54J71j46Q7J10j58j06J02J11k18
6062f6M23l65o0O6J07p0j44M9j46M73m04P1R5k06QL46k76J9K98l11J15j11M2J36
6086H9L0j38P4L8k28lJ29O9n0m2j0K9K07l26J03K04k45J57Q3l7l0j04J3J2m1J08
$$ plain form
6112 91 37 186 -32 -48 -33 178 50 -76 -67 45 -242 -46 -117 -107 77 -215 -8 -20 -66 -154 42 85 -54 72
6136 72 142 113 -144 -97 35 185 -2 -99 73 1 151 -84 161 61 65 143 -104 37 -11 -49 -67 -65 -164 7 -23
6161 -23 71 137 -124 12 106 97 -47 137 -94 -157 -115 -178 -119 214 -16 35 -47 54 -193 -243 -165 -80 15 0 -159 -112
6187 -112 -47 38 -264 30 132 -47 -178 98 54 22 -150 75 -29 141 24 -148 -194 124 -175 -417 69 135
6209 135 -170 -96 -59 -133 186 -223 87 69 -132 161 -21 -47 -151 -200 -50 -62 34 83 -40 -22 -80 -152 32 88
6233 88 88 -63 -29 -64 166 264 194 199 101 -66 -44 -66 -152 -58 -165 149 186 -27 17 43 -132 205 1 74 -102 201
6259 201 85 57 -59 -86 54 212 23 -176 -229 141 94 345 -37 -74 151 -33 142 14 -61 255 71 -11
6281 -11 105 -17 273 -99 -112 133 99 -292 -187 -34 262 164 -109 -50 12 -85 105 92 118 -47 290 -145 -67
$$ packed form
6112I1n4J49k18j6J5K11j28j26RJ12k87J96p1J0J84k92K07j2m6q8J96M3j39J26
6136G2P0k9k57M7J32J50j87r7J72p2J50k35K45j00MP8k47J41m8l8j8Kr9J71l0
6161b3R4O6k61J36R4rj44J84k31o3M2o3N9L33k30N1q2J01k47n0P8Q5R5j5j59M7
6187a12O5Q5l02K94J02j79j31K76m4l2j72K25j04J70j17j72m6L18k99k42M86O6
6209A35l05P4L7p4L19m09L10j8k01K93j82k6j04m9J50j2R6M9j23J8n8p2J84N6
6233H8%j51L4l5K30R8p0Nr8j67K2k2q6R4j07L14L7k13M4K6j75L37k04P3j76L03
6259B01j16k8j16k7J40J58j89j99n3L70m7K51l82l7K25j84J75j28p5L16j84q2
6281a1J16j22K90l72j3K45l4l91J05J53K96r8k73N9O2r7J90j3K6j65L37m35P8
$$ plain form
6304 -67 -10 49 -13 12 70 -299 134 -167 -1 187 -2 95 25 39 -220 -17 -28 -23 -69 -142 -29 -130 140 164 -11
6329 -11 -44 -6 100 -6 -103 -110 -300 304 238 -183 -70 -283 148 293 511 -20 -285 -26 -12 129 23 -53 120
6352 120 -35 58 97 120 -33 85 216 156 -216 -40 146 192 64 46 -253 -148 49 -22 144 0 131 -10
6374 -10 5 31 -58 92 97 -85 69 71 119 147 280 -223 -35 -38 -134 -184 150 56 211 -134 -118 265 -77 -362 -315 41
6400 41 -33 -122 -256 185 -8 58 359 -2 -332 -48 26 -59 4 -80 25 241 45 -110 38 -42 107 114 40 17
6424 17 -32 -56 -76 76 27 -84 -29 -40 105 261 303 85 10 155 53 84 125 -170 -17 -13 -133 22 -9 2 51
6449 51 208 -36 23 75 31 159 133 233 26 270 -129 97 484 32 40 -76 -4 -201 -35 67 -54 -107 78
6472 78 -189 -315 -198 167 70 -20 89 -126 -44 217 274 -215 149 17 -269 57 138 -106 -233 -147 -204 112 79
$$ packed form
6304f7N7N9o2K5N8l69M33l01J66J88j89R7p0J4k59K03j1Nm6p3J13j01K70K4j75
6329a1l3L8J06j06r7pj90O04o6m21J13k13M31J45K18n31k65K59J4J41j06p6J73
6352A20j55R3L9K3j53J18J31o0l72J76J86M6j28j8k99J05J97p1J66j44J31j41
6374a0J5K6q9J50Nj82J54KM8K8J33n03J88lr6n0L34r4J55l45J6L83l42k85M7L56
6400D1p4q9j34M41j93O6L01l61l30K84P4q5O3q4J05K16j96j55J48q0J49Pp4k3
6424A7m9k4k0J52m9j11N5j1J45J56M2k18p5J45j02L1M1k95J53Mj20J55l1J1M9
6449E1J57k44N9N2m4J28k6J00k07K44l99K26L87m52Qj16P2j97J66J02j21n3J85
6472G8k67j26J17L65r7r0J09k15Q2K61N7m89L64j32k86L26Q1k44j27Q6n7L16l3
$$ plain form
6495 79 -124 68 -41 194 -107 12 77 -300 96 217 21 27 75 -251 -29 -5 -79 36 -88 66 -19 -154 138
6518 138 2 -183 -223 -53 -220 27 -58 -178 -72 -206 369 -10 12 137 137 -207 -138 -90 57 79 -97 -165 -170 105
6542 105 -114 -116 -14 -8 16 -23 195 135 -190 -47 62 99 -37 -218 -59 27 -123 -62 111 -237 -103 -108 -168 -43
6566 -43 -108 177 20 90 -70 -158 -154 96 -40 -159 33 73 265 158 154 -69 -154 32 -80 -55 -228 -198 -167 286
6590 286 -44 -82 -210 240 24 23 -128 -25 218 61 -245 -29 -312 -142 -7 72 135 -136 -68 -167 -94 -176 -41
6613 -41 -356 89 -1 125 -46 34 -19 -23 -15 -84 -279 27 55 -137 54 216 92 -172 38 -145 71 -133 218
6636 218 -275 -32 65 145 83 101 30 -129 193 169 -92 19 -301 -12 -119 90 -53 -23 42 235 -17 -18 60 -11
6660 -11 -179 17 -176 -167 97 70 237 -98 -33 -134 -92 22 143 188 23 -255 9 237 67 -70 -101 325 -7
$$ packed form
6495G9k03J92j09K35l01J19O5l77L96J21j96OM8l26K22K4p4J15j24J54q5j35K92
6518A38j36j85m0J70j67K47q5j20J06j34N75l79K2J25%l44O9M8J47K2j76o8nK75
6542A05k19kJ02OK4l9K18o0l25J43J09L7j36j81J59Q6j50O1J73l48J34no0J25
6566d3o5K85j57P0j60q8MK50j36j19J92M0J92j07mk23q5J86j12K5j73L0L1M53
6590B86l30l8j28M50k16jj51J03K43j57l06K16k83J70J35P9O3k71O8r9P3q2J35
6613d1l15M45r0J26j71Q0n3mQo9j95L06K8j92J91J62j24k64K10j83K16k04L51
6636B18m93K43R7Q0o2J8p1j59L22k4k61J11l20K89j07K09j43L0O5J93k52jP8p1
6660a1j68J96j93RK64k7J67l35O5j01M2J14J21M5j65k78K64K28j70j37l1M26l32
$$ plain form
6683 -7 -330 172 30 -31 156 74 -247 -38 -104 -172 16 6 -246 -331 -72 159 -285 56 -284 109 -248 -362 -1
6706 -1 124 146 131 -37 52 59 65 -59 64 -187 -264 -264 -132 -232 -409 19 -114 20 163 -151 -209 -186 -64 -83 -79 125
6732 125 55 -193 -53 118 84 29 27 -46 105 198 -153 44 -146 -74 -96 183 -97 -75 69 -224 -63 -52 -135 -9
6756 -9 -50 -129 -182 -131 89 -321 326 -287 285 63 39 179 -230 118 -71 330 107 -33 61 -193 -119 -22 -24 -96
6780 -96 -13 -143 -234 259 102 -220 52 -119 390 -118 42 -10 -62 -71 58 355 111 233 -8 34 47 118 95 157
6804 157 109 43 73 211 16 -127 -89 63 70 56 -84 -13 -47 -193 -118 22 -62 -5 -79 17 -52 110 140 -94 31
6829 31 -22 23 -153 67 15 163 72 -29 330 -135 76 98 -71 -68 95 -75 39 333 -78 -26 36 -125 -234
6852 -234 2 -83 -97 148 108 187 174 -89 49 14 99 -105 329 -29 72 37 -219 -98 -262 108 259 -107 125
$$ packed form
6683gl23N02j42o1J87q2l21K09o6o8J88j0k52q5K59K31m44L41l40L93l57j14L61
6706aJ25K2j5j68Q9POj24J23k51p7%J32j00j77M28j33J34J43l14n8K3J22j9MK04
6732A25p0k48J40J71l4n5kp3J51R3l51J97j90P2k2K79k80K2J44k93J61J1q3J26
6756im1p9n3N1K20m10O47o13N72k22k4J40m09L48j89M01k23j40R4k54P4R7kp2
6780i6Q3j30r1M93j57l22K72j71N09n08J60n2n2rJ29K97k44J22k41M2J3P1k3O2
6804A57m8o6L0J38j95j43L8J52Pj4j40P1l4j46P5J40q4N7p4R6o9J62L0k34J25
6829C1n3M5j76K20n2J48r1j01L59m65K11K2j69LJ63j70J14K94m11N2O2j61j09
6852b34K36q5j4K45m0P9j3k63J38l5Q5k04M34l58J01l5k56J21j64L70J51l66K32
$$ plain form
6875 125 234 -297 123 20 148 22 -81 -324 -77 -100 -2 -36 -126 -137 -9 -105 276 -161 -102 38 -118 -116 180
6898 180 237 -110 189 -185 23 -106 72 15 67 99 173 -145 -4 -115 -21 61 -3 218 86 136 325 226 -135
6921 -135 -186 55 80 215 65 29 150 -30 -43 110 -30 124 -47 -281 96 -58 103 -47 -61 44 -38 -95
6943 -95 108 -123 -207 -91 7 -3 -223 -99 110 -59 -15 198 22 24 329 -101 146 196 -119 -167 78 35 -3 148
6967 148 12 -57 312 354 160 224 32 -186 123 201 -178 -64 279 -266 9 -310 44 -175 3 219 63
6988 63 19 -15 -20 -65 -1 62 77 -49 327 13 -88 -56 104 172 38 -24 14 56 -162 -197 -183 -10 -80 -12 -93 182
7014 182 251 112 -34 40 -109 -92 37 -148 103 155 190 75 -122 47 132 -111 197 -12 -154 -37 150 -143
7036 -143 -196 171 -13 88 49 -23 83 -88 58 -57 64 111 11 -26 38 -108 76 -55 -13 -54 298 313 122
$$ packed form
6875A25J09n31M20j03J28j26j03k43K47k3R8l4r0j1J28r6L81m37N9J40j56KK96
6898A80N7l47K99l74K08j29J78n7N2L2P4l18J41j11R4Q2o4K21j32N0J89r9l61
6921a35n1K41K5J35j50l6J21j80j3J53j40J54j71k34L77j54J61j50j4J05q2n7
6943i5K03k31q4J16R8j0k20J24K09j69M4K13j76KL05m30K47N0l15m8K45m3l8J51
6967A48j36o9L69M2j94O4j92k18L09P8l79J14L43n45K75l19L54k19J78K16j56
6988F3m4l4nm5O4O3J5j26L76l14j01L2J60O8j34o2L8M2k18l5J4J73p0O8q1K75
7014A82O9j39j46P4j49J7J29j85K51N2L5j15j97J69Q5k43L08k09j42J17J87k93
7036a43n3L67j84J01l9p2J06j71J46j15J21M7j00l7O4j46J84j31M2m1L52J5j91
$$ plain form
7059 122 -117 -257 101 100 109 -182 48 -54 112 -38 9 302 -159 -11 84 -53 3 -92 -4 48 -107 -123 -306 -281
7083 -281 76 -122 -81 -119 158 -43 202 -145 27 -41 -109 -83 -62 -28 193 127 -224 -237 143 159 127 -87 -138 59
7107 59 67 128 -298 267 57 -133 76 237 -108 162 -161 125 -220 -143 -117 -69 20 -337 -41 -139 20 15 -36 -23
7131 -23 329 396 322 -160 78 235 19 -254 206 221 126 52 4 279 26 194 -112 133 265 -55 -181 -211 -81
7154 -81 258 -72 5 -112 -4 -219 183 -31 -218 101 -41 7 126 1 -118 23 -90 53 101 -259 -256 -33
7176 -33 -74 347 15 71 -189 136 -23 19 -186 3 48 80 191 173 247 -34 -130 157 349 215 168 -208 -18
7199 -18 -173 146 -31 -7 -2 -129 -339 -20 -103 -5 -158 -79 31 211 43 -186 180 133 -236 51 58 -87 43
7222 43 -145 -49 111 60 -64 -52 215 -85 141 -76 55 -58 194 -105 -59 -42 159 88 -154 189 -148 251
$$ packed form
7059A22k39j40L58jRk91K30j02J66j50M7K93m61J48R5j37N6r5Q8N2j55j6j83K5
7083b81L57j98M1l8K77k01K45l47J72o8o8K6K1L4K21o6l51j3L80J6l2k14n1J97
7107E9QO1m26N65k10j90K09J61l45K70l23K86l45P7K6M8Q9l57K96r8J59nn1J3
7131b3L52O7p4m82K38J57k16k73M60J5r5p4m8K75k53J68l06K45J32l20j26l0J30
7154h1L39l30P7j17J08k15M02k14j87L19j42M8J19j25j19J41j13J43M8l60LK23
7176c3m1M21l32N6k60L25j59M2k05J89M5L2J11j8P4k81r6K87J92j34m7l76J90
7199a8j55L19j77K4Nj27k10L19q3R8j53P9J10J80j68k29L66m7l69K87Pj45J30
7222D3j88R6J60n1j24J2K67l00K26k17J31j13K52k99M6J7K01p1k42L43l37L99
$$ plain form
7244 251 -282 -267 42 42 240 -15 100 -280 196 19 -69 126 100 190 158 -196 39 -82 -40 -33 -16 130 -75 -173
7268 -173 118 -62 193 20 -88 101 146 -149 43 116 -18 77 -231 37 118 -13 166 218 -167 -5 -4 -293
7290 -293 -27 187 -15 -189 37 48 -56 -40 3 -169 -30 70 70 -67 -27 -204 97 102 17 64 68 36 83 -107 -19
7315 -19 -169 -3 -90 102 69 -80 169 198 -214 -243 117 193 -148 -142 4 7 168 -87 202 108 -73 -13 39 165
7339 165 24 -268 -5 180 -332 93 -76 226 208 -58 245 -306 -171 -10 34 -150 -161 -182 -60 173 221 62
7361 62 69 72 21 211 146 42 29 -6 -11 155 342 186 -3 14 238 265 -105 24 -117 -58 -185 -96 21 134 274
7386 274 -98 80 -18 227 -188 10 204 -119 192 8 -121 -108 -30 181 -106 -240 139 -33 149 -77 -297
7407 -297 -41 63 71 -256 -213 -200 229 -62 -113 30 -313 219 -103 11 60 49 124 43 -105 -143 -143 -86 298 45
$$ packed form
7244B51n33J5L09%J98k55J15l80M76j77q8J95k6R0l2l54K35j21M2PJ7J46k05r8
7268a73K91j80K55j73j08J89M5k95J92P3j34R5l08K68Q1j31J79N2l85J62Jk89
7290b93K66K14k02j74K26J1j04J6M3j72J39J00%j37M0j77L01Nq5M7Ml2M7j90Q8
7315a9j50J66q7J92l3j49K49K9m12k9L60P6l41OJ46LJ61k55K89r4j81O0N2J26
7339A65j41k92K63J85n12M25j69L02j8k66L03n51J35J61M4j84j1k1J22K33M8j59
7361F2PLn1J90o5j04j3l5nJ66J87j56j89J7K24K7l70J29j41N9j27Q9J17J13J40
7386B74l72J78r8K45m15J98J94l23L11j84j29J3P8K11k87j34L79j72J82k26k20
7407b97K56J04Ql27M3J3M29k91n1J43l43N32l22J14M9j1P5q1j48l8%N7L84k53
$$ plain form
7431 45 -136 -27 127 43 -341 -60 196 -74 -223 81 15 64 60 252 -135 -147 1 426 12 73 120 123 44 -220
7455 -220 -54 -230 -19 61 213 78 64 -1 53 -36 37 -22 26 221 173 115 -154 -78 -38 -214 45 14 -24 -36 -76
7480 -76 -126 50 -296 -19 -126 -2 -204 -114 50 -287 70 -95 122 -129 57 -33 112 39 -102 -281 -22 210
7502 210 106 -122 74 -70 -102 -86 -75 233 -45 241 33 -216 59 -121 -57 37 229 191 98 -121 -7 55 -52
7525 -52 254 -20 -177 229 5 43 -209 -60 -15 55 -280 82 9 374 -171 -71 -120 -17 327 9 -171 69
7547 69 -25 -120 -31 4 -17 -86 51 13 187 -108 170 36 -264 -253 117 136 98 -216 155 -252 72 -365 -103 91
7571 91 34 -53 27 -70 -233 237 -57 148 -57 -102 110 -35 179 -12 -235 83 39 52 101 -46 -211 -136 -35
7594 -35 -256 -86 -77 195 80 147 -4 -142 -99 139 164 169 208 -86 -244 -78 114 65 42 304 47 106 296 -158
$$ packed form
7431D5j81J09J54q4l84K81K56k70j49L04o6M9mJ92l87j2J48M25m14O1M7Lp9k64
7455b20J66j76K11Q0J52j35j4o5N4q9P3n9M8J95m8n8k69P6M0j76K59l1l8j2m0
7480g6n0J76l46K77j07J24k02R0J64l37L57j65K17k51J86r0J45p3j41j79K59K32
7502B10j04k28J96j44l2J6J1L08k78K86k08k49K75j80O4R4J92l8r3k19J14O2j07
7525e2L06k74j57M06k24L8k52J49M5P0l35L62p3L65n45J00m9J03L44l18j80K40
7547F9r4r5Q9L5k1o9J37l8J74k95K78j34l00J1L70J9l8l14L71m07L24m37K62J94
7571I1n7q7Q0r7j63M70k94K05k05m5K12j45K14j91k23L18m4J3M9j47j65P5J01
7594c5k21J70RK72j15O7j51j38M3K38K5NL9k94j58J66J92m9k3K62k57N9J90m54
$$ plain form
7618 -158 -230 106 64 30 65 -179 -200 -63 131 -230 91 -122 218 -300 16 -22 -342 239 73 -397 -17 -198
7640 -198 8 348 -145 -65 71 57 -119 172 24 163 -216 80 -23 -208 267 -50 116 87 -142 19 -373
7661 -373 -93 41 -45 -73 71 -38 -59 -22 159 91 118 19 -65 11 -186 -253 244 82 50 -180 -179 -235 61 125 -217
7686 -217 -5 -16 96 -167 78 -89 -89 -112 -237 -41 131 269 -109 39 130 -24 -32 -22 23 39 153 -94 -50 -219
7710 -219 88 82 -309 -14 43 86 -4 274 94 -109 325 -172 -143 94 -49 109 -47 124 205 111 -94 193 -15
7733 -15 140 -103 -41 32 166 -73 -98 147 68 -46 -68 -118 24 64 -212 -23 43 27 -91 -124 -265 -221 -113 118
7757 118 148 -208 183 88 -66 98 134 88 -59 -115 67 -154 270 251 82 45 -60 -113 -172 -124 73 -140 -196 284
7781 284 -22 -130 -14 -92 -34 108 -156 232 -31 -37 39 -38 -255 -154 -52 35 -249 83 -257 109 181 65 338
$$ packed form
7618a58p2L36m2l4L5k44k1J37J94l61L21k13L40n18L16l8l20N81j66m70L80j81
7640a98K06L40m93Q0J36j4j76K91j48J39l79K96j03j85M75l17J66k9k29J61l92
7661c73K80J34q6k8J44j09k1L7J81o8K7r9q4P6j97o7M97j62l2k30Jn6K96O4l42
7686b17K12j1J12k63K45j67%k3j25J96J72J38l78J48R1j54qJ0M5J6J14k47M4j69
7710b19L07ol91K95N7M3r0K78j80k03M34m97K9K37j43J58j56J71Q1r4k05K87k08
7733a5J55k43O2P3J34k39k5K45p9j14k2n0J42M0k76J89O6j6j18l3j41M4J08K31
7757A18L0l56L91r5j54J64L6m6j47n6J82k21M24j9j69l7j05n3n9M8J97k13n6M80
7781B84l06j08J16p8N8J42k64L88k63oP6p7k17J01J02Q7k84L32l40L66P2j16K73
$$ plain form
7804 338 21 441 90 -149 111 61 51 -81 213 -59 263 -142 131 145 262 141 179 116 -25 102 -234 132
7826 132 -53 2 375 -158 44 163 -97 87 219 73 -78 -33 -85 119 108 21 130 -48 -53 79 203 160 -110
7849 -110 125 -30 -12 11 -27 74 -49 -148 58 -275 136 79 -255 -148 294 -89 -40 315 -41 327 -180 -162
7871 -162 226 74 113 -85 10 89 -77 -115 73 44 6 116 10 68 -121 95 -288 212 -87 366 42 -151
7893 -151 -162 -92 74 -76 -260 144 446 -41 -113 25 -159 -146 133 144 77 41 101 57 -161 -90 -226 -229 34 150
7917 150 47 285 -289 -304 202 -87 -86 -56 31 -77 -13 147 135 70 -29 209 -200 52 147 70 -72 -28 572 28
7941 28 193 -255 -56 62 -96 51 -247 82 28 127 32 -283 412 35 159 -29 164 65 -31 -247 -131 -40
7963 -40 -146 -16 -338 -122 95 -186 158 -147 -75 215 198 30 -22 16 -72 227 -28 -436 -150 -143 65 406 134
$$ packed form
7804C38l17M20l51k39K60n0j0j32K94k72L22m05K73J4J17j21L8o3j41J27l36L66
7826A32j85N5L73n33K02J19k60J84J32j46j51M5n2K04j1q7J09j78nJ32J24m3k70
7849a10K35j55J8K3l8J01j23r9K06l33M11n7l34J07M42l83M9L55l56L68n07J8
7871a62L88j52L9j98R5P9j66l8J88k9l8J10j06N8j89K16l83N00k99M53l24j93
7893a51j1P0J66j50j84M04L02m87p2J38j84J3K79J1o7l6O0m4k18P1j36lK63J16
7917A50j03K38n74j5N06k89JL0Q7j08O4J60j2o5r9K38m09K52R5p7j42M4O00n44
7941B8J65m48J99J18j58J47k98L29n4R9r5l15O95l77J24j88J93r9r6k16J16R1
7963d0j06J30l22K16K17k81L44l05P2K90j7j68n2L8q8K99k55m08K86PK08L41k72
$$ plain form
7986 134 25 154 52 160 -95 179 156 -92 -86 -82 146 40 -116 -49 20 -127 179 -64 109 74 112 -135 63
8009 63 109 -17 228 129 388 -22 -211 179 37 188 -79 -91 12 74 144 27 76 157 -24 88 -106 71 -257
8032 -257 60 241 132 -140 225 78 273 -10 -68 138 -131 -15 -105 -174 33 52 359 49 155 16 -119
8053 -119 -28 46 -129 -66 83 -14 82 -188 111 256 124 32 157 -31 107 -335 46 -157 40 -52 -119 122 -4
8076 -4 -293 86 -140 -125 -53 318 171 185 -386 22 -201 -72 136 198 37 -39 36 224 35 -291 117 197 -85
8099 -85 -49 179 165 6 -107 -239 -49 -172 -34 156 45 130 -63 199 45 -53 -45 -327 -206 -131 141 -48 -73
8122 -73 257 145 2 2 140 50 251 -84 9 12 44 103 -121 -54 -49 265 285 -35 -2 -160 124 270 292 -54 271
8147 271 -76 -140 79 186 -68 167 -2 162 224 -37 58 -265 -179 -215 25 -281 84 213 -8 90 228 -123
$$ packed form
7986A34j09J29j02J08k55K74k3k48OMK28j06j56O7O9j47L06k43J73l5L8k47J98
8009F3M6j26K45r9K59m10j89L90j42J51k67j2J03O2P0j17M9Q1j81J12j94J77l28
8032b57L17J81j09k72L65j47J95k83n8K06k69J16r0o9K07J9L07l10J06j39j35
8053a19R1P4j75O3J49r7R6k70K99J45j32r2J25j88J38m42L81k03J97r2o7K41j26
8076dk89L79k26J5P2L71j47J4n71M08k23J29K08O2j61p6P5J88j89l26M08Q0k82
8099h5L6K28j4j59j13j32J90j23J38J90j11Q5j93K62j54r8Qk82J21P5K72j89k5
8122g3L30j12j43%J38r0K01l35R3LL2N9k24O7NL14K0l20L3j58K84J46K2l46L25
8147B71l47o4K19J07k54K35j69J64O2k61R5l23Q6l6K40l06L65J29k21R8J38l51
$$ plain form
8169 -123 127 -114 -17 -112 -31 -235 -123 -121 -266 93 181 107 27 196 -242 41 286 -218 -160 -44 133 -100
$$ packed form
8169a23K50k41R7r5Q1k04J12Kj45L59Q8p4q0J69m38K83K45n04N8J16J77k33
8191a00
$$ Imaginary data points
##PAGE= N=2
##DATA TABLE= (X++(I..I)), XYDATA
$$ plain form
0 0 0 0 0 0 0 0 0 0 0 0 0 0 -8 8 -8 8 -8 16 -16 24 -24 32 -32 40 -48 56 -64 73 -88 97 -112 128 -145 167
34 167 -186 210 -238 264 -296 329 -368 409 -454 502 -554 613 -677 744 -822 903 -998 1097
52 1097 -1211 1336 -1477 1636 -1815 2023 -2266 2551 -2895 3319 -3855 4555 -5521 6937 -9223
67 -9223 13538 -24571 118397 193609 22712 80740 110159 52109 -4980 171 -27377 -21926
79 -21926 -26246 -68641 -86902 -35927 -42529 -84045 -82814 -70298 -79923 -54387 -53632 -82345 -57595
92 -57595 -11300 -31297 -48822 -23867 -4156 -6736 -7980 -16605 -11002 20602 33373 17778 33929
105 33929 65659 66972 65390 73661 68421 76216 83294 48845 25168 47326 50123 17585 -815
118 -815 -3096 -7271 -13470 -31567 -56476 -47992 -28415 -55250 -83239 -53334 -24784 -37446 -47218
$$ packed form
0@%%%%%%%%%%%%qJ6j6J6j6K4l2M0m8N6o4P2q8J04j20J37j61J85k09K40k73L12
34A67l53L96m48N02n60O25o97P77q63R56j056J167j290J421j566J725j901K095
52A097k308K547k813L113l451L838m289M817n446O214p174Q410j0076J2458j6160
67i223K2761l8109J42968P5212j70897N8028K9419n8050n7089N151k7548N451
79b1926m320m2395j8261N0975o602m1516J231J2516r625K5536P55k8713K4750
92e7595M6295j9997j7525K4955J9711k580j244q625N603L1604J2771j5595J6151
105C3929L1730J313j582Q271n240P795P078l4449k3677K2158K797l2538j8400
118h15k281m175o199j8097k4909Q484J9577k6835k7989K9905K8550j2662r772
$$ plain form
131 -47218 -39087 -23263 -5535 -10381 -28542 -15409 12282 6181 -16277 -8401 15861 22380 16799
144 16799 12555 14837 33371 43006 27364 23548 40280 46253 38527 27641 21948 32454 39803 18592
158 18592 -5468 -1875 8675 -4524 -23477 -27329 -27565 -26441 -28593 -43557 -44957 -22021 -19129 -36863
172 -36863 -35005 -16604 -6447 -6482 -12163 -13071 -19 11777 1529 -9713 7015 24243 10903
185 10903 -655 10856 23907 24310 15045 9764 19868 27995 18324 9238 16450 26400 19430 5603
199 5603 4758 10102 8040 366 -9733 -15475 -11986 -13072 -20548 -24889 -21704 -13565 -14374 -24684 -23011
214 -23011 -8381 -2834 -10905 -17073 -8601 4357 5677 -1065 -759 8856 16837 9427 -879 5992
228 5992 17240 14589 5308 1364 7886 17882 15834 4807 3065 13258 16978 3409 -6427 3680
$$ packed form
131d7218Q131J5824J7728m846j8161J3133K7691o101k2458P876K4262O519n581
144A6799m244K282J8534R635j5642l816J6732N973p726j0886n693J0506P349k1211
158A8592k4060L593J0550j3199j8953l852k36J124k152j4964j400K2936K892j7734
172c6863J858J8401J0157l5n681r08J3052J1796j0248j1242J6728J7228j3340
185A0903j1558J1511J3051M03r265n281J0104Q127r671r086P212R950o970j3827
199E603q45N344k062p674j0099n742L489j086p476m341L185Q139q09j0310J673
214b3011J4630N547q071o168Q472J2958J320o742L06R615P981p410j0306O871
228E992J1248k651r281l944O522R996k048j1027j742J0193L720j3569r836J0107
$$ plain form
242 3680 11104 840 -11016 -10612 -2232 -286 -10322 -16995 -12394 -7379 -11428 -18096 -14885 -5797 -5713
257 -5713 -9495 -7702 -3057 2102 5009 1264 -925 2855 7539 6588 3081 5581 11724 10547 5550
272 5550 4137 7418 11400 8142 -434 91 7159 6641 1193 -444 4348 6925 385 -5662 -3569 160
288 160 -923 -8149 -12864 -8051 -2621 -4926 -9951 -9296 -1902 92 -8471 -11323 -3154 2616 -880 -6534
304 -6534 -4190 5438 8652 3842 1078 5355 9523 5532 -1178 1830 6195 5333 3371 1231 1204 5574
320 5574 7580 2689 -1201 -868 1864 987 -4191 -4626 -207 1662 -1515 -6624 -4021 2723 340 -6501
336 -6501 -7256 -3613 -1960 -4812 -6112 -1914 1134 -355 -1529 -71 2632 4650 1565 -765 863
351 863 2909 3954 2122 2035 5442 5398 1874 372 2244 4222 2122 -2672 -3002 993 1317 -1562 -2859
$$ packed form
242C680P424j0264j1856M04Q380J946j0036o673M601N015m049o668L211R088Q4
257e713l782J793M645N159K907l745k189L780M684r51l507K500O143j177m997
272E550j413L281L982l258q576N25P068n18n448j637M792K577o540o047K093L729
288A60j083p226m715M813N430k305n025O55P394J994q563k852Q169N770l496n654
304f534K344R628L214m810k764M277M168l991o710L008M365q62j962k140k7M370
320E574K006m891l890L33K732q77n178m35M419J869l177n109K603O744k383o841
336f501p55L643J653k852j300M198L048j489j174J458K703K018l085k330J628
351H63K046J045j832q7L407m4l524j502J872J978k100m794l30L995L24k879j297
$$ plain form
368 -2859 249 2013 -2173 -4674 -1788 -318 -1083 -2945 -4349 -3667 -1105 -554 -1542 -2622 -1525 703
384 703 -119 -1862 -1511 603 3122 959 -2709 57 5484 4531 544 -246 3615 4573 1240 71 1835
401 1835 3342 2433 -488 -2190 966 2338 239 -1902 -1616 -333 356 -1020 -1561 -979 -491 -1223 -3373
418 -3373 -2894 654 495 -1838 -1311 -194 96 -227 -391 585 -35 -1621 -999 -34 554 976 893 1133 1447
437 1447 1123 1555 2369 1031 37 322 34 -536 -985 900 2624 152 -1621 241 1487 -338 -2369
454 -2369 -2357 -714 -908 -2716 -2299 -253 2066 1092 -1441 -953 921 890 -157 -1399 -1269 320 375 -101
472 -101 331 1763 2306 959 -718 24 1256 879 -100 -1178 -558 1472 1114 611 1260 1313 764 221 -495
491 -495 -1131 -1093 -711 -506 -1699 -1715 -234 272 192 -701 -1311 -336 -662 -2038 -1436 691 655 -983 -465 1031
$$ packed form
368b859L108J764m186k501K886J470p65j862j404O82K562N51r88j080J097K228
384G03q22j743L51K114K519k163l668K766N427r53l987p90L861R58l333j169J764
401A835J507r09k921j702L156J372k099k141K86J283O89j376n41N82M88p32k150
418c373M79L548j59k333N27J117K90l23j64R76o20j586O22R65N88M22q3K40L14
437A447l24M32Q14j338r94K85k88n70m49J885J724k472j773J862J246j825k031
454b369J2J643j94j808M17K046K319r74k533M88J874l1j047j242J30J589N5m76
472a01M32J432N43j347j677P42J232l77r79j078O20K030l58n03O49N3n49n43p16
491d95o36L8L82K05j193j6J481N06q0q93o10R75l26j376O02K127l6j638N18J496
$$ plain form
511 1031 1379 338 430 672 -276 -488 -350 406 1027 134 -755 0 1194 894 92 432 870 96 -671 49
531 49 93 -139 703 87 -900 -124 839 371 -771 -734 84 -274 -912 -605 -270 132 550 -768 -837 -263 236
552 236 709 636 -90 -487 133 1459 691 -860 -125 1142 -424 -1226 -59 1139 556 -819 -1045 148
570 148 684 -61 -317 -350 29 -193 -418 395 528 -419 -193 378 -320 -1025 -309 59 -445 -941 -455 -393 -126
591 -126 341 577 -333 269 502 -428 -88 229 291 354 77 -11 243 1384 1338 162 -644 389 -30 -456 592
612 592 199 -350 -150 -8 318 -22 -62 342 -87 -472 -546 -298 168 256 -964 -542 652 296 -99 -425 296
633 296 255 -331 -568 -597 133 158 96 -150 134 -10 -46 595 271 -431 -34 71 42 12 -412 433 193 -461 -283
656 -283 138 366 396 -43 -491 -76 -239 279 288 -86 -51 304 -28 -174 -81 199 401 -205 -428 -66 341 24
$$ packed form
511A031L48j041R2K42r48k12J38P56O21q93q89P55J194l00q02L40M38p74p67P20
531D9M4k32Q42o16r87P76R63m68j142L7Q18l58o38L07L35M02M18j318o9N74M99
552B36M73p3p26l97O20J326p68j551P35J267j566q02J167J198n83j375k26J193
570A48N36p45k56l3L79k22k25Q13J33r47K26N71o98p05P16L68n04m96M86O2K67
591a26M67K36r10O02K33r30L40L17O2O3k77q8K54J141m6j176q06J033m19m26J048
612E92l93n49K00J42L26l40m0M04m29l85p4K48M66Q8j220M22J194l56l95l26P21
633B96m1n86k37k9P30K5o2k46K84j44l6O41l24p02L97J05k9l0m24Q45k40o54J78
656b83M21K28L0m39m48M15j63N18Rl74L5L55l32j46R3K80K02o06k23L62M07l17
$$ plain form
678 24 136 104 -360 -310 -2 338 -292 -169 290 -77 341 -243 -60 731 537 -839 -904 201 428 -5 -56
699 -56 196 -268 -519 71 -34 -230 -106 -189 -413 -348 -81 4 345 134 -325 74 151 -223 -192 -103 -278 -17 -11
722 -11 150 -255 183 431 10 -292 -133 239 230 -3 -435 -91 298 424 252 183 287 225 -574 -426 -109 208
744 208 149 -142 -124 0 -296 367 486 -141 -442 -63 216 -70 96 -122 395 44 -172 -359 101 437 49
765 49 -229 -217 -259 -486 127 25 122 54 46 194 -133 34 -196 -106 -144 -449 42 235 159 -44 7 -157 34 -131
789 -131 172 137 -70 79 -72 -13 -333 257 365 99 -145 -182 276 529 86 -116 72 -48 -120 74 255 24
811 24 20 -131 180 -156 25 -84 368 41 58 -145 226 165 -112 -313 45 -92 6 2 71 162 58 -68 -363 -432
835 -432 9 -88 -106 -387 -106 -105 68 198 21 67 -221 19 -127 92 20 54 287 200 235 -81 235 307 -99 -376
$$ packed form
678B4J12l2m64N0L08L40o30J23M59l67M18n84J83P91j94j376o5J105K27m33n1
699e6K52m64k51N90j05j96J24q3k24O5K67Q5L41k11m59L99P7l74L1Q9j75K61O
722a1J61m05M38K48m21l02J59L72rk33m32L44L89J26j72o9J04o2p99J48L17L17
744B08n9k91J8J24k96O63J19o27l01L79K79k86J66k18N17l51k16j87M60L36l88
765D9k78J2m2k27O13j02R7o8qJ48l27J67k30R0l8l05M91J93p6k03N1j64J91j65
789a31L03l5k07J49j51N9l20N90J08k66k44l7M58K53m43k02J88j20p2J94J81k31
811B4mj51L11l36J81j09M52l27J7k03L71o1k77k01L58j37R8mO9R1j04j26k95o9
835d32M41r7j8k81K81JJ73J30j77M6k88K40j46K19p2L4K33q7L5l16L16P2m06k77
$$ plain form
859 -376 -98 297 98 -251 -173 150 108 34 -39 52 123 6 -130 33 -195 -174 112 207 -64 -36 -188 -184 69 -18
883 -18 152 -16 -114 -235 95 125 347 -24 36 185 13 3 -111 389 24 -20 -145 -181 -358 110 163 -61 -68 -174
907 -174 -22 221 -285 -106 147 -307 154 227 18 127 -329 37 -4 -225 -154 237 169 -111 -236 137 333 194
929 194 -92 74 125 188 129 -170 301 401 -194 -50 -100 106 63 -81 183 -161 67 -11 -45 249 88 249 -60
952 -60 -192 24 34 220 169 203 -207 198 159 383 33 -101 -308 10 64 80 71 -58 -142 92 -58 110 141 86
976 86 15 -124 -277 -177 164 77 -211 378 23 -60 -17 85 23 -233 223 11 -131 -141 -52 -108 -132 -28 -67 -197
1000 -197 80 -72 218 8 -348 107 -148 80 58 -155 41 -13 -82 -2 261 -124 -257 -303 82 183 204 -135
1022 -135 -44 166 -10 189 74 -113 75 64 -100 -117 86 33 -45 341 -180 -40 25 -76 -48 133 76 34 -43
$$ packed form
859c76K78L95j99l49P8L23m2p4p3R1P1j17j36J63k28K1K86R5k71K8j52MK53q7
883a8J70j68r8j21L30L0K22l71O0J49j72j0j14N00l65m4j25l6j77M68N3k24pj06
907a74J52K43n06J79K53m54M61P3k09J09m56L66m1k21P1L91o8k80j25L73J96j39
929A94k86J66N1O3n9k99M71J00n95J44n0K06m3j44K64l44K28p8l4K94j61J61l09
952f0j32K16J0J86n1L4m10M05l9K24l50j34k07L18N4J6rj29q4K34j50J68L1n5
976H6p1j39j53J00L41q7k88N89l55q3M3J02o2k56M56k12j42j0Q9n6k4J04l9j30
1000a97K77j52K90k10l56M55k55K28k2k13J96n4o9Q0K63l85j33m6L85J01K1l39
1022a35R1K10j76J99j15j87J88j1j64j7K03n3p8L86n21J40O5j01K8J81n7m2p7
$$ plain form
1045 -43 -145 108 82 66 -79 -28 -354 -15 127 102 -256 116 58 206 -65 -34 18 145 -9 -113 149 86 116
1068 116 -14 280 -49 -26 -15 202 -4 -63 -124 -11 -279 -18 6 -153 213 172 -177 83 34 -242 59 -70
1090 -70 -179 113 194 80 -116 -79 47 -231 163 -181 77 -15 13 5 106 -33 106 175 -146 -32 358 95 178
1113 178 215 -28 -1 21 -248 127 -107 -21 42 -67 -212 -86 251 169 -98 -100 -247 109 -17 -23 144 16 -1 -62
1137 -62 -135 -82 -203 182 -164 -26 -152 -14 -176 -73 235 76 143 -93 162 -72 -97 63 -103 -206 -245 -82
1159 -82 56 -143 -270 -216 101 142 -33 -117 138 213 111 -16 -27 -52 -12 -136 -137 -131 -28 -91 24 144 -42 -176
1183 -176 -149 -232 7 -49 -107 -52 71 -6 40 111 223 -81 -242 -302 -75 35 -201 29 117 -230 299 -145 155
1206 155 -146 75 251 -12 16 60 71 39 -55 23 -146 -123 -27 -125 125 180 -49 120 133 -78 22 183 -51 -280
$$ packed form
1045d3j02K53k6j6j45N1l26L39J42k5l58L72n8J48k71L1N2J27j54j04K62o3L0
1068A16j30K94l29K3J1K17k06n9o1J13k68K61K4j59L66m1l49K60m9k76L01j29
1090g0j09K92Q1j14j96L7J26k78L94l44K58r2K8qJ01j39J39O9l21J14L90k63Q3
1113A78L7k43K7K2k69L75k34Q6O3j09j45J26L37q2k67kj47L56j26oJ67j28j7o1
1137f2p3N3j21L85l46J38j26J38j62J03L08j59O7k36K55k34k5J60j66j03l9J63
1159h2J38j99j27N4L17M1j75q4K55P5j02j27j1k5M0j24jOJ03o3J15J20j86j34
1183a76K7q3K39n6n8N5J23p7M6P1J12l04j61o0K27J10k36K30Q8l47N29m44L00
1206A55l01K21J76k63K8M4J1l2r4P8j69K3R6r8K50N5k29J69J3k11J00J61k34k29
$$ plain form
1230 -280 3 92 104 27 191 36 202 154 167 -148 57 87 -18 -59 -70 150 -42 153 -23 142 -76 -136 -100
1253 -100 -324 -62 83 -128 124 74 4 75 77 -111 3 -10 -56 8 -44 64 431 197 162 19 -28 130 117 17
1277 17 -239 -13 -141 -64 145 -9 37 130 33 -38 -149 -303 -22 -225 -332 -38 -115 -33 25 103 99 -63 96 216
1301 216 -14 -87 -42 42 79 150 -14 123 -56 -10 -103 -306 112 42 -41 -20 -353 -21 169 -10 236 -39 -54 250
1325 250 -90 -84 233 -70 -78 130 -24 -148 102 266 -232 14 -104 77 -93 -144 -49 114 -137 146 -37 -152
1347 -152 -302 14 -158 -154 -108 219 69 -173 358 105 54 -320 -50 -29 166 -90 -44 -280 -30 194 211 -157
1369 -157 -207 12 -112 -167 -95 -180 -106 -47 -180 -6 -396 192 -65 -303 -236 30 78 -40 -322 182 -106 43 -195
1392 -195 -79 -190 -151 202 -44 -173 23 14 5 287 15 144 111 116 104 -127 -14 -10 -41 -114 116 -134 137 -8
$$ packed form
1230b80K83Q9J2p7J64j55J66m8J3l15K05L0j05m1j1K20j92J95j76J65k18o0L6
1253a00k24K62J45k11K52n0p0P1Kj88J14j3m6O4n2J08L67k34l5j43m7J58j3j00
1277A7k56K26j28P7K09j54M6R3r7p1j11j54K81k03j07K94p7Q2N8P8mj62J59J20
1301B16k30p3M5Q4L7P1j64J37j79M6r3k03M18p0q3K1l33L32J90j79K46k75j5L04
1325B50l40OL17l03qK08j54j24K50J64m98K46j18J81j70n1R5J63k51K83j83j15
1347a52j50L16j72MM6L27j50k42N31k53n1l74K70K1J95k56M6k36K50K24J7l68
1369a57n0K19j24n5P2q5P4N9j33J74l90N88k57k38O7K66M8j18k82N04k88J49k38
1392a95J16j11L9L53k46j29J96rrK82k72J29l3Nj2k31J13Ml1p3K30k50K71j45
$$ plain form
1416 -8 -139 -69 4 -36 -88 -158 -108 -42 -33 -279 170 -9 -34 -248 417 -44 1 -38 81 46 167 89 -98 150 -159
1441 -159 -78 -109 -75 178 -128 -53 -163 44 -138 -42 47 -125 -31 26 508 -63 -9 157 46 -40 43 158 182 70
1465 70 107 112 3 50 106 -171 -33 21 3 15 -175 -76 -204 16 7 22 -226 30 -15 118 -145 -169 -163 -78 55 115
1491 115 58 44 -42 131 61 390 -191 124 361 66 -66 328 -21 -115 190 97 130 -38 40 -164 -1 143 121
1514 121 -196 6 -40 111 11 -130 -4 114 31 -91 -34 -175 16 -4 -13 -5 53 -27 101 -11 143 -203 -21
1537 -21 58 216 78 -110 383 288 -21 -27 53 -230 -85 -144 224 -39 -81 -207 -67 93 -6 -133 44 156 -40
1560 -40 160 -121 247 -156 65 149 -119 83 -209 -243 33 -163 -105 -149 -15 97 133 216 -17 7 60 0 -95 -66
1584 -66 -154 -178 79 13 5 -102 -246 115 -52 38 -116 -145 -28 97 12 -294 -56 -54 -67 -236 -21 -22 107 318 -165
$$ packed form
1416hj31P0P3m0n2p0N0O6Rk46M49j79k5k14O65m61M5l9J19l5J21p8j87K48l09
1441a59Q1l1L4K53l06P5j10K07j82R6Q9j72R4N7M82n71N4J66j11q6Q3J15K4j12
1465G0L7Nj09M7N6k77J38N4j8J2j90R9j28K20rJ5k48K56m5J33k63k4OQ5J33O0
1491A15n7j4q6J73p0L29n81L15K37k95j32L94l49r4L05r3L3j68P8k04J63J44k2
1514A21l17K02m6J51j00j41J26J18q3j22N7j41J91k0rQN8q0J28j12J54l46J82
1537b1P9J58j38j88M93r5l09oQ0k83J45n9L68k63m2j26J40J60r9j27J77J12j96
1560d0K00k81L68m03K21Q4k68K02k92l4K76j96N8m4J34J12L6Q3k33K4N3o0r5K9
1584f6q8k4K57o6qj07j44L61j67R0j54k9J17J25q5l06K38Kj3j69K15jJ29K11m83
$$ plain form
1609 -165 98 125 191 -144 -1 135 48 -124 -118 3 94 -240 -154 117 121 156 111 -88 -81 110 -208 -159 235 -35 -36
1634 -36 135 405 -42 29 19 15 -152 2 106 -42 -42 -107 10 79 117 -59 -3 -21 -345 -237 -52 -99 3 168
1658 168 283 -38 -87 243 29 -136 147 -135 -120 -345 169 -96 -153 153 -107 -37 -50 -185 117 245 -2 -420
1680 -420 -20 -72 -139 113 93 83 -223 -281 -27 72 -61 270 62 -9 -69 -32 -225 -50 268 -37 32 -128 -79 51
1704 51 197 79 130 171 -225 -256 -40 -136 68 -229 -45 -122 137 -59 -66 -45 65 -87 -30 135 -54 -55 0 37 -252
1729 -252 45 59 -101 221 4 -63 -58 -187 -80 147 -25 101 -136 -153 -168 92 -247 -36 -159 354 -145 -34
1751 -34 -216 -262 -65 107 28 184 -97 19 -66 21 -184 -158 -354 142 257 -56 -112 -209 163 -40 -307 295 5
1774 5 33 178 -124 275 -84 180 132 167 119 -97 30 72 -140 170 101 -57 -382 -218 12 -71 66 119 -40
$$ packed form
1609a65K63K7O6l35J43J36q7j72OJ21R1l34Q6K71ML5m5j99PJ91l18M9L94k70j
1634c6J71K70m47P1j0mj67J54J04j48%o5J17O9L8j76N6j8l24J08J85m7J02J65
1658A68J15l21m9L30k14j65K83k82J5k25N14k65n7L06k60P0j3j35L02J28k47m18
1680d20M00n2o7K52k0j0l06n8K54R9j33L31k08p1o0L7j93J75L18l05O9j60M9J30
1704E1J46j18N1M1l96l1K16r6K04k97J84p7K59j96pK1J10j52N7J65j89jN5L7k89
1729b52K97J4j60L22k17o7Nj29J07K27j72J26k37j7j5K60l39K11j23N13m99J11
1751c4j82m6J97J72p9J56k81J16q5Q7k05K6j96M96J15l13n6r7L72k03k67O02k90
1774EK8J45l02L99l59K64m8L5m8k16J27M2k12L10o9j58l25J64K30q3J37N3j59
$$ plain form
1797 -40 -251 -84 -203 147 73 -68 127 -127 -152 -129 -68 -105 82 82 -205 149 150 -169 -99 -294 -185 7 -2 1 207
1822 207 -82 47 -85 -24 -45 -57 21 97 -53 143 -161 -222 -98 -208 -4 225 28 -9 -55 104 109 -137 -97 -160
1846 -160 25 -102 -29 123 -36 183 24 -193 3 197 62 130 -200 -251 -43 89 31 -70 -6 -187 205 -51
1868 -51 -19 -174 194 -90 130 107 272 -134 -59 157 -46 176 54 201 -339 23 161 145 193 -145 -206 -4
1890 -4 122 -175 -35 -167 -9 20 -112 -10 89 -174 -116 76 94 287 -66 156 -58 -106 44 36 -49 99 47 -15
1914 -15 -255 34 -199 -133 -104 93 -10 10 -91 -126 4 -90 80 153 104 -142 23 15 253 -6 110 -325 -337 -187
1938 -187 -204 -10 -261 210 -157 30 113 -63 -4 -328 -46 194 8 91 0 -206 -94 -114 -479 -60 117 120 147
1961 147 -109 -165 225 137 -158 236 -228 -131 -99 170 182 158 -148 -107 161 117 -14 -116 -104 -130 57 -10 -177 108
$$ packed form
1797d0k11J67j19L50p4j41J95k54k5K3O1l7J87%k87L54Jl19P0j95J09J92rLK06
1822B07k89J29j32O1k1j2P8P6j50J96l04o1J24j10K04K29j97l7m6J59Nk46M0o3
1846a60J85j27P3J52j59K19j59k17J96J94j35O8l30n1K08J32n8j01O4j81L92k56
1868e1L2j55L68k84K20k3J65m06P5K16k03K22j22J47n40L62J38j6M8l38o1K02
1890dJ26k97J40j32J58K9j32J02R9k63N8J92J8J93l53K22k14m8J50qq5J48n2o2
1914a5k40K89k33O6K9J97j03K0j01l5J30r4J70P3m9k46J65qK38k59J16m35j2J50
1938a87j7J94k51M71l67J87Q3j76N9l24K82K40j86Q3r1k06J12k0l65M19J77LK7
1961A47k56n6L90q8k95L94m64R7L2K69J2k4l06M1K68m4j31j02J2k6J87o7j67K85
$$ plain form
1985 108 -163 -144 258 -18 -107 293 -68 -143 -150 163 -33 52 -71 -53 232 59 -175 178 -67 28 236 -112 -180
2008 -180 -156 162 213 114 53 2 -121 38 -89 84 -129 140 172 94 -213 143 -80 64 -133 -51 38 -197 -82
2031 -82 78 -284 299 128 -86 -53 76 -59 -90 -27 -193 207 -115 371 -104 9 -63 -113 -26 -117 -60 63 68 -143
2055 -143 -85 205 58 -28 93 192 342 -87 -167 -176 96 214 43 316 95 175 -195 -193 -21 57 118 -19 188 -11
2079 -11 257 9 -220 33 -74 -11 29 -183 103 -16 197 -133 -173 -115 26 -178 -102 44 -11 84 22 -76 -193
2102 -193 -11 -169 -89 12 52 223 -69 148 56 137 76 6 -84 55 33 231 -233 138 -95 -155 -151 91 -204 17
2126 17 248 192 184 -173 -212 19 -97 -43 -138 -137 23 22 -135 -159 -81 133 -55 -123 92 46 -20 175 60 -32 13 -312
2152 -312 -41 -141 -136 -249 -12 73 -1 0 -82 158 -2 151 151 92 13 203 132 163 -275 109 -279 -23 -12 319 -217
$$ packed form
1985A08k71J9M02k76q9M00l61p5pL13j96Q5j23J8K85j73k34L53k45R5K08l48o8
2008a80K4L18N1r9o1n1j23J59j27J73k13K69L2p8l07L56k23J44j97Q2Q9k35J15
2031h2J60l62N83j71k14L3J29j35l1O3j66M00l22M86m75J13p2n0Q7r1N7J23Nk11
2055a43N8K90j47q6J21R9J50m29q0rK72J18j71K73k21Q0l70KJ72P8O1j37K07j99
2079a1K68k48k29K53j07O3M0k12K86j19K13l30m0N8J41k04P6J46n5R5o2r8j17
2102a93J82j58Q0J01M0J71k92K17r2Q1o1p0r0J39k2J98m64L71k33o0MK42k95K21
2126A7K31n6ql57l9K31j16N4r5JJ60jj57k4P8K14j88o8K15m6o6J95j15r2M5l25
2152c12K71j00Nj13K37Q5p4Jq2K40j60J53%n9p9J90p1L1m38L84l88K56J1L31n36
$$ plain form
2177 -217 -21 441 168 68 104 -184 251 -67 100 230 -194 365 54 81 46 62 -281 80 -105 -40 -166 271
2199 271 165 -44 20 -68 -110 -144 -154 -212 -225 -119 262 -115 -12 14 -43 -73 -62 92 -100 -214 16 -38 -136 12
2223 12 -82 -105 -25 187 -215 202 20 -99 -449 -2 139 24 -91 -24 134 179 -141 -44 154 -4 218 9
2245 9 -219 -173 141 233 4 68 73 -222 -24 -120 201 128 37 88 -50 -18 221 122 49 5 18 -227 59 55 136 48 166
2272 166 480 -47 29 151 -28 -167 0 140 -36 61 14 -139 136 269 3 179 -180 79 40 -59 -13 -201
2294 -201 129 -379 14 -97 46 140 40 -105 8 -161 -87 115 62 -76 64 156 -236 115 -76 159 81 -132
2316 -132 -165 -104 176 18 -153 176 47 -20 -77 95 330 -75 -181 -6 261 130 39 16 5 18 65 288 -13
2339 -13 -54 114 -138 175 -164 79 -123 249 -106 40 -6 29 -41 108 258 163 54 -105 14 -104 118 26
$$ packed form
2177b17J96M62k73j00L6k88M35l18J67J30m24N59l11K7l5J6l43L61j85O5j26M37
2199B71j06k09O4q8m2l4j0n8j3J06L81l77J03K6n7l0J1J54j92j14K30n4r8J48
2223A2r4k3Q0K12m02M17j82j19l50M47J41j15j15O7J58M5l20R7J98j58K22k09
2245Ik28M6L14R2k29O4Nk95J98r6L21p3r1N1j38L2K39r9p3m4J3k45K86mQ1q8J18
2272A66L14n27P6J22j79j39J67J40j76R7m7j53K75J33k66J76l59K59l9r9M6j88
2294b01L30n08L93j11J43R4j00j45J13j69P4K02n3j38J40R2l92L51j91K35p8k13
2316a32l3O1K80j58j71L29j29o7n7J72K35m05j06J75K67j31r1k3j1J3M7K23l01
2339a3m1J68k52L13l39K43k02L72l55J46m6L5p0J49J50r5j09j59J19j18K22r2
$$ plain form
2361 26 -165 -147 -235 -186 -33 -39 -61 -163 15 -42 -216 119 150 266 -127 -9 -113 -96 -40 75 40 196 -118 -3
2385 -3 168 -33 -69 102 -183 -254 11 -230 -261 -75 167 -75 -129 -141 -1 -23 207 -128 -43 58 120 -258 47
2408 47 11 287 -70 88 3 63 302 9 64 5 48 174 50 25 -38 171 140 76 98 121 -172 78 298 -96
2432 -96 -47 -25 -75 -79 131 138 -11 5 -9 -164 -35 -267 176 172 -146 -154 -22 262 -85 61 63 -10 84 -169 -88 -28 65
2459 65 -201 -158 170 -74 194 4 166 89 -164 83 -15 -144 110 -35 159 -88 70 -128 -233 -113 -97 -2
2481 -2 83 -214 96 -201 -229 -86 124 335 -114 -34 121 109 -50 120 291 174 -145 -296 -179 64 -57 -110
2503 -110 298 -111 -82 27 -137 66 117 115 278 181 -49 44 -173 -31 34 62 94 196 85 29 -9 -153 -4 56
2527 56 -136 119 32 -113 14 -71 -28 127 148 63 28 -136 -29 12 182 194 89 -397 98 -88 57 -19 162
$$ packed form
2361B6j91J8q8M9J53ok2j02J78n7j74L35L1J16l93J18j04J7N6J15l5J56l14J15
2385cJ71k01l6J71k85p1K65k41l1J86K42k42n4j2J40k2K30l35Q5J01O2l78L05
2408D7l6K76l57J58q5O0K39k93N5n9M3J26j24k5o3K09l1o4K2K3k93K50K20l94
2432i6M9K2n0mK10Pj49J6j4j55J29k32M43ml18qJ32K84l47J46Kp3R4k53Q1O0R3
2459F5k66M3L28k44K68j90J62p7k53K47r8j29K54j45J94k47J58j98j05J20J6R5
2481bQ5k97L10k97k8J43K10K11m49Q0J55j2j59J70J71j17l19j51J17K43j21n3
2503a10M08m09K9J09j64K03N1kJ63r7k30R3k17J42O5K8L2J02j11n6l8j44J49O0
2527E6j92K55q7j45J27q5M3J55K1q5l5j64J07M1J70J2j05m86M95j86J45p6J81
$$ plain form
2550 162 80 -60 261 -142 29 -169 -56 111 -191 -188 -18 219 137 -29 32 94 18 293 249 -163 -63 -213 208
2573 208 1 -212 87 142 4 42 -303 16 42 -65 -177 -98 -50 -110 11 -39 7 -391 -152 -139 -198 404 39
2596 39 233 92 -6 116 82 39 -21 -194 74 -38 85 186 -107 159 -156 4 10 266 -317 -156 -143 -214 6
2619 6 -64 226 118 169 292 -46 115 168 36 -126 273 -199 56 -126 -180 -255 137 103 243 -250 73 -24 22
2642 22 -85 91 -42 160 78 54 226 -78 217 -100 203 -63 245 -14 -52 160 -90 95 -88 -28 141 -128
2664 -128 -40 -8 90 4 -55 98 -30 -53 -43 227 149 -62 -85 164 230 -60 182 120 215 -27 -184 -3 51 -60
2688 -60 -33 -105 -111 73 -10 51 -22 52 177 39 122 170 122 -66 -92 -4 60 181 -89 -316 -94 38 -138 3 62
2713 62 -54 74 -167 12 162 -343 -201 -72 -162 252 52 -401 -12 -61 -105 29 -19 261 -127 -156 -102 -99 47
$$ packed form
2550A62q2j40L21m03J71j98J13J67l02LJ70K37q2j66O1O2p6K75m4m12J00j50M21
2573B08k07k13K99N5j38L8l45L19K6j07j12P9M8o0J21n0M6l98K39J3n9O02l65
2596C9J94j41r8J22l4m3o0j73K68j12J23J01k93K66l15J60OK56n83J61J3p1K20
2619Fp0K90j08N1J23l38J61N3j32j62L99m72K55j82n4p5L92l4J40m93L23r7M6
2642B2j07J76j33K02q2k4J72l04K95l17L03k66L08k59l8K12k50J85j83O0J69k69
2664a28Q8L2R8q6n9J53j28k3J0K70p8k11k3K49O6k90K42o2R5k42j57J81N4j11
2688f0K7p2oJ84q3O1p3P4J25j38Q3M8m8j88k6Q8O4J21k70k27K22J32j76J41N9
2713F2j16J28k41J79J50n05J42J29r0M14k00m53L89m9m4J34m8K80l88k9N4LJ46
$$ plain form
2736 47 100 15 -83 -109 -153 -9 -355 138 125 84 -68 -44 -1 93 199 -238 -32 -114 59 -33 31 -392 33 43 -59
2761 -59 166 57 -97 75 -31 -51 67 -94 -16 -67 453 -161 -263 -29 -62 162 49 89 -55 -100 -36 -289 -224
2784 -224 -86 -9 212 -102 62 47 -251 43 -91 74 179 22 -149 195 214 -317 16 -179 46 131 -57
2805 -57 -115 111 132 -11 311 -228 -22 -244 285 -57 95 64 102 -343 -145 184 169 326 29 123 -118 -83 -322
2828 -322 -51 -45 158 114 76 140 77 -134 -255 196 240 67 307 -57 -15 -75 -20 28 -202 4 -85 -118 -119 45 -270
2853 -270 220 -23 -72 170 71 260 7 -193 -70 -57 -17 -178 -91 107 238 136 264 -155 55 57 185 -162
2875 -162 -35 -132 9 35 -123 47 53 121 -49 -4 -12 -186 218 182 40 227 77 71 45 -160 -68 269 26 2 32
2900 32 208 -132 -7 7 101 129 35 -53 -46 -192 28 142 -122 87 -43 11 259 17 139 184 0 182 -34
$$ packed form
2736D7N3q5r8k6m4J44l46M93j3m1j52K4M3R4J06m37K06q2J73r2O4m23M25J0j02
2761e9K25j09j54J72j06k0J18j61P8n1N20o14j02K34l3K24j13M0j44m5O4k53O5
2784b24J38P7K21l14J64j5k98K94j34J65J05j57j71L44J9n31L33j95K25Q5j88
2805e7n8K26K1j43L22n39K06k22N29l42J52l1L8m45J98L29j5J57k97R4k41L5k39
2828c22K71OK03m4l8O4o3k11j21M51M4j73K40l64M2o0N5M8k30K06q9l3jJ64l15
2853b70M90k43m9K42r9J89k53k00J23J3M0j61Q7J98J31j02J28m19K10KJ28l47
2875a62J27r7J41K6j58J70OO8j70M5qj74M04l6j42J87j50ok6k05R2L37k43k4L0
2900C2J76l40J25J4R4K8r4q8Pj46K20J14k64K09j30N4K48k42J22M5j84J82k16
$$ plain form
2923 -34 -157 46 -357 -16 -184 44 73 -93 203 109 -65 -114 -254 -424 188 -243 -69 38 72 -48 -111 51
2945 51 -108 -219 11 -79 -41 203 90 -171 24 -103 -131 111 -218 -76 288 77 -178 290 18 -27 56 43
2967 43 44 -52 45 -83 181 105 -21 -342 66 151 -99 105 109 -176 -500 -219 -173 33 89 33 16 -48 306 37 -191
2992 -191 126 -141 -337 48 -95 134 122 33 146 76 -162 -161 15 -200 218 84 305 -64 -191 -287 -102 119
3014 119 -67 -155 -283 -359 69 -54 6 -21 220 -111 26 -131 54 172 -140 -39 -24 236 18 -28 134 -157
3036 -157 -104 248 -50 -86 -171 41 371 -156 -240 -383 159 230 57 -161 186 34 -30 39 45 36 -122 5 -302 -122
3060 -122 75 6 -2 138 -5 157 17 238 -226 -203 44 337 -99 -6 -91 -155 104 -196 235 -33 -78 389 103
3083 103 55 -94 -66 63 -44 127 136 132 152 251 147 -160 -102 -31 -355 -184 -98 -27 109 54 187 -29 214 97
$$ packed form
2923c4j23K03m03L41j68K28K9j66K96r4j74m9j40j70O12m31J74J07L4j20o3J62
2945E1j59j11K30r0L8K44j13k61J95j27k8K42l29J42L64k11k55M68k72m5Q3j3
2967D3Jr6R7j28K64p6j26l21M08Q5k50K04Mk85l24K81M6K06N6n6j7o4L54k69k28
2992a91L17k67j96L85j43K29j2q9J13p0k38JJ76k15M18j34K21l69j27r6J85K21
3014A19j86q8j28p6M28j23O0k7K41l31J37j57J85J18l12J01J5K60k18m6J62k91
3036a57N3L52k98l6q5K12L30n27q4j43N42P1j73k18L47j52o4O9Orj58J27l07J80
3060a22J97o9qJ40j43J62j40K21m64K3K47K93m36R3q5o4K59l00M31k68m5M67k86
3083A03m8j49K8J29j07J71RmK0R9j04l07N8P1l24J71Q6P1J36n5J33k16K43j17
$$ plain form
3107 97 192 -14 83 -143 -104 229 43 -77 97 121 162 -264 134 -53 108 37 -232 -239 73 -45 -283 174 -4
3130 -4 127 154 224 146 50 -98 46 -73 -141 -151 140 -14 34 -251 -10 -113 -19 39 216 -214 -159 124 -130 161
3154 161 -41 200 -151 -189 -32 51 -66 -196 8 117 188 -247 -78 -159 -2 110 -240 76 135 -71 158 224
3176 224 -35 116 43 -37 -48 -40 -387 72 -203 39 58 61 -53 5 -24 -27 124 -240 416 31 140 141 -132 -197 -42
3201 -42 14 -67 -175 269 115 -7 -89 -23 19 173 85 124 12 -30 -122 -12 -136 -49 71 -79 -60 -212 -191 47
3225 47 -37 -88 164 -120 45 -7 64 70 43 94 217 -28 -90 29 176 -131 181 -142 84 -190 -91 155 -128 168
3249 168 -48 -105 92 83 -37 126 -191 286 -96 -11 -104 208 228 3 -92 -171 -206 -334 -155 -60 12 75 46 175
3273 175 101 -73 63 -5 122 -70 -84 -2 76 33 23 92 -49 -46 -215 308 -128 -97 290 -67 -123 -162 41 142
$$ packed form
3107I7R5k06R7k26L9L33j86j20J74K4M1m26L98j87J61p1k69pL12j18k38M57j78
3130dJ31K7P0p8r6j48J44j19o8j0K91j54M8k85K41j03R4N8J77m30N5K83k54K91
3154A61k02K41l51l8J57Q3j17j30K04J09P1m35J69q1J57J12l50L16N9k06K29O6
3176B24k59J51p3q0j1Ql47M59k75K42J9Lj14N8k9lJ51l64O56l85J09Jk73o5J55
3201d2N6q1j08M44j54j22q2O6M2J54q8L9j12m2r2J10j24Q7J20j50J9j52K1K38
3225D7q4n1K52k84J65n2P1Ok7N1J23k45o2J19J47l07L12l23K26k74R9K46k83K96
3249A68k16n7J97rj20J63l17M77l82Q5r3L12K0k25r5p9l5j28J79R5P2O3k9J29
3273A75p4j74J36o8J27j92j4Q2P8m3j0O9j41Lj69N23m36L1L87l57n6l9K03J01
$$ plain form
3297 142 15 16 -229 11 -49 149 34 -261 127 32 -34 123 -78 -107 -147 208 192 -123 -27 76 174 -158 21
3320 21 -228 180 -203 132 52 251 120 0 -52 20 189 -122 -42 44 47 262 -233 157 -203 -77 -24 81 172
3343 172 -107 -289 -75 -305 -254 117 -32 81 24 -42 -137 156 -245 -74 -44 60 -276 185 -60 -214 -25 3
3365 3 -78 -171 123 108 -47 -80 -99 -96 -200 64 -21 290 176 -367 313 -294 127 -224 12 -148 5 32 60 -7
3389 -7 108 -68 -315 -61 148 135 -256 -182 39 86 -59 -173 131 11 16 -73 177 -12 220 200 -54 48 -69
3412 -69 238 14 -28 -37 218 37 -140 116 50 -111 -38 -85 97 251 -179 186 -93 -201 11 71 -86 36 -27
3435 -27 57 19 -38 70 -253 -80 -309 26 167 23 -260 6 84 131 -172 258 69 -136 -106 148 101 -11 61
3458 61 -119 9 -12 19 -163 -59 266 5 -79 219 -85 -70 61 268 57 48 365 -55 -256 198 64 162 -55
$$ packed form
3297A42j27Jk45K40o0J98j15k95L88r5o6J57k01k9m0L55j6l15R6J03R8l32J79
3320B1k49M08l83L35q0J99j31j20n2P2J69l11Q0Q6LK15m95L90l60J26N3J05R1
3343A72k79j82K14k30N1L71j49J13n7o6r5K93m01J71L0J04l36M61k45j54J89K8
3365Cq1r3K94j5j55l3j9Lj04K64q5L11j14n43O80o07M21l51K36j60J53K7K8o7
3389gJ15j76k47K54K09j3l91P4K21M7j45j14L04j20Nq9K50j89K32k0k54J02j17
3412f9L07k24m2rK55j81j77K56o6j61P3m7J82J54m30L65k79j08K12O0j57J22o3
3435b7Q4l8n7J08l23J73k29L35J41j44k83K66P8M7l03M30j89k05L0K54m7j12P2
3458F1j80J28k1L1j82J04L25k61q4K98l04J5J31K07k11rL17m20k01M54j34R8k17
$$ plain form
3481 -55 300 -36 -230 182 -3 96 113 78 27 -172 -4 127 143 -129 261 -59 -142 -79 -77 125 -28 -370 63
3504 63 -120 -53 -41 -23 -28 238 -341 86 176 102 -45 102 -65 80 19 68 51 149 7 -249 26 -194 48 -208
3528 -208 208 131 -14 -53 182 -8 -69 -1 221 -236 -220 -26 142 -104 -245 -147 -114 -95 35 102 -20 140 148 103
3552 103 32 66 -221 170 172 -28 357 94 -141 23 63 13 47 -32 169 105 288 -249 8 102 32 92 -81 23
3576 23 226 185 -142 105 20 -71 280 -83 -202 -10 -181 -171 -45 -330 -21 -19 152 -40 140 -52 -8 -78 -44
3599 -44 -119 56 85 -28 264 136 -125 -271 -142 55 33 209 86 38 -59 -21 -284 109 224 60 -134 -74 -111
3622 -111 -175 35 10 -32 43 -78 -68 0 24 49 2 163 141 18 -80 34 -39 5 87 151 214 -84 1 171 35 -62
3648 -62 -322 -182 -187 89 2 20 -363 150 -40 83 85 174 33 -82 137 99 259 100 143 -26 131 79 61 99
$$ packed form
3481e5L55l36j94M12j85R9J7l5n1j99J68J31J6k72L90l20q3O3KK02j53l42M33
3504F3j83O7J2J8nK66n79M27R0p4j47J47j67J45o1M9j7R8j42k56K75k20K42k56
3528b08M16p7j45l9K35j90o1O8K22m57J6J94J68k46j41R8L3J9J30O7j22J60Qm5
3552A03p1L4k87L91Kk00L85k63k35J64M0n0L4p9K01o4J83n37K57R4p0O0j73J04
3576B3K03m1l27K47q5r1L51l63j19J92j71J0J26k85L09KJ71j92J80j92M4p0L4
3599d4p5J75K9j13K92j28k61j46J29J97k2J76j23m8r7L8k63L93J15j64j94O0l7
3622a11o4K10k5m2P5j21J0O8K4K5m7J61k2j23r8J14p3M4Q2O4O3k98Q5J70j36r7
3648f2k60J40nK76q7J8l83N13j90J23KQ9j41j15K19l8J60j59M3j69J57n2j8L8
$$ plain form
3672 99 -135 -94 82 122 -229 4 -99 -15 363 -144 292 -24 -190 -143 148 -243 -154 46 90 160 153 212 -78 7
3696 7 52 26 -27 55 -92 -190 94 360 -221 -38 97 20 -39 -164 109 -166 238 131 -49 -46 82 -194 -28 -21
3720 -21 -83 11 209 15 -87 75 34 248 -7 181 -64 -105 182 -69 187 167 271 -12 -92 124 -196 165
3742 165 66 121 -110 -40 -215 -69 7 -134 -339 -61 32 -65 70 -37 -22 -90 -180 82 -125 11 121 0 42
3765 42 111 -44 108 181 108 -125 -123 289 -13 79 91 -2 -206 -6 -26 53 -166 100 -82 -183 28 101 -51 143
3789 143 142 -82 -112 -130 92 5 -7 -21 -156 -203 20 37 38 -145 46 -244 58 248 -232 16 123 -72 72 86
3813 86 -177 -226 -69 -92 2 -106 -46 19 -141 115 76 70 -48 171 -108 83 -171 -66 212 -296 -94 -40 95
3836 95 -69 -150 70 -25 -66 91 6 166 -77 176 193 -186 189 183 37 -78 134 6 -96 379 -19 -23 126
$$ packed form
3672I9k34M1J76M0l51K33j03Q4L78n07M36l16j66M7K91l91Q9K00M4P0pN9k90Q5
3696GM5k6n3Q2j47r8K84K66n81J83J35p7n9j25K73k75M04j07j80LJ28k76J66P
3720b1o2R4J98j94j02J62m1K14k55J88k45m1K87k51K56k0J04k83q0K16l20L61
3742A65r9N5k31P0j75J46P6j41k05K78R3r7J35j07J5o8r0K62k07J36J10j21M2
3765D2O9j55J52P3p3k33KM12l02R2J2r3k04K00k0P9k19K66j82j01K11P3j52J94
3789A43jk24l0j8K22q7j2j4j35m7K23J7Jj83J91k90L02J90m80K48J07j95J44J4
3813H6k63m9J57k3R4j08O0O5j60K56l9oj18K19k79J91k54J05K78n08K02N4J35
3836I5j64q1K20r5m1J57q5J60k43K53J7l79L75oj46j15K12j28j02M75l98mJ49
$$ plain form
3859 126 -289 -136 -9 81 100 -35 13 150 -4 81 -11 150 -21 -278 37 8 362 -80 -34 -182 -168 -144 -82
3882 -82 -183 83 122 350 -117 -4 -146 -99 110 -265 41 144 162 29 -169 108 -75 187 -11 -131 6
3903 6 -112 -42 -83 -12 -93 289 -182 -3 90 199 69 197 -41 -97 83 99 56 199 -175 -239 -37 143 1 316
3927 316 11 207 2 -20 71 -25 30 -45 104 -103 -222 -54 -154 -25 64 -35 145 -44 -67 -18 170 -78 -138
3950 -138 -165 -6 -59 -253 45 -160 -151 -230 22 -197 32 42 -200 -39 74 -200 21 259 -237 217 -18 222
3972 222 135 51 59 -234 294 -36 -283 -465 87 -15 172 468 -47 -23 163 -47 68 299 53 269 -127 127
3994 127 57 -218 -99 -131 -109 103 191 61 -184 -156 98 151 101 84 -44 -73 92 -164 -142 -2 254 186 108 -15
4018 -15 -173 -45 67 21 -19 -36 29 -79 -29 58 127 -116 215 147 -49 -174 -119 78 35 -153 -175 58 82 68 -124
$$ packed form
3859A26m15J53J27R0J9j35M8J37j54Q5r2J61j71k57L15k9L54m42M6j48J4K4O2
3882h2j01K66L9K28m67J13j42M7K09l75L06J03J8j33j98K77j83K62j98j20J37
3903Fj18P0m1P1q1L82m71J79R3J09j30J28k38n6J80J6m3J43l74o4K02J80j42L15
3927C16l05J96k05k2R1r6N5p5J49k07j19J68j00J29Q9r9J80j89k3M9J88k48o0
3950a38k7J59n3j94K98k05Rp9K52k19K29J0k42J61J13k74K21K38m96M54k35K40
3972B22q7q4Qk93N28l30k47j82N52j02J87K96n15K4J86k10J15K31k46K16l96K54
3994A27p0k75J19l2K2K12Q8j30k45K8K54N3n0j7j28k9J65k56K2J40K56o8p8j23
4018a5j58J28J12m6m0j7O5j08N0Q7O9k43L31o8j96j25N5J97m3j88k2K33K4j4j92
$$ plain form
4043 -124 -111 -10 -167 -265 -24 235 -46 -43 -97 140 -7 43 195 204 119 -183 -254 44 76 120 253 151 -222 -165
4067 -165 -26 -9 -249 -75 -109 -92 -158 76 -45 6 -20 -150 -68 141 -63 -2 -39 31 -258 8 -194 -161 227 -20
4091 -20 -25 -227 -180 -119 20 -16 -57 130 18 -60 332 3 -117 127 25 -6 283 24 -49 -91 247 106 -131 -64
4115 -64 62 -195 -40 -61 107 219 7 -116 -92 14 93 -149 3 244 -94 -23 137 51 -138 2 -325 183
4137 183 -93 -89 68 -69 -52 84 71 -142 139 -26 -41 -298 125 11 190 -55 9 33 -103 59 -76 57
4159 57 -15 193 84 146 -35 -181 55 -93 -6 -216 -123 -26 -5 -158 115 33 -17 -101 -20 41 -123 96 -91 -130
4183 -130 -93 307 97 -126 18 83 -62 -240 -2 84 61 1 -377 -61 -133 -179 -240 -59 269 -112 41 81 47
4206 47 106 -199 47 7 6 -141 -226 -86 -78 -96 -74 -8 -144 -106 192 208 -77 100 -94 -411 -27 -82 123 -4 -241
$$ packed form
4043a24J3J01j57r8K41K59k81Ln4K37j47N0J52Rq5l02p1K98L2M4J33j02l73N7
4067a65J39J7k40J74l4J7o6K34j21N1k6j30Q2K09k04O1l7P0k89K66k02L3L88k47
4091b0nk02M7O1J39l6m1J87j12p8L92l29j20K44j02l1K89k59p3m2L38j41k37O7
4115f4J26k57J55k1J68J12k12j23K4J06P9k42J52K41l38P1J60q6j89J40l27N08
4137A83k76MJ57j37J7J36j3k13K81j65j5k57M23j14J79k45O4K4j36J62j35J33
4159E7p2K08j09O2j81j46K36j48Q7k10R3R7K1j53K73q2n0q4Q1O1j64K19j87l9
4183a30L7M00k10k23J44O5j45j78K38Q6k3o0l78L16p2m6o1J81L28l81J53M0l4
4206D7N9l05K46m0jj47q5J40Qj8K2O6j36L8K98J6k85J77j94l17L84n5K05j27k37
$$ plain form
4231 -241 -94 10 314 72 316 -12 166 84 282 -105 -124 92 -199 440 -122 -121 -300 -94 173 129 -29 47
4253 47 207 120 37 -9 116 260 -119 69 99 -24 34 22 108 -35 35 75 77 -122 -303 110 195 44 23 -7 53
4278 53 -19 52 84 -25 -15 -134 -65 -4 92 -39 151 -185 55 143 -2 22 -61 104 -128 -113 285 231 -115 -48 20
4303 20 146 -24 -124 87 -36 35 -283 264 -126 336 60 -24 -103 -263 -109 -51 -147 16 72 48 -95 17 38
4326 38 74 63 201 101 -65 329 -69 191 183 42 -247 -172 -94 -29 84 112 84 -168 22 88 -174 -42 59 319
4350 319 145 -310 78 -108 -23 277 -206 179 17 52 62 -139 -22 -42 -116 -181 279 268 30 -340 -3 67 -31
$$ packed form
4231b41J47J04L04k42K44l28J78q2J98l87j9K16k91O39n62Jj79K06K67m4j58P6
4253D7J60q7q3m6J25J44l79J88L0j23N8j2Q6j43P0M0Kj99j81M13Q5j51k1l0O0
4278E3p2P1L2j09J0j19O9O1R6j31J90l36K40Q8j45K4q3J65k32J5L98n4l46O7O8
4303B0J26j70j00K11j23P1l18N47l90M62k76q4p9j60J54N8r6J63N6k4j43J12K1
4326C8L6j1J38j00j66L94l98K60qj41k89P5P8O5J13K8k8k52J90O6k62J32J01K60
4350C19j74m55L88j86Q5L00m83L85j62L5J0k01J17k0p4o5M60j1k38l70L37P0r8
$$ [...]
8191A45
##END NTUPLES=NMR FID
##END=
