##TITLE=1H_DE-172_TEST_PH-Gly`
 200.13Hz, D2O.
 8 sc
 17.8.2026
##JCAMPDX= 6.0         $$ Bruker NMR JCAMP-DX V2.0
##DATA TYPE= NMR FID
##DATA CLASS= NTUPLES
##ORIGIN= UXNMR, Bruker Analytische Messtechnik GmbH
##OWNER= pz
$$ XWIN-NMR		Version 3.5
$$ Mon Aug 17 14:41:05 2026 Russian Standard Time (UT+4h)  she@DPX200
##.OBSERVE FREQUENCY= 200.1313
##.OBSERVE NUCLEUS= ^1H
##.DELAY= (6, 6)
##.ACQUISITION MODE= SIMULTANEOUS
##.ACQUISITION SCHEME= undefined
##.AVERAGES= 8
##.DIGITISER RES= 18
##SPECTROMETER/DATA SYSTEM= spect
##.PULSE SEQUENCE= zg30
##.SOLVENT NAME= D2O
##.SHIFT REFERENCE= (INTERNAL, D2O, 0, 14.3821)
##AUDIT TRAIL= $$ (NUMBER, WHEN, WHO, WHERE, WHAT)
$$ ##TITLE= Audit trail, XWIN-NMR		Version 3.5
$$ ##JCAMPDX= 5.01
$$ ##ORIGIN= Bruker BioSpin GmbH
$$ ##OWNER= she
$$ F:/spectra/data/she/nmr/H-C/1/audita.txt
$$ ##AUDIT TRAIL=  $$ (NUMBER, WHEN, WHO, WHERE, WHAT)
(   1,<2026-08-17 14:39:23.40 +0400>,<she>,<DPX200>,
      <created by zg, POWCHK disabled, PULCHK disabled
       configuration hash MD5:
       00 E9 B6 7A A2 85 ED C7 34 08 36 98 17 FE 4E 26
       data hash MD5: 16K
       67 CA A4 DF B7 83 38 84 38 15 F4 98 D6 BA 38 47>)
$$ ##END=
$$ 
$$ hash MD5
$$ 12 B8 EF 62 B9 FF 44 3D 60 7D C0 B1 04 69 62 C9
##$RELAX= 
##$RELAX= 
##$RELAX= 
##$RELAX= 
##$RELAX= 
##$RELAX= 
$$ Bruker specific parameters
$$ --------------------------
##$DU= <F:/spectra>
##$EXPNO= 1
##$NAME= <H-C>
##$PROCNO= 1
##$TYPE= <nmr>
##$USER= <she>
##$AMP= (0..31)
100 100 100 100 100 100 100 100 100 100 100 100 100 100 100 100 100 100 
100 100 100 100 100 100 100 100 100 100 100 100 100 100 
##$AQSEQ= 0
##$AQ_mod= 1
##$AUNM= <au_zg>
##$AUTOPOS= <>
##$BF1= 200.13
##$BF2= 200.13
##$BF3= 200.13
##$BF4= 200.13
##$BF5= 200.13
##$BF6= 200.13
##$BF7= 200.13
##$BF8= 200.13
##$BYTORDA= 1
##$CFDGTYP= 0
##$CFRGTYP= 5
##$CHEMSTR= <none>
##$CNST= (0..31)
1 1 145 1 1 1 1 1 1 1 1 1 1 1 1 1 1 1 1 1 1 1 1 1 1 1 1 1 1 1 1 1 
##$CPDPRG= <>
##$CPDPRG1= <>
##$CPDPRG2= <>
##$CPDPRG3= <>
##$CPDPRG4= <mlev>
##$CPDPRG5= <mlev>
##$CPDPRG6= <mlev>
##$CPDPRG7= <mlev>
##$CPDPRG8= <mlev>
##$CPDPRGB= <>
##$CPDPRGT= <>
##$D= (0..31)
0 0.7 0 0 0 0 0 0 0 0 0 0.03 0 0 0 0 0 0 0 0 0 0 0 0 0 0 0 0 0 0 0 0 
##$DATE= 1786963162
##$DBL= (0..7)
120 120 120 120 120 120 120 120 
##$DBP= (0..7)
150 150 150 150 150 150 150 150 
##$DBP07= 0
##$DBPNAM0= <>
##$DBPNAM1= <>
##$DBPNAM2= <>
##$DBPNAM3= <>
##$DBPNAM4= <>
##$DBPNAM5= <>
##$DBPNAM6= <>
##$DBPNAM7= <>
##$DBPOAL= (0..7)
0.5 0.5 0.5 0.5 0.5 0.5 0.5 0.5 
##$DBPOFFS= (0..7)
0 0 0 0 0 0 0 0 
##$DE= 6
##$DECBNUC= <off>
##$DECIM= 32
##$DECNUC= <off>
##$DECSTAT= 4
##$DIGMOD= 1
##$DIGTYP= 9
##$DL= (0..7)
0 120 120 120 120 120 120 120 
##$DP= (0..7)
150 150 150 150 150 150 150 150 
##$DP07= 0
##$DPNAME0= <>
##$DPNAME1= <>
##$DPNAME2= <>
##$DPNAME3= <>
##$DPNAME4= <>
##$DPNAME5= <>
##$DPNAME6= <>
##$DPNAME7= <>
##$DPOAL= (0..7)
0.5 0.5 0.5 0.5 0.5 0.5 0.5 0.5 
##$DPOFFS= (0..7)
0 0 0 0 0 0 0 0 
##$DQDMODE= 0
##$DR= 18
##$DS= 0
##$DSLIST= <SSSSSSSSSSSSSSS>
$$ [...]
##$SUBNAM0= <"">
##$SUBNAM1= <"">
##$SUBNAM2= <"">
##$SUBNAM3= <"">
##$SUBNAM4= <"">
##$SUBNAM5= <"">
##$SUBNAM6= <"">
##$SUBNAM7= <"">
##$SUBNAM8= <"">
##$SUBNAM9= <"">
##$SW= 18.0517328524113
##$SWIBOX= (0..15)
0 0 2 0 0 0 0 0 0 0 0 0 0 0 0 0 
##$SW_h= 3612.71676300578
##$TD= 16384
##$TD0= 1
##$TE= 0
##$TE2= 300
##$TE3= 300
##$TEG= 300
##$TL= (0..7)
0 120 120 120 120 120 120 120 
##$TP= (0..7)
150 150 150 150 150 150 150 150 
##$TP07= 0
##$TPNAME0= <>
##$TPNAME1= <>
##$TPNAME2= <>
##$TPNAME3= <>
##$TPNAME4= <>
##$TPNAME5= <>
##$TPNAME6= <>
##$TPNAME7= <>
##$TPOAL= (0..7)
0.5 0.5 0.5 0.5 0.5 0.5 0.5 0.5 
##$TPOFFS= (0..7)
0 0 0 0 0 0 0 0 
##$TUNHIN= 0
##$TUNHOUT= 0
##$TUNXOUT= 0
##$USERA1= <user>
##$USERA2= <user>
##$USERA3= <user>
##$USERA4= <user>
##$USERA5= <user>
##$V9= 5
##$VALIST= <valist>
##$VCLIST= <CCCCCCCCCCCCCCC>
##$VD= 0
##$VDLIST= <DDDDDDDDDDDDDDD>
##$VPLIST= <PPPPPPPPPPPPPPP>
##$VTLIST= <TTTTTTTTTTTTTTT>
##$WBST= 1024
##$WBSW= 4
##$XGAIN= (0..3)
0 0 0 0 
##$XL= 0
##$YL= 0
##$YMAX_a= 689097
##$YMIN_a= -635038
##$ZGOPTNS= <>
##$ZL1= 120
##$ZL2= 120
##$ZL3= 120
##$ZL4= 120
##$ABSF1= 10
##$ABSF2= 0
##$ABSG= 5
##$ABSL= 3
##$ALPHA= 0
##$AQORDER= 0
##$ASSFAC= 0
##$ASSFACI= 0
##$ASSFACX= 0
##$ASSWID= 0
##$AUNMP= <proc_1d>
##$AZFE= 0.1
##$AZFW= 0.1
##$BCFW= 1
##$BC_mod= 2
##$BYTORDP= 1
##$COROFFS= 0
##$CY= -3
##$DATMOD= 1
##$DC= 2
##$DFILT= <>
##$DTYPP= 0
##$F1P= 0
##$F2P= 0
##$FCOR= 0.5
##$FTSIZE= 0
##$FT_mod= 4
##$GAMMA= 1
##$GB= 0.15
##$INTBC= 1
##$INTSCL= 1
##$ISEN= 128
##$LB= 0.25
##$LEV0= 0
##$LPBIN= 0
##$MAXI= 10000
##$MC2= 0
##$MEAN= 0
##$ME_mod= 0
##$MI= 1.114404
##$NCOEF= 0
##$NC_proc= 0
##$NLEV= 6
##$NOISF1= 3.799351
##$NOISF2= 2.8
##$NSP= 1
##$NTH_PI= 0
##$NZP= 0
##$OFFSET= 14.38212
##$PC= 1
##$PHC0= -4226.462
##$PHC1= 14.9923
##$PH_mod= 1
##$PKNL= yes
##$PPARMOD= 0
##$PSCAL= 0
##$PSIGN= 0
##$REVERSE= no
##$SF= 200.129724274929
##$SI= 16384
##$SIGF1= 3
##$SIGF2= 2
##$SINO= 400
##$SIOLD= 16384
##$SREGLST= <1H.CDCl3>
##$SSB= 0
##$STSI= 0
##$STSR= 0
##$SW_p= 3205.1282051282
##$SYMM= 0
##$S_DEV= 0
##$TDeff= 0
##$TDoff= 0
##$TI= <>
##$TILT= no
##$TM1= 0
##$TM2= 0
##$TOPLEV= 0
##$USERP1= <user>
##$USERP2= <user>
##$USERP3= <user>
##$USERP4= <user>
##$USERP5= <user>
##$WDW= 1
##$XDIM= 8192
##$YMAX_p= 0
##$YMIN_p= 0
$$ End of Bruker specific parameters
$$ ---------------------------------
##NTUPLES= NMR FID
##VAR_NAME=  TIME,          FID/REAL,        FID/IMAG
##SYMBOL=    X,             R,               I
##VAR_TYPE=  INDEPENDENT,   DEPENDENT,       DEPENDENT
##VAR_FORM=  AFFN,          ASDF,            ASDF
##VAR_DIM=   8192,          8192,            8192
##UNITS=     SECONDS,       ARBITRARY UNITS, ARBITRARY UNITS
##FACTOR=    0.0002768,     1,               1
##FIRST=     0,             0,               0
##LAST=      2.2672688,     0,               0
##MIN=       0,             -635038,         0
##MAX=       2.2672688,     689097,          0
$$ Real data points
##PAGE= N=1
##DATA TABLE= (X++(R..R)), XYDATA
0@%%%%%%%%%%%%JjQj6J6j6J6k4L2l3M1m8N6o8Q0r6J09j25J44j63J88k11K39k70
36a41L04l46L84m29M80n32N92o57P28q06Q89r81J081j192J312j445J594j756J938
55A017k141K370k631K929l279L691m183M790n552O545p904R886j3062J9059m6498
70c4963K85179K87683j4028o7489j96518l58547l87258j20946J46537K72939K90912
81A03501K88742J58043o4537k52704l17705l03838j68617O8789K66349K89002
91F7025K37652J83968M0790k22555l74047k74312q6318Q149J01479K70737L49244
102C01812J87596n9223j86614k16082k46011k11613m0266J68351K69404K56226
112B23580J75777L6591j28171k32575k43981j92180p3761J08254K51199K50109
$$ y = [0, 0, 0, 0, 0, 0, 0, 0, 0, 0, 0, 0, 0, 1, 0, 8, -8, 8, -8, 8, -16, 16, -17, 24, -24, 32, -36, 44, -52, 57, -68, 76, -87, 101, -110, 129, -141, 163, -183, 201, -228, 252, -280, 312, -345, 383, -423, 466, -515, 566, -626, 686, -759, 835, -921, 1017, -1124, 1246, -1385, 1544, -1735, 1956, -2227, 2563, -2989, 3556, -4348, 5538, -7524, 11535, -34963, 250216, 537899, 523871, 456382, 259864, -98683, -485941, -606887, -460350, -187411, 103501, 392243, 550286, 485749, 233045, -84660, -388498, -557115, -488326, -221977, 67025, 304677, 488645, 529435, 306880, -67167, -341479, -427797, -419648, -318169, -47432, 301812, 489408, 430185, 243571, 27489, -218522, -430135, -470401, -302050, -32646, 223580, 399357, 435948, 307777, 75202, -168779, -360959, -434720, -326466, -75267, 174842]
122A74842J48710N1118n0120j90575k80754k07760l2742R9397J62270K10633K14693
133B99712J04094p4654j97300k17815j76653r3217L3908J59447K18830J91681
143B48033R7666l3829j53820k05764j77575r9089Q658J29590K11929J96417R7413
154C19629j8238j11139j77456j93996j27540N27J17363J74552J72740J19088K0450
165B95980r4104j72188j78698j19536j9563Q4984J58248J73551J26418L3475p3326
176B15241j52405j71762j26653l9954N9316J37217J65743J30684M6746n1264j28631
187H4278j58520j29418n2565M2007J20035J54252J32152N9833l3178j11516j48312
198d0952j32141o7229K1786J01163J40873J30589P2542j3278r3111j34900j25348
$$ y = [174842, 323552, 374670, 324550, 133975, -146779, -354539, -387281, -287884, -125614, 85019, 299712, 403806, 329152, 131852, -85963, -262616, -355833, -321925, -162478, 56352, 248033, 345699, 311870, 158050, -47714, -225289, -324378, -315720, -186130, 25799, 222216, 319629, 301391, 190252, 12796, -181200, -308740, -308213, -190850, -16298, 156442, 275530, 295980, 201876, 29688, -149010, -268546, -288109, -203125, -44877, 128674, 255092, 288567, 215241, 62836, -108926, -235579, -275533, -216217, -79000, 86743, 217427, 264173, 212909, 84278, -74242, -203660, -256225, -214218, -94183, 60069, 192221, 252054, 218876, 107360, -40952, -173093, -240322, -218536, -117373, 23500, 154089, 226631, 213353, 120242, -14658, -140006]
209a40006p4568K907Q3182J33147J27992P4984N30p1556j22077j29594q4679p388
221b07126O7292J13595J21637Q6768J8254n7349j08678j19447q6808k2313N0509
232a43666J02597J15006Q8608K9780m1240r8856j15464q8230l2680L0924Q6904
243f6317J12877R3754L6966k8455p9571j03376r2123m4748K1310P6739J01566
254B8622Q9314M7023j3806o9203r8941r1210n0837P261O2554R4096R0077N3531
266A48481m01n4924q9210q9113n5670k311M9521Q3132Q7200N8933P614m5266q0101
279A7885q5513o0456j3709L8434P5571Q4097O2020J7986l1875o9560q1363o3183
291a09666k1445K7253O5222P8649O3412K5006k2578o1323p6953o4048k8581J6901
$$ y = [-140006, -214574, -211667, -128485, 4662, 132654, 207638, 208168, 136612, 14535, -115059, -199738, -207126, -139834, -26239, 95398, 182166, 200420, 143071, 34393, -85054, -171862, -194175, -143666, -41069, 73937, 162545, 192325, 151085, 52229, -63235, -151465, -184145, -153221, -66317, 46560, 140314, 177280, 148825, 69254, -34122, -126245, -170993, -149683, -72944, 28622, 117936, 164959, 151153, 81950, -16991, -108201, -159038, -151777, -89223, 4873, 94950, 148481, 148080, 93156, 3946, -85167, -140837, -143148, -93627, -10495, 76705, 135638, 143252, 97986, 17885, -67628, -128084, -141793, -103359, -27788, 56309, 118329, 136315, 104440, 34880, -46483, -109666, -131111, -103858, -38636, 40013, 103425, 128431, 105853, 44530, -32423, -96471, -125052, -108151]
303a08151N5715P4827O5139L1996j2254n0618p0518o4697l4516P585M6435O7422
315H365O4030L6570l733m2244o4940o3811l9088q46L7830O1885O3093M1403N394
328A03908l2876n7913o2037m2906q267K8197N4183O0362M4072J1535k4648n1274
340B2336n8973m5283j5340K0622M8494N7716M5807J8130j5385m3863n6345m7373
352f9457k0248J3124L9817N3001M7052K3569r370l8092n1415m6521k5247N459
364g8328L3810M9937M7453K7420k272l0398m7263m6322k8818j704K6653M5502
376d330M6013K9463K804k3334m1312m6020l2086n928K2088M0398M3135L2414R692
389G2997j7291l8205m3478l2920j0771J4472L4412M1435L3836J3207j2114l2813
$$ y = [-108151, -52436, 22391, 87530, 119526, 107272, 56654, -13864, -78561, -113077, -105492, -59057, 8365, 72395, 108965, 105232, 62988, -1952, -65763, -104851, -105697, -67867, -5982, 57111, 98514, 103908, 71032, 13119, -48918, -91824, -100091, -71894, -17711, 42651, 86723, 98258, 73610, 22336, -36637, -81920, -97260, -76638, -28144, 29572, 75379, 93509, 78124, 34261, -22084, -69457, -89705, -76581, -36764, 16237, 63289, 86858, 77488, 39396, -12019, -58540, -83787, -78328, -44518, 5419, 52872, 80292, 78020, 47622, 359, -45963, -74781, -76485, -49832, -4330, 41683, 71146, 73950, 50616, 9304, -36716, -68802, -74730, -52642, -12244, 30891, 63305, 72997, 55706, 17501, -25977, -58897, -69668, -55196, -20784, 20651, 54487, 67694, 55580, 22767]
401B2767m0485l3134j4253Q716K9425L9473L4959J6513p519k7195l6782l4188
413d1703j8696L916K4865L5914L3567J8877j727k1932l3898l3665k0415l5K0150
426c4782L2403L2670K1372K772j7437l0950l2342k2038m511J4826K8880L1528
438B2391K2528N555j2452k6044l1378k3332p167J1657K4699K8926K4186R391r064
451C9896k3907k8577k3277j0581O650K1347K7226K4049J1637m815j9973k6970
463g295k3075j1242K418J6803K6321K4837J2545l623j5257k2204k3808j6194M70
476c9304J5987K2399K1783J4319K331j2085k1891k2478j5255k381J0947K0833
488d795K1312J4693M566q007j9757k3431j5241k408P207J4789K0597J8903O574
$$ y = [22767, -17718, -50852, -65105, -56389, -26964, 12509, 47468, 63981, 56462, 29267, -7515, -41703, -60399, -56483, -31618, 4296, 37863, 56740, 55013, 33081, -817, -34482, -54897, -54932, -34782, -2379, 30291, 51663, 54435, 36998, 6048, -26294, -48332, -52843, -38017, -9137, 22391, 44919, 50474, 38022, 11978, -19400, -42732, -49899, -38242, -13543, 15383, 39569, 48960, 39896, 15989, -12588, -35865, -46446, -39796, -18449, 8777, 32826, 44463, 39648, 19675, -7295, -30370, -41612, -39194, -22391, 3930, 28767, 41312, 37689, 22432, 228, -23580, -39774, -39304, -23317, -918, 20865, 35184, 37515, 25430, 3539, -18939, -34194, -36575, -25628, -4795, 16517, 31210, 35776, 27769, 8012, -15419, -30660, -33068, -25861, -11072, 9525, 28428, 35002]
501C5002q972j6718j7615j5358q743L832J6254K0275J5482O672l228j2971j8317
514d405j6362q632J419J2935J8424J5965P288r65q871j5962j8458j0688K650J1137
528a4525J3392J4087J2087K556r930j6654j4388q806k372O030J3830J5758J1134
541B2199K585o897j2834j4288j0327l560M122J1651J5250J2156K471n445r725
554G358j1944j2312o524L998J2056J2465R468N537p18q910j3814j1565m587J806
568a7686P835J1129J0831O878m05p413j1873j1240n675M44N810R471J1713P887
582A7706K93o988r449r303p236k438M745J0085J0610O521J529l698q317j0015
596e955q067k331L722Q083R710P073L006k119p233r746p837l227K619O434Q397
$$ y = [35002, 26030, 9312, -8303, -23661, -32404, -28572, -12318, 7957, 23439, 30111, 26883, 13912, -4405, -20767, -29399, -27980, -15045, 3379, 19344, 26632, 25667, 16796, 834, -17624, -28312, -25662, -14525, -1133, 12954, 25041, 27597, 17667, 1013, -13375, -22181, -24553, -18523, -4693, 11065, 22199, 24784, 17887, 5053, -9235, -19562, -23122, -19000, -7349, 7901, 20057, 22528, 17083, 7358, -4586, -16898, -23422, -19424, -7368, 5097, 14565, 20102, 19384, 10474, -3340, -14905, -19492, -17686, -9851, 1278, 12109, 18987, 18582, 11169, -704, -11944, -17619, -17175, -11365, -1894, 9819, 17706, 17999, 11011, 1562, -7741, -14977, -17415, -12670, -2585, 8025, 14546, 16075, 12377, 4060, -5955, -14022, -16353, -12631, -4548, 5162, 12235, 15241, 13122, 5889, -3857, -11694, -14921, -12302, -5868, 2529]
611B529P505M249j122o803q426p256l739N21N253Q144P678M271k44n018p324p363
627g145m563o46M503O864P596M733M13l506o472p090n336j160L357O298O677N122
643I645J736k639n686o944n126j718J933N726O090N129K309j951m485o177n401
658g559k511J172M333O278N335K586p94m068n657n455k646K71L632N265N178L206
674H566r0l248n029n104l280k21K911M880M802L431N65k376m714m604l761n30
690g802J868M151M743L515J112j581m119m455l308j663J604L618M227L505J688
705G103j075l292m196l506j728R50K685L990L378K117m63k458l991l566j751J36
721e667K332L445L429K050q5j865l232l581k038r2J559L199L308K206K16j528
$$ y = [2529, 10034, 14283, 13161, 6358, -2068, -9324, -13063, -12542, -7289, 855, 8533, 12804, 12560, 7542, 218, -7145, -11708, -12354, -7851, -987, 6609, 11342, 11755, 8249, 1777, -5313, -10649, -11809, -8452, -2154, 4523, 9645, 11381, 8742, 3056, -3888, -9014, -10732, -8799, -3073, 3017, 8146, 10455, 8504, 4019, -2158, -7559, -10070, -8898, -4565, 1713, 7048, 9634, 8840, 4772, -885, -6340, -8986, -8715, -5083, 182, 5360, 8566, 8476, 5228, 199, -4905, -8185, -8406, -5495, -615, 4187, 7618, 8183, 5807, 1093, -3511, -7272, -7802, -5934, -1783, 2960, 6475, 7587, 6006, 1887, -2568, -5876, -7539, -5935, -2317, 1910, 5415, 7103, 6028, 2736, -1460, -4966, -6694, -5744, -3059, 931, 4309, 6426, 5963, 3505, -486, -4052, -5803, -5667, -3335, 110, 3539, 5589, 5504, 3639, 407, -3174, -5212, -5304, -3745, -546, 2762, 4968, 5184, 3656]
737C656k902l124k159o09J427K490L005K426O56j077k289l039k357o31N91K240
753a696K945K273Q40m69k072k630k348j100K87K069K339K305J436m16j592k326
769a55k369j269nJ505K254K241J413J28j356k226k056j562k63J217J867K325J464
786C153L19q50j924k080j590j05O70J418K243J543N51o19j663j920j656p64P43
803b531J193K022J321R07n76r89j811j600p60M08Q93J585J838O48q2r28j721j218
821a401j044p4Q93J411J637R78qp79j313j337j008o8M57J345J172J199Q4n53q75
840G16j430q28o16M87R07J255J294K29l12j000j211j083k12J13J076R24Q90M96
858A695N6r34r10j116m24J42O26Q20J184O22M0o67j033r31p71N2N65R22P82P22
$$ y = [3656, 754, -2370, -4529, -5138, -3711, -1221, 1784, 4210, 4866, 3789, 1500, -1539, -3896, -4527, -3936, -1696, 1249, 3522, 4362, 3893, 1821, -809, -3157, -4257, -3970, -1901, 438, 2743, 4179, 3763, 2171, -155, -2524, -3793, -3798, -2293, -39, 2202, 3615, 3743, 2387, 161, -1895, -3457, -3720, -2503, -636, 1689, 3153, 3472, 2622, 698, -1382, -2972, -3077, -2407, -989, 1254, 2797, 3348, 2729, 1066, -854, -2510, -3274, -2531, -1338, 684, 2005, 2912, 2336, 1347, -464, -2064, -2824, -2416, -1523, 62, 1900, 2548, 2466, 1538, -183, -1401, -2445, -2519, -1626, -215, 1422, 2400, 2392, 1613, 300, -1037, -2045, -2113, -1656, -311, 861, 2060, 2144, 1591, 716, -714, -1542, -2158, -1671, -764, 491, 1785, 2014, 1702, 702, -509, -1592, -1804, -1691, -615, 309, 1199, 1695, 1751, 817, -93, -1209, -1633, -1491, -865, -45, 1139, 1761, 1801, 1134, 101, -830, -1601, -1549, -984, -62, 720, 1442]
878A442L39n00j089p89p67j44J50J254O27O17L59m84n78r19q28k52M39Q56M82
897B15Q43K02j45o98p85p09l24K93P01N92N01O91l20l63q48m88m37k6L69P50O40
918F54L34J09j96q89p84j56l03O30N13O26M13K5m06l33o52l42k75L60L90O33N82
939I33O0l21m98n58k92j92J46M16M76O35l4L3l02q40l08k41K7M32N80K56N99k28
961G79l35n96m22k3JJ49L86L84K00K17j49o17k11l87r9J17L20N73L20LN5n81l13
984b29j46k85J45N72M4K80K97k25k11j79n88r7K65O8N26q4M23j35l11k18k01j86
1006d75j06L01L11m4M71J22j98k51l89l48J72J1K30M59J51kk8l96j54l77J7L7
1028d86M33K13J36J92j25k58r1l64J8J98P7J06K30j51J53k13p9l39N6l21M40k2
$$ y = [1442, 1781, 1281, 192, -597, -1364, -1508, -1358, -104, 523, 1140, 1499, 1015, 437, -482, -1310, -1562, -1123, -267, 215, 1058, 1260, 1115, 417, -368, -1077, -1401, -1108, -407, 185, 686, 1377, 1057, 694, -154, -642, -1079, -1105, -736, 14, 654, 988, 1097, 901, 12, -772, -928, -1231, -601, -88, 538, 951, 976, 570, 237, -415, -757, -1032, -672, -282, 351, 933, 993, 672, 174, -384, -676, -868, -722, -306, 170, 805, 771, 804, 502, -338, -646, -887, -860, -428, 152, 408, 1007, 779, 444, -152, -574, -597, -596, -447, -61, 323, 523, 740, 591, -26, -237, -624, -723, -606, -286, 287, 607, 610, 665, 84, -229, -375, -660, -515, 57, 101, 381, 678, 453, 242, 63, -525, -622, -357, -289, 237, 153, 576, 441, 130, -88, -289, -475, -581, -280, 31, -13, 458, 580, 382, 131, -258, -606, -434, -423, -193, 266, 417, 415, 387, -9, -163, -540, -523, -486, -53, 160, 296, 488, 363, 105, 14, -350, -332, -134, -57, 49, 279, 128, 281, 68, -11, -350, -294, -615, -175, -197]
1050a97M80J4j38O7m51Pj71O4lL05Q0J23j43L12n90J68r0J70k21k3K43K28K4j00
1074A58k1j81j03j34J31R8m1L17k9L52n43o1N2j69J42n7O0j80N85p9j63j49k0
1097c5j21N1J43p1K36j25PN4j96Q7j50J02L6j02K24k85K72L8j28J42l44m1J10
1120i6j10K58J1R4k39J13k0j2%J38j91lJ6N8J18l09M5J4P3p0J5q2K61L7j38L28
1146C09l34lK87l98m6K40j88K47j53J04K23j54n0j40l47K96K1m6L96k70J42q4
1168E2j03R9J22j30j74J20j33M47n03L70l30L9L9J20k3R8k42kK57j96j73J76J91
1191A21k23K7K42k26J22o2M9j91J35q5J78q2r1l5J44K5O6j39J02j3j87R8K5j13
1215a13L57M5k98j07J0K4k43L55p9p1J83j50J68j8J6n8j62J58n4K12M4j48M2q5
$$ y = [-197, 283, 297, 159, 226, -225, -218, -389, -325, -328, -23, 57, 180, 37, 349, -241, -73, -163, 7, -214, -237, 6, 234, 258, 158, 137, -44, -147, -281, -150, -52, -93, 224, 195, 547, 4, -57, -5, -174, -32, -89, -29, -209, 376, 297, 134, -15, -35, -156, -105, 38, -33, 203, 78, 85, 139, -57, 30, -120, -18, 18, -84, 140, -145, 127, 165, 37, 179, -165, -206, -96, -206, 52, 63, 157, -82, 31, 11, -1, -1, 137, -54, -57, -41, 17, 135, -174, -129, -115, -42, -112, -97, -179, 82, 119, -19, 309, -25, -28, 259, -139, -185, 55, -133, 114, -39, 65, 288, 134, 84, -56, -403, -107, -86, -132, 264, -6, 136, 52, -51, 48, 170, 40, -134, -14, -147, 300, -203, 167, -163, -124, -85, 35, 12, 110, -132, -134, 123, -73, -246, -70, 121, -102, -75, 167, -59, 63, 1, 50, -141, -6, -91, 87, 5, -86, -121, 23, 48, 114, -25, 77, 64, -123, -25, 0, -113, 244, 289, -9, -116, -106, -82, -325, 30, -49, -120, 63, -87, 81, 63, 79, 21, -141, 17, -37, 175, 219, 71, 113, 28]
1239B8%k89M90k55R8k6k15L07j40K93l24oq4kK30k91J9J59M8k15J10Q6K4rmp6
1265d4k5L73k17p6O8l07J31J69p8k4M4N7j34J21j54K31j70K3Q6N7p8j42R9P0j67
1290h7MJ33l10J25rJ54j29O5n7L6J74pq8K6Q4j4k61K02J34r7r5j25K81r0j02N5
1316BJ44k84J67J8j36L42k38P4l3L0j03J4J3Q1Rj75q9L00j53M8Q0l09L63k65J00
1341@n7O6n7J7J4j04L4J72j13p6J71k06M39m22J93k30K74n1l04J76n7J30R8P6
1365A83k82m0K26k0j71J37N9o7K8Q2l07K43P1k92O9J09k07J01R7p3J71p0rOn4
1390a0J8o9K0K35j29l0j04J67J90k12j20l6j8r7L57QJ2j4l11O4j01K97j38R5J00
1415A74o0L3P6k81J08r2K8p9p2L55k3L2l0k81J48k87J10J10j5K1J91k1mj94j95
$$ y = [28, 28, -261, 229, -26, 72, 46, -169, 138, -2, 291, -33, -39, -123, -125, 105, -186, -167, -8, 40, -175, -65, 21, 45, 36, 32, -44, -69, 304, 87, 11, 79, -228, -97, 72, -6, -30, 14, 71, -63, 58, -96, 135, -35, -12, 74, 131, 53, -89, 10, 80, -87, -83, 50, -260, -135, -144, 10, -119, -54, -111, -75, 99, 92, 4, 30, 114, 100, -161, 41, 175, 78, -17, -142, 139, 49, -53, 2, 146, -138, 29, 47, -89, 253, 15, 89, 56, 86, -17, -3, 10, 91, 100, -75, -164, 136, -17, 31, 111, -198, 165, -100, 0, -57, 9, -48, -31, -17, -121, -87, 85, -28, -104, 67, -139, 300, -122, 71, -159, 115, 64, -240, -64, -121, 9, 107, 183, -99, -139, 87, 67, -104, 33, 92, 25, 53, 135, -172, 71, 142, -150, -81, 28, -179, -78, 19, -54, 117, 47, 38, 44, -10, 8, -61, -41, 194, 65, 35, -69, 98, 288, 76, -44, -80, -98, -195, 162, 170, 182, 168, -143, -79, -180, 117, -21, 74, 174, 114, 147, 223, -58, 50, -42, -14, -93, -165, 190, 167, 199, 169, -112, 36, -251, -141, -31, -46, -25, 166, 145, 141, -53, -248]
1440b48K21n1J4o4J39Q8l3R7j03J27l08J21j75K10j61j4M22j05N8l63O8K2j4j28
1464a80L58o7Q6j79Q6j65J22k45j18K39K61k33L93k64j32J7j00q1J35Kl3K93k51
1487e6K40k19jR5j96J32ml0j28K71K8j61ML0j24O0p7LJ52M6M3n3J17q8r1j02n8
1514a67J16j83K60K2km1R1k94R4k06M39j01L2J7j89K51k8l24J63k39J38M05j05
1537A49l5q2j73J77Mj89NnJ27K1N1J45j93j6j09J24O8k30L05L3r2j22J12k10J31
1562dj92J81J55L4j85Q8n0O7q2q5j89Q2OJ01K8j16M15k63O4j91J18j41KO0J75
1587G8r4K69j70p1J4J23k71l3O0j6oK01J8k74J66R1p4l02K50rQ6J07j34K8K51
1612B88l50k2R2K3J40j00M9N5j52p4N5k19L07j82K7J6J46l6j24ok13M02k04j10
$$ y = [-248, -27, -78, -64, -128, 11, 99, 66, 163, 60, 187, -121, 0, -175, 35, -126, -140, 282, 177, 235, -128, -60, -38, -52, -180, 178, 111, 197, 18, 104, -61, 61, -184, -302, -63, 198, -35, 358, 94, -38, -21, -121, -202, -67, -65, -98, 195, -56, 184, -35, -36, 59, -137, -5, -9, -39, -167, 104, 132, -29, -25, 5, -119, -59, -136, -133, 19, 65, 108, 55, 172, 84, -7, -109, -167, -51, -234, 26, 48, 46, 5, 96, -198, -104, -310, 129, 28, 60, 77, -112, 139, 111, -213, -50, -289, -151, 254, 149, 114, 32, -141, 36, 40, -149, -144, -149, -22, -1, 50, 195, 2, -14, -123, 1, 69, -161, 144, 177, 85, -37, 75, -135, -4, -196, -15, 140, 174, -11, 77, 27, 94, 12, -73, -262, -180, -174, -73, -45, -161, 254, -9, 55, -136, -18, -159, -157, -97, 78, -16, 253, 83, 12, 26, 149, -122, -155, -95, -111, -117, 84, 102, -172, -6, 85, 11, -291, -41, -50, 36, 143, 9, 37, 288, -62, -84, 8, 31, 171, 71, 120, 175, 23, -51, 4, -215, 92, -90, -63, -47, 99, 63, -61, -67, -280, 122, -82, -192]
1636a92O5L5MJ91J30k48R5l19J87m1R0j30J55J56l57K20j10lL9J77r0J3Q4j34
1660A7O5q5k8P4O6k45P8K17k28L5q1K09j53P7j14K49k79kK54j86j08K47r0p9O2
1685b8m7m7K77j85J52j23J29o6r7J2J63j10q2p5P3N0J20j12j1J14k52m4J08J80
1709I9l7j31J78k35P0L21k77j48L30j66q9K59j70J28j9rj88%K5K34q1j01j22K47
1733A18R8j96K15l87J58j29M2J17j51K58l51L29l56L18n6p0j19K10M9j06J52m6
1755I7l50K01l5l4J51J29j77Q4n1q3J06K5k51J06L1J07k03J02N1k33K37k47K65
1778B8J09j11O4J45j75r3O5j2M2J5j42l2L8J81J17l5J1j79j82j3J67k2J92k27
1802d9Q0P8o8R6j49J58j96R4L9J5L4k46M75k10j17o3L9J65j70O4j60J16L4J4l1
$$ y = [-192, -127, -92, -88, 103, 233, -15, 80, -239, -52, -93, -3, -133, 22, 178, -179, 41, -69, -72, -33, 144, 54, 67, 151, 17, 82, -3, -31, 43, 109, -136, -58, 159, -69, -34, -115, 94, -59, 18, -96, 153, -126, -128, 126, -60, -168, 79, -11, -90, -28, -75, -122, 155, -30, 122, -1, 128, 62, -35, -23, 140, 30, -52, -127, -54, -4, 116, 4, -7, 107, -145, -189, -81, 99, 62, -69, 109, -126, -56, 265, -12, -160, 170, 4, -85, 174, 4, 132, 113, 104, -84, -84, -59, 175, 94, -7, -129, 118, 216, 20, 235, -152, 6, -123, -81, 36, -115, 143, -208, 121, -235, 83, 27, -43, -162, 48, 97, -9, 143, 97, -253, -52, -87, -121, 30, 159, -18, 66, 15, -68, 38, 63, -188, -82, -51, 56, -147, -45, 6, -227, 10, -237, 28, 137, 26, 90, 235, 60, -33, 32, 20, 62, 77, -65, -97, -59, 122, 239, 204, 215, 36, -146, -159, 8, -14, 178, -49, 31, 109, 41, 137, -12, 146, -50, 44, 83, 98, 132, -114, 361, 151, 34, -29, 10, 175, 5, 69, -91, 25, 59, 73, 42]
1827D2q5L01j35j34K05Q7m47J33K00o8kjk93J59L6J09j20J65k51Q6r7j43J30P2
1851e1J85l28K74k57J95J17m1k75J21M6P4L8p4r6K06O7k88K05k4p2M6K11l25J06
1875F0m4l4n3J09k02L66j87n4J49K2K1j88k0K8J87k15m0K62o1J71j62k53K92j82
1899b8J68m63J91K59K23k16k9j83O5L9k25J72O0j09K53j41k3J3j62K7J3K07k35
1922a24J57o7J87k64q2J31N4N5n3m3%Q6j44N4M9J62K9l94K67n4P1l2j58J69oJ20
1948A70q2n4P2j68jL05k03J0J29l80J41j4J70j59K6L8j34J37j44K43j23m5P2j08
1972a02K00j06J54N3k29j71J27L0J28P2k56J2O8j2J10Nj30l8J41j84Q5K5n1P7
1996Hj3J3J42k04or2J37Q3Q5p6j05p2J96NJ05l18J95J2j30J53n2P2qj45P7l8K7
$$ y = [42, -43, 258, 123, -11, 194, 281, -166, -33, 167, 99, 97, 96, -197, -38, -2, 107, -13, 152, -99, -13, -110, -253, -123, -51, 134, -194, 80, -177, 18, 135, 94, -181, -60, -14, 60, 98, 24, -72, 134, 201, -87, 118, 94, 22, 68, 279, -46, 60, 16, -18, -71, 38, -164, 202, 15, -39, 110, 132, 153, -35, -55, -27, 160, -55, -95, 167, 106, 277, 115, -138, 154, -28, 140, -323, -132, 127, 350, 134, 105, -78, -13, 26, -199, -27, 33, -76, 177, 36, 13, 26, -136, -109, -96, 111, -124, 33, -34, 153, -111, -193, -62, -8, 47, -6, -49, -49, 37, -107, -53, -4, 158, 187, -207, 60, 6, 77, 45, -113, 56, 50, 170, 88, 34, 106, -62, -63, 242, 39, 49, 178, -202, -61, -75, 95, -64, -38, 0, -134, 3, -141, 102, -21, -66, 6, -102, 98, -8, 146, 199, -30, -201, -74, -44, 84, 156, -100, -88, -20, -32, 78, 83, -47, -85, 56, -128, -43, -18, -69, 8, -5, 8, 150, -54, -60, -152, -15, 68, 153, 77, -28, -100, 96, 101, 206, -112, 83, 95, -35, 118, 66, 138, 130, -15, 62, 24, 51]
2023E1M7Omm2j73J11m2L6K24l07l1j08L91l43J75n0K09k98K49k0n1nO7L5k51O8
2049e6K21k83K7J39j33J91n5k20j4Q0L1j5K3k0qJ84J23k35L9M8n3J5Q0l0r3rn0
2076g3Lj35L75K3q4l96L13n2J54q5l1n5J26j00R2k65j27J78K65j73O9K98l55m4
2100g9K01l6j61J18m2K58r0j55j26N1K5L9j00J87j16K75j58j80J57k35L22l42
2122a87J58j37J09p0Q7P8k97K59l1J4Q0j26K05k83K35OK4r7j40K23l8Jr3J54r3
2147D1j16J2M9L0J36r0k41K68j00R9P9k73J07j63K67j85J07j4J36j37rL7n3j97
2171b10M4J86K1J40m12J31Q8J82k46J38l3k25K01R7O8o7o9j4J43o8j05J01j46
2194e5N1pJ68k32J02J30j17k28R9J62L0j47k3K33l43J94J0j11N4M2J4l4N2O0j71
$$ y = [51, 98, 104, 100, 58, -115, -4, -46, -10, 214, -93, -124, -232, 159, -184, -9, -59, 150, -148, 101, 81, 30, 25, 92, 127, -124, -56, 165, -118, -91, 48, -85, 106, 51, -169, -183, -103, -72, -87, -64, -84, -92, 92, 215, -20, 19, 67, 14, 29, 109, 79, -14, -23, -73, -70, -205, 170, 193, 109, -287, 26, -26, 128, 43, 12, -43, 83, -17, 75, -190, -317, -139, 126, -47, 22, 320, -35, -79, 122, 86, -75, 43, 1, 259, 169, 14, -112, -61, -36, 3, -97, 90, -26, 249, 91, -89, 68, -167, 155, -187, -29, -166, -57, -127, -40, 38, -259, 0, -31, -17, 63, -63, 142, -141, 94, 100, 124, 27, -113, 110, 72, 73, -20, 134, 41, -75, -63, -14, 16, 152, 62, -179, 89, -11, 88, 167, -106, 1, -162, 105, -80, 27, 13, 149, 12, 3, 40, -13, -210, -166, 20, 41, 181, -231, -100, -12, 170, -76, 62, 29, -196, 5, 102, 170, 103, 34, 20, 163, 95, -10, 91, -55, -4, -11, 157, -75, 27, 157, 40, -188, -89, 73, 103, -44, -67, 166, -177, 17, 27, -84, -30, 12, 26, -8, 44, 104, -67]
2219f7j4K8K04k56j98J17%L05k18J66Lj25K33J41m46n2L42n2j53O9J34j05R0k51
2243a05J01J61k09L39k49O1j76L79l04kqnj81L66k00J15N3j47q9q5K02r1j31J87
2267a8p8K24k1J59l36q5K73j83J93o8j7n9k1qQ8O9p9O3M1k20J77j9o9R1K9q0N4
2294A00j01O0j69P6k48K56nj49K48p3r4J48j2K5M6Jk24P4J20l1j38K15P5o5j53
2319a8R8K51m62J2K08j26KP4m0J82p2k2j26N0n3j71J18RJ25R0q5m0K2J13j76n5
2345i2J25j49K5J08j80J93Rl4j62J13J48k98J77q9J02j6oP2J39m26O5K51k42L40
2369A73k93J57J28q8K26l02P8j08j49J86J14j60Q0p7J07k84L31j97j51K80j02
2390e1J32M9n2r0J42l34J65J24J2J0j88M5K50j69k34N8j24L13R4j63r1J88k45
$$ y = [-67, -81, -53, 151, -105, -303, -186, -186, 119, -99, 67, 70, -55, 178, 319, -127, -179, 163, 111, -42, 27, 161, 56, 146, -105, -4, 157, -52, 287, 38, 99, -77, 302, -2, -4, -12, -17, -198, 168, -32, 83, 136, -11, -100, -185, 17, -74, -205, -18, -96, 128, 107, 266, -70, -155, 118, -65, 128, 60, 43, -16, -37, -45, 43, 112, 33, 96, 137, -83, 94, 75, 6, 97, 126, 46, 100, -1, 59, -110, -34, -282, -26, -31, -180, 68, -5, -99, 49, 37, 62, 108, 109, -115, -41, 79, 48, -90, 125, 200, 135, -18, 80, 331, -131, -119, 89, -37, -35, 39, -1, 181, 109, 87, -39, 11, -42, -213, -95, -86, 39, 129, 44, 4, 26, 139, -37, -92, 33, -116, -91, 17, -163, 30, 39, 5, -157, -44, 104, -194, -17, -106, -4, -20, -26, 46, 185, -241, -176, 75, -167, 173, -120, 37, 165, 77, 303, 1, 79, -29, -178, 8, 122, -38, 42, -35, 72, -212, 119, -78, -229, 51, -51, 81, 130, 78, -12, 130, -204, -39, 85, 97, 107, -81, -36, 214, 45, -189, -131, -255, 58, 152, -11, -102, 86, -159]
2413a59M0J87p3J89k29lk9R1O5O8j17o8O5p0nJ45k23O4K14k4j07n8K06j52j12
2438i5K25J5j86Q7J1P0l69L3L28o8m7J03k77J90J02l0m1P3j83r7L7P8Q6J6K11
2463B72j63k61K81q7j65j0R8j19J85o6J72o1j36K1J10O4n5j53J65j15n1O5p7K03
2487A17j11k1J0j07J82j05K53j62R0p9q8J9j81O8j3J90r4o7O9O0j35K70j27j07
2511f9j00RK38K3M0R6r2k21j43K05k1O2j01J55k13O8K47j87j1O7p6P4j34K59k51
2536g6K15j57J30p9r6K02J10j13j19RP0k23J88J4P5j72p5L15p1k76p5J24J12j75
2560a43P8J28j44P2j30K18j11J14Q7K4k75K4J75l00J03J09p7R3k16J88N7j60q3
2583a69K93J53l71J46j08J41l35K96j69L36k66K6L0Q3jj13J57j61n3K07N4k64
$$ y = [-159, -119, 68, -5, 184, -45, -48, -77, 14, 79, 147, 30, -38, 27, -43, -48, 97, -126, -62, 152, 128, 21, -37, 169, 17, -95, 130, 145, -41, 46, 57, 127, -242, -209, 119, 51, 4, 107, -170, 20, 122, 92, 51, 124, -59, -156, -119, -41, 45, 61, 272, 109, -152, 129, 42, -123, -133, -35, -154, 31, -35, 137, 76, -60, -39, 71, 135, 80, -73, 92, -23, -74, -9, -86, 117, 6, -15, -5, -112, 70, -35, 218, 56, 146, 67, -21, -2, -183, -115, -128, 62, -32, -99, -30, 30, -105, 165, 38, -69, -169, -160, 78, 101, 141, 237, 145, -76, -219, -14, -35, 27, -74, 81, -132, -64, 183, -4, -15, 52, -24, 50, -84, 175, -76, 139, -18, 112, 33, -63, 139, 249, 136, 17, 26, 96, -127, 61, 75, 150, -22, -97, 218, 147, -129, -204, -80, 32, -143, -65, 63, -81, -9, -139, 79, -32, 82, 169, 193, -82, -58, 117, -183, -80, 29, -48, 45, -171, 17, 74, -86, -169, 124, 277, -94, 52, -56, 85, -250, 46, -123, 213, -53, -27, 3, 86, 85, -28, 129, -32, -85, 122, 176, -88]
2605h8J18j64J83m8J34O5p1j35n2J90k79P5J23J34l67J78j02j0K69j95r6L71j01
2628A32j85k4J45j83Q5r0N8J46j34J64q1K56m14L31l55K17p2q7J70j91N5o6n9
2651a82R1J35Q3q9j7l0K14k34J55j94j8R3N9L2k3p9K8L4o%j1l6R4k8p3m3lK98
2679B50j06Nj24j30M1l7J34o9K80k48Q6n0J37l07K57p4l0J49k24o0K6O6J94k9
2703A37l0q0Po7k39J50J95P6q5r1m0R9k51K50m6QJ2n3J11n7K52j56j62J00j23
2728h3J49k3rR8p7lj21O8Q7j39O6r1J13j67j9K22j34J18J74k02J23l8k30P5R8
2753E5o2N7q5P6k88M40l7k62K66l62J99j5p7K19j81J37kn3M4J7j18l0L09p0j67
2778A0J90l70J79o0J35k09J46Q0M3j90R8p9n2m4J33j23j04J10K12J87l25K09k9
$$ y = [-88, 30, -134, 49, 1, 135, 200, 129, -6, -58, 132, -147, -72, 51, 185, -182, -4, -106, -116, 153, -42, -138, 233, 132, -53, -77, 68, -115, -30, -120, -62, 84, -50, 114, 33, 289, -125, 206, -149, 68, -4, -91, 79, -112, -57, -123, -182, -91, 44, 127, 38, 21, -9, 205, -29, 126, -68, -86, 7, 66, 98, 75, -4, 24, 58, 52, 52, 41, 5, 99, 71, -2, -45, -48, 250, 144, 149, 25, -105, -64, -101, 33, -36, 244, -4, 82, 32, 169, -138, 119, 45, 15, 164, -60, -120, -94, -28, 166, 137, 107, 27, 34, -33, -272, -122, 73, 149, 64, -27, -67, 32, -219, 31, -15, -7, 5, -48, 63, 6, 258, 102, -60, 40, -83, 66, 43, 34, 132, 55, 52, -69, -1, 86, -53, 13, -78, 35, -132, -151, 71, -63, 55, 229, 27, 150, 112, -118, -43, 55, -7, 50, -35, 41, -247, 193, 156, -106, 160, -202, -3, -18, -95, 124, -57, 80, 78, 25, 69, 86, -32, -62, 247, 177, 10, 200, -170, 9, -51, 84, -125, 21, 101, 144, -46, 52, -27, -79, -123, 10, -113, -217, -107, 105, 292, -33, 176, 147]
2801A47j77j58L5R4j21R5J40k19K66j71j2k8Q7M0j46O1K4L1o1J30l9R2o3k17K10
2826D0j41J69%j1j07m9J15J2J44k88J70j67J97N9l48J31L3N6r2R6M0O5l06K56
2850G4j45R5j51J58k69M38l22K26j94j62K20OJ07j12J27j85K5l6J61n7Rp4l3R7
2874CK3P6j40J58j10L5k80J96J8J75j67j49K88j28J52k15J7J05l03K90j13Q4K16
2897B31k48r6J94J17k32j01NJ53J30L9l86M34Q3l20o0n5j45J90r1J59r7q7M24
2920B41k55N3r6R5j2j28P3M3J02j49K0J11k40o1K34q4K89j96K2L3qK6j30J73l15
2945a59R0N3n4J09J5J04r6l1j47R3q0K82l5j81L44k07j05o9P8O4j84L10m34L79
2969A39j72O1K5p7j52P6P7k0k5qj92O50m33m1J65M2k91J31P5N9j5j07J28P8j40
$$ y = [147, -30, -188, -153, -59, -180, -85, 55, -164, 102, -69, -81, -109, -22, 18, -128, -67, -43, -12, -73, 57, 18, 110, 47, -170, 40, -101, 68, 68, 57, -50, -99, 16, 28, 172, -116, 54, -113, 84, 143, -205, -74, -41, 15, -77, 19, 59, 124, -182, 74, -71, 24, -127, 31, -238, 200, -122, 104, -90, -252, -32, -26, 81, -31, 96, -89, -64, -100, 61, 4, 13, -61, -94, 3, 26, 102, -38, 120, 10, 45, -235, -39, -21, 154, -13, -162, 126, -2, 150, -65, -48, 57, -246, 44, -69, 15, 231, -17, -113, 81, 198, -34, -135, -130, 23, 153, 192, -194, 240, 323, 3, -57, -112, -257, -67, -158, 1, -96, -183, 241, -14, 39, -57, 38, 26, -102, -29, 14, 116, -33, -13, 98, -142, -203, 31, -53, 236, 40, 62, 95, 87, 113, -17, 156, -159, -69, -16, -70, 39, 54, 158, 62, 31, -116, -23, -103, 179, 144, -37, 307, 100, -5, -74, 4, 68, -116, 194, -240, 139, -33, 28, 53, -24, -176, -100, -23, -43, -68, -76, -268, 382, -51, -92, 73, 115, -176, -45, 30, 89, 74, -33, 95, 173, 33]
2994C3k6j65K26N7p4l2k13J07J43k24j20M77j31J26k46K70m25K54n4J3K47m38
3016a95L86q7n9j32r0K11l4PK02q4j21J31k00J44N3k09J19RPN0o3R9o1k39M29
3041B73l49p0O1O7j00K10k33j9R6K37l60R1j28KJ32J49l8R2j07M5j9n7lJ29o7
3066C4j7J46l3M2n1J6k77L11k85J41N7m3mj10J86j07o9K30l67J93M3j80J42K37
3090B35L5l19L6rR1Mj09J7j0RJ11j74J02p1L6j0J88l30R1J17k80J89J7r9Q9J5
3116b9R9k38J85p7j2J33k66J1Q0J80j24L8J6j69K11k4k2J86r5K1k08o3Jp3M37
3141A98j92o4p7J14J06j41j8j07K15k2pk52K08J15k53J81j46J13K07j22j90J55
3163B1k26Q4q1J1K36J29k04K97k46J1j86K97o2J26n3k49K65q6K05k75L6n3K1j14
$$ y = [33, 7, -158, 68, 125, 51, 19, -194, -87, 56, -168, -288, 189, 58, 184, -62, 208, -217, 37, -17, -4, 243, -195, 191, 104, 45, -87, -177, 34, 0, 7, 209, 125, 4, 135, -65, 79, 132, -77, 42, 51, 58, 108, 45, 144, 83, -156, 273, -76, -146, -85, -18, -118, 92, -141, -160, -64, 173, -187, -96, -224, -222, -90, 59, 21, 113, 6, 51, 32, -25, -28, 101, 34, 17, 163, 130, 172, 121, 137, -140, 171, -114, 27, 84, 41, 37, -73, 113, 6, -63, 167, -200, -7, 36, -144, -2, 235, 270, -49, -13, -22, 69, 73, -36, -19, -29, -20, 91, -83, 19, -52, -16, -26, 162, -168, -77, 40, -240, -51, -34, -133, -44, -29, 70, -168, 17, -60, -72, 61, -205, -194, -114, 66, -58, -20, -4, -173, 38, 14, -8, 178, 83, 104, -104, -167, -166, -239, 198, 6, -58, -135, -21, 85, -56, -74, -181, 34, 12, 5, -247, -39, 76, -177, 4, -142, -29, 178, 56, -134, 21, -205, -121, -202, -191, 45, 174, -30, 267, 21, 32, -154, 143, 81, 207, 154, -95, 170, 84, 289, 14, 50, -3, 18, -96]
3187i6J86P7j51j00K88m4m4Jj21NK83j01j96P9or1J36L7k35J33j24R2J2j49O5
3212f4l6J23J32o2M6r7k37J94N4j96J92j31K35n1j5M2j26j2P8q2j38R5K03k32
3236h5j6O3K23l83K87J08j07j9j12K35Jk27r2P6k61L39j25q6K55J5j98K6l3J52
3260C6O4k19K29j56J17p6jl8M1k9qp1J76j74L2p2L90r8m8k92J76%j6L6K35m16
3286a82L93k41j06K20k64J54J4j28M2NQL9j01R7MO7j9K19k46k6Q3N8k21K04k61
3311a88J84M4j73m0K41l33J28J88k18J01J68m0K7J3j11K2R1q6k7J52J2j40N1l02
3335b36K79KqJ6q6N4L6R7m20K94J4k44J60L5j28j83L39k5Q3q4k85M56j40k09J42
3360d1J6Q1l2p1k7J39j28J53j71J76l9j10M3L3M9j23J38m5L8p2J13j33n0q6J4
$$ y = [-96, 90, 167, 16, -84, 204, 160, 116, 117, -4, 1, 284, 183, -13, 66, 60, -31, 105, 142, -93, 40, -84, 8, 20, -129, -64, -100, 23, 155, 93, 139, 42, -195, -1, 53, -143, 49, -82, 153, 102, 87, 129, 3, -9, 69, -13, -151, -56, 147, -85, -101, -38, 185, -198, 89, 197, 90, 71, -41, 194, 195, -32, -124, -48, -309, 30, -95, -181, 74, 89, -109, -83, -116, 36, 100, -119, 110, -46, 71, -5, -6, -44, -3, -32, -40, -111, 65, -109, -77, -149, 241, 143, 95, -197, -21, -21, -37, -1, 234, -182, 211, -30, -136, 84, -180, -26, -12, -140, -98, -93, -85, -46, -147, -50, -46, 21, 2, 221, -25, -51, 32, 90, -131, 73, -188, -4, 40, -133, -173, 68, -265, -137, 51, -167, -66, 102, 62, 89, 102, -9, 13, 104, 18, -9, 143, 155, 15, 66, -236, 43, 45, 37, 53, -33, 21, 57, 154, -266, 28, 42, -202, -42, -7, -135, -318, 21, -4, 79, -5, -290, 166, 26, -183, -41, -25, 56, 24, -47, -74, 65, -63, 90, -81, 95, 56, -54, -11, 22, 71, -52, 86, 41, 79, 7, 120, -13, -63, -149, -135]
3385a35J2K67l13K74j78J64j57L5J13j27JKp3K54j70l2J71j69J46j29q5K18J77
3408B66k30Or2J01K5k33Q6l5q5P4J61j71J21j64J41O2j7l9O3l1M6j4m9Nj0Jq3
3435i5K5J18l2kJ85j72Q9m6J14j73j51Q8m4J44k82L46n0J52p7K9K8j96n8O6j63
3460a57J13lJ67j59R3k40J43l11M23j11M0K8Q3j66j5J02p8J64j43n4K5Q7L9J49
3484B19j70l7p3P4j38K12j51J84m7J6j4n7j63K40j42P3j59Q9p8K66n4J83j34n8
3508H1j19J73ql2pn6L4P5j8n9j20k1J80Rj4j21p7N2O9j51O5R5j06M6J53j42o4
3535h3L2J6j43K78K6N3k64l7Q9K47k58J7j7j71L63j92J94k07pj02R3j26J86J52
3559A39R7l74J54P0j23R7L1j48l6J90k06J10M9J35o5MK0l45K65j98J02Q9k31Q3
$$ y = [-135, -123, 144, -169, 105, -73, 91, -66, -31, 82, -45, -44, -42, -115, 139, -31, -63, 108, -61, 85, -44, -129, 89, 266, 36, 42, -50, 51, 76, -157, -71, -106, -191, -117, 44, -127, -6, -170, -29, 33, 16, -23, 40, 9, 55, 41, -8, -3, -13, -12, -95, -70, 48, 16, 14, 199, 27, 116, 70, 184, 11, -140, -52, -96, 48, -234, 112, 62, 214, 137, 166, 194, -2, -60, 6, -157, -44, -47, 120, -39, 54, -186, -43, -354, 69, -42, -2, 26, 109, -57, -72, 30, -48, 116, -27, -81, -56, 31, 70, 219, 49, 12, -61, 13, -125, 87, -64, 120, 73, 89, 75, 18, -145, 95, -47, 26, -133, -44, -122, 144, 90, 273, 139, 81, -38, 135, 127, 95, 88, 32, 66, 141, 123, 64, -56, -77, 103, 112, 98, -23, -100, -48, 21, -130, -65, 30, -76, -30, 123, -19, -83, -51, -35, -178, 100, 126, 179, -85, -122, -33, 214, -44, -27, -44, -215, 148, -44, 150, -57, -64, -166, -73, -199, -13, 139, 236, -138, 16, 86, -37, 60, 91, -57, -93, 97, -109, 1, 50, 185, 120, 124, 144, -201, 64, -134, -32, 57, -174, -91]
3583i1P3J13J47k73J18k4J4r5q1J66k77J50r7O2p2M48k95Q7L3k97J71R2j27N2
3607co6Mj46K66R0j06n9NJ23q6j38J51n8r1K29j24L6k7J18j29J2J30k08P8L5J42
3633A78l9j68l0J02p7L63j71q9j26J58m4J5J8j22J66l63L79k39K55j38q8J83r0
3656C3n1k0J2K4J33j13j25L50l15m6J01j9J98j11m3K2m4j14L14k13j14J29O1j78
3680a29J34J64l07L93k67j60K80J4q7l1M1jj45J26P9m8j99J14J25j16J1pM4m5
3704a7L40l46q6J99m05L98n9nk40L63j56q8K07j33J8jJ13j06J20n0P9j28n0K32
3728A99j83M7LO6N7k11P8j60K2qK23j31j35K91k21LK42k57O7P4qj43J8P9O4o2
3754A4o6M0K2k03n3K00P2j40o9L27l72K56P8o0Pk13M1J36O6k1P8k07q1J10J90
$$ y = [-91, -18, 95, 242, -31, 87, 63, 77, -18, -99, 67, -210, -60, -157, -95, -167, 281, -14, 73, 106, -191, -20, 72, -55, -3, -69, -65, -211, 55, 145, 39, -20, -15, 108, 22, -116, 35, -23, -114, 115, -9, 27, 0, 118, -11, 1, 131, -77, 1, 36, 178, 139, -29, -59, 43, -34, 329, 158, 69, -57, 101, 57, 72, 90, -32, 134, -229, 150, -89, 166, 28, -60, 123, 33, -18, -38, -26, -2, 131, 18, -107, 243, -72, -118, -17, -36, 162, 51, 8, 30, -14, -128, 186, -27, -141, -12, 49, -129, 5, 169, -138, 255, -12, -172, 108, 122, 35, 4, 45, 44, -101, 25, 104, 56, -143, -29, 96, -20, -9, -16, 28, -17, 323, -23, -109, 90, -315, 83, 24, 19, -221, 142, -14, -102, 105, -28, -10, -11, 102, -4, 116, 66, 145, 17, -33, 199, 16, 63, 66, 132, 189, -22, 56, -104, -82, -90, 133, 2, -133, 158, -63, -60, 182, -75, -8, 66, 58, -85, -67, 12, 76, 14, -52, -12, 10, -193, -246, -46, 26, -114, -183, 144, -228, 28, 106, 46, 53, -160, -119, 17, 83, 62, 140, -67, -148, -38, 152]
3779A52j23j51K07Q8l75J42J54j89J48K1j78L62l97Q2m1O3jj8jJ26k40m2J87n1
3803g5J63j96K29M6j85K43k84K6Q0j46K61r8k39J49J74q4M1jj58J67j32l7k06
3826b62K71J34L9L8j60j05k5M6j2J50j8l36J07K68o9j20N7k0Ll0j69K11m5o0R1
3851a6J56k64P3l4j2J31o3qK09l78K16JL8k16J94K9k39K53J70k48j06M5R7P5Q4
3876A87l28J87k21O9K93l12J02n0N4m6O3L87l87K6j23j26J63j43J01J4m2ON5j67
3900b38J88j6J45J16k96rK42l1J3k32QJ28k95J45P2M2J0j51K73k24J06j20R9P9
3924E4o7m5J36k82K66L1k08R5Q5j42J16P5k26J79J46q5p4j30M5m2j6J65ok5NO0
3950A10j7l3j67J62k5J47r4j36J14J27j57J35j12m0p2M9P7q1NJ51j30pj46L0Q3
$$ y = [152, 29, -122, 85, 173, -202, -60, 94, -95, 53, 74, -104, 258, -139, -57, -98, -35, -36, -54, -55, 71, -169, -211, -24, -75, 88, -108, 121, 167, -18, 225, -59, -33, 47, -99, 162, 64, -175, -26, 148, 64, 105, 104, -54, 113, -19, -56, -262, 9, 143, 182, 220, 60, -45, -70, -24, -36, 114, 96, -240, -133, 135, 66, -54, 3, -17, -14, -44, -213, -2, -47, -107, -16, 140, -124, -51, -85, -97, 34, -29, -37, 172, -206, 10, 11, 49, -167, 27, 56, -183, 70, 240, -8, -114, -69, 28, 103, 187, -141, 46, -175, -106, 187, -125, -23, -73, -19, -65, -2, 385, -2, 24, -99, -225, -62, -205, -104, -90, -132, -126, -71, -238, -50, -66, 79, 195, -101, -110, 132, 101, 114, -118, -110, 18, -277, -132, -60, -18, -8, -159, 114, -110, -4, -124, -25, 54, -13, -58, 78, -204, 62, 93, -115, -20, 65, -77, 39, 114, -112, 67, 213, 128, 54, -76, -31, -73, -89, 76, 70, 45, 50, 110, 93, 60, -107, 55, 30, 177, 83, -53, 61, 188, 31, 166, 54, 14, -58, -9, 68, -13, -8, 143, 13, 6, -140, -110, -27]
3975b7k4J22r3J22k30j45L70K3j20n7k34J04K55K4q0J50j19j12R8K22q7k27N5
3998a0N0J9kM2j23P4M9j50k7j8k2j30K42j2j01j9J52J09j42J42j39r7K46K6k05
4023d6K10q9j61K67k35j2l8kO7L5k9J42J1l31J22L2J44j08K1jJ8Q9P3r5j15J02
4049G1j57J99J6r1n2R7K4J19j33l27L08k47J2J51J33l31J40j8K01j1j28k9m6K88
4073A89l03J00LM5k86K71m9j01J52j96J66K46l05R1j76K08j20r8K86k07P2j98
4095b10L50k93L27o9k04R0j72K63L6o7L5Kl1Rq0j79J24qJ08M7J4o1m7o0J76m17
4121c17M42j95L0J81l7p9Mp8M8J8J15k16N4k5L3jk28K16n6L4J17mo0J51O0j11
4147I6j31J52j30J11j39o0Q3P6l1kR7m8j32J14k61J21J0P3J22j97J08j37J02M1
$$ y = [-27, -51, 71, -22, 100, -130, -275, 95, 118, -2, -59, -293, -189, 66, 90, 10, 160, 41, -71, 27, 249, 162, -65, -10, 40, 59, 57, 99, -24, 50, 99, -51, -78, -96, -118, -248, -6, -18, -119, -138, 14, 123, -19, 123, -16, -113, 133, 159, -46, 164, 75, -86, 181, -54, -66, -104, -106, -39, -4, -33, 109, 120, -211, -89, -57, 87, -21, 0, -1, 17, 106, 179, 84, -31, 71, -86, 113, 129, 38, -14, 83, 107, 226, 93, -234, 74, -173, -161, -10, 123, -208, -68, -86, 115, 104, -24, -53, -99, 189, -114, -14, -11, 34, -252, 19, -30, -131, 21, -175, -9, 237, -68, 23, -153, 55, -65, -163, 123, -84, -12, -210, 140, -153, 174, 105, -99, -9, -181, 82, 118, 51, 86, 88, 57, 66, -14, -193, -69, -77, 31, 78, 92, 31, -16, -76, 100, -317, 125, -70, -40, 141, 104, 25, 29, -49, -1, 17, 132, -84, -30, -55, -22, -23, -251, -35, -91, -57, 60, 56, -4, 147, 207, 96, -35, 117, -13, 98, -41, -101, -18, 58, 27, 25, 122, 74, -58, 56, -205, -84, -74, -1, 121, -76, 32, -105, -3, 38]
4171C8o1j89k8L62l68L31q1p3K38r4Q5j82j17K07J14k78J24M4P0q7j48R1J32k55
4195a25M8K9l2J94j66r4J12M1Kj28J00P8N5k61N3P4J1n0J48n1l9j14N2J74j88
4220g7J1J38j04l2j48J98m4J21m3O6J59j58Rk17K7K06j61j64K48J78k34N7k6l7
4244b7o4N8j5j39R2J55q0l1j9N3M2o0j62J39K22j29k13J11Q8k00K58k99J48K12
4268A40l8k51Q7Q4R5N7j59p4q9N2K94j67J51j50J26j76N5j74J2j53K22r6L2K78
4292A58l1J46k04j80L03Nk75J40Q2p9j83J93j56m7K02j44J32j89R4O1R2r1j37
4315a08J24N4k2O6MJk8q5p0J14J32j29j24J32P6j8k01J07k04L92j55j20J63k59
4339a58K52q5K9l04M23m2l06K24j59K37o4n2J4j70K76k54K09k77K83K7j96J53
$$ y = [38, -23, -212, -240, 122, -246, 85, 4, -69, 169, 75, 160, -22, -139, 68, 182, -96, 28, 72, 142, 55, -93, -2, 130, -125, -77, -48, -80, 114, -52, -146, -34, 7, 9, -119, -19, 59, 114, -147, -94, -20, -9, -59, 89, 38, -1, -115, -63, 111, -77, -66, 72, -32, -64, -212, -14, -58, 63, 20, 86, 245, 87, 96, -121, -94, 112, -49, -213, 35, 213, -21, 36, 10, -27, -91, -33, -48, -187, -95, 60, -20, -51, -70, -17, 25, -35, -197, -58, 164, 35, -178, -67, 21, -179, 79, -220, -72, 140, 102, -149, -62, 22, 117, 174, 15, -59, -148, -96, 198, 31, 182, 32, 158, -18, 37, -137, -125, -278, -56, -152, -120, 158, 127, 273, 69, -111, 192, 197, -78, 62, 144, 65, -118, 75, -81, -128, 74, -70, 62, -127, -33, 28, 120, 29, -108, 16, 70, 48, 114, 118, 119, 91, 6, -64, 50, 182, 53, -71, 61, 137, 119, -82, 25, -179, 213, 58, -62, 101, -158, 94, 9, 38, -266, 157, 115, -191, 33, -126, 111, 47, -5, 9, -161, 115, -139, 70, -207, 76, 103, -93, 60]
4361F0m0L8l1j85P1K16j72J22j3k01K30j84R2N6q7p1K04k0R8%j84rJ24k66L5r3
4387b10L40k13j5Q4R0J0k65m0Q6K41j8r1r9K16O8j10l40K29J41k29K77K32k47
4410A37j54m5J05J36l73K40j15Q1q7L7J36m3k82J96L7n1M8J12j98J48M3j61J68
4433A15j76O4J39l17J21N3M0k26J40O3q7J24J10k2k22M4J32r9j61K58j01L10l11
4456iRKQ2k94J97J82j23r0N7n1J95j71r6J55n4J3p6j4J05J26j62nJ67p6M7j77
4482f1J08Q9j00N3o3j04K20o9k87J98j19L59r7j15j35N7K08k08j40M04j36pJ74
4505B29k05J4j32J18O0j48jQ8j34K88r4j40J97k60J94r0j8J44q5oP1k9k00K34
4529I5o1P5j12q4K3J20k8L5j02Rk60L03j2J65j80l4R1l5J35j69M4n9r3r8Q4J11
$$ y = [60, 20, 58, 27, -158, -87, 129, -43, 79, 66, -135, 95, -89, 3, 59, -28, -99, 105, 85, 183, 183, -1, -10, 114, -152, -117, -210, 130, -83, -98, -14, 76, 86, -179, -219, -133, 108, 90, -1, -100, 116, 184, 74, -266, -37, 104, -125, 152, 384, 137, -17, -62, 43, 179, -194, 46, -69, 12, -75, -38, 98, 55, -227, -31, 6, -45, 3, 115, -83, 65, 108, -53, 115, -61, 3, 142, -175, -54, -1, 39, -187, -47, 16, -71, 53, 163, 141, -81, -37, 95, -4, -165, 93, -8, 302, -9, 0, 2, 84, -210, -13, 169, 46, -44, 13, -38, 157, -14, -110, 45, -9, 4, -72, -86, 19, 145, -17, -22, 145, 69, 116, -61, 47, 136, 36, 89, 26, -78, 142, 73, -214, -16, -135, 224, 127, 12, -123, -66, 142, -66, -206, 198, 62, 55, 229, 24, 38, -94, 24, 84, -64, -65, 23, -111, 177, 83, -57, 140, -120, 74, -16, -34, 110, 25, 19, 90, 61, -139, 95, 34, 109, -3, -87, -64, 56, 28, 63, -39, -30, -290, 13, 1, 166, -14, -48, 43, 8, 143, -26, 18, -41, -134, -232, -148, -37]
4555c7J30j51K49j80L6L1L8k25K4J26p9Q2j67K06l1j4N3l3L3Kj66R1JQ5j18QJ90
4582A84k88O2PJ8nO6p2R2k69J06J56J3J67k41lP8o1J21J0p0N2k14K06k13K55j72
4608a5J18K7j27j57J38N6r4J74l3o4Q2p4p3J35j67P0L9k7r0N2q7J22Q8J17k63
4633e3j04K57j58mJ96j04j06M8K7L1j28J66J15j51J44j33R2j86J36On0j13J28
4656E6j85K92j66j55K14k8j6K09m29J50K13l38J16q6K31q3L4j98J43K0PO5p1N4
4680D9k6m2PP0j10P7o6m1K32j06m7j81J79J0J53j28l57N54k95rJ64j47K80k60
4704d0R1P2j70P0k2J2l2M8j9k0j22J50M0Qj36O8J53J3j22J2j93N0N0R7O3J4j8
4731A17j90O5K01k17pK2oJ15Nk09K79j58J34o3q9o1J2L6J93j4k28P3N5j94Q8k31
$$ y = [-37, 93, -58, 191, 11, 47, 78, 116, -109, -85, 41, -38, 44, -123, 83, 52, 38, 91, 58, 91, 93, -73, 18, 19, 104, -14, -6, 184, -104, -42, -35, -17, -22, 44, -28, 64, -205, -99, 57, 70, 237, -4, -7, 71, 10, 131, 141, 71, 123, -91, 115, -98, 157, -15, 103, 130, 3, -154, -16, 40, -54, 120, 87, 23, 105, 31, -42, 93, -74, -4, 35, 8, -82, -30, -117, 5, 93, 210, -53, -157, 100, -58, -62, 134, 30, -76, -28, -1, 30, -98, 68, 183, 32, 176, 43, 135, -51, 85, 91, 41, -72, 56, -129, 163, -3, -158, 56, 28, 12, 221, -208, -58, 155, -183, -67, -153, 78, -5, 29, -169, -26, -6, 1, 66, -5, 49, 23, -19, -12, 58, -52, 25, -41, -82, 150, 44, -3, -184, -5, 5, 158, 30, -327, 227, -68, -77, 87, -60, 220, -40, 51, 123, -47, 23, 1, 13, -19, 29, 10, -10, -132, 18, 58, 66, -70, -2, 151, 164, 42, 54, -139, -89, -39, 58, 121, 135, 117, -73, -8, 193, -24, -31, -9, -15, 100, 105, -104, 175, 17, 151, 88, -1, -62, -50, -14, 179, 165, -63, 10, 65, -129, -41, -272]
4757b72J67K29M9Oj73k19J33L24l69L56m9k60K07R5j97K20k97Q8J18m05J76j5
4779h8j86J93M6j4J26q2j0k0O0j05J0L58l32J31J5j6j44O3m9j03J25R1j23M1O5
4804E2j18K5J0J92J17j91q2P4j74J07L22l44p1J61j16M1R1M9n0J7k56N4NM7Q7
4829D9O5j08p3r3J87r3J16k1j86L55m6l52Q5R2k63M02j47q3J49rj5K0j80K8M03
4854B82l67N9R8Kj36J36N0l17J92K0J27j00j10RL7J60j24J14k14J73m2q8J75k13
4878g7NO7J26k28O9p9L97k04j49r6n2L4M29l97K35j98l9K75j89o2J73qK11k69
4902b6l6K98l86K51j01R0l62N06l9l43J9q3K94n3J4n6QP0j13K13k43N0R5j45K5
4927e3J00k22K93N7o4j92J24lk12J53J39k17R9k7j74K40n6J2J40j43J11j10J27
$$ y = [-272, -105, 124, 173, 179, 6, -213, -80, 244, -125, 231, 182, -78, 129, 224, 27, 247, -50, 38, 156, -249, -73, -88, -274, -81, -35, -49, 77, -5, -15, -35, 25, -80, -70, 288, -44, 87, 102, 86, -58, 5, -44, -147, -22, 69, -54, -13, 52, -66, -41, -31, 161, 278, 87, 5, 79, -95, 12, 334, -10, -81, 80, -36, 5, 96, 145, 95, 112, -144, -90, -85, -38, 49, 114, 6, -67, -160, 27, -66, 50, 29, -157, 198, 152, -200, -115, -23, -286, 116, -31, -114, 35, 26, 11, 31, -149, -121, 282, -85, -26, 72, 74, -62, 74, 124, -193, -1, 19, 146, 46, -64, -55, -18, 142, 18, 132, -82, 91, 49, -39, 136, -77, -72, -5, 121, -107, -38, -117, 280, 76, -73, -169, -221, -187, 242, -155, 80, -118, -157, 118, -71, -133, 40, 32, 243, -26, -62, 236, -150, 101, 0, 90, -272, 234, 195, -148, -129, -212, 82, 29, 43, -13, -5, 65, -48, 165, -78, -28, 67, -78, -53, 47, -175, 118, 175, 111, -81, 43, 40, -172, -19, 120, -97, 2, -25, -199, 41, -15, -3, 137, -6, 105, -5, 122]
4950A22k02R4j09K38j11m3LO4q7K1r6J00N3r2j14L96l16K2n0K77j72k28K68r8
4974f0K8P2J51q4j33P4K0k82K80j16J41nJ2p0m2p2K83r6j33j33L37k75P5K8J41
4999A41l7j89P8J26l24L5J34J11k14K2J17K6j46P5o3Q6j30J13L03j92j92J61l4
5022GK74k07k21K03K5J13p8j61j18L08j23k33K73L7k30J46l00L49L5M5j85J52
5044A11J2j41j21M2K23k12N2J08j37J57J9j70L2m6K49k14l0J81K44m19J43N6j66
5067b7L10j39n8k46K33j11J88j38k48K02j00J14J68k7j04j41J88j36N6O9J32k02
5089a7j96K30j69N1J62r3j13J4J48j2J2q0J63n1nl4q9n1N1J36m6N2j21L1j02K22
5115I3j01L0K3MN3j49L7M4J22l56J02L6J20p0j93L71j60J27j81r2R7O1J59k45
$$ y = [122, -80, 14, -95, 143, 32, -11, -8, 56, -31, -10, -106, -6, 47, -45, -159, 237, -79, -57, -107, 170, -2, -230, 38, -60, -32, 40, 191, 107, -26, 48, 68, -214, 66, -50, 91, 86, 98, 28, -14, -86, 197, 101, -32, -165, 172, -103, -28, 0, 141, 104, -85, -7, 119, -205, -170, -36, 75, -139, -117, 0, 26, -120, -45, -108, -22, -152, -39, 264, 72, -120, 41, 7, 281, 74, -147, 56, 81, 194, 116, -45, -163, 145, 22, -211, 62, 99, -131, 15, -285, 64, 99, 144, -41, 111, 123, -18, -139, -97, 126, -86, -34, 74, -63, 94, 113, -57, -25, -71, 178, -36, -66, 115, 359, -60, 83, 139, -27, 283, 144, 86, -160, 73, -38, 150, 12, -236, -34, -134, -20, 148, 121, 17, -124, 64, -72, -16, 53, 185, -17, -213, 17, -152, -101, 61, -32, -145, -131, 17, 5, 17, -63, 100, 49, 44, 10, -79, -130, -79, 57, 11, 63, -58, -27, -129, 93, -8, 22, 45, 49, 102, -47, -10, 34, 156, -200, -98, -62, 58, -12, -205, 166, 6, 133, -48, -140, -43, 18, 177, -68]
5139f8O1j44J28p1J23RK18k10m6r2M0O8j12J50l5Q4l7J22k7k86J66j92O6J06q5
5164f4K20j59R0k85J78j19J84j47J49j86J68N6K1p0n4J09R7j36m8q3J80n5r9l8
5188i1J79j9j14j60L07j04rp5J16J61l82L80m08J53O8J08k76L1K45j65n6K02o0
5211C1K98m34J01j29P4J15j29J67j95K57nj74L5N1o2J45j71j2J36o7r3J55j74
5234h0%P5J35K00n19J63M9j10m5n5K89mj03m3J26r6J44J1k60K2Lm1J38q3K95q0
5260A31j7m0kn7L6J88m4j21J49%k63nj9R9j56K33L0k33p5L18j2m6q7R3Oj64J78
5287A20p8o5o6mJ08Op8J25o2J74k57P4O2k19L13l47J73q2j26J42P3p7jm8J46K4
5313C0j53j8J03p3K67m9M4rO4j37J45p1o5%j80J33Oj86K75j15j67R8K61k33J40
$$ y = [-68, -7, -151, -23, -94, 29, 38, 256, 46, 0, -92, -52, 16, -96, 54, 19, 103, 66, 188, 161, -125, 41, -151, -85, 21, -64, 156, -3, 87, -198, -20, -139, 45, -102, 47, -139, 29, 85, 106, 36, -18, 91, 188, 52, 4, -79, 101, 46, -53, -91, 88, 69, -45, -205, 102, -2, -11, -86, 30, 191, -191, 189, -219, -66, 2, 110, -166, -135, 110, -55, -111, 91, 31, 329, -105, -4, -133, -59, 56, -73, 94, -101, 156, 151, -23, 12, 63, 1, 146, -25, -37, 99, 32, -61, 94, -80, -80, -5, 130, 330, -189, -26, 23, -87, -132, -187, 102, 98, -5, -48, 78, -18, 126, 137, -123, -101, -98, -139, -1, -84, 211, 131, 114, 74, 72, 15, 51, 239, 195, 74, 223, 223, -40, -45, -64, 35, -121, 112, 142, -91, -166, 152, 140, 94, 7, 100, 106, -58, 120, 42, -23, -89, -93, 15, 21, -57, 68, 6, 180, -77, -3, 59, -160, 153, -194, -21, -103, -229, -87, -14, -91, -92, -140, 6, 30, -123, -141, -38, -111, 156, 107, 151, 142, 206, 69, 214, 143, 78, 78, -102, 31, 37, -149, 126, 11, -156, -58, 203, -30, 110]
5338A10k87J06n9P3J2P0p5j38L40j53K1J13j28J08j00o4J61p0k96K76p9K9p6J74
5362F8j33j0J71j32j2J64j35p3K64j74Q2j26k21O5L12j81nj52R3J82Qj2Q0r8O5
5387I0k02J92p8p1J41p2M0J80k72n5P5P0R2n3Q8l21L02k9r4Q4k7P0j4Q7k21K11
5413B13k06J04k97J38N3j52L4kJ5K30j11j37L5J03j05k3K55o5Mk81K00%n9K36
5437A82j85k07J48Q8j00j65K04K51j00J62l11ol6L4l0J56L6k14j9K0K6Q4l9j88
5461b09M80r3k98J34O5R4j00k05j9M6J85k68K72O5q1P2M9l28J01m2J62j50J23
5484E5J08j61j7nJ47j31p5j08J40j41L34j32J5k0J6J65Lk74j8K18k15L3J75k2
5508I0Q8J5k15J07j23J35j42Q8j62J15L1k38K74q3L6K83j66om1L9K7j17m9p1j2
$$ y = [110, -177, -71, -130, -57, -45, 25, -50, -188, 152, -1, 20, 133, 5, 113, 13, -51, 110, 40, -256, 20, -59, -30, -106, 68, -65, -75, 96, -36, -48, 116, -19, -92, 172, -2, 80, -46, -267, -202, 110, -71, -76, -228, -135, 47, 55, 43, 123, 25, 90, -112, 80, 2, -69, 72, 0, 40, 220, -52, -107, -32, 38, 130, 77, 165, -156, 146, 117, 23, 107, 80, 150, 136, 223, 2, 213, 7, 111, -186, -48, 5, -147, -113, -115, -100, 130, 19, -118, -83, 20, -85, -108, 147, 82, 86, -195, 5, 5, -54, 182, -3, -210, -62, 26, -74, -239, -35, 216, 116, 278, -33, -39, -75, -41, -71, 85, 121, -93, -112, -92, -66, 18, -21, -209, 271, 178, -120, 14, 79, 173, 73, -132, -151, -105, 80, -188, 84, 149, 68, 140, 189, -139, -38, -80, 82, -68, 55, 163, 2, -15, -20, 127, -4, -79, -187, -47, -188, 146, 14, 29, 9, 25, 190, 193, -81, -99, 119, -96, -63, 112, 90, 178, 193, -22, 85, -38, 97, -45, 43, -119, -4, 27, -211, 63, -20, 16, 299, 133, 127, 86, 125, 152, 35, -14, -85, -97]
5533i7K1K1J7O3Q7o5Jj21K1j47J79J07l08K32l7L5m5K16j75Q5j26Q1OL7k44N9
5559i7r3M19l79K54j66R5J12j77K23j84L7Qj67j4K14j18J84k39N9j74J18Q4o5
5582f6J91J82l58P8j65R3O1J65k06Ol%o2J10L8j21P4j76J09oQ4Q8j81J48k1N7
5608A19r0n1j03J57J5j19q3p8L07r3j15J75J70j32p0pL8J7j02K03l77K45k62K10
5632b6K12k37N7k1j28J20P3r4J18j32k2J43q2J78k87N2J04N2j27ON3j10J13J40
5656A55j85j52J39Q4N4o4K36j88l07O1L36j54m3OM0PR0l17J58K0M0r2K46p5j92
5681i7M1J09R8k53J73N4k88J55l4J13K7j22j23M7J41%K0k40J72J28j85j23R9J90
5705A02l01J12K35j40M9j48lJ1rJ58K4l54K38Pj11N0J03l5R1m0n2q2J27J23j56
$$ y = [-97, -76, -55, -38, 25, 112, 47, 48, -73, -52, -199, -20, 87, -221, 11, -26, 9, -36, 180, 5, 90, -36, 45, 51, 88, -156, -97, -190, 229, -150, 104, -62, 33, 145, -32, 191, 7, 44, 52, -115, -129, 85, -33, 151, -88, -29, -203, -85, -1, -66, 125, 307, -51, 27, -138, -45, 16, 181, -25, -19, -22, -22, -84, 26, 64, -57, 17, -159, -50, -56, 28, 116, -65, 83, 62, 119, 29, -22, -125, 32, 47, -72, -155, -233, 74, -19, -134, 41, 211, 79, 9, 2, 40, 57, -45, 158, -219, 26, -236, -26, 186, -51, 6, -15, -143, -23, 50, -44, 74, -58, -80, 63, -19, 159, -128, -76, 28, 80, -47, -41, 12, -98, 15, 155, -30, -182, -43, 41, 95, 31, 267, 79, -228, -167, 169, 15, -28, -22, 18, 25, 115, -202, -44, -24, 16, -76, 170, 95, -97, -56, 53, 151, -102, 71, 125, -163, -8, -42, 71, 98, -24, -147, -100, 41, 41, 61, -179, -7, 121, -64, -187, -88, 102, -199, -87, 148, 8, 57, -91, -94, -83, -92, 66, 90, -264, -26, -19, -130, -80, 23, -12, 79, 39, -13, -95, 32, 155, -1]
5730ao6KK54l53J93r5J08n1j30J78LO5P2n1l08K27j96n8K85k51L44k10J79P2k82
5755g0J00L0Mm0j50J87Q8j0l5k68Q9J65j49J99j70l1m2J52Pj82R2m4j11K60k22
5780a51J17J26j0k12J4K5M6J65j20N7J06p5r8j26j13M05r6j97K37k00J88o4J49
5803A73l28J12R0j07J86k62K8J45j24J47l3o6M3j54J80m2k35L74q3k27J83O3n5
5826Hr3L6P9K2M3j74j20M16k27k1p6n4k4K55nJ29Lj78KP2k61J21r1K84l1j04n1
5853d0J71k24n4K5K61J68k65K10k56M5%J59k19j60N8J99l2j59M6J30n5j82j2J87
5877AL1O7j83K48k2k28R8m1P8N3j58N1J64k66R0O8j20M4K27m10O9o7J61K1J77
5902A53l05L74j25q5l6J04k5r0K87k38J9l8mk5J81m8j4M4j58L1P5j30J1J48j61
$$ y = [-1, -67, -65, 189, -164, 29, -66, 42, -9, -139, 39, 42, 107, 179, 128, -180, 47, -149, -207, 78, -173, 171, -39, 140, 212, -70, 30, 60, 64, 24, -126, 61, 149, 139, 104, -164, -75, 90, -59, 140, -30, -61, -103, 49, 56, -126, -34, -78, -189, 71, -151, -34, 92, 82, -130, -116, -91, -45, 120, 0, 57, 163, 88, -10, -136, -249, 156, 60, -137, 100, -100, 88, 24, 173, -155, -43, 47, -60, 126, -136, -108, 37, -87, 60, 27, -39, 4, -150, 30, -12, -247, 127, 44, -183, 0, 63, 8, -85, -49, 30, 52, 95, -79, -199, 217, -10, -31, -107, -161, -185, 70, 65, 194, 197, 19, 21, 93, -168, -47, -138, 146, 115, 11, -40, 131, -93, -147, -122, 139, 307, 42, 252, -4, 41, 41, 200, -19, -179, -121, 78, 46, -113, -67, 63, 8, -174, -186, 1, 32, 99, -84, 164, 142, -86, 12, -29, 49, 102, -56, -5, 159, -107, -17, 51, -69, -25, 202, -208, -139, -206, -45, -24, 153, -152, 222, 97, 12, -24, 80, 55, -35, 252, 14, 33, -5, -9, -34, 147, 99, 85, 129, -29, 2, 77, -53, -42, 106, -55]
5927e5m4J89j04J3o2j47J41K90m11J14J27k56K16M2J53k92J20O7j68Nl4K70k77
5950a03N3K26q4p2j19J55j68L4M8j62K53k38K02J1Q0l13O9M7J2K61k95J16K5J09
5974A47j03k71L82l92L16J3k06K39k74K79k8J37m05J44k9P8L3rpj37J55j65K52
5997A49k45J49j28J4j17j38L68P4k15J4K04j71O7N2M7j12l2j4L22m80M54l74j95
6020c07M54k46R0L2j46O6K56k23j2J44j89J52J93j29j20m1j09r6J30N6K86pp2
6043A62j43k65R0J72L9p7K5j5pj65K03J78k10L0M0J67j94q0o6Q7mJ06j73N3K13
6068A66k35j43Q9J91k54Q4J22j18J82l3m0M0j33L76l39m1J19o4N8j48P9K11k40
6091g1m6K28K5j13J13j30m7J24k09K41k77J28J55r4k91L15j69K41j61r6K79j82
$$ y = [-55, -99, 90, -14, -1, -63, -210, -69, 221, -190, -76, 51, -205, 11, 53, 206, -86, 34, 101, -67, -62, -96, 174, -103, -50, 176, 92, 20, -99, 56, -112, -78, -30, -192, 61, -177, 25, 36, 116, -197, -128, -81, -69, 192, -103, 13, 38, 147, 44, -227, 155, -237, 79, 92, -114, 125, -149, 130, 102, 239, -166, -22, -51, 27, 60, 51, 44, -93, 62, -103, 149, -96, 53, -75, -61, -178, -316, 52, 126, -89, -75, 129, -42, 25, 77, 124, 12, -20, -34, 288, -192, 262, -112, -307, 147, -99, -9, 23, -123, -57, 199, -24, -36, 108, -81, 71, 264, 135, 15, -26, -135, -231, -101, -45, 241, 234, 162, 19, -246, -156, 16, 55, -22, 3, -12, -19, -184, 19, 197, -13, 17, 57, 224, 30, -50, -116, -29, -33, 73, -100, -47, 166, -69, -212, -123, 68, -186, -102, 20, -98, 84, 51, 11, 51, -82, 294, -45, -86, 33, -31, 27, -121, -42, 169, -71, -117, 111, 136, 23, 136, 6, -41, 83, -126, 115, -162, -34, 121, 27, -264, 51, -118, 123, -38, -134, 145, -37]
6113c7n3P9P1j25K28m3j93J97o4l2J62j52r4M2P1k92J24J40N6p8%j60K19R6k37
6138g5M5j36R8MQ5rj52J22j48L27j10j50J55j0J11q6M0k35J76k00M8J71R0j16
6162D5Qj43J37M0r4R5j2j22J60rk42J59k6J83k67J28j92L96l85J13J36j59J7J17
6186H3j36K1RJ6n4J03J7j17L6j2j32K3M13j82M0j89j2kj4J04j85L67j97j09J69
6211F0k3q9l5LJ09p9K00k10k1j05J35k2K24l6p5j15K09k59O1j08J11l4J76j58
6235h1J01j92J88K9JM0j40M2j53k6L42j42m0J63mj93J25j59J43o3K5L6M7L0j33
6260a4L2j14J91j65M5J78l06R8K94k2j78LqL2j55J68O1k39m1K64N3k0j32L7P9
6285A41m6j48ok7lJ28k0q4j02K70l07K24J42j3q3P3j21k7J39j39J13Kj23J04J54
$$ y = [-37, -90, -11, 60, -65, 163, 120, -73, 124, 60, 28, 190, 38, -56, -14, 57, -235, -111, 29, 85, 7, 7, -153, 66, 162, -75, -30, -166, -68, -64, 21, 12, -140, -18, -166, 161, 51, -99, 56, 46, 157, 71, 111, -124, 52, -148, -100, 71, 161, 45, 53, -90, 47, 87, -7, 88, 76, -46, 114, 105, -137, 22, -4, 179, -88, 40, -152, 244, -141, -28, 108, -51, -34, 83, -53, -32, -23, -7, -61, 42, 59, -58, -22, -34, -166, -143, 270, 88, 128, -61, -73, -75, -89, 15, -170, 197, 0, -109, 60, 37, -52, -87, -84, 25, -54, 146, -64, -85, -190, -55, -77, 147, 111, 36, -79, 130, -129, -68, -176, -65, -99, 77, -81, 20, -172, 16, 45, 46, 86, -54, -12, -165, -191, 151, 9, -31, 132, 128, -65, 60, -99, 44, -19, 6, 42, 89, 119, -14, 18, -96, 95, -70, -25, 153, -153, -55, 239, 217, 39, 42, 34, 66, -89, 79, 140, -99, -140, 124, 177, 157, 25, 62, 141, 95, -53, -59, -86, -89, 39, 19, -65, -167, 103, -204, 20, 162, 149, 66, 139, 18, -9, 130, -9, 104, 106, -17, 87, 241]
6310B41k61o2L23N4m1l40O5j2l9Q9n8J84k47K85kJ50l37pj01J35P1p5Q1p4j21
6335i9j9J09J59k40O8jJ96m7M1Qj71K78l19L7n5k4k4J06J49l76L89k00L0m8P2
6360A9m6K87j38j19k4r9J55M0j4K21l95P7n2J55o7jlk32M09k8j86j76K48q1K3
6385b7M0Q1q3P2Q8j09N9p6R8j94R4P6j63p0l5J14k13J82J10P8j10L8Pj91J83p9
6411c0p2j17L5Q3J9L04j94o1J6J03o3ko9J23r1rJ62r2J32l74K23rk2Ll4K55j46
6438G3o8K32j62Q5l21L20k83P7J59N9j98qN2J08m9j48M8j23O0J50J81k34k7R4
6462G7k98N7L3m9J25K04k72M5K3M1J04l5R0k11P3k80M29L8j07k52P6p1K82l13
6486a91J92r9J63r8N3n1Q7L1lN0j39o3KN2j78L43k07M7K8J01J50k69j23J55o3
$$ y = [241, -20, -82, 241, 295, 254, -86, -21, -33, -72, 17, -41, 143, -104, 181, 179, 329, -8, -15, -116, 19, 90, 15, 96, 22, -99, -118, -9, 150, -90, -22, -23, 173, 126, 167, 175, 4, 282, -37, 0, -55, -79, -103, 3, 152, -224, 165, -35, -5, -53, 19, -27, 260, 122, 3, -21, -120, 35, 75, 61, 282, -113, -36, -88, 67, 0, -1, -4, -236, 173, 145, -41, -217, 31, -50, -27, 13, 94, 11, 83, 171, 62, 121, 45, 143, -51, 43, 119, -44, -114, -149, -35, -248, -66, 44, 122, 12, 50, 57, -134, 49, -30, -102, -219, -184, -101, -82, 222, 28, -33, -17, 86, 23, 21, -48, 75, -16, -25, 137, 45, 177, -197, 26, 17, -5, -2, -36, 219, 73, 5, 237, 75, 160, -161, 159, -124, -47, 112, 171, -27, -35, 17, 125, 76, -72, -24, -147, -87, 63, 244, 10, -17, 77, -221, -164, -131, -180, -55, 149, -123, -78, -55, -14, 90, 55, 145, -66, 7, -273, 156, 194, 87, -165, -89, -160, 122, -191, 1, -98, 65, -33, 20, -31, 56, 87, 84, 134, -5, -68, -66, -14, -192, 151, -56, -9, 19, 120, 270, 1, -122, 33, -30]
6511c0K20k20o9J60j96q0K51j40J65j8k45J91j35J42Q0o7J84k70q9J66l27K85
6533d2K3J44j49o0Q9l5JoJ37j1k07J88j3j14j50NL17k92J68nL4P8R2q6j1j54k3
6560h2K12k73L38j61j05K5M7L4j41J48p9l1Q7nL2n5j49L17M3k51mo6J32p1J49
6585I1j33J98l2k78J17Q0j4N0P6k98J87J2l0k01J71j34k0L6J50K4j51PK51k86
6609a27J70J14l59K68k1j22J75j44RQ5j38J46j31K62j13J17j20K9r5J59k27K87
6631B24k86J02j50O2j95K26J6J45j65J56j46qP6Lkk0j80N0Q1j19J64Q8r7j52K62
6656A35L9j76kN5k4J39n9j64j17K46O8k07K49j95m5J70o0o2o3J04j34J48j57Q8
6680b4Q6j81K52l46L4J33O7R4k23Q0l3p0L30l05k8J18Rr1K55p9k88L64q4J0k09
$$ y = [-30, 190, -30, -99, 61, -135, -215, 36, -104, 61, 43, -202, -11, -146, -4, 76, 9, 193, -77, -166, 0, -327, -42, -19, 125, -24, -84, 5, -30, -29, -35, 102, 91, -116, 72, 59, -55, -205, -200, 117, -175, -7, -12, 22, 100, 192, 106, 95, -59, -82, 130, -143, 195, 34, -71, -46, 1, 35, -106, 42, -37, -68, 19, 14, 46, -9, -158, 159, 202, -49, -53, -119, 13, -58, 91, -42, 156, 124, -154, -37, 43, 29, 79, 155, -143, 44, 56, 26, -175, -4, -138, -158, -122, 28, 52, -99, -92, 159, -127, 43, 157, -202, 66, 45, -77, 98, -46, -37, 48, -90, 56, -75, 187, 74, 191, 71, 100, 5, 164, -63, 224, -62, 40, -110, -48, -243, -17, -1, 144, -21, 135, -11, -19, 57, 60, 58, 38, -142, -92, -11, -130, 34, 122, 25, -127, 135, 174, -2, -4, 51, 27, 166, 107, -57, -174, 72, 140, -67, 182, -13, -58, 112, 52, -10, -73, 31, -103, 45, -112, -24, 62, -119, 133, -213, -179, -46, 21, 115, -108, -28, -61, -131, 199, -106, -134, -16, -7, -98, 157, 78, -210, 154, 70, 80, -129]
6705a29K31j88NL3n8R8q5J6R8J50j56q0J26j49K23k33k5Q8L3Mj15N6j35L26k26
6730i2L92l19K47l01L1QNj82K16J07M7k50l0K03M1k94j3J91J79j35k09J57j5j56
6754a72J38l1J31k0j27J57L4k48M77k95k35L67k62J00p3J43j58K01j13r9J17j08
6776g6J16P4k48j9K60j53j48J82j73L63j03j32P4L0P5k42K47j42J9p5p0L53j17
6799I5k87K14j7k7L6k12K26R7k60O7K17k10K26k03o5J43N4l04J00K20m71L00K55
6822A94k29J01r9j32M5J31k7l6N7J9J87k20P5n2R8j09P8k62M17l45j22K15kO6
6846D8J53n6j43M7k5M6m8o7K22J15m17K11M3m3j83J28q2P4m4k3P0j32K10j09O
6871AM8j75K98q2j78J57j04MM5j20N2k01N44l54kK8l7J11mKk81K25j26LJ85J0
$$ y = [-129, 102, -86, -81, -48, -106, -8, -93, -77, 21, 171, 15, -65, 61, -88, 135, -98, -123, -35, -2, 2, -113, -57, -192, 134, -92, 300, -19, 228, -73, -42, -34, -29, -211, 5, 112, 159, -91, -121, 82, 123, -171, -184, 7, 186, 51, -158, -1, -16, -172, -34, -65, 66, 46, -81, 76, 110, -138, 339, 44, -191, 176, -86, 14, -59, 84, -74, 127, 14, -85, 32, -76, 40, 114, -134, -153, 107, -46, -194, -12, -185, 178, 75, -57, 17, 47, 122, -120, 127, -15, 4, -71, -141, 212, 95, -192, 22, 5, -22, 14, -198, 28, 125, -135, -68, 149, -61, 165, -38, -103, 40, 94, -210, -110, 110, -361, -61, 194, -35, 66, -33, -165, -120, 11, -16, -52, 5, 24, 211, -9, 66, 14, 112, 3, 81, -181, 236, -109, -231, -16, -18, 48, 201, 145, 2, 49, 24, 70, 22, -45, 177, 292, -125, 86, 129, 86, -97, 31, -51, 23, -21, -44, 26, -106, 104, -5, 1, 49, -126, 172, 90, -88, 69, -35, -31, 14, -106, -54, -255, 289, -65, -67, -39, -76, 35, 31, 33, -248, -23, -149, -146, 39, 49]
6897D9j24J40l1J25j40n3j4J07j25mR3NN4j38L8J13k3M7k44M42l45P1M7k50RK24
6923G3ok70K22j68J59O0J68j09r0j52J16O5n2R1k57J23J4j70K39jq7n6M7o4k5
6948a30K12j85Q7j25J55j25J21J6r8j1K20j66k7j07K70Q9M2l02p5K36J1j46J95
6971A57k30J33n9j32L06k18O7l74L82J10p1K2j06J34n5O7j97M2N6j14j14NJ43
6994d6J16J34j36m7R2j90L0j12J25J08M1j94P9l6M6O9j72M5j4rj36M09j51j84
7018a33K71K0j40J54j07q0R8j63K11k70K98k08J80k07Q3m8m7P1J3J24l24J18O9
7041a7o9J25j83J47P4j88R0J45j82J00k18K23j38j11J84J34k28K09k5l9j26K86
7063A93o7l4l3j7K91l70Q8K06k64j13K32j11j0J05J48l53J18j39P8Q7j30j13J02
$$ y = [49, -75, 65, 34, 159, 19, -34, -48, 59, -66, -70, 23, 28, 82, -56, -18, 95, 72, 119, -125, 317, -28, 43, 90, -160, -151, 73, 67, -203, 19, -149, 10, 70, 238, 129, 39, -113, 3, 68, 16, 107, -150, -27, -13, -183, 56, 55, -32, -88, -41, -105, -130, 82, -103, -16, -141, 14, -111, 10, 26, -72, -83, 137, -29, -56, -163, 107, 196, 238, -64, -139, 97, 108, -38, 157, -73, 60, 1, -131, 175, -43, 24, -350, 32, 142, 71, 93, -13, 121, 66, 133, -64, -22, 34, -80, -194, -189, -46, 70, 204, 68, 21, 113, -77, -47, -159, -34, 74, 115, -79, 0, -36, 10, 79, -93, -48, -62, -71, -207, 202, 51, -133, 138, 158, 18, 172, 65, -15, 83, -80, 131, -139, 159, -49, 131, -76, 7, -41, -88, -17, -4, 120, -204, -86, -17, -86, 39, -144, 3, 77, -111, -21, 124, -58, 42, -176, 47, -91, -202, -18, 116, -112, 97, 72, 33, -93, 193, 126, 92, 59, 42, 333, -37, 51, 257, -7, -120, 112, 1, -9, 96, 244, -109, 9, -130, -52, 35, -95, -208, -106]
7086a06Q0L7j07j3J59k15K01k24P7J24J33k65j51K55j76J02J45j33K47k10L2j48
7108a56L08L1k61K31k52K03j61J78l95K07m8l8K49j23J63j61j8Q4R3k16K80O6
7130B64j93J48l95J30K4Q2K5j62J56p6oN1R8j83Q0J4k26J39M3p5n0L17j25k2o4
7155fp2R6j09Q0N0k20l4J30k9K13j68L7K9O8l8R7p2j25J33k41J39RP4l0Q7m7m8
7182CK6K8n3l35L48K83k24N1m0k33J71l7k12O8J60n2O7j43K20j7j56p4l0k1J88
7207a4N6j21J95L7N8K1m74M6K24j43P4Q7Kl1N1J31j17J3j46J42J26k06p5J02M7
7232H5N9j70R6j16m0Q1k9q7N3lj0R2j15P6Q0q7K09j72n6J67j83J11p0k4N1M9j61
7259a14J92j07K81k21J90l33J80j20Ml56M84P0j77O9r7lp4M2J94j29r9J26J83
$$ y = [-106, -26, 11, -96, -109, 50, -165, 36, -188, -111, 13, 146, -119, -270, -15, -191, -89, 56, -77, 170, -40, -8, -156, 152, 183, -78, 153, -99, 104, -57, 121, -274, -67, -115, -153, 96, -27, 136, -25, -43, 41, 134, -82, 198, 264, 71, 219, -176, -46, -22, 60, 85, -77, 79, 3, -3, 48, 146, -37, 43, 57, -169, -30, 13, -62, -112, 205, 80, 58, -6, -78, 18, -91, -11, 39, -181, -215, -85, -114, 99, -69, -32, -3, 65, 27, 124, 52, -73, 60, -181, -42, -33, 41, 11, 98, 51, 3, 29, 57, 4, -331, 17, 300, 76, 127, 87, -146, 25, -12, -224, -156, 4, -48, 19, -124, 96, 79, -77, -151, -181, -202, -14, 42, -79, 116, 153, 211, 232, -242, -196, 28, -115, -41, 46, 48, 17, 68, 199, 82, 95, -51, 91, 217, 11, -64, 38, 85, 144, -26, 70, -46, -86, -5, -34, -121, -68, -71, -81, 11, -104, -28, 52, -35, 174, 2, -54, 113, -70, 41, -29, -53, -2, 47, -114, 78, -29, 252, 31, 221, -112, 68, -52, -48, -404, 80, 150, -27, 42, -55, -58, -132, -90, 104, -25, -124, 2, 185]
7282A85j03P1P4q9j28p9K7J26k4n3j52J25O4K65m05j8J88j16J77k03J11M9k16
7305a24j27J08L86j89k19J01J81J38r3k75J33q3J02k1K26m0j85j21K60j44q4J48
7327G8k82J65k7Q7k45L80k29j3K86m27PJ10L5K13Rl23K69k4j07j5J58k11L99m64
7351a71K59k40J77J39k51R0K8k65K54p8M0%p3J4K1qK84J9j94k01K12J5mj24m2
7376i9J34k22L53k59J58M3j50J4k73K77J59o1l2Qm9j23K41k11K39j1q7m0Q4M4
7400A37j18pj3j44L8k7J9K03J4j47n2J9J29q9m0n5Q3O9l9J30j33O9N5j63J98j07
7426B9J64l06O4J72j89l8m2J78j41n2L22k42K10k59K46M8K0k59J38R1J3k68L4
7449f7K25k51J6J01O4q0J18j4k09J07L3Q7L3j52r0J47j41P7L7n2o4N6rJ68k31
$$ y = [185, 82, 153, 227, 138, 10, -69, -42, 84, 60, 7, -145, -20, 44, 309, -96, -114, 74, -42, 135, -68, 43, 92, -124, -251, -143, 243, 54, -165, -64, 117, 255, 162, -113, 20, -63, 39, 18, 244, 204, 19, -102, 158, 14, -70, 78, -204, -39, -66, 21, -224, 156, -73, -86, 200, -227, -220, -110, -75, 138, 147, -176, 93, 69, -38, -53, 105, -106, 293, -171, 88, -152, 25, 164, -87, 3, 31, -234, 20, -58, -18, -18, -91, -77, -56, -64, 220, 239, 45, -156, 56, 71, 67, -57, -99, 35, -187, 166, -93, 65, 108, -42, -28, -301, -24, 135, 74, 42, 50, 1, -122, 119, -92, 147, 136, 49, 9, 93, 137, 19, 12, -1, -145, -107, -134, -115, 88, 102, -45, -97, -78, 51, -38, -78, -133, -50, 19, -20, 110, -23, 46, 101, -62, 136, 29, 193, -113, -49, 123, -66, -104, -146, 32, -109, -161, 161, -81, 129, -130, 116, 164, 184, -75, 63, 154, 167, -101, -67, 158, -93, -77, 24, 88, 8, 126, 112, -97, 10, 43, 130, 163, 11, -79, 68, -73, 4, 41, -11, -75, -19, -28, 140, -91]
7474i1Q8r9q0m2J75K3J25j46K6P4j11J83l71K60P1j79R8r0N6J19k2L8j08j1NR4
7500H5q1r5j16M49j15q8J4j42n4K59j42K13j6j60k04P2q7J65K42k14R3j65R2j28
7524a23J51M2q5M9l2N5L7j47j30J30L3m9J98j8m3m9J54j47N8j29N3m2j28PN8L45
7550B48n93M85k40K89m2p8J48J5j07k49O1R5N1J4m16K43K92k75J10j30J58Km1
7573D0K1R5j49P2n2q9j20K28k42J05R7j40K49j55K11pj35J80l13j0K79j91n3K31
7597A52k01J47k05M2K02l32K63j37J49j45J30mk9l6J05j64O0O9pM0r3Q2Kk12L09
7622A87l28M7N6O6K38l24J77j0j13R9l3k8q8p2K97n8q8l3J00l4q8J15o0L0p9J23
7648I9k33J6J95j09RJ30p1j66R6j1n7r0L58m57L68j7j67N1J81r3Q9j57J08j73
$$ y = [-91, -3, -102, -182, -224, -49, -26, 99, -47, -21, 53, -58, 125, -246, 14, 85, -94, 4, -86, -30, 89, 67, 105, -3, -14, -9, 85, 4, -91, -207, 242, 127, 39, 53, -89, -143, 116, -26, 187, 171, 11, -193, -121, -208, -43, 199, -15, 78, -87, 5, -123, 28, 70, -15, 34, 2, 57, 94, -53, -183, -53, -20, -69, 129, 111, 68, 19, 173, 26, 84, -45, 8, -34, -162, -155, -97, 248, -345, 140, -100, 189, 147, 69, 217, 232, 125, -124, -63, 32, 83, 97, -319, -76, 216, -59, 51, -79, 79, 81, 40, 61, 156, 7, 79, 27, -62, -182, 46, -196, -91, 6, -134, 115, -40, 171, 164, 29, 209, -104, -114, 165, -26, -79, 152, -49, 98, -107, -65, 137, -195, 68, -69, 80, -65, 65, 61, 32, -4, 101, -63, -3, 66, 59, 99, 6, 88, 90, -122, 187, -141, -94, -38, 28, 266, -58, 119, 109, -4, 95, 62, 34, -54, -126, 171, 113, 25, -8, 92, 58, -30, 85, 25, 55, -24, 99, -134, -118, 77, -32, -23, 107, 36, -130, -34, -45, -102, -192, 166, -291, 77, 60, -107, -56, 125, 32, 121, -36, 72, -101]
7672a01j0M5P7J85j10j2j7l8p8L4M6k32K94m9j00K69j06k13K48m3k41L50k66L3
7696c5m8K0L62k78j39j5k7K06l7n1O9L4L0%l33K45k78L41p7J5p7Q3R8j30J83m5
7722A16j86K51l3j23j39n6J76K10k61k07L37l1j69L46l57o4K14K37j77j22j53
7743a91K57M3o4j20n5q6L74j74L3k44J80K00k84K27k4l2m3J2j4o1J80L2j57P3
7767F2p4J74k57K6r2J11K24k67J74Mk27J7K4Q5KJ70j83L6L2j62k8J39k12L65j98
7792e5L6J88j06J76k77K58l29L48l26J21j08p6K94J5l63K10N0K2k9k01L46k1l55
7815a82K47l4L2R8m56K48O9j42K83l02K7J30P5r5m6K07M5l08l0O8M6J59r4N2m54
7840c57L45J37k59J82j7n1J39k44j0J12k67K86L9J72j93k3J2Q0n3j5k4r4K98j41
$$ y = [-101, -111, -66, 11, 196, 86, 74, 57, 19, -59, -25, 21, -211, 83, 34, -66, 203, 97, -116, 132, 89, -152, 198, -68, -35, -83, -63, 299, 21, -118, -133, -160, 46, 9, -42, 27, 61, 91, 91, -242, 3, -275, 66, -11, 4, -73, 10, 108, -22, 161, 116, -70, 181, 148, 25, -114, -170, 6, 216, -45, -252, 85, 54, -115, 231, -126, -190, 24, 261, 84, -38, -191, 66, 109, 45, -75, -130, -216, 158, -16, 17, -227, -47, 153, -131, 96, 72, 40, -3, 9, -5, -66, 114, 146, -11, 62, -12, 162, -95, -69, -161, -50, 174, -93, 81, 85, -142, -125, -101, -16, -14, 156, -27, 9, 41, -121, -149, -10, -222, 143, -55, -19, 169, 63, 239, -38, 220, -109, 239, -87, 34, -74, -150, 144, 159, -204, 6, 56, 78, 49, -152, 194, 173, -182, 65, 31, 63, 161, -295, -47, 22, -120, 163, -139, -112, 18, 93, -2, -48, 159, 204, -104, -134, -66, -20, 139, 45, 97, -357, -12, 125, -134, 48, 31, -20, 119, -125, -135, -23, -290, -4, 35, 207, 14, -9, 3, 83, 30, 15, -9, -103, 195, 54]
7864E4k9J39k22J22j59L21j15l12K98r6o2q6K84j87m1J54j45J49q6K2J34k6k11
7887a00j10K33k0k71L46j16%K3Q5k40K47j00P5k8J32j47j05J24n4J24k6o5J86
7910A93j54o9m0k9Q3j69K17O6j36j70J78m8L2k56M80l3j03O9l28J99j11J29K15
7933B15j74j10K13j63M8J55l02J36p2M7Q6j59K75o8k05J72J1q2Mk13J8L4r3N9
7957a68K65j80J62k40L8J90j00N8p3M5j35J41k9m4M2R2l6p2N2j81K01L2j88J44
7981A6j04q6R8O5O8q3J37j78J17j19J71k60J85j50J14j23K91j52r7K34j66o6k9
8004a17N9JM8k7O7k06L17j88J66j2J1j11j09M7L22k86Q3qN3k03J1O3J0j15OJ87
8030F9M9k11K8J20n3J33k11n5J45L9Nj4j85K86r9p4K2m8j95K72O8p6K7J70k10
$$ y = [54, 25, 164, -58, 64, -95, 226, 111, -201, 97, 1, -61, -147, 137, -50, -91, 63, -82, 67, -19, 3, 137, 111, -100, -210, 23, 3, -268, 78, -38, -38, -15, 70, -170, 77, -23, 52, 24, 156, 9, -96, 28, -26, 98, 72, 7, 193, 39, -30, -70, -99, -16, -185, 32, 98, -38, -208, -30, -78, -46, -302, 178, 145, 42, 111, -217, -18, -129, 0, 215, 41, -69, 144, -19, 29, 184, -118, 18, -54, -7, 79, -80, 195, 127, -78, 94, 105, 23, 27, -186, -168, -134, -227, -168, 97, -83, 79, -161, -123, 67, -33, 25, -48, -3, -138, 3, -26, -70, -28, 64, 28, -44, 8, -173, 28, 60, -128, 16, -88, -174, -76, -11, 57, -26, 111, -67, 50, -69, 102, -158, 27, -123, -9, -132, 159, 7, -90, 144, -22, -88, -117, -58, -57, -9, -36, 31, -175, 142, -46, 120, 108, 119, 8, -101, -54, 268, -18, 65, 57, 110, -93, -82, -19, -9, -124, -118, 69, 118, -93, -65, 55, 2, 135, -76, -131, 14, 53, 58, 44, -141, 145, 46, -28, -6, -54, -249, 23, 91, 15, 42, 212, 2]
8055Bp8J77n3j1J40r9J14j11j00j3K5j36J91Q4l43J33%J8k41L77r5N4k7j49K1
8080a20J56J9J40k24j10L91l47R5K07j98J9k36K67k66J98n6r0J91L1J26m8j04
8102D1j20N6L8L07l12Jk09K85k03L3N5J41j49J45Jj74J09N2r3J1N7r2q2K7j6l4
8128a25J50R2k34Q9R3Q5l04L45J8j78J74k56J21Mj67o9L2J83j61K45j63J60k61
8151a27M0L01l76J68p1J37p7q4J6j67J88J06j77J06o9J11K8m3o7j9O3m8J3P3m7
8176b2J72k57K96k71p8J16J17j8k9Q3L1q4k34K09j95
$$ y = [2, -76, 101, 48, 37, 177, 78, 192, 81, -19, -32, -7, -143, 48, 132, -211, -78, -78, -60, -301, 76, -19, 35, 8, -141, -120, 36, 55, 195, -29, -139, 252, -95, 0, 207, 9, 28, -208, 59, -207, -9, -65, -155, 36, 67, 193, 145, 41, -79, -23, 15, 322, 10, 11, -198, 87, -116, -83, -28, 113, -36, 109, 110, -64, 45, 97, 4, 15, 72, -20, -102, -75, -91, -125, 25, 117, -117, -28, 65, 150, -154, 191, 209, 31, 205, -51, 70, 74, -93, -162, -130, 53, -108, 137, -26, 134, -127, -87, 214, -162, 6, -65, 72, -5, -89, -73, -240, -52, 54, -123, -17, -86, 25, 53, 10, -57, -76, -13, -61, -48, 25, -22, 150, -107, 189, -82, -160, -44, 73, 55, 26, 109, 140, 56, -178, 31, -164]
8191a64
$$ Imaginary data points
##PAGE= N=2
##DATA TABLE= (X++(I..I)), XYDATA
0@%%%%%%%%%Qj6J6j6K4l4M2n6O5p7J00j20J44j69J95k32K71l16L66m22M87n55
31b95O36p23Q17r25J042j175J316j471J644j830K036k259K503k770L060l380L729
48A955m110M528m986N496o059O683p381Q162r055J0077j1256J2641j4291J6307
62H711j8825K2077k6466L2745m2555O0170j01764L88517L66487m36159k66425
73a3487k90496k05075j25980K31022L94732L62655J51523K7822j59725l04706
83F8285l58046k14071m6112J56051L13874L64343K02765J0940j20339k18043l43958
94a84311l04946n5995K00045K51383K24522K27318J57841q8435l08164l11693
104a92435j73721o4824M3139J99542L10514K52124Q4906p8797j99633k67355k31499
$$ y = [0, 0, 0, 0, 0, 0, 0, 0, 0, 0, 8, -8, 8, -8, 16, -18, 24, -32, 33, -44, 56, -64, 80, -89, 106, -126, 145, -171, 195, -227, 260, -295, 341, -382, 435, -490, 552, -623, 693, -778, 866, -964, 1072, -1187, 1316, -1454, 1606, -1774, 1955, -2155, 2373, -2613, 2883, -3176, 3507, -3874, 4288, -4767, 5310, -5946, 6695, -7596, 8711, -10114, 11963, -14503, 18242, -24313, 35857, -65907, 322610, 689097, 252938, -13487, -303983, -509058, -635038, -404016, -9284, 353371, 504894, 532716, 372991, 68285, -289761, -503832, -549944, -393893, -80019, 284324, 487089, 498029, 377690, 159647, -184311, -489257, -545252, -345207, -93824, 130698, 358016, 515857, 427422, 119258, -192435, -366156, -430980, -387841, -188299, 122215, 374339, 459245, 380448, 180815, -86540, -318039]
115c18039j03603M2061J65081K57622K57600J18725o7145j71619k00233k13018
125b32568j65043K142J90806K50945J88949J08573K1901j12821k36671k41925
135b25712j28193P526J13970J90563K13177J50571K3945j05171j92066k09989
145a61379j43583k2762R3133J67803J96994J61340M8705r1033j78182j84770j41304
156b55038o2862N1938J61390J99425J49415N2174m8711j34424j79631j56906o9194
167b92424M3054J33489J73271J50566P3682k8616j19641j68582j55347q2999K0080
178b53467J09878J58023J50412Q9259n489r8431j51390j47783r0935j265Q8044
189a53144J43582J45505R5229J0315p8598j38107j45007r8919j9074O6414J29012
$$ y = [-318039, -421642, -379581, -214500, 43122, 300722, 419447, 352302, 180683, -19550, -232568, -397611, -395469, -204663, 46282, 235231, 343804, 365705, 252884, 16213, -225712, -353905, -346379, -232409, -41846, 171331, 321902, 345847, 240676, 48610, -161379, -304962, -327724, -234591, -66788, 130206, 291546, 340251, 249218, 71036, -113734, -255038, -317900, -265962, -104572, 94853, 244268, 296442, 247731, 113307, -66324, -223230, -292424, -249370, -115881, 57390, 207956, 281638, 253022, 133381, -35201, -190548, -273547, -253467, -143589, 14434, 164846, 254105, 248616, 150185, -1205, -148988, -239923, -241188, -153144, -9562, 135943, 231172, 241487, 162889, 24782, -120225, -219144, -238218, -171804, -42792]
200d2792J42139J02642K7379n5713j19180j38911j03885l0772M8164J08484J32951
211G0506J09097L9890m4500j05809j26445j06262m9913K9789R9434J27780J05967
222A49534N0611k0425q6001j20731j08815n5724J5236P9628J15533J07072N8895
233A84813q880p1451j10349j09821o5449L915O7066J02745J04856P1378Q306n9839
245A17290j01850j02308o8223j3448M8623R4764J03603P1907J5407m4576q8413
256C2776j00549p5493k2181L8541Q3693R8510P7584K7170l1602p6945r4502p7935
268a20933l2533K5828P2528R1324P6619L5080j9468o7314q9693p8115l7877J4684
280a29870O1329Q5972P9126M2676r118n5801q1996p7598m5757L559N0510P8487
$$ y = [-42792, 99347, 201989, 229368, 173655, 54475, -84436, -188321, -219093, -170929, -62445, 70506, 179603, 219493, 174993, 69184, -57261, -163523, -213436, -183647, -84213, 43567, 149534, 200145, 179720, 93719, -27012, -135827, -191551, -176315, -96687, 18846, 125918, 184813, 175933, 104482, -5867, -115688, -181137, -177222, -110156, -7411, 97445, 168823, 177129, 117290, 15440, -86868, -155091, -168539, -119916, -25152, 78451, 150358, 165765, 121189, 32776, -67773, -143266, -165447, -126906, -43213, 55297, 132881, 160051, 128449, 51504, -42998, -120933, -153466, -127638, -55110, 36214, 112833, 147913, 128445, 61131, -28562, -106677, -144554, -129870, -68541, 17431, 96557, 139233, 130115, 74314, -7682, -85280, -131037, -127478, -76968, 1519]
292A519P6262M6895N13m5558p4958p6363m9330m328M1111P1512P5038N2083R682
305A24078l6021o7497p3211n2876j3677L0517O2481P1777N3692J6364k6318n8839
317C0470o9803n4997j9685K2140N5219O8223N6127K3146j7189n0856o5636n6274
329g9115k6700J2881M6542O2519N6066K8463q707m2676o0652n5665l0677N301
341i2420L8871N8287N6318L3179j984l4868n4983n4730l5805k701L1175N2610
353g051N3293L5643N907k6829m9432n3332l7101p455K4006M5717N1939L8990J1234
366H5529k0184m3582n0776l9097j3815J6109L9673M8530M0345J6715j4184l7421
378B7842m6600l8923j8184R088L4746M6588L9871J9096p239l0377m3607m0912
$$ y = [1519, 77781, 124676, 125189, 79631, 4673, -71690, -121020, -125348, -84237, -12725, 62313, 114396, 124078, 88057, 20560, -52651, -105527, -119204, -88687, -26206, 45571, 99263, 115627, 89309, 30470, -39333, -94330, -114015, -91875, -36656, 31567, 87694, 110840, 93651, 42795, -22841, -79115, -105815, -92934, -46392, 16127, 72193, 100656, 91949, 49273, -11379, -67044, -97721, -92420, -53549, 4738, 61056, 94235, 92251, 57383, 2400, -52330, -88135, -90836, -59661, -7051, 46242, 81885, 87792, 60963, 11531, -41801, -78902, -86357, -62351, -16634, 35305, 74295, 85529, 65345, 21763, -29013, -68110, -81925, -65816, -26143, 22387, 62732, 79447, 65263, 27842, -18758, -57681, -75865, -66777, -32031, 14557, 54428, 73524, 66285, 35908, -7699, -48611]
390d8611k2157M419K8794M1214L9050K3255j232k5100l9209l9202k4441n20K2988
403d0752L7030L7862K6012L593k0062l6070l7535k5881n500J6134L2919L7137
415B4887K7050P441j4476l0706l4819k7334r535J1621K8687L4755K7932J0519
427E6022r883k5867l3112k8530j2958P581K3881L1761K8367J4116n325k1863l0027
440e837k7475j5395K602K0239K9590K7117J5587j017j7298k8009k7652j6893m22
453d4863J5412K6001K6869J8277J817j3154k4317k6671j8593l036J2592K1774
465g892K4450J9848O456j1022k3064k4036j7521p140O210K0195K6072J9346O389
478C8291o662j7023k2978k0123r353N392J7175K2259J9679R051l991j4664j9956
$$ y = [-48611, -70768, -66349, -37555, 3659, 42709, 65964, 64732, 39632, 423, -38779, -63220, -63740, -40752, -3722, 34140, 60152, 63745, 43683, 7613, -29922, -55803, -61303, -45169, -12250, 24887, 51937, 59378, 44902, 14196, -20623, -47957, -57492, -45871, -17184, 17571, 45503, 56022, 46139, 20272, -12840, -41370, -54328, -46747, -22866, 8895, 37262, 51378, 46053, 24190, -5837, -33312, -48707, -46105, -25866, 3724, 30841, 46428, 45411, 28113, 104, -27548, -44441, -44863, -29451, -3450, 23419, 41696, 43513, 30359, 6042, -20629, -39222, -42258, -29666, -7892, 16558, 36406, 42862, 31840, 8776, -15260, -32781, -39921, -33711, -13516, 12556, 31902, 38291, 31629, 14606, -8372, -28495, -37848, -32456, -15281, 6978, 26657, 35708, 31717, 17053, -2903]
491b903k0509j2628L022J5879J9655J6853J1605K224j1983k1861j9578r376L09
504b9291Q397J7281K0111J3538O57j0522j6441j7655j2959l205P921J5634J8126
517A1592J4527L507q336j4771j5308j3080p225N079J6050J7749J1219M107k399
530B2711j0873j7818j5872m918N247J0902J3975J3811Q230j819j1364j5148j3360
543a6296p161J598R454J2710J3512R166K33j0207j4090j1612p080j940N863J3638
557b212J5008P857o72n935j0128j2514j0447k426O749J1403J1454Q649K621m052
571A5355j0024j1901r842l225M536R639J0652Q787M355j709r258j2151r018l248
585a7052K148O728J0324J0164N407k416p826r354q697n233P7O645R912R349N030
$$ y = [-2903, -23412, -36040, -33018, -17139, 2516, 19369, 30974, 33198, 21215, -646, -20224, -29600, -29291, -20894, -3613, 16498, 30036, 30693, 20171, 3730, -13925, -26884, -30089, -22168, -6534, 11592, 26119, 29626, 21290, 6519, -8789, -21869, -29094, -24015, -7965, 9784, 21003, 25110, 22711, 11838, -5980, -21852, -26770, -21523, -10621, 3354, 17165, 25395, 23576, 12212, -2936, -16296, -23457, -21859, -12405, 305, 13817, 22983, 23216, 13009, -1081, -12693, -19773, -21713, -15850, -2212, 12796, 20653, 19981, 14046, 3918, -8596, -19043, -21469, -14720, -3317, 8137, 16786, 19407, 15355, 5331, -6570, -16412, -19637, -15101, -5462, 5190, 13977, 18332, 16623, 7365, -4786, -13804, -17052, -14904, -8176, 2148, 12312, 17719, 15303, 7477, -1877, -10574, -15807, -15730, -9085, 827, 10176, 15206]
600A5206n00n636q409q788o428n63N231R027Q694N211J050l911p748r238o082
615a2884r58L789P237P776O588K340l233p302p827o002k296K264N971P824O387
630I674L093k156n839p221o326l064J120N168P331O379L160p35m855o420o356
645g047l885M31M541O254O059L863R6l793o025o257l922k84L331N707N778M268
661I115N61k910n103n621m117j327K168N076N432M299J481j768m278n820m203
676g015j661J700M011N051M426K085j237m022m842m482k066Q03L657M567M111
691E086K375m24k956m424m561k366L30K571M534L886K635M4k177l914m155k805
707f321j85J878L744L849K763P21j814l567l553k842j001J568K934L928K853Q07
$$ y = [15206, 14706, 9070, 661, -8127, -14555, -15118, -9887, -860, 7834, 13045, 14095, 10184, 2436, -6802, -12884, -13842, -10053, -2816, 4960, 11548, 13888, 10655, 3353, -4474, -10476, -12772, -10508, -4537, 3287, 9674, 12767, 10611, 4772, -2449, -8775, -11839, -10719, -5551, 1780, 8159, 11319, 10584, 5729, -691, -7047, -10932, -10501, -5960, 294, 6353, 10216, 10312, 6519, 494, -5763, -9685, -9969, -6638, -931, 4847, 9115, 9676, 6766, 1663, -3958, -8075, -9402, -7234, -2158, 3274, 7573, 9054, 7286, 3008, -2812, -7015, -8676, -6976, -2965, 2086, 6512, 8597, 7360, 3338, -1504, -5986, -8052, -7249, -3592, 975, 5086, 7461, 7037, 4081, -343, -4904, -7270, -6940, -4369, 165, 4051, 6686, 6730, 4553, 639, -3516, -6321, -6506, -4628, -884, 2965, 5728, 6449, 4635, 1068, -2485, -5327, -6328, -4760, -1826, 2102, 4955, 5762]
723E762r37l005l531k958r30J160K245L270K972J323o49k277l278k919j429K82
739d899K203L145K853J578j64k087k816k793j414j31J662K811K763J655j32j111
755C123k645k793j769j75J063K591K684J647L13r84k157k499k013l92J077J840
771a089K405J832O28o56j938k164j883r08N87J637K010K023R93j33j700k336j735
788b427r41K85J467J801J816J163k29j220j711j877r57j53J174J650J731J273
804B845J51j080j479j821j288k35O93J743J318J408L01n22j403j476j419l56N78
821b042J106J555J542L18l59j026j627j202p13L38J065J314J254P69j73r12j351
838a44j354p33L70P58J169J299O31J1p61j083j412n85k02P27J023J191J039k4
$$ y = [5762, 4825, 1820, -1711, -4669, -5599, -4439, -2194, 1076, 4048, 5371, 4722, 2445, -833, -3752, -5181, -4899, -2696, 449, 3302, 4880, 4716, 2629, -187, -2980, -4394, -4525, -2863, -52, 2711, 4366, 4234, 3123, 478, -2315, -4084, -4259, -3196, -605, 2079, 3726, 4039, 3055, 898, -1601, -3614, -4006, -2929, -1089, 1316, 3148, 3776, 3120, 1182, -982, -2865, -3773, -3186, -1549, 461, 2484, 3477, 3344, 1644, -692, -2427, -3368, -3083, -1616, 185, 2001, 3164, 2935, 1715, 4, -1873, -2830, -2983, -1809, -159, 1572, 2845, 2996, 1916, 437, -1384, -2672, -2907, -2214, -471, 847, 2255, 2556, 2034, 631, -845, -2264, -2620, -2042, -936, 619, 2161, 2479, 2120, 1094, -533, -1735, -2448, -2110, -1045, 269, 1523, 2292, 2119, 1207, -144, -1498, -2231, -1861, -1103, 66, 1365, 1996, 2007, 1246, 163, -1249, -1834, -2036, -1309, -286, 905, 1944, 1920]
856A920q57o69j197q74k03L80R86J272N68N34m43r35r62r06l5k31J193P36R15
875A192K85k9o51j012r22l38K79N22J004M26N56K5n15p97q09m73j07R18M75R67
895I96M17J02o35p95p87o10L7M01O46O94L98K79l34p47n00n00j97J69N46O95M44
916G19L33l09k12q63k77m77M0O96N94N65J84M8m82o90o44m37L94L06N17O54M67
937A126k67m53m53n63m5l9J18M51O40M32k39J9n41k92p55lL03L49L80N22L1k11
959E10n73j83k34l01J59K54O60L76K42k53k02l30n33l78J55J73M36L86L74j66
979E72m15j98m59qk60K66M03K47N45j34j52k74m62l06j6O0M04M35J72J46l32k28
1001Fl56rj63J80J76L97K28M3lr7m98k89p9Q5N0M00J94J83j26j86k57m3o7l9P0
$$ y = [1920, 1063, 394, -803, -1677, -1880, -1500, -514, 758, 1326, 1860, 1417, 482, -480, -1386, -1421, -1652, -459, 277, 1192, 1477, 1448, 797, -215, -1137, -1475, -1196, -674, 330, 756, 1312, 1337, 822, 25, -784, -1257, -1364, -446, 29, 996, 1413, 1515, 880, 85, -702, -1312, -1275, -874, -228, 466, 864, 1143, 809, 62, -438, -938, -1135, -966, -420, 275, 719, 1052, 743, 531, -332, -609, -1086, -1046, -350, 244, 809, 993, 1041, 559, -131, -775, -1212, -818, -512, 5, 659, 1126, 859, 406, -47, -610, -655, -694, -576, -125, 515, 947, 708, 727, 186, -106, -861, -864, -561, -212, 168, 690, 721, 510, -63, -246, -480, -781, -622, -368, 292, 668, 910, 657, 455, 125, -408, -786, -631, -458, -22, 364, 738, 572, 157, -41, -500, -508, -768, -502, -99, 148, 693, 559, 407, 133, -329, -635, -651, -591, -187, 248, 420, 566, 234, 6, -350, -359, -522, -342, -166, 231, 459, 502, 499, 402, -96, -385, -464, -379, -329, 71, 265, 448, 322, 136, -121, -164, -231, -270, -200]
1026b00L52J43K43r5k84m1l10n4k3m7L48L4L18m0m6l19k24j95r4J61L52K54K50
1049D83M6l76j25l42K07k68K25k2J65K38O5q5j01j65j57j03K14k71M53J32K32
1070D45j59r9k49R7k53Q0l0N2J92k2K77r8j28j80k20J71J9l8J47P4J8Q0j53p6
1094e3J00l19K48j08K11k17M41j36j35L3j63j89J31J95m6K55l86K63PN1j32o4
1116a3n2L9L1J23J7o9L2j42k39K40k0j09j0J98N3J1j17O7P3k47Q0kN8J00k7N7
1142A32n0M0k75K26k0j09Nk1J3J32j43J73p9j02n0N5RJ90L9j8l3j55J65j43j22
1167a41M6j4J7O6j19J94N9k03K27k95K18j71r5M00l38K68q0r3nkK15j16q5J46
1191I9j49J80k19K95j48J40l5j60M7k56J78O2JM0J9O1j86J02q5K12q4j90o6L65
$$ y = [-200, 152, 295, 538, 443, 159, 118, -192, -246, -269, -316, 32, 66, 384, 344, 298, -21, -245, -440, -534, -373, -21, 233, 483, 529, 153, 28, -314, -107, -375, -150, -172, -7, 231, 296, 211, 110, -55, -212, -315, -101, -372, 81, 213, 445, 286, 187, -62, 35, -218, -138, -168, -116, 76, 54, 331, 233, 105, -75, -295, -124, -105, -143, 4, 78, 96, 176, 23, -53, 47, -272, -24, -132, 79, -138, 303, 167, 32, 65, -98, -287, -156, 39, -7, 248, -138, 125, 132, 183, 51, -13, -65, -26, 5, 128, 145, 76, 108, -34, -273, -33, -53, -162, -172, 26, 79, 90, -27, 40, 113, -134, -54, -56, 2, 102, 75, 132, 82, 122, -153, 73, 53, -56, -51, -72, -59, 73, -70, 103, 24, -78, -128, -73, -64, 126, 165, 147, 114, -41, 124, -19, -141, -95, -109, -92, -26, -145, 49, 108, -95, 132, -163, 55, -116, -211, 189, -149, 119, 39, -54, -59, -61, 154, 38, -47, 99, -50, 130, -89, 206, 58, 198, 163, 3, 50, -206, -28, 34, 35, 75, 94, 155, -31, 71, -14, 198, 114, -76, -142, 223]
1215B23j1j44j38o1J08j2J41K1j60J7j9Q1N4p0m2Nk23J12J29L15k84j57J33J34
1239A52l07K06J04q9k19r6M00r1Nj98%K08j20K4p5J58j51J32n8o4J28k10J01J00
1263D0J2q3K0O3j68K0J5k0k31K96J16j50N3J6m9K28l49M62k81P0k44J35r6m8k9
1288b02K25p5K29j12k68K86n8K32n5k38LJ92k45j64K57K80l29K15j87j24m8L07
1310A21k62J82k7j52L16l48l6J74J39J4k09OJ27M8L3L8j63j72J26j25L32j90l1
1333e9J59n9j52L8j9J33p9PL17m99L03K5n5P9J16j86o2r6r1J54K05k97J39J20
1357A41j22l7p2M1L6J38kj2l39J72l2J29k04L05k6L7j19j83l5J42k7K71k74J13
1381D1J52j47M4Q3k27j57J88P1q3MR5j10K04l18L51j39j07j11P0R1P9r0P1j57
$$ y = [223, 212, 68, -70, -131, -23, -35, 106, 127, -33, -16, -35, 46, 100, 30, -12, -7, -230, -118, 11, 326, 42, -115, 18, 152, -155, 51, 155, 66, -153, -249, 151, 60, 65, -133, -133, 75, -45, -21, -96, 62, -89, 43, -15, -79, 49, -161, -60, 40, 52, -31, -11, 52, -116, -96, -81, -101, -332, -36, 80, -70, -17, -1, -50, 178, -171, 291, 10, 80, -164, -29, -125, -173, -202, 23, -52, 177, 65, -203, 83, 25, 257, 202, -36, -33, 159, -86, -250, 7, 287, -42, 173, -14, -138, -186, 121, -141, 41, 14, -138, 178, -170, -206, -32, 107, 121, -88, -82, 45, 93, 126, 164, 1, -171, -45, -170, 162, -28, -59, 100, 41, -111, -73, -92, 41, -38, -31, 286, -213, 90, 115, 60, 139, 255, 69, 7, -89, -180, -26, 179, -118, 21, 141, 19, -18, -90, -49, -13, 125, 123, 111, -228, -56, -88, 41, -163, 142, 116, 153, 34, -149, -184, -42, -69, 202, -72, 41, 193, 46, 90, 173, -54, -211, -23, 48, -35, -31, 64, -46, 158, -160, 191, 52, -55, -166, -96, -5, 74, -16, 55, -102]
1405a02J74q7K5j22J25K57l97J66R2L4j94O3l0n3j82K75l7J92n2k20J11j34M9
1428d7k24K95l9J07Mj7l1R2j83m2j45K09j27K58j21q0K01Q4j48j47J25j02J27
1451D9p4M9K21q0k59N1r2j58K50K8k36J82J16k6k00R9J55N3r2j46J59p5m5K62
1475A91j26o8K6j72J59j14JQJ36J29L0l40J68l05M1J45J57o6L5K35j39j54J34
1498A11l56L03m1j87J31J97M2j27k65M0O2J1n6p4L34j11J53l3l5J09j78p0k10
1521b50M49l75M3J88J93j77j39M7Q3k16l2J59j36NJ60Q2R1k74K3K00k39OJ04R2
1545H7K2P9j16m5O6j2l7j24n5J74L0j13J12n3J21k98M6R1j08M22q8j71oj28J77
1570G3j10r7K14j10nL36j14k06J33j71j00J21k00KK92l6J06P8j61m1J21j37M6
$$ y = [-102, 72, -15, 10, -112, 13, 270, -127, 39, 131, 165, -29, 34, 4, -49, -231, 44, 7, 199, 147, -73, 38, -96, -47, -271, 24, -15, 92, 96, 79, 48, 140, -43, -85, -230, -21, -148, 110, -11, -91, 110, 194, 46, -101, 24, -78, 49, -25, 24, 245, 165, -94, -43, -135, -293, -43, -15, -251, -69, 47, 21, -179, -80, 75, 128, 36, -110, 49, -26, -71, 191, 65, -3, 23, -149, 10, -104, -103, -95, 41, 170, 200, -140, 28, -277, -236, -91, 66, 0, 35, 270, 131, -23, 111, -245, 58, 17, -170, -39, 158, 200, 73, -192, -152, -90, -79, -135, -209, 125, 14, 167, 134, 99, 208, 30, -40, -250, 199, -176, -133, 55, 248, 71, -68, -21, 62, -154, -186, -27, -163, -158, 2, 84, 175, -99, -76, 124, -115, -109, -5, 87, 109, 188, 72, 27, 93, 81, 44, -80, -135, 39, 69, -44, 68, 15, 136, -162, -116, -25, -133, 289, 201, 30, 24, -104, 73, -37, -134, 80, -30, -35, 301, 187, -19, 114, -57, -157, -36, -236, -234, 58, 22, 128, 206, 45, 4, 125, -12, 34]
1593C4J53j66r9L18k55J21N5k52m2J13R5j75J29n5J3K4R9k74K02P4p1j14J81L1
1617A39J93l74m4L2r7J13j04R1P1K0R6j10M9k06J64q5o1J53j13K06O2J20l62k5
1641g2o2J83r6K83k50J34j80J21n9j40J39j30r2K55k27K77m7O9k15k9J10n7K20
1664A35k58M07k79K37j76j75K04j57j28L11m15K88J38o4m3L9j75k6J77k70K37
1685GL8p3J7R7j09J52q2J3k49J60j06J06J87k18L26k12j12J53r4l19J67K59m8
1708F0j67K08l23K53Q0l11m6K19J69k06j6Q8n2j47M51k62k7K58k28K9j20n3K39
1731I6O2j64j80K75k38M8K27k74L80k66J83r3p0Q5J3q0m5J2J49m7j89qN4JO0L3
1757B4Q7n2l5o8J96k47J00n8r1K67N5m00J76N1N0M8k20l6J30Q9j38L36m17n8J25
$$ y = [34, 187, 21, -78, 240, -15, 106, 161, -91, -133, -20, 75, -100, 29, -26, -13, 11, 110, -164, 38, 112, 41, -73, 108, 139, 332, -42, -86, -54, -151, -38, -142, -51, 20, 40, 136, 26, 75, -131, 33, -52, -113, 40, -73, 133, 195, 315, -47, -72, -134, 49, -47, 236, -14, 120, -60, 61, 2, -138, 1, -129, -221, 34, -193, 84, 37, 106, -109, -138, -28, -85, 135, -123, 284, 5, 242, 66, -109, 95, -62, -190, 121, -294, -6, 132, 68, 25, 64, -111, -137, 40, -230, 7, 45, -28, -11, 86, -23, 129, 47, 60, -189, -29, -135, -29, 158, -60, 266, 54, -58, 95, 1, -318, -151, 108, 60, -107, 101, -222, 31, 111, -200, -246, -27, 142, -64, -80, 8, -44, -191, 260, -2, -29, 229, 1, 30, -90, -143, 96, 158, -6, -186, 89, -149, -101, 126, -148, 232, -34, 149, 56, -14, 71, 84, 4, -41, -29, 120, 73, -116, -124, -70, -69, -9, 24, 111, 59, 24, -44, 152, -95, 5, -53, -144, 123, 178, -222, -46, 5, 55, 103, -117, -153, -23, 66, -72, 264, -153, -211, -86]
1782h6N0L3j14J19M2m9n2M9k08M24j48j85q2K29j23K5P6m7K02j6k09J55j05j77
1806a97R4m3J20P6m6P9o8j6j31N1k2M7O0j40M31m19K21k4n5P1j42J13Kp5m5j33
1832a91Q1J44m4K7j10J08k0Q2l1J60p7j08J38j03p6kL8K6p4j76J71J44j26J12
1856I3r6N3K20p3j4l42J15J33j95J8j2J50k94J78j46K10J04K2j18r3K2j26K97
1879A06k9O4j80mN7j11J57j07J92Lj41J33k25R0j59K5J3M6Q8R6k1O4j14k12K19
1904E0j1j48M3R7k33K2O7K04n6J31Oj41j98J47j54K36N2j19J10O1j53k0J96j38
1928E1j0L65l50L7r9j9r3K3J24J06m1nj65J98k3q7r3qJ35j88K26k66L51j7k75
1953a23L04j11k2j38M6r2K64K7j38J91L4p5k60P2N5j5Qk9o3R0k13J74q0l1K14
$$ y = [-86, -36, -3, -117, 2, 44, -5, -57, -8, -216, 208, 60, -125, -207, 22, -101, -76, 0, -47, 155, 139, -70, 85, -20, -197, -103, -146, -26, 50, 4, 83, 15, -1, -132, -81, -103, -56, 4, -136, 295, -124, 97, 73, 18, 89, -53, 60, 62, -13, -58, -191, -110, 34, -10, 17, -93, 15, -5, 77, 46, 206, 129, 21, 159, 56, -20, -22, 16, 42, -32, -208, -37, 107, -19, 93, -3, 50, 270, 197, 183, -159, -44, 89, -106, -88, -100, 50, -244, -66, -212, -2, 102, 124, 6, -87, -65, -191, 106, 77, 141, -39, -43, 14, -97, 60, -47, 145, 148, 7, 140, -85, 5, -154, -129, -116, -70, 18, 114, 93, 157, 43, -169, 50, 39, -109, -66, 31, -202, -180, -113, 91, 35, 166, 172, 31, -167, -20, -174, 62, 114, -5, 105, 166, 13, -7, 189, 51, 41, 406, 56, 93, -6, -25, -118, -95, 29, 135, 94, 89, -76, 122, 99, 12, -81, -89, 46, -142, 84, -182, 169, 152, -123, 181, 70, 48, -90, -44, -136, 128, 155, 17, 208, 242, 167, -93, -21, 34, 19, 27, -2, -65, 25, -188, -14, -94, -125, 89]
1978H9j90J57m8P9m9J33j03K3m4j33k0J94j00k3J13l7JJ7k58K18j34K21j92L96
2002C10k99K0j08jJ16J5M7p7j3m4K37k16P4j75P9l5o8K87J43m41K57k72J05N1
2026hq3P6J5L3k13K50j2p4J22j67J72k30O9j6K7Q4q7K99j11k02N5j33K76l11J49
2051b0Q8j06k5L4M1J4R2k26M1J04K88k49N8k85M1OJ51R2j38P1N8J88j34j32J36
2076A88k01L6NO1p5J31R7l12M0j24K30l5N4o4J2l2J07j46p2L5Q0pk01J19N2L1
2102IJ2N4J20k00p9M6J53k39L52N6l09K5l0J23l7j83Q9J61k95J64O6K5r3K0j97
2127a87K02K9j41m1K02J1j24M9j0J09j38j49J90j2j47M7L40l13N3O5k43K63j59
2150a04K40J09l84L14o6P2k68L20j24j9O5k35M0P8j17J45m7N0O8j30O0j10N2k7
$$ y = [89, -101, 56, 8, 87, 38, 171, 68, 91, 47, -86, -106, 88, -12, -35, 78, 41, 42, 59, -199, 19, -115, 106, -86, 310, 11, 31, -77, -78, 38, 53, 100, 23, 10, -34, 203, -13, 61, -114, -35, -70, -138, 149, 292, -149, 108, -164, -59, -8, -91, -15, 0, 33, -180, 70, 58, -16, 106, -61, 111, -119, -50, -66, -39, 45, -42, 257, 146, -56, -1, -134, 142, -169, -20, 68, -38, -63, -29, 12, 26, 118, -108, -67, 37, 325, 76, 134, -151, -110, -104, 47, 139, 1, 72, 130, 318, 184, 52, 188, -13, 23, 28, 89, 14, 145, 242, -70, -30, -154, 76, 41, 95, 31, 43, 11, 118, -28, -100, -65, 15, 8, -193, -74, -22, 9, 21, 75, 195, -5, -84, -38, 115, -124, 228, 284, -25, 0, -30, 93, 56, -127, -38, 123, -172, -8, 58, 83, -10, 10, -187, 15, 44, -97, -138, 64, 75, -49, 0, -10, 99, -39, -188, 2, -10, -157, -110, 230, -83, -30, 35, -208, 55, -104, 136, 245, -139, 175, 109, 181, -87, 233, 109, 90, 155, -80, -40, 38, -79, 66, 19, 69, 137, 7, 67, -43, 9, -18]
2174a8J65k69O4J38j47P4No9J32Q7M5O5l56K84k04p4J01M5j10J10J47j16m4k2
2198C3O3j85O0j24L16k06M3j55J20R2O0j51K27o1k38L3j31K55J1j33J58j14k16
2221b43K01j6l8q9R9q9K28N5M5j03j40L8l4J39J1k20L7J69q0n9N3J4q9Q8P3p6
2247b6NN4r3m5o8J18J01J81m25J26j4P0L2N2j01R1k1j33k7J14J35L8r2l11K56
2272A7j8O9l11J28J44j22J18J21l2j83J90j06N2J59j09l0k9l3r2j9K31J44l81
2295i2Q9N1R0J09m60J02J05m0K74j92K7P6j55R6pl7j38J80l8j92J61K2j3l3J48
2320A33P5l40J27n7J35M1rl28K40P4m8j1K5j02N3n4J00o1p4K41j58n4R9Q5q8q7
2346d3j3J02J4l2r1Q1J32o1Lj02j22O2J7K23k57J27j52J71j8j46mL34j16j41K6
$$ y = [-18, 147, -122, -58, 80, -67, 7, 12, -57, 75, 162, 207, 272, -84, 200, -4, -78, 23, 68, -42, 68, 215, 99, 55, 33, 96, -89, -29, -153, 163, -43, 0, -155, -35, 57, 117, -34, 193, 132, -106, -73, -204, 51, 62, -71, 87, -27, -243, -42, -58, -96, -185, -86, -175, 53, 108, 153, 50, -90, -52, -86, 53, 64, -156, -119, 50, -30, -89, -36, -22, -111, -23, 50, -26, -21, 33, -60, -105, -173, -55, 46, 227, -198, -72, -86, -16, 16, 68, -33, 58, 37, -96, -123, -9, 126, 164, 72, -239, 17, -1, 68, -243, -115, 29, -93, 25, 146, 114, -69, 121, 15, 67, 226, 117, 87, 58, 25, -67, -86, 145, 289, -92, -3, 48, 138, 247, -213, -111, -6, -46, 228, 36, 63, 139, -16, 80, 73, 36, -102, 78, 40, -152, 9, 31, 18, -15, 133, 208, -132, -5, -62, 73, 114, 105, -223, 17, 91, 43, 32, 57, -45, 8, -46, 54, -7, -81, 160, 2, -52, 47, 132, 44, -43, -56, 46, 60, 28, -63, 18, 150, 89, 92, -10, -132, -70, -53, 170, -87, 40, -112, 59, 41, -105, -109, 225, 109, -32, -6]
2371fJ24j29O7q5k02M23l40J30J19j76p5L24J5j14k77L9K23K1K0k83L59j53o6
2394d2MM3o3k9o0J44L6Kj92J14l9J46k09R2L09l58K4J68O4j28N9K8%j39k0j71
2420b17J26J88%r5J58j32J63k66J66q6k04K12K2j77J55l04K58O1j84K11J3j9k22
2443a73N6j26J81qj55K40O2k16J88O2j92p4P3M4j33M1J8J26O3p1m5K6J76Nj33
2468C5l03L35j47R4J40k04k4J05K90n35K11J40N9j39j63J24j06J08j25K25k65
2489a45L67l77m7M60k15o7j00J67Q1k2J19j34l44K41N6J3r9J48k40J44J16k76
2511a54J96kK26l28j3j72K65j73Q8J0O8J0J28j09K9Kj65o5K26J22m26P3K34k34
2535a64K3J25oj28J05j51J44K4J46k33O8J24p2m5J09j00J40j38Mo6n1J15L0Q5
$$ y = [-6, 118, -11, 56, -29, -231, 192, -148, -18, 101, -75, -150, 174, 189, 75, -202, -163, 60, 81, 101, -182, 177, 24, -42, -38, 5, -58, -87, -147, -3, 33, 35, -157, -43, -82, 64, -145, -53, 256, -102, -78, 90, 154, 26, 85, 113, 113, -26, -46, -217, -91, 97, 97, 2, 160, 28, 191, -75, 91, 5, -199, 13, 35, -142, 13, -291, -33, 28, -156, 55, 68, 49, -173, -117, -243, -62, -70, -225, 15, 77, -139, 49, 111, -81, -155, -82, -38, -171, -130, -112, 14, 77, 6, -39, -13, 163, 168, 35, -268, 67, -80, 14, 154, -50, -74, 31, 321, -214, -3, 137, 196, 57, -106, 18, -88, 20, -105, 120, -145, 222, -155, -202, 258, 43, -24, -124, 43, 124, 102, 221, 87, -257, -16, 40, 53, -46, 102, -138, 6, 122, -154, 42, 40, 266, -62, -75, -247, 18, -155, -67, -57, 11, 21, 149, 40, 69, 71, -94, -159, 67, 189, -237, -164, 70, -164, -141, -16, -22, -150, -45, -196, -52, -28, 118, -115, -47, 77, 5, -40, 69, -31, 109, -29, -25, -91, -142, -27, 3, 88]
2559H8j56R6j19rj26J57J92j30J57k11j21R3j0K14k9%j23j4r0j20K77j29L22k87
2583g8J03P4k36J04k21J54J7J28q1J01K06k95M5j1m9K02n2j11j63K27N0j93k4
2606a03Q3j00RJ74j11L1O9j41J72l7k01n3M1J72mK83k53j15L3P8j29k0J28K3P1
2631A00o0j25N4J1J22o2k08K85j37M3J25k94J61l4K02k94j41M36k54J43p2J69
2653A70j02r7J45j5j77J14K1j40J07j15M9J08k12J84p5J03j18j20J51n4j10L20
2675A37j78J15K0n6n7J55j65lJ90k4k36M2L7Q7j72J27N8j34O6M6o0J14o2j91Q6
2700e8J56N1k92N0J09j35N8J50j00L3m3J17J2q9m3Q0P3k33j3L3K56k29k7K81j73
2725B4M3r0J08q5J4J00j47o5R0%j31J74J25l00J73kj02J82K4Nj74R4j73J79O3
$$ y = [88, -68, 28, -91, -100, -226, -69, 123, -7, 150, -61, -182, -89, -99, 115, 86, 86, -37, -51, -141, -261, 16, -113, 209, -78, 25, 99, -137, -33, -254, -100, -83, 45, -36, 65, 271, -24, 21, 10, -39, 163, 111, 0, -163, 64, 114, -79, -103, -20, -120, -111, 63, -48, -17, 52, -89, 83, 46, -155, -208, -167, 5, 1, 284, 31, -84, -51, 27, -102, -122, 6, 29, 100, 40, -85, -31, -20, 102, 40, -168, 117, -20, 23, 148, -146, 15, -19, 183, -111, -252, 184, -70, 73, 1, 170, 68, -29, 116, 101, -76, 38, 59, -81, 26, -89, -40, 68, -144, 40, -35, 68, -50, -170, -19, -73, -183, 137, -41, 74, 94, 38, -19, 136, -29, -32, 158, 134, -102, -60, -23, 64, -108, 19, 77, -57, 9, 55, -5, 109, 47, -144, -58, 98, 149, -143, -93, 16, -119, -61, 89, -11, 22, -21, 96, 108, 19, -24, 56, 129, -104, -117, -84, 172, -57, -84, 197, 24, 67, -23, 85, 0, 14, 114, -33, -98, -8, -8, -139, 35, 160, -140, 33, 31, -71, 111, 135, 140, -34, 60, -113, 66, 129]
2750A29k60J57j26N1J09K0j36J24NP3j74M5p2q8K09o0R2k01M1L33l26J02Qo3r5
2775a03j9K19k03o7L96m10L5J39m4J3rm2K29k68P6J09R7l09K6L40k08j30J34J38
2799A39k5k43J59Kj29O4RP2j74k0J85l3J61Q3l52K53j28Q7j60m5J28j9j43K31
2823A02j35p4J36n0K09j98O4j07o0J64L7l5j73J75J68k32J8J34j25K24l97K36
2845H1j68k50L47K57o4j39N4j92j95J47O5J11L9k02J61j62k7j03J02j0j8K34j19
2868e1J67n8O4k67J18qQ0L7j67L58l55J4O1J34k43K88o3J4k9l5J76j54Ol61K98
2893B4j09j13J20R4j50J54J40k14oL20k52J6j58O6O0j43J14L05l09n3K89k82R3
2916Fm5L08k47k08K86k10L43j75k00o5K91k37L3J17K0k0J8K10p6k63J99n1r2j65
$$ y = [129, -131, 26, -100, -49, 60, 80, -56, 68, 73, 146, -28, 17, -55, -143, 66, 6, 98, -103, -62, 271, -55, 47, 55, -8, -103, -122, 97, -106, -173, 223, -187, -152, -13, -57, -44, -53, -95, 134, -134, -58, 51, 148, -161, -135, 205, -3, -133, 1, 139, 114, -129, 30, 32, -97, -33, -24, 48, -126, -146, 39, 6, 167, 250, -102, 151, 23, 110, -50, -95, 33, 14, -129, 102, -33, -107, 29, -21, 188, -10, 54, -53, -113, 51, 88, 53, -120, 55, 223, -9, 9, 143, 18, 242, -155, 81, -87, -337, 10, 267, 203, 64, 118, -74, -269, -122, -57, 54, 93, -109, 52, -110, -137, -240, -138, -148, -166, 68, -51, 116, 58, 122, -145, -27, -35, 45, 82, -85, 273, -82, -68, -7, 127, -116, 172, 109, 123, 94, 59, 235, 81, 87, -274, 24, -85, -198, -78, 16, -134, 20, 160, -54, -60, 260, 8, 24, -134, -68, -8, -151, -37, 268, -41, -94, 195, -87, 6, -39, 269, 22, -186, 100, -110, 233, 58, -142, -207, 84, -153, -120, -3, 17, -3, 15, 225, 149, -114, 85, 34, -58, -223]
2940b23K78j86L58m18NJ84R4o6j42R6O6j1k13J48J6l3R2n5m2o1J43R8k45K71k76
2965a22K26r1k1q6J17o0j83K96j47L4Q4K8O6q0j16K53m51J36J74R7k40J21K3q9
2989c1J14P7rL4p6j19J95p3j91j88L02J29k79K35p3Mj33J47qj96J25j20L7J31
3013C4J00k22l1J44k17J66P3j16o5J48L6m7r5N1M5K00j00k14R2J90j16J20j04
3036G2j22Q0o2O0r3J78NK6j04n6j33K65j53J05m6Q6j5lk2m06M51k00O4j36K12
3061E3m6R2J79l73J66j5j3Pj20j25J80J12j98J86Q7k00J00O2k10k7J69j9l6J49
3085A60j97O1J00n3j34p9J15j3K9J45j91J0pN5j88K23Q4j8k56j02J52R6j72M58
3109B78l34k6m5Q9kJ95l03K60J18j40j03Q6j40O8J35l31K63PJ32k28J38j87R3
$$ y = [-223, 55, -131, 227, -191, -186, -2, 92, 26, -116, -20, 46, 35, -178, -30, -14, -47, 45, -10, -52, -113, 30, 128, -117, 154, -122, 104, 13, -8, -94, 23, -37, -220, 76, -71, -37, 47, 75, 141, 61, -55, 198, -253, -117, 57, 154, -86, 35, 58, -31, 83, 160, 151, 185, 109, -10, 185, 112, -79, -267, 35, 164, -115, 120, 47, 51, -82, 65, 57, -139, -14, -134, -97, 34, 134, -88, -119, 25, -192, -26, 47, -69, -134, 14, 50, 3, -92, -41, 4, 204, 104, -110, -18, 172, 56, 176, 72, -50, 30, -32, 28, -65, 113, 118, 144, 40, -16, -149, 116, -37, 68, 22, 108, 93, 90, 68, -338, 113, -87, -23, -159, 53, 7, 99, 278, -95, 71, 56, 43, 50, -70, -195, -15, 97, -101, 85, 172, -28, 72, 134, -76, -103, 66, 47, 11, 160, -37, 24, 124, 71, -63, -142, -27, -40, -11, 134, -57, -47, -54, 1, -187, 36, 120, 102, -154, -256, -104, -8, -180, 278, -56, -82, -127, -38, -40, 155, -148, 112, 230, 90, -13, 73, -67, 1, 136, -195, 68, 75, 207, -21, 117, -70, 23]
3132B3J34j72N1J17m4o9K15l60J03k3r2l2L4J2K0K5p7Q0N7J45j52j0n5RJ38j27
3158e0k2K1kL5o8J27j28J42l4J5J02l7K8k24K82k18L1j2K62l08J52n4m4Q7Q3j11
3184E5P1Mk94nQ8M9rJ14q0j98J11J7Q6k94J57R1K7J61j97o2J03k17K68j40o3J19
3210c8j27L33j84j18O3J17O6k7j39j33K00j09J38j39%J97k27J96O4r4J67k55n9
3233a08l9J21L41m39M4K32j6j55j22L8J31j9n7J4K08k15J5J68n5j36K75K1Mm75
3257b24L80j26K25p1k65o6L23j47j07J46K9J39j71l7q0L47l85Q4l8k9J06j72K55
3280A16j29%J21r8k56K37O3MJ34l41J62K6q2J43l33K09J57j65RJ56r0q9J94j24
3304B4N7O0M6k17j2J74j46j22K3RM8J97k74O2ko3J28J32J52l18J92m04K66K05
$$ y = [23, 157, -15, 36, 153, 109, 40, 255, -105, -2, -25, -117, -149, -115, -103, -83, -58, -135, -55, 2, 147, -5, -15, -70, -61, 77, -50, -72, -51, -53, -18, -86, 41, -87, 55, 21, 36, 138, 101, 129, -95, 187, -31, 0, -12, 250, -58, 94, 40, -4, 83, 166, 55, 126, 130, -164, -169, -81, -32, -41, 73, -7, -205, -94, -77, 9, -285, -128, -37, -10, 151, -46, -108, -5, -222, 46, -94, -157, -38, -165, 168, -16, -134, -71, 46, 112, 85, -54, -187, 13, -96, 42, -97, -97, 100, -127, 69, 133, 39, 206, -49, -108, -147, -26, 315, -124, -80, 152, 136, -19, -141, -103, 28, 9, -48, -34, 174, -41, -26, 142, 87, -49, 226, 247, 251, -224, 156, 30, 255, 184, -81, -147, 176, 29, -78, 68, 97, 236, 65, 28, -52, 295, -90, -6, -44, -73, 33, -139, 116, -13, -13, 108, 10, -246, -9, 54, 58, 192, -149, 13, 39, -43, 100, -233, -24, 133, -32, -23, 133, 43, -46, 148, 24, 81, 141, 187, -30, -42, 132, -14, -136, -113, -104, -56, 141, -133, -71, -73, -136, -8, 124, 276, -42, 150, -254, 12, 217]
3328B17k22j63J52J02o0R5j01K9l3j60J17J01j40Q3J5j41J27j22J02J3q7J47j38
3351f7P6k68M67r8J11j56L1q8j39L17m14P1K67l1j73o7L85m6k12J2J31j65p6J3
3375a19N4K14k4k9l8j45J71k48o3J82J58j37q1KJ77R1j86J82k12K9RM5o5O0P7
3400A04o8k33L41K4j55j09Q7J09J3p7m6p3j84N7J43L33k20j86L84k96K67k91Q
3423f8K1k16M50j98Nj28J72N7j64N4o2O6J19o0j26J52j67K24q7j16J05j92R2P4
3447Gp4J1Q8N5k5L8k80J87J14j14K14j11k68M3O4k8K34p5k71L16j1l0j51P2j11
3472a06n2K13q8J92j27rk79J92j5J3L2J13O6k5k56J08m9O1j16J31Q7o6jJ03l07
3497a85K0J95j43J57n8j9jJ1p5O0On6J71j82j25K84O3q0J03l7j89K67o8m1k21
$$ y = [217, -5, -168, -16, 86, 26, 121, 20, 49, 16, -144, -27, 74, -66, 17, 32, -109, 18, -104, -2, 11, -76, 71, -67, 9, -259, 208, 110, 221, 65, 96, 8, -131, 186, -228, -157, 110, 79, -94, -161, 224, 178, -34, -22, 109, -56, -132, -119, -65, 149, 125, 96, 58, -87, 84, -164, -227, -45, 113, -24, -105, -103, 74, 165, -21, 161, -51, -22, -13, 32, -33, 27, 104, 36, -197, 144, 168, 13, -96, -9, 100, 113, 36, -10, -83, -267, -210, -67, 266, 46, -140, 244, -52, 215, -76, -68, -47, -263, 187, -11, -6, -134, 38, 95, -69, -15, -77, -11, 108, 48, -78, 74, -93, 131, 44, -72, 33, -159, -67, 7, -67, -56, 32, 87, 62, 100, -180, 7, 121, 7, 221, 110, -158, -115, -51, -79, 155, 80, -191, 125, 114, 84, -67, 5, -106, -158, 55, -33, 159, 32, 23, -256, -64, -79, -66, -34, 79, 145, 120, -136, -28, -77, -16, -132, -1, 86, 20, 19, 122, -185, -165, 30, -113, 44, -14, -33, -34, -23, -98, -38, -32, -88, 83, -99, -224, 60, 123, 43, 146, 109, -80, 187, 119, 78, -143]
3522a43J84j46m7P2P0m2J20J25l9k08r7L3J39J50o1k27J43j7P5Q9k22k6J40j43
3546g8N5J82k39J66l6r7J53m2l8j25J63n3J3qj5K02o9j33p2O4L6N2j35N4j40J89
3572D9k40K06O6k77L13j3j19J96l9k28N1K20l08Q2r9L1J01rO6n1l4r1P2K0K30
3597A95j38Q0k09m0R1k19J88J05k35L12l47J77p7Q5j46J75r5J56Q2j76p2m9J37
3620b0J04K9k90J95KLJ2j85J66j56J20j47J04j14K63O1k63J4Q5Pk9j4j6M2o5K94
3646B02l9R3k33j20p6J77K24k92J23m4Q1k37J06N7R4q6J87j74m9J32M6k04P1J57
3670A96l97K91R2j88L8p1P1J99j85r8k80L42l2J00j54K05kj38n1p8K88r3J02k01
3694d4l9o2K83k80J89jj13P2j4P1K6k30J55l07R2L80j05l4O4j62l9J62q3p6m8
$$ y = [-143, 41, -105, -152, -80, -10, -52, 68, 193, 154, -54, -151, -118, 21, 171, 110, -117, 26, 9, 84, 173, -49, -75, 65, -78, -23, 159, -80, 86, 50, -47, 106, 64, 26, -99, 64, 11, 24, 16, 1, 203, 134, 1, -71, -7, 29, 81, -54, 0, -140, 49, -191, 15, 81, -196, 117, 104, -15, 181, 142, -86, -35, 185, -123, -41, -140, -109, -8, -17, 49, -2, -36, -127, -55, -35, 195, 57, 137, -72, -112, -21, -240, -52, 53, -182, 130, -217, -40, -117, -32, -178, -3, -98, 58, 140, -36, -108, -157, -20, 84, 113, -177, 18, 20, 23, 35, -150, 16, -140, -20, -167, -63, -177, 86, 147, -116, -102, -17, -10, -39, -53, -69, -27, -92, 202, 163, 256, 23, -97, -173, 4, 228, -64, 59, 15, 96, -141, -35, 22, 116, 30, 217, 43, -6, 126, 172, -32, 39, 196, -201, 90, 182, -6, 32, -39, 32, 231, 46, -52, -332, 10, -22, 78, -76, 129, 127, -11, -62, -140, 148, 55, 157, -44, -83, -145, 138, -142, 47, 46, -67, 5, -9, 62, 88, -142, 13, -294, -202, 178, 73, 39, 103, -59, -98, 64, -19, -95, -143]
3719a43L00j45n3K9O7j68m0J24j57J29J15Ro6o8j18K51n6J27l20K35rj14K21R
3743A59k81J19j27J13LN0m7M4o4l7nj44L13j05J12j70m4J39j15M0J76q0l15K29
3767c7M3j10J58Q6j56J5j0k8K03k25Q9Q8l76J51J4m9oJ13k2L4P6j5q9J13M0j09
3793iJ33k05%j67J71r4J50k8l8R6Q7j52J61m4qJ43j59j45K04O7k52N4m2K10L2
3818A65k83QJ22J84j43o4j57J40P2O2J13l1l33k1K49p4J21j64J32K13l53J49j71
3841f4P0j4m0Q3Pn7J75n9j84o0n3K50M4j62O7J38l66J37K5K28k52m0K31o2j42
3866a00J52m1J51j99P3j87K59k42L03Q6l36Q2r9J03k9n7M7jJ67k0J5oL2j70P6
3891E9J7j48j1L09k46M5N0j38m9K83k25J17k42J96J33j50J22k01J46NK6j05O4
$$ y = [-143, 157, 12, -41, -12, 55, -113, -153, -29, -186, -57, 58, 67, 1, -67, -185, 66, 10, 137, -183, 52, 43, -71, 150, 159, -122, -3, -130, -17, -14, 36, -11, 33, -31, -68, -73, -217, 96, -9, 103, -67, -111, 28, -87, -47, 129, 49, -266, -37, 6, -104, 54, 140, -16, -1, -11, -39, 164, -61, 28, 116, -260, -109, -95, -144, -150, -37, -59, -25, 51, 36, -53, 60, 100, -9, 124, -81, -81, -248, -77, -171, -21, -49, -87, 9, 96, -56, 105, 61, 53, 196, 37, -108, 96, 163, -89, -35, -77, 133, 165, -118, -110, 12, 196, 53, -11, -168, -28, 44, 106, 219, 188, -145, -166, 83, 9, 130, -34, 98, 311, -42, 107, -64, 6, -8, -48, 35, 42, -15, 160, 101, -83, -143, -196, 54, 98, -64, 3, 141, -225, -88, -63, 165, -87, -127, 104, 42, -100, 52, 11, 162, -37, 36, -151, 108, -134, 169, 255, -81, 1, -98, 5, -24, -81, -34, -35, 132, 112, 127, 121, 153, -17, 59, 76, -72, -83, 226, -20, 25, 75, -63, -112, 171, -54, 63, -179, 17, 150, 0, 122, -79, 67, 72, 98, -7, 57]
3914E7M8j81k5J55q0J2K04j70J24k27o9L50m05K28r5K4k5k4J86l55J85L6J14Q0
3938A47l72J80mL8N5j19p0l5J98r8J26j93r2J2K72L8j39m0J32P3j62J8N8k03L00
$$ y = [57, 105, -76, -101, 54, -26, -14, 190, 20, 144, -83, -152, 198, -207, 21, -74, -50, -75, -99, 87, -268, -83, -47, 67, 147, -225, -45, -49, -11, 44, -75, -145, -180, 18, -80, 46, -147, -239, -227, 45, 83, -56, -96, 36, 109, -53, -35, 23, -180, 120]
$$ [...]
8191I
##END NTUPLES=NMR FID
##END=
