##TITLE=1H_DE-170K_TFA_d6
 200.13Hz, DMSO_CCl4.
 8 sc
7.8.2026
##JCAMPDX= 6.0         $$ Bruker NMR JCAMP-DX V2.0
##DATA TYPE= NMR FID
##DATA CLASS= NTUPLES
##ORIGIN= UXNMR, Bruker Analytische Messtechnik GmbH
##OWNER= pz
$$ XWIN-NMR		Version 3.5
$$ Fri Aug  7 13:09:57 2026 Russian Standard Time (UT+4h)  she@DPX200
##.OBSERVE FREQUENCY= 200.1313
##.OBSERVE NUCLEUS= ^1H
##.DELAY= (6, 6)
##.ACQUISITION MODE= SIMULTANEOUS
##.ACQUISITION SCHEME= undefined
##.AVERAGES= 8
##.DIGITISER RES= 18
##SPECTROMETER/DATA SYSTEM= spect
##.PULSE SEQUENCE= zg30
##.SOLVENT NAME= DMSO
##.SHIFT REFERENCE= (INTERNAL, DMSO, 0, 14.3821)
##AUDIT TRAIL= $$ (NUMBER, WHEN, WHO, WHERE, WHAT)
$$ ##TITLE= Audit trail, XWIN-NMR		Version 3.5
$$ ##JCAMPDX= 5.01
$$ ##ORIGIN= Bruker BioSpin GmbH
$$ ##OWNER= she
$$ F:/spectra/data/she/nmr/H-C/1/audita.txt
$$ ##AUDIT TRAIL=  $$ (NUMBER, WHEN, WHO, WHERE, WHAT)
(   1,<2026-08-07 13:08:17.57 +0400>,<she>,<DPX200>,
      <created by zg, POWCHK disabled, PULCHK disabled
       configuration hash MD5:
       00 E9 B6 7A A2 85 ED C7 34 08 36 98 17 FE 4E 26
       data hash MD5: 16K
       F5 EF 79 24 6B 40 A1 27 07 4D 6F 13 94 EC CA 62>)
$$ ##END=
$$ 
$$ hash MD5
$$ 52 88 61 4E 17 45 7E 6E 1A 61 FF 61 2E BA 9C 67
##$RELAX= 
##$RELAX= 
##$RELAX= 
##$RELAX= 
##$RELAX= 
##$RELAX= 
$$ Bruker specific parameters
$$ --------------------------
##$DU= <F:/spectra>
##$EXPNO= 1
##$NAME= <H-C>
##$PROCNO= 1
##$TYPE= <nmr>
##$USER= <she>
##$AMP= (0..31)
100 100 100 100 100 100 100 100 100 100 100 100 100 100 100 100 100 100 
100 100 100 100 100 100 100 100 100 100 100 100 100 100 
##$AQSEQ= 0
##$AQ_mod= 1
##$AUNM= <au_zg>
##$AUTOPOS= <>
##$BF1= 200.13
##$BF2= 200.13
##$BF3= 200.13
##$BF4= 200.13
##$BF5= 200.13
##$BF6= 200.13
##$BF7= 200.13
##$BF8= 200.13
##$BYTORDA= 1
##$CFDGTYP= 0
##$CFRGTYP= 5
##$CHEMSTR= <none>
##$CNST= (0..31)
1 1 145 1 1 1 1 1 1 1 1 1 1 1 1 1 1 1 1 1 1 1 1 1 1 1 1 1 1 1 1 1 
##$CPDPRG= <>
##$CPDPRG1= <>
##$CPDPRG2= <>
##$CPDPRG3= <>
##$CPDPRG4= <mlev>
##$CPDPRG5= <mlev>
##$CPDPRG6= <mlev>
##$CPDPRG7= <mlev>
##$CPDPRG8= <mlev>
##$CPDPRGB= <>
##$CPDPRGT= <>
##$D= (0..31)
0 0.7 0 0 0 0 0 0 0 0 0 0.03 0 0 0 0 0 0 0 0 0 0 0 0 0 0 0 0 0 0 0 0 
##$DATE= 1786093697
##$DBL= (0..7)
120 120 120 120 120 120 120 120 
##$DBP= (0..7)
150 150 150 150 150 150 150 150 
##$DBP07= 0
##$DBPNAM0= <>
##$DBPNAM1= <>
##$DBPNAM2= <>
##$DBPNAM3= <>
##$DBPNAM4= <>
##$DBPNAM5= <>
##$DBPNAM6= <>
##$DBPNAM7= <>
##$DBPOAL= (0..7)
0.5 0.5 0.5 0.5 0.5 0.5 0.5 0.5 
##$DBPOFFS= (0..7)
0 0 0 0 0 0 0 0 
##$DE= 6
##$DECBNUC= <off>
##$DECIM= 32
##$DECNUC= <off>
##$DECSTAT= 4
##$DIGMOD= 1
##$DIGTYP= 9
##$DL= (0..7)
0 120 120 120 120 120 120 120 
##$DP= (0..7)
150 150 150 150 150 150 150 150 
##$DP07= 0
##$DPNAME0= <>
##$DPNAME1= <>
##$DPNAME2= <>
##$DPNAME3= <>
##$DPNAME4= <>
##$DPNAME5= <>
##$DPNAME6= <>
##$DPNAME7= <>
##$DPOAL= (0..7)
0.5 0.5 0.5 0.5 0.5 0.5 0.5 0.5 
##$DPOFFS= (0..7)
0 0 0 0 0 0 0 0 
##$DQDMODE= 0
##$DR= 18
##$DS= 0
##$DSLIST= <SSSSSSSSSSSSSSS>
$$ [...]
##$SUBNAM0= <"">
##$SUBNAM1= <"">
##$SUBNAM2= <"">
##$SUBNAM3= <"">
##$SUBNAM4= <"">
##$SUBNAM5= <"">
##$SUBNAM6= <"">
##$SUBNAM7= <"">
##$SUBNAM8= <"">
##$SUBNAM9= <"">
##$SW= 18.0517328524113
##$SWIBOX= (0..15)
0 0 2 0 0 0 0 0 0 0 0 0 0 0 0 0 
##$SW_h= 3612.71676300578
##$TD= 16384
##$TD0= 1
##$TE= 0
##$TE2= 300
##$TE3= 300
##$TEG= 300
##$TL= (0..7)
0 120 120 120 120 120 120 120 
##$TP= (0..7)
150 150 150 150 150 150 150 150 
##$TP07= 0
##$TPNAME0= <>
##$TPNAME1= <>
##$TPNAME2= <>
##$TPNAME3= <>
##$TPNAME4= <>
##$TPNAME5= <>
##$TPNAME6= <>
##$TPNAME7= <>
##$TPOAL= (0..7)
0.5 0.5 0.5 0.5 0.5 0.5 0.5 0.5 
##$TPOFFS= (0..7)
0 0 0 0 0 0 0 0 
##$TUNHIN= 0
##$TUNHOUT= 0
##$TUNXOUT= 0
##$USERA1= <user>
##$USERA2= <user>
##$USERA3= <user>
##$USERA4= <user>
##$USERA5= <user>
##$V9= 5
##$VALIST= <valist>
##$VCLIST= <CCCCCCCCCCCCCCC>
##$VD= 0
##$VDLIST= <DDDDDDDDDDDDDDD>
##$VPLIST= <PPPPPPPPPPPPPPP>
##$VTLIST= <TTTTTTTTTTTTTTT>
##$WBST= 1024
##$WBSW= 4
##$XGAIN= (0..3)
0 0 0 0 
##$XL= 0
##$YL= 0
##$YMAX_a= 196987
##$YMIN_a= -186646
##$ZGOPTNS= <>
##$ZL1= 120
##$ZL2= 120
##$ZL3= 120
##$ZL4= 120
##$ABSF1= 10
##$ABSF2= 0
##$ABSG= 5
##$ABSL= 3
##$ALPHA= 0
##$AQORDER= 0
##$ASSFAC= 0
##$ASSFACI= 0
##$ASSFACX= 0
##$ASSWID= 0
##$AUNMP= <proc_1d>
##$AZFE= 0.1
##$AZFW= 0.1
##$BCFW= 1
##$BC_mod= 2
##$BYTORDP= 1
##$COROFFS= 0
##$CY= -3
##$DATMOD= 1
##$DC= 2
##$DFILT= <>
##$DTYPP= 0
##$F1P= 0
##$F2P= 0
##$FCOR= 0.5
##$FTSIZE= 0
##$FT_mod= 4
##$GAMMA= 1
##$GB= 0.15
##$INTBC= 1
##$INTSCL= 1
##$ISEN= 128
##$LB= 0.25
##$LEV0= 0
##$LPBIN= 0
##$MAXI= 10000
##$MC2= 0
##$MEAN= 0
##$ME_mod= 0
##$MI= 1.114404
##$NCOEF= 0
##$NC_proc= 0
##$NLEV= 6
##$NOISF1= 3.799351
##$NOISF2= 2.8
##$NSP= 1
##$NTH_PI= 0
##$NZP= 0
##$OFFSET= 14.38212
##$PC= 1
##$PHC0= -4218.145
##$PHC1= 8.7923
##$PH_mod= 1
##$PKNL= yes
##$PPARMOD= 0
##$PSCAL= 0
##$PSIGN= 0
##$REVERSE= no
##$SF= 200.129724274929
##$SI= 16384
##$SIGF1= 3
##$SIGF2= 2
##$SINO= 400
##$SIOLD= 16384
##$SREGLST= <1H.CDCl3>
##$SSB= 0
##$STSI= 0
##$STSR= 0
##$SW_p= 3205.1282051282
##$SYMM= 0
##$S_DEV= 0
##$TDeff= 0
##$TDoff= 0
##$TI= <>
##$TILT= no
##$TM1= 0
##$TM2= 0
##$TOPLEV= 0
##$USERP1= <user>
##$USERP2= <user>
##$USERP3= <user>
##$USERP4= <user>
##$USERP5= <user>
##$WDW= 1
##$XDIM= 8192
##$YMAX_p= 0
##$YMIN_p= 0
$$ End of Bruker specific parameters
$$ ---------------------------------
##NTUPLES= NMR FID
##VAR_NAME=  TIME,          FID/REAL,        FID/IMAG
##SYMBOL=    X,             R,               I
##VAR_TYPE=  INDEPENDENT,   DEPENDENT,       DEPENDENT
##VAR_FORM=  AFFN,          ASDF,            ASDF
##VAR_DIM=   8192,          8192,            8192
##UNITS=     SECONDS,       ARBITRARY UNITS, ARBITRARY UNITS
##FACTOR=    0.0002768,     1,               1
##FIRST=     0,             0,               0
##LAST=      2.2672688,     0,               0
##MIN=       0,             -186646,         0
##MAX=       2.2672688,     196987,          0
$$ Real data points
##PAGE= N=1
##DATA TABLE= (X++(R..R)), XYDATA
$$ plain form
0 0 0 0 0 0 0 0 0 0 0 0 0 0 0 0 0 0 8 -8 8 -8 8 -16 16 -16 24 -24 31 -35 40 -47 53 -60 69 -78 88 -100 113
37 113 -126 140 -157 175 -196 216 -241 265 -294 324 -355 394 -434 477 -525 578 -639 707 -781
56 -781 864 -963 1073 -1204 1359 -1548 1780 -2081 2480 -3044 3901 -5392 8774 -34883 -542
71 -542 -81378 -175572 6895 104801 48913 8102 -49362 -142649 -84904 7492 -7788 47245
83 47245 191504 136719 -17596 -33774 -32349 -53779 45688 104537 20107 -12861 -4773 -107563
95 -107563 -172029 -69306 40115 64898 71890 33043 -38840 -40272 -30736 -61094 13089 133931
107 133931 108345 29582 10236 -31406 -58550 -11051 11495 6051 50784 42557 -79790 -135840
119 -135840 -71658 -35142 -5882 72812 76479 24628 30514 -10345 -88886 -16021 101063 68550
$$ packed form
0@%%%%%%%%%%%%%%%%Qj6J6j6J6k4L2l2M0m8N5o6P5q7J00j13J29j47J66j88K13
37A13k39K66k97L32l71M12m57N06n59O18o79P49q28R11j002J103j217J346j488
56g81J645j827K036k277K563k907L328l861M561n524O945r293J4166m3657L4341
71e42q0836r4194J82467R7906n5888m0811n7464r3287N7745R2396j5280N5033
83D7245J44259n4785j54315j6178J425k1430R9467N8849q4430l2968Q088j02790
95a07563o4466J02723J09421K4783O992l8847p1883j432R536l0358P4183J20842
107A33931k5586p8763j9346m1642k7144M7499K2546n444M4733q227j22347n6050
119a35840O4182L6516K9260P8694L667n1851N886m0859p8541P2865J17084l2513
$$ plain form
131 68550 15336 36951 3966 -67562 -47895 -9474 -16848 26934 59879 -28539 -87461 -41604
143 -41604 -38508 -49900 15595 55749 40623 51122 36257 -32896 -33706 36952 43310 7040 24881
156 24881 28326 -23356 -45644 -48798 -51069 3963 50736 10806 -22925 -7935 -16744 -40814 -23553
169 -23553 17297 48306 64466 39873 -12648 -15427 14169 -1653 -10688 24169 24005 -7170 -26548
182 -26548 -58344 -63318 -7211 22528 -762 7573 37429 10440 -33308 -18564 7864 17952
194 17952 42200 35567 -7148 1505 15914 -29265 -39540 13660 27781 -272 -14906 -27716
206 -27716 -41628 -22893 -216 -10233 8784 57339 36451 -20031 -12518 12675 10752 16387 14494
219 14494 1304 9120 7306 -28907 -43004 -2962 23641 2612 -11357 -5397 -9365 -8951 -10974
$$ packed form
131F8550n3214K1615l2985p1528J9667L8421p374M3782L2945q8418n8922M5857
143d1604L096j1392O5495M0154j5126J0499j4865o9153q10P0658O358l6270J7841
156B4881L445n1682k2288l154k271N5032M6773l9930l3731J4990q809k4070J7261
169b3553M0850L1009J6160k4593n2521k779K9596j5822r035L4857j64l1175j9378
182b6548l1796m974N6107K9739k3290Q335K9856k6989m3748J4744K6428J0088
194A7952K4248o633m2715Q653J4409m5179j0275N3200J4121k8053j4634j2810
206b7716j3912J8735K2677j0017J9017M8555k0888n6482P513K5193j923N635j893
219A4494j3190P816j814l6213j4097M0042K6603k1029j3969N960l968M14k023
$$ plain form
232 -10974 -23840 528 42946 31964 300 650 11537 8311 -3375 -8780 913 14821 6902
245 6902 -28063 -41133 -11454 3420 -6180 1002 9761 7803 5838 -10916 -22137 4094 28036
258 28036 16505 1262 8003 14741 1705 -8062 -4661 -1206 6254 4559 -20669 -25559 -4178 -4693
272 -4693 -13652 -3489 12669 22016 16625 -171 -5946 5683 14581 1984 -7922 10111 18061 -4618
286 -4618 -17991 -12709 -1686 8197 -798 -16657 -9421 1765 -6660 -19601 -11209 15295 22679 6258
300 6258 -1072 5088 13133 11096 -6007 -9471 6454 8188 -4809 -14405 -11888 1087 3673 -8181
314 -8181 -9973 1181 9629 2741 -13209 -10258 8101 12082 5665 1904 5796 14240 7773 -7459
328 -7459 -6564 3299 7927 -339 -15973 -12219 2430 -399 -9589 -7550 4680 11510 -414 -7702
$$ packed form
232a0974j2866K4368M2418j0982l1664L50J0887l226j1686n405R693J3908p919
245F902l4965j3070K9679J4874r600P182Q759j958j965j6754j1221K6231K3942
258B8036j1531j5243O741O738j3036r767L401L455P460j695k5228m890K1381n15
272d693q959J0163J6158R347n391j6796n775J1629Q898j2597r906J8033P950k2679
286d618j3373N282J1023R883q995j5859P236J1186q425j2941Q392K6504P384j6421
300F258p330O160Q045k037j7103l464J5925J734j2997r596K517J2975K586j1854
314h181j792J1154Q448o888j5950K951J8359L981o417l761L892Q444o467j5232
328g459Q95R863M628q266j5634L754J4649k829r190K039J2230O830j1924p288
$$ plain form
342 -7702 3872 10921 6401 341 -1332 6869 9753 286 -5093 -3371 -489 -1471 -11597 -12187 -238
357 -238 -391 -8593 -10260 -4924 4583 5907 222 2578 7242 9384 7726 -448 1683 11165 7170 -2751
373 -2751 -7803 -5105 4379 93 -13428 -10336 1094 3417 -3632 -8741 1909 11352 3985 -3467
387 -3467 -1373 7010 13923 5231 -5986 -1399 4254 2738 -4153 -9180 -709 4951 -5475 -11901 -7081
402 -7081 1085 5191 -1275 -4712 1902 7020 6680 343 -3776 5862 8855 -2386 -4869 1519 3475
417 3475 -471 -6813 -6671 -547 624 -1176 -4692 -5014 1614 48 -5060 202 5763 6055 3929 -2957
433 -2957 457 8352 5177 -558 480 4310 5668 -3164 -8377 -94 4214 -1961 -8419 -7255 3290
448 3290 3954 -6040 -4344 1617 2106 3167 -92 -1042 6459 7469 -2198 -6956 -759 7351 3761 -3689
$$ packed form
342g702J1574P049m520o060j673Q201K884r467n379J722K882r82j0126n90J1949
357b38j53q202j667N336R507J324n685K356M664K142j658q174K131R482l995r921
373b751n052K698R484m286j3521L092J1430K323p049n109J0650R443p367p452
387c467K094Q383O913q692j1217M587N653j516o891n027Q471N660j0426o426M820
402g081Q166M106o466l437O614N118l40o337m119R638K993j1241k483O388J956
417C475l946o342J42O124J171j800l516l22O628j566n108N262N561K92k126o886
433b957L414P895l175n735J038L830J358q832n213Q283M308o175o458J164J0545
448C290O64r994J696N961M89J061l259r50P501J010r667m758O197Q110l590p450
$$ plain form
464 -3689 -3000 -4749 -4145 -829 -7660 -7385 6601 4528 -7540 -5318 4991 6504 3535 5357 6084
479 6084 16 1375 3349 -5325 -3058 5812 -173 -5206 -1013 -2610 -3731 -962 -1109 -3370 -2845 2620
495 2620 2234 -2007 2340 5336 2043 5720 5956 1387 3712 1157 -4799 -2361 -673 -2033 -1691 -2376
511 -2376 -2928 -2557 -1576 -543 -1095 222 -720 -6887 -778 6844 -326 -10 7039 618 -1107 5512 1601
528 1601 -2979 2412 2194 -8898 -9369 3270 1688 -4226 5593 2959 -9648 397 7154 -5088
542 -5088 -653 11259 3412 -6147 -167 4601 2944 7229 8002 -5434 -6538 4595 -4967 -13355 335
557 335 4042 -4141 -3421 -2124 -476 4302 3985 -817 264 4439 1444 -4448 796 4308 -551 2861
573 2861 4847 -2409 -1778 -738 -6084 -3812 -3068 -7644 -2910 1266 -3038 -2758 5975 6373 942 5509
$$ packed form
464c689O89j749O04L316o831K75J3986k073j2068K222J0309J513k969J822P27
479F084o068J359J974q674K267Q870n985n033M193j597j121K769j47k261N25N465
495B620l86m241M347K996l293L677K36m569K325k555n956K438J688j360L42o85
511b376n52L71R81J033n52J317r42o167O109P622p170L16P049o421j725O619l911
528A601m580N391k18j1092m71J2639j582n914R819k634j2607J0045O757j2242
542e088M435J1912p847r559N980M768j657M285P73j3436j104J1133r562q388J3690
557C35L707q183P20J297J648M778l17m802J081M175k995n892N244L512m859L412
573B861J986p256O31J040n346K272P44m576M734M176m304K80Q733L98n431M567
$$ plain form
589 5509 8289 -3856 -3439 7823 -1402 -6613 7044 3644 -7817 847 5473 -3867 -2375 4982
603 4982 -3773 -13399 -2765 3138 -3589 3700 9584 -1298 2028 10822 618 -2476 8136 3630
617 3630 -9851 -8395 -1858 -3820 -3231 4493 994 -5162 1782 594 -6699 -252 3559 -1890 -1869 -61
633 -61 -1638 2759 7762 7545 3306 1344 1408 -2069 -4290 -4724 -6408 -3127 -1104 -5483 -1550 5184 2242
650 2242 2774 5935 728 -99 3615 455 -3921 -133 4369 569 268 6510 2076 -5024 2420 1478
666 1478 -9615 -5168 119 -5610 -5163 390 976 1499 6892 6986 148 963 5083 -2657 -4998 1497
682 1497 -2362 -5746 1074 -335 -4323 2312 5808 -23 -4166 -1753 -1131 -4054 -1224 2198 -782
697 -782 1193 4664 1807 3318 6148 2859 1861 -1118 -5962 -4427 -1435 -1136 -1165 -1269 300 911 1427
$$ packed form
589E509K780j2145M17J1262r225n211J3657l400j1461Q664M626r340J492P357
603D982q755r626J0634N903o727P289N884j0882L326Q794j0204l094J0612m506
617C630j3481J456O537j962N89P724l499o156O944j188p293O447L811n449K1J808
633f1j577M397N003k17m239j962O4l477k221m34j684L281K023m379L933O734k942
650B242N32L161n207q27L714l160m376L788M502l800l01O242m434p100P444r42
666A478j1093M447N287n729M47N553N86N23N393R4o838Q15M120p740k341O495
682A497l859l384O820j409l988O635L496n831m143K413O22k923K830L422k980
697g82J975L471k857J511K830l289r98k979m844J535K992K99k9j04J569O11N16
$$ plain form
714 1427 2808 988 792 2808 -2399 -4443 1375 1634 960 4653 1594 -1686 2479 3147 -1779 -4919
730 -4919 -2159 -3124 -7772 -3160 894 -2767 792 4793 -994 -418 5742 3313 309 777 -1205 -2736
746 -2736 -313 2890 -89 -2126 2482 143 -4553 -207 960 -2685 -615 -694 -3968 -341 4388 4461
762 4461 3008 2599 3566 1843 950 2035 -949 -2993 -1523 -3810 -4474 -1526 -742 876 1200 -2782 -1429
779 -1429 2653 2211 1065 -216 281 1076 379 1742 1980 1072 2502 113 -3997 -1878 -1427 -3170 -1901
796 -1901 -3412 -4708 -1896 227 1513 1495 1547 3055 1985 1233 2724 738 829 2581 -1587 -2849 994
813 994 1302 997 249 -1379 -1274 -1254 -774 -723 -1869 -245 613 -1341 530 2959 2537 3844 3353 166
831 166 -203 -701 -66 440 -3692 -4034 -1368 -814 -1014 -1145 -174 2234 -62 -2809 -1066 73 689 942
$$ packed form
714A427J381j820j96K016n207k044N818K59o74L693l059l280M165O68m926l140
730d919K760r65m648M612M054l661L559M001n787N76O160k429l004M68j982j531
746b736K423L203k979k037M608k339m696M346J167l645K070p9l274L627M729P3
762D461j453m09R67j723q93J085k984k044J470k287o64K948P84J618L24l982J353
779a429M082m42j146j281M97P95o97J363K38r08J430k389m110K119M51j743J269
796a901j511j296K812K123J286j8N2J508j070p52J491j986R1J752m168j262L843
813I94L08l05p48j628J05K0M80N1j146J624Q58j954J871K429m22J307m91l187
831A66l69m98O35N06m132l42K666N54k00j31R71K408k296k747J743J139O16K53
$$ plain form
849 942 -797 810 2607 1973 3312 2665 629 383 -1493 -2866 -2651 -3349 -1802 -1004 -2207 -1005 666
866 666 1529 4208 2579 -162 702 723 647 474 -301 1151 1998 483 1036 351 -347 1612 -1124 -4577
884 -4577 -3936 -2007 -1017 -1121 -1236 1386 2141 1693 3051 2524 448 1422 -138 -2449 -2310 -1920 259 975
902 975 -1155 -974 284 411 758 -1853 -1599 408 -2136 -2681 711 1685 2158 2467 2241 2357 571 382
920 382 1981 -225 -2430 -1661 -2255 -678 1152 -390 441 1721 693 -288 -1096 446 2314 -568 -1809
937 -1809 -284 -464 1696 3058 401 -91 312 -69 -901 -2776 -1079 658 -1709 -2027 -616 -748 1721
954 1721 2191 -247 -398 61 310 143 -1281 -302 1015 -841 403 612 -1117 836 1718 -1301 -1892
971 -1892 -694 823 479 -733 637 909 -406 1731 1526 -567 1023 1058 -1320 -554 81 475 446 -108
$$ packed form
849I42j739J607J797o34J339o47k036k46j876j373K15o98J547P98j203J202J671
866F66Q63K679j629k741Q64K1p6j73p75J452Q47j515N53o85o98J959k736l453
884d577O41J929R90j04j15K622P55m48J358n27k076R74j560k311J39L90K179P16
902I75k130J81J258J27L47k611K54K007k544n45L392R74M73L09k26J16j786j89
920C82J599k206k205P69n94J577J830j542Q31J280j028r81q08J542J868k882j241
937a809J525j80K160J362k657m92M03l81q32j875J697J737k367l18J411j32K469
954A721M70k438j51M59K49j67j424R79J317j856J244K09j729J953Q82l019n91
971a892J198J517l44j212J370K72j315K137k05k093J590L5k378P66O35L94k9n54
$$ plain form
989 -108 432 -1135 -2088 1818 1263 -1974 -219 189 -1012 448 1412 968 -507 74 632 -1975 -2544 2232
1007 2232 1156 -2471 -1142 -304 -726 949 1301 -491 -648 336 25 -2615 -764 3383 845 -547
1023 -547 1504 -1117 -798 3096 1360 -1977 -1117 902 170 -2153 -88 2388 -8 5 958 -1194 -122
1040 -122 2089 -509 -1177 -99 322 646 -80 441 916 -399 559 843 -1476 -1259 -404 -1171 -1214 -488 314
1059 314 1266 -44 584 780 -2016 -15 3434 -442 -2138 78 444 -935 -809 1773 1287 -1137 23
1076 23 -631 -2728 532 2595 -644 -929 507 -632 257 2461 2254 -211 -233 1668 -933 -2716 1174
1093 1174 1962 -1493 -274 -44 -2042 145 1957 162 -1472 -195 1655 -1302 -2511 1697 1940 -223
1109 -223 659 -20 -1509 344 936 -484 -1404 -888 615 -983 -1272 858 17 -735 1439 -185 -1164
$$ packed form
989a08N40j567r53L906n55l237J755M08j201J460R64m44j475N81N58k607n69M776
1007B232j076l627J329Q38m22J675L52j792j57R84l11k640J851M147k538j392
1023e47K051k621L19L894j736l337Q60K019p32k323K065K476k396J3R53k152J072
1040a22K211k598o68J078M21L24p26N21M75j315R58K84k319K17Q55p67m3P26Q02
1059C14R52j310O28J96k796K001L449l876j696K216L66j379J26K582m86k424J160
1076B3o54k097L260K063l239k85J436j139Q89K204k07k465k2J901k601j783L890
1093A174P88l455J219K30j998K187J812j795j634J277J850k957j209M208K43k163
1109b23Q82o79j489J853N92j420r20N16J503j598k89K130q41p52K174j624r79
$$ plain form
1126 -1164 458 838 -562 -1261 396 1699 37 -419 1467 -613 -413 1986 740 -1440 -467 -36
1142 -36 -740 -663 517 1583 -408 483 1714 -1465 -1095 2610 591 -894 387 -170 -352 185 927 229
1160 229 -486 1258 -49 -3469 -1139 1899 -808 -1168 -34 -1161 -1125 845 1443 161 -204 1480 647
1177 647 -1718 208 887 -276 133 -210 -1984 -89 998 351 -40 -679 230 431 -762 -13 97 95
1195 95 1241 35 -775 1212 1344 1112 347 -967 -11 622 -920 -546 -32 -1148 -405 441 -99 49
1213 49 375 1197 -494 -1951 556 628 -721 903 -168 -1640 643 1164 -53 -260 149 -176 -1087 -896
1231 -896 48 -1166 -115 1685 -1023 -1434 2194 1093 220 1302 212 -964 19 700 -16 -544 545
1248 545 894 -1076 -254 1114 335 913 255 -1796 -596 541 37 235 68 95 451 569 290 57 455
$$ packed form
1126a164J622L80j400o99J657J303j662m56J886k080K00K399j246k180R73M31
1142c6p04P7J180J066j991Q91J231l179L70L705k019j485J281n57j82N37P42o98
1160B29p15J744j307l420K330L038k707l60J134j127L6J970N98j282l65J684q33
1177F47k365J926O79j163M09l43j774J895J087o47l91o39R09K01j193P49J10k
1195I5J146j206q10J987J32k32p65j314R56O33j542L74N14j116P43Q46n40J48
1213D9L26Q22j691j457K507P2j349J624j071j472K283N21j217k07M09l25r11J91
1231h96R44j214J051J800k708m11L628j101q73J082j090j176R83O81p16n28J089
1248E45L49j970Q22J368p79N78o58k051J200J137n04J98j67K7L56J18k79k33L98
$$ plain form
1267 455 1241 -407 -1948 -264 -161 -403 837 -1173 -1235 817 -62 -112 631 29 -532 -86 -68 -2 -769
1286 -769 1303 1007 -997 -414 1330 154 157 482 -1313 -571 184 -624 -652 366 453 216 -268 616 548 175
1306 175 1635 497 -1804 254 449 -170 313 39 -203 262 54 16 -287 61 488 -600 -1439 -362
1324 -362 -199 579 1182 -573 -591 1046 11 168 171 -652 -259 -744 -1059 -274 -206 874 507 -581 25 155
1344 155 -113 1005 128 -1382 -206 378 96 553 599 925 558 -304 -280 -182 71 1041 -665 -1519 102
1363 102 158 381 826 186 168 534 -306 -490 -40 75 140 -350 -687 35 -35 934 1070 -636 -673 -333 -594
1384 -594 262 -423 -785 160 -138 117 564 76 1130 635 -958 -969 -185 -142 294 -524 -503 185 -212 335
1404 335 701 110 154 270 -335 -709 -646 432 1059 294 -496 0 379 1063 269 -531 25 0 -793 -154 -77
$$ packed form
1267D55P86j648j541J684J03k42J240k010o2K052q79n0P43o02n61M46J8O6p67
1286g69K072k96k004N83J744j176LL25j795P42P55q08k8J018Q7k37m84Q84o8l73
1306A75J460j138k301K058J95o19M83k74k42M65k08l8l03L48M27j088q39J077
1324c62J63P78O03j755j8J637j035J57Lq23L93m85l15P85O8J080l67j088O06J30
1344A55k68J118q77j510J176N84k82M57M6L26l67q62K4R8K53R70j706q54J621
1363A02N6K23M45o40j8L66q40j84M50J15O5m90l37P22p0R69J36j706l7L40k61
1384e94Q56o85l62R45k98K55M47m88J054m95j593j1P84M3M36q18K1O88l97N47
1404C35L66n91M4J16o05l74O3J078O27p65p90M96L79O84p94q00N56k5p93O39P7
$$ plain form
1425 -77 150 719 188 -361 128 25 633 385 -1153 -832 -405 -461 105 -93 -39 330 -119 -6 -118 -666 515
1446 515 176 -1167 -554 71 -10 769 634 -356 -4 241 354 -312 -3 782 -21 -584 592 -172 252 1070
1466 1070 317 -893 48 66 95 431 574 101 -597 200 838 -429 -226 1028 -258 -597 -435 -224 718
1485 718 530 -487 -392 -221 140 184 -419 -294 -72 -324 113 -100 -385 867 248 -183 -471 -727 -96 701
1505 701 -520 -842 339 256 -131 27 517 572 23 152 17 -1024 514 1170 -447 -304 669 280 82
1524 82 404 -233 -477 -251 291 -281 -765 860 231 -526 407 510 -523 497 889 -855 -977 -545 5
1543 5 -260 -26 350 -360 -595 631 -365 -694 545 261 -667 -609 -651 28 1196 353 158 -211 -280 374 39
1564 39 -119 52 -178 -618 -376 -451 422 828 500 606 -390 -118 861 227 -692 229 533 235 -58 -219 423
$$ packed form
1425g7K27N69n31n49M89j03O08k48j538L21M27n6N66j98N4L69m49J13j12n48J181
1446E15l39j343O13O25q1P79j35r90L52K45J13o66L09P85q03n63J176p64M24Q18
1466A070p53j210R41J8K9L36J43m73o98P97O38j267K03J254j286l39J62K11R42
1485G18j88j017R5J71L61M4o03J25K22k52M37k13k85J252o19m31k88k56O31P97
1505G01j221l22J181q3l87J58M90N5n49J29j35j041J538O56j617J43R73l89j98
1524H2L22o37k44K26N42n72m84J625o29p57R33J03j033J020L92j744j22M32N50
1543Ek65K34L76p10k35J226r96l29J239k84r28N8m2O79J168q43j95l69o9O54l35
1564C9j58J71k30m40K42p5Q73M06l28J06r96K72R79o34r19R21L04k98k93j61O42
$$ plain form
1585 423 224 202 115 -1266 -658 750 -487 -836 53 177 55 220 -4 34 76 331 -11 -1038 155 736
1605 736 -798 -511 45 -738 222 343 -377 -719 -381 -269 78 196 514 420 -190 312 331 -87 659 530
1625 530 239 461 -550 -351 384 189 138 229 -522 -290 -63 -222 -230 -42 582 81 -641 -178 807 704 682
1646 682 -374 -1244 482 1016 -799 -743 460 472 -680 -982 14 102 -35 822 -899 -1026 432 821 -246
1665 -246 -31 477 286 298 -137 -98 79 476 -52 -945 -262 808 238 -533 62 -135 -29 142 -177 56
1685 56 45 -46 329 -170 77 1066 234 -190 160 -127 -276 -194 -327 284 -570 -477 81 168 -59 314 -359 -256
1707 -256 226 -272 -262 144 272 322 -411 -241 -206 66 618 174 -983 -361 400 -377 -501 105 162 618 73
1728 73 -683 192 861 639 -125 -881 -9 636 455 -196 -596 238 728 -496 -713 269 37 203 -304 -744
$$ packed form
1585D23j99k2q7j381O08J408j237l49Q89J24j22J65k24L8M2K55l42j027J193N81
1605G36j534K87N56p83R60J21p20l42L38J12L47J18L18r4o10N02J9m18P46j29
1625E30k91K22j011J99P35j95n1R1p51K32K27j59qJ88O24n01p22M63R85j03k2
1646F82j056q70J726N34j815N6J203J2j152l02R96Q8j37Q57j721j27J458L89j067
1665b46K15N08j91J2m35L9J77L97n28q93O83J070n70p71N95j97J06J71l19K33
1685E6j1r1L75m99K47R89q32m24L50k87j49Q2j33O11q54R3N58Q7k27L73o73J03
1707b56M82m98J0M06J28N0p33J70L5K72N52m44j157O22P61p77j24O06N7M56n45
1728G3p56Q75O69k22p64p56Q72O45j81o51m00Q34M90j224k17R82k32J66n07m40
$$ plain form
1748 -744 33 719 33 -194 -299 474 390 -404 9 359 -149 121 -290 -871 415 865 -86 -719 -169 57
1768 57 -457 -414 -74 148 -466 -154 -347 -54 1008 299 -394 8 132 -243 -118 -248 99 232 71 -325
1788 -325 -56 519 1094 -119 -503 80 336 27 -419 -118 612 524 -550 -572 261 555 82 -798 -873 -59
1808 -59 198 306 -667 -341 721 477 -351 -355 290 736 30 -786 -661 472 925 -195 -751 -148 577 26
1828 26 -441 -397 -175 53 29 -725 -293 834 544 322 -28 267 481 115 -163 93 61 76 179 -562 283
1849 283 525 88 -259 -248 4 488 -107 -348 288 39 -318 -688 -215 942 462 -550 -186 -35 311 -61
1869 -61 -843 -220 436 -196 -521 -379 116 494 -10 -537 -67 -51 331 120 -956 -93 627 362 -167 -176 597
1890 597 948 -134 -573 -246 377 468 -345 -814 174 661 47 -297 -15 388 624 142 -768 127 519 374
$$ packed form
1748g44P77O86o86k27j05P73q4p94M13L50n08K70m11n81J286M50r51o33N50K26
1768E7n14M3L40K22o14L12j93K93J062p09o93M02J24l75J25j30L47J33j61l96
1788c25K69N75N75j213l84N83K56l09m46L01P30q8j074k2Q33K94m73q80p5Q14
1808e9K57J08r73L26J062k44q28mO45M46p06q16J25J133M53j120n56O03P25n51
1828B6m67M4K22K28k4p54M32J127k90k22l50K95K14l66k78K56l2J5J03p41Q45
1849B83K42m37l47J1K52M84n95k41O36k49l57l70M73J157m80j012L64J51L46l72
1869f1p82O23O56o32l25J42M95L78n04n27M70J6L82k11j076Q63P20k65n29rP73
1890E97L51j082m39L27O23R1q13m69R88M87o14l44K82M03K36m82r10Q95L92j45
$$ plain form
1910 374 -347 -576 281 355 -611 -480 65 444 176 -727 -624 467 453 231 -396 -85 49 66 -343 374 -9
1931 -9 -6 -110 -762 -436 226 -2 -331 -203 97 180 -210 -78 407 145 324 92 -832 455 825 94 -569
1952 -569 -87 220 686 -261 -41 695 401 -193 -615 -548 623 1010 -174 -687 -82 590 454 -741 -533
1971 -533 436 396 -490 -693 -198 639 384 -590 -712 348 390 253 -630 -19 560 2 55 -474 -30 816 291
1992 291 -391 -561 196 750 88 -336 -7 315 -159 -245 -529 217 758 -162 -600 251 453 258 -114 -141 189
2013 189 24 -464 125 248 167 200 -477 -334 452 324 -418 -274 -301 583 -117 -473 32 350 281 64 -452
2034 -452 -506 479 167 -363 -510 -85 693 -44 -619 208 329 499 -78 -208 -55 674 263 -617 -641 340 657
2055 657 -457 -374 387 19 43 -59 -720 4 745 187 -923 -559 413 470 -175 -252 13 -19 154 -87 -540
$$ packed form
1910C74p21k29Q57P4r66J31N45L79k68r03J03J091j4k22o27L11J34J7m09P17l83
1931iLj04o52L26O62k28l29J28L00Q3l90J32M85k62J79k32r24J287L70p31o63
1952e69M82L07M66r47K20P36k94n94m22O7J171L87j184n13O05O72j36j195K08
1971e33R69m0q86k03M95Q37k55r74j22J060M2j37q83O11N79n58N3n29M44Q46n25
1992B91o82j70P57N54o62m24L29L22m74q6k84P46N41r20m38Q51K02j95l72k7L30
2013A89j65m88N89J23q1L3o77J43P86j28p42J44k7Q84p00l56N05L18o9k17n16
2034d52n4R85l12n30j47M25P78p37n75Q27J21J70n77j30J53P29m11q80k4R81L17
2055F57j114Q3P61l68K4j02o61P24P41n58j110L64R72N7o45p7K65l2J73k41m53
$$ plain form
2076 -540 359 520 -401 -233 236 175 266 -236 -387 -306 -120 214 -209 -121 369 178 -461 -71 303 82 -128
2097 -128 -655 -10 215 -180 -112 80 304 390 -242 -561 300 315 484 -323 -231 348 515 -106 -79 188 492 434
2119 434 -278 -408 43 628 78 -779 -498 458 304 -365 150 251 260 -15 -812 -911 306 539 -235 -1046 -41
2140 -41 649 48 25 -249 -253 -1 328 -482 -328 360 -102 -221 -159 90 1 94 -366 -296 -188 111 44 -336 162
2163 162 386 59 -261 -272 244 574 -22 -419 191 -72 -1 209 24 295 298 -309 -55 -31 150 590 -468
2184 -468 -55 250 118 -3 318 -12 124 262 -686 -555 326 239 -422 -637 -266 443 -307 146 79 -68 199
2205 199 -54 -335 -263 392 327 -119 -230 218 374 171 -11 -206 25 265 49 -565 157 446 144 -74 -197
2226 -197 72 459 150 -63 -131 26 205 -319 -111 -45 53 -41 -355 -348 197 181 -216 -136 -83 16 -37 309 -37 281
$$ packed form
2076e40Q99J61r21J68M69o1R1n02j51Q1J86L34m23Q8M90j91o39L90L74k21k10
2097a28n27O45K25l95O8J92K24Q6o32l19Q61J5J69q07R2N79J67o21K7K67L04n8
2119D34p12j30M51N85n50q57K81R56j54o69N15J01Rk75p97r9J217K33p74q11J005
2140d1O90o01k3k74mK52L29q10J54O88m62j19O2K49q9R3m60P0J08K99o7l80M98
2163A62K24l27l20j1N16L30n96l97O10k63P1K10j85K71Lo07K54K4J81M40j058
2184d68M13L05j32j21L21l30J36J38r48J31Q81q7o61k15L71P09p50M53o7j47K67
2205A99k53k81P2O55o5m46j11M48J56k03j82j95K31K40k16o14P22K89l02k18j23
2226a97K69L87l09k13o8J57J79n24K08O6R8r4l14PN45j6l97Q0N3R9n3L46l46L18
$$ plain form
2250 281 -102 -48 -95 -282 134 -134 84 278 -12 -317 142 -134 -39 188 -355 -376 -47 11 222 -179 -123 428
2272 428 15 2 23 -185 258 202 -69 -462 -93 401 125 -186 -364 199 -68 -50 -127 -135 302 104 -219 -130 21
2295 21 118 348 -361 -170 -128 275 298 95 -158 -22 36 -224 54 90 357 368 -424 -9 233 -4 269 -116
2317 -116 -165 187 -9 -29 154 -45 94 60 -455 -246 126 -114 -11 -87 -217 114 3 166 163 -156 1 74
2339 74 -109 263 84 -126 68 -51 -255 59 -152 2 170 -133 -66 -194 66 193 133 -116 -164 145 186 388
2361 388 -223 206 219 -361 -167 173 -53 94 94 -338 187 -257 103 157 7 158 163 111 -146 -4 176 281
2383 281 145 -142 -39 2 72 123 -382 20 248 -89 -55 -125 -75 58 -228 -132 104 46 -101 -77 -335 49 -55
2406 -55 -146 74 266 -267 -75 -316 -37 519 -235 222 -87 -134 -245 72 -144 169 74 -5 114 -81 210 92
$$ packed form
2250B81l83N4m7j87M16k68K18J94k90l05M59k76R5K27n43k1L29N8K11m01N6N51
2272D28m13j3K1k08M43n6k71l93L69M94k76l11j78N63k67J8p7qM37j98l23Q9J51
2295B1R7K30p09J91M2M03K3k03k53J36N8k60K78L6K67J1p92M15K42k37K73l85
2317a16m9L52j96k0J83j99J39l4n15K09L72k40J03p6j30L31j11J63ll19J57P3
2339G4j83L72j79k10J94j19k04L14k11J54J68l03O7j28K60J27o0k49m8L09M1K02
2361C88o11M29J3n80J94L40k26J47%m32N25m44L60N4j50J51Nn2k57J42J80J05
2383B81j36k87J03M1P0N1n05M02K28l37L4p0N0J33k86R6K36n8j47K4k58L84j04
2406e5r1K20J92n33J92k41K79N56p54M57l09m7j11L17k16L13r5p9J19j95K91j18
$$ plain form
2428 92 -165 -66 -87 35 42 -5 -185 221 41 107 -205 208 174 -151 158 -215 177 142 151 -129 -48 123 -31 -117
2452 -117 -336 204 257 205 -220 96 -237 -226 319 51 -155 21 43 -142 -161 -66 12 94 -320 -71 -215 -85 -8
2475 -8 72 -197 -69 -22 -28 228 -17 123 -300 82 147 -131 116 182 37 28 93 -183 107 209 -71 -62 8 -84 332
2500 332 84 -3 -26 -255 -159 167 -148 -34 -2 189 -403 -129 -254 225 -98 -121 -305 -36 188 22 278 -109
2522 -109 -97 -94 -88 98 90 294 -241 -65 243 -157 54 -49 -335 50 1 -162 312 -104 195 363 169 -258 -155
2545 -155 -65 227 107 -162 -77 -105 -31 -17 -94 267 302 2 -129 -18 -233 -157 -134 -417 -4 81 20 363 55 1
2569 1 -252 -424 35 44 -293 -29 53 -262 -219 -122 216 14 137 161 -232 21 0 31 -180 -161 289 -5 -182 69
2593 69 158 99 -146 206 98 -377 209 -12 -236 248 -125 128 206 175 -6 293 -50 9 29 12 220 38 263
$$ packed form
2428I2k57R9k1J22Pm7j80M06j80O6l12M13l4l25L09l73L92l5Rk80Q1J71j54q6
2452a17k19N40N3n2m25L16l33J1N45k68k06J76K2j85j9R5P8Q2m14K49j44J30P7
2475hQ0k69J28M7oK56k45J40m23L82O5k78K47O6j45rO5k76K90J02k80RP0r2M16
2500C32k48q7k3k29R6L26l15J14L2J91n92K74j25M79l23k3j84K69K24j66K56l87
2522a09J2LOJ86qK04n35J76L08m00K11j03k86L85m9j63M74m16K99J68j94m27J03
2545a55R0K92j20k69Q5k8P4J4p7L61L5l00j31J11k15P6K3k83M13Q5o1L43l08n4
2569Ak53j72M59Rl37K64Q2l15M3R7L38k02J23K4l93K53k1L1k11J9M50k94j77K51
2593F9Q9n9k45L52j08m75N86k21k24M84l73K53P8l1j81K99l43N9K0j7K08j82K25
$$ plain form
2616 263 -2 126 49 450 118 -52 -261 -53 135 -243 -184 117 54 18 -121 51 260 285 7 -100 -190 -90
2638 -90 166 117 208 -34 -170 -100 225 -252 10 271 130 -22 -177 13 457 -183 -51 113 23 227 115 -417
2660 -417 104 131 -43 -148 -349 -87 258 111 235 -26 -332 30 -94 -118 -23 63 -101 -98 -145 -161 296 -29 29
2683 29 -244 -291 -54 76 -27 -230 -23 46 163 159 170 162 -61 -74 42 76 17 -57 -139 158 -74 -100 -97 -112 -239 157
2709 157 -193 244 214 -50 -59 -31 124 -117 -317 78 252 134 84 -117 -298 33 92 -33 39 59 -142 -22 -198
2732 -198 -290 114 242 184 -91 -98 -93 -63 99 108 -420 -34 155 -50 -91 -11 -103 197 109 -66 186 -135 296 266 -189
2757 -189 67 169 98 274 91 -192 24 -139 -20 -35 -120 241 95 -255 80 47 140 59 -61 -196 115 -73
2779 -73 72 233 -234 77 -497 -36 99 19 65 -8 -133 -101 -432 -154 103 68 209 -326 -226 83 49 98 -81
$$ packed form
2616B63k65J28p7M01l32j70k09K08J88l78N9L01o3l6j39J72K09K5k78j07r0J00
2638i0K56m9R1k42j36P0L25m77K62K61j41j52j55J90M44o40J32J64r0K04j12n32
2660d17N21K7j74j05k01K62L45j47J24k61l06L62j24k4R5Q6j64Lm7j6M57l25N8
2683B9k73m7K37J30j03k03K07O9J17mJ1qk23j3J16L4n9p4q2K97k32k6Lj5j27L96
2709A57l50M37l0k64rK8J55k41k00L95J74j18n0k01j81L31N9j25P2K0k01J20j76
2732a98r2M04J28n8k75pNL0J62Rn28L86J89k05m1Q0r2L00q8j75K52l21M31l0m55
2757a89K56J02p1J76j83k83K16j63J19j5q5L61j46l50L35l3R3q1j20j35L11j88
2779g3J45J61m67L11n74M61J35q0M6p3j25L2l31K78K57l5J41n35J00L09l4M9j79
$$ plain form
2802 -81 191 -16 -212 64 -71 271 106 -96 -47 -250 123 419 -212 -32 80 -220 -182 85 0 -382 -199
2823 -199 11 16 129 314 99 9 43 109 -75 137 172 -150 46 -109 80 -49 -35 -15 57 -85 -43 95 -71
2846 -71 268 4 -61 260 -180 39 -115 -150 102 37 -47 -111 -221 72 460 16 -136 98 138 173 -10 -69 -12
2869 -12 80 18 -98 48 132 55 28 -362 -247 221 59 -25 18 -11 -115 99 -149 195 -243 -72 -160 -36 -123 -69
2893 -69 -202 -26 124 -147 -112 -104 317 -124 -141 78 -129 -58 -37 262 -68 411 109 276 10 116 490 -26
2915 -26 104 -34 -30 64 373 -67 -94 -64 -79 124 -46 25 222 147 -183 -318 307 -45 -112 -150 90 -327 110 -16
2939 -16 240 -123 -152 202 -27 -237 122 141 -3 -256 160 -75 66 216 148 218 41 -235 13 76 -83 21
2961 21 17 -135 41 -166 -68 361 83 199 12 -291 -128 130 -101 -57 -207 -162 81 -248 -33 67 145 -63
$$ packed form
2802h1K72k07j96K76j35L42j65k02M9k03L73K96o31J80J12l00L8K67q5l82J83
2823a99K10NJ13J85k15r0L4O6j84K12L5l22J96j55J89j29J4K0P2j42M2J38j66
2846g1L39k64o5L21m40K19j54l5K52o5q4o4j10K93L88m44j52K34M0L5j83n9N7
2869a2R2o2j16J46Q4p7k7l90J15M68j62q4M3k9j04K14k48L44m38J71q8J24q7N4
2893f9j33J76J50k71L5QM21m41j7K19k07P1K1K99l30M79l02J67k66J06L74n16
2915b6J30j38MR4L09m40k7L0j5K03j70P1J97p5l30j35O25l52o7l8K40m17M37j26
2939a6K56l63k9L54k29k10L59J9j44k53M16k35J41J50o8P0j77k76K48O3j59J04
2961B1mj52J76k07R8M29k78J16j87l03J63K58k31M4j50M5K43l29K15J00P8k08
$$ plain form
2983 -63 -215 -109 200 229 -400 -48 -16 -31 28 -259 -94 397 -226 110 -95 -91 61 -241 -91 25 -147 -29
3005 -29 174 -267 -45 -247 29 144 437 -73 -16 -57 18 -121 216 -69 322 -210 -90 274 30 111 42 -70
3027 -70 -232 -211 37 40 167 51 206 108 10 -232 223 10 69 -230 -74 -180 -1 9 204 70 58 79 82 -30
3051 -30 23 72 81 40 207 -34 -123 -220 178 -95 -27 232 -297 121 -123 -38 -130 127 117 62 85 20 105 -128 11
3076 11 120 72 188 18 -121 -98 64 -13 3 -211 -203 -421 -13 -232 -40 30 107 -66 74 66 -94 -78 -288 23
3100 23 -60 74 -242 18 126 102 118 -105 351 -208 94 -8 48 226 178 -325 -60 199 -33 -126 177 30
3122 30 -68 229 -127 -31 104 63 -296 -59 217 19 -75 -224 -52 -98 87 -275 131 97 197 207 161 160 -94 139
3146 139 -134 -372 14 114 -27 -312 -188 -131 75 68 -165 15 255 -182 90 -47 53 76 241 49 -106
$$ packed form
2983f3j52J06L09K9o29L52L2j5N9k87J65M91o23L36k05MJ52l02J50J16j72J18
3005b9K03m41K22k02K76J15K93n10N7m1P5j39L37k85L91n32J20L64k44Q1o9j12
3027g0j62K1K48LJ27j16J55r8r8k42M55k13N9k99J56j06J79J0J95j34j2K1Lj12
3051c0N3M9Rm1J67k41q9r7L98k73O8K59n29M18k44Q5r2K57j0n5K3o5Q5k33J39
3076A1J09m8J16j70j39K3J62p7J6k14Qk18M08k19J92P0P7j73J40qj60J6k10L11
3100B3q3J34l16K60J08k4J6k23M56n59L02j02N6J78m8n03K65K59k32r3L03j47
3122C0r8K97l56R6J35m1l59K37K76j98r4j49J72m6J85l62M06l4J00J0m6jk54K33
3146A39k73k38L86J00j41k85J24N7K06pk33J80K40m37K72j37J00K3J65j92j55
$$ plain form
3167 -106 199 25 215 67 -106 -54 -96 -92 -57 87 -72 -63 -139 193 -149 -35 135 62 -130 117 123 274 219 91
3191 91 -52 16 -178 244 -183 -16 322 168 -175 13 46 36 -4 118 -11 10 21 45 -59 -121 121 14 -141
3214 -141 47 44 -58 -51 -234 -28 194 -32 325 -209 -78 -151 5 287 -32 -158 259 319 151 -168 -287 258
3236 258 190 154 212 -32 -28 15 132 221 -160 37 57 -81 24 -179 184 -157 -150 147 -111 -226 28 -83 63
3259 63 -94 -55 178 203 -151 -5 -24 12 114 -112 -157 -347 7 194 -220 170 47 -34 115 -91 -194 42
3281 42 89 -170 -145 -185 102 -188 193 -178 -236 13 150 108 -271 -200 -304 -126 56 -192 85 -87 -195 65
3303 65 68 43 -60 -90 -1 -76 55 251 -66 188 -202 -211 -209 -96 202 85 47 88 29 -80 -62 -178 99 -74 -203
3328 -203 146 81 268 -93 110 151 191 113 -82 36 -20 -20 -166 -43 -251 -160 -26 -177 10 88 33 -57 -57 -11 145
$$ packed form
3167a06L05j74J90j48j73N2m2ML5J44j59Rp6L32l42J14J70p3j92K47OJ51n5j28
3191I1j43O8j94M22m27J67L38j54l43J88L3j0m0J22j29K1J1K4j04o2K42j07j55
3214a41J88lj02Pj83K06K22k26L57n34J31p3J56K82l19j26M17O0j68l19j19N45
3236B58o8l6N8k44MM3J17Q9l81J97K0j38J05k03L63l41PK97k58j15K54j11J46
3259F3j57L9K33K5l54J46j9L6J02k26m5j90L54J87m14L90j23q1J49k06j03K36
3281D2M7k59K5m0K87k90L81l71n8K49J37m2l79P1j04J78J82k48K77j72j08K60
3303F5Lk5j03l0Q9p5J31J96l17K54l90rKJ13K98j17l8M1n9j09J8j16K77j73j29
3328b03L49o5J87l61K03M1M0p8j95J18n6%j46J23k08R1J34j51J87P8n5r0%M6J56
$$ plain form
3353 145 20 -75 165 9 -343 -1 398 124 91 -119 76 427 162 200 214 2 36 -190 7 -230 44 -160
3375 -160 -229 -151 190 15 2 41 -79 91 130 79 -245 97 178 -138 -53 38 21 28 59 -60 -20 233 189 204 247 13
3401 13 15 171 284 -215 2 -69 -353 65 -59 161 485 -432 143 -29 -13 97 89 37 134 -196 80 -22 -158
3424 -158 6 98 -269 53 435 277 233 -320 209 -102 -78 -503 24 -128 -111 195 117 129 93 128 -3 211 -37
3447 -37 38 173 -66 69 146 -49 101 -38 262 -35 150 -7 56 -37 1 89 -166 211 155 -103 -93 148 -167
3470 -167 -16 -134 240 -32 177 369 -176 169 16 27 -121 105 116 -130 29 -88 39 -213 -206 -116 25 -7
3492 -7 -42 -23 11 -7 8 -59 -23 -1 -227 3 97 -45 177 -119 -151 30 180 -7 134 117 -119 23 64 -2 128
3517 128 212 5 -8 -80 15 -115 -97 -159 -1 247 -13 118 356 83 -210 -84 35 196 -125 -90 -201 -275 71
$$ packed form
3353A45j25r5K40j56l52L42L99k74l3k10J95L51k65L8J4k12L4k26J97k37K74k04
3375a60o9P8L41j75j3L9j20J70L9n1l24L42Q1l16Q5R1j7PL1j19M0K53m4J5M3k34
3401A3KJ56J13m99K17p1k84M18j24K20L24r17N75j72J6J10qn2R7l30K76j02j36
3424a58J64R2l67L22L82j58m4n53N29l11K4m25N27j52J7L06p8J2l6L5j31K14k48
3447c7P5J35k39J35P7j95J50j39L00k97J85j57O3r3L8Q8k55L77n6k58J0K41l15
3470a67J51j18L74k72K09J92n45L45j53J1j48K26J1k46J59j17J27k52PR0J41l2
3492gl5J9L4j8J5o7L6K2k26K30R4j42K22k96l2J81J50j87J41j7k36J42M1o6J30
3517A28Q4k07j3p2R5j30J8o2J58K48k60J31K38k73k93J26J19J61l21L5j11p4L46
$$ plain form
3540 71 119 -204 42 -27 -255 -252 -87 -55 179 -96 119 -10 60 -129 -100 210 170 -62 -2 -21 269 96 -227 -54
3564 -54 -81 179 -194 243 166 -89 14 15 -32 -140 -227 32 132 58 -17 -2 -256 98 109 323 226 17 110 -57
3588 -57 -102 31 -116 -56 94 -131 22 4 -140 -11 149 -88 425 -222 -90 72 -85 75 74 263 57 -47
3610 -47 93 -143 339 221 -32 98 50 -5 67 -88 79 -160 49 -170 -118 149 -268 18 8 -179 75 83 -61
3633 -61 58 -164 19 156 277 -102 38 -263 32 28 165 -71 177 -72 161 128 180 164 51 -240 -34 -42 -76
3656 -76 -33 -46 158 -23 -33 -355 193 -176 -193 -335 -6 28 -112 110 272 101 -27 290 158 54 86 -144
3678 -144 26 87 273 139 -89 26 -179 167 -48 -219 156 30 -65 -5 -257 130 48 -318 266 180 -25 11
3700 11 -94 184 51 -129 55 397 19 66 125 10 149 1 -8 195 46 39 -120 -173 305 120 0 28 -133
$$ packed form
3540G1M8l23K46o9k28LJ65L2K34k75K15j29P0j89K9L10m0k32O0j9K90j73l23J73
3564e4k7K60l73M37p7k55J03Jm7j08q7K59J00p4p5J5k54L54J1K14r7k09R3j67
3588e7m5J33j47O0J50k25J53j8j44J29J60k37N13o47J32J62j57J60jJ89k06j04
3610d7J40k36M82j18k53J30m8n5P2j55J67k39K09k19N2K67m17K86j0j87K54Qj44
3633f1J19k22J83J37J21l79J40l01K95mJ37k36K48k49K33l3N2j6j13k91K06ql4
3656g6M3j3K04j81j0l22N48l69j7j42L29L4j40K22J62j71j28L17j32j04L2k30
3678a44J70O1J86j34k28J15k05L46k15j71L75j26r5O0k52L87q2l66N84q6k05L6
3700A1j05K78j33j80J84L42l78M7N9j15J39j48rK03j49pj59n3M78j85j20K8j61
$$ plain form
3723 -133 -64 -39 -125 -15 10 13 85 138 114 -74 124 -114 36 -194 -76 -81 53 163 1 109 42 -72 -100 2
3747 2 52 -51 -204 40 -108 -255 79 -238 -172 -106 -87 83 1 -135 -151 242 -285 159 299 -38 177 -161 47
3770 47 182 241 -87 -328 -204 -152 -217 -116 -90 16 -98 184 -65 -280 46 -37 -319 -43 121 9 -188 147
3792 147 116 7 -70 -149 89 -84 -153 -179 -475 259 41 -55 230 -237 133 248 88 180 -36 -7 -100 159 16
3815 16 212 -48 59 141 20 326 62 -27 199 47 -6 13 -368 -35 213 -16 -40 31 302 28 236 79
3837 79 -198 220 -63 -150 -50 -54 -187 -190 170 98 264 24 -211 373 235 -97 227 -97 53 -12 -50 -67 -11 -43
3861 -43 -114 70 -66 138 293 -133 286 -46 107 100 176 12 -95 140 212 109 201 -61 115 203 50 102 -216
3884 -216 -153 225 -351 -54 129 104 23 -117 -30 208 -226 -250 -40 78 -207 -82 -88 -23 70 -280 36 -79 -216
$$ packed form
3723a33O9K5q6J10K5LP2N3k4j88J98k38J50k30J18nJ34J10j62J08o7j14k8J02
3747BN0j03j53K44j48j47L34l17O6O6J9J70q2j36j6L93n27M44J40l37K15l38K08
3770D7J35N9l28k41J24N2o5J01K6J06j14K82k49k15L26q3k82K76J64j12j97L35
3792A47l1j09p7p9K38j73o9k6k96P34k18r6K85m67L70J15j60R2k16K9r3K59j43
3815A6J96k60J07Q2j21L06k64q9K26j52n3J9l81L33K48k29k4P1K71k74K08j57
3837G9k77M18k83q7J00mj33lL60p2J66k40k35N84j38l32L24l24J50o5l8j7N6l2
3861d3p1J84j36K04J55m26M19l32J53pP6j64j07K35P2j03R2k62J76Q8j53N2l18
3884b16O3L78n76K97J83k5q1j40Q7K38m34k4K10J18k85J25oO5R3l50L16j15j37
$$ plain form
3907 -216 -123 120 205 -290 -173 -215 86 -4 84 170 49 -49 -45 -127 -113 101 167 -122 -145 -64 81 276 -76 49 -156
3932 -156 137 176 64 -111 137 45 168 13 -316 -25 56 113 -183 253 -209 99 -162 -91 44 96 -41 -271
3954 -271 -75 114 106 -10 -79 7 188 106 -68 -51 -175 216 -18 277 143 10 212 97 229 -45 128 -176
3976 -176 215 -42 -27 -38 -339 -106 138 -151 -165 228 135 242 -91 73 -190 -329 -97 -269 150 11 -280
3997 -280 -182 90 110 57 -65 -125 -152 141 -110 85 -207 -46 337 140 47 -154 77 251 -62 -187 -69 -110
4019 -110 112 3 -103 104 8 -72 -116 -25 216 -5 -158 193 -45 -108 69 -144 -192 103 138 19 -3 -99 226
4042 226 46 336 243 -88 27 109 315 -152 224 232 -97 29 49 165 171 83 -64 -212 -4 -46 -176 346 -109
4065 -109 -50 -33 47 -133 -113 -85 -314 32 141 243 151 -122 -268 -219 -316 214 -81 -191 -115 -175 -171 47 82 -47
$$ packed form
3907b16R3K43Q5m95J17m2L01r0Q8Q6j21r8Mq2J4K14O6k89k3Q1J45J95l52J25k05
3932a56K93L9j12j75K48r2J23j55l29K91Q1N7k96M36m62L08k61P1J35N2j37k30
3954b71J96J89qj16o9Q6J81q2j74J7j24L91k34K95j34j33K02j15J32k74J73l04
3976a76L91k57J5j1l01K33K44k89j4L93r3J07l33J64k63j39K32j72M19j39k91
3997b80R8K72K0n3j22o0k7K93k51J95k92J61L83j97r3k01K31J74l13j25J18m1
4019a10K22j09j06K07r6q0m4R1K41k21j53L51k38o3J77k13m8K95L5j19k2r6L25
4042B26j80K90r3l31J15Q2K06m67L76Ql29J26K0J16Oq8j47j48K08m2j30N22m55
4065a09N9J7Q0j80K0K8k29L46J09J02r2k73j46M9r7N30k95j10P6o0MK18L5j29
$$ plain form
4089 -47 157 64 -20 135 -55 -126 94 -158 -142 -118 -201 -85 -332 89 -118 -140 -231 -53 71 147 -173 -76 -144 -73
4113 -73 165 106 -120 173 189 142 -42 221 120 -290 -167 -36 -30 5 -108 128 -12 -142 -39 -354 29 -126
4135 -126 128 -124 20 -46 -2 -2 -72 87 -119 -122 186 299 1 -112 -16 -199 -184 -24 -188 168 74 -158 68
4158 68 69 361 -100 65 -83 115 91 -126 -183 329 -126 -262 129 -62 -202 -95 -95 -47 20 -185 17 -83 -41
4181 -41 -63 79 -106 1 -113 268 268 233 57 -149 184 294 229 107 351 125 173 -60 64 -297 196 200 60
4204 60 55 -97 -240 12 166 91 81 -257 135 -69 121 -159 -293 -202 20 124 -86 -119 73 54 -269 238 152
4227 152 191 -80 -124 63 53 -7 -2 95 92 -30 189 -16 2 -135 -143 12 -133 -176 -27 57 350 -25 -12 -124 -88
4252 -88 -11 26 39 -8 -143 154 74 105 143 -66 65 5 112 -197 219 228 135 202 169 -272 30 68 -59 220 128
$$ packed form
4089d7K04r3q4J55j90p1K20k52J6K4q3J16k47M21k07k2r1J78J24P6l20R7o8P1
4113g3K38n9k26K93J6m7j84K63j01m10J23J31OL5j13K36j40j30J03l15L83j55
4135a26K54k52J44o6M4%p0J59k06lL08J13k98j13R6j83J5J60j64L56r4k32K26
4158F8JK92m61J65j48J98k4k17n7N12m55j36L91j91j40J07%M8O7k05K02j00M2
4181d1k2J42j85J07j14L81%l5j76k06L33J10o5j22K44k26M8k33J24l61M93Mj40
4204F0nj52j43K52J54p5j0l38L92k04J90k80j34R1K22J04k10l3J92j9l23N07q6
4227A52L9k71m4J87j0o0NR7lj22K19k05J8j37qJ55j45m3J49Q4K93l75J3j12L6
4252h8P7L7J3m7j35K97q0L1L8k09J31o0J07l09M16Rr3O7l3m41L02L8j27K79r2
$$ plain form
4277 128 -277 -269 -477 -52 -37 -75 -83 -75 10 -11 -37 154 108 45 -142 -173 90 22 84 -126 -75 -88 -74 133 232 -160 -96
4304 -96 -205 -22 544 107 80 77 -303 -110 -83 114 142 -12 74 98 -237 14 36 -35 -88 0 163 -91 -66 -84 10
4329 10 -74 135 138 69 -26 -18 163 32 -56 -46 180 121 -21 110 -25 -124 98 27 237 67 -136 150 -74 64
4353 64 17 -123 220 240 -151 -82 -124 -52 -108 -136 -48 -180 29 -268 114 -229 -66 280 -22 122 -99 104 236
4376 236 29 13 107 254 47 152 -86 -38 -128 262 -173 -22 117 -45 6 -19 145 206 254 -24 -359 -218 -149
4399 -149 113 115 -27 109 91 -1 215 314 -105 103 -28 -449 -122 130 231 11 -4 -80 252 163 -127 -228 26
4422 26 190 34 395 -220 -72 -210 24 -5 -93 131 -177 202 131 76 -31 -137 127 -120 -166 -17 46 -112
4444 -112 -49 -23 62 -70 67 197 -241 -57 -146 -21 203 293 162 94 -43 -6 210 -27 77 -37 119 -37
$$ packed form
4277A28m05Qk08M25J5l8qQQ5k1k6J91m6o3j87l1K63o8O2k10N1j3J4K07R9l92O4
4304i6j09J83N66m37k7ll80J93K7J97K8j54Q6K4l35K51K2p1n3Q8J63k54K5j8R4
4329A0q4K09Lo9r5QJ81j31q8J0K26n9j42J31j35r9K22p1K10j70k03K86k24J38
4353F4m7j40L43K0l91O9m2P2n6k8Q8j32K09k97L82l43J63L46l02J44k21K03J32
4376B36k07j6R4J47k07J05k38M8r0L90m35J51J39j62N1k5J64O1M8k78l35J41O9
4399a49K62Kj42J36j8r2K16R9m19K08j31m21L27K52J01k20j5p6L32q9k90j01K54
4422B6J64j56L61o15J48j38K34k9q8K24l08L79p1n5j07j06K64k47m6J49O3j58
4444a12O3K6Q5j32J37J30m38J84q9J25K24R0j31o8j37L7K16k37J04j14J56j56
$$ plain form
4466 -37 -122 101 208 -51 137 55 -228 -133 334 215 176 -11 6 -96 -383 225 -112 -221 -56 -127 -71 61 127
4489 127 58 -164 158 -85 -318 -123 117 151 125 48 -219 70 -164 144 65 -38 90 -93 -59 35 -135 -40 -360
4512 -360 10 178 43 -152 -91 99 187 239 326 46 -114 111 -8 122 67 -75 10 -41 -16 191 255 -37 -47
4535 -47 105 106 248 -208 136 -74 95 107 -291 -234 89 44 -227 -176 59 -29 114 -90 85 -287 126 -68 81
4558 81 17 30 31 108 122 -27 -119 -69 -91 138 121 -146 -75 -71 1 115 -77 -198 54 -22 31 303 -122 10 -20 105
4584 105 197 66 -288 176 -135 -56 -115 -90 67 199 220 -384 246 108 -301 -21 -135 5 29 -91 111 -111
4606 -111 -30 49 97 90 -345 -24 -98 2 -3 42 -45 -167 220 -6 -15 40 95 -190 52 -94 -104 271 82 12 118
4631 118 -167 38 88 70 -19 185 -311 -290 -46 -117 -159 300 143 -82 94 157 174 49 41 -49 136 -72 109 214
$$ packed form
4466c7q5K23J07k59J88q2k83R5M67j19l9j87J7j02k87O08l37j09J65p1N6J32O6
4489A27o9k22L22k43k33J95K40L4k6p7k67K89k34L08p9j03J28j83L4R4j70R5l20
4512c60L70J68j35j95O1J90Q8N2Q7k80j60K25j19J30n5j42Q5n1K5K07O4k92j0
4535d7J52JJ42m56L44k10J69J2l98N7L23m5k71N1K35q8J43k04J75l72M13j94J49
4558H1o4J3JP7J4j49r2N0k2K29j7k67P1MP2J14j92j21K52p6N3K72m25J32l0J25
4584A05R2j31l54M64l11P9n9K5J57J32K1o04O30j38m09K80j14J40K4j20K02k22
4606a11Q1P9M8pm35L21p4J00nM5q7j22L87k26rN5N5k85K42j46j0L75j89p0J06
4631A18k85K05N0j8q9K04m96K1K44p1m2M59j57k25J76O3J7j25qr0J85k08J81J05
$$ plain form
4655 214 143 -69 -59 -5 -267 58 -186 107 -198 44 -10 -44 13 -153 15 -146 329 6 -76 -42 -129 -59 44
4678 44 -201 8 5 26 -62 -66 -88 165 -74 -215 175 -76 37 -190 -112 -40 116 145 32 90 111 175 4 -24 -222
4703 -222 7 -52 236 -31 -110 196 210 -70 -39 -112 -85 -10 41 70 18 2 -125 -60 -172 214 -109 311 6 106
4727 106 -428 -184 -273 192 -115 -95 -149 -83 -12 -188 50 -201 -282 -140 -3 261 -22 -44 -134 -284 94 -30 31
4750 31 -256 78 -43 5 -74 34 275 35 -79 389 -98 76 150 30 -84 6 -159 136 -178 -6 34 -14
4772 -14 29 -29 -37 -92 73 -132 39 -9 -263 22 -6 -233 1 -51 7 -277 -91 -60 -183 -186 310 150 -131 -104 195
4797 195 178 109 -68 19 30 -116 73 -302 123 53 -88 -65 -227 71 -52 62 -72 -85 -133 -160 -4 -71 -143 237
4821 237 177 -46 -57 67 65 -22 -3 83 -38 -210 -233 181 152 86 -29 -147 132 228 -225 251 213 -13 -18 -28 54
$$ packed form
4655B14p1k12J0N4k62L25k44K93l05K42n4l4N7j66J68j61M75l23q2L4q7P0J03
4678D4k45K09lK1q8mk2K53k39j41L90k51J13k27P8P2J56K9j13N8K1O4j71k8j98
4703b22K29n9K88k67p9L06J4k80L1p3K7P5N1K9n2j6j27O5j12L86l23M20l05J00
4727A06n34K44q9M65l07K0n4O6P1j76K38k51q1J42J37K64k83k2r0j50L78j24O1
4750C1k87L34j21M8p9J08K41k40j14M68m87J74P4j20j14R0j65K95l14J72M0m8
4772a4M3n8qn5J65k05J71m8k54K85k8k27K34n2N8k84J86L1j23lM96j60k81K7K99
4797A95j7o9j77Q7J1j46J89l75M25p0j41K3j62K98j23J14j34j3m8k7J56o7p2L80
4821B37o0k23j1J24kq7J9Q6j21j72k3M14k9o6j15j18K79R6m53M76l8k26nj0Q2
$$ plain form
4846 54 235 -85 31 68 -110 76 41 5 -168 -99 -74 96 -146 141 221 73 -210 39 78 154 -85 41 -60
4869 -60 -9 9 192 -6 -104 -255 140 -14 -55 -102 -114 -240 -122 124 309 20 59 -193 236 42 193 101 -8
4892 -8 6 -1 -207 -18 114 -43 123 -267 -174 211 -28 -207 -16 -210 -41 27 -22 -140 27 -53 216 19 103
4915 103 69 89 41 -27 -60 -138 -29 41 154 -53 228 93 -63 -213 -166 97 127 -3 -185 -169 -203 -197 -108 -36 166
4940 166 -149 -397 67 202 162 21 -48 -318 -95 20 -165 -7 -231 -120 -106 24 -257 21 96 45 176 150
4962 150 -170 74 127 -22 -241 -271 65 46 160 -42 450 110 -165 48 328 -51 127 -150 -98 221 -145
4983 -145 194 265 -72 -129 51 -50 345 55 -280 7 -93 -17 -252 -128 -3 127 -138 -39 -189 33 -95
5004 -95 -5 -115 138 55 -202 128 -67 -14 -68 -100 -258 -114 32 140 211 -359 108 123 -165 -188 -69 -51 -87 -91
$$ packed form
4846E4J81l20J16L7j78J86l5l6j73O9K5J70k42K87Q0j48k83K49L9P6k39J26j01
4869f0N1J8J83j98r8j51L95j54m1m7j2j26J18K46J85k89L9k52M29j94J51r2j09
4892hJ4pk06J89J32j57J66l90R3L85k39j79J91j94J69O8m9j18J67q0K69j97Q4
4915A03l4K0m8o8l3p8J09P0J13k07K81j35j56j50M7K63L0j30j82J6l4OQ9P2K02
4940A66l15k48M64J35m0j41o9k70K23J15j85J58k24J11J4J30k81K78P5n1J31k6
4962A50l20K44N3j49k19l0L36j9J14k02M92l40k75K13K80l79J78k77N2L19l66
4983a45L39P1l37n7J80j01L95k90l35K87j00P6k35J24J25J30k65R9j50K22j28
5004i5R0j10K53q3k57L30j95N3n4l2j58J44J46J08P1n70M67J5k88k3J19J8l6m
$$ plain form
5028 -91 -182 -35 -185 -72 -63 -93 -52 118 -170 128 -64 5 -105 95 101 398 -133 53 16 121 -259 47 -363
5051 -363 -58 96 3 102 -142 99 -91 -196 -18 -5 -118 330 111 76 164 85 -199 -123 57 13 37 145 -61
5074 -61 -62 42 216 -82 152 -326 346 -139 274 -2 170 271 169 -170 -176 180 7 33 -1 13 35 -76 -83 -182
5098 -182 -133 67 -257 41 5 42 -1 123 -1 -103 -40 67 59 -41 126 -6 36 14 -159 220 314 -71 -33 373
5122 373 -253 149 -15 20 -93 -104 -312 -64 98 -99 22 0 -107 38 -3 -51 178 136 91 40 -89 51 -60
5145 -60 43 -48 -167 51 -72 -87 64 -153 -58 225 -160 -93 128 157 54 -79 -18 64 35 -188 98 23 -117
5168 -117 159 113 -155 -154 -92 -18 -97 -121 -122 -81 -277 -299 -119 12 56 125 -276 89 -182 94 154 -45 11 -144 65
5193 65 -176 -92 -22 -36 -33 109 -63 -206 91 -151 -99 172 -31 21 -72 -59 85 16 144 -129 -286 55 -76 142
$$ packed form
5028i1r1J47j50J13Rl0M1J70k88K98j92O9j10K00OK97n31J86l7J05l80L06m10
5051c63L05J54r3R9k44K41j90j05J78J3j13M48k19l5Q8p9k84P6J80m4K4J08k06
5074f1jJ04J74k98K34m78O72m85M13k76J72J01j02l39oL56j73K6l4J4K2j11pr9
5098a82M9K00l24K98l6L7m3J24j24j02O3J07qj00J67j32M2k2j73L79R4l85L8M06
5122C73o26M02j64L5j13j1k08K48J62j97J21k2j07J45m1m8K29m2m5n1j29J40j11
5145f0J03r1j19K18j23j5J51k17R5K83l85O7K21K9j03j33O1Q2k9k23K86p5j40
5168a17K76m6k68JO2P4p9k4jM1j96k2J80J31M4O9m01L65k71K76O0j99N6j55K09
5193F5k41Q4P0j4LJ42j72j43K97k42N2K71k03N2r3J3J44o9J28k73j57L41j31K18
$$ plain form
5217 142 305 -300 3 -13 90 11 -228 -122 11 -106 31 192 191 278 -221 -97 -104 -77 346 1 -162 97 165
5240 165 167 -227 71 129 60 49 169 119 -111 252 57 19 -113 -91 -233 210 -299 -52 53 -87 215 -40 -211
5263 -211 76 86 150 96 -89 -192 155 223 -23 95 114 10 -18 5 74 317 30 -165 -231 111 94 182 -96 129
5287 129 -141 -120 -190 -63 -242 -18 167 -126 -16 197 -42 98 26 -153 -88 -172 178 -51 74 192 199 -77
5309 -77 -60 -194 -217 -79 31 -108 36 -140 54 133 8 25 -312 220 271 198 -322 175 336 87 -42 186
5331 186 24 -89 241 -39 -27 47 77 -121 -456 -117 43 112 179 -107 19 -25 -100 -84 83 181 135 147 295 -245
5355 -245 -89 34 162 -122 -122 -314 88 -69 -81 -7 -151 24 -35 -34 -221 -51 156 79 -81 94 26 -128 -52
5378 -52 -314 -99 -38 58 -155 -52 127 -175 123 85 13 312 317 41 -38 36 -319 -14 -18 -137 -48 -261 -192 -26
$$ packed form
5217A42J63o05L03j6J03p9k39J06J33j17J37J61jQ7m99J24pK7M23l45j63K59O8
5240A65Kl94K98N8o9j1J20n0k30L63j95l8j32K2j42M43n09K47J05j40L02k55j71
5263b11K87J0O4n4j85j03L47O8k46J18J9j04k8K3O9K43k87j95o6L42j7Q8k78K25
5287A29k70K1p0J27j79K24J85k93J10K13k39J40p2j79O5q4L50k29J25J18Pk76
5309g7J7j34k3J38J10j39J44j76J94P9j25J7l37N32N1p3n20M97J61k49j29K28
5331A86j62j13L30k80J2P4L0j98l35L39J60O9O7k86J26m4p5J6J67R8m6J2J48n40
5355b45J56J23J28k84%j92M02j57j2P4j44J75n9Jj87J70K07p7j60J75o8j54P6
5378e2k62K15O1R6k13J03J79l02K98l8p2K99Nk76p9P4l55L05mj19Q9k13O9J66
$$ plain form
5402 -26 -191 93 6 -201 -153 -6 47 -73 140 -20 193 -106 99 -108 -41 129 59 238 48 200 -33 35
5424 35 167 -9 -137 -76 90 -74 244 146 -100 -63 261 -25 18 122 -29 52 -153 87 59 25 -33 74 -206
5447 -206 254 16 -267 172 101 131 53 -123 -98 135 196 -68 -167 159 4 96 -175 68 -17 96 -234 -361 191
5470 191 22 -110 101 190 -261 -64 -255 -254 102 58 -210 -216 182 -97 -333 51 82 109 79 273 122 -21 39
5493 39 -132 -44 95 15 -39 -79 41 170 251 99 4 44 63 330 -6 -12 142 -178 -97 83 -102 -168 9 -39 159
5518 159 212 296 -192 -93 92 192 153 -205 317 -121 -62 90 67 -68 112 -60 270 158 16 -314 -33 -20
5540 -20 149 -25 -84 154 -250 347 -34 3 -76 251 -200 -50 -8 -116 -284 122 -15 73 -5 -183 142 -81
5562 -81 194 -192 -41 -117 -98 -211 147 15 -81 -81 -301 -143 80 -41 171 -63 -50 -149 138 -304 236 109 -93
$$ packed form
5402b6j65K84q7k07M8J47N3j20K13j60K13k99K05k07O7J70p0J79j90J52k33O8
5424C5J32j76j28O1J66j64L18r8k46L7L24k86M3J04j51Q1k05K40k8l4n8J07k80
5447b06M60k38k83M39p1L0p8j76K5K33O1k64r9L26j55R2k71K43q5J13l30j27N52
5470A91j69j32K11Q9m51J97j91JL56m4k68oL98k79k36L84L1K7l0J94j51j43O0
5493C9j71Q8J39q0n4m0J20J29Q1j52r5M0J9K67l36oJ54l20Q1J80j85o6J77m8J98
5518A59N3Q4m88R9J85J00l9l58N22m38N9J52k3j35J80j72L30j12j42l30K81J3
5540b0J69j74n9K38m04N97l81L7p9L27m51J50M2j08j68M06j37Q8p8j78L25k23
5562h1K75l86J51p6J9j13L58j32r6%k20J58K23j21K12k34J3r9K87m42N40j27k02
$$ plain form
5585 -93 -50 87 -42 -231 11 246 54 -167 -51 -12 107 -24 103 225 -75 120 -40 -185 487 -29 -193
5606 -193 27 77 -75 11 101 -130 127 155 90 -62 -17 -78 -15 -64 71 98 79 309 126 -119 167 -58 -322 -85
5630 -85 69 51 10 -198 120 -50 -54 -106 23 -77 -10 -9 156 10 107 13 -101 17 122 263 424 -192 -181 -15
5654 -15 -28 -387 -157 247 189 -251 322 77 -237 43 -20 28 193 42 -96 -310 -29 -36 -158 -341 -166 98
5676 98 69 135 0 104 -8 85 -144 38 -78 54 -111 -184 -171 82 142 -21 -20 36 79 -29 -12 -142 14 139
5700 139 -128 -260 -8 80 -32 79 -14 254 146 -201 -112 -52 77 191 77 -174 -244 -70 130 -135 -102 218
5722 218 240 -144 -56 -250 29 372 95 -99 -318 18 -64 85 -1 -80 236 -61 -110 84 -31 -206 89 282
5744 282 10 68 -135 55 -12 350 -248 24 163 -16 76 -18 301 -17 -171 -220 -221 -139 40 -12 -250 14 -91
$$ packed form
5585i3M3J37j29j89K42K35j92k21J16L9J19j31J27J22l00J95j60j45O72n16j64
5606a93K20N0j52Q6R0k31K57K8o5j52M5o1O3m9J35K7j9K30j83k45K86k25k64K37
5630h5J54j8m1k08L18j70mn2J29j00O7JJ65j46R7r4j14J18J05J41J61o16J1J66
5654a5j3l59K30M04n8m40N73k45l14K80o3M8J65j51j38k14K81pj22j83J75K64
5676I8k9O6j35J04j12R3k29J82j16J32j65p3J3K53O0j63JN6M3j08J7j30J56J25
5700A39k67j32K52Q8j12J11r3K68j08l47Q9O0J29J14j14k51p0J74K00k65L3L20
5722B18K2l84Q8j94K79L43k77j94k19L36q2J49q6p9L16k97m9J94j15j75K95J93
5744B82k72N8k03J90o7L62n98K72J39j79R2r4L19l18j54m9jQ2J79n2k38K64j05
$$ plain form
5767 -91 -67 -133 -158 80 144 -60 -77 -18 -136 -239 -303 114 61 -5 57 186 -100 132 -285 -134 152 100 292 260
5791 260 243 -38 -6 7 -141 68 135 -561 218 61 -7 90 -77 -35 -168 -28 233 30 -48 13 -25 -183 -196 7
5815 7 233 -43 118 -225 -61 -74 -295 -65 93 186 285 -23 199 127 283 -97 78 215 -62 -54 -96 86 -119
5838 -119 159 77 -220 212 -78 -297 -261 0 -114 138 -20 55 91 -162 -274 -168 -248 -178 -161 242 -208 -19
5860 -19 86 -203 -121 -63 -220 -60 -236 -80 -130 219 110 -172 8 -215 -38 10 -47 -247 68 -74 -106 -5
5882 -5 290 -242 -179 -38 -349 -99 43 -3 -119 270 119 22 -137 3 -111 111 41 -191 -23 65 -42 212
5904 212 -121 96 -22 -76 100 -105 -101 -76 161 -109 -28 -74 40 158 122 86 288 61 -123 -197 -250 50 -42 -92
5928 -92 -116 -136 126 163 62 -200 -229 30 -97 -198 34 240 -156 101 38 -298 -74 15 389 -68 177 88 268
$$ packed form
5767i1K4o6k5K38O4k04j7N9j18j03o4M17n3o6O2J29k86K32m17J51K86n2J92l2
5791B60j7k81L2J3j48K09O7o96P79j57o8R7j67M2j33J40K61k03p8O1l8j58j3K03
5815GK26k76J61l43J64j3k21K30J58R3R9l08K22p2J56l80J75J37k77Qm2J82k05
5838a19K78q2k97M32k90k19L6K61j14K52j58P5L6k53j12J06q0P0J7M03m50J89
5860a9J05k89Q2N8j57J60j76J56n0L49j09k82J80k23J77M8n7k00L15j42l2J01
5882eK95n32O3J41l11K50J42m6j16L89j51r7j59J40j14K22p0k32J68Q8j07K54
5904B12l33K17j18n4J76k05MK5K37k70Q1m6J14J18l6l6K02k27j84p4n3L00r2n0
5928i2k4k0K62L7j01k62k9K59j27j01K32K06l96K57o3l36K24Q9L74m57K45q9J80
$$ plain form
5951 268 70 70 -89 -60 32 62 -57 59 127 -42 -52 74 57 -143 -141 171 156 -135 -191 -40 -51 290 298 -66 -125
5976 -125 101 -226 -187 29 -215 -13 -53 83 85 -126 112 -59 -179 -57 -26 62 157 83 131 133 -25 29 -292 -20
6000 -20 190 -29 69 87 253 -48 -256 -35 -7 -122 -218 -201 27 -264 86 88 -180 127 231 -89 25 95 67
6023 67 17 224 -79 -196 156 -32 -231 89 134 158 -29 -248 107 34 169 28 242 -194 28 215 302 302 71
6046 71 97 -214 152 -324 -146 202 -108 35 -70 -107 -11 72 -151 98 -184 -207 -216 -203 18 121 -174 -199 152
6069 152 130 218 -40 134 70 -151 42 -172 -114 -71 208 -202 -140 -28 -81 154 -184 -125 61 28 -181 -158 -254 -9
6093 -9 -164 -124 -164 -203 45 -197 -59 -85 -93 -50 -226 44 113 -70 117 -11 -196 21 -55 -210 15 147 153 182 251
6118 251 9 -367 -160 83 10 248 -62 -214 -161 -20 -104 -39 -121 -208 -36 159 8 -293 -113 58 218 -55
$$ packed form
5951B68j98%j59K9R2L0j19J16O8j69j0J26j7k00KL12j5k91n6J51j1L41Ql64n9
5976a25K26l27L9K16k44K02m0J36Kk11K38j71j20J22L1Q8R5p4M8Kj58N4l21K72
6000b0K10k19R8J8J66l01k08K21K8j15r6J7K28k91L50Kk68L07J04l20J14P0k8
6023F7n0K07l03j17L52j88j99L20M5K4j87k19L55p3J35j41K14m36K22J87Q7%k31
6046G1K6l11L66m76J78L48l10J43j05l7R6Q3k23K49k82k3rJ3K21J03k95k5L51
6069A52k2Q8k58J74o4k21J93k14N8M3K79m10O2J12n3K35l38N9J86l3k09K3r6K45
6093ij55M0m0l9K48k42J38k6qM3j76K70O9j83J87j28j85K17p6j55K25J32OK9O9
6118B51k42l76K07K43p3K38l10j52N3J41q4O5q2q7J72J95j51l01J80J71J60k73
$$ plain form
6140 -55 -411 72 112 25 -70 297 -86 -92 -132 -302 168 22 -97 135 135 29 101 88 -92 -188 75 53 -107 1
6164 1 30 42 61 43 251 -125 227 -242 -35 -74 -52 77 -82 -187 381 122 105 -105 77 -215 -13 114 -53
6187 -53 133 106 79 -267 226 2 -13 141 -34 224 116 -9 195 15 96 50 63 -196 -142 -111 182 2 -8
6210 -8 149 -104 116 -195 -139 137 -211 187 -34 159 335 160 -134 120 -75 -48 191 -94 -190 -5 293 -91
6232 -91 -339 18 -70 90 -278 219 -204 -2 24 160 81 121 161 61 67 -45 -20 -159 38 112 314 -103 -141 99
6256 99 -161 -71 80 21 -66 143 -18 -66 -211 -77 -151 -268 -36 7 33 -16 57 158 -60 -170 69 39 469 -39
6280 -39 90 101 -173 -118 58 -117 132 281 -349 159 43 16 -14 -337 100 -41 -59 -43 4 87 197 77 -57
6303 -57 245 -28 185 -8 101 -95 57 55 192 6 44 256 125 -116 98 293 -46 108 -51 49 -70
$$ packed form
6140e5l56M83M0q7r5L67l83om0j70M70j46j19K32%j06P2j3j80r6K63k2j60J08
6164AK9J2J9j8K08l76L52m69K07l9K2J29j59j05N68k59j7k10J82k92K02J27j67
6187e3J86k7k7l46M93k24j5J54j75K58j08j25K04j80Q1m6J3k59N4L1K93j80j0
6210hJ57k53K20l11N6K76l48L98k21J93J76j75k94K54j95K7K39k85r6J85K98l84
6232i1k48L57q8J60l68M97m23K02K6J36p9M0M0j00Oj12K5j39J97P4K02m17l8K40
6256I9k60R0J51n9q7K09j61m8j45J34p4j17K32M3K6m9P3J01k18j10K39l0M30n08
6280c9J29J1k74N5J76j75K49J49o30N08j16k7l0l23M37j41j8J6M7Q3J10j20j34
6303e7L02k73K13j93J09j96J52kJ37j86L8K12j31k41K14J95l39J54j59J00j19
$$ plain form
6324 -70 -132 3 25 44 106 168 10 121 -28 127 -116 77 -154 -101 -5 38 125 -258 -180 -32 -46 201 -54 34
6348 34 92 -29 -233 68 -237 -181 108 -37 -322 22 66 15 -59 222 -24 -28 -106 113 -175 -19 -39 -183 13
6371 13 1 -57 368 67 -107 -184 136 -172 2 229 70 -100 -48 -220 145 169 -61 24 -156 4 117 -89
6393 -89 98 -131 -156 -95 -300 106 119 -104 147 67 326 -599 -4 -385 -110 108 28 -15 -69 59 231 -3 -81
6416 -81 -40 64 -166 -147 -51 -72 92 -194 -153 -21 -145 145 -106 121 -197 -66 -77 -113 112 -33 192 424 82
6439 82 -186 -143 69 131 -186 -181 -33 -36 130 62 -106 144 259 8 -192 88 -119 -46 -65 156 -131 -27 196
6462 196 -85 153 -145 -57 -157 -62 115 -14 116 47 9 -14 76 -122 -74 102 -26 -33 75 86 -252 57 20 127
6486 127 -24 110 -136 -77 88 125 -148 -202 73 -51 2 154 -148 47 276 4 -146 166 160 81 -13 30 119
$$ packed form
6324g0o2J35K2J9O2O2j58J11j49J55k43J93k31N3R6M3Q7l83P8J48j4K47k55Q8
6348C4N8j21k04L01l05N6K89j45k85L44M4n1p4K81k46mp8K19k88J56k0j44J96
6371A3j2n8M25l01j74p7L20l08J74K27j59j70N2j72L65K4k30Q5j80J60J13k06
6393h9J87k29k5O1k05M06J3k23K51q0K59r25N95l81K75K18q0m3n4J28J72k34p8
6416h1M1J04k30J9R6k1J64k86M1J32j24K90k51K27l18J31j1l6K25j45K25K32l42
6439H2k68M3K12O2l17NJ48lJ66o8j68K50J15k51k00K80k07P3j9K21k87J04K23
6462A96k81K38k98Q8j00R5J77j29J30o9l8k3R0j98M8J76j28pJ08J1l38L09l7J07
6486A27j51J34k46N9J65L7k73n4K75j24N3J52l02J95K29k72j50L12op9r4M3Q9
$$ plain form
6509 119 -12 101 -104 -82 40 -77 34 65 199 94 114 100 340 294 129 221 102 -51 47 -36 -3 -4 112 115
6533 115 116 195 -98 77 42 -164 35 -147 -155 -95 -10 76 -123 14 -108 -159 0 23 -198 96 -248 -36 184 -152
6557 -152 92 -132 -5 -10 19 198 201 71 28 -174 265 -104 48 16 13 90 25 -124 -49 -32 -214 85 -181 -167 -264
6582 -264 -381 -133 -103 42 -34 169 261 337 -109 237 180 -279 141 43 -96 61 75 213 -21 -130 70 -123
6604 -123 113 -102 -81 -129 227 -134 40 -20 -102 -203 151 166 88 103 -182 384 -54 -22 -306 -6 122 -49 97
6627 97 -183 -85 219 -40 -49 76 269 -19 11 44 -121 -45 -6 -33 85 -254 205 161 -49 52 -131 -340 -142
6650 -142 239 172 -226 -57 -88 206 -76 -187 77 137 -189 -54 82 182 -223 162 -138 -425 -55 14 -74 -110
6672 -110 88 52 98 -26 -40 36 88 -111 288 -2 137 -269 -17 -94 -336 62 -88 -315 86 295 -250 128
$$ packed form
6509A19j31J13k05K2J22j17J11L1J34j05K0j4K40m6j65R2j19j53R8q3L3jJ16L
6533A15JP9k93J75l5k06J99j82qO0Q5Q6j99J37j22n1J59K3k21K94l44K12K20l36
6557a52K44k24J27nK9J79Lj30m3k02M39l69J52l2lP7o5j49P5J7j82K99k66J4r7
6582b64j17K48L0J45p6K03R2P6m46L46n7m59M20r8j39J57J4J38k34j09K00j93
6604a23K36k15K1m8L56l61J74o0q2j01L54J5p8J5k85N66m38L2k84L00J28j71J46
6627I7k80R8L04k59rJ25J93k88L0L3j65P6L9k7J18l39M59m4k10J01j83k09J98
6650a42L81o7l98J69l1K94k82j11K64O0l26J35J36J00m05L85l00k87L70O9q8l6
6672a10J98l6M6j24j4P6N2j99L99k90J39m06K52p7k42L98j50k27M01K09n45L78
$$ plain form
6694 128 126 99 129 72 -155 380 -160 83 -136 35 -136 -134 42 -453 -22 -42 177 -88 304 113 156 -122 -148
6717 -148 62 3 71 -227 -2 103 -37 -17 -42 302 -156 52 211 305 -82 -113 187 37 117 -41 -76 39 106
6740 106 -144 -159 -72 -105 152 -128 -3 -37 83 -340 -43 50 -28 266 -185 101 -31 -164 -93 8 166 -108
6762 -108 -96 68 -57 224 59 40 -129 57 227 -141 -31 -271 -176 -76 -51 199 306 225 5 29 80 -240
6784 -240 136 -310 -140 98 -20 -88 90 -97 -160 60 68 -2 90 -159 -205 78 241 46 19 251 16 -130 -345
6807 -345 -228 204 -154 216 -367 -1 26 59 -15 141 -143 116 -355 -127 143 11 139 -126 -46 -174 156
6828 156 63 153 22 577 225 62 -206 238 -76 79 -153 180 -80 259 26 -179 -301 -53 -94 -254 -121
6849 -121 -72 38 -61 -39 -275 81 44 -50 -269 81 -103 140 -61 89 53 -173 212 29 -34 -6 110 113 -77
$$ packed form
6694A28kk7L0n7k27N35n40K43k19J71j71KJ76m95M31k0K19k65L92j91M3k78k6
6717a48K10n9O8k98K25J05j40K0k5L44m58K08J59R4l87l1L00j50Q0j58l5J15O7
6740A06k50j5Q7l3K57k80J25l4J20m23K97R3p8K94m51K86j32j33P1J01J58k74
6762a08J2J64j25K81j65j9j69J86J70l68J10k40R5J00K5K50J07q1k20K4N1l20
6784b40L76m46J70K38j18o8J78j87o3K20Qp0R2k49m6K83J63j95k7K32k35j46k15
6807c45J17M32l58L70n83L66K7L3p4J56k84K59m71K28K70j32J28k65Q0j28L30
6828A56r3R0j31N55l52j63k68M44l14J55k32L33k60L39k33k05j22K48m1j60J33
6849a21M9J10r9K2k36L56l7r4k19L50j84K43k01J50l6k26L85j83o3K8J16Lj90
$$ plain form
6872 -77 33 13 -67 166 303 57 -12 -30 47 113 33 -156 7 96 -26 -129 -6 -20 -176 -34 103 -44 260
6895 260 -243 79 -25 66 -31 85 39 54 320 151 255 -12 230 156 94 11 69 -65 235 23 -104 -59 -254
6918 -254 -362 -4 -88 142 -224 -76 40 -182 -125 -151 58 -212 -152 110 25 86 -192 -17 -231 -104 136 -78
6940 -78 46 -227 -9 296 77 -36 -95 250 -179 -60 30 97 134 120 -132 22 97 -315 129 50 203 -53 83
6963 83 -108 0 124 -58 -135 150 269 152 -146 78 11 130 -350 7 -170 -226 -78 303 37 134 -86 -6
6985 -6 -22 -48 52 -49 -26 -148 -130 -233 -65 -223 21 255 44 162 -46 -28 -145 -50 180 -57 91 23 258
7008 258 3 -257 184 177 21 -121 246 157 110 -70 56 238 -67 35 84 -33 -57 -121 13 -109 144 237 -54
7031 -54 145 -149 20 27 -63 189 63 25 -8 -203 -194 170 -210 137 76 17 -36 18 -26 0 -11 -159 86 -53 -84
$$ packed form
6872g7J10k0q0K33J37k46o9j8P7O6q0j89J63Q9j22j03J23j4j56J42J37j47L04
6895B60n03L22j04R1r7J16m6J5K66j69J04k67K42p4o2q3N8j34L00k12j27M5j95
6918b54j08L58q4K30l66J48J16k22N7k6K09k70O0K62q5O1k78J75k14J27K40k14
6940g8J24k73K18L05k19j13n9L45m29J19R0O7L7j4k52J54P5m12M44p9J53k56J36
6963H3j91J08J24j82p7K85J19j17k98K24o7J19m80L57j77n6J48L81k66R7k20Q0
6985fj6k6J00j01K3j22J8j03J68j58K44K34k11J18k08J8j17R5K30k37J48o8K35
7008B58k55k60M41pj56j42L67q9m7j80J26J82l05J02M9j17k4o4J34j22K53R3k91
7031e4J99k94J69Pr0K52j26l8l3j95RL64l80L47o1n9n3N4m4K6j1j48K45j39l1
$$ plain form
7056 -84 -81 33 58 10 -236 44 -189 -17 -71 -111 93 -138 75 -413 10 -14 220 -21 -128 -255 -176 -43 -29
7079 -29 -136 17 137 211 -4 162 155 -62 -109 -159 -193 -14 47 62 -71 -56 -74 -107 -9 170 -123 -82 -129 28 -169
7104 -169 -169 226 -209 -91 71 -59 -109 -128 -146 -31 81 180 -18 -60 39 84 -117 87 -125 -291 174 -112 -129
7127 -129 -32 -188 310 68 119 -142 -87 115 -149 62 -56 -245 -171 0 -4 165 30 173 269 -102 -335 56
7149 56 108 -258 -20 37 -107 86 130 -288 188 5 58 63 -132 2 254 -150 248 142 -33 45 -202 -81 -124
7172 -124 166 79 -70 -239 164 -57 -88 -110 258 -19 117 44 -54 144 -89 -97 -1 -221 73 -192 172 4 -128
7195 -128 2 10 -21 -169 215 251 195 255 5 -235 58 202 -76 -22 -32 125 -119 -69 69 -439 -65 82 -55
7218 -55 53 -12 -67 -34 -17 -164 179 35 161 155 -182 78 -104 -135 76 -137 234 8 417 42 58 -35 -338
$$ packed form
7056h4LJ14K5m8k46K80k33J72n4m0K04k31K13m88M23k4K34k41j07j27P9J33J4
7079b9j07J53J20P4k15J66pk17m7n0l4J79O1J5j33J5j8l3R8J79k93M1m7J57j97
7104a69%L95m35J18J62j30n0j9j8J15J12R9j98m2R9M5k01K04k12j66M65k86j7
7127a29R7j56M98k42N1k61N5K02k64K11j18j89P4J71mJ69j35J43R6l71k33L91
7149E6N2l66K38N7j44J93M4m18M76j83N3Nj95J34K52m04L98j06j75P8k47J21m3
7172a24K90q7j49j69M03k21l1k2L68k77J36p3r8J98k33qR6k20K94k65L64j68j32
7195a28J30Ql1j48L84L6n6O0k50k40K93J44k78N4j0J57k44N0J38n08L74J47j37
7218e5J08o5n5L3J7j47L43j44J26ol37K60j82l1K11k13L71k26M09l75J6r3l03
$$ plain form
7241 -338 -299 -129 233 16 -175 -46 69 57 29 -187 70 -121 59 -130 -507 -168 -125 -77 188 86 52 101
7263 101 -89 78 107 -23 89 57 1 -215 -192 -107 61 18 -2 -53 -221 18 -70 -59 56 1 3 -83 -119 -36 -45 115
7289 115 162 138 25 48 50 -156 75 21 67 -83 88 -6 2 -208 -137 86 -85 -81 254 108 -6 136 -101 41
7313 41 29 -110 -5 -57 -131 76 156 -47 -92 60 -103 338 24 28 -35 181 -101 200 -104 129 -207 208 -209
7336 -209 -447 -116 -91 139 97 -24 -107 -53 13 90 -148 104 -41 -121 96 185 -113 -89 72 -303 98 2 280
7359 280 -77 -75 13 119 -164 53 -144 96 22 -74 14 107 127 -109 144 45 -61 61 210 176 127 131 -263 110
7383 110 -9 -340 -58 50 -53 -102 -39 -10 65 -161 5 91 23 3 245 -42 14 -72 215 32 -28 -54 26 -244
7407 -244 -100 246 103 186 -202 4 -115 130 -87 -202 -64 -79 12 -156 -52 16 -82 53 -231 14 -92 -111
$$ packed form
7241c38L9J70L62k17j91J29J15j2k8k16K57j91J80j89l77L39M3M8K65j02l4M9
7263A01j90J67K9j30J12l2n6k16K3Q5J68m3k0n1j68K39q8J1J15n5Kq6l6Q3rJ60
7289A15M7k4j13K3Kk06K31n4M6j50J71r4Qk10P1K23j71ML35j46j14J42k37J42
7313D1j2j39J05n2p4K07Q0k03m5J52j63M41l14Mo3K16k82L01l04K33l36M15m17
7336b09k38L31K5K30m2j21q3N4O6P7k38K52j45q0K17Q9k98K4J61l75M01r6K78
7359B80l57KQ8J06k83K17j97K40p4r6Q8R3K0k36K53r9j06J22J49l4m9Ml94L73
7383A10j19l31K82J08j03m9O3K9P5k26J66Q6o8k0K42k87N6q6K87j83o0k6Q0k70
7407b44J44L46j43Q3l88K06j19K45k17j15J38j5R1j68J04O8r8J35k84K45j06j9
$$ plain form
7429 -111 179 -99 -31 -105 39 165 -86 -58 -67 25 37 103 -20 109 187 -39 223 125 -10 -43 -274 -39 69 66
7453 66 144 166 -121 -186 10 -57 174 172 -37 -72 -23 -59 -200 7 197 -10 -24 -44 102 -112 -53 -13 235 -54 48
7478 48 -249 -115 -133 -102 110 -60 206 191 -105 247 -245 -184 43 -253 10 -115 -226 12 175 -16 12 -23
7500 -23 -31 -63 -108 -85 114 204 -19 161 -66 -77 -254 -81 -49 125 11 258 -84 209 -58 -43 -12 -8 -43 -130 -144
7525 -144 -96 -273 -1 186 126 -172 196 153 66 248 -170 130 144 11 -262 -212 -3 -56 198 138 -3 -39 44
7548 44 31 67 171 85 -59 70 59 -279 77 172 -195 104 -78 54 102 319 28 211 317 -206 41 90 -28
7571 -28 36 -48 39 108 138 144 -10 48 -125 -45 158 -56 114 211 34 -80 62 -143 -10 43 -114 93 -199 -96
7595 -96 -222 -205 93 -305 134 4 -410 99 -209 180 93 44 -268 -152 -46 -4 -17 -30 -89 288 41 -25 175
$$ packed form
7429a11K90k78O8p4J44J26k51K8rR2J2O6j23J29P8k26K62r8j35l3k31K35J08l
7453F6P8K2k87o5J96o7K31kk09l5M9l6j41K07J90k07j4k0J46k14N9M0K48k89J02
7478D8k97J34j8L1K12j70K66j5k96L52m92O1K27k96K63j25j11K38J63j91K8l5
7500b3ql2m5K3J99R0k23J80k27j1j77J73L2J74j14K47l42K93k67J5L1Ml5q7j4
7525a44M8j77K72J87o0k98L68m3q7J82m18L00J4j33k73N0K09n3K54o0j41l6Q3
7548D4j3L6J04q6j44J29j1l38L56R5l67K99j82J32M8K17k91J83J06n23K47M9j18
7571b8O4q4Q7O9L0Oj54N8j73Q0K03k14J70R7j77j14J42k05J33N3j57K07k92J03
7595i6j26J7K98l98M39j30m14N09l08L89q7m9l12J16J06M2j3j3n9L77k47o6K00
$$ plain form
7618 175 146 38 -253 17 -245 176 -1 50 11 -155 -143 53 -303 100 -85 31 207 -453 -16 127 10
7639 10 -177 -205 209 13 -6 56 -75 -166 -183 29 -39 153 26 -46 -255 33 -207 -140 128 -143 207 109 209
7662 209 425 -76 -111 71 -67 -154 -55 -60 -36 -49 -99 6 -40 131 -444 48 75 -269 -49 -405 271 -121 53
7685 53 -100 290 225 105 389 343 -84 -10 -58 -227 -102 402 41 -73 -292 -49 147 -109 -269 -123 147 -157
7707 -157 45 163 -156 -10 -1 99 -99 45 -117 -237 -5 27 -189 -27 115 -133 -63 55 137 -219 -37 261
7729 261 -93 -135 -4 93 82 140 80 -54 -128 -164 -24 370 96 128 232 28 42 -39 -172 -141 363 12 -179 55
7753 55 -125 -148 -217 32 44 67 -176 9 144 241 -87 -16 51 1 8 299 204 -125 -202 -188 -148 -23 154 -117 -8
7778 -8 6 -149 -74 -246 189 174 180 -227 -64 -32 -111 -75 -53 -172 55 94 -216 225 -119 -46 203 -269 -161 -84 -328
$$ packed form
7618A75k9j08k91K70k62M21j77N1l9j66J2J96l56M03j85J16J76o60M37J43j17
7639A0j87k8M14j96j9O2j31r1j7K12o8J92j27p2k09K88k40O7K68k71L50r8J00
7662B09K16n01l5J82j38q7R9nK4j3n0J05m6J71n75M92K7l44K20l56O76l92J74
7685E3j53L90o5j20K84m6m27P4m8j69J25N04l61j14k19K43J96k56j60J46K70l04
7707a57K02J18l19J46RJ00j98J44j62j20K32L2k16J62J42k48P0J18Q2l56J82K98
7729B61l54m2J31R7j1N8o0j34p4l6J40L94k74L2J04k04J4q1j33L1N04l51j91K34
7753E5j80k3o9K49J2K3k43J85J35R7l28P1O7n0PK91r5l29p7J4M0J25J77k71J09
7778hJ4j55P5j72M35j5Om07J63L2p9L6K2j19K27L9l10M41l44P3K49m72J08P7k44
$$ plain form
7803 -328 111 -25 67 29 137 276 -12 -8 -10 42 -9 63 -150 -80 74 -195 -140 117 135 175 -29 39 106 50 38 -56
7829 -56 -141 47 116 -285 15 -201 -35 50 -171 24 -115 -38 -45 -79 -55 -185 -47 254 -141 -227 103 8 45 39 -128
7854 -128 26 89 -163 135 -171 -62 -166 -88 132 -421 42 27 46 134 82 114 197 -86 -155 -110 13 27 -80 -74
7878 -74 -253 13 -18 -48 -44 240 78 212 -76 316 177 133 119 -80 77 35 -19 248 145 -2 109 -48 -160
7901 -160 408 -227 -280 -102 -20 95 31 226 94 -16 29 -326 108 237 -169 49 -77 -59 -35 100 101 98 -154
7924 -154 30 -329 -386 -2 -31 -288 -177 -59 103 -150 -305 105 -22 168 79 416 -239 16 55 -128 -178 -87
7946 -87 58 46 -60 80 221 -73 -2 -188 -509 41 -203 -301 -213 -3 -315 46 117 97 162 -151 63 -74 -88
7969 -88 198 -83 -25 83 -233 -229 27 242 -152 46 -158 -92 42 46 22 -60 -94 34 -63 -257 18 57 -34 200
$$ packed form
7803c28M39j36R2l8J08J39k88MkN2n1P2k13P0J54k69N5K57J8M0k04O8O7n6j2r4
7829e6q5J88O9m01L00k16J66Q5k21J95j39P7pl4K4j30J38L01l95q6L30r5L7oj67
7854a28J54O3k52K98l06J09j04P8K20n53M63j5J9Q8n2L2Q3k83o9M5J23J4j07O
7878g4j79K66l1l0MK84j62J34k88L92j39m4j4j99J57m2n4K67j03j47J11j57j12
7901a60N68o35n3J78Q2J15o4J95j32j10M5l55M34J29m06K18j26J8K4J35Jlk52
7924a54J84l59n7L84k9k57J11J18J62k53j55M10j27J90q9L37o55K55L9j83n0R1
7946h7J45j2j06J40J41k94P1j86l21N50k44r8Q8K10l12L61P1k0O5l13K14j37j4
7969h8K86k81N8J08l16MK56K15l94J98k04O6J34Mk4q2l4J28r7j94K75L9r1K34
$$ plain form
7993 200 36 0 214 346 180 181 -276 -171 282 -109 -215 132 -233 34 -144 153 -84 -247 147 -23 40
8014 40 -89 173 124 221 165 -194 -50 -293 345 101 8 29 39 339 326 -46 -122 -91 17 -280 -143 65 127 135
8038 135 209 -36 -296 49 -264 303 -112 2 199 -272 223 -102 -173 -117 48 -166 -217 -157 148 -13 118 93
8060 93 -269 197 75 -44 -64 -106 -309 132 -39 -156 33 19 -22 -170 -208 -46 127 -142 -54 59 -241 -77
8082 -77 92 -132 -166 -281 -176 154 100 -117 64 218 -45 -45 -243 -56 -44 -57 -99 130 -52 4 303 -14 -96
8105 -96 -35 73 82 81 100 184 27 145 -17 -214 98 -46 30 297 -59 204 45 -235 142 -38 37 118 37 188
8129 188 -26 -311 131 131 -105 179 93 -90 22 -148 -166 -88 -263 205 194 70 -8 -163 93 -49 82 -165
8151 -165 43 -32 -59 -96 75 -30 41 -5 291 -101 114 -121 137 195 -122 87 -154 -360 71 114 -45 20 182
$$ packed form
7993B00j64l6K14J32j66Jm57J05M53l91j06L47l65K67j78K97k37j63L94j70O3
8014D0j29K62m9R7n6l59J44k43O38k44r3K1J0L00j3l72p6L1J08k97J37K08O2Q
8038A35P4k45k60L45l13N67m15J14J97m71M95l25p1N6J65k14n1O0L05j61J31k5
8060I3l62M66j22j19k0m2k03M41j71j17J89j4m1j48l8J62J73k69Q8J13l00J64
8082g7J69k24l4j15J05L30n4k17J81J54k63%j98J87J2j3m2K29j82N6K99l17q2
8105i6O1J08RjJ9Q4j57J18j62j97L12j44P6K67l56K63j59k80L77j80P5Q1q1J51
8129A88k14k85M42%k36K84q6j83J12j70j8P8j75M68j1j24p8j55K56j42J31k47
8151a65K08p5k7l7J71j05P1m6K96l92K15k35K58N8l17K09k41k06M31M3j59O5J62
$$ plain form
8174 182 -120 -305 -70 -173 -212 -260 105 38 37 94 11 -131 8 -11 -37 -73 77
$$ packed form
8174A82l02j85K35j03l9m8L65o7jN7q3j42J39j9k6l6J50
8191G7
$$ Imaginary data points
##PAGE= N=2
##DATA TABLE= (X++(I..I)), XYDATA
$$ plain form
0 0 0 0 0 0 0 0 0 0 0 0 0 8 -8 8 -8 16 -16 17 -24 27 -32 40 -48 56 -64 80 -88 104 -120 136 -155 178 -202
33 -202 227 -258 291 -326 364 -409 456 -508 565 -625 692 -765 844 -934 1029 -1134 1248 -1375
51 -1375 1516 -1668 1842 -2038 2256 -2504 2792 -3125 3518 -3992 4575 -5311 6277 -7601 9541
66 9541 -12663 18513 -33295 154786 196987 -126295 -83054 -42121 -73299 -29102 76786 37188
78 37188 10520 -35725 -163027 -186646 5114 88429 45325 79027 86685 -40414 -72184 -33543
90 -33543 -43598 29250 166313 126346 2819 -18437 -26643 -89112 -79110 -13016 19906 43284
102 43284 22261 -89767 -121256 -31960 -2039 5384 92612 121094 53731 6011 -39685 -76223
114 -76223 -7655 74802 45665 14801 44771 871 -86463 -72605 -34265 -26238 34184 48466
$$ packed form
0@%%%%%%%%%%%Qj6J6j6K4l2L3m1N1n9P2q8J04j20J44j68J92k24K56k91L33l80
33b02M29m85N49o17O90p73Q65r64J073j190J317j457J609j778J963k163K382k623
51a375K891l184L510l880M294m760N296n917O643p510Q567r886J1588j3878J7142
66I541k2204L1176n1808J88081M2201l23282M3241M0933l1178M4197J05888l9598
78C7188k6668m6245j27302k3619J91760Q3315m3104L3702P658j27099l1770L8641
90c3543j0055P2848J37063l9967j23527k1256q206o2469J0002O6094L2922K3378
102D3284k1023j12028l1489Q9296K9921P423Q7228K8482o7363m7720m5696l6538
114g6223O8568Q2457k9137l0864K9970m3900q7334J3858L8340Q027O0422J4282
$$ plain form
126 48466 -43084 -51563 6842 -39128 -65668 43981 113352 70664 49382 31592 -40885 -48972
138 -48972 10557 -467 -9362 56077 37983 -60045 -73702 -48610 -46694 3256 50945 15291
150 15291 -11945 10323 -18224 -66615 -14457 65636 68577 54196 38276 -12323 -26108 -7279
162 -7279 -29741 -29043 27942 35470 -20458 -51516 -46825 -33481 -6249 17100 18178 32878 50591
175 50591 5626 -42010 -13297 19995 22490 37262 30230 2041 3831 -9504 -54726 -42897 17346
188 17346 22349 -16345 -17528 -10821 -30692 -23436 661 3251 36517 68942 18774 -25979 2547
201 2547 11757 -12189 -2871 18740 11657 2476 -8389 -42482 -43884 7405 15196 -19331 -2022
214 -2022 24551 -1640 -22661 -17085 -6603 24380 47613 23774 -1234 12655 14693 -19731 -29627
$$ packed form
126D8466r1550q479N8405m5970k6540J09649O9371m2688k1282j7790p2477q087
138d8972N9529j1024q895O5439j8094r8028j3657K5092J916M9950M7689l5654
150A5291k7236K2268k8547m8391N2158Q0093K941j4381j5920n0599j3785J8829
162g279k2462O98N6985P528n5928l1058M691J3344K7232K3349J078J4700J7713
175E0591m4965m7636K8713L3292K495J4772p032k8189J790j3335m5222J1829O0243
188A7346N003l8694j183O707j9871P256K4097K590L3266L2425n0168m4753K8526
201B547R210k3946R318K1611p083r181j0865l4093j402N1289P791l4527J7309
214b022K6573k6191k1021N576J0482L0983K3233k3839k5008J3889K038l4424r896
$$ plain form
227 -29627 1126 15187 7015 -6891 -33778 -31714 2240 2201 -12428 9455 31958 19091 -7291
240 -7291 -18641 -5992 16287 22895 6981 285 18375 15235 -18516 -24022 -6046 -319 1086
253 1086 -7682 -22784 -12092 1082 -12764 -17044 8879 31576 22943 5659 1949 -603 -854 2938
267 2938 -5387 -3103 17265 9067 -18695 -19420 -5982 1208 467 -6502 -6716 1842 2428 -11166 -16122
282 -16122 9244 29659 14716 3582 11513 13562 8023 -5028 -17141 -5281 10034 -877 -18222
295 -18222 -15899 1314 3819 -11440 -10798 6444 14830 7125 -10204 -13738 5575 13070 3241 2172
309 2172 9005 15366 9574 -9741 -14073 -1346 4912 -2843 -17021 -15056 1129 1371 -8192 -6146
323 -6146 4262 13985 9924 -4541 -3101 7982 8535 557 -7602 -890 14539 8227 -7943 -7837
$$ packed form
227b9627L0753J4061q172j3906k6887K064L3954l9j4629K1883K2503j2867k6382
240g291j1350J2649K2279O608j5914o696J8090l140l3751n506J7976N727J405
253A086q768j5102J0692J3174j3846m280K5923K2697q633j7284l710k552k51L792
267B938q325K284K0368q198k7762p25J3438P190p41o969k14Q558N86j3594m956
282a6122K5366K0415j4943j1134P931K049n539j3051j2113J1860J5315j0911j7345
295a8222K323J7213K505j5259O42J7242Q386p705j7329l534J9313P495r829j069
309B172O833O361n792j9315m332J2727O258p755j4178J965J6185K42r563K046
323f146J0408R723m061j4465J440J1083N53p978q159O712J5429o312j6170J06
$$ plain form
337 -7837 426 2896 -8095 -14537 -2031 4768 -3224 -8234 -4616 6357 13327 6593 2988 8683
351 8683 9743 5517 -2910 -4832 6058 4819 -7380 -9784 -4681 -595 -2671 -10691 -9513 -2360 -925
366 -925 -1916 -4978 -1233 10280 8331 -402 415 6733 13879 8303 -6918 -5901 4468 1976 -7748
381 -7748 -11385 -2347 5838 -3522 -12018 -5941 2950 7445 969 -6900 1833 11615 7994 977 -2008
396 -2008 5091 10288 -797 -8562 -2062 3107 1019 -7811 -11958 -3051 3611 1930 -2185 -4007 3093
411 3093 7141 -3738 -5382 6340 8805 3895 -1320 -1880 4159 3960 -401 -2583 -3189 453 -1458
426 -1458 -9725 -6822 -648 -1703 -2865 -4331 -418 7669 3834 -4129 -1885 3585 6042 1000 -2437
441 -2437 6108 9323 497 -5232 -1099 7373 7117 -5145 -7225 -888 -3334 -5098 -4641 -3251 5307
$$ packed form
337g837Q263K470j0991o442J2506O799p992n010L618J0973O970o734l605N695
351H683J060m226q427j922J0890j239j2199k404N103M086k076q020J178P153J435
366i25r91l062L745J1513j949q733Q17O318P146n576j5221J017J0369k492r724
381g748l637R038Q185r360q496O077Q891M495o476p869Q733R782l621p017k985
396b008P099N197j1085p765O500N169k088q830m147Q907O662j681m115j822P100
411C093M048j0879j644J1722K465m910n215n60O039j99m361k182o06L642j911
426a458q267K903O174j055j162j466L913Q087l835p963K244N470K457n042l437
441b437Q545L215q826n729M133Q472k56j2262k080O337k446j764M57J390Q558
$$ plain form
456 5307 7909 -1197 -4255 2818 9514 5900 -2153 -295 1745 -327 1557 -3804 -6223 5007 3899
471 3899 -10045 -7621 2530 441 -6185 -5999 -1918 -2597 935 7172 2261 1792 9974 4726 -2962
486 -2962 2682 3160 -903 -504 -2304 -6008 -5357 -848 739 -2782 -780 2893 -2372 -2307 222 -2819
502 -2819 641 4195 1077 3722 6945 3252 2444 1874 846 1142 389 -756 -3169 -5044 -4701 -6622
518 -6622 -1614 7803 1464 -3260 3106 -1565 -6515 2242 3208 -1601 3581 5160 -4303 -4889 7301
533 7301 7071 -3293 1590 1821 -11698 -6389 3411 -7739 -6747 7345 2199 -7836 245 7018 3379
548 3379 2904 4825 -3517 -4190 9059 4593 -6505 5312 10029 -2555 -4462 129 -940 -110 -2062
563 -2062 -7785 -6567 -862 -352 -3435 2694 8042 2518 1875 5662 -567 -1119 3530 -291 -1258 1641
$$ packed form
456E307K602r106l058P073O696l614q053J858K040k072J884n361k419J1230j108
471C899j3944K424J0151k089o626J86M081o79L532O237m911m69Q182n248p688
486b962N644M78m063L99j800l704O51M509J587l521K002L673n265O5K529l041
502b819L460L554l118K645L223l693q08n70j028K96p53j145k413j875L43j921
518f622N008R417o339m724O366m671m950Q757R66m809N182J579r463n86J2190
533G301k30j0364M883K31j3519N309R800j1150R92J4092n146j0035Q081O773l639
548C379m75J921q342o73J3249m466j1098J1817M717j2584j907M591j069Q30j952
563b062n723J218N705N10l083O129N348n524o43L787o229n52M649l821r67K899
$$ plain form
579 1641 -3688 -2283 2668 -2365 -4754 1554 1554 -6458 -5047 352 -6790 -6581 8554 5125 -3372 8199
595 8199 8513 -5362 1384 9396 -509 -3270 3382 -3551 -13208 -2861 6002 -2212 -1292 5655 -4178
610 -4178 -5740 5850 -909 -5399 7069 6524 -5651 -2322 7510 5876 2603 6687 3729 -4750 -876
625 -876 359 -8452 -4722 1141 -5324 -6154 -1049 -1346 1371 5587 3629 -200 -1043 1597 789 -558
641 -558 541 -400 462 2645 -1957 -1739 4280 -153 -4054 -1205 -4804 -6321 -871 -947 -3612 1324 6684
658 6684 4057 1631 7344 5325 -2256 3719 5013 -6449 -4549 2564 -3704 -5877 805 1266 -732
673 -732 2360 2165 -4040 -4039 2606 -1165 -4308 3547 3221 -2260 3967 5012 -221 4188 6397 -1249 -6856
690 -6856 -4131 -2201 -4381 -3500 730 -1789 -1726 2941 949 571 3947 1206 -927 -1275 -3875 -1567
$$ packed form
579A641n329J405M951n033k389O308%q012J411N399p142K09J5135l429q497J1571
595H199L14j3875O746Q012r905k761O652o933r657J0347Q863q214R20O947r833
610d178j562J1590o759m490J2468n45j2175L329R832j634l273M084k958q479L874
625h76J235q811L730N863o465q30N105k97K717M216j958l829q43K640q08j347
641e58J099r41Q62K183m602K18O019m433l901K849l599j517N450p6k665M936N360
658F684k627k426N713k019p581N975J294j1462J900P113o268k173O682M61j998
673g32L092j95o205JO645l771l143P855l26n481O227J045n233M409K209p646n607
690f856K725J930k180Q81M230k519O3M667j992l78L376k741k133l48k600K308
$$ plain form
706 -1567 2939 2374 1087 975 1823 2052 302 -113 -2113 -4048 -2025 -4363 -5926 1417 3755 1462
722 1462 4553 3666 534 4397 5776 53 -2939 -726 -164 -4344 -1423 3525 -433 -1405 2514 -2751
738 -2751 -4679 1141 -692 -4674 -3008 -1591 -929 2147 5508 3738 909 4244 3341 -2827 -798 973
754 973 -4735 -4411 -2757 -4831 -1433 3292 2228 -24 -608 1046 1178 346 2357 852 -774 2152
770 2152 1582 464 3593 3171 1814 361 -4505 -4407 -665 -1730 -3893 -3652 -1700 746 866 2777 4427
787 4427 2922 3148 2101 -1586 508 2255 -725 -845 -910 -2528 -43 1151 -180 -1808 -3131 -2369
803 -2369 -2713 -3421 -995 -753 -317 2900 911 -91 4101 4862 2275 861 -1053 -1432 -251 -1144 -1071
820 -1071 -1906 -1085 842 -1201 -815 1931 697 -129 77 -1434 -554 1225 2388 3226 966 45 3279
$$ packed form
706a567M506n65j287j12Q48K29j750m15k000j935K023k338j563P343K338k293
722A462L091q87l132L863J379n723k992K213N62m180K921M948l958r72L919n265
738b751j928N820j833l982J666J417O62L076L361j770k829L335r03o168K029J771
754I73n708L24J654k074L398M725j064k252n84J654J32q32K011j505j626K926
770B152n70j118L129m22j357j453m866R8L742j065k163K41J952K446J20J911J650
787D427j505K26j047l687K094J747k980j20o5j618K485J194j331j628j323P62
803b369l44p08K426K42M36L217j989j002M192P61k587j414j914l79J181q93P3
820a071q35Q21J927k043L86K746j234q26K06j511Q80J779J163Q38k260r21L234
$$ plain form
837 3279 3269 865 -200 -852 -237 -2732 -5920 -2970 -333 -105 -691 -1924 -646 2104 1223 1324 1641
854 1641 -281 153 789 -208 787 1076 981 1420 -852 -1625 -578 -1413 -968 -1920 -4435 -2832 -201 -196 697
873 697 995 1948 3213 1444 1695 2013 1072 1859 455 -3111 -1307 1175 792 -157 -1378 -446 377 -1654
891 -1654 -724 -71 -1279 87 378 -1139 495 1745 3039 2923 -4 -479 1002 787 -780 -2194 -2512
908 -2512 -374 -1864 -3303 246 893 -350 -129 -343 31 -252 20 1947 859 -1466 388 385 918 2039
926 2039 98 -489 826 -718 -1612 -1714 -188 1443 -1107 -2582 -154 515 1510 2754 602 -359 1550
943 1550 1388 511 -632 -2 1810 -855 -2289 -4 -42 544 952 -1517 -2275 -228 57 -48 -1066 -455
961 -455 1327 -731 -471 1121 -551 376 2097 -913 -2021 -69 581 -39 -1737 -1028 234 -943 287
$$ packed form
837C279j0k404j065o52O15k495l188K950K637K28n86j233J278K750q81J01L17
854A641j922M34O36r97R95K89r5M39k272p73J047q35M45r52k515J603K631NQ93
873F97K98R53J265j769K51L18r41P87j404l566J804K482l83r49j221R32Q23k031
891a654R30O53j208J366K91j517J634J250J294j16k927m75J481k15j567j414l18
908b512K138j490j439L549O47j243K21k14L74k83K72J927j088k325J854lN33J121
926B039j941n87J315j544q94j02J526J631k550j475K428O69R95J244k152r61J909
943A550j62q77j143O30J812k665j434K285l8N86M08k469p58K047K85j05j018O11
961d55J782k058K60J592j672R27J721l010j108J952O50o20j698P09J262j177J230
$$ plain form
978 287 1092 -901 610 1340 -785 -332 1309 824 65 -385 -100 -175 -831 1968 1959 -1777 -1092 1113 -569
997 -569 -96 1271 -98 -560 -476 623 -566 -994 3461 2561 -2698 -1028 555 -782 164 532 -1129
1014 -1129 -1445 -281 203 -1807 -772 2714 122 -2578 -185 -544 -1613 2283 1514 -2245 -736 1957
1030 1957 1031 -996 91 2648 -339 -1890 124 -1010 -594 2034 293 -1774 409 1238 691 174
1046 174 -159 910 137 19 1463 -402 -426 1102 -160 -369 -168 -386 -143 -1435 -1092 327 -1671 -218
1064 -218 2617 269 -1898 668 1488 -106 -385 1115 1183 -1553 -747 328 -1196 472 2796 -1467
1080 -1467 -2748 -512 -1128 -1356 977 853 -1180 -1294 1293 308 -1762 2287 3536 -990 -975 628 -1331
1097 -1331 354 2084 -265 -1526 148 1710 -497 -1965 1662 2109 -1465 -609 355 -1079 698 1578
$$ packed form
978B87Q05j993J511P30k125M53J641m85p59m50K85p5o56K799rl736O85K205j682
997e69M73J367j369m62Q4J099j189m28M455r00n259J670J583j337R46L68j661
1014a129l16J164M84k010J035L486k592k700K393l59j069L896p69l759J509K693
1030A957r26k027J087K557k987j551K014j134M16K628j741k067K183Q29n47n17
1046A74l33J069p73j18J444j865k4J528j262k09K01k18K43j292L43J419j998J453
1064b18K835k348k167K566Q20j594k79J500O8k736Q06J075j524J668K324m263
1080a467j281K236o16k28K333j24k033j14K587r85k070M049J249m526J5J603j959
1097a331J685J730k349j261J674J562k207j468L627M47l574Q56R64j434J777Q80
$$ plain form
1113 1578 475 -242 169 1175 44 -1767 250 -468 -1452 124 -219 -1929 410 1291 -817 -1151 257
1130 257 1550 -347 -1306 452 363 -503 1998 843 -1384 55 937 -354 -640 354 1009 -823 -1233
1147 -1233 681 -990 -1507 2206 1100 -1521 -276 211 -523 523 1005 564 64 1176 969 -1659 -176
1164 -176 3298 -94 -2312 -145 -1002 -1282 842 1009 -137 -435 311 322 -1874 -389 1628 -649 -420
1181 -420 186 -1074 324 2066 143 -538 -437 -339 -231 -1241 -868 -330 -562 179 25 -1030 1580 1847
1199 1847 757 383 -628 97 1129 -393 -297 831 -281 316 1243 354 59 240 301 -869 -2561 -197
1217 -197 882 -1079 50 686 -527 1312 2375 177 -326 156 -414 -1331 -775 282 -287 -448 1156
1234 1156 -518 -1385 1693 1174 -1497 -761 -992 -1900 -361 587 238 307 899 1704 -370 -365 1177 12
$$ packed form
1113A578j103p17M11J006j131j811K017p18r84J576l43j710K339Q81k108l34J408
1130B57J293j897r59J758q9q66K501j155k227J439Q82j291k86R94O55j832m10
1147a233J914j671n17L713j106k621J245M87p34J046M82m41n00J112k07k628J483
1164a76L474l392k218K167q57k80K124J67j146k98P46J1k196J485K017k277K29
1181d20O06j260J398J742j923o81J01R8J08j010L73N38k32P41j54j055K610K67
1199A847j090l74j011P25J032j522R6J128j112N97R27q89k95J81O1j170j692K364
1217a97J079j961J129O36j213J839J063k198n03M82n70r17N56J057n69j61J604
1234A156j674q67L078n19k671P36k31r08J539R48l49O9N92Q05k074NJ542j165
$$ plain form
1252 12 -595 -565 -2018 -917 1137 355 329 504 -88 323 216 -454 -347 -269 272 -334 -1023 1203 1859 676
1272 676 1359 -205 -963 728 69 -1473 -251 -687 -1185 -220 134 78 191 801 1171 -1112 -982 994
1290 994 -20 -419 248 -736 -343 1040 323 -14 435 271 -611 -1306 -601 24 -506 395 402 -1342 296
1309 296 1797 618 534 418 -378 -88 -41 -76 159 116 599 -23 -775 552 734 335 433 -897 -1459 813
1329 813 403 -573 74 74 297 384 -174 215 572 295 -76 -1180 -700 274 -353 13 -277 -1450 -483 520
1349 520 -258 -111 224 261 356 -423 -257 201 455 985 -233 -965 272 799 61 481 85 -460 159 -243
1369 -243 -152 -9 124 514 -239 -489 775 532 414 906 -286 -830 458 -47 358 -39 -868 193 169
1388 169 -408 153 25 628 291 -1368 -900 499 115 89 -363 -770 76 151 98 429 -483 -290 148 -841
$$ packed form
1252A2o07L0j453J101K054p82k6J75n92M11j07o70J07P8N41o06o89K226O56j183
1272F76O83j564p58J691o59j542J222m36m98R65L54n6J13O10L70k283J30J976
1290I94j014l99O67r84L93J383p17l37M49j64q82o95P05O25n30R01Pj744J638
1309B96J501j179q4j16p96K90M7l5K35m3M83o22p52J327J82l99R8j330n62K272
1329H13m10r76O47%K23Q7n58L89L57k77l71j104M80R74o27L66k90j173R67J003
1349E20p78J47L35L7R5p79J66M58K54N30j218p32J237N27p38M20l96n45O19m02
1369b43R1J43J33L90p53k50J264k43j18M92j192n44J288n05M05l97q29J061k4
1388A69n77N61j28O03l37j659M68J399l84k6m52m07Q46P5n3L31r12J93M38r89
$$ plain form
1408 -841 -837 -288 120 997 73 -798 114 703 971 145 -743 -97 196 -424 -345 239 256 836 3 -285 447
1429 447 264 386 294 -799 -420 178 47 480 -50 -185 314 422 238 75 -508 384 113 -1370 -757 45
1449 45 142 600 283 -1057 -65 570 -122 -395 -368 272 -394 -1228 72 439 58 822 251 -936 71 677
1469 677 245 87 -131 -307 -485 -62 971 -248 -243 1073 56 -703 -34 22 328 259 -891 -635 27 345
1489 345 514 297 312 453 -377 -84 -329 -472 278 475 -680 -249 78 595 946 -506 -805 92 -29 -761
1509 -761 -558 -353 -62 -327 -221 -122 -173 231 1187 -481 -530 539 230 -124 245 -159 -13 453 552 208 2
1530 2 505 315 -969 -37 602 -622 555 853 -291 -563 681 771 286 106 260 -182 -590 449 58
1549 58 -668 284 335 -847 -662 -134 284 572 -15 -337 -619 -249 428 417 -375 411 78 -417 -349 -469 50
$$ packed form
1408h41MN49M08Q77r24q71R12N89K68q26q88O46K93o20P9N84J7N80q33k88P32
1429D47j83J22r2j093L79N98j31M33n30j35M99J08j84j63n83Q92k71j483O13Q02
1449D5R7M58l17j340R92O35o92k73K7O40o66q34J300L67l81P64n71j187J007O06
1469F77m32j58k18j76j78M23J033j219NJ316j017p59O69N6L06o9j150K56O62L18
1489C45J69k17J5J41q30K93k45j43P50J97j155M31L27N17L51j452k99Q97j21p32
1509g61K03K05K91k65J06R9n1M04R56j668m9J069l09l54L69m04J46M66R9l44k06
1530BN03j90j284R32O39j224J177K98j144k72J244R0m85j80J54m42m08J039l91
1549E8p26R52N1j182J85N28M18K88n87l22k82L70O77j1p92P86l33m95O8j20N19
$$ plain form
1570 50 684 -375 -515 -488 -944 690 259 -1040 -265 616 144 -312 -37 673 679 237 438 -662 -288 1253
1590 1253 180 -1168 338 517 -34 59 -36 -83 -9 152 -284 -622 131 725 -533 -597 611 -19 95 600
1610 600 -234 -545 -224 246 -297 -299 -265 -76 -483 -341 233 71 682 187 77 -20 -442 -493 747 216 42
1631 42 38 -269 -218 512 194 -371 154 232 -339 -994 -308 655 278 194 -196 -493 696 1390 -395 -523 1045
1652 1045 334 -597 -778 260 517 -115 -79 -334 -894 791 581 -864 -696 -76 -13 -43 -308 -206 222 594
1672 594 241 -477 -246 827 417 -1097 -375 -22 -95 -224 -140 -7 192 -102 -114 -29 8 813 -92 -504 261
1693 261 465 119 129 362 457 179 -474 -284 162 -12 157 -662 -737 452 230 -247 423 431 257 -218 -235 93
1715 93 -37 353 -191 -972 -147 1010 258 -458 154 80 -190 -456 -1196 47 396 352 -522 -593 473 976
$$ packed form
1570E0O34j059j40K7m56J634m31j299P75Q81m72m56K75P10Om42K01j100L74J541
1590A253j073j348J506J79n51R3r5m7P4J61m36l38P53N94j258o4J208o30J14N05
1610F00q34l11L21M70n43kL4J89m07J42N74j62O11m95j10r7m22n1J240n31j74
1631D2ml07N1P30l18n65N25P8n71o55O86R63l77q4l90k97J189O94j785j28J568
1652A045p11r31j81J038K57o32L6k55n60J685k10j445J68O20O3l0k65J02M28L72
1672E94l53p18K31J073m10j514P22L53p3j29Q4J33J99k94j2Q5L7Q05r05m12P65
1693B61K04l46J0K33R5k78o53J90M46j74J69q19p5J189k22m77O70Qj74m75j7L28
1715I3j30L90n44p81Q25J157p52p16O12p4k70k66p40J243L49m4q74p1J066N03
$$ plain form
1735 976 537 -276 -245 -147 454 -232 -623 207 530 38 -405 -505 260 1000 60 -542 -478 -86 352 -508 220
1756 220 633 707 395 117 -209 337 973 -532 -617 -353 -172 194 -262 -60 416 -282 -185 -14 56 518 35
1777 35 -611 -238 249 -124 190 237 171 123 -195 -356 -127 16 204 -491 -970 25 542 -96 -270 -338 590 873
1799 873 -365 -106 608 516 351 -698 -629 471 420 110 -418 -431 510 382 -652 -453 287 625 11 -491
1819 -491 -527 764 596 82 -366 -144 676 123 -801 -196 55 -9 -60 -891 -365 598 302 -381 -344 -201 368
1840 368 343 -555 79 324 189 -284 -204 -10 857 -52 -314 96 209 295 -139 -387 366 220 -413 -378 -260
1861 -260 770 567 -554 -50 323 407 -31 -323 -102 459 -20 -682 -181 462 830 -56 -723 -455 154 51
1881 51 -222 -770 181 495 -102 -647 205 457 761 326 -833 -105 441 216 -625 -611 63 456 -296 -284 26
$$ packed form
1735I76m39q13L1R8O01o86l91Q30L23m92m43j00P65P40r40o02O4L92M38q60P28
1756B20M13P4l12k78l26N46O36j505q5K64J81L66m56K02M76o98R7J71P0M62m83
1777C5o46L73M87l73L14M7o6m8l18j61K29J43J88o95m79R95N17o38j74o8R28K83
1799H73j238K59P14r2j65j049O9J100n1l10n28j3R41j28j034J99P40L38o14n02
1819d91l6J291j68n14m48K22Q20n53r24O05K51o4n1q31N26R63k96o83L7J43N69
1840C68k5q98O34K45j35m73Q0J94Q67r09k62M10J13Q6m34k48P53j46o33L5J18
1861b60J030k03j121N04L73Q4m38k92K21N61m79o62N01O43L68q86o67K68O09j03
1881E1k73n48R51L14n97n45Q52K52L04m35j159P28N46k25q41J4O74L93p52J2L10
$$ plain form
1902 26 521 496 -342 -976 -92 461 183 -457 -290 352 768 -249 -110 260 315 152 -472 -912 308 373 -166
1923 -166 -316 -15 562 -129 -192 -9 381 -415 152 -506 -326 523 351 -329 -371 110 247 -100 -285 -2 -13
1944 -13 -225 -681 -475 56 664 -53 -569 -300 571 455 -73 -458 430 304 -293 -299 -130 475 810 -283 -667
1965 -667 58 493 276 -420 -318 445 104 -547 -471 248 662 397 -604 -586 367 239 153 -656 -341 553 -107
1986 -107 -117 -398 -54 507 42 -715 -602 393 265 -150 -540 -187 457 -181 -296 624 -25 195 -18 -580
2006 -580 -54 550 48 124 -35 192 434 -152 -167 284 382 341 -232 -311 340 550 -440 -94 134 417 -1 -241
2028 -241 112 421 234 -526 -554 -313 909 -103 -482 -240 300 402 -227 -578 115 448 16 -222 -481 -39
2048 -39 530 113 -631 -330 531 483 -105 -751 183 239 21 331 -283 90 686 120 -615 -17 534 451 -373
$$ packed form
1902B6M95k5q38o34Q84N53k78o40J67O42M16j017J39L70N5j63o24m40J220O5n39
1923a66j50L01N77o91o3J83L90p96N67o58J80Q49j72o80m2M81J37l47j85K83j1
1944a3k12m56K06N31O08p17n16K69Q71j16n28l85Q88j26n97oJ69O05L35j093l84
1965f67P25M35k17o96J02P63l41o51P6P19M14k65j001J8R53j28q6q09L15Q94o60
1986a07j0k81L44N61m65p57J13R95j28m15l90L53O44o38j15R20o49K20k13n62
2006e80N26O04n02P6j59K27K42n86j5M51R8m1n73p9O51K10r90L46K28K83m18k40
2028b41L53L09j87p60k8K41J222j012l79K42N40J02o29l51O93L33m32k38k59M42
2048c9N69m17p44L01Q61m8n88o46R34N6k18L10o14L73N96n66p35N98N51q3q24
$$ plain form
2069 -373 -340 337 -14 45 -93 -179 192 278 -479 -703 382 440 205 -148 109 306 174 141 69 -372 235 6
2091 6 -737 -44 686 193 -248 -356 -83 139 -314 -329 195 -172 16 -110 19 286 188 284 -127 -364 167 363
2113 363 -182 -309 129 -48 -204 -445 -416 363 617 94 -513 29 627 244 -375 -103 292 383 247 -14 -491
2134 -491 375 727 -531 -611 -96 558 53 -665 3 -123 -31 251 -473 -256 539 -14 -306 -304 -261 231 -181
2155 -181 -27 -463 -33 -158 -22 -370 -4 379 45 -366 -125 168 282 -45 -362 179 319 -69 263 241
2175 241 -80 69 -62 -363 -65 177 101 -143 -420 -96 224 -46 309 167 82 -24 -339 91 511 425 -195
2196 -195 -460 269 398 -72 -415 254 -141 -164 89 -783 -202 531 115 -297 -426 187 253 -132 -172 -302 14
2217 14 332 -39 -370 305 598 -230 -451 -225 194 299 16 -259 -318 -67 276 -115 -391 186 233 -42 133
$$ packed form
2069c73L3O77l51N9j38q6L71Q6p57k24J085N8k35l53K57J97j32l3p2m41O07k29
2091Fp43O93P30m93m41j08K73K22m53j5N24l67J88j26J29K67r8R6m11k37N31J96
2113C63n45j27M38j77j56k41K9P79K54n23o07N42N98l83o19K72L95R1j36k61m77
2134d91Q66L52j258q0N15O54n05p18O68j26R2K82p24K17P95n53k92KM3M92m12
2155a81J54m36M30j25J36l48L66L83l34m11K41K93J14l27l17N41J40l88L32k2
2175B41l21J49j31l01K98K42p6k44k77L24L20k70L55j42q5j06l15M30M20q6o20
2196a95k65P29J29m70l43O69l95k3K53q72N81P33m16m12j29O13O6l85m0j30L16
2217A4L18l71l31O75K93q28k21K26M19J05k83k75n9K51L43l91k76N77M7k75J75
$$ plain form
2238 133 -179 171 245 -156 -125 -55 -298 -133 -159 9 84 -290 -205 99 82 90 145 -333 -5 -91 -249 176 -67 126
2262 126 102 -219 -252 4 327 86 -559 -422 253 72 -16 -6 154 128 238 -156 -225 365 370 292 -218 -643 181
2285 181 324 -277 6 -315 239 6 -82 -28 458 297 82 -429 -487 299 11 23 136 -3 -72 90 92 115 150
2308 150 220 5 -372 -25 359 21 1 16 -197 100 166 -314 7 185 -266 154 139 26 348 134 -19 -3
2330 -3 -189 63 133 -109 145 -45 -42 73 -42 174 422 88 -32 -132 -174 -242 -230 354 400 158 -195 154 381
2353 381 365 27 -297 -129 300 -181 -103 -146 -98 -123 98 42 -44 267 -103 6 -302 -273 66 145 9 -112 -194
2376 -194 -45 168 -162 72 289 115 85 -751 -118 296 250 290 -96 -7 334 91 -132 111 -115 91 12 184
2398 184 386 127 97 167 -199 16 20 -179 27 9 -83 -237 3 -72 -53 -173 209 238 -233 -133 -201 -212 198 71
$$ packed form
2238A33l12L50P4m01L1P0k43J65k6J68P5l74Q5L04j7QN5m78L28q6j58M25k43J93
2262A26k4l21l3K56L23k41o45J37O75j81q8J0J60k6J10l94o9N90Np8n10m25Q24
2285A81J43o01K83l21N54k33q8N4M86j61k15n11n8P86k88J2J13j39o9J62KK3L5
2308A50P0k15l77L47L84l38k0J5k13K97O6m80L21J78m51M20j5j13L22k14j53J6
2330cj86K52P0k42K54j90LJ15j15K16K48l34j20j00m2o8J2N84M6k42l53L49K27
2353C81j6l38l24J68M29m81P8m3M8k5K21n6q6L11l70J09l08K9L39P9j36j21q2
2376a94J49K13l30K34K17j74l0q36O33M14m6M0l86Q9L41k43k23K43k26K06p9J72
2398A84K02k59l0P0l66K15Mj99K06j8r2j54K40p5J9j20L82K9m71J00o8j1M10j27
$$ plain form
2422 71 -132 -133 -109 75 53 -4 -248 189 21 0 -77 -20 209 303 -276 -136 -150 374 291 -231 -372 349 42 17
2446 17 156 -94 185 187 -327 -153 -176 26 -242 -117 86 -69 246 341 33 -112 -193 -114 -13 -62 -87 108 44
2469 44 -206 23 -37 108 23 -117 -156 -217 -249 142 333 -314 2 306 -139 127 -123 33 206 -69 -189 87
2491 87 -90 236 202 -120 -26 72 -71 -57 26 -224 449 -11 -194 229 68 130 159 -128 -244 268 201 352 -128
2514 -128 -152 -86 7 49 53 95 205 288 -253 -67 -67 -356 40 -236 -70 -129 -7 113 115 -191 -251 66 -192 30 -95
2539 -95 -70 139 -96 -118 -11 -294 203 210 -138 -143 -8 -114 205 -131 138 307 -1 142 100 -157 450 535 18
2562 18 28 -220 7 248 -151 162 36 29 150 202 -183 -25 222 65 53 -143 190 -11 -220 -3 -1 -187 172
2585 172 324 -478 -213 -34 -85 11 -88 182 273 46 -359 -260 60 432 86 -297 -140 -259 8 259 -118 4
$$ packed form
2422G1k03jK4J84k2n7k44M37j68k1p7N7K29R4n79J40j4N24q3n22j41P21l07k5
2446A7J39k50K79Kn14J74k3K02k68J25K03j55L15R5l08j45q1P9J01m9k5J95o4
2469D4k50K29o0J45q5j40l9o1l2L91J91o47L16L04m45K66k50J56J73k75j20K76
2491H7j77L26l4l22R4R8j43J4Q3k50O73m60j83M23j61O2K9k87j16N12o7J51m80
2514a28k4O6R3M2MM2J10Q3n41J86%k89L96k76J66n9J22J20Kl06o0L17k58K22j25
2539i5K5K09k35k2J07k83M97Pl48nJ35j06L19l36K69J69l08J43m2k57O07Q5n17
2562A8J0k48K27K41l99L13j26pJ21N2l85J58K47j57j2j96L33k01k09K17Kj86L59
2585A72J52q02K65J79n1R6r9K70R1k27m05R9L20L72l46l83J57j19K67K51l77J22
$$ plain form
2607 4 -94 -24 125 -280 -469 169 -5 -83 161 71 -66 249 157 156 -102 -239 99 -152 107 274 142 52 47 -16
2631 -16 -162 0 56 -189 7 211 -44 -246 109 13 253 115 -6 -119 -23 -22 151 -47 32 21 65 -196 -2
2654 -2 318 -127 -85 143 -76 7 5 -236 32 71 -120 260 72 36 -34 -80 121 182 173 13 18 263 220 -116 102
2679 102 194 -284 3 70 -310 -29 77 -108 5 112 72 73 -38 263 151 96 -76 -246 -103 371 79 -149
2701 -149 81 183 -65 329 -53 -59 -239 -82 180 -103 47 -63 177 16 -138 237 223 -10 47 66 51 -174
2723 -174 -13 176 -135 507 -14 -120 -132 -65 63 105 175 -5 29 -35 51 -102 -150 121 -94 100 33 67 -51
2746 -51 -37 -187 -98 -208 -184 -146 50 101 2 -68 -126 454 -59 -181 -276 -32 304 66 -174 -33 41 -58 11 2 124
2771 124 -95 -237 95 69 -152 85 142 44 -215 73 17 15 -148 -49 47 59 -120 -198 -480 -78 -20 89 81 -435
$$ packed form
2607Dr8P0J49m05j89O38j74p8K44r0j37L15r2jk58j37L38k51K59J67j32r0no3
2631a6j46J62N6k45J96K04k55k02L55r6K40j38j21j13R6JJ73j98P9j1M4k61J94
2654bL20m45M2K28k19Q3kk41K68L9j91L80j88l6p0m6K01O1rj60NK45m3l36K18
2679A02R2m78K87O7l80K81J06j85J13J07m0Jj11L01j12n5j72j70J43M74k92k28
2701a49K30J02k48L94l82oj80J57K62k83J50j10K40j61j54L75j4k33N7J9j5k25
2723a74J61J89l11O42n21j06j2O7J28M2P0j80L4o4Q6j53m8K71k15J94o7L4j18
2746e1J4j50Q9j10K4L8J96N1r9p0n8N80n13j22r5K44L36k38k40J41P4r9O9rJ22
2771A24k19j42L32k6k21K37N7r8k59K88n6kj63R9R6J2j79p8k82M02N8J09qn16
$$ plain form
2795 -435 150 -25 -132 -267 -23 64 100 12 -64 10 344 210 -252 -133 133 263 235 122 -218 -220 9 -47 24
2818 24 -211 -368 -234 136 76 28 232 78 72 367 -134 -66 -126 141 51 -224 -180 -235 -224 -213 -63 -194 -191 -57 -158
2843 -158 484 113 256 397 -288 49 32 -76 228 76 -2 -140 -29 -297 -76 -381 83 -208 -113 -69 0 143
2865 143 -56 -76 -211 112 -114 139 58 4 -59 119 -207 101 -373 -115 100 -140 -154 -138 166 401 56 -310
2887 -310 -243 -51 -206 -120 37 -194 39 -338 19 40 121 36 -59 -147 -62 163 -24 -60 -11 -66 228 -79 -163 9
2911 9 -17 3 -201 -189 -118 -26 -85 11 152 25 -84 188 -128 -309 -224 -229 72 -256 -15 108 251 160 -41 -213
2935 -213 -244 266 91 -116 -57 337 -137 130 -120 -393 -68 -103 75 35 -71 -138 135 -76 49 100 -145 89
2957 89 75 45 -153 304 289 -44 -134 -35 25 -60 -269 50 138 142 208 -135 56 228 39 60 14 -120 233 2 -85
$$ packed form
2795d35N85j75j07j35K44Q7L6q8p6P4L34j34m62J19K66J30k8j13l40kK29n6P1
2818B4k35j57J34L70o0m8K04j54oK95n01O8o0K67r0k75M4n5J1J1J50j31LJ34j01
2843a58O42l71J43J41o85L37j7j08L04j52p8j38J11k68K21l05M64k91R5M4O9J43
2865A43j99k0j35L23k26K53q1n4o3J78l26L08m74K58K15k40j4J6L04K35l45l66
2887c10O7J92j55Q6J57k31K33l77L57K1Q1q5r5q8Q5K25j87l6M9n5K94l07q4J72
2911Ik6K0k04J2P1R2n9R6J41j27j09K72l16j81Q5nL01l28K41J23J43r1k01j72
2935b13l1N10j75k07N9L94m74K67k50k73L25l5J78m0j06o7K73k11J25N1k45K34
2957H9j4l0j98M57j5l33r0R9O0q5k09L19Q8MO6l43J91J72j89K1m6j34L53k31q7
$$ plain form
2982 -85 120 191 139 213 -48 -73 102 -229 48 55 -108 15 -22 121 212 -36 -56 34 161 -76 -135 163 -15 -349
3006 -349 -114 -147 -162 -17 -205 28 45 1 -45 101 235 -66 -4 89 -73 -75 -73 -65 -55 -295 -154 1 70 190 -14
3031 -14 -27 -41 117 -68 -22 -42 41 104 99 -56 53 -54 294 73 -292 -33 211 225 -112 12 93 219 90 -285
3055 -285 11 83 59 329 100 38 -109 36 249 -79 215 -131 -65 208 -132 -85 -2 -340 -231 -138 -28 -134
3077 -134 187 -88 36 -132 -69 125 156 -138 84 -203 75 -170 112 83 -72 2 -175 34 37 119 15 -157
3099 -157 -200 18 -29 316 -32 204 275 66 -126 -38 257 5 -299 -86 -131 380 52 232 -195 -308 -46 -113
3121 -113 274 -5 205 135 191 -104 52 -81 81 417 107 -226 -95 103 -3 -12 -140 -179 -185 -28 31 39 99 44
3145 44 27 277 -463 36 78 181 213 220 230 -1 -19 -175 -61 233 248 -81 -302 114 -149 103 86 -91 -66 -11
$$ packed form
2982h5K05P1n2P4k61k5J75l31K77Pj63J23l7J43R1k48k0R0J27k37n9K98j78l34
3006c49K35l3j5J45j88K33J7m4m6J46J34l01O2R3j62kKQJ0k40J41J55O9J20k04
3031a4j3j4J58j85M6k0Q3O3nj55J09j07L48k21l65K59K44J4l37J24Q1J26j29l75
3055b85K96P2k4K70k29o2j47J45K13l28K94l46O6K73l40M7Q3l38J09R3J10j06
3077a34L21k75J24j68O3J94L1k94K22k87K78k45K82k9j55P4j77K09LQ2j04j72
3099a57m3K18m7L45l48K36P1k09j92Q8K95k52l04K13m5N11l28J80m27j13K62o7
3121a13L87k79K10p0N6k95J56j33J62L36l10l33J31J98j06rj28l9oJ57N9QO0n5
3145D4j7K50p40M99M2J03L2PJ0k31j8j56J14K94J5l29k21M16k63K52j7j77K5N5
$$ plain form
3169 -11 -86 350 262 -234 379 184 -366 -133 -24 87 -200 -191 -178 -168 -187 -135 165 -212 -5 76 303 -23 -173
3192 -173 214 -148 -91 -438 -155 -52 5 205 70 -52 96 18 -319 282 -82 239 91 129 112 -170 203 14
3214 14 -109 188 281 -35 81 -86 50 54 85 80 82 136 164 152 198 19 203 167 -199 43 129 -53 103 44 -154
3239 -154 -121 9 -260 80 158 -26 30 -75 -77 -62 208 46 -36 -62 -241 4 -135 -243 -113 -146 64 -76 -89
3262 -89 109 227 -163 -191 -302 -167 55 114 199 -33 81 191 22 -198 -63 29 -250 -53 195 -64 -117 224
3284 224 219 -29 -52 -218 155 -46 -309 -36 -190 -50 60 103 118 46 122 221 12 -188 286 -135 -40 -29 -83 355
3308 355 -115 198 11 -76 -49 87 -164 -144 41 98 -336 129 303 -246 77 83 -80 -37 -77 318 119 139 99
3331 99 -6 46 -130 -67 52 200 -118 86 -206 56 118 72 60 -340 -121 -146 -110 66 30 -145 41 -149 -26
$$ packed form
3169a1p5M36q8m96O13j95n50K33J09J11k87RJ3J0j9N2L00l77K07Q1K27l26j50
3192a73L87l62N7l47K83J03N7K00j35j22J48p8l37O01l64L21j48L8j7k82L73j89
3214A4j23K97R3l16J16j67J36ML1nKN4K8j2M6j79J84l6l66K42Q6j82J56n9j98
3239a54L3J30k69L40P8j84N6j05kJ5K70j62q2k6j79K45j39j08J30l3K10j40j3
3262h9J98J18l90k8j11J35K22N9Q5k32J14J10j69k20J35R2k79J97K48k59n3L41
3284B24nk48k3j66L73k01k63K73j54J40J10M3J5p2P6R9k09k00M74m21R5J1n4M38
3308C55m70L13j87q7K7J36k51K0J85N7m34M65J74n49L23Oj63M3m0L95j99K0m0
3331I9j05N2j76O3J19J48l18K04k92K62O2m6j2m00K19k5L6J76l6j75J86j90J23
$$ plain form
3354 -26 207 249 -64 234 -164 43 -99 179 -37 94 -11 -16 -138 -249 124 -38 -84 -2 -143 -118 105 -184
3376 -184 149 94 13 98 201 -58 -48 199 -138 28 -35 -104 207 144 102 55 154 -69 -10 52 191 112 -3 131
3400 131 -323 -69 200 -167 -118 134 -90 96 -117 59 -51 -58 -74 -15 128 -26 13 4 113 -50 70 131 77
3423 77 225 118 251 -52 73 61 7 70 -118 -13 152 -19 165 -13 191 85 39 10 216 -160 -141 127
3445 127 74 88 -74 68 -35 38 282 -188 176 -48 -119 22 -85 -221 -20 -16 143 169 -21 127 -212 147
$$ packed form
3354b6K33M2l13K98l98K07j42K78k16J31j05nj22j11L73j62m6Q2j41K5K23k89
3376a84L33n5q1Q5J03k59J0K47l37J66o3o9L11o3m2m7R9k23N9O2J39p9j15J34
3400A31m54K54K69l67M9K52k24J86k13J76j10pj6N9J43j54L9rJ09j63J20O1n4
3423G7J48j07J33l03J25j2n4O3j88J05J65j71J84j78K04j06m6k9K06l76J9K68
3445A27n3J4j62J42j03P3K44m70L64k24p1J41j07j36K01MJ59K6j90J48l39L59
$$ [...]
8191c00
##END NTUPLES=NMR FID
##END=
