##TITLE=1H_DE-168_oil_TFAd6
 200.13Hz, DMSO.
 8 sc
 28.7.2026
##JCAMPDX= 6.0         $$ Bruker NMR JCAMP-DX V2.0
##DATA TYPE= NMR FID
##DATA CLASS= NTUPLES
##ORIGIN= UXNMR, Bruker Analytische Messtechnik GmbH
##OWNER= pz
$$ XWIN-NMR		Version 3.5
$$ Tue Jul 28 14:37:25 2026 Russian Standard Time (UT+4h)  she@DPX200
##.OBSERVE FREQUENCY= 200.1313
##.OBSERVE NUCLEUS= ^1H
##.DELAY= (6, 6)
##.ACQUISITION MODE= SIMULTANEOUS
##.ACQUISITION SCHEME= undefined
##.AVERAGES= 8
##.DIGITISER RES= 18
##SPECTROMETER/DATA SYSTEM= spect
##.PULSE SEQUENCE= zg30
##.SOLVENT NAME= DMSO
##.SHIFT REFERENCE= (INTERNAL, DMSO, 0, 14.3821)
##AUDIT TRAIL= $$ (NUMBER, WHEN, WHO, WHERE, WHAT)
$$ ##TITLE= Audit trail, XWIN-NMR		Version 3.5
$$ ##JCAMPDX= 5.01
$$ ##ORIGIN= Bruker BioSpin GmbH
$$ ##OWNER= she
$$ F:/spectra/data/she/nmr/H-C/1/audita.txt
$$ ##AUDIT TRAIL=  $$ (NUMBER, WHEN, WHO, WHERE, WHAT)
(   1,<2026-07-28 14:36:00.23 +0400>,<she>,<DPX200>,
      <created by zg, POWCHK disabled, PULCHK disabled
       configuration hash MD5:
       00 E9 B6 7A A2 85 ED C7 34 08 36 98 17 FE 4E 26
       data hash MD5: 16K
       EF 53 4F 23 14 87 11 09 3F EF 2A 5D 7D 98 F4 95>)
$$ ##END=
$$ 
$$ hash MD5
$$ 57 63 42 7E 17 6A 5D 96 6B 6B A8 64 01 FA 9E F1
##$RELAX= 
##$RELAX= 
##$RELAX= 
##$RELAX= 
##$RELAX= 
##$RELAX= 
$$ Bruker specific parameters
$$ --------------------------
##$DU= <F:/spectra>
##$EXPNO= 1
##$NAME= <H-C>
##$PROCNO= 1
##$TYPE= <nmr>
##$USER= <she>
##$AMP= (0..31)
100 100 100 100 100 100 100 100 100 100 100 100 100 100 100 100 100 100 
100 100 100 100 100 100 100 100 100 100 100 100 100 100 
##$AQSEQ= 0
##$AQ_mod= 1
##$AUNM= <au_zg>
##$AUTOPOS= <>
##$BF1= 200.13
##$BF2= 200.13
##$BF3= 200.13
##$BF4= 200.13
##$BF5= 200.13
##$BF6= 200.13
##$BF7= 200.13
##$BF8= 200.13
##$BYTORDA= 1
##$CFDGTYP= 0
##$CFRGTYP= 5
##$CHEMSTR= <none>
##$CNST= (0..31)
1 1 145 1 1 1 1 1 1 1 1 1 1 1 1 1 1 1 1 1 1 1 1 1 1 1 1 1 1 1 1 1 
##$CPDPRG= <>
##$CPDPRG1= <>
##$CPDPRG2= <>
##$CPDPRG3= <>
##$CPDPRG4= <mlev>
##$CPDPRG5= <mlev>
##$CPDPRG6= <mlev>
##$CPDPRG7= <mlev>
##$CPDPRG8= <mlev>
##$CPDPRGB= <>
##$CPDPRGT= <>
##$D= (0..31)
0 0.7 0 0 0 0 0 0 0 0 0 0.03 0 0 0 0 0 0 0 0 0 0 0 0 0 0 0 0 0 0 0 0 
##$DATE= 1785234959
##$DBL= (0..7)
120 120 120 120 120 120 120 120 
##$DBP= (0..7)
150 150 150 150 150 150 150 150 
##$DBP07= 0
##$DBPNAM0= <>
##$DBPNAM1= <>
##$DBPNAM2= <>
##$DBPNAM3= <>
##$DBPNAM4= <>
##$DBPNAM5= <>
##$DBPNAM6= <>
##$DBPNAM7= <>
##$DBPOAL= (0..7)
0.5 0.5 0.5 0.5 0.5 0.5 0.5 0.5 
##$DBPOFFS= (0..7)
0 0 0 0 0 0 0 0 
##$DE= 6
##$DECBNUC= <off>
##$DECIM= 32
##$DECNUC= <off>
##$DECSTAT= 4
##$DIGMOD= 1
##$DIGTYP= 9
##$DL= (0..7)
0 120 120 120 120 120 120 120 
##$DP= (0..7)
150 150 150 150 150 150 150 150 
##$DP07= 0
##$DPNAME0= <>
##$DPNAME1= <>
##$DPNAME2= <>
##$DPNAME3= <>
##$DPNAME4= <>
##$DPNAME5= <>
##$DPNAME6= <>
##$DPNAME7= <>
##$DPOAL= (0..7)
0.5 0.5 0.5 0.5 0.5 0.5 0.5 0.5 
##$DPOFFS= (0..7)
0 0 0 0 0 0 0 0 
##$DQDMODE= 0
##$DR= 18
##$DS= 0
##$DSLIST= <SSSSSSSSSSSSSSS>
$$ [...]
##$SUBNAM0= <"">
##$SUBNAM1= <"">
##$SUBNAM2= <"">
##$SUBNAM3= <"">
##$SUBNAM4= <"">
##$SUBNAM5= <"">
##$SUBNAM6= <"">
##$SUBNAM7= <"">
##$SUBNAM8= <"">
##$SUBNAM9= <"">
##$SW= 18.0517328524113
##$SWIBOX= (0..15)
0 0 2 0 0 0 0 0 0 0 0 0 0 0 0 0 
##$SW_h= 3612.71676300578
##$TD= 16384
##$TD0= 1
##$TE= 0
##$TE2= 300
##$TE3= 300
##$TEG= 300
##$TL= (0..7)
0 120 120 120 120 120 120 120 
##$TP= (0..7)
150 150 150 150 150 150 150 150 
##$TP07= 0
##$TPNAME0= <>
##$TPNAME1= <>
##$TPNAME2= <>
##$TPNAME3= <>
##$TPNAME4= <>
##$TPNAME5= <>
##$TPNAME6= <>
##$TPNAME7= <>
##$TPOAL= (0..7)
0.5 0.5 0.5 0.5 0.5 0.5 0.5 0.5 
##$TPOFFS= (0..7)
0 0 0 0 0 0 0 0 
##$TUNHIN= 0
##$TUNHOUT= 0
##$TUNXOUT= 0
##$USERA1= <user>
##$USERA2= <user>
##$USERA3= <user>
##$USERA4= <user>
##$USERA5= <user>
##$V9= 5
##$VALIST= <valist>
##$VCLIST= <CCCCCCCCCCCCCCC>
##$VD= 0
##$VDLIST= <DDDDDDDDDDDDDDD>
##$VPLIST= <PPPPPPPPPPPPPPP>
##$VTLIST= <TTTTTTTTTTTTTTT>
##$WBST= 1024
##$WBSW= 4
##$XGAIN= (0..3)
0 0 0 0 
##$XL= 0
##$YL= 0
##$YMAX_a= 320760
##$YMIN_a= -203994
##$ZGOPTNS= <>
##$ZL1= 120
##$ZL2= 120
##$ZL3= 120
##$ZL4= 120
##$ABSF1= 10
##$ABSF2= 0
##$ABSG= 5
##$ABSL= 3
##$ALPHA= 0
##$AQORDER= 0
##$ASSFAC= 0
##$ASSFACI= 0
##$ASSFACX= 0
##$ASSWID= 0
##$AUNMP= <proc_1d>
##$AZFE= 0.1
##$AZFW= 0.1
##$BCFW= 1
##$BC_mod= 2
##$BYTORDP= 1
##$COROFFS= 0
##$CY= -3
##$DATMOD= 1
##$DC= 2
##$DFILT= <>
##$DTYPP= 0
##$F1P= 0
##$F2P= 0
##$FCOR= 0.5
##$FTSIZE= 0
##$FT_mod= 4
##$GAMMA= 1
##$GB= 0.15
##$INTBC= 1
##$INTSCL= 1
##$ISEN= 128
##$LB= 0.25
##$LEV0= 0
##$LPBIN= 0
##$MAXI= 10000
##$MC2= 0
##$MEAN= 0
##$ME_mod= 0
##$MI= 1.114404
##$NCOEF= 0
##$NC_proc= 0
##$NLEV= 6
##$NOISF1= 3.799351
##$NOISF2= 2.8
##$NSP= 1
##$NTH_PI= 0
##$NZP= 0
##$OFFSET= 14.38212
##$PC= 1
##$PHC0= -4227.445
##$PHC1= 20.5923
##$PH_mod= 1
##$PKNL= yes
##$PPARMOD= 0
##$PSCAL= 0
##$PSIGN= 0
##$REVERSE= no
##$SF= 200.129724274929
##$SI= 16384
##$SIGF1= 3
##$SIGF2= 2
##$SINO= 400
##$SIOLD= 16384
##$SREGLST= <1H.CDCl3>
##$SSB= 0
##$STSI= 0
##$STSR= 0
##$SW_p= 3205.1282051282
##$SYMM= 0
##$S_DEV= 0
##$TDeff= 0
##$TDoff= 0
##$TI= <>
##$TILT= no
##$TM1= 0
##$TM2= 0
##$TOPLEV= 0
##$USERP1= <user>
##$USERP2= <user>
##$USERP3= <user>
##$USERP4= <user>
##$USERP5= <user>
##$WDW= 1
##$XDIM= 8192
##$YMAX_p= 0
##$YMIN_p= 0
$$ End of Bruker specific parameters
$$ ---------------------------------
##NTUPLES= NMR FID
##VAR_NAME=  TIME,          FID/REAL,        FID/IMAG
##SYMBOL=    X,             R,               I
##VAR_TYPE=  INDEPENDENT,   DEPENDENT,       DEPENDENT
##VAR_FORM=  AFFN,          ASDF,            ASDF
##VAR_DIM=   8192,          8192,            8192
##UNITS=     SECONDS,       ARBITRARY UNITS, ARBITRARY UNITS
##FACTOR=    0.0002768,     1,               1
##FIRST=     0,             0,               0
##LAST=      2.2672688,     0,               0
##MIN=       0,             -203994,         0
##MAX=       2.2672688,     320760,          0
$$ Real data points
##PAGE= N=1
##DATA TABLE= (X++(R..R)), XYDATA
0@%%%%%%%%%%%%%%%qJ6j6J6j6K4l2L2m0M8n5O7p6Q8j02J16j32J53j76J98k25K53
37A33k84L20l57L97m42M93n49O08o71P40q16R01r94J094j207J329j462J614j781
56i34J970k186K430k712L045l440L917m514N279o298P732r915J3730l1440J61551
71A38215q8623j25346K28168L0643j37144M5198O6588j06091j2793L6850r4603
82a8938n5184P3111l9413p2254M7656R416n0572N0719M1759k0994L2150M5417
94D2873j0867N466K1736M196P522m645l8730j2157O042m6020l5124L4961p908
107c2655m1959L8259K7603l1459L4031L6635m2373R178N3839l0573k7057N3704
119D7173J056n5025J8696K4699n5308o780M4609m1045l6273N3132M241m4288K6610
$$ plain form
0 0 0 0 0 0 0 0 0 0 0 0 0 0 0 0 0 -8 8 -8 8 -8 16 -16 16 -24 24 -31 36 -40 48 -54 62 -70 83 -93 105 -120 133
37 133 -151 169 -188 209 -233 260 -289 319 -352 388 -428 473 -521 573 -634 695 -767 847 -934
56 -934 1036 -1150 1280 -1432 1613 -1827 2090 -2424 2855 -3443 4289 -5626 8104 -23336 138215
71 138215 49592 -75754 152414 183057 45913 91111 157699 51608 38815 75665 -18938
82 -18938 -74122 -1011 -40424 -112678 -65022 -55606 -106178 -55459 -13700 -34694 -2544 42873
94 42873 32006 37472 59208 63404 70926 66281 27551 15394 21436 -24584 -59708 -24747 -32655
107 -32655 -74614 -36355 -8752 -40211 -6180 30455 -11918 -2740 51099 20526 -6531 47173
119 47173 48229 -6796 11900 36599 -18709 -25489 19120 -21925 -58198 -5066 -825 -45113 -18503
132a8503L3171k1669J000K8253m459p103J8167n449k3672P178M443k1616K88J0786
146H15j1423l375Q046k148M06P99K15Q099K21o324J0315J2119p865n239Q968k487
162A1142j4253N262M585j7286J102J2137j4316n181J7887l142q835J3608K528
175E238j0306Q989J0702j2586n378J5081m673j5452J0464O553j3930O66P090q053
189e595j572N332k736j587N501P33k579M784N833m534k865M963j644l827J556
204A763q38j326O85k794q84K026j528M64J616j693J43K476K030p75n75J725J49
221B664j584J392r89j630K618j718m900J501J876p06p46l87O64J794O76m23p22
238f20J838K167l729q81L832j12j531K88o35p06m29j267Q13K83p27j80J59J657
$$ plain form
132 -18503 14668 -7001 -6001 22252 17793 10690 28857 23408 -264 6914 11357 -10259 -9971 815
146 815 -10608 -13983 -5937 -8085 -7679 -6880 -6665 1434 1655 -4669 5646 17765 9900 4661 13629 11142
162 11142 -3111 2151 6736 -10550 -9448 2689 -11627 -16808 1079 -2063 -10898 2710 5238
175 5238 -5068 3921 14623 2037 -3341 11740 7067 -8385 2079 8632 -5298 -4632 2458 -5595
189 -5595 -7167 -1835 -4571 -6158 -657 76 -2503 2281 8114 3580 715 5678 4034 207 1763
204 1763 925 -401 284 -2510 -3394 -1368 -2896 -2432 -816 -2509 -2366 110 2140 1365 790 2515 2664
221 2664 1080 2472 1483 -147 2471 753 -4147 -2646 -770 -1476 -2222 -2609 -1945 -151 525 102 -620
238 -620 1218 3385 -344 -1225 2607 2495 964 1252 617 -89 -518 -1785 -972 -689 -1416 -1596 -1437 220
256B20M36j108J592J185j998j2J340rn07r27n64L54n33j85P7j72R59q41j222K057
276A42k7j639J113J056l72m88P59J431k38j277k03p7l39K13j506K59J491n01j188
295a391P33K48P52K99q40K78M59n1L29m61R1M33p45K20J61l59M3P5p27j17l89
316i59L80O33k75q80J143N51j9m99K31O25o63n37K68l90N21L74j033l00J150j113
336g92J31K82J47m65J25M66M18k4k77M27l77J51L88l90N43r3r02Q8j09J3p7K80
358d7o0O1j82L87j63l11O45j20k99m6j84O37K64m29j13k50J52N9J45l52J5O2j45
381b74l13K43K85M36l67r6j07J94J61N44q48P7L81l79l5j2L21m2l84K71j15K27
403A68o6K0l25R3J98r4P9K70k03J92p4%l05M8K67o35M54r3k66l7J73k72K82k08
$$ plain form
256 220 656 -452 1140 2325 327 315 1655 1646 1139 212 -352 2 -531 -716 -639 -811 148 -693 -1915 142
276 142 115 -1524 -411 645 273 -215 544 1975 1737 460 257 180 -159 54 -1452 -1193 298 -203 -1391
295 -1391 -658 -410 342 641 -199 79 538 487 816 355 446 879 134 354 515 156 199 274 -453 -570 -959
316 -959 -579 54 -221 -1101 42 593 574 75 306 931 268 -269 -1 -391 130 504 -529 -829 321 -792
336 -792 -661 -379 -232 -697 -572 -106 312 288 11 438 61 212 600 210 753 660 -242 -154 -263 -250 -327 -47
358 -47 -107 -46 -228 159 -4 -315 330 210 -89 -135 -319 318 582 153 40 -210 -58 1 146 -206 -191 -129 -274
381 -274 -587 -344 -59 377 10 -86 -193 1 162 706 -142 -65 316 -63 -98 -110 211 169 -215 56 -59 168
403 168 102 122 -203 -110 88 -6 73 343 140 332 258 258 -47 1 268 -367 87 -6 -272 -309 -136 -408 -126 -334
427c34L74J20j32p7J20l6k50N0L86j72M7k63K98o8m98N30O6o31N03k97K1L33k24
450a34j91M06J41k92k82N18K53l58l92L80r7j9l3M1J79o6k39N9N3j63J46oJ34
473C8k30j82K88J58j12P8q2p5L10j8o10M75j45j16J70j62K55q9j77L36J44j44
495A10j23ML6Ok20J62K44j21J76l4o6k14K4R1J35j77J49k45j07R7K2R1J93r7j13
520B3m0j58M75j34K8k46KJ77N7l95L36j5j69J88K67o70k2K54j21L64k94L86l78
543h5j11K84L6l18K88j14r2J58k17J82j61K22k66J99n7J41k57p9L53m6j80P4L7
566iL14j72L6k70K08k77J98J38k63M8o8K89j96o1Q1J42o5l44K79J61l68L56o6
589I1j5j75K12O5J60k24m02L40qL0k13J06K44l04K19n1k0K6OO7l9j78O6k7j35
$$ plain form
427 -334 40 160 28 -49 71 35 -215 -165 221 49 96 -167 131 63 -435 95 161 -470 33 -264 -243 90 -134
450 -134 -325 81 222 -70 -352 166 419 61 -331 49 -48 -67 -100 -59 120 54 -185 -126 -73 -236 -90 -96 38
473 38 -192 -374 -86 72 -40 38 -44 -119 191 173 -437 38 -107 -223 -53 -215 40 -49 -226 110 254 110
495 110 -13 -9 27 33 -187 -25 219 98 274 240 174 -40 -16 75 210 33 182 -63 -170 -73 -51 40 233 136 23
520 23 -17 -175 300 166 194 -52 -50 127 184 -211 125 110 -59 129 396 -274 -296 -42 -163 201 -93 293 -85
543 -85 -196 88 124 -194 94 -20 -112 46 -171 11 -150 72 -194 5 -52 89 -168 -247 106 60 -120 -46 -9
566 -9 305 133 169 -101 107 -170 28 166 -97 -49 -117 172 -24 -85 -4 138 73 -271 8 169 -199 157 91
589 91 76 -99 113 178 338 114 -288 52 44 74 -139 -33 211 -93 126 75 55 81 87 154 115 -63 3 -24 -159
614a59QJ43K58k34j19K89k42q6J60J82k72K1J49j73j87L2J09lP0J81j31k75J40
637a39J24l4J04j65K25m37K77j9K39j98J42k30K24J90m71N3K68o8O0k78m7K38
659E8j19Q2K37k83O2k58J54k34L70K9k85N70j83l29J49K59k31j82k05L62J30j6
681A37J14q2k81J09j66L26j98M6J40j38K6q3P9M9Jl62K76J11lk36K07q8l1K32
705A85J5m5l48J04J59l48K02K97m72L00j21R2j94J5L05J8j10o9L3j77K97l66M08
728A80j42j73J62k51J86J48k01J8o8J11Ql9L8m4J51j71J23j95J15o5P9q9K66p4
752G3J46O6l63l6J61m4o4m4L3j1P9J03j50L9o0j42Q2j56M26r8m2P9j48M3mJ70
778A38k85K0K5J91m6L8J40j87K04j60J14k60J07o0r3M13l6K5j04j03J82l41J32
$$ plain form
614 -159 -151 -8 250 16 -103 186 -56 -142 18 200 -72 -51 98 -75 -262 -230 -121 -124 -54 127 -4 -279 -139
637 -139 -15 -49 55 -110 115 -322 -45 -64 175 -23 119 -111 113 303 -168 -115 153 85 145 -133 -180 58
659 58 -61 21 258 -25 37 -221 -67 -301 69 98 -187 383 200 -129 20 279 48 -134 -339 23 153 137
681 137 251 169 -112 -3 -169 157 -41 5 145 7 33 -50 29 78 79 -283 -7 104 101 -135 72 -16 -47 185
705 185 200 155 -193 -89 70 -278 -76 221 -251 49 -72 20 -174 -159 146 164 54 -15 18 -159 138 -228 180
728 180 38 -135 27 -224 -38 110 -91 -73 -141 -30 -22 -61 -23 -67 84 -87 36 -159 -44 -109 -30 -119 147 73
752 73 219 285 -78 -114 47 3 -61 -105 -72 -83 -4 99 -51 -12 -72 -214 -132 -288 138 40 -2 77 -71 -28 -32 138
778 138 -147 -127 -102 89 43 81 221 34 238 78 192 -68 39 -21 -114 299 263 288 184 81 263 -78 54
801E4J54k38r1rj60K62K80k58j39K20J13j91L8J08J04k60n8N6o7k63N79k09J63
824A88l72J71K10k45RJ40l12J36J70k43L85m23J40o0K28mk25Jm4l4K18j3j65R
848a35L09k21J43K9K18l89L0K20m76M33o2l05J76j77K53J59j45M2j21k2pJ31O5
871A48j86j14J48J8mJ20l60L59k79K05jn2l03n6K70J88j56%r4K44j60M8j74q1
895b72L78J23jk65l5J40j19J26m8j21J85n3l37K89nK06l77K59J32l01L41l60L5
918h0J16k47J54n5K67K1L8j68J73l79K83j8j19K05k19jJ89o3j67j71K76j76J76
941C5p3J42k70K01o7j20K72j36j12K36j55P1r0j92L97k85kj0j8N1O3l1j96K06
965h3J59K0P1r3J26k57j34O20m11k1K6m2p5J72k10J95oq4K2K7o8N3J29J3k5L4
$$ plain form
801 54 208 -30 -121 -130 -290 -28 252 -6 -145 75 188 -3 35 143 247 -13 -71 -15 -82 -345 234 25 188
824 188 -184 -13 197 -48 -39 101 -211 -75 95 -148 237 -186 -46 -106 122 118 -107 -106 -150 -184 34 21 -144 -135
848 -135 174 -47 96 125 343 -46 -16 204 -272 161 99 -206 -30 -207 46 205 60 102 -19 -41 -48 83 148
871 148 -38 -152 -4 14 10 130 -230 129 -150 55 54 2 -301 -357 -87 101 -55 -55 -149 95 -65 -17 -191 -272
895 -272 106 229 228 -37 -72 68 -51 75 27 -94 91 38 -299 -10 -15 191 -186 73 205 -96 245 -115 -80
918 -80 36 -211 -57 -112 155 176 214 46 219 -160 123 105 -14 191 -28 -29 160 97 -70 -241 35 -141 35
941 35 -38 104 -166 35 -32 -152 120 -16 -128 108 -47 24 -66 -258 139 -146 -148 -158 -176 -125 -62 -93 -289 -83
965 -83 76 96 167 74 200 -57 -191 429 18 -3 23 -19 -94 78 -132 63 57 -27 -5 22 -46 7 136 149 124 158
991A58j48l00M0J57Q8J60j64j25K96k09J56q4J57k11L16K3q5m12O6K42k85J21
1013d3K1M75p05L41o7j53J61j80J39j08n0J34QJ34j33J15QJ32l40K46k19n8P9
1036f3K67p6j32L87l01Pk44J29j1K5K08j36J70j40l47K84K44l68NK85k29j03p6
1059b15L54j26L8R2p8L2m9n7J27n5J23j30j67J15N5j75O4M1j49K30M4j37l1k55
1083c09L1L83k20J74J12j94Q3P3r7k63L10k20K04N4l15M59k04N4P9j0m12P5O4
1106h9L15l55j20L88L4o8pl3M9k30j64P6m7K01M3J37j1k40J86L2o1k6J71k77L9
1131e7J13jJ96l35J22j86j8K19j7p0J18j50K49l03L04m43L42r3J0M8k5r9J27j63
1155a12R2l1K0r2K13k74J76K42j74J4Q5j6k23J13K3P2k96L3L69k31j99L33j56
$$ plain form
991 158 10 -290 -250 -93 -5 155 -9 -134 162 -47 109 25 182 -29 287 310 225 -187 -121 121 -164 -43
1013 -43 -22 453 -252 89 22 -131 30 -150 -11 -119 -169 -35 -27 107 -26 89 97 229 -111 135 -84 -142 -63
1036 -63 204 128 -4 383 82 89 -155 -26 -37 -12 196 60 230 90 -257 27 271 -97 -92 193 -36 -139 -215
1059 -215 139 13 51 143 65 97 48 -9 118 63 186 56 -111 4 59 -116 -52 -11 -160 70 114 -23 -54 -309
1083 -309 -278 105 -115 59 171 -23 60 133 36 -227 83 -137 67 121 -194 265 61 115 194 184 -228 -153 -89
1106 -89 226 -129 -249 139 173 105 98 65 114 -116 -280 -204 -251 -50 -7 130 119 -121 65 97 36 10 181 -96 -57
1131 -57 56 55 251 -84 38 -148 -166 53 36 -34 84 -66 183 -120 184 -259 83 -10 0 48 23 -76 51 -112
1155 -112 -20 -51 -31 -123 90 -184 -8 234 60 74 159 143 -80 33 56 128 -168 -135 234 3 -196 137 -19
1178a9rm2K02J59k18l51K82L27l85j6J48j67L8Q1L8l9Jq3K26n2j01k28n0K17J42
1203A01j55n3J23n4l73L9K50L6j86O01l49r0K06j55J0L19k13j18K7j63J40J60
1225A03K08m73L32l76n9K09J48k09J33j25K52l33L00M0q8k3j83L03k96J95o9L31
1247C20j37j28J95k95J34rRj98J87j68l3M72n75M77mm05J54OJ41r8L69l18kJ70
1271B64m3j94n0N6j72K12j11J09j36J08J04j56k48L40K8m15M49J00m89J78J4O6
1293A4N1K20k60j54K56k07j43K33k82J76O0J95k48K35l4k41J71J30k13M0r7O9
1315b9k2j03K8M6L51k65l16L20M2Q2M1j47j38K56k50M3K23j44p9J55k61j02L97
1338A28l10k1M46l52K6K36N2j96Q9j21k46J72K49k53O8K6n34O48n8o3O5j56J4
$$ plain form
1178 -19 -28 -70 132 291 73 -278 4 331 -54 -70 78 -89 -51 30 68 29 30 -53 173 121 20 -208 -258 -41 101
1203 101 -54 -107 16 -38 -411 -372 -122 -86 -272 329 -20 -110 96 -59 -49 270 57 -61 -34 -197 -57 103
1225 103 311 -162 170 -206 -265 -56 92 -117 16 -109 143 -190 110 150 62 39 -144 159 -137 58 -11 320
1247 320 183 55 250 -45 89 80 89 -109 78 -90 -123 349 -226 251 247 -158 -4 2 143 45 414 96 94 264
1271 264 221 27 -23 33 -139 73 -38 71 -65 43 147 -9 -257 83 111 -304 145 245 -244 -66 -52 14
1293 14 65 285 25 -129 127 -80 -223 10 -272 -96 -36 159 -89 146 112 -129 42 172 -41 -1 -98 -29
1315 -29 -51 -154 -126 -80 271 6 -310 10 52 134 175 28 -110 146 -104 -61 162 18 -61 94 -167 -269 128
1338 128 -182 -203 243 -109 -83 153 205 9 98 -23 -269 -97 152 -101 -33 -7 -541 107 49 -14 51 -105 -91
1361i1j72L05j05Ko5K03L4j67k6Q7r3K27l32J73K39O3m12M5Lj41J96R3k04L46
1385B08k71r0O5L09j73q5l8j15J91j00J61R2o2j03O3k56K55ln9L56k57N6r3p8
1409b7p2QK06R3l89N4n8J60%n0L45l95L31k31J43j02O6k40N5J54k78L77l18J36
1433c2J70j4k26N0q3J59j2k90L42J10R7j56j47j15K29r4Q8q2J19K3m6j8k71L79
1457A80j47j37J55n7r7M0L1O6l1J22j65N0j07L89k24j48j6r9J48J56j3k02j13
1480b19L18l4m2J36k58K36pK01n32L17m90M14k70K56k53J73J42Q5j75Mk46J31
1502a13P5K27q5j68J38N5R0K79K1j072L62O6J31k88M00j98J38k6n0K30jj20l55
1525b64J90L45k86L2J0Q6k03J97j63j92L26r6j9J97m87K01L07l12P2J57l71K20
$$ plain form
1361 -91 -263 42 -63 -61 -126 77 111 -56 -82 5 -88 139 -193 -20 219 282 -130 -85 -82 -223 -27 66 -138 208
1385 208 -63 -153 -88 221 48 -37 -75 -190 1 -99 62 154 92 -11 52 -204 51 48 -11 345 88 144 51 -27
1409 -27 -99 -91 115 208 -181 -127 -185 -25 -25 -75 270 -125 206 -25 118 16 82 -158 -103 51 -227 150 -168 -32
1433 -32 138 124 -102 -52 -135 24 12 -278 64 174 271 115 -32 -147 82 -12 76 -6 113 136 90 72 -199 180
1457 180 33 -104 51 -6 -103 -63 -32 34 3 125 -40 10 -97 292 68 -80 -96 -195 -47 109 96 -106 -219
1480 -219 99 65 23 159 -99 137 130 331 -201 116 -374 40 -230 26 -227 -54 88 173 -2 2 -244 -113
1502 -113 -38 189 104 -64 74 129 219 498 519 -553 -191 -125 6 -282 118 -80 58 32 -18 212 211 91 -264
1525 -264 -74 271 -15 17 27 113 -90 107 -56 -248 78 -18 -37 160 -327 -126 181 -131 -59 98 -273 -53
1547e3j80L2L32j63o1n6L47k84J6P9R8m8kro4j72J7K98l22K9L7K02l16O9j07K91
1573A0Rk23K28J33n7j26R9l9N2k90K02Lo1JJ34k69J77M1m9j5p1M93l61k7N8o3
1599a1m7N4P5r2K24l9j17j68N8J09J00j44k87K23J45l14K64n7J73r9j57oJ17l3
1623b9NJ12l8m2lq7J02m9K5l3o0R1K9K38J8j76j88p0K3J32k9M9l1M1J6k39L43
1650A50j53J86N1j59k47L46l76m2K64J1N6l58K61p2l7J08J93l13jj93K60P0l92
1673c87O12k64J10l88P9L00J75j86j90O2M58n63j53o8K86K33J57r4j58j25l6K52
1695A12m50L05O9J9o0J95k66k1K57p1r5o1Q6K73k54qj85RL24l68Q0L52J24l04
1719F2k13J46m9J50j53J12j2k00L47j72L76j97N08l04r2o01N03m03O18p18J19
$$ plain form
1547 -53 -233 -201 131 -32 -93 -149 198 -86 -70 9 107 59 57 48 -16 -188 -171 127 -195 -166 -129 73 -243 -174 -281 10
1573 10 19 -204 24 157 100 -26 73 34 86 -204 -2 1 -60 -59 75 -194 -17 24 -25 -40 -111 382 21 -6 52 -11
1599 -11 -58 -4 71 -21 203 164 47 -121 -63 46 146 2 -285 -62 83 -231 33 -24 149 50 -107 -113 4 -29
1623 -29 -24 88 50 8 5 -82 20 -29 -4 -37 -97 -6 23 261 279 103 -85 -155 -132 0 -29 20 -11 30 46 -193 150
1650 150 -3 183 234 75 -172 174 -202 -244 20 31 87 -271 -10 -82 -119 -11 182 -131 -132 -325 -65 5 -387
1673 -387 225 -39 71 -317 -238 62 237 51 -139 -77 381 -182 -335 -403 -117 116 273 179 21 -104 -140 112
1695 112 -338 -33 36 55 -5 190 -76 -97 160 89 -6 -67 19 292 38 30 -155 -146 178 -190 -110 242 366 62
1719 62 -151 -5 -54 96 -57 55 43 -157 190 18 394 197 705 401 309 -292 211 -192 426 -292 -173
1740a73J85K39K85o17N4R5O70p43K93K8l27M04l73k76j56q4L13K14o6J47l8o1
1762A3p0J68p1j36p5O9K68r4J10k06j57J12K11l27K00O2j68J42J49k74p7K02m8
1785Cl65K26L95m68J22n1K61j65L03k04l05M76m3j93k37K75j01jQK36j36j87J54
1808CL2L8j01Lj02J33m16K75J70l3j59LL76l14r1J12j33J59J05l26K95r6j10J62
1832a5j96N3q6J27j05K76l18K19K91l18K71k24p2K59j09J86l44L1K28l69L59j03
1854D1k40K33L1lK05l51J89m5J32l46J99j03J11J03L0p5j60j33M66m24K00M7M2
1877A49j30M0jk78L11K5j20J2Kk9J64r3k24K7K62l14J03J34j90M16j10k87M77
1900C46l79k72M70n7o3o7J2n7J50k64L07j60JQ8k20J27O9n7r9J94K0k48P5j77
$$ plain form
1740 -173 12 251 536 -81 -27 68 738 -5 288 316 -11 393 20 -256 -412 -496 -183 31 -35 112 74 13
1762 13 -57 111 40 -96 -171 -102 166 72 182 -24 -181 -69 142 -185 15 77 -91 51 200 -74 -151 51 3
1785 3 -362 -136 259 -209 -87 -138 123 -42 261 57 -248 228 185 -8 -245 30 -71 -72 -64 172 36 -151 3
1808 3 35 73 -28 -25 -127 6 -410 -135 35 2 -157 -154 222 -92 -183 -71 -204 -45 60 -266 29 -67 -177 -15
1832 -15 -211 -158 -244 -117 -222 54 -264 -45 246 -72 199 -25 -97 162 53 239 -105 -74 154 -215 144 41
1854 41 -199 34 65 62 267 -84 105 60 192 -154 45 -58 53 156 186 111 -49 -182 284 -140 60 107 149
1877 149 19 59 58 -220 91 116 -4 8 10 -19 145 52 -172 -145 117 -197 -94 40 -150 266 156 -131 346
1900 346 -33 -305 165 108 45 -22 -10 -67 83 -181 126 -34 -33 55 -165 -38 31 -26 -125 69 89 -159 -84 -261
1924b61L25q1j7J66j85k09L92j30j50K17j20J37Ok07k27O24j3r2r1m6Lp4L06k31
1948D2l50M20k17K70qJl23K8R3m4J1Q3L2n0jkJ72q4k88M13l67K66j10K29m10J67
1974b7o7J88j10J64Qj31L31n11M20j63l90J62P4j2J85J26l55L9K44m69N38l05
1996f1J60j44K19J12k57mk6q8n4K32l1N8j78M8K47m05J61J91o4j13P7R0N0r4P2
2021A98j42l17N33l04J27j99R4l2Ll4L35m3k93K87j37l14J29l9L06k45n0k0L48
2044A91k74L62k33k67J55j54M01k82J8m9J34m1P9o5J54M6K15k42l8k41K74j99
2066e6r4K62nO7j86K22k98P0K01k58m0K40L0j19l36K00J98j20J36R2l64L57m9
2089A50l59K56k3k0o6J09JJ65k02p8o0J85K54k64M6k08p0K66m3j8j95J31p9L01
$$ plain form
1924 -261 64 -17 -34 132 -53 -262 130 0 -150 67 -53 84 90 -117 -344 280 267 175 84 38 41 -33 273 42
1948 42 -308 112 -105 165 157 158 -165 -137 -44 -88 -77 6 38 -12 -13 -15 157 73 -215 198 -169 97 -13 216 -194 -27
1974 -27 -94 94 -16 148 156 25 356 -155 265 102 -288 -126 -52 -64 121 247 -108 -69 175 -294 244 -61
1996 -61 99 -45 174 286 29 25 -1 -89 -143 89 58 116 -62 -14 233 -172 -11 180 116 3 80 170 220 126 198
2021 198 56 -261 272 -32 95 -104 -10 -42 -39 -73 262 219 -74 213 76 -238 -109 -148 158 -87 -137 -157 191
2044 191 -83 279 46 -221 -66 -220 181 -101 -83 -132 2 -39 40 -25 129 175 390 148 110 -131 143 -56
2066 -56 -150 112 107 174 -12 210 -88 -18 183 -75 -115 125 155 36 -300 -100 98 -22 114 206 -158 199 150
2089 150 -209 47 24 4 -62 47 48 213 11 -67 -127 58 312 48 94 -114 -184 82 39 21 -174 -43 -122 179
2113A79l14L15r8P2j44L3Q2q9n6J07o4j40r0Q8J69J10J99j61R9n7m31l17K00L46
2137C8J02l57R2J94p4K42l99j32O83m60k40J28J37L25l28L4o5K38k19K6qJ13J37
2160B07m1l7j53L88m33L1k62L10J1pM7n0K0KN7k0j65K41j20PP8j98K12j80L0J29
2186A04L1j89Q0J56Q7l64j16K37k11o4L46J80l99L9Q3l9l3k28J02J86J07k59J62
2209bJ72p1J19j41k42J39qj2j39L92k27K3mj76J7p5L18j00o8K16l36L84J6l75
2233a80K71j37L3M8k8n8r4K21j35J99j29m1j93K18j61j3J21P8l57L65l1o3M02
2256C36j77l48k2J47J74j0Mk86K60k41J8L20j74m8J9l4J49k09J46K8j20K05j4
2279A23Pk49J82j83j2n7N3%K71j13J15l61K61R1Jj62n5L9m9j03K35J54j00n4k50
$$ plain form
2113 179 -135 180 82 154 10 43 125 36 -20 87 23 -117 -207 -119 50 160 359 198 297 240 -191 -508 -308 38
2137 38 140 -217 -125 69 -5 237 -162 -294 389 -71 -311 -183 -46 279 -49 -15 -80 158 -61 -35 -43 70 207
2160 207 166 129 -24 364 -69 -38 -300 10 21 14 61 11 31 33 90 70 -95 146 26 33 111 -87 125 -55 -25 104
2186 104 135 -54 26 182 269 -95 -211 26 -185 -249 97 277 -122 -83 0 -39 -72 -300 -198 -12 95 -164 -2
2209 -2 170 99 218 77 -165 -26 -34 -46 -185 207 -20 3 -1 -177 -160 -235 83 -17 -85 131 -205 179 195 -180
2233 -180 91 -46 -13 35 7 -51 -145 76 -59 140 11 -30 -223 -5 -166 -179 -58 20 -337 28 -3 -66 336
2256 336 159 -189 -211 -64 110 100 104 -182 78 -163 -145 175 1 -47 -28 -62 87 -122 24 52 -68 137 123
2279 123 130 -119 63 -120 -132 -189 -136 -136 135 22 137 -224 37 128 129 -33 -88 -49 -98 -201 34 188 88 34 -216
2304b16K82j04j40O9J77k66J43l5k2L46k17R5k18L72l52j36J56J74q1Q8m7k3J00
2327A45k53K45R9l94J49o9Nj25J66q2j51J81m9p0L11l11j06L39L4l74M06j03n2
2350e9J28l5ro8k12J45m0j51K48j00Q8L4j01L00k65K31j32p0J19o0J68k90l4L
2374a62O7K47k39K28j96P7j11J60N4k83L22j53jl33K85r1L70r2k58J74k84K90
2396G1r9j16K24o9Oj13K37K84m77j11J93R2J81m02K66Nj53o1p9P0K34j80L5N6
2420I4j26M2RKL1l1j25k02L26J92r4j54Q3m8j1J29n1k36M0K25j29Q5Q2J04J43
2445C80l86R0k67L33rj74J83k84M0j23L26j42P1j58J43j10J62j85qJ61j96M2L19
2468B08j68J3K08l27N6M4n2J77k05J35R9j17j91OQ4o5j25P6O5Q7J65k55n3J4P5
$$ plain form
2304 -216 66 -38 -178 -109 68 -198 -55 -90 -112 234 17 112 -106 266 -86 -222 -66 108 27 115 68 45 145
2327 145 -108 137 236 -158 -9 -78 -73 -198 -32 -114 -265 -84 -133 -203 108 -203 -309 30 64 -310 96 -7 -59
2350 -59 69 34 25 -43 -255 -110 -150 -301 -53 -153 -65 -31 -132 168 -97 134 2 -68 51 -9 159 -131 -165 -162
2374 -162 -95 152 -87 141 -55 22 -89 71 125 -158 164 11 10 -323 -38 -129 241 149 -109 65 -219 71
2396 71 -28 -144 80 11 17 -96 141 425 -52 -163 30 122 303 -99 167 172 19 -42 -121 -51 183 3 38 94
2420 94 -32 10 19 21 52 21 -104 -306 20 212 118 -36 47 -1 -12 117 66 -170 -130 95 -34 51 133 237 380
2445 380 -6 84 -183 150 141 -33 150 -134 -94 -217 109 -33 38 -120 23 -87 75 -110 -118 43 -153 -111 208
2468 208 40 53 261 -66 -10 34 -18 159 -46 89 188 71 -120 -114 -30 -95 -220 -144 -79 8 173 -82 -135 -121 -46
2493d6Lm5K15l43K64k01K01j52L99L53o46L37j45k92J95j11o8P8J81k92K12j19
2515b2J21k99L58k43K35m27M79k38J51j30l6J04N8L3l30J16j09L09p3J18m46Q8
2537a83K33j46J78J9j16J27j88RK32k32j25J3J31L38k71O0j12%O3p8J56p7j10
2560g9j04J60m3J31k74K97j67K36k38j34J01J94j13q4L68k52O1r2r0J53j48j10
2582b27K38N7J14k88k6M3k5J82k57L56j73j70L3o1K2L01j51P7o6J17m13M53r5
2605D1j6q8k2q3J72j04J27K78k92l5J13j25N7k30M86m46J74R3p4J17j52Q1k66
2628a94J01J48J9k1j31L1K50j49j51M0r6J66j04k92J16L42J38k71O5M0n2K09m19
2651b15P8J52l0J35J04m8j13j10L75k57O8J23m33J15o7K14j54K2N2J78q5l69L29
$$ plain form
2493 -46 -43 -88 127 -216 48 -153 48 -104 295 648 2 339 194 -98 97 -14 -82 -4 177 -115 97 -22
2515 -22 99 -200 158 -85 150 -277 202 -36 115 -15 -51 53 111 144 -186 -70 -179 130 57 175 -271 -183
2537 -183 50 -96 82 101 -15 112 -76 -67 165 -67 -192 -179 -48 290 19 79 -33 -33 30 -48 108 31 -79
2560 -79 -183 -23 -66 65 -209 88 -79 157 -81 -215 -114 80 -33 -117 251 -1 60 -32 -122 31 -117 -227
2582 -227 11 68 182 -106 -132 -89 -114 68 -189 167 -6 -176 -143 -204 -182 119 -32 45 -21 96 -317 136 41
2605 41 25 -63 -85 -168 4 -100 27 305 13 -22 91 -34 23 -207 279 -167 7 100 26 143 -9 72 -194
2628 -194 -93 55 74 53 -78 -47 203 54 -97 -57 -153 13 -91 -383 -267 75 213 -58 7 47 -5 204 -215
2651 -215 -137 15 -15 120 224 176 63 -47 328 71 139 262 -171 -56 -123 91 -63 -41 11 189 104 -265 64
2674F4m7k3k02L07o6k26K10J0R1j05K06k76M9J31k8j91j5L36m95j18K62L20j97
2697cp1P2M9J3O4K8j82J5j59L17j39j84K14J55j30Q0p5j70M3oJ65o3o4%q8P6j48
2724a91J4J1K39j2Q0J27p2m36L12k35M95m74O1l8J16k56L74J9k59J8J7J6L0q4
2748a28j93M00l06K61J05k57Q6K54q2o3R1l21J14P8n9Q6r7j61J97K64j45m9o3
2771A2j47J91l49J51J11P3o5J0j2L25n99M65j13j0J68j59j08J28p6P3Q2q9m6O8
2795H4k53J62j15K16j4j22m3M52m21K9j5L7J9j67R8J54Q7k26M5m0m5K5j68J43
2819g8M5j37J62k49K13J11j16l0K13n2j73J54J8k14K60k79K0J34l6%O6N8m5J31
2843A76l24K52J17j35k27J68O8n8P6m9O3k22K21p9J29k17J58J05k90J51nl4R4
$$ plain form
2674 64 17 -6 -208 99 33 -193 17 27 118 13 219 -57 -8 123 95 -96 -111 225 -270 -388 -126 194 -3
2697 -3 -74 -2 47 60 124 152 -30 -15 -174 143 4 -180 34 189 59 139 64 -106 -63 -69 96 33 -31 -31 -119 -43 -191
2724 -191 -177 -166 73 61 141 268 196 -240 72 -163 332 -142 -81 -119 -3 -259 115 134 -125 -107 -90 -74 -44 -128
2748 -128 -321 79 -227 34 139 -118 -32 222 140 77 168 -153 -39 39 -20 66 -31 -192 5 269 124 75 12
2771 12 -135 56 -293 -142 -31 42 -23 -13 -25 300 -299 166 53 43 211 52 -56 72 -4 69 151 62 16 84
2795 84 -169 -7 -122 94 80 -42 -85 367 -54 -25 -40 -3 16 -151 -53 101 188 -38 7 -33 -78 -53 -221 -78
2819 -78 -33 -170 -8 -257 -44 67 -49 -79 134 82 -91 63 81 -133 127 -152 -132 2 -34 -34 32 90 45 176
2843 176 -148 104 221 86 -141 27 95 37 113 64 127 -95 126 47 176 -41 117 222 -68 83 78 44 138
2866A38j90j3K31l18K1L3J81j31j1j02n3Q1K98l48K21j84L30k82K19m03L22q9
2888d9K11j24J27l35L37l69L11j90k06K56jM2j15J21Q8k07J46J65k39J82k76K48
2910A23P4p4l60L85k41K5L05M1l21J54j78J51m00N49n1m37J89K62j07J98l48K06
2932A45nq9l82R8J36O3M2k5j53J02K20o0j36j05J23k4L12r9j9k51J92k64R0J00
2956A1K43j68M4l60J95J92j41j83R4k54M20j64K25p4k41L21j40p4J2J07k23L40
2978A82n3k91K60P1oQl4l27K76j32J23j45j4l2k32M78j25J44k84K7J20P8k55J8
3002a45K22l8k17L19k1k44k9L32m55M28k47Q1n9k7M2n0K27j83j3J92k68K19j46
3025h0J96j76N4K67k50j03M9J90o2p3j14K85k33J30k46J84K4q3J25Q5j00LJ54
$$ plain form
2866 138 -52 -65 166 -152 -131 -98 83 -48 -59 -161 -214 -133 165 -183 38 -146 184 -98 121 -282 40 -49
2888 -49 162 38 165 -170 167 -202 109 -81 -287 -31 -32 10 -105 16 104 -103 43 208 -31 151 -125 123
2910 123 197 123 -237 148 -93 -68 237 278 -43 111 -67 84 -316 233 182 -255 -66 196 89 287 -61 145
2932 145 140 51 -331 -233 -97 -34 8 -17 -170 -68 152 92 -44 -149 -26 -50 262 163 144 -107 85 -179 -89 11
2956 11 254 86 130 -230 -35 157 16 -167 -73 -327 93 -71 154 80 -161 160 20 -54 -42 65 -158 182
2978 182 129 -162 98 169 163 171 137 -190 86 -46 77 -68 -82 -114 -346 132 7 151 -133 -106 14 92 -163 -145
3002 -145 77 39 -178 141 120 -124 -153 179 -276 152 -95 -14 -73 -100 -58 -108 119 -64 -77 115 -153 66 -80
3025 -80 116 -60 -6 261 11 -92 -43 147 85 12 -102 183 -50 80 -166 18 42 -41 84 169 69 72 226
3048B26Lk82o5L9L89m23P4J91j66j5J55q5Q8j20L6p3lk1J35k42K24J5O6m82K93
3073d3J04M2J03j86J41k36k6L83l70K21p0j65j12J68J2J26j71l00L10M0J74j53
3095hk0Q4j1k04L13k06R7k03L67p1M6q3j21K9J47k53J46j23J04L4j4kk54M84k83
3120ej01J6J97j30L33l18k00L58QL2l48K46k5n6%j7j22J18l6R7j27K15l10O4M8
3145f3K55j9l16N7j4N06n91L60jM4k09o6O5P9q3R7l20K00J7j44J10L1LLO5k83
3171b17J75J01j1j66R3J11J78j41j21J06p0J06q3l0j05k9No3J29j59M9O9K69j94
3195Bj19J00j27L64j59J22ok36J44r6N8n8m23M67KR7J59jk37j11l7n4L46p1m57
3220c31L13OK53m30pM92l39Pk06K95R3l4n7M6k14J35L6K7pj14P7j62o1M75j6l27
$$ plain form
3048 226 229 -53 -118 -79 310 -113 -39 152 -14 -29 126 41 129 9 45 -28 -31 -52 83 -159 65 80 146 -336 -43
3073 -43 61 103 206 20 161 -75 -101 282 -88 133 63 -102 -214 -46 -34 92 -79 -379 -69 -29 145 -8
3095 -8 -28 56 45 -159 154 -52 45 -158 209 138 184 101 -20 9 156 -97 49 -74 30 64 50 48 -206 278 -5
3120 -5 -106 -90 107 -23 310 -8 -208 150 158 190 -158 88 63 7 7 -10 -132 -14 -50 47 -80 135 -175 -111 -63
3145 -63 192 173 -143 -86 -100 406 -185 175 174 218 9 -57 8 87 4 101 -219 -19 -2 -146 -36 -5 -2 1 66 -217
3171 -217 -42 59 48 -118 -25 86 264 123 2 108 38 144 61 31 -74 -103 -98 -161 -32 -191 -142 -73 196 2
3195 2 -117 -17 -144 220 61 183 177 -59 85 -11 47 -11 -434 33 35 132 291 290 53 -58 -95 -149 197 126 -331
3220 -331 -18 -12 241 -189 -196 296 -43 -36 -242 53 146 112 55 101 -113 22 58 85 78 -36 41 -121 -182 293 277 -50
3246e0j17J27m1r7J84P4k8R2J6l21k02M91j44J29r7J22k45K98k59J6K17j12n6
3269cJ39o0q6j38K14j64m8J62k40J94L07n0k36k4k1K8mJ75j36k51M77m43J32J16
3293D0n5J26q1j72J41J95j80K35k57k20L16M1JJ99l32m5P1l23K65OQ2M1l2J6k38
3318a60J12j10n3K90m09K56q8L05R9j96K7mO5k63N6lJ46MN8j89n8O11o26J27J0
3343GM0j9k66K23nm0j5Q3o5o3J88K6o2J11J68J2k37o2J25k62L32n27L10K03k03
3368BR0n9mj54J37k18J9K70l2J68k4j55r1m0J70Q3k17M2p4j01J46o5R2k4L80l66
3394b5j61J22j75J07M19k73q3K1J97j82L9rJ26p4l04K82m1k48M06l9M6j95p5Q8
3418c1MJ42j59l9J15pO4j10j98L30m7M7J60l47K1J8k11K21k13N90l60pJ01l12
$$ plain form
3246 -50 -167 -40 -81 -178 6 80 52 144 160 -161 -363 128 -16 113 16 138 -107 191 -68 -52 165 53 -3
3269 -3 136 76 -10 -148 66 -98 -146 16 -224 -30 277 227 -9 -33 -54 -26 -30 145 9 -242 235 -208 -76 40
3293 40 -15 111 30 -142 -1 194 14 249 -8 -228 88 129 130 329 -3 -48 23 -300 -35 -29 53 94 62 78 -160
3318 -160 -48 -158 -211 79 -330 -74 -162 143 242 46 73 69 134 -129 -73 -76 70 74 132 -57 -115 496 -130 -3 7
3343 7 47 28 -238 -15 -20 -60 -75 8 -57 -120 68 94 32 143 311 323 86 24 149 -113 219 -308 2 205 2
3368 2 92 33 29 -125 12 -206 -187 83 51 219 195 40 -51 -91 79 162 -55 -13 -87 -188 -42 -107 -15 -39 341 -25
3394 -25 -186 -64 -239 -132 287 14 -69 -48 149 -33 6 -3 123 49 -255 27 -14 -262 144 105 151 -44 -119 -31
3418 -31 -27 115 -44 -83 32 25 89 -21 -219 111 64 111 271 -76 -55 -37 -248 -27 -240 350 -10 -17 84 -228
3442b28L11l21J10J58j74K84j23r7J97j12r1oK27l49L03j14K03j61kj77J05R6
3464C9k17J29M0P1l52L07j43N5J45J29Lk45j9J49R1k81O8J66j49j1L0j28J36J85
3488A98O0j24R5l66K44r8l7J65j41Q1p9J64o9M8j51l1R7J6J5q2j97J55J00j08
3512d5J7Q7J14m9j47k13K11J11L4L9l31N47n81K24k1k8J29j40o1M08l08R6l09
3535b16K81q9M5J27m9k04J54J61ol34J69j63J94L05m90N1l9OK65j72K3P3J45m47
3559b10K17K9j11R8j35K40j04N3O0m0K8r4j8p58N50K89M12J27m33L30n66k23N05
3582B46k50J00k04L93j40l06N1p5J00M5J45j71R0j24O6l7K13K29n64M36k52jK13
3605B03L2J54n28K27lK21n8j74pK1j95J4K72l26K28L13m14mJ54rm64K75R1m7j25
$$ plain form
3442 -228 83 -238 -128 30 -144 140 17 -80 117 5 -86 -92 135 -214 89 -25 178 17 15 -162 -57 39
3464 39 -178 -49 -9 62 -290 17 -126 -71 74 203 206 -39 -58 91 182 -99 -31 135 -14 -25 5 -123 13 198
3488 198 258 134 229 -137 107 9 -28 137 -4 77 -2 162 93 141 -10 -41 56 72 87 5 -192 -37 63 -45
3512 -45 -28 59 173 124 -23 -236 -25 86 120 159 -172 375 -206 18 -3 -31 98 -42 -103 305 -3 93 -216
3535 -216 65 -24 21 148 99 -105 49 210 204 -130 39 -124 70 375 -115 -64 -103 -97 168 -4 19 92 237 -210
3559 -210 7 36 -75 23 -112 128 24 77 137 97 125 31 13 -745 -195 94 506 633 200 530 -36 -259 246
3582 246 -4 96 -108 285 145 -161 -110 -185 -85 -40 105 -66 24 -100 -34 -71 142 371 -193 243 -9 -10 203
3605 203 235 389 -139 88 85 306 248 74 67 88 -107 -93 179 -147 81 394 -20 -24 130 121 -343 -68 23 -24 -149
3630a49J85q6j3r8J75K8l66L77N2J58l51J26n6j04J56j21K90m40K60J12k59P7
3652d7jJ0m6K77l67L97l42J38rJ6J8J16j50m0n9L4J16q1l4j82J11NO4J06J66k44
3678b8J77l94K49k2J62K3N9j34m4K9J6q9P7N8k46L24k53J32J4J19K24l43l71N12
3702B51k46j76K89r6p0K2o8l1Mj64J30J31N0M6rj4L9j5R0n3k5j45n3K94o9j11
3728AqM6q2L06k56J80l94K35m8J46J28r0l6j15l6l9K12k18K39k10j32J65J98L8
3752B30k88oJ6n7k53L70k93L46j36K65r1r3K6M6P7k77K28k32J99J45n10L26K0
3775E8M7P7j16J66m65K88j08O4J4k61K60k86L16K04p7k7j69J71l35K19r1J81j14
3798A6n8j2k05J96N0K82j48k50L25k24k87K00o3M77l03j9K8j75K22J24j04k31
$$ plain form
3630 -149 36 -50 -63 -161 14 42 -324 53 105 263 -88 38 -18 -122 34 -87 203 -237 23 135 -124 -47
3652 -47 -48 -38 -84 193 -174 223 -119 19 10 26 44 160 10 -30 -89 -55 61 -20 -54 -236 -125 -120 -56 50 216 -28
3678 -28 149 -245 4 -18 144 167 226 92 48 77 93 4 81 139 -107 217 -36 96 110 229 453 110 -261 251
3702 251 5 -171 118 22 -48 -26 -94 -125 -121 -285 -155 -24 26 72 63 49 88 73 163 110 85 -60 -113 181 112 1
3728 1 -7 39 -43 263 7 187 -207 28 -20 126 254 164 128 13 -23 -62 150 -68 171 -39 -171 -6 192 230
3752 230 -58 -64 -48 -105 -358 12 -281 65 -71 194 103 10 36 82 159 -118 110 -122 77 222 -288 38 58
3775 58 105 182 66 232 -233 55 -53 11 25 -236 24 -262 54 258 181 154 -15 156 -179 40 -51 130 16
3798 16 -42 -54 -259 -63 -13 269 121 -129 196 -28 -315 -115 -178 299 -4 -23 5 -170 52 176 72 -159
3820a59L05j82J36k43MK99k29J17J8r2J65j90K40n57K32L85m01J14K25j72j86
3841a71L17l69J64J24j05J38J69j10m29M6j5J29J46K5O3j06J19J34j07l6k94K95
3863A27j10p1j98Q7K94K60p17K98j23J1J74Q3j89L03k19n3j57N1L16j46Q1j82
3885h0k28J01J41N3k22M20k85mJ41R5K89n85L97q8j37M3L6L3L2k23K7K8Q4q8J75
3910A55R3k73K78l16p1L77k29l4J23j26K55j01k77L60j48l69J97K29k43J45R9
3931A24l04M97n2k69k12J7R6J2j5n8L69k93R7j08K5J99k86K51j6j34l7K37j16
3954B4k5M4J28l29K0R4l4K16j49k65J99m3j00K59K97k40J02l92J10l5J73q1P8
3977E1o6J57l86J9N25l18J98m15K82J21j54o1J28j48K93k08q9Q5J43m40M90k90
$$ plain form
3820 -159 146 -36 100 -143 -139 160 -69 48 66 -26 139 -51 189 -368 -136 249 -152 -38 187 15 -171
3841 -171 146 -223 -59 65 -40 98 267 157 -272 -226 -241 -112 34 59 122 16 135 269 162 126 -168 127
3863 127 17 -54 -252 -165 129 389 -328 -30 -153 -142 32 115 -74 229 10 -43 -200 -149 167 21 102 -80
3885 -80 -308 -207 -66 -13 -235 185 -100 -104 37 132 421 -164 233 145 8 51 87 120 152 -71 -44 -16 68 -20 155
3910 155 248 -25 253 -63 -134 243 14 -20 103 -23 232 131 -146 214 66 -303 -106 123 -120 25 124
3931 124 -180 317 265 -4 -216 -199 -103 -91 -106 -164 205 -88 9 -99 -74 125 -161 90 74 -60 -97 140 24
3954 24 -1 43 171 -158 -138 -44 -78 138 -11 -276 -77 -120 -220 39 336 96 198 -194 -84 -119 54 -27 51
3977 51 -15 142 -244 -225 300 -18 180 -235 47 168 14 -47 81 -67 226 18 -71 14 157 -283 207 -83
3999h3K87j17j2l08J00j17K85J94o0k40K57l18J30%J28lk22KP2J67j64N5j94J19
4023d2K28k15o6k1J21o0q9K96lM9j02K26k47o4J88k89L17K5l80L19l45R9J07K0
4047G2l54j0K38J40j73M5K58q4N3j03j09m7K78k39j6J22N8l2J2J5j19K31j80m1
4071A5K84l91L19j25j78Q7J45k54O4J55pj65J4L76l43j49N69m33R4J56k95J61
4093I9J3k69J26J03J69j88j07mL03l31K74j64J82j37j81R1K15N9o10J79O2L11
4115A95m37K64J83k34J86l77O2M28l85K08k23j4k49L54OO1k33K24j8m5KK50l79
4138a71K14J51m06j2K05l5J87j9k34J05j03o3L4J04R8r4J00k03K97n5j54k46L73
4161G3j20N1J42k02Kj59j93N33j31K27j37j65O9l6m5O3j57J15J99K4p6l31M64
$$ plain form
3999 -83 204 87 75 -233 -133 -250 35 229 169 -71 186 -132 -2 -2 126 123 -99 -97 -25 142 -22 33 -161 -42
4023 -42 186 -29 -95 -116 5 -55 -144 152 149 198 96 322 75 11 199 -90 227 252 -128 191 -154 -55 52 72
4047 72 -282 -292 -54 86 -87 -42 216 132 185 82 -27 -74 204 -35 -51 71 129 97 109 124 5 236 56 15
4071 15 299 -92 227 102 -76 11 156 -98 -34 121 114 -51 -37 339 -4 -153 416 -17 77 233 -62 99
4093 99 112 -157 -31 72 241 53 -54 -58 245 -86 188 24 206 69 -112 -21 194 253 -357 -178 -116 195
4115 195 -242 22 205 -29 157 -220 -158 270 -115 93 -130 -144 -393 -39 -33 28 -205 19 1 -44 -42 208 -171
4138 -171 43 194 -212 -224 -19 -54 133 114 -120 -15 -118 -181 -147 -43 55 -39 61 -142 155 100 -54 -300 73
4161 73 -47 4 146 -56 -54 -213 -406 127 -4 223 86 -79 -10 -46 -91 -28 -185 -70 129 153 77 -254 210
4184B10l54Q4J25J6M6q0j94J42M3J19M5j81J7Q9q0L7j03J0J15k80L86p8j35K70
4208B69k72J21k20P2jN4n8N0k59J88r7o9L48j77k96J06J04M0R5pM52p78N25m74
4232b84J69K39j55R0k72K73j48K20j04R7k04J30O3n9J70j89j38J30Q6o7NJ76k39
4255a1L3n8r3m2J97Q0j90J83j33j31J44K08l52J23J20j31L21k48j28j64J90J7
4277f5j9M10m70J57m2k4rl09Q6R6K31k17K42j14j49Q5J52j06n6J56K23k78O5q0
4301c5M50n93J99N4q2O3k08L22l16J30j16J0K77j11J63l39K09Q8j17K93n16M00
4323B25q1j87mk09L09Q9j85L8K46ok54J14k30K62k02L8J32Q0k2l20M1j17K14L47
4347C18jQ9m14j37Q8R6n7J06j41J28m5Lj1N4Lj36j08J85l61J80L67k38J98l39
$$ plain form
4184 210 -144 -60 65 81 127 47 -147 -5 38 157 202 21 38 127 47 84 -19 -9 106 -174 212 134 -1 269
4208 269 -3 118 -102 -30 -31 23 -35 15 -244 -56 -153 -222 126 -51 -347 -241 -137 -97 -2 -9 443 -335 190 -284
4232 -284 -115 124 -31 59 -213 60 -88 132 28 125 -79 51 114 55 225 36 -102 28 114 47 52 228 -11
4255 -11 22 -36 -129 -171 26 106 -84 99 -34 -165 -21 187 -165 -42 78 -53 268 20 -108 -272 -82 -65
4277 -65 -84 326 -144 13 -29 -53 -62 -371 -285 -189 42 -175 67 -47 -196 -111 41 -65 -121 35 258 -20 45 -35
4301 -35 415 -178 21 75 -7 56 -152 170 -146 -16 -132 -122 155 44 207 -132 77 165 48 341 -175 225
4323 225 144 -43 -47 -256 53 142 -43 -5 241 235 -19 95 -135 127 -75 -37 95 175 153 -167 -126 -243 -29 318
4347 318 317 406 -8 -145 -57 39 -18 88 -53 75 30 33 22 76 79 -57 -165 20 -341 -161 206 -32 166 -173
4371a73L71J4m60P7k8K52j72K26J39k08k3q2p1J45j80L00J81n13Q9l6K32L0l57
4394b47N1M83r6l51J94k39K23J63j04J59j77Q0k13N5k17K67r2J85j5j14q5Lj7
4417a04K6L7P5K2n5QJ4k51L34k91K56K7j6o0J59j4k11k48M48k77k52J07J28K62
4441A24k8p5j74K27k65Q8O6K82j85q9k47L41k36K78n9j21M8p6l8J31l2J12K3O3
4465A58K0k50L76j51j4j43r9J53m5j58k1K84m24J24N0J11j29P2j19L07j27K32
4487B07m38J41rJ21q3OK47j59j43L10l93M14j70K50o40J12K63J50r9m39K79L7
4509c6q0N3M56m47%p6q4M01p2r7n0J27k31L0L32l7k18K14q2l68K71m02L71j30
4533a55K18Lj69J5r7J57L24m56J67K00l7l30R1Q6RP1mn9r9K70k32Jj24K3J65j08
$$ plain form
4371 -173 198 212 -248 -171 -199 53 -119 107 246 38 15 -67 -138 7 -173 127 308 -205 -116 -152 80 110 -247
4394 -247 -196 287 191 -160 34 -205 18 181 77 236 59 139 -74 -19 -236 31 -61 124 109 -5 -90 -87 -104
4417 -104 -78 -41 34 56 1 9 23 -228 106 -185 71 98 82 22 181 167 -44 -292 156 -121 -373 -266 -138 124
4441 124 96 21 -153 74 -191 -103 -37 245 60 -29 -276 65 -171 107 48 -73 -25 -101 -139 -8 -40 72 95 158
4465 158 178 -72 304 153 139 -4 -103 50 5 -153 -174 110 -314 -190 -140 -29 -158 -86 -205 102 -25 207
4487 207 -231 -90 -99 22 -61 -55 192 33 -110 200 -193 221 51 301 -339 -227 36 186 87 -352 -73 -36
4509 -36 -116 -63 393 -54 -54 -130 -214 187 115 18 -32 95 -136 -106 226 189 -29 185 103 -265 6 -396 -25 -155
4533 -155 63 66 -103 -88 -185 -28 296 -160 7 207 170 -160 -69 17 26 97 93 34 -65 205 -27 -26 -150 -127 38 -70
4559g0L11l77K94j78k66j59L66J68j51L04m22K40J49l28j40K08K64j43J2j71O5
4580b4k10J64J66j0N8l23J80J17n7o9J6M6r6j93K18q7J01m0J11J29k34r4M32n23
4604b22K25Q9l51L17k00j0J57L0k08j19K06J49N3m88N75m30J48J91j77L9q1N7
4626e0j8NK46j57l9k54K62K33j89qN6k26J26R0k14J58J48k97L44l92J05P5l3J1
4650a8o9PK8j32J19Kj83J02J5K32m08J97L6N9j33J05%KJ96j03j14K5q9j3j0L37
4676A90n2q9j18N8J26k54J65P0j0j75K27k09j12K28l3K86m88K44P0k40J47k7K70
4699B74m64K28j1j07O7L3k0K8o8K38m82L90k7l40K47p8N6Kl2K06q8Mk03L13J6
4724A82l70Q8P9J02j3n4o3L7k16L09k62N4j4M2K91k36j67L29j50j98M53J49k95
$$ plain form
4559 -70 241 -136 158 -20 -286 -445 -79 89 -62 242 -180 60 209 -119 -259 -51 213 70 82 -89 -24
4580 -24 -234 -70 96 86 144 -179 1 118 61 -8 8 54 -42 -235 -17 -104 -3 -43 68 197 -37 -131 301 -222
4604 -222 3 92 -259 58 -142 -152 5 35 -173 -292 -86 63 116 -372 203 -227 -79 112 -65 -26 -107 -50
4626 -50 -68 -63 183 26 -13 -267 -5 228 39 31 87 -139 -13 77 -137 21 169 -128 216 -176 -71 4 -29 -18
4650 -18 -87 -80 -52 -184 -65 -63 -246 -144 -129 103 -305 -108 -72 -13 -146 -41 -41 -39 157 54 -60 -35 -124 -137 -147 190
4676 190 138 49 -69 -11 115 -139 26 96 86 -89 138 -71 -183 45 12 298 -190 54 124 -116 31 4 274
4699 274 -190 38 27 -80 -13 20 0 28 -40 198 -284 106 79 -261 -14 -92 -36 -34 -66 140 52 56 -147 166 182
4724 182 -188 -100 -21 81 68 14 -49 -12 -228 81 -181 -127 -141 -99 192 -44 -211 118 -32 -230 223 372 77
4747G7J87k18J27k97J30M8k60J20K98k50P2RL4J22j33Q1j86K18k93J14p0K62j31
4770F1R5j11m4J59j68k00J3J46J60k06J25J01j93L3m1J11K3m31N43j0l4j46j30
4793a44J91q4L9j31P0j4k9j18k58N12Q0j93R2p9J34J98k30L0N5k47J55q2k11O18
4817C54l07j43L9K03k87Q7J86k61L1K09k60L56j70K89k55j96K34q7p0L06k16Q7
4839A29j87J46j49k33O5N21k79n6J41Q0N3o4k45l9M50n47Q4J02j8N0K36l03m9
4862a12N0L5J47j68j8J21O7k38J89k94M6K20J34j78N0P6k35j8J0K20k97K90j20
4885b3R0j25K62R2l77J09j98L54j2k56J46m4k73J22k8K05rJ06l90J96J7L19j75
4908A08l8K63k03k83J24m9J39j0O2j91l2K37r5r7J20j6q9P4j23l9L16k63K15j69
$$ plain form
4747 77 264 46 173 -124 6 54 -206 -86 212 -38 34 43 77 199 66 147 -39 179 -114 0 -70 192 61
4770 61 156 45 1 160 -8 -208 -195 -49 111 -95 30 131 -62 -29 -70 41 64 -367 176 166 132 -14 -144
4793 -144 47 -37 2 -129 -59 -73 -102 -220 -478 34 114 -79 13 -66 68 266 36 66 121 -126 29 -53 -264 354
4817 354 47 -96 -57 146 -141 -54 132 -129 -98 111 -149 207 37 326 71 -125 109 22 -48 258 42 129
4839 129 -58 88 -61 -294 -229 292 13 -43 98 178 231 167 -78 -117 333 -214 -130 -28 -46 4 240 -63 -112
4862 -112 -62 -27 120 -48 -66 55 122 -116 73 -221 -175 45 179 1 51 127 -108 -126 -116 104 -193 97 -23
4885 -23 67 -58 204 296 -81 28 -170 184 172 -84 62 18 -255 -133 -161 44 35 141 -249 -53 -36 283 108
4908 108 70 333 130 -153 -29 -78 61 51 113 -78 -110 127 32 -65 55 39 -50 24 -99 -138 178 -85 130 -39
4932c9Q8P1j07J44k11j53J50J71p6o4M5j69N9Mr5K46k41K20Q6j85j47J59j13J87
4956C0p8p1QK58j77K05J08m9k76j68J93M8m7j08j44M64j71n5o4j45K35K1QJ23
4980A48R7k32r1J90k39J84j34M8J17l04J70KM8k2k2R8k52J52j5R8K34m49K75k32
5004a31L34k01o5J26p0j1J04M0k33j44J32J52j85K31o1j24J42L08l22j56J53j18
5026i9J57J46l29k4J38o1K36k35q8J36Q9K2k41K19l05j01K54M6K9k9L42k64K27
5049B65j16j8q9J19Mm30J08M13l12j83L97k3l3k50K13j4K1Lk51R1K00Nk09L1J58
5074A00M7O9k28J75r4q8k47J59k55L35J31N4j55p4J3J27k08P8L61m59J03K08n94
5097d42L18L26o3K6j79K33k95oJ76m1J2K04j89k59J43j36K34l09J83L8K25l81
$$ plain form
4932 -39 49 120 13 157 -54 -207 -57 114 38 -26 19 -150 -91 -87 -182 64 -177 43 129 -56 -203 -44 -157 30
4956 30 -48 -119 -111 147 -30 175 283 234 -42 -210 -17 31 -16 -124 -268 196 25 -30 -94 -239 -4 17 25 148
4980 148 245 13 -78 112 -127 57 -77 -29 88 -216 -46 -44 4 -18 -40 58 -194 -42 -57 41 275 -174 101 -131
5004 -131 203 2 -63 63 -7 -18 86 126 -107 -251 -119 33 -152 79 18 -106 36 344 22 -134 19 -99
5026 -99 58 204 -125 -149 -11 -72 164 -71 -159 -23 66 88 -153 66 -239 -340 -86 -40 -11 -40 302 38 265
5049 265 149 131 42 161 165 -265 -157 256 -56 -239 158 135 102 -148 65 51 72 75 -176 -85 115 120 -89 -58 100
5074 100 147 216 -12 163 69 -19 -266 -107 -362 -27 104 158 3 -71 -58 69 -139 -61 300 -159 -56 152 -442
5097 -442 -124 202 139 165 -14 219 -76 -82 94 53 65 269 80 -179 -36 -172 62 -247 -64 -26 199 -182
5119a82J66p2M2ml0j90L84l89nL71Q9Q2n81K94K13k68RJ61k42J24L08k54m3q2
5143i9J11Mk53K47j08j01J96j09L87l89P0m1J67Q9l94L64o0l3N8j10k15J59K40
5166A80j49K92m44R3K04k12J52J26k86k61K63r0J20Q2j12K20j17j91Q9K91m00
5187a50r9N1K38L2l5J57k93nl9L8J42J4L4J4O1k15l19M48j9j35Q6k3l7p4L45j32
5213H5J2j61Q9J61j75J16j15r7KJ17J99k42Lk6J4K5P1k01N2K24k20o5k01M15j85
5238a03Q5K24l27L05K41l94k70M79k06J07L9k07M08p0j87r9K0J60j27J20l65J81
5260A4jj71J95j24J47o1k22K86J8k03K42k18n7J09J62J80l11J40ok64K11k40K29
5283E5l46J74Q4K06k90J64Q5k66K08k27K69q2o0j32p9K66Q3k58J85J39k70J05
$$ plain form
5119 -182 -16 -88 -46 -50 -80 -270 114 -275 -280 91 180 262 -319 -25 188 -80 -71 90 -152 -28 280 26 -17 -99
5143 -99 12 16 -237 10 -98 -199 -3 -112 275 -114 -44 -85 82 171 -223 141 81 48 106 -4 -219 -60 180
5166 180 31 323 -121 -28 176 -36 116 242 -44 -305 -42 -132 -12 70 -42 178 61 -130 -41 250 -150
5187 -150 -249 -198 40 72 37 194 -99 -104 -143 -105 37 51 85 99 160 -55 -374 74 55 -80 6 -17 -54 -128 217 85
5213 85 97 -64 25 186 11 127 12 -85 -83 34 233 -9 -6 -32 -18 7 78 -123 -71 153 -67 -132 -333 82 -103
5238 -103 -18 206 -121 184 425 31 -239 240 34 141 180 -27 381 311 124 25 45 205 78 198 -167 14
5260 14 13 -158 37 -87 60 -1 -223 63 81 -122 120 -98 -155 -46 116 296 -15 125 119 -145 66 -174 55
5283 55 -291 -117 -33 173 -117 47 132 -134 74 -153 116 34 -26 -158 -237 29 112 -146 39 178 -92 13
5305A3j89j04N86o00K89J20o9j79K84rk01J01O6P9k23R3k6JJ37j25N5j93j7J13
5329BJ88k62K11k63Q6K08J6l42J45M6k78J63K46k35j18J16k38K56K82l87K97Q3
5351B22j03j84K80k51jK75k30P8m4J48j94K17j00k2J12m56K63J3r3j96M44j93
5373a5j42J03J19m9Rl32M21k59J61QO7k26J23K27k78j6J03j41M1P1k3K85n11M9
5397b05j5L60j93J02k5k24N6L00k82J06j68O32l59r6j85lJ94m6K5J57k21J74l04
5420b20K38k47K21m0r0J6o0J07K95o10K96p0K48j69L20k07j18L7K1K37l84M67
5442B88n03L22j79O7O1J45k44J15n3k35K17N3K44k32j42Q6M8o1q9J25J74l8r1
5465G8p4m9j02k87N91l71L68k24j8L84q3k62QP7j36J10j3j1J39j46k3R7K4l38
$$ plain form
5305 13 -176 -280 306 -294 -5 115 46 -133 151 142 -59 42 108 187 -36 57 31 32 169 44 99 -94 -111 2
5329 2 190 -72 139 -124 -38 170 186 -156 -11 35 -243 -80 166 -69 -187 -71 -309 -53 229 -158 139 222
5351 222 119 -65 215 -36 -37 238 8 86 42 190 -4 213 113 91 203 -253 10 23 -70 -266 178 -15
5373 -15 -157 -54 65 16 25 -307 114 -145 16 24 91 -135 -12 215 -63 -79 24 -117 -76 -5 -28 257 -254 -205
5397 -205 -220 140 -53 49 24 -200 -144 156 -126 -20 -188 444 85 -11 -196 -199 -5 -51 -26 131 -90 84 -220
5420 -220 18 -229 -8 -48 -138 -122 -182 -75 220 -390 -94 -164 84 -85 235 28 -90 -53 -32 205 -179 288
5442 288 -215 107 -72 -5 56 201 -43 72 19 -216 1 54 298 66 -76 10 58 -3 -92 33 207 169 78
5465 78 4 -45 -147 -434 157 -214 154 -70 -88 296 213 -49 -41 36 -100 10 -3 -14 125 -21 -44 53 77 -261
5489b61K35j7j03J10J70j18j77L29J29l90J94K0M8j70q1n1J48K70l01J18j64R4
5511C2nk67M04k05J20J47m47M9J93j69pj49o8L03K81j54m7j09j09o1M55J9k03
5534Cj51J2J66l8k67K35jJ16Nk81J29J59q6k22J87J32k51K76j88K4j20K21j87
5557a27M05j60j00R7r1L2k31M23k36j33RJ97l7o6k3k95O52j11k40J20j11p0Jk1
5581a16K07J7j69L18p7k28P5J29j38J22l9j31J47k66J93KR9L4j47m85K89O0l5
5604a39J9K02j68o0K61j71p9J05J91j95m9J20j72M26l46K13l21K21j34P6o7NJ29
5627F7k95m3K16R3l46K40Q7j19J81j41q3K87j45j62J00K15k37J67k26K05k57J49
5649d7k4q9K85j28j2N2P8j63J11m3m1j37L89j56mk59J55K05k23K56j44K3k10J11
$$ plain form
5489 -261 -26 -43 -146 -36 134 16 -161 168 297 -93 101 121 169 -1 -82 -133 15 285 -16 102 -62 32
5511 32 27 -240 164 -41 79 226 -221 -172 21 -148 -155 -304 -372 -69 212 58 11 -98 -207 -268 187 206 3
5534 3 -148 -136 30 -8 -275 -40 -41 75 80 -201 -72 87 1 -221 -34 98 -153 123 -65 -41 -161 60 -127
5557 -127 278 118 18 115 24 56 -175 248 12 -121 -112 85 48 -18 -41 -336 316 205 -35 85 -26 -96 -95 -116
5581 -116 91 108 -61 257 180 -48 27 156 18 140 101 -30 117 -149 44 46 145 179 32 -453 -164 -104 -139
5604 -139 -120 82 -86 -146 115 -56 -135 -30 161 -34 -83 37 -135 291 -55 158 -163 58 -76 0 -67 -62 67
5627 67 -228 -271 -55 38 -308 -68 19 -100 81 -60 -143 144 -1 -163 -63 152 -85 82 -144 61 -196 -47
5649 -47 -71 -160 125 -3 -15 37 115 -48 63 20 -21 -158 231 75 71 -188 -33 172 -51 205 61 84 -126 -15
5673a5j08J33J89k7k29m2p9k7L52l07L26j54R3j24m0k4nJ27O9l12Q7j7R4O4j63
5698a39L49j35N6k81q7L77P2j59j75J83J11p9k61K98l80J09L24l05K15J22k53
5719c8mj66j6L73j75m3P6j50J77Q9l04K59J75k98R6j80J60J74k51J15j47O8j59
5742a69J20N0m7K55l68K41n4j98K75j09P0P9k90L07J06m19J33J52j37K43j15k74
5764a49P8J7NJ3J22l15K75J21m8q9J11J56k21n6n8j22J46q9J23k9K21o9q2j19
5788e8k3K54j37k41M15N6l2q93N53p1Q70n98l37L15J31j33j59J92Jj50k29J53
5810a21K66r5k95K12J52p4Q6o5J55k88K52o2J46l59J51j90j16M61l4j77M9k54
5832b00J66QP3l6k8j36L35l59J83j12Kl8J45n6K55o2k27o4K49l87K11o0J25k82
$$ plain form
5673 -15 -123 10 199 172 -57 -99 -178 -205 147 -160 166 12 105 -19 -59 -83 -88 39 108 -204 -117 -134 -40 24 -139
5698 -139 210 75 131 -150 -237 140 212 53 -122 61 172 93 -168 130 -250 -141 183 -122 93 215 -38
5719 -38 -42 -208 -224 149 -26 -69 7 -143 34 123 -181 78 253 -45 51 -129 31 205 -46 69 -78 -10 -169
5742 -169 -49 1 -46 209 -159 82 28 -170 105 -4 66 145 -145 162 268 -151 -18 134 -3 240 125 -149
5764 -149 -71 -54 -49 -36 86 -229 46 167 119 30 141 297 76 20 -38 -160 -14 -103 20 -9 212 143 61 -58
5788 -58 -81 173 36 -205 210 266 234 -659 -106 -177 693 95 -242 73 204 71 -88 104 105 -45 -274 -121
5810 -121 145 50 -245 -33 119 45 131 66 221 -67 185 123 269 -90 61 -129 -245 216 182 5 54 -200
5832 -200 -34 -26 47 11 -17 -153 182 -177 6 -106 -104 -142 3 -53 202 140 -87 -151 98 -289 -78 -138 -13 -295
5856b95N5K89o8j29M29k57j46J48j80J40K52k80j3p2J04L9J06l8k0J79j97j20
5878g4J97j58J23l6Q1r1j23M0R9R1j31J70j32M9k79Q7J76l64J80L33j96l24N38
5901B56l76J10j25L03k52q1J21k56K12J49m0j29j55L01j33O2k31q3L47j85J78
5922gL2k3j7K51k57o7k4K05rj03j35J70Q9J0j17j11pK30J5q8r1Q9M7q8N8N7k59
5949a50j59M25p6r8k71M32K09j35l40K35j54J95l2M3k44l9L73l80K10j08q2o3
5971b09N9J9L14k72J20j09J03l45K07J36k50K73j4k82J07j39M47q3j22K08k72
5992a04L16J05m93L75n3j49K22l40M4O2R1j31R5K1j4o1j13m2J85L17l61lj06K66
6016A29o5P6j32j02j95M16j48J07p5N0J11j70J13r4J61j21j29K7nJ80l64K25j14
$$ plain form
5856 -295 -240 49 -19 -148 281 24 -122 26 -154 -14 238 -42 -55 -127 -23 16 122 84 64 243 46 -74
5878 -74 123 -35 88 52 133 42 -81 -41 58 149 18 188 56 105 -174 -87 89 -275 -95 238 42 -282 256
5901 256 -120 -10 -135 168 -84 -165 -44 -300 -88 61 21 -108 -263 38 -95 -33 -264 -347 0 -185 -7
5922 -7 25 2 -15 236 -21 -88 -112 93 84 -19 -154 16 105 115 -2 -113 -120 110 125 37 -54 35 82 -6 52 109 -150
5949 -150 -309 116 40 -58 -329 103 312 177 -163 72 -82 113 81 124 -120 -159 214 -166 44 -64 -146 -209
5971 -209 -150 -131 183 -89 31 -78 25 -320 -113 23 -227 46 32 -250 -143 -282 165 82 -40 168 -104
5992 -104 212 317 -176 199 146 -3 219 -121 -77 -15 76 -55 40 61 47 -14 -127 -169 16 333 -28 -31 -137 129
6016 129 64 140 8 -94 -289 127 -21 86 11 61 172 2 115 21 182 61 -68 -41 -46 134 -230 -5 -119
6039a19L12q0J27k3k58Q0J70j16P5k32J1N1q4P7Qk01P6j42J10J86j74%J17q7N6
6064f0l9%N2J3K90k14n2K03j57J8L1l22L33j48J11j15j25L24J03j03r6q2k15L29
6088G9K3n4j23L75j73k24j70M12k73J23l0r5J28K44j47n28M55j72J22O7j23o8
6110a52Q5j00M90l21K71l46N8j00J4J78j01n7J31q4M5Q4o9j26Q8p9K23k06L89
6133C15m4k00j13k00M92k59J93j66Q3m2j18K91l18O0p1o6J83j06O7M9q3J69k54
6156a38J05J11J52j23j89J65N9J98j99kn03L11J7n6j31R2K12j42K91l48J38l1
6178a1k2r2L06j14K07l89O3q3N8J37J42j51k03J87p7M4M2J51l08k1K05j14J6J20
6202I3k61J73j96n2K96p1K47N2n30J49L50m69n1N34j60n1O7m26L67P1n3R3r3l09
$$ plain form
6039 -119 193 113 240 217 -41 39 209 93 168 -64 -53 -2 -86 -9 -1 -202 -126 -268 -158 28 -146 -146 -29 -116 -60
6064 -60 -99 -99 -47 -34 256 42 -10 193 36 54 85 -237 96 -52 59 -56 -181 143 246 143 47 -35 -250 79
6088 79 102 48 -75 300 127 -97 -267 145 -128 -5 -35 -130 -2 242 95 -433 22 -150 -28 39 -84 -152
6110 -152 -67 -167 323 2 273 -73 -15 -115 -101 77 -24 -81 50 -34 11 95 26 -100 -12 -91 132 -74 315
6133 315 271 71 -42 -242 250 -9 184 18 101 59 -59 232 -86 -26 -97 -163 20 -86 -19 30 -53 116 -138
6156 -138 -33 78 230 107 -82 83 142 340 141 139 -364 -53 -36 -92 -223 -131 81 -61 230 -118 20 -11
6178 -11 -33 -125 181 67 274 -115 -52 -135 -77 60 202 51 -152 35 -42 2 44 195 -113 -134 71 -43 -27 93
6202 93 -168 5 -191 -243 53 -18 229 281 -249 -100 250 -219 -270 264 104 53 120 -306 61 132 79 172 79 -230
6226b30J80P4L9j86J48J38Q3j56j55K32Q3k38J02M1j77j8J52M2k92k02L40p3p6
6249a49K2J99p8J90k03R3J4L9L0j88K1L4RJ93l58O7J58k66l0J82k1K4J16n9k20
6274a81L11k43r8J24R3j78K05l0o1R8R3k21K84N4m56Q9R6o5L61j62p3k86Q2J4
6298a50K35j34L03k88K91k13k6k11N71m02J29ok30J78J23o2k81K55j30p3q2J33
6320g0k5P7k41L31Pk23M42m10J51k89N37k03j25N2k9K9Q9O0R3k88M5j2j91K58
6344F5O6k14J7L25k79l32L31J29k14M49k38k22K60j64j12K17k01j00K37K02j57
6365F5k0P6j72Q9J33j45j07j7J51l5rk19J33j96K68l8K65r9n1l50K69O7m8O8j22
6390d4J9J28j3Q3R0j83j56K67k05K38j15j26K49o2J66k16k58R8j95M78r3j86L18
$$ plain form
6226 -230 -50 24 63 -123 25 163 246 90 -65 167 250 12 114 155 -22 -40 112 154 -138 -340 0 -73 -149
6249 -149 -127 72 -6 184 -19 74 88 127 157 -31 -10 24 33 226 -132 -65 93 -173 -203 -21 -42 -18 98 39 -181
6274 -181 130 -113 -211 -87 6 -172 33 3 -58 40 133 -88 196 250 -206 -117 -21 -86 275 113 40 -246 -164 -150
6298 -150 85 -49 254 -34 257 44 18 -193 378 -24 105 99 -131 47 170 108 -173 82 -48 -121 -203 -70
6320 -70 -95 -18 -259 72 79 -144 298 -112 39 -250 287 84 -41 11 -18 11 100 160 253 -35 10 -2 -193 65
6344 65 131 -83 -66 259 -20 -352 -21 108 -106 343 105 -117 143 -21 -133 84 -117 -217 20 222 65
6365 65 45 121 -51 38 171 26 -81 -98 53 18 9 -210 -77 -273 -5 -43 222 123 72 -278 -9 58 10 78 -44
6390 -44 -25 103 90 173 263 80 -76 191 -14 224 109 -17 232 170 336 120 -138 -40 -235 243 150 -36 282
6413B82m02O7J48j3J54j68j36o0K26r8O1M5n5q0r6L0Q9Q0j21j45n8J71q3J09J02
6438D9J39k50K03l19K0K78l81K87J08k53K10l16J26L1j40L20j27l0j40K07J30
6459A52k37L21O3j98k8j67J49J48k30J17r1L3RK99o97L79j94P1m0M58l54N1m7
6482c3%K05k22J9J71r8k71K91R9r5p8J09m0Rn4j39l41M12J96l4p9J41j88r8j4
6507a32J50r6L06n7L4m65J97o2J89k4L2k15K30l5k43J50k2RJ62j76P0j37L7K71
6531A73j13N1J97l59K24l8j97K83k45n0j32L12K8j66l7K64k04l0J06l07J75K30
6553A65r7k14K67Mk03k08M07j27O0j35L3O0m3j52K80R4k48P2k59K47ok60J66j45
6577b42K93k01M01m4k69O3JL9j14j34K25k54L28l21J50k44M30J3k11p7N1k6K99
$$ plain form
6413 282 -120 -53 95 82 236 68 -68 -128 98 0 61 106 51 -29 -125 -95 -6 74 -47 -192 -250 -79 -162 -53 49
6438 49 188 -62 141 -178 -158 120 -261 26 134 -119 91 -225 -99 -68 -208 112 -15 -45 -185 22 152
6459 152 -85 236 299 101 73 -94 55 203 -27 90 -1 32 41 340 -357 22 -172 -101 -141 317 -37 14 -33
6482 -33 -33 172 -50 -31 140 42 -229 62 161 66 -12 97 57 66 12 -127 -468 -56 140 106 27 168 -20 -118 -132
6507 -132 18 -78 228 171 205 -260 -63 -125 64 40 72 -143 87 52 -191 -41 -63 -54 108 -68 2 -135 -98 173
6531 173 60 111 308 -51 173 135 -62 221 -24 -74 -206 106 134 -32 -69 195 -9 -39 67 -240 -65 165
6553 165 68 -146 121 125 -78 -286 121 -6 54 -81 -48 12 -31 -183 97 191 -57 15 -244 3 -3 -263 -97 -242
6577 -242 51 -150 251 207 -62 1 2 41 -73 -207 18 -236 92 -229 -79 -323 107 120 -91 -168 -117 -143 156
6600A56K7r4q8J04k97k43L89J85l00L36J05k05j28oQ5O2k37l3j1J20K58n01N62
6623B46l53j60L38J91j40j54R5j66L55k16r2Q8N2m9j30J83l47L28L0K60m0m53
6645a34K61p2k21L04j01K34l04r6O9K05j78J85k26O0J29p0l31L76J9k6j60J01
6667B4Q1k59lQ0j41L77j69k7ok26N28k58J24o1Jk25K60j97j0j94K10p0n9L45j04
6692B1K24j63r6N7m3k02J64J37k51J71k4nP7j98M8n9n5J33J05L8kk15K43R8j41
6717F2k86K7P7K42J52k50k82J90M8q1K38r3k26P9J0K67j36k7L8r8K07m6o7N3l33
6742b35J92O7J30k5j24p8J02J94k11k2R3J13l05K33k18L80j59l40L83j01j24J43
6764H8n03L47l3n6L48m0j58J31p9M5o7J01l31K11K32m51M44j92p2J72j72j7K0
$$ plain form
6600 156 183 89 1 105 -192 -435 -46 139 -161 175 280 75 -53 -59 26 88 -149 -182 -193 -73 185 -316 246
6623 246 -107 -267 71 262 122 -32 63 -103 252 36 -56 32 84 35 -95 88 -259 69 99 359 319 -134
6645 -134 127 55 -166 138 37 271 -33 -129 -60 145 -33 152 -74 -14 115 45 -286 90 109 83 -77 24
6667 24 105 -154 -157 -77 -218 159 -10 -37 -43 -269 259 1 125 64 65 -160 100 -97 -107 -301 -91 -161 -220 125 21
6692 21 245 82 -14 43 0 -202 -38 99 -152 19 -5 -10 67 -131 -83 -142 -197 -64 41 79 77 -138 105 203 62
6717 62 -224 -197 -120 122 274 24 -258 -68 -20 -101 137 44 -182 -103 -93 174 38 11 49 -49 158 112 45 98 -235
6742 -235 -43 24 154 129 5 -73 29 223 12 -10 83 196 -109 124 -94 286 127 -213 170 69 -55 88
6764 88 -415 -68 -101 -157 191 151 -7 124 45 90 23 124 -207 4 236 -215 229 37 -35 137 -35 -52 -32
6787c2q7J95k43P1P1J9j60M36j35j44k81L94k95k7m2K93j60K92k13j17P7n1N4
6810h5J95J3m6j7l0N4K82k29k89J01J70l41L07Rk73M24p9l55J80p7R9K62j77J1
6834A09k52L02l5m02K92R1k27kj57J92K4m1J25J38k91J01K77j03o6j14l7j30J66
6857d0p5M50l40J08j9QR4j43L6k56Q3J3M0r9J38j17O8J36p0r6Q1P7k50M0L35k56
6883e4j53J39J11J66j31P6R8j82Jj72j36L04l11K15j07J58J4j02q2O3J39j11j47
6906b04K91K5Qj72R3J93m49M39j44m48J37J19lL96j63k71L8L01k63J08mK0q1M4
6930A0j38L57j33j08j27K84j93J9J68l39M13k84R7q2M0j31K20l8M7J39l70O8K97
6953B16l27K06j42J63r0m6m12M51K0j42L2k88J01L14P8l21J26J04j5R1l93N19
$$ plain form
6787 -32 -119 76 -167 -96 -25 -6 -166 270 135 -9 -290 104 -191 -218 -260 33 -127 165 -48 -165 -88 -139 -85
6810 -85 110 123 77 60 30 84 366 137 -152 -51 119 -222 85 94 -179 245 166 -189 -9 -86 13 275 98 109
6834 109 -143 159 124 -278 14 105 -122 -124 -281 -89 -65 -106 19 157 -134 -33 244 141 75 -39 -76 -206 -40
6857 -40 -115 335 -5 103 84 92 186 43 79 -177 -94 -81 -41 -140 -2 -119 -51 85 15 -81 0 77 -173 -133 202 -54
6883 -54 -207 -68 43 209 78 154 252 70 71 -101 -237 67 -244 -29 -136 22 36 -66 -148 -85 54 -57 -204
6906 -204 87 112 120 -52 41 234 -215 224 80 -368 -231 -112 -115 281 118 -153 -115 186 -77 31 27 47 -34 10
6930 10 -128 229 96 -12 -139 145 -48 -29 139 -200 213 -71 26 -56 -16 -147 73 35 82 221 -149 -81 216
6953 216 -111 95 -47 116 26 -20 -432 19 39 -103 -71 -359 -258 56 134 -187 -61 43 28 119 -274 245
6975B45l11k0J00l2j14K85p3J99k46k64P8j01K18L02l53j94K05j90L90m81J63
6996a94Q5k8L2L4K78l30Q4P7j21K5J95n2j42k22L51L0l33K03j22NJ9J95j49l2
7020a12NJ25n8R8j32p8M13l61L2J8J24J74l10q5L85k66j47Mk5Q3K27k9j85K39
7044A39j91k0PJ51m5j76OK31j41K24p0j57j42L02k25o9J51K37m9n5l18K33K5J31
7068A79P9l82N3L71l49J81p2k01L05l71J24q5J98l6p8L56O4m59JK01p4J56l82
7091b21J81L6J1L0m40M65k04Lk52Q58m89J15j57J75J80l93N5K33j07k8l10L54
7113I5J35j64J63k80k2K08k14K2R5J47o7k03J45j08P5k3K94l85L08m84J34QL47
7136B26k77N6j54J36j4J56k69l7L62P9l29K6J06m1l1n5J33J4m9j87K91j21q6k8
$$ plain form
6975 245 -66 -86 14 -18 -132 153 80 279 33 -231 -153 -254 -36 266 -87 -281 -76 -266 124 -357 -194
6996 -194 -109 -137 -105 -71 207 -123 -39 38 -83 -58 137 85 -57 -279 72 102 -231 -28 -150 -145 -126 69 -80 -112
7020 -112 -107 18 -40 58 -74 -152 261 -100 -68 -50 74 248 -62 -147 238 -28 -175 -171 -196 -113 114 85 -100 139
7044 139 -52 -72 -65 86 41 -135 -129 102 -39 185 115 -42 -184 118 -107 -176 -25 212 163 108 -210 23 48 179
7068 179 258 -124 -71 300 -49 132 60 -141 164 -207 -83 -168 30 -6 -84 272 336 -123 -122 79 5 161 -221
7091 -221 -40 -4 7 37 -403 62 -142 -139 -391 467 -22 93 -64 111 291 -102 -47 186 79 51 -259 95
7113 95 230 66 229 -51 -73 135 -79 -57 38 185 118 -85 60 -48 27 4 298 -87 221 -263 -129 -121 226
7136 226 -51 5 -149 -13 -27 129 -140 -177 185 264 -65 -39 67 26 -5 -60 73 87 38 -149 142 21 -65 -93
7160i3k4J10R2l22L19K60k70J75m24K9Q0L9j54k4J68k7j99K74q7J79o5L2j74N6
7184e0k05J11J06J69k7J66j56k74J74k1Q8r0J6k84l4N24k43J27j75N2l4rJ15N9
7208A05j68k4q9K29qq4J06n8k84O1L44n58M88L35p8k56J4k59L44q2q6N0J76l31
7232a13k0L10k7J78j74l98L13J52k34P9j59J34K35j91m66L59J25k16M9J59p5j76
7254a56J94L7J35l10J53k51K28K25m62L57k99j7J95O6l00Q5L62k86N6j8o5K46
7276A75j46N2j22Q3j06L97l19k69O23m06j21P9J53j20J10j84L08K3l57RK46k20
7298a12J88Km1l2J99k67j3j14J26J14M8l09n5K78j25J36K1r5K3J72n1l23K26q2
7322h6k47L55o2m63O01q1J03o6k99K9M59k82K04O2j18O6j78L2k54J53R8N0j24
$$ plain form
7160 -93 -117 -7 85 -237 82 342 72 247 -177 -148 -68 -29 -183 -207 -39 -66 -265 9 -78 101 36 68 -106 -50
7184 -50 -255 -144 -38 131 104 270 114 -160 14 -7 81 -9 7 -277 -311 213 -30 97 -78 -26 -60 -69 46 105
7208 105 -63 -87 -176 53 45 -39 67 9 -275 -214 130 -428 60 395 317 61 75 -184 160 78 -8 42 218 -113
7232 -113 -133 177 150 328 154 -244 69 221 -13 66 -93 41 276 85 -381 -22 103 -113 -64 95 20 -156
7254 -156 38 75 210 -100 53 -198 30 255 -207 150 -149 -166 29 95 -205 -120 242 -44 12 -6 -71 175
7276 175 29 81 -41 42 -64 333 14 -255 368 -38 -159 -80 73 -47 63 -121 187 210 -147 -138 108 -112
7298 -112 76 78 37 5 204 -63 -76 -190 -64 50 98 -211 -266 12 -113 23 44 -51 -28 144 93 -230 -4 -86
7322 -86 -333 22 -40 -503 98 17 120 54 -245 -216 243 -39 165 227 109 175 -3 29 -225 -72 26 76 -48
7345d8p3O1j5l2J9J68k84L03j03K59l04j60j52M30R0k99K13l5J39j54k37J08r0
7368a96J77K92j88R5j32J60l36M4J95k40K05j49j32R8qK49j68J52k63JM95k07
7390A44k35L5Q4l9J24j86l5r7J56J2J81j11q5j1n0om1L21l33k36M72j37J22K47
7414B96k44o6q2J03M4J43k24p3K31j43k49K71L82l20j19J89n2n9p8L58k36k3k96
7437b47L66m19M38k80J62M9J04j70J28pj82Q9o9N2jJ6j40K16j04j27J71R9l01
7460a57L9K82n1j14j11J72k2M0l16Q8M9j7L50k93o7jk67K38N4j9K10k66M35l82
7484a26J18j21NM59k33k77J64rL39l96K30J55m72m02L45J89m60Q41m41L19Ml57
7506a26j01R9J82K2j6k08J1k4m44P42K7J0p88Q14l82j77M24o0j42K33K7o9K4j25
$$ plain form
7345 -48 -121 -60 -75 -107 -88 80 -204 99 -4 255 -49 -209 -361 69 159 -140 73 38 177 23 -214 -106 -196
7368 -196 -19 273 85 180 48 208 -128 -84 111 -129 76 -73 -205 -107 -115 134 -34 118 -145 -144 351 144
7390 144 -91 -56 28 -11 113 -73 -108 -205 -49 -37 144 33 -52 -63 -113 -119 -160 161 -172 -408 64 -73 49 296
7414 296 52 -14 -96 7 51 194 -30 -103 128 -15 -264 7 389 69 -50 139 87 28 -50 308 72 49 -247
7437 -247 119 -300 138 -142 20 69 173 3 131 124 -58 31 -38 14 13 29 -111 105 1 -126 45 144 -157
7460 -157 -118 164 113 -1 -112 60 38 78 -238 -150 -101 -118 232 -61 -128 -129 -396 -158 -104 -123 87 -179 256 -126
7484 -126 -8 -129 -124 335 102 -175 -11 -20 319 -77 153 308 -164 -566 -221 -32 -492 349 -92 227 231 -126
7506 -126 -227 -128 54 76 60 -148 -137 -161 -605 137 164 174 -614 200 -182 -359 65 5 -137 96 123 54 78 -47
7530d7O9lj09l3L02q2j85J6n1J8K81O3L32l67k12k8k80L98q4l2m0L5k37K69j01
7555a08K52P6l62K73j08j82K19pl1J16j00Q9j92pJ10q7J04J73k65J15l7l30L84
7578I5k39N8O9K3o0J66Nj17L4r3Q9J28j76o1K61k8p3J17j51j57M31l14p8J30j0
7603D9J08k76R9K61k98K6P6l38J77m7L0N5K75j93j9k4J21j77o3L14j76J91k44
7626g3J27j75k26J47K43J20j37J64j67j8j24J26r4K13j82L00l79M5K77r4m5k75
7648b27L19m12N00j9m2j59j43J9L54l92K63l7k9j54J41J10j79J59j00k0O2J81
7670A95l65L00m42N03j42J5j42J86j23J27mO0j46Rj39NJ50m8o4k9o6R6J91R2j56
7695F3N5j43J01R3k38k01N35j42o9K4j77J89j25r1J32L8J20Jj01jJ09j5k09j99
$$ plain form
7530 -47 22 19 -90 -123 179 97 -88 -72 -123 -105 176 239 571 204 -8 -36 -316 82 -2 -34 -74 -39 -276 -7 -108
7555 -108 144 220 -142 131 23 -159 60 53 22 138 38 127 -65 -72 38 -49 55 228 -37 78 41 -289 95
7578 95 -144 -86 -17 6 -54 112 117 0 34 -59 30 158 -18 -79 182 154 81 198 47 -110 321 7 -71 59 49
7603 49 157 -119 -20 241 -57 -31 45 -293 -116 -163 -133 -78 197 4 -15 -39 82 -95 -158 156 -20 171 -73
7626 -73 54 -121 -347 -200 43 163 26 190 23 5 -119 7 -87 126 -56 244 -135 -90 187 93 48 -227
7648 -227 92 -320 180 161 119 -40 -183 -164 190 -202 61 24 -5 -159 -18 92 -87 72 -28 -48 14 195
7670 195 -170 130 -312 191 49 64 -78 108 -15 112 108 168 22 31 -108 -103 47 -1 -65 -94 -160 -64 127 219 63
7695 63 118 -25 76 169 -69 -270 265 123 54 78 -99 90 -35 -126 6 44 164 165 64 63 172 157 -52 -251
7719b51L07R0k19M4K56j38k79K05l4L0J02j27j5O5m9K12k97J92n9l46K27M9R6
7742F1l2k47JJ56j43K96k89L66k85K62j63j5J28j83P8k7M6p7P0k57L79j83j62
7765b20J27KJ3J16P4j67L7o4J27P6k05J5J12k62J56K95J01j86j49Q5j13l3j47
7788b10M80l08j36M14k54J86k26M5r9J5K0oM6L20r1k50L9Q4j55J53j19j73P6L53
7812B04j01n7k04L34l23o1N07o04K25k98N46j47j68ML8J06L0r4R1j19K17q8j39
7835a01J57q5n2j07J20J03r1K3j22L92k09m7K34k11K9j15M0K30l00r3L25%k29
7858a09R1L04j34l54K82M2M4k34q8M27k92N8K18k40r9R7r7M0j8K0m7J63K50l89
7882f5J5J12r9O2l6K8k2K8j89K84k20O3j03J22k09J46K25p8pk37L33P7n3k35M93
$$ plain form
7719 -251 56 146 -73 -29 227 89 -190 15 -19 11 113 -14 -29 36 -13 199 -98 94 35 -311 -84 -35 61
7742 61 29 -218 -217 -61 -204 92 -197 169 -116 146 -17 -32 96 -87 -9 -36 10 -67 3 -254 125 -58 -220
7765 -220 -93 -91 -78 38 112 -55 -18 -82 45 121 -84 -69 43 -219 -63 232 333 147 -2 83 -30 -63 -210
7788 -210 270 -38 -174 240 -14 172 -54 -9 -108 -93 -73 -79 -33 287 196 -54 -15 69 -86 67 -52 -225 -149 204
7812 204 103 46 -158 176 -147 -208 299 -305 -80 -378 168 21 -147 -143 -105 1 31 -63 28 -91 126 38 -101
7835 -101 56 -29 -81 -188 -68 35 -56 -33 -155 237 28 -19 215 4 33 -82 -42 188 -112 -205 120 120 -109
7858 -109 -18 286 152 -202 80 122 166 -68 -156 271 -21 37 255 15 -84 13 -84 -44 -62 -42 -89 74 324 -65
7882 -65 -50 62 -37 25 -11 17 -5 23 -166 118 -102 -39 -142 -20 -229 -83 142 64 57 -180 153 230 177 -58 435
7907D35o09J32Kk37L01j73M33j17lq7k21J19j49L35n08K68O6m4K84M7k14J16j98
7930b2m3P8O7o0r1K59J30j07l04M46m85J31n9j85K36P2j05OK0k86o8K38q8M76
7954B56m85L86l10J12K89k32o3J28m06L77j84m2j01k8m4L82L2J65N3n21J03K69
7976A36j19O1j20J52j93L4N0k8p8N3K00j41J44l95M88n6J9l14n4J0M25l15M81
7999D40m63Q1j72M19m18k49L67L4Q9l38J99P8O1k70m3K94k02K7q6m5K8K11J36
8022A78k14Q6j23k9J66K3o8K3k17OR0J0J92k57J49j96L4J11Q7j23k3nJ1J36j42
8047i5J68J70k87k65L21Q2N9j72j88L66j16j58J12J34j80K95j54p9l3k7J26m88
8069d09L34J18k94J69j7J94j84K22J01k84J02J29k46O0N4L4K6m13M74p2j50K04
$$ plain form
7907 435 -174 -42 -40 -277 24 -149 284 167 164 77 -144 -25 -174 161 -347 -79 -13 -57 227 274 60 176 -22
7930 -22 -65 13 80 20 -71 188 318 211 -93 353 -132 -1 -60 -245 -9 63 -42 -36 -16 -302 -370 -132 -220 256
7954 256 -229 157 -153 -41 248 16 -47 81 -325 52 -132 -174 -275 -303 -347 35 67 232 285 -236 -133 136
7976 136 17 78 -42 110 -83 -49 1 -27 -105 -52 148 7 151 -244 244 188 207 -107 -161 -151 274 -41 440
7999 440 -23 58 -114 305 -113 -362 5 39 128 -210 -11 67 128 -142 -185 109 -93 -66 -152 -197 -169 42 178
8022 178 -36 50 -73 -102 64 87 19 42 -175 -169 -79 -69 123 -134 15 -181 -147 -36 51 -72 -95 -100 -89 47 -95
8047 -95 73 243 -44 -309 12 94 153 -19 -207 159 43 -115 -3 131 -49 246 92 13 -20 -47 79 -409
8069 -409 -75 43 -251 -82 -99 95 -89 133 234 -50 52 181 -65 -5 49 83 109 -304 170 98 -52 152
8091A52k16j23K37M8k32q4K41rr7L33k1k68o1p7J31p8l5J09p5J80j09J23k31r6
8115b58M11l62J57J62j35O1n5O7j00K07j21j59J84q1J06J07j83R0ro5L18k71O7
8138A38L4j01P2l03R5j45K29k6RL05m75J31J01j31p2K9r3J86Q9L92l91j00j41
8161a68J45l7L08k98J070q97j40J58o0j07R9o7J4j30L19j78j17J50P4k74K18Q4
8183A66k44M80m70j00K68k74Q9K41
$$ plain form
8091 152 -64 -187 50 98 -134 -218 23 14 -83 250 229 -39 -100 -177 -46 -124 -159 -50 -125 55 -54 69 -162 -258
8115 -258 153 -209 -52 110 -25 36 -19 48 -52 155 34 -125 59 -22 84 191 8 98 89 24 342 71 138
8138 138 172 71 143 -160 -65 -210 19 -7 2 307 -168 -37 64 -67 -139 -110 -203 -17 72 464 73 -27 -168
8161 -168 -23 -60 248 -50 1020 123 -17 141 81 -26 73 6 20 -110 209 31 -86 64 138 -136 82 166
8183 166 -78 402 -68 -168 100 -174 -85 156
8191A56
$$ Imaginary data points
##PAGE= N=2
##DATA TABLE= (X++(I..I)), XYDATA
0@%%%%%%%%%%qJ6j6J6k4L2m0M8n6P2q8J04j20J36j60J92k24K56k96L42l90M44
32B36n04N72o46P29q21R19j028J149j279J423j580J748j934K138k359K601k867
49a503L160l482L835m226M661n146N694o316P026p850Q817r969J1373j3130J5396
64H340j8443K2794k9548M1542o9225K52337J12963l03922J78890R49k13200n4986
76g1509P8164j27083m8891N0984l9304m6355J17369K6771m4043P3714Q0545k6782
88B3580N2207O1568k6956l670K9817m5163l9729p549k6266l6225k8272m5616j5145
101a07419J8084j2769j2914O0796L7697j7824M4140N6853k1439J4014M0342m2837
113E6724k0065M4144l3044n6585K8294k06p0311l798L2526m3170j5685N7270j0874
$$ plain form
0 0 0 0 0 0 0 0 0 0 0 0 -8 8 -8 8 -16 16 -24 24 -32 40 -48 56 -64 72 -88 104 -120 136 -160 182 -208 236
32 236 -268 304 -342 387 -434 485 -543 606 -673 750 -830 918 -1016 1122 -1237 1364 -1503
49 -1503 1657 -1825 2010 -2216 2445 -2701 2993 -3323 3703 -4147 4670 -5299 6074 -7056 8340
64 8340 -10103 12691 -16857 24685 -44540 207797 320760 16838 195728 196677 -16523 -71509
76 -71509 6655 -120428 -169319 -118335 -157639 -203994 -86625 -59854 -103897 -30183 50362 23580
88 23580 75787 137355 110399 106729 136546 91383 51654 44105 17839 -18386 -46658 -92274 -107419
101 -107419 -89335 -102104 -115018 -54222 -16525 -34349 9791 66644 45205 59219 99561 56724
113 56724 36659 80803 47759 -8826 19468 19262 -51049 -54847 -22321 -65491 -81176 -23906 -34780
126c4780l2814O3421L5119l8890K3136M7717k0174j3327K4206r288k5439L689
138B2576j0329l3353l272Q844j9717n831J6809m404j536J6484N492L432J0247
151E442O467R115L991n331O387Q005j3677j4951K760m292j8292j921O008j3761
165b4050k861J6379o780n672K3008N125r608J3366J0070r411M231J0544j2206
178A2135j0402J1145k876j9867M800R105j6018n310R891m508l636Q813J201q9
192e616P458M164j696L945N941m186n765L818j088o461k33j275l678r6j975j821
208h564K736K62O32K884J38O52M049K487m93q03J438J077k279k05q37l063R67
225A078j605n960P20L530j561q26Q82J740K387O28m29m6J707K207k762j827L870
$$ plain form
126 -34780 -67594 -4173 30946 -7944 15192 62909 42735 29408 53614 44326 18887 22576
138 22576 12247 -21106 -24378 -15534 -35251 -41082 -24273 -28677 -30213 -13729 -8237 -4805 5442
151 5442 11909 21024 25015 19684 26071 34076 20399 5448 8208 3916 -14376 -16297 -10289 -24050
165 -24050 -26911 -10532 -17312 -22984 24 5149 -4459 8907 18977 9566 13797 24341 12135
178 12135 1733 12878 10002 -9865 -5065 4040 -11978 -17288 -7397 -11905 -15541 -6728 -5527 -5616
192 -5616 1842 6006 4310 8255 14196 10010 4245 8063 6975 514 281 -994 -4672 -4768 -6743 -8564
208 -8564 -5828 -5566 -4934 -2050 -1912 -1260 2789 5276 4783 3980 5418 6495 4216 4011 3174 111 1078
225 1078 -527 -6487 -5767 -2237 -3798 -4624 -3742 -2002 385 1013 584 538 2245 4452 1690 -137 3733
242C733O87l178l79n96j609j53j466J55O67m85j17J297Q34R53n19J161K028j966
260A047l06J942k93j407l30p30N98o59o63M02o8l33m74j222J616P40j575J023
278f92K283r77j16R11J005n54j400n58jj75M47q94n73J697o50j395J073M01KJ45
298b1q43L17P40mN51l19j40N53k38oMl06Q9m47o47j84J54J62R56R6j606J499N66
321I26o92n35J17K86J15n36K6O57J23K34r27k31J087n63r15O71o3k87j22M54L50
342A75m06R0O73q36J93K68j36N54n03o29L65L13N6oQ2j66J16k86K0J72p61O44
364hK15m30L37l73L85M25m58m74K24K45R1j0l19L01j82l5N0k52NM68m85p2K71
387h1j15M04k76k86n5L07K95j14l03O74K54q37J40j05j88K98Nk28k17M15j27L29
$$ plain form
242 3733 4420 1242 863 267 -1342 -1495 -2961 -2806 -2139 -2624 -2741 -1444 -610 343 -176 985 3013 1047
260 1047 741 2683 2390 983 653 -77 521 -138 -801 -399 -467 -800 -1274 -2496 -880 -140 -1715 -692
278 -692 1591 614 498 1409 2414 1860 460 -98 -99 -274 173 -721 -1294 403 -247 -1642 -569 -168 -166 -21
298 -21 -864 -547 193 189 740 421 281 834 596 590 594 288 377 -70 -717 -901 -747 -585 371 467 -1139 360 926
321 926 234 -301 -184 102 217 -319 -293 364 487 721 -206 -437 650 87 -828 -157 -220 -507 -629 -175 175
342 175 -231 -141 532 -304 -111 157 21 575 72 -557 -192 121 177 171 253 87 203 -83 -63 109 -652 -8
364 -8 207 -223 114 -259 126 551 93 -381 -157 88 179 169 -150 151 -31 -66 -16 -268 -263 205 -280 -352 -81
387 -81 -196 208 -68 -354 -409 -102 193 79 -224 450 704 -133 7 -98 -286 12 17 -211 -428 -13 -140 189
409A89p3j07k7K0R4j64J54J63r4l36P1O7L2J94l82K4j7k0R0J28l76K16K3J56k03
434a78K11N0j9l2L20l94j17L84M7m49J20k20J56K26M9m21M0N26l95r2N5L76m30
457a87J0K32J5K02L9l45j25K00j81O9P3j73L1R1l3J51l4q2m3j4n5m6MN47n60K01
483a3J80q0k15K5K58r8OJ19k80J16l67O41j92l85L47n55L44K66k91J63O8K48j70
506A35l09L59j2j86j3J2N0o7pk13K84K9j35j02J06k0K38n2mj74L46j92J2o2K15
531B38k29j58J19j80J97n4N3L6K1j48J30Q2o5n3K84m17O25j72n13K21k07K50j40
554h0LR2j21j5J23J33m05N7k37L92K88k98J62k54K06j21L7k41L15l3K2j16J66
577G5j20K81l48K65nl94L1M27n67K94J74j37K85j96j13Rj43j41K53L57j62k76
$$ plain form
409 189 116 9 -18 2 96 -68 86 249 155 -181 -110 -43 -11 183 -199 -175 -192 -212 -122 6 -370 -154 -131 25 -178
434 -178 33 83 64 32 352 -42 -159 225 272 -177 -57 -277 -121 105 154 -267 -227 299 -96 -188 -133 243 -187
457 -187 -177 55 70 272 311 -34 -159 41 -140 -71 2 -171 -140 -49 -82 69 35 -47 -90 -104 -159 -205 -201 346 -214 -13
483 -13 167 87 -128 -103 155 57 63 182 -98 18 -349 292 100 -285 62 -493 -149 117 -174 -11 57 305 135
506 135 -174 185 173 -13 -26 -14 36 -31 -38 -251 33 62 -73 -175 -69 -89 149 97 93 -81 265 73 85 23 238
531 238 9 -149 -30 -210 -13 -67 -14 22 43 -105 25 107 42 -11 273 -144 481 309 -204 17 -190 60 -80
554 -80 -77 15 -106 -121 2 135 -270 -213 -450 -58 230 -68 94 -160 46 -75 -38 -279 36 3 25 -91 75
577 75 -45 236 -112 153 148 -246 -215 212 -355 -61 113 -24 261 65 -48 -39 -182 -323 -70 287 125 -151
599a51OJ70o2l5k16K04n3J90M3k3J11m8q4l46K38j2j4J75k24K47r9J00j81P3Q4
624I3k21lj06L79K86n67L6L34q7l58M02jj42K93k07r0j25j09L71m4j27r0Q1O3
648F1j39k7J46j11K10k96K34k99L84j55k19K34j10l5K74j73n0J16K07m57L31j55
670b9O0n4L26l41K5K8R3l5m0m59L99Q4q5j77J12K06j71K22q6L0l96M43J75m58
694a28k4L84l22J39L2j17r6J87m7k00K11j02J41q3J2q0J95k43M0J71j4k0k64L32
718A04l4O4j82K9K12m06K63n1j65K19o5K92l74M6k2J11j4J10k97K80M7k93M99
741C73l60K50n11K66q4N3j03J19j09J00q3J4J76j21J23k36J60K47k48j92J69k3
763b0Q4j50N4o2J68m9J09k73Q8J14k40J10L15l79JK24q3j6J34p1k09q0L84K23
$$ plain form
599 -151 -145 25 -37 -72 -288 -84 -137 53 96 73 184 136 52 -294 -56 -68 -82 93 -131 116 17 117 -64 9 93
624 93 -128 -131 -237 142 428 -139 -103 231 144 -214 188 187 45 338 131 41 -84 -193 178 134 7 -83 -2 61
648 61 -78 -105 41 -70 140 -156 78 -221 163 8 -211 23 -87 -122 152 -21 -71 45 252 -205 126 -29
670 -29 31 -23 303 -38 -13 15 108 73 33 -426 -27 57 -28 -205 -93 113 -58 164 78 108 -288 155 330 -128
694 -128 -152 232 -90 49 81 -36 -132 55 8 -192 19 -83 58 -25 -13 -93 102 -141 -101 70 56 36 -228 104
718 104 70 134 -48 -19 193 -213 50 -1 -166 53 -12 280 -94 -48 -70 41 27 137 -160 120 167 -126 373
741 373 13 263 -248 18 -66 -13 -116 3 -106 -6 -89 -75 101 -20 103 -133 27 274 26 -166 3 -20
763 -20 64 -86 -32 -94 74 25 134 -139 -51 63 -177 -67 248 -131 -130 94 11 -5 129 58 -151 -231 153 376
787C76k19l3N4j1q3p9P9j63P3k1j19J99N2k02K20k98L45k91k0L47l96M33l61K55
811A37J74m46K71k48K10J54Qj60m06M03k2j74o8O5j59J34K78m5j80J96j29q3P6
834a4J15Kp9j16pJ80p9J25j70J02L67n49KN4O1J8m8n7L97n02M03j48P1q7K33L2
860C06k04J92j48m00K71J88j87J54j15l3j53k9M70j35j50k05K16rj33N3m6m3o8
883b08K10j62K61l22L08o1Q5l6j24K5k1j10L81r5j71Q5O7k55r8N6J18j31L92k17
907b3j74K64Q1k83J89n7j21P4J86k41K3Q8K35j22k69J31r7J05L3J08n0j75QK44
931A57k04j38P6p9lK41M2j42j7J43k68K49l5O2q6r1P2J32K7k92k75L65R7m5j14
956a26K70P3k06m5q2K01J39k91j79J54m6J8K32K3n72M73O6kk07R5j14J04n8L43
$$ plain form
787 376 157 124 178 167 84 5 84 -79 -6 -27 -146 53 105 -97 123 -175 170 -121 -141 206 -190 243 -118 137
811 137 311 -135 136 -112 98 252 260 100 -306 97 75 -99 -167 -102 -261 -127 151 106 -74 122 -7 -90 -14
834 -14 101 103 24 -92 -99 81 2 127 -43 59 426 -123 -121 -67 -6 12 -36 -93 304 -198 205 57 128 41 274 306
860 306 102 294 146 -254 17 205 18 172 57 24 -129 -158 312 177 27 -178 38 29 -104 -51 -97 -140 -208
883 -208 2 -160 101 -221 87 26 111 75 -49 -24 -45 -155 226 131 -40 45 112 -143 -241 -185 -67 -198 194 -23
907 -23 -197 67 148 -135 54 -3 -124 -50 136 -105 -82 6 241 119 -150 -19 -116 -11 22 130 80 -95 -87 157
931 157 -47 -185 -109 -188 -191 50 92 -50 -67 76 -192 57 22 84 -2 -93 -21 111 138 -154 -429 -64 33 -12 -126
956 -126 144 217 11 -34 -116 85 224 -67 -246 -92 -138 -120 112 135 -437 36 102 100 -107 -12 -126 -22 -80 263
980B63l42O9lJ5M3K3k09L0K95k55Q0j54J09K82l02J31J24j96j51J26R7qj7M4k86
1005a92M18k82j77O5J37J93l68J69m6J82j36R9Q8j68J0J9k2J54k4l11K84k92K74
1028G4J54j98K12m57J82j6P0p3k5l5l5J43Om4j30K87k04P0J30L9k21%J63j23J58
1053A27j40L12l62Q2k82K06J34J86j61K99m32K0K07k67j57L94M7k55j34p7K29
1074b4m17L03J1K37k41L10k62J60p8J05J73p3j60Oo2m1j50R8J0K3o4K35J10k49
1098d0K41j85J55n9k80L52K9l19L43j98K25l97j3j0N2K39J47p7r0n1j49K03M3
1121A61k44M21l39j64p2J85jK83J7j96K40j53m08R9NO6kk9J14J64j19l1k50R2
1145a61K71j50j31j47L19J41l37L76k26o3K14p0J66m41K45j11r9m5J87m6K69l19
$$ plain form
980 263 -79 -10 -13 2 45 68 -141 -111 184 -71 9 -145 -36 246 -56 75 199 3 -148 -22 75 67 50 94 -192
1005 -192 226 -56 -233 -168 -31 162 -206 -37 -83 99 -37 62 150 -18 -8 11 -11 143 119 -192 92 -200 74
1028 74 228 30 242 -215 -33 -49 21 -52 -77 -112 -147 -4 2 -42 -172 115 -89 -19 111 150 -71 -71 92 -31 127
1053 127 -13 299 -63 19 -263 -57 77 263 102 401 -31 -11 196 -71 -228 166 213 -42 -176 -253 -24
1074 -24 -441 -138 -127 110 -131 179 -83 77 -1 104 277 204 44 50 -12 -53 -203 -105 -95 -72 -136 99 209 -40
1098 -40 201 16 171 112 -168 184 213 -106 237 39 264 -133 -146 -156 -104 135 282 205 115 64 -85 118 161
1121 161 -83 338 -1 -165 -237 -52 -53 230 247 51 291 138 -270 -171 -166 -100 -102 -131 -17 147 28 -3 -253 -161
1145 -161 110 -40 -171 -318 1 142 -195 181 -45 -108 106 36 202 -239 6 -105 -204 -249 -62 -108 161 -158
1167a58K4J11J6k64M54k67r7J34RL4J7O6N0j75J00j78J25pj9j47M13m1k98j86
1191b84k7L25o2K2k26K72J39j89k3J54r5N0p3n4j92J15j5J99j00j40K9j26K09
1214i2J25K31l34p2J29k47L21j77q3K27j32K9J85l6j75j4R4j00q3M51J27m33K04
1237A45j39MJ74o1j03l4Q1j14m4L03n85N50j0l8J61l37J40j80K61k48j76N44m26
1260a32L22p3k34J86j67K54j34QK57l19j83K56m84M07J45j78o3Q4J2K07j67J80
1282A84j53k18P8J40K38q8k84J17L5k62K65j47J86P9L1l90M05k03J88m30RM01
1304A81k86M0o5J86k9j31K61j58r8j77M26k16K01l62J08J17N1J51k75R7j3j12
1326a03R7K87m44M42l42P7j86K71J13j26k09J85j14K33l5k73K06p1J39l98J04
$$ plain form
1167 -158 -134 -23 -7 -271 183 -84 -181 -47 -38 -4 13 79 129 -46 54 -124 1 -6 -25 -172 241 200 -98 -284
1191 -284 -311 14 -48 -26 -252 20 159 -30 -53 101 6 56 -17 -71 -263 -148 -163 36 -64 -204 -175 -301 -92
1214 -92 33 264 -70 -142 -13 -260 61 -116 -199 28 -104 -75 110 74 -101 -115 -21 -121 -204 247 374 -59 145
1237 145 6 10 184 123 20 -14 67 -47 -91 212 -373 177 167 129 290 -47 93 -87 174 -74 -250 294 -132
1260 -132 190 117 -117 69 -98 156 22 30 287 -32 -215 41 -443 -36 109 -69 -132 -48 -36 171 4 184
1282 184 31 -187 -109 31 269 181 -103 14 49 -213 52 -95 91 170 201 -189 216 13 201 -229 -220 181
1304 181 -105 -65 -130 56 27 -104 157 -1 -99 -276 150 -66 135 -227 -119 -2 49 200 -75 22 9 -103
1326 -103 -6 281 -163 279 -63 14 -172 99 212 86 -123 62 -52 181 146 -127 79 8 147 -251 -147
1347a47K76l78J47L44l83R6J92m88M25%m7n8k3J32j24J45l4r9N3j14jJ27k76K22
1371a3j12j64M81l89J73J09r3J1J83j07j57K18j12l0r7j15K48J55p3k59N5K86
1393A98k20P8k06JQ7m1Q0k2q9K3j28M09n22M59j90K32l31J61R2n1K06j73nq8l9
1418g9j31O4K85l16J39M1j07J35n1j16J47O4l9k70L59M2r2l6L77l99J37k28K05
1441A31j61j2j17L1L09k46l3L1n8L47l49J64j11k2j21J85N7m0l3K05j37q9O7J11
1465A09j4l9J30rj83p5J91J00j47p5j27J8J21m1o7PK18l42J34j61M58j29m06M48
1489A19j00L2J58k87K89l75J67r3J71N2j91P8l97M19O8N3rj07J00j82m3r3Q97
1512G26j21p18M2J54q1r9J0J40j6j45N3J92j35l7J32pJ16k28k19N7O8K90k4l00
$$ plain form
1347 -147 129 -249 -102 242 -141 -45 147 -341 84 84 37 -21 -44 88 -36 109 75 -24 29 -85 -86 41 -235 -13
1371 -13 -125 -289 192 -197 -24 85 -8 3 186 79 -78 140 28 -2 -99 -214 34 189 116 -143 -88 198
1393 198 -22 56 -150 -149 -62 -103 -23 -45 -134 -111 -239 170 -352 107 -83 149 -182 -21 71 20 226 53 48 -40 -79
1418 -79 -210 -146 139 -177 -38 3 -104 31 -20 -136 11 75 36 -234 125 167 75 39 416 17 154 -74 131
1441 131 -30 -42 -159 -128 181 -65 -98 -67 -125 222 -127 37 -74 -96 -217 -32 25 -15 -48 157 20 -69 -2 109
1465 109 95 56 186 177 -6 -81 110 210 63 -12 -139 -121 0 -41 -108 -101 117 -225 -91 -252 206 77 -329 119
1489 119 19 51 209 -78 211 -164 3 -90 81 133 -58 20 -377 42 110 163 154 47 147 -35 -78 -171 726
1512 726 605 -113 -71 83 2 -97 -87 53 37 -108 -55 137 2 -35 97 90 206 -22 -241 -184 -116 174 150 -150
1536a50J82o2R0j40J9k51L42o4j87J82q2J99m7j9k60J14K77k34N3L17k77j36J19
1559a5P1m2nJ98q0qq3l13N27J5k89k51R5l6Q3J33Q8J21j93j05J26L66j70k74j77
1584b18LK16O5jr9O7L0j33k27J73P1O0k23K87rk61J33J46k56J26m0k88M94k85
1608a69k5j94L11K58j90k24j81M19J26l9r9m3J53l01K25J79p7l9j82K58j17o4
1630a5j80J71q3J55k76N0K70k38L90j18k15o6R7J19N5k00J53j7j16L46j46k76
1652a40J52J77l09J57j68m9K40R2r0q4J9P4m50N91q3q7J60k60m6J10l0J27l8K8
1676I3j07j06K4J26N5p8k49J50k3RJ03j36K32j38q4m1q9L56L3r4R6j01j13J36
1700E4l01K09J41k98K75m1Ko5m3q1J92k93J69p3j60L46k43J04Mk5J20N3j53qj30
$$ plain form
1536 -150 32 -30 60 -80 -61 -312 30 -34 -221 -39 -121 78 31 12 -248 -134 143 -91 -38 279 2 -134 -15
1559 -15 56 14 9 207 127 119 36 -277 250 265 -24 -275 -180 -216 -133 0 88 209 16 -89 37 403 233 -41 -218
1584 -218 -215 1 66 65 -34 33 63 -70 -297 -124 -53 7 -216 71 62 -199 -66 80 -176 -50 -90 -378 116 -169
1608 -169 -194 -388 -77 181 -9 -233 -414 5 131 92 -7 -50 103 -198 27 206 129 90 -92 166 49 -15
1630 -15 -195 -24 -107 48 -228 -178 92 -146 244 126 -89 -155 -58 61 116 -84 69 52 -64 282 136 -140
1652 -140 12 189 -120 37 -131 -180 60 152 62 -22 -3 71 -379 212 129 42 202 -58 -104 6 -24 103 65 93
1676 93 -14 -120 -96 30 85 7 -242 -92 -115 -106 -3 -139 93 -45 -129 -170 -259 97 130 36 132 31 -82 54
1700 54 -247 -38 103 -195 80 39 41 -24 -67 -148 44 -249 -80 -153 -313 33 -210 -106 -102 -127 -7 46 -107 -115 -245
1725b45L17m09l4Q24k94j86K21k68k5k91O08l3K61p16K58J10n89M41M09l16P3
1746A16p99N2N65n75M74K66k83K19j57l44N13q5l38M29j64m6q3N21n87L84p9O4
1768F3p3q6Q7o3j08K03Lk99K23Q7l7r7K1J92k13J53M2r9J00m1J76j1k18p4L9R7
1794F7K8J10r3j17n3J05J97j94k75k8j48P38n83L28R6l84j42J94Q7Pn8J93k03
1817a28J47K7j69L96k73k4o8J83j29j26K48Q8k92L06o3j61mL9o4L2J62k77L07
1840A57O1n4m01M88j32l34L82l48J27L10l20J20j18k15R8j5K21J00K2l17J07J11
1862E0N2j08L6j73qJ88L7j66K4K06j10L8M7l4j01Q2J47k76k6l2N1N00k35j62j31
1887a04Q1L4r5Q5J59k08J40j58K03l19K17J36l60K13m5j44K29M6m1J32j61p9n3
$$ plain form
1725 -245 72 -337 -371 453 159 -27 194 -74 -99 -390 218 185 446 -270 -12 98 -491 -50 359 43 116
1746 116 -683 -631 -66 -641 -167 99 -184 35 -122 -466 47 -38 -376 53 -111 -157 -240 281 -306 78 -1 63
1768 63 -10 -96 -9 -72 -180 23 26 -273 -50 37 0 -97 -76 116 -97 56 98 -1 99 58 234 223 5 -69 -30 67
1794 67 95 205 112 -5 -58 47 244 50 -225 -253 -401 337 -246 82 178 -206 -348 -154 -67 -60 -118 75 -128
1817 -128 19 46 -123 273 0 -24 -92 91 -38 -164 84 172 -120 186 123 -38 -42 -3 -67 -35 127 -150 157
1840 157 218 164 -237 251 119 -215 167 -181 -54 256 -64 56 -62 -277 -179 -194 27 127 149 -168 -61 50
1862 50 102 -6 30 -143 -151 37 74 -92 -68 138 28 66 113 79 -22 60 207 -69 -95 -127 -76 424 189 27 -104
1887 -104 -23 11 -84 1 160 -48 92 -66 137 -182 35 171 -189 24 -21 -165 64 110 69 201 40 -39 -92
1910i2J21m3K04l91J2K05k8l74M72J68k24k86K25j66N2L89m6j79k4pr7K14n8m
1934D3k15K24M1J54j45j27p4j38J78J11j23J83L21o95J98K50k73J68j62j29K12
1955BJ30l29J81N5j23n1L5J64j94RK51j3M4K98m75J54j81J72k3R4j58o2P5K05
1979B60k20j96K76N8k14p5j59M45j36J40j17k69o5L80j39P8oM4k44m5J08j1J61
2002E4O9Jj43%K22j68J00m15J83j40J35n5N1o1K30k18K79J54j88K67n10K46j84
2025i1J61j80M28l32r4O4j2Q5J21J82l22J97j84o2J18N8k12K85P5j24K8q6l15
2048b12L14l8K8j45K35l21N7M8O7L7p3R1L5m8J13j01J09l80J02j65N67l62J87
2071A45o9Qk13K55J39l75p5R9Q5q1R9k52K25k84k0M21l59L31l03J65J8l3K17J4
$$ plain form
1910 -92 29 -14 190 -201 -189 16 -12 -386 86 254 30 -256 -31 -197 -145 244 198 19 -5 -12 -109 105 47 43
1934 43 -172 52 93 247 102 -25 -99 -237 -59 52 -71 112 433 -262 -64 186 -87 81 -81 -210 2
1955 2 132 -197 -16 39 -84 -135 -100 64 -130 -121 130 117 161 459 -16 138 -43 129 106 200 42 -20 55 260
1979 260 40 -156 120 178 -36 -111 -270 175 39 179 62 -207 -272 108 -31 47 41 85 -159 -204 -96 -107 54
2002 54 123 124 -19 -19 203 35 135 -280 -97 -237 -102 -157 -106 -167 63 -155 124 278 90 357 -153 93 -91
2025 -91 70 -110 318 -14 -108 -44 -56 29 150 332 10 207 23 -39 79 137 -75 210 285 161 189 103 -212
2048 -212 102 64 92 -53 182 -139 -82 -34 33 70 -3 88 123 75 188 87 196 -184 -82 -247 320 -42 145
2071 145 76 84 -129 126 265 -110 -185 -86 -1 -82 17 -235 -10 -294 -314 107 -252 79 -224 -59 -41 -74 143 157
2095A57j55M9l6j52k48L93j38n0O0K10k47K27j56K49l3j66Q8k30K04j01J07k14
2117a82K86j43kp6J76m7j1J82j70J44k35J25r2P7o46k72O73M56n7r2o6j64K2J87
2141G3k0J51m76J30k5J69K26m72K98j70O6J95jm22M63j27l28L91n7k63K11J0L67
2164C89j16m86j4L76k02q8J39M2k10K95j11J3k1j57M5N5o1N9n2K86K2m64R1L15
2188A45j79K26p5q8J58j83J62k22J05ok68P8P2l04L24J69l1k25J61j1k11QM99
2211C04k33J24j04R9l28L05j78j06R1j97K59k15J87L4j61K08j83L16m91L76J00
2232B07n18M90o5m27L56M5%j15k55K09J50J5o5j50M9J36k6O7N0j19j56K21J25
2255B24l15O0j15N6J55j2J7j38o4J73n5J02l31L09Q0m56L62R8j46J1J24j64J1
$$ plain form
2095 157 2 51 15 -137 -385 8 -130 -180 -120 90 -157 70 -86 163 130 -36 52 -178 26 -75 32 -182
2117 -182 104 -39 -41 -117 59 12 1 183 13 157 -78 47 -45 32 -614 -886 -213 243 186 94 28 -136 -114 73
2141 73 53 204 -272 -142 -167 2 228 -244 54 -116 -50 145 144 -278 185 58 -270 121 64 -199 12 22 389
2164 389 273 -213 -227 149 -53 -141 -2 40 -170 125 14 27 6 -151 -106 -51 -112 -53 -105 181 203 -261 -170 145
2188 145 -34 192 117 29 187 4 166 -56 49 43 -225 -147 -75 -379 -55 114 83 -142 19 8 -203 -195 304
2211 304 71 195 91 190 -138 167 -11 -117 -26 -223 36 -179 8 42 -119 89 -94 222 -269 107 207
2232 207 -311 179 114 -313 43 88 88 -27 -282 -73 77 92 27 -123 -74 62 36 103 153 34 -122 99 224
2255 224 -91 -31 -146 -90 65 53 70 -68 -132 41 -14 88 -243 66 146 -310 52 150 4 15 139 -25 -14
2278a4l8J80j58N4J10mP9k69J95j02p4m74M33P8k82L48l9Q6l68M01k54r1R0J04
2302iq8P6Q4R7l64L28r7K19j68J16m78R6K82k28L83l43J37k33J33ok19L28J87
2325B33j60j59J74k25K24M2M8J4m65K81J76J8m1j10J90j84m1r8J47l88L55L2R3
2348A56Lp4K3j69l7K3K92l98J3OK88l78K47m5M8J37k56J4J33k83K9L95l23J85
2372B9l5k79J79K7k2P9J09q7J23p3J2QJ38l85K26J21l9r5j56q7L0K8L87l87L66
2397B17o8P5k93o6J13J67k44Q6Q7K32k86J14J24n17K01P7j73m8K77J43N8M3p71
2420d52M89J69l87K17l3M5J0Kj37J04J78j94N9L5k29K10Q5J70o59Q4L39r8q1K97
2444B23j15o4J14l45J13K38m17M87k53J37J05j32j49lJ88k01j2K13j60j36L76
$$ plain form
2278 -14 -52 128 -30 24 134 130 209 -60 135 33 -41 -515 -82 -4 -286 62 23 109 -259 142 -112 -203 -113 -9
2302 -9 -97 -21 63 160 -204 124 27 246 78 194 -284 -188 94 -134 249 -94 43 -190 -57 -63 -282 46 233
2325 233 73 -86 88 -137 87 129 177 191 -274 7 183 201 160 50 240 56 15 -83 64 -324 31 63 156
2348 156 159 85 108 -61 -98 -75 217 -181 -168 -162 126 -252 -5 -50 -2 135 -121 -107 26 -257 -228 167 -156 29
2372 29 -6 -285 -106 -79 -101 -22 87 0 123 50 62 70 208 -177 49 170 131 36 -120 -207 -177 -149 238 -149 217
2397 217 149 224 -69 -135 -22 145 -99 -13 74 306 20 134 258 -259 -58 19 -154 -202 75 218 276 319 -452
2420 -452 37 206 -181 36 3 48 58 60 -77 27 205 11 70 105 -124 86 171 341 -318 -234 105 7 -74 223
2444 223 108 44 158 -187 -74 164 -253 234 -19 118 223 91 -58 -61 127 -74 -86 127 -33 -169 207
2465B07q2j51M6o4l8j49J27Q7L6n7j22K36J2J72k15J5q8k66P9L54k81J83j37J82
2489H6l3j28K10j41j92J18N5J31l0Q9j50j08J83o36N98n0k3k9M9j48K24j42P5
2512HR1n22J14M87l16O20n35K89j53k0j90K00J36k9l58K44l1J67k49K01j25J7
2534D6l42K73k00J65J7L14k61J70l49P3J29p6O9J90m28L9Q1L6Q1J42mj28K0r4
2558c7O6j27j36l8R8N56k48O4k41n6J35j42J98o6m8K29k62L6n7J76k17P2J2J34
2582A01r3k22Q9j93K7M53K41l37l1N5n4p4J14l82K56J04j65K62l07K03L0n4j81
2605a58M9J70J19k84r8K41k7l21M44o5j80j46K94m5j14J78J12j98j50K05k9l6
2627c9l0J21l99L53j89N1M02l10Q5j01J20l35K42J30k60K5K71J57l93J25J3rj75
$$ plain form
2465 207 125 -26 20 -44 -82 -231 -104 -17 19 -38 -160 76 88 260 45 60 -28 -294 -215 139 -142 41 -96 86
2489 86 53 -75 135 -6 -198 -80 -25 106 76 165 15 -93 90 -546 52 2 -21 -50 -1 -149 75 -67 8
2512 8 99 -423 -309 178 -138 482 -53 236 83 63 -127 73 209 180 -178 66 35 202 -47 154 29 46
2534 46 -296 -23 -223 -58 -41 273 12 182 -167 -94 35 -41 28 218 -210 -171 -90 -54 27 169 165 37 57 -37
2558 -37 29 -98 -234 -272 -174 382 134 198 -43 -99 36 -106 92 26 -22 207 -55 -19 -76 100 -117 -45 -33 101
2582 101 8 -214 -125 -318 -291 162 403 66 35 90 36 -38 76 -306 -50 54 -111 151 -156 47 77 23 -158
2605 -158 -109 61 180 -104 -202 39 12 -309 135 70 -110 -256 38 -7 -121 57 169 -29 -179 26 -3 -39
2627 -39 -69 52 -347 6 -183 -132 270 -40 45 -56 64 -271 -29 101 -159 -134 137 294 -99 26 39 30 -145
2650a45N7L7j29L29k26K46j17j35LM1Q5k06R6L1m6mO2N7J94l43K54J10k85J37
2674A03J1k00J19m6P0q5j18J79o5J45K2k21J80k63j39J88l0L62Kk33J05j91L3
2697g2J12r5J53k55J83l23J23K63J17j03N3n8j60j38L04j04J18j45j18K63k33
2718a15P3p7j19J68J07O0k20J43Qp7Ol8K84k64O7K11j34k11M03l29JM6K01k85
2742i1j77L93j7j99J43j90Q6J74m17L21j37J30J36l96L0R0K26k18l9J53J16m2
2764G5k36j3m2P0K50m7j74K48j59O7LK45l9k88j18J39p1J52J21m30J98l0R7J13
2788A31q3O2P2k79K50j93j43K48J94l26P3k7K35m77L68pj31L44k38lp5K15l59
2811a49J30R4o1p2nJ86j15l4N6J83l03K3L46p0j45M8k95M76j53l76o4N13l38K18
$$ plain form
2650 -145 -88 -51 -180 149 -77 169 52 -83 -80 -39 46 -160 -64 -33 -79 -83 -21 36 230 -113 141 251 -34 103
2674 103 114 -86 33 -13 57 -28 -146 33 -32 113 135 -86 94 -169 -308 -120 -150 212 214 -19 86 -105 -72
2697 -72 40 -55 98 -157 26 -297 -174 89 206 103 156 98 -62 -200 104 0 118 -27 -145 118 -115
2718 -115 -42 -119 -238 -70 37 97 -123 20 28 -49 -43 -81 203 -61 6 217 83 -128 275 -54 -53 -7 194 -91
2742 -91 -268 125 108 -91 52 -138 -52 122 -295 26 -111 19 155 -241 -211 -121 105 -113 -152 1 117 75
2764 75 -161 -174 -216 -146 104 57 -117 131 -28 39 42 287 248 -40 -158 -19 -90 62 183 -247 -49 -79 18 131
2788 131 48 110 182 -97 153 -40 -183 65 259 -67 6 -21 214 -263 105 98 -33 311 73 70 -5 210 -149
2811 -149 -19 75 14 -58 -63 123 8 -26 30 213 -90 -67 279 209 64 112 -183 293 140 -236 -300 213 -125 93
2835I3k21N6l6o5L06q1j04k0j7j08L95n2j44J03j11J3L04l67J48p9J31j47M5m41
2859c99N59j06p3j62L32j18l22K68J3j08o2L02j76K88k46J22M8p9k89P4K46k19
2881a07K02j56j51J93j22K58o1K55l15k30K97j71J9P0j83J18R0R8l04K61m1k4
2903dj41j13M29k68J22R5%%k4K9j35j15J58p8K58K7j22k18M9j15J82j75J42n3
2927g0m3M04m50L28r0n1p6j02J21K39k82J95o9l2q8J97l20K8O1j92L07n0P5L9
2951G9m7j20P5J18N0n40K70J06n2K82j43m57L37J22N4k28J52K36q7k28n0j83K42
2974a2j42P1O2k7j92M29j15k49J17j51K12J01Q1j29J23j92J40q1q6O0J1l29K54
2997d4L81l26%rQ8l32J60K85l24P2K46k13P9R0k51J8R3o3p6L16j90j22K0M3O0
$$ plain form
2835 93 -128 -72 -108 -173 133 52 -52 -72 -89 -197 198 146 2 105 -6 7 311 -56 92 13 144 -3 42 -399
2859 -399 160 54 -19 -181 151 33 -289 -21 -8 -116 -178 124 -52 236 -10 112 160 81 -208 -134 112 -107
2881 -107 95 -61 -212 -19 -141 117 56 311 -4 -234 63 -108 -89 -19 -202 -84 6 104 -200 61 20 -4
2903 -4 -145 -258 171 -97 25 120 120 120 96 125 -10 -125 33 -45 213 240 118 -100 -51 -166 16 -159 -17 -70
2927 -70 -113 291 -159 169 79 28 -48 -150 -29 210 -72 123 54 22 -66 131 -189 -161 -100 -292 15 -35 40 79
2951 79 32 -88 -13 105 155 -385 -115 -9 -61 221 78 -379 -42 80 134 -94 58 294 207 -21 -71 -254 -12
2974 -12 -154 -83 -21 -48 -240 189 74 -175 -58 -209 3 104 185 56 179 -13 127 46 -40 20 31 -298 -44
2997 -44 337 11 11 2 90 -242 -82 203 -121 -49 197 -16 63 153 -98 -80 13 -50 -126 190 0 -122 -102 -59 1
3022Ap4o9K83K4L8q5k97P4K8J32l11M14o1k00K9j43J88R8J62l08m0K75l88J37
3046i3rn5J11N6K0k8M3k58Jj66L24L5j2p9o8J85n1J95j46j44L22P1j80J83l98
3071a41No4K03j61J13J06j25l9J3K81l1j88J22l0j7J3j86K21L41o07L32J4k93
3094a18K71j46K18l78O9J06K14j80K47m54J32j34J41J98k54M02k26L1j7j20l3
3115c1K59j25Q2l63K58P8k12K23k65O6m3N8rM8L5O9m4K13l61J4K75k24O7j02l70
3140d04L38j66K97J10j04P3k29o2L25j70k14K54r7J81O5j33l2j57K48k21J49J79
3162B30k60L0K06m5k52J30n2q8J57j07k9j57K24M2Q0o5k1K71m78K09K32m59J90
3185a2k24J42K04j67R5N8k44Q8O2O7m6k23Q6J11Q1m8K3Q1p8L24n27j20K02M82
$$ plain form
3022 1 -73 -142 141 165 203 118 -179 -105 -77 55 -256 158 97 -103 -74 -217 -29 69 231 -77 -117 158 -230 -93
3046 -93 -102 -157 -46 10 30 2 45 -213 -212 -378 -54 -19 -31 -110 -178 7 -44 151 5 -139 183 254 74 257 -141
3071 -141 -136 -200 3 -158 -45 61 -64 -103 -90 191 160 -28 94 64 47 60 -126 95 436 -171 161 175 -118
3094 -118 153 7 225 -153 -84 22 236 56 303 -151 -19 -153 -12 186 -68 334 108 139 122 2 -31
3115 -31 228 103 185 -178 80 158 -54 169 -96 -30 -73 -15 -24 24 59 128 84 297 -64 -50 225 1 68 -34 -404
3140 -404 -66 -232 65 175 71 144 -85 -147 178 8 -206 48 -49 132 197 64 32 -125 123 -98 51 230
3162 230 -30 0 206 161 -91 39 -13 -101 56 -51 -80 -237 -13 29 109 44 23 294 -184 25 257 -202 -12
3185 -12 -236 -94 110 -57 38 96 -148 -60 2 69 23 -200 -114 -3 78 30 53 134 56 380 -147 -267 -65 417
3209D17m18J24j45%K30q7j25l7m4j54J33L5j4o7J48l6J39J53l52J09M8j58J67
3232F6J31l37J52J68J06k07k38j14N31k56J32l07J70p0q4L9Q7o8L0K77m44N8J82
3255Dq4M8N7J05k61J58j90K23m31K72p9j4Q0R3J16j03j59L36J37m03j61J38k45
3278c63K67J76j51j20K13M7l07p3L07j53o2K65M5Mk29q9K64l31K82J38p2o4j80
3301a86K46p7N8j67l9K46j7l9j83K5j00N36m33L18j54k60K41k04K03j81L75j71
3323C7n5jj75K92j23L4M0L7M5j47O9J66l94J75q7J71L8mk45K86j24j03QJ8j58
3348b00M71n68J78j04J94k3K29j80N7Q2j49J75l64J95J13j34J33j5l52L63l21
3369b20L56n3j53K10j8j26J9q6J30j5J08k33J28j13j25r8K1O26o34M85j69o7j8
$$ plain form
3209 417 -1 123 -22 -22 208 121 -4 -41 -85 -239 -106 -71 -85 -152 -4 -40 99 252 -100 9 57 -101 66
3232 66 197 -140 12 180 286 79 -159 -273 258 2 134 -173 -3 -73 -157 -118 -31 -99 -69 208 -236 -178 4
3255 4 -80 -32 25 130 -131 27 -163 60 -371 -99 -178 -192 -112 -19 97 -6 -165 171 308 -95 -256 -118 -363
3278 -363 -96 80 -71 -191 22 69 -238 -311 -4 -157 -219 46 91 95 -134 -223 41 -290 -8 130 58 -6 -186
3301 -186 60 -17 41 -126 -165 81 64 25 -158 -133 -233 303 -130 188 34 -226 15 -189 14 -167 208 37
3323 37 -18 -19 -194 98 -25 9 49 86 131 -16 53 219 -175 0 -87 84 122 118 -127 159 35 -68 -60 -42 -200
3348 -200 271 -297 -119 -223 -29 -52 177 -3 54 136 -13 162 -202 -7 106 -28 105 90 -262 101 -220
3369 -220 136 83 -70 140 122 -4 15 -71 59 44 152 -81 47 -66 -191 -289 -268 358 -276 209 40 -27 -45
3392d5p0K66k19j02K99k98J16K01j30j37j33K86l51L05J8k91K09J56j3J71j96
3413D2j88M9J16K2p4J11m5R8N1j41j89QK60O1k97M3J33j43L09o6r5P7k62J65j57
3438a12j32J69o3L37j48j27M5p3K61q6p2k09J47M7J54k43mL22m57L79p7L1k03
3461a14J96J73p57N27q7J50j81rL73j59j26l2J21K7pK6j33m2j9q0K09j7m2J94
3485A91j31k35L72j76N6j73K07j76k14J27K20Rk86j78K83L12j43J08j05J12N0
3506B30k18l4J58k29K33q5J37j04J3j51o4K65j34j58j95K84K40j46L2j00j7j58
3528b01K34J8j89N0L91j54m17J71k39K13m5nL24j71j58M26m1k53K29n7j1k40N70
3551D45m11o5J1Q9Q7k23M3J55k20j9K58p1OK05j46k02J39P2m68P07p16L23K48
$$ plain form
3392 -45 -115 151 -68 -170 129 -169 -53 148 18 -119 -252 34 -317 -12 6 -285 -76 80 67 238 42
3413 42 -146 -97 19 41 -33 78 33 131 182 41 -148 -140 120 181 -116 -73 60 -83 226 160 65 142 -120 45 -112
3438 -112 -244 -75 -138 199 51 -76 -31 -104 157 71 -1 -210 -63 -16 138 -105 -109 213 -244 135 58 89 -114
3461 -114 82 255 -502 25 -62 88 -93 -102 271 112 -14 -46 75 102 95 121 -12 -54 -73 -153 56 39 -3 191
3485 191 60 -175 197 21 77 -96 111 -65 -279 -152 68 77 -209 -387 -104 208 65 173 68 180 230
3506 230 12 -22 136 -93 140 55 192 88 101 -50 -114 151 17 -141 -336 -52 188 42 74 -26 -43 -201
3528 -201 33 51 -138 -88 303 149 -268 -97 -336 -123 -168 -173 151 -20 -178 248 207 -46 183 126 115 -125 445
3551 445 34 -31 -20 69 156 -67 -24 131 -89 -108 150 79 85 290 144 -58 81 153 -315 392 -324 -1 247
3574B47m13L95p13L12r33R64M64q40L53j59L19j19K64n6k58K52j12Q9N0q0L1j73
3596a16J86Km41M46N3k21J20l6k8k5j32L12j56K73l35L45Qj14o8O8K4j07k0k0
3620A8k0J41k73j26K21K03k70j3N5M6J15k25M5k31K38N5Jj8L1J23j72q1M11j04
3644A70l46L04j34L7j7n2m9J93k54m0J59k42J72J11M4k11K04o2L0n6O2J09j70
3667c8Q2k35L14p6J49l94K80l19K17J02k21J08J5j79L37k35L11j85j23K33j71
3688b8j30L93k18K06j78k07J18n0J93%j6p4kj85l2L18l66n1N28j37m3j48J98K10
3712B99k09j52K95k04J70j41p6o1J82j05p2J67K2Rl73O00k43j15o9JL12m39K41
3735C9M9j1j32j0L01l85J69j72J55J88k50j30M1K86k13O8j35K46j03K45k69k2
$$ plain form
3574 247 -166 229 -484 -172 -1105 -141 323 -517 -164 -323 -4 -123 141 85 -173 79 -33 56 106 26 57 -116
3596 -116 70 72 -369 77 130 -91 29 -7 -35 -60 -192 120 -36 237 -98 247 255 141 73 141 165 58 38 18
3620 18 -2 139 -134 -260 -39 164 -106 -119 -64 -18 97 -128 -83 -314 -76 -21 -20 -38 -7 116 -56 -137 274 170
3644 170 -176 128 -6 31 14 -38 -87 106 -148 -188 -29 -271 -99 12 56 -155 49 -13 17 -39 23 132 -38
3667 -38 44 -191 123 47 196 -198 82 -237 -20 82 -139 -31 -16 -195 142 -93 218 33 -90 143 -28
3688 -28 -158 235 17 223 45 -162 -44 -94 99 99 83 9 7 -178 -210 108 -258 -309 219 82 39 -109 89 299
3712 299 90 -62 233 29 199 58 -18 -79 103 -2 -74 93 115 124 -249 351 108 -7 -76 -75 237 -202 39
3735 39 88 77 -55 -65 236 -149 20 -152 3 191 -59 -189 -148 138 -75 -7 -142 104 1 246 -23 -45
3757d5P5j6k42N91l86K1J05J31k05R5l12J83L7J67l83L83k50J4M3k43K16N96n18
3780E7j73LK9p8N4Q5j02m5M72l39K3N5J8r2l8M15m51j3M03m16l9j30J48O2k8Q1
3806c9p1K14j30K7j76M17j35L2k99K58k2o7p3j21K7M11n47K86J63k70P8j93L71
3829A41k92p5l0L19j49J71k6J37j68K37k39J4M8m4M3L1m4O7k5k4k01k65K97OO2
3854iJ70J21l13k60L16jm04N22j83J22j68k43J44Q6L44q1P7j47J2j85J10k44J79
3877c5j06k6o5K91j56Q2j88J52J22j86K94K8l13K11Jq1K3q3k3k5n9J06K10m49
3901b75J75L4L65o05L85j57M6J51k92M12l08J12R6r3j59J01P3k79J42L82n01K85
3923I0l38J96oJ69j65k08J24l5j3L22l61l9L12j5K86k07J5Rr9N2m1o1K59k14j1
$$ plain form
3757 -45 30 14 -228 363 -23 -2 103 234 29 124 -188 -5 32 199 -184 199 -51 -37 6 -237 -21 575 57
3780 57 -116 -113 -84 -162 -108 -23 -125 -170 302 -37 -14 41 59 -33 -71 344 -107 -120 283 -133 -172 -302 -154 -92 -120 -39
3806 -39 -110 104 -26 1 -175 242 107 139 -160 98 76 9 -64 -185 -158 253 -294 -8 155 -115 -37 -230 141
3829 141 -151 -226 -256 63 -86 85 59 196 28 265 26 40 88 44 87 118 74 141 116 92 -109 -374 -77 -71 -9
3854 -9 161 282 -31 -291 25 24 -380 142 -41 81 -87 -330 -186 -100 244 163 240 93 105 -80 30 -214 -35
3877 -35 -141 -167 -232 59 -97 -15 -203 -51 71 -115 179 207 -106 105 106 25 48 -35 -58 -83 -142 -36 174 -275
3901 -275 -100 -66 299 -306 79 -78 -32 119 -173 239 -69 43 139 46 -113 -12 61 -218 -76 306 -195 90
3923 90 -248 -52 -58 111 -54 -262 -138 -173 -186 136 -225 -264 48 33 319 112 127 136 37 89 48 -13 246 32 21
3948B1j2k83M50q4j81J94J73j20m90K71l30L20J92j49K49l92J48K40k14j58K72
3969A17m8k29p2KL24l37L71k21n5J17J23K3J00l24K22m7K0K27l04j28K86l67L6
3992a64K02K07j30j87K27k3k42q7L12j15kk12J39K6J28P9k28K35L1m7j58m0j1
4015f0K42k18J7q1L30j36j2K0J33m26J16K04j66L4qj66J24k05J79l6K82k30Q1
4038A8k05J94o6M85r0n76M3K08j5p9J82j0L1k50P6j35Q0K63j31j07P4p9M11k98
4062B4j18P8j10j74L00m3j33J14j07p2N5K97N5n2J9k61rl2M72l55j5J70r4J88
4086A97j03k03J17M6q6l2J62k51Q5J67qq1q8Q9O0J26K02l31N7k71K9r1K21m7L79
4111C45m01m0l4P7q3J11J50j41J10pj11l8Nj83P3NL06k42J07K59m50J27o5J15
$$ plain form
3948 21 9 -274 176 92 -89 105 278 158 -332 -61 -391 -71 121 -28 221 -171 -23 217 3 -155 117
3969 117 69 -160 -232 -230 94 -243 128 -93 -148 -31 92 115 215 -109 113 66 86 313 9 -119 167 -200 -164
3992 -164 38 245 115 -72 155 132 -110 -197 115 0 -2 -214 -75 -49 79 158 -70 165 196 149 -9 -49 -60
4015 -60 182 -36 -19 -100 230 94 82 102 235 -191 -75 129 -37 -3 -11 -177 -53 -258 -79 -115 167 -63 18
4038 18 -187 7 -59 426 336 -240 -197 11 -4 -83 99 89 120 -130 -54 -189 -109 154 23 -84 -10 -89 322 24
4062 24 -94 -16 -126 -300 0 -43 -176 -62 -169 -241 -186 111 166 114 133 -128 -137 -169 303 -52 -67 103 9 197
4086 197 94 -109 8 54 -32 -64 98 -153 -68 99 91 10 -78 11 71 197 399 68 125 -146 -117 -208 13 -34 345
4111 345 -56 -96 -130 -53 -136 -25 125 -16 94 87 -24 -62 -57 -240 -167 -162 144 -98 9 268 -182 -55 -120 -5
4135ek17J93J81j52J29k56K67k57M54l53k80N7K15J01Q0l34J47j1N9j23J61K25
4157B81j71k76K14j26J0M6Jq9O8mk5J21j31j2R5k16M05k90J91n5j61k7L49l98
4181b00L52j89m7M7N3J70m24K73L5j39L2p6K18j39P6j26P3PJ89n38O6L50j87p8
4205b02O2k14M20J11j58j04J25L4o4J39m12L02k50K52J79k91J20n2Q6J28m46J45
4227i0N4K56l17L4n5O7O0L7N2j0O5j65j5pk52J93o2L94m01J87J71o3k1p0pk64
4253b29K17J3j21M2k72M65j39J41J4q3JJ39K3K4k37k31K00J24J05k16J41j38j38
4276a55N34o80K54J47Q1k0k45R0N4j11Q6j50K19j26p1k51JM30o1L2k44R6K79k02
4300a3l3o7j27L35j94J04Kj4j7j02J52l1J0J33N0j48j23L26k89j06J0j36J83p5
$$ plain form
4135 -5 -222 -29 152 0 129 -127 140 -117 337 -16 -296 -239 -24 77 157 -177 -30 -41 18 -105 56 281
4157 281 110 -166 48 -78 -68 -22 -21 -110 -42 -46 -71 50 -81 -93 2 -214 191 -99 92 37 -124 -151 198 -200
4181 -200 152 -37 -84 -37 16 186 -238 35 70 -69 -37 -113 105 -34 42 -84 -11 -4 185 -353 -287 63 -124 -202
4205 -202 -140 -354 66 177 19 -85 40 74 10 149 -263 39 -211 41 220 -71 49 -3 83 211 -235 -90
4227 -90 -36 220 -97 -63 -118 -51 9 46 98 88 153 -12 -27 -34 -286 -93 -155 239 -162 25 196 133 112 42 35 -229
4253 -229 -12 1 -120 -78 -350 115 -24 117 131 48 49 188 211 235 -2 -233 -33 91 196 -20 121 -17 -155
4276 -155 379 -301 -47 100 181 161 -84 6 60 -51 35 -115 104 -22 -93 -344 -343 87 26 58 -186 -90 189 -13
4300 -13 -46 -113 -240 95 -99 5 7 -7 -24 -126 26 -5 5 138 188 40 -83 243 -46 -152 -142 -278 -95 -170
4324a70R8J20k59R8J45l7Q3m5L0j85j59K08l9K94J1j74j28J15r6K54p1m63J22
4347b48P15m37k01Q5o2N01l92J19o8q3J53j94J19K9j27J04K63l38J68r0L4k21
4369a71L32j42J20k21j8K24ok1k23O7o3J49K69l27k37Q1L96r6j8j05J56K2j84
4392a6mJ64q0j28km6K91k38q3QK75k77P0K05q5k01O6mN4J67l63J37J95k13m7J91
4418C6k81N5K06J76m71M51k53j7N5J7J23K29m83M49l36K69j08j98K18k19J91J75
4440B84l54J08J0P8nk76Q8k7q0R3J8q8j4L20k46J45j2Q4j3q2n4R2R2k68rK46m6
4467H4k06Q7k09J87j46J16L42l24k3J52N9k91K03J30J4k12j0j5O6l9J95l92J74
4490e8j01j8L44l09R4K28j46q7n2J16J31j9Mj15q7k29N10k73o1k53M98j89K06
$$ plain form
4324 -170 -72 48 -211 -113 32 -5 78 33 63 -122 -281 -73 -112 182 193 19 -109 6 -90 164 93 -370 -248
4347 -248 467 30 -171 -86 -148 353 -39 80 12 -71 82 -112 7 36 -91 13 276 -62 106 16 50 -171
4369 -171 161 19 139 -82 -100 124 118 97 -126 -59 -122 27 296 -31 -268 -187 209 113 95 -10 146 168 -16
4392 -16 -20 144 64 -64 -66 -112 179 -59 -142 -134 141 -136 -66 139 54 -147 -81 -85 -31 136 -227 -90 105 -108 -155 36
4418 36 -245 -190 16 192 -279 172 -81 -98 -43 -26 97 326 -157 292 -44 225 117 -81 137 -82 109 284
4440 284 -70 38 48 126 121 -155 -67 -94 -174 -81 -63 -151 -165 155 -91 54 42 126 113 31 -23 69 161 -107 -116 130 84
4467 84 -122 -35 -244 -57 -203 -87 255 -69 -92 60 119 -172 31 161 175 -37 -47 -62 4 -35 160 -232 -58
4490 -58 -159 -177 167 -142 -48 180 34 -53 -105 11 142 123 127 12 -75 -304 206 -67 -128 -381 117 -72 134
4513A34j99M61n20P1J00KL9O6K0k56Q9j46m1J28K09J07q8k33Q8r8N2K62k00J1
$$ plain form
4513 134 -65 396 -124 -53 47 49 88 154 174 -82 7 -139 -180 -52 157 264 176 -57 31 -67 -15 247 47 58
$$ [...]
8191H4
##END NTUPLES=NMR FID
##END=
