##TITLE=1H_DE-165_oil_TFA
 200.13Hz, DMSO-d6+CCl4.
 8 sc
 15.7.2026
##JCAMPDX= 6.0         $$ Bruker NMR JCAMP-DX V2.0
##DATA TYPE= NMR FID
##DATA CLASS= NTUPLES
##ORIGIN= UXNMR, Bruker Analytische Messtechnik GmbH
##OWNER= pz
$$ XWIN-NMR		Version 3.5
$$ Wed Jul 15 13:08:40 2026 Russian Standard Time (UT+4h)  she@DPX200
##.OBSERVE FREQUENCY= 200.1313
##.OBSERVE NUCLEUS= ^1H
##.DELAY= (6, 6)
##.ACQUISITION MODE= SIMULTANEOUS
##.ACQUISITION SCHEME= undefined
##.AVERAGES= 8
##.DIGITISER RES= 18
##SPECTROMETER/DATA SYSTEM= spect
##.PULSE SEQUENCE= zg30
##.SOLVENT NAME= DMSO
##.SHIFT REFERENCE= (INTERNAL, DMSO, 0, 14.3821)
##AUDIT TRAIL= $$ (NUMBER, WHEN, WHO, WHERE, WHAT)
$$ ##TITLE= Audit trail, XWIN-NMR		Version 3.5
$$ ##JCAMPDX= 5.01
$$ ##ORIGIN= Bruker BioSpin GmbH
$$ ##OWNER= she
$$ F:/spectra/data/she/nmr/H-C/1/audita.txt
$$ ##AUDIT TRAIL=  $$ (NUMBER, WHEN, WHO, WHERE, WHAT)
(   1,<2026-07-15 13:07:24.76 +0400>,<she>,<DPX200>,
      <created by zg, POWCHK disabled, PULCHK disabled
       configuration hash MD5:
       00 E9 B6 7A A2 85 ED C7 34 08 36 98 17 FE 4E 26
       data hash MD5: 16K
       1E E4 FA EA DC 07 DB C1 9D 11 DF 12 E5 CE DE 81>)
$$ ##END=
$$ 
$$ hash MD5
$$ C9 1C 21 F8 34 BC 90 E7 6F D3 69 BB 3C 65 A5 B5
##$RELAX= 
##$RELAX= 
##$RELAX= 
##$RELAX= 
##$RELAX= 
##$RELAX= 
$$ Bruker specific parameters
$$ --------------------------
##$DU= <F:/spectra>
##$EXPNO= 1
##$NAME= <H-C>
##$PROCNO= 1
##$TYPE= <nmr>
##$USER= <she>
##$AMP= (0..31)
100 100 100 100 100 100 100 100 100 100 100 100 100 100 100 100 100 100 
100 100 100 100 100 100 100 100 100 100 100 100 100 100 
##$AQSEQ= 0
##$AQ_mod= 1
##$AUNM= <au_zg>
##$AUTOPOS= <>
##$BF1= 200.13
##$BF2= 200.13
##$BF3= 200.13
##$BF4= 200.13
##$BF5= 200.13
##$BF6= 200.13
##$BF7= 200.13
##$BF8= 200.13
##$BYTORDA= 1
##$CFDGTYP= 0
##$CFRGTYP= 5
##$CHEMSTR= <none>
##$CNST= (0..31)
1 1 145 1 1 1 1 1 1 1 1 1 1 1 1 1 1 1 1 1 1 1 1 1 1 1 1 1 1 1 1 1 
##$CPDPRG= <>
##$CPDPRG1= <>
##$CPDPRG2= <>
##$CPDPRG3= <>
##$CPDPRG4= <mlev>
##$CPDPRG5= <mlev>
##$CPDPRG6= <mlev>
##$CPDPRG7= <mlev>
##$CPDPRG8= <mlev>
##$CPDPRGB= <>
##$CPDPRGT= <>
##$D= (0..31)
0 0.7 0 0 0 0 0 0 0 0 0 0.03 0 0 0 0 0 0 0 0 0 0 0 0 0 0 0 0 0 0 0 0 
##$DATE= 1784106444
##$DBL= (0..7)
120 120 120 120 120 120 120 120 
##$DBP= (0..7)
150 150 150 150 150 150 150 150 
##$DBP07= 0
##$DBPNAM0= <>
##$DBPNAM1= <>
##$DBPNAM2= <>
##$DBPNAM3= <>
##$DBPNAM4= <>
##$DBPNAM5= <>
##$DBPNAM6= <>
##$DBPNAM7= <>
##$DBPOAL= (0..7)
0.5 0.5 0.5 0.5 0.5 0.5 0.5 0.5 
##$DBPOFFS= (0..7)
0 0 0 0 0 0 0 0 
##$DE= 6
##$DECBNUC= <off>
##$DECIM= 32
##$DECNUC= <off>
##$DECSTAT= 4
##$DIGMOD= 1
##$DIGTYP= 9
##$DL= (0..7)
0 120 120 120 120 120 120 120 
##$DP= (0..7)
150 150 150 150 150 150 150 150 
##$DP07= 0
##$DPNAME0= <>
##$DPNAME1= <>
##$DPNAME2= <>
##$DPNAME3= <>
##$DPNAME4= <>
##$DPNAME5= <>
##$DPNAME6= <>
##$DPNAME7= <>
##$DPOAL= (0..7)
0.5 0.5 0.5 0.5 0.5 0.5 0.5 0.5 
##$DPOFFS= (0..7)
0 0 0 0 0 0 0 0 
##$DQDMODE= 0
##$DR= 18
##$DS= 0
##$DSLIST= <SSSSSSSSSSSSSSS>
$$ [...]
##$SUBNAM0= <"">
##$SUBNAM1= <"">
##$SUBNAM2= <"">
##$SUBNAM3= <"">
##$SUBNAM4= <"">
##$SUBNAM5= <"">
##$SUBNAM6= <"">
##$SUBNAM7= <"">
##$SUBNAM8= <"">
##$SUBNAM9= <"">
##$SW= 18.0517328524113
##$SWIBOX= (0..15)
0 0 2 0 0 0 0 0 0 0 0 0 0 0 0 0 
##$SW_h= 3612.71676300578
##$TD= 16384
##$TD0= 1
##$TE= 0
##$TE2= 300
##$TE3= 300
##$TEG= 300
##$TL= (0..7)
0 120 120 120 120 120 120 120 
##$TP= (0..7)
150 150 150 150 150 150 150 150 
##$TP07= 0
##$TPNAME0= <>
##$TPNAME1= <>
##$TPNAME2= <>
##$TPNAME3= <>
##$TPNAME4= <>
##$TPNAME5= <>
##$TPNAME6= <>
##$TPNAME7= <>
##$TPOAL= (0..7)
0.5 0.5 0.5 0.5 0.5 0.5 0.5 0.5 
##$TPOFFS= (0..7)
0 0 0 0 0 0 0 0 
##$TUNHIN= 0
##$TUNHOUT= 0
##$TUNXOUT= 0
##$USERA1= <user>
##$USERA2= <user>
##$USERA3= <user>
##$USERA4= <user>
##$USERA5= <user>
##$V9= 5
##$VALIST= <valist>
##$VCLIST= <CCCCCCCCCCCCCCC>
##$VD= 0
##$VDLIST= <DDDDDDDDDDDDDDD>
##$VPLIST= <PPPPPPPPPPPPPPP>
##$VTLIST= <TTTTTTTTTTTTTTT>
##$WBST= 1024
##$WBSW= 4
##$XGAIN= (0..3)
0 0 0 0 
##$XL= 0
##$YL= 0
##$YMAX_a= 359351
##$YMIN_a= -272330
##$ZGOPTNS= <>
##$ZL1= 120
##$ZL2= 120
##$ZL3= 120
##$ZL4= 120
##$ABSF1= 10
##$ABSF2= 0
##$ABSG= 5
##$ABSL= 3
##$ALPHA= 0
##$AQORDER= 0
##$ASSFAC= 0
##$ASSFACI= 0
##$ASSFACX= 0
##$ASSWID= 0
##$AUNMP= <proc_1d>
##$AZFE= 0.1
##$AZFW= 0.1
##$BCFW= 1
##$BC_mod= 2
##$BYTORDP= 1
##$COROFFS= 0
##$CY= -3
##$DATMOD= 1
##$DC= 2
##$DFILT= <>
##$DTYPP= 0
##$F1P= 0
##$F2P= 0
##$FCOR= 0.5
##$FTSIZE= 0
##$FT_mod= 4
##$GAMMA= 1
##$GB= 0.15
##$INTBC= 1
##$INTSCL= 1
##$ISEN= 128
##$LB= 0.25
##$LEV0= 0
##$LPBIN= 0
##$MAXI= 10000
##$MC2= 0
##$MEAN= 0
##$ME_mod= 0
##$MI= 1.114404
##$NCOEF= 0
##$NC_proc= 0
##$NLEV= 6
##$NOISF1= 3.799351
##$NOISF2= 2.8
##$NSP= 1
##$NTH_PI= 0
##$NZP= 0
##$OFFSET= 14.38212
##$PC= 1
##$PHC0= -4213.594
##$PHC1= -7.407697
##$PH_mod= 1
##$PKNL= yes
##$PPARMOD= 0
##$PSCAL= 0
##$PSIGN= 0
##$REVERSE= no
##$SF= 200.129724274929
##$SI= 16384
##$SIGF1= 3
##$SIGF2= 2
##$SINO= 400
##$SIOLD= 16384
##$SREGLST= <1H.CDCl3>
##$SSB= 0
##$STSI= 0
##$STSR= 0
##$SW_p= 3205.1282051282
##$SYMM= 0
##$S_DEV= 0
##$TDeff= 0
##$TDoff= 0
##$TI= <>
##$TILT= no
##$TM1= 0
##$TM2= 0
##$TOPLEV= 0
##$USERP1= <user>
##$USERP2= <user>
##$USERP3= <user>
##$USERP4= <user>
##$USERP5= <user>
##$WDW= 1
##$XDIM= 8192
##$YMAX_p= 0
##$YMIN_p= 0
$$ End of Bruker specific parameters
$$ ---------------------------------
##NTUPLES= NMR FID
##VAR_NAME=  TIME,          FID/REAL,        FID/IMAG
##SYMBOL=    X,             R,               I
##VAR_TYPE=  INDEPENDENT,   DEPENDENT,       DEPENDENT
##VAR_FORM=  AFFN,          ASDF,            ASDF
##VAR_DIM=   8192,          8192,            8192
##UNITS=     SECONDS,       ARBITRARY UNITS, ARBITRARY UNITS
##FACTOR=    0.0002768,     1,               1
##FIRST=     0,             0,               0
##LAST=      2.2672688,     0,               0
##MIN=       0,             -272330,         0
##MAX=       2.2672688,     359351,          0
$$ Real data points
##PAGE= N=1
##DATA TABLE= (X++(R..R)), XYDATA
$$ [...]
$$ plain form
1896 -50 -177 27 224 52 -175 232 104 -17 10 -45 86 -136 -85 37 -194 119 -10 107 -134 24 31 -179
1918 -179 340 126 -5 73 -235 -136 -61 49 -75 -86 4 -61 -37 152 -184 -53 267 -63 -493 197 -104 10
1940 10 154 -24 69 32 -85 352 161 41 155 -31 221 -33 -283 23 -273 13 45 -181 202 38 314
1961 314 35 -124 -125 55 309 -253 1 242 310 294 450 69 315 34 -432 -71 -81 -153 -254 -135 -60 -272
1983 -272 63 -277 29 -71 -54 -317 395 245 61 -53 54 215 172 278 162 49 135 -23 103 -24 -94
2004 -94 -38 65 -177 -37 12 -122 -192 23 197 -150 229 359 -42 235 149 621 91 -27 -201 -67 10 -83
2026 -83 -27 -127 -46 -18 -124 -120 40 72 168 57 -114 -196 -92 -134 -89 74 2 -13 41 -14 57 -46 -44 -28 -34 43 128 274
2054 274 49 -115 150 -199 51 -192 96 -90 -333 353 -31 82 185 -354 -71 272 -225 -58 -67 -127 19
$$ packed form
1896e0j27K04J97j72k27M07j28j21K7n5J31k22N1J22k31L13j29J17k41J58Pk10
1918a79N19k14j31P8l08R9P5J10j24j1R0o5K4J89l36J31L20l30m30O90l01J14
1940A0J44j78R3l7j17M37j91j20J14j86K52k54k50L06k96K86L2k26L83j64K76
1961C14k79j59jJ80K54n62K54K41O8j6J56l81K46k81m66L61j0p2j01J19P5k12
1983b72L35l40L06j00J7k63P12j50j84j14J07J61m3J06j16j13Q6j58J26j27p0
2004i4N6J03k42J40M9j34p0K15J74l47L79J30m01K77q6M72n30j18j74J34P7r3
2026h3N6j00Q1K8j06MJ60L2R6j11j71q2J04m2M5J63p2j5N4n5P1j03KJ6oP7Q5J46
2054B74k25j64K65l49K50k43K88j86k43O86l84J13J03n39K83L43m97J67ro0J46
$$ plain form
2075 19 205 -46 -127 -221 -45 157 33 43 188 144 -52 -24 140 -145 138 69 -41 -282 101 151 154 286 20
2098 20 -195 256 -41 179 -87 -25 -8 3 176 119 177 -77 138 -7 162 89 77 -20 114 -50 41 192 -120
2121 -120 -16 -37 211 105 -259 85 -177 12 -14 239 -129 -187 107 -247 53 77 -79 -125 -24 -161 177 -220
2143 -220 127 -337 -72 -96 10 -139 -62 93 -407 -105 39 -69 260 267 190 199 140 130 -1 22 336 149 -71
2166 -71 -63 183 -102 110 -253 -54 17 302 79 -35 -222 -141 -28 230 -135 -100 142 -95 -308 -31 -282 124
2188 124 192 278 -45 354 98 -103 -89 -283 -175 16 -21 -222 224 -159 237 -109 105 -17 72 21 335 -143
2210 -143 301 -28 -17 -104 226 -77 -119 -238 -157 -4 106 117 -191 -13 78 29 -81 -256 -18 -28 260 100 -373
2233 -373 -175 -167 13 15 -72 128 -101 122 -25 -13 27 -1 122 -65 -226 102 40 -8 307 -173 -235 224 250 -60
$$ packed form
2075A9J86k51q1r4J76K02j24J0J45m4j96K8J64k85K83o9j10k41L83N0LJ32k66
2098B0k15M51k97K20k66O2J7J1J73n7N8k54K15j45J69p3j2r7J34j64R1J51l12
2121a20J04k1K48j06l64L44k62J89k6K53l68n8K94l54L00K4j56m6J01j37L38l97
2143b20L47m64K65k4J06j49P7J55n00L02J44j08L29Pp7Rn9j0j31K3L14j87k20
2166g1QK46k85K12l63J99P1K85k23j14j87Q1J13K58l65L5K42k37k13K77k51M06
2188A24O8Q6l23L99k56k01J4j94J08J91l7k01M46l83L96l46K14j22Q9n1L14m78
2210a43M44l29J1q7L30l03m2j19Q1J53J10J1l08J78R1m9j10j75K38j0K88j60m73
2233c73J98QJ80Kq7K00k29K23j47J2M0k8J23j87j61L28o2m8L15m80o2M59K6l10
$$ plain form
2257 -60 170 -133 -69 -1 399 -42 86 9 -266 140 29 102 144 224 20 244 71 -21 -209 -172 135 303 152
2280 152 -46 189 205 -26 -73 146 145 -14 -133 -32 -16 -39 -351 40 -150 142 -43 -9 -13 -90 76 269 -10
2303 -10 97 7 -87 78 -134 135 -143 9 -18 31 316 57 -4 -127 127 259 -16 109 93 -235 183 -93
2325 -93 126 -179 52 300 21 166 -43 18 246 -94 -152 -90 6 -287 -198 196 -21 93 -190 -307 -94 -157
2347 -157 322 -87 109 53 123 159 42 -126 -158 66 -321 40 14 -13 -151 -11 -2 140 15 24 -49 72 78 -4 89
2372 89 166 196 -200 11 -96 -39 35 186 45 117 90 118 -23 -27 -79 247 40 -121 -184 -90 108 88 -117 167 196
2397 196 -25 171 -111 119 -126 110 -102 -44 -303 38 -50 25 -186 13 20 -95 -15 175 -5 47 -74 -202
2419 -202 39 -55 -227 192 36 -61 243 52 -121 165 55 55 -78 -109 -364 -87 -22 20 -78 -73 -120 -78 -104 -57 16
$$ packed form
2257f0K30l03O4O8M00m41J28p7k75M06j11P3M2Q0k04K24j73r2j88L7L07J68j51
2280A52j98K35J6k31m7K19jj59j19J01J6k3l12L91j90K92j85L4mp7J66J93k79
2303a0J07r0r4J65k12K69k78J52k7M9K85k59o1j23K54J32k75J25j6l28M18k76
2325i3K19l05K31K48k79J45k09O1K28l40n8O2R6k93Q9L94k17J14k83j17K13o3
2347a57M79m09J96n6P0L6j17j68l2K24l87L61k6k7j38J40RJ42j25Rp3J21Oq2R3
2372H9P7L0l96K11j07N7P4J51j41P2k7K8j41mn2L26k07j61o3R4J98k0k05K84K9
2397A96k21J96k82K30k45K36k12N8k59L41q8P5k11J99Pj15Q0J90j80N2j21j28
2419b02K41r4j72M19j56r7L04j91j73K86j10%j33l1k55K77O5M2r8Nm7M2k6M7P3
$$ plain form
2444 16 -134 212 86 92 -17 2 -235 -34 129 35 -40 42 79 454 -22 -181 -170 253 -191 42 32 105 249 -249
2468 -249 -69 -51 -81 -71 -174 72 -32 -268 -213 -170 35 34 133 200 86 22 -168 -27 -37 189 -263 -113 3 -169
2492 -169 33 -123 -109 -253 57 -301 -157 105 101 70 65 -151 -682 -139 100 -218 -370 -46 540 -329 -273 -118
2514 -118 -821 351 317 -167 -607 630 -131 -125 -151 1 268 -311 -8 -67 66 135 111 123 -171 242 119 78
2536 78 -32 -140 255 200 -25 147 -68 -85 155 80 37 320 5 -165 -145 -35 16 -130 87 -98 -56 -75 -212
2559 -212 534 120 -240 -113 78 171 181 63 131 -229 -528 261 -25 88 659 -335 225 406 -47 106 -423
2580 -423 -837 91 -349 73 -95 -7 -29 22 -107 91 -59 67 45 -55 -24 -82 181 41 21 51 48 -97 -374
2603 -374 30 -357 -55 41 7 188 -163 -314 100 13 15 -139 -365 194 116 230 -284 -46 -100 -91 -38 -346 -25
$$ packed form
2444A6j50L46j26Oj09J9k37K01J63r4p5Q2L7L75m76j59J1M23m44K33j0P3J44m98
2468b49J80J8l0J0j03K46j04k36N5M3K05jR9O7j14o4j90J41j0K26m52J50J16j72
2492a69K02j56J4j44L10l58J44K62ml1nk16n31N43K39l18j52L24N86q69N6J55
2514a18p03J172l4m84m40J237p61Ok6J52K67n79L03n9J33O9k4J2k94M13j23m1
2536G8j10j08L95n5k25J72k15j7K40p5m3K83l15j70K0J10N1j46K17j85M2j9j37
2559b12P46m14l60J27J91R3J0j18O8l60k99P89k86J13N71r94N60J81m53J53n29
2580d23m14R28m40M22j68Q8k2N1j29J98j50J26k2j00L1n8K63j40k0L0lj45k77
2603c74M04l87L02R6l4J81l51j51M14q7Kj54k26N59p8J14n14K38n4RN3l08L21
$$ plain form
2626 -25 -362 65 2 96 269 19 -113 159 98 -17 151 108 -63 78 37 162 -140 -15 -110 -178 55 10 115
2649 115 -85 -207 -358 210 -116 268 -174 151 -24 379 -170 34 160 -60 -115 55 22 -115 183 98 227
2670 227 65 -38 373 -87 -102 173 -245 -93 -101 66 -96 -43 -76 -169 30 -31 -136 95 -93 66 139 -45 -14
2693 -14 -131 -136 22 92 -12 89 269 20 149 -45 -316 125 16 -28 30 32 157 -123 -82 286 -18 -13 318 207
2717 207 194 -103 -4 224 -62 -44 -79 -231 -67 185 0 239 150 -56 48 -113 -4 48 -334 -82 -305 -129
2739 -129 -282 -204 200 85 -129 127 -78 -210 313 -44 19 148 -86 195 161 -3 -28 133 122 145 -82 99
2761 99 -315 -129 -7 68 -201 -20 160 139 56 -32 -108 183 108 -132 -118 61 -329 -44 -4 216 -140 143 131
2784 131 113 168 85 42 40 90 -37 -83 115 147 103 73 317 -126 121 202 293 113 25 -29 -52 85 61 366 -74 44
$$ packed form
2626b5l37M27o3R4J73k50j32K72o1j15J68m3j71J41m1J25l02J25r5o8K33m5J05
2649A15k00j22j51N68l26L84m42L25j75M03n49K04J26k20n5J70l3j37K98q5J29
2670B27j62j03M11m60j5K75m18J52qJ67j62N3l3r3J99o1j05K31j88J59P3j84L1
2693a4j17nJ58P0j04J01J80k49J29j94k71M41j09m4N8KJ25k80M1L68l04NL31j11
2717B07j3k97R9K28k86J8l5j52J64K52j85K39q9k06J04j61J09N2l82K52k23J76
2739a29j53P8M04j15k14K56k05j32N23l57O3J29k34K81l4j64k5J61j1K3k27J81
2761I9m14J86J22P5k69J81J80k1q3q8p6K91p5k40J4J79l90K85M0K20l56K83j2
2784A31j8N5q3m3kN0j27m6J98L2m4l0K44m43K47Q1R1j80q8n4k3J37k4L05m40J18
$$ plain form
2810 44 -38 98 163 -69 -234 -194 45 226 -88 -364 -130 -165 -128 -8 -11 -64 -30 173 143 -215 33 217 316 151
2834 151 110 83 -96 -13 0 -52 -62 -175 213 128 98 19 64 80 -141 -184 199 16 310 -213 -62 84 92 -18 -207
2859 -207 -54 56 -130 53 -169 -176 -184 -201 -411 374 10 -106 -17 6 -75 -79 -4 73 35 -119 141 -23 -172 -290
2883 -290 178 71 -184 -69 -73 -16 -26 -183 232 -81 124 -314 -145 383 -29 101 -70 -115 -52 12 218 -92
2905 -92 -41 -131 -36 -184 7 104 -89 59 -104 -174 -115 -180 -182 164 -431 -164 102 144 7 11 -302 -37 34 -113 -9
2930 -9 -2 -56 17 -98 -300 223 49 21 -10 10 28 13 -107 -57 60 -21 50 343 228 -173 139 727 -438 -143
2954 -143 -3 1 -165 -42 -146 -110 -330 97 283 -260 -57 87 -99 -12 235 -17 244 -188 -4 12 -71 -214
2976 -214 -199 -46 138 65 157 -4 -342 -101 73 3 -319 235 -31 -127 58 -80 -61 -94 120 -91 -176 -130 77
$$ packed form
2810D4q2J36O5k32j65M0K39J81l14k76K34l5L7J20ln3L4K03l0l58K48J84R9j65
2834A51m1k7j79Q3J3n2j0j13L88q5l0p9M5J6k21m3L83j83K94n23J51J46Qj10j89
2859b07J53J10j86J83k22pqj7k10P85l64j16Q9K3q1mP5P7l8j54K60j64j49j18
2883b90M68j07k55J15mN7j0j57M15l13K05m38J69N28m12J30j71m5O3O4K06l10
2905i2N1r0R5j48J91R7j93J48j63p0N9o5kL46n95K67K66M2j37Ml13K65P1j47J04
2930iPn4P3j15k02N23j74k8l1K0J8j5j20N0J17q1P1K93j15m01L12N88j165K95
2954a43J40Mj66J23j04L6k20M27J86n43K03J44j86Q7K47k52K61m32J84J6q3j43
2976b14J5J53J84p3R2j61l38K41J74p0l22N54k66r6J85j38J9l3K14k11q5M6K07
$$ plain form
2999 77 -50 -36 248 200 120 -54 -17 -7 59 -165 -196 19 74 40 56 179 -11 -23 -99 -127 -118 139 -24 -75 47 -96
3025 -96 204 -25 -144 136 -49 -221 270 -121 -52 -69 90 -73 129 -75 277 39 -236 93 153 101 197 27
3047 27 145 17 153 125 -15 43 22 -122 -50 -77 17 -1 371 -52 -113 -92 146 -180 145 -204 54 203 -16
3070 -16 -128 88 16 -8 10 128 75 -68 -106 -217 -32 -181 222 11 -1 148 135 224 -136 -20 -104 192 31
3093 31 97 -157 -48 -50 37 -154 137 116 182 -160 -66 181 34 -164 -198 -14 -90 355 221 15 -77 -110 29 60
3117 60 86 -37 -52 80 -55 -67 -152 83 108 -47 109 3 -44 -60 214 75 -176 -339 127 190 -22 98 -129
3140 -129 -80 82 -55 16 -93 29 -201 109 108 112 -61 113 309 25 -78 135 -1 -18 0 -250 -134 -132 -91 -71
3164 -71 179 130 -147 29 -202 19 217 143 -1 29 124 -1 -99 -17 -107 214 102 51 105 -14 243 -190 -108 105
$$ packed form
2999G7j27J4K84m8q0j74L7J0O6k24l1K15N5l4J6J23j90j2p6k8RK57j63n1J22j43
3025i6L00k29j19K80j85j72M91l91O9j7J59j63K02k04L52k38k75L29O0n2R6j70
3047B7J18j28J36k8j40N8k1j44P2k7R4j8L72m23o1K1K38l26L25l49K58J49k19
3070a6j12K16p2k4J8J18n3j43l8j11J85j49M03k11j2J49j3Q9l60J16q4K96j61
3093C1O6k54J09kQ7j91K91k1O6l42R4K47j47j98l4J84p6M45j34k06r2l3J39L1
3117F0K6j23j5J32j35j2q5K35K5j55J56j06m7j6K74j39k51j63M66O3k12J20k27
3140a29M9J62j37P1j09J22k30L10jMj73J74J96k84j03K13j36j7J8k50J16KM1K0
3164g1K50m9k77J76k31K21J98p4j44L0R5j25r8Q2r0L21j12n1N4j19K57m33Q2K13
$$ plain form
3188 105 -116 -219 -80 69 -27 -52 66 -5 -62 -330 75 8 -180 -58 -28 -48 -303 134 -196 -183 -91 -3 142
3211 142 -158 -105 221 -213 -99 -141 -49 -3 -1 -31 -103 76 -83 46 15 -117 31 144 -157 49 89 -20 148
3234 148 -2 369 -187 3 108 167 -193 31 -193 -344 21 -116 -19 -190 103 -23 -79 241 -69 -76 -5 161
3256 161 -136 141 -1 -205 182 -75 -123 65 -1 520 402 28 37 242 -120 -42 -206 53 72 -178 -406 -99
3278 -99 69 -40 -139 79 -98 129 -11 204 79 133 -154 -107 29 -39 48 -103 84 78 84 -112 -249 355 -55
3301 -55 139 -128 -35 62 17 -150 92 -142 331 -63 149 -99 -123 69 24 107 52 -136 -176 -128 -257 -4 66 -157
3325 -157 -3 -75 100 -18 -11 141 94 -28 -86 -144 19 -22 59 97 65 -135 -33 -4 257 24 49 -75 190 -18
3349 -18 -189 -109 -182 244 160 -60 -181 -89 -152 -209 166 117 -181 28 -208 122 31 154 -3 0 -112 -187 -38 56
$$ packed form
3188A05k21j03J39J49r6k5J18p1n7k68M05o7j88J22L0k0k55M37l30J3R2Q8J45
3211A42l00N3L26m34J14m2R2M6Kl0p2J79j59J29l1j32J48J13l01K06M0j09J68
3234A48j50L71n56J90J05N9l60K24k24j51L65j37R7j71K93j26n6L20l10pP1J66
3256A61k97K77j42k04L87k57m8J88o6N21j18l74RK05l62P8j64K59J9k50k28L07
3278i9J68j09r9K18j77K27j40K15j25N4k87M7J36o8Q7j51J87oOj96j37O04m10
3301e5J94k67R3R7m5j67K42k34M73l94K12k48k4J92m5Q3n5j88m0M8j29K53P0k23
3325a57J54p2J75j18PJ52m7j22n8n8J63m1Q1L8l2k00J02K9K61k33K5j24K65k08
3349a8j71Q0p3M26q4k20j21R2o3n7L75m9k98K09k36L30r1J23j57Lj12p5J49R4
$$ plain form
3373 56 48 184 -229 -92 274 25 -232 -49 257 55 46 57 -88 -105 32 102 -151 41 230 333 88 -114 -71
3396 -71 49 212 6 73 295 89 -139 126 112 -8 -55 178 31 -21 128 64 39 225 -267 -92 -184 87 -70
3419 -70 35 -16 128 74 174 212 134 -103 82 22 -19 -41 -82 150 153 -201 -96 43 200 53 266 99 269 -161
3443 -161 33 -27 -32 -149 -112 138 -28 -2 -16 52 -188 -52 -165 -70 -89 79 -127 154 -72 -68 -30 123 -125 -95
3467 -95 126 43 -13 144 -151 6 -318 255 122 76 68 -234 -105 -242 134 8 -143 15 82 -163 -20 -117 -129
3490 -129 -143 -5 110 5 -6 -50 -158 51 76 -180 47 -236 -179 -87 333 -194 -180 7 129 -103 63 39 -81
3513 -81 -209 55 45 -69 -17 67 291 198 11 -115 -36 -142 134 51 35 145 -39 -20 104 -48 26 -193 -84
3536 -84 -263 41 96 -137 -29 32 14 153 285 -172 -105 -110 -71 197 -117 96 -59 -15 -103 70 -58 -12 7 123
$$ packed form
3373E6qJ36m13J37L66k49k57J83L06k02rJ1j45j7J37P0k53J92J89J03k45k02M3
3396g1J20J63k06O7K22k06k28K65j4j20m7K33j47n2J49o4k5J86m92J75r2K71j57
3419g0J05n1J44n4J00L8p8k37J85o0m1k2m1K32Ll54J05J39J57j47K13j67J70m30
3443a61J94o0nj17L7K50j66K6j4O8k40J36j13R5j9J68k06K81k26ML8J53k48L0
3467i5K21q3n6J57k95J57l24N73j33m6ql02J29j37L76j26j51J58O7k45J43r7j2
3490a29j4J38J15j05j1m4j08K09K5k56K27k83N7R2M20n27J4J87J22k32J66k4j20
3513h1j28K64j0j14N2Q4K24r3j87j26P9j06K76q3j6J10j84J9J24j52P4k19J09
3536h4j79L04N5k33J08O1j8J39J32m57O7nL9K68l14K13j55M4q8J73j28M6J9J16
$$ plain form
3560 123 39 126 -86 264 173 -192 -141 -14 166 108 -153 111 -81 -14 323 318 -127 -97 79 214 239 167 -237 -26
3584 -26 -81 134 247 -94 -124 -88 -41 -98 168 63 78 -203 212 43 21 -28 358 269 -124 -109 87 -69 253 -196
3608 -196 -47 151 -82 -326 173 -191 -49 154 -297 162 23 -128 -266 15 -73 183 53 49 29 158 -11
3629 -11 264 35 -20 30 64 -32 3 -106 70 -128 18 -69 -186 -32 -250 -37 78 100 -208 -49 28 -72 223
3652 223 57 -117 108 -120 124 -245 87 94 -264 86 51 156 231 195 -38 45 110 36 163 11 -48 40 113 161
3676 161 234 -71 93 -199 -297 -200 -7 216 -163 -287 68 37 -8 300 -149 -20 70 214 -151 -186 31 70 -3
3699 -3 -35 159 -238 -194 83 -94 -220 -101 -9 -94 -138 -78 -50 154 121 213 -28 -139 -32 373 276 -285 392 74
3723 74 124 -26 -94 -106 -290 -132 -238 -64 42 -114 85 84 149 -69 29 6 -348 30 -146 -143 218 124 -151 -90
$$ packed form
3560A23q4Q7k12L50r1l65N1J27J80n8k61K64j92O7L37nm45L0J76J35K5p2m04K11
3584b6n5K15J13l41l0L6M7n7K66j05J5k81M15j69k2m9L86q9l93J5J96j56L22m49
3608a96J49J98k33k44M99l64J42K03m51M59j39j51j38K81q8K56j30mk0J29j69
3629a1K75k29n5N0L4r6L5j09J76j98J46q7j17J54k18K13J15K2l08J59P7j00K95
3652B23j66j74K25k28K44l69L32Pl58L50l5J05P5l6k33Q3O5p4J27j52n9Q8P3M8
3676A61P3l05J64k92r8R7J93K23l79j24L55l1m5L08m49J29R0J44l65l5K17L9p3
3699cl2J94l97M4K77j77j26J19R2q5m4O0K8K04l3R2k41j11J07M05r7n61O77l18
3723G4N0j50o8j2j84J58j06J74J06j56J99jO5k18R8k3l54L78j76LL61r4k75O1
$$ plain form
3747 -90 -75 -125 -272 -54 29 -207 265 175 -5 141 18 300 154 -366 217 208 -218 84 -151 -150 28 -93 -141
3770 -141 -123 -48 -52 87 83 -65 296 37 -86 -20 40 361 -197 24 -61 -47 18 285 -39 -160 -15 153 127 179
3794 179 -244 -218 203 -94 -99 126 -1 -109 190 -280 -79 -43 -35 170 106 -190 -58 3 286 -81 303 -39 -225
3817 -225 -307 -211 165 -69 -146 -218 -496 73 -368 -283 549 380 232 -206 -719 -286 101 219 -157 -72 -147 295
3839 295 470 119 -381 -21 -341 76 -94 -79 -68 -279 -371 -1 41 -297 510 177 -100 -51 -572 444 341
3860 341 -249 202 -318 431 134 182 -161 -53 -277 287 -395 493 145 9 -444 -27 153 136 -190 -279 53
3881 53 182 -332 381 -577 -170 -103 71 -121 -195 7 -381 65 -155 96 -335 230 -319 152 -480 925 372
3902 372 55 41 262 337 16 10 18 63 -19 -41 -15 -31 42 -110 93 -120 6 -112 -148 9 233 116 81 201 208
$$ packed form
3747i0J5n0j47K18Q3k36M72r0j80J46j23K82j46n20N83rm26L02k35JJ78j21m8
3770a41J8P5mJ39mj48L61k59j23O6O0L21n58K21q5J4O5K67l24j21J45J68k6N2
3794A79m23K6M21k97nK25j27j08K99m70K01L6QK05o4k96J32O1K83l67L84l42j86
3817b25q2R6L76k34p7p2k78N69m41Q5Q32j69j48m38n13M33L87J18l76Q5p5M42
3839B95J75l51n00L60l20M17j70J5J1k11r2L70M2l38Q07l33k77M9n21J016j03
3860C41n90M51n20P49k97M8l43J08k24N64o82Q88l48j36m53M17J80j7l26q9L32
3881E3J29n14P13r58M07O7J74j92p4K02l88M46k20K51m31N65n49M71o32J405n53
3902C72l17j4K21P5l21oQM5q2k2K6j6P3j52K03k13J26j18l6J57K24j17l5J20P
$$ plain form
3927 208 -17 -114 0 -31 -125 246 74 -129 3 258 -3 -93 6 -25 -94 101 37 146 -122 163 -30 160 -34
3950 -34 -157 -214 -225 66 16 160 -81 -111 -149 -35 -41 -325 -37 153 -177 160 -125 214 -73 76 -91 19 75
3973 75 -10 72 151 -37 74 -116 -3 -41 25 -178 248 -303 -60 11 27 188 -130 194 37 70 -88 -33 32 -115
3997 -115 -199 -119 -24 -75 57 -14 75 70 265 2 -11 45 -145 -189 44 -107 120 -76 44 46 -114 -154 170 100 -169
4022 -169 -56 184 51 150 -71 2 160 -53 -238 161 135 -213 -7 -178 -406 124 -3 75 203 -117 63
4043 63 199 25 -56 14 212 89 57 -75 47 -63 33 38 -48 142 -122 256 -48 -142 66 83 -19 101 -67
4066 -67 -122 53 53 176 64 -102 299 23 143 93 35 59 8 284 89 -10 -184 0 199 61 -97 -54 -74 -152
4090 -152 36 -70 -45 197 -21 -79 7 223 -67 -160 48 173 221 -120 -298 -107 -107 116 -125 -30 -70 189 140
$$ packed form
3927B08k25r7J14l1r4L71j72k03J32K55k61r0R9l1o9J95o4J09k68K85j93J90j94
3950c4j23n7j1K91n0J44k41l0l8J14ok84K88J90l30L37k85L39k87J49j67J10N6
3973G5q5Q2P9j88J11j90J13l8O6k03M26n51K43P1J6J61l18L24j57L3j58N5O5j47
3997a15q4Q0R5n1J32p1Q9nJ95k63j3N6j90m4K33j51K27j96J20Kj60m0L24p0k69
4022a69J13K40j33R9k21P3J58k13j85L99k6l48K06j71k28N30j27P8J28l20J80
4043F3J36j74q1P0J98j23l2j32J22j10R6Nq6J90k64L78l04r4K08J7j02J20j68
4066f7n5J75%J23j12j66M01k76J20n0n8K4n1K76j95r9j74J84J99j38j58M3k0p8
4090a52J88j06K5K42k18n8Q6K16k90r3K08J25M8l41j78J91%K23k41R5m0K59m9
$$ plain form
4113 140 166 160 -41 -77 -96 70 -77 268 145 -65 101 -258 241 -114 -49 89 105 142 -65 77 -111 166 41
4136 41 228 -327 -65 59 182 99 -157 159 35 -2 14 -28 -263 36 -29 -6 15 -48 4 -31 -31 109 -186 -270 5
4161 5 158 29 7 -17 200 70 149 -40 213 319 -42 85 -126 191 30 -109 -63 60 -98 149 -63 -66 33
4184 33 202 133 74 13 187 -65 -275 85 58 -85 262 11 -147 -171 151 -207 270 38 36 -167 -5 -87 -113
4207 -113 0 85 23 447 -20 -358 143 -2 120 17 4 -77 4 -281 158 -23 -120 192 -108 -191 -17 14 -171
4230 -171 -340 -28 21 21 -214 -21 -292 287 -201 -20 4 -242 39 32 -23 92 59 173 28 -135 29 123 98
4253 98 39 178 -134 -203 -184 207 -139 -61 201 -160 -5 -317 272 -232 230 -202 -140 119 -29 -158 -294 -242
4275 -242 140 24 -327 229 -384 147 18 51 -51 242 -148 -60 -113 -178 -182 -37 142 -29 92 12 -248 -124
$$ packed form
4113A40K6ok01l6j9J66j47L45j23k10J66l59M99l55O5J38J6L7k07J42j88K77j25
4136D1J87n55K62J24J23q3k56L16j24l7J6m2k35K99o5K3K1o3N2l5%J40k95q4K75
4161EJ53j29k2k4K17j30P9j89K53J06l61J27k11L17j61j39M6J23j58K47k12lR9
4184C3J69o9n9o1J74k52k10L60k7j43L47k51j58k4L22l58M77k32kk03J62q2k6
4207a13J13Q5o2M24m67l38N01j45J22j03j3q1Q1k85M39j81r7L12l00q3J74L1j85
4230a71j69L12M9%k35J93k71N79m88J81K4k46K81pn5J15l3J14j45j63J64R4k5
4253I8n9J39l12o9J9L91l46P8K62l61J55l12N89n04M62m32O2K59j48j29j36N2
4275b42L82j16l51N56o13N31j29L3j02K93l90Q8n3o5mJ45J79j71J21q0k60J24
$$ plain form
4297 -124 82 331 151 19 4 56 -102 -16 14 -73 83 -39 269 -200 153 67 6 73 49 88 158 -290 59 45
4321 45 -305 -107 -65 16 -208 414 38 55 -267 -66 94 75 -63 125 25 -145 -26 45 -161 7 203 -1
4343 -1 180 42 80 25 54 56 77 58 20 -26 -318 -49 22 101 76 215 -21 164 112 133 127 110 -42 -103 -139 99 -160
4370 -160 -106 -141 54 -66 -133 -372 -157 -29 4 -62 -94 91 -11 -32 -46 122 -50 97 43 -110 -119 282 -21 -218
4394 -218 260 51 202 187 -183 -32 -126 10 -98 -28 98 -288 174 -80 -64 -89 98 -36 74 89 -354 575
4416 575 101 242 -246 -54 -151 -243 100 228 64 -48 -138 -351 39 -199 127 71 -190 -203 110 -78 -65 182
4438 182 79 41 45 102 -43 -28 125 148 -59 -37 187 -7 87 -74 74 -371 169 -199 -246 76 86 -5 -102 -190
4462 -190 9 279 104 149 -28 -150 153 -264 51 129 -218 -39 29 -155 138 1 -298 5 -38 53 -52 135
$$ packed form
4297a24K06K49j80j32j5N2j58Q6L0q7J56j22L08m69L53q6o1O7k4L9P0m48L49j4
4321D5l50J98M2Q1k24O22l76J7l22K01J60j9j38J88j00j70J19P1k06J68J96k04
4343aJ81j38L8n5K9KK1j9l8m6k92K69P1P9k5J39k36J85n2K1oj7j52o1l6K38k59
4370a60N4l5J95j20o7k39K15J28L3o6l2J85j02k1j4J68j72J47n4j53rM01l03j97
4394b18M78k09J51j5l70J51r4J36j08P0J26l86M62k54J6k5J87j34J10J5m43R29
4416E75m74J41m88J92r7r2L43J28j64j12r0k13L90k38L26n6k61j3L13j88J3K47
4438A82j03l8MN7j45J5J53K3k07K2K24j94R4j61J48m45N40l68m7L22J0r1r7q8
4462a90J99K70j75M5j77j22L03m17L15P8l47J79O8j84K93j37k99L03m3R1j05J87
$$ plain form
4484 135 87 -141 -139 72 -128 37 21 64 142 149 180 -146 -138 147 294 -136 232 406 -58 -65 8 -45 -72 309 240 -38
4510 -38 256 111 -19 -105 43 145 91 108 -72 -123 47 72 122 -13 101 172 -193 123 220 -211 24 160 -235
4533 -235 158 37 43 76 -32 -397 -90 143 251 -43 21 -122 -79 220 59 -40 -48 -141 47 13 -168 171 -115
4556 -115 -34 41 -135 168 76 -54 -115 11 65 -60 -98 306 24 110 131 -251 -55 -9 -78 93 -99 -253 238
4579 238 -61 231 -116 109 3 -171 -97 -160 71 51 -7 -47 -111 91 -174 218 -124 142 -181 -313 -48 -2
4601 -2 30 190 127 -150 -171 249 358 85 -78 -208 95 -47 271 -110 129 -199 262 138 -9 -189 -289 91
4623 91 -100 91 28 307 -103 82 131 288 -28 -194 111 -79 130 124 -82 -96 130 135 110 -11 224 118 -122
4646 -122 39 -68 78 -182 193 -143 -207 -241 44 84 59 114 15 3 -151 -227 -69 -216 -161 140 75 64 -136 152
$$ packed form
4484A35m8k28KK11k00J65j6M3P8PL1l26QK85J47m30L68J74m64pP3n3k7L81o9k78
4510c8K94j45j30q6J48J02n4J7j80n1J70K5N0j35J14P1l65L16R7m31K35J36l95
4533b35L93j21OL3j08l65L07K33J08k94O4j43M3K99j61r9qr3J88l4j81L39k86
4556a15Q1P5j76L03r2j30o1J26N4j25l8M04k82Q6K1l82J96M6o9J71j92j54M91
4579B38k99K92l47K25j06j74P4o3K31k0n8m0o4K02k65L92l42K66l23j32K65M6
4601bL2J60o3k77k1M20J09k73j63j30L03j42L18l81K39l28M61j24j47j80j00L80
4623I1j91J91o3K79m10J85M9J57l16j66L05j90K09ok06j4K26Nk5j21K35j06k40
4646a22J61j07J46k60L75l36o4l4K85M0k5N5r9j2j54p6J58j47N5L01o5j1k00K88
$$ plain form
4670 152 -105 151 84 -15 114 -243 130 52 -46 185 99 -141 178 112 98 142 -179 4 -17 36 33 79 170 -10 -113
4695 -113 -199 479 622 338 -241 -94 199 22 -32 66 -107 -121 -4 -54 28 -244 -126 -255 -44 -35 236 90 20
4718 20 7 114 159 -139 8 -96 -131 399 171 -34 -184 80 -312 51 -181 170 -40 -22 -297 -422 -66 7
4740 7 -142 26 431 254 -144 103 108 117 181 143 -221 -117 234 94 121 23 55 68 -196 -171 -146 164 -116 -56 -299
4765 -299 4 -14 -294 200 -273 254 160 0 168 133 -35 16 -94 1 -57 -108 41 -10 -114 -260 3 -91 -139
4788 -139 266 -110 -98 -212 -242 -67 -72 110 -211 25 -36 -190 39 98 108 -179 -38 -128 -320 23 199 -206 -188
4811 -188 43 312 -192 85 -207 43 16 -168 -112 14 -29 40 -65 56 81 337 9 129 200 -124 42 -17
4833 -17 112 162 90 -105 -182 -225 18 -128 58 -29 -81 -81 -209 364 76 -242 -66 -22 -25 -168 -324 -59 -92 -32 -204
$$ packed form
4670A52k57K56o7r9J29l57L73p8r8K31q6k40L19o6j4M4l21J83k1N3lM6R1j80j03
4695a13q6O78J43k84n79J47K93j77n4R8j73j4J17n0Q2k72J18j29K11RK71j46p0
4718B0j3J07M5k98J47j04l5N30k28k05j50K64l92L63k32L51k10J8k75j25L56P3
4740Gj49J68M05j77l98K47NRO4l8l64J04L51j40K7r8L2J3k64K5K5L10k80O0k43
4765b99L03j8k80M94m73N27r4j60J68l5j68N1j10R5n8n1J49n1j04j46K63r4m8
4788a39M05l76J2j14l0J75nJ82l21K36o1j54K29N9J0k87J41r0j92L43J76m05J8
4811a88K31K69n04K77k92K50k7j84N6J26m3O9j05J21K5K56l28J20P1l24J66n9
4833a7J29N0p2j95p7m3K43j46J86q7n2%j28N73k88l18J76M4lj43j56K65l3O0j72
$$ plain form
4858 -204 30 48 -126 48 46 198 -80 -263 -130 11 -42 127 49 -102 -27 264 -196 133 -100 227 -43 -45 34
4881 34 212 14 -125 -36 49 108 16 -5 105 -349 295 107 0 230 88 -44 -301 313 -37 -77 53 95 -46
4904 -46 -88 -226 302 17 -111 90 -52 141 7 -19 106 79 -162 -78 -104 -19 -327 21 -20 -14 -14 157 161 78 52
4929 52 -114 -84 115 -19 67 -44 111 214 -276 161 11 -47 43 -107 259 61 -14 -109 -63 53 100 -173 -140
4952 -140 -218 -149 -320 -59 -181 -132 -19 7 150 72 62 131 44 35 -230 290 -68 107 -50 -85 45 -72 -31 -49
4976 -49 14 -30 -243 -43 118 91 -16 67 -269 -277 -86 300 129 98 -214 -28 -92 -101 82 -2 -216 -154 -283 -206 -97
5001 -97 -306 6 40 -27 37 -68 -236 -234 -66 -66 181 -145 -395 48 -157 -9 111 -213 -62 101 118 286 180
5024 180 -254 -51 290 123 -61 -328 46 85 -200 -35 8 20 -103 -44 35 57 -68 -19 -31 -116 -157 28 211
$$ packed form
4858b04K34J8j74J74kJ52k78j83J33J41n3J69p8j51P5K91m60L29k33L27k70kP9
4881C4J78j98j39Q9Q5N9r2k1J10m54O44j88j07K30j42j32k57O14l50m0J30M2j41
4904d6m2j38N28k85j28K01j42J93j34k6J25k7k41Q4k6Q5l08L48m1O%J71Mq3k6
4929E2j66L0J99j34Q6j11J55J03m90M37j50n8R0j50L66j98p5r5M6J16M7k73L3
4952a40p8O9j71K61j22M9J13K6J43p8j0O9q7rk65N20l58J75j57l5J30j17M1j8
4976d9O3m4k13K00J61k7j07Q3l36qJ91L86j71l1l12J86o4rJ83q4k14O2j29P7J09
5001i7k09L12L4o7O4j05j68KJ68%K47l26k50M43k05J48J20l24J51J63J7J68j06
5024A80m34K03L41j67j84k67L74L9k85J65M3J2j23N9P9K2j25M9j2q5m1J85J83
$$ plain form
5047 211 241 -86 74 -57 432 -164 -297 306 87 -205 -48 361 1 -9 -57 -29 -136 -34 152 -177 64
5068 64 -12 -274 -240 29 -263 -388 -64 26 296 -46 195 78 -146 -58 -25 -347 -88 -7 1 348 68 -73 -22
5091 -22 135 -24 18 -48 55 -16 67 -209 -84 -40 113 75 -61 -77 75 188 -82 187 -237 12 -20 -33 58 -140
5115 -140 164 50 0 13 26 -42 -74 194 4 24 -187 -57 73 -134 57 151 -76 46 -126 -71 -1 93 -66
5138 -66 14 41 64 114 -306 112 -6 -93 147 292 -341 211 62 117 -113 256 131 49 82 -81 166 -215 99
5161 99 -253 -98 -172 83 -195 -76 -428 255 -41 36 -74 17 149 69 85 222 293 312 78 -99 -66 -319 103
5184 103 148 -277 -50 55 -49 -190 42 37 -57 122 211 -58 -164 -90 -168 19 -38 100 -33 -63 -71 -255 131 -190
5208 -190 -295 144 36 0 79 16 49 148 43 168 -215 -88 -592 35 -313 106 -536 164 -365 -66 -225 -133
$$ packed form
5047B11L0l27J60j31M89n96j33O03k19k92J57M09l60j0m8K8j07J02J86l29K41
5068F4p6k62L4K69k92j25L24R0K70l42K41j17k24Q8L3l22K59Q1QL47k80j41N1
5091b2J57j59M2o6J03p1Q3k76J25M4J53l8j36j6J52J13k70K69m24K49l2j3R1j98
5115a40L04j14n0J3J3o8l2K68j90K0k11J30J30k07J91R4k27J22j72N5P0R4j59
5138f6Q0K7K3N0m20M18j18q7K40J45o33N52j49N5k30L69j25q2L3j63K47l81L14
5161I9l52J55p4K55k78J19l52O83k96P7j10R1J32q0J6J37P1J9k34j77L3k53M22
5184A03M5m25K27J05j04j41K32nr4J79Q9k69j06P4p8J87n7J38j33l0qj84L86l21
5208a90j05M39j08l6P9o3L3R9j05J25l83J27n04O27l48M19o42P00n29K99j59R2
$$ plain form
5230 -133 -137 384 -20 -32 234 378 -329 56 162 -92 130 110 -415 -100 643 -217 61 39 3 137 -214 -133
5252 -133 -21 18 -115 -308 -324 -270 368 -98 -175 58 -59 -622 121 639 -313 39 -15 189 -161 -116 576 -50
5274 -50 139 77 -362 -439 -64 -161 205 -277 -73 -178 -16 42 282 -242 19 -218 -82 57 -230 -67 -110 64
5296 64 277 122 -270 30 -8 66 -265 -393 249 48 175 163 90 105 -229 250 361 -90 398 138 -77 84
5318 84 106 220 -169 243 299 131 14 -302 3 -84 -187 -14 33 199 77 -100 -97 -188 127 -91 -51 -27 125
5341 125 45 -63 216 171 55 89 -186 144 83 -196 136 -74 41 -20 37 104 -379 230 -10 -10 55 -115 -119 -130
5365 -130 -118 11 -16 249 318 -151 -95 -315 133 231 -198 -433 56 142 -213 401 14 295 39 293 26 -110
5387 -110 -412 180 52 8 76 -59 -17 121 54 -2 65 -87 -103 385 -310 -197 9 147 75 -194 -5 -204 84
$$ packed form
5230a33mN21m04j2K66J44p07L85J06k54K22k0n25L15P43q60K78k2l6J34l51Q1
5252a33J12L9j33j93j6N4O38m66p7K33j17n63P43N18r52L52n4K04l50M5O92o26
5274e0J89o2m39p7L75r7L66m82K04j05J62N8K40n24K61k37J36J39k87J63m3J74
5296F4K13j55l92L00l8P4l31j28O42k01J27j2p3J5l34M79J11m51M88k60k15J61
5318H4K2J14l89M12N6j68j17l16L05q7j03J73M7J66j22j77Lr1L15k18M0K4J52
5341A25q0j08K79m5j16L4k75L30o1k79L32k10J15o1N7O7m83O09k40%O5j70mj1
5365a30J2J29k7K65O9m69N6k20M48R8m29k35M89Q6l55O14l87K81k56K54k67j36
5387a10l02N92j28m4O8j35M2J38o7n6O7j52j6M88o95J13K06J38p2k69J89j99K88
$$ plain form
5410 84 -17 98 -166 180 -122 57 162 -42 161 164 391 -115 -127 80 -100 -124 14 -33 323 -120 -15 -26
5432 -26 189 92 -12 -93 123 -24 98 18 58 229 11 130 -263 0 -26 74 15 -97 66 46 -188 123 94
5455 94 -77 -9 104 -148 239 5 118 157 -137 -83 201 -49 -10 59 -110 -124 -43 320 -7 239 -39 271 292
5478 292 -124 -73 209 79 17 -73 217 329 -82 224 -305 -50 23 305 -63 -91 151 -177 -176 11 -97 117
5500 117 -11 -141 -45 -26 220 -174 -113 198 64 42 98 -131 47 40 210 253 130 -168 17 91 134 137 46 235
5524 235 -26 -143 27 10 164 113 81 31 310 -113 145 96 -74 119 -60 7 116 -64 242 296 124 137 57
5547 57 -77 -278 4 -69 46 -147 255 212 -124 -25 231 1 82 -231 -103 -245 -390 31 188 100 172 -11
5569 -11 -202 39 -61 -56 86 190 94 -142 42 93 -162 -51 -38 -180 329 126 -109 -135 -162 -161 -11 4 83 -100
$$ packed form
5410H4j01J15k64L46l02J79J05k04K03LK27n06j2K07j80k4J38m7L56m43J05j1
5432b6K15r7j04q1K16j47J22q0M0J71k18J19l93K63k6J00n9j12J63k0k34L11k9
5455I4j71O8J13k52L87k34J13L9k94N4K84k50L9O9j69j4Q1L63l27K46k78L10K1
5478B92m16N1K82j30o2r0K90J12m11L06n29K55P3K82l68k8K42l28JJ87j08K14
5500A17j28j30R6J9K46l94O1L11j34k2N6k29J78pJ70M3j23k98J85P4M3Lr1J89
5524B35k61j17J70j7J54n1l2n0K79m23K58m9j70J93j79O7J09j80L06N4j72J3q0
5547E7j34k01K82p3J15j93M02m3l36R9K56k30Q1l13J28j42j45M21J57q8P2j83
5569a1j91K41j00NJ42J04r6k36J84N1k55J11J3j42N09k03k35k6k7JJ50J5P9j83
$$ plain form
5593 -100 -229 6 136 93 39 -35 -160 85 3 -75 -191 24 -162 165 182 -11 -24 -26 123 -358 46 72 64 -159
5617 -159 -109 28 -68 -41 47 -46 -82 -91 -28 5 4 178 -3 -13 -81 -27 90 83 142 -74 -59 -187 -92 -27 40 17 -239 126
5645 126 169 217 25 -35 119 8 -138 -110 238 321 -12 -109 201 -94 -175 10 -52 -82 -87 -26 202 42 32 138
5669 138 -83 -59 355 81 -111 125 -48 -76 66 -66 -121 89 22 118 147 237 201 -78 -353 77 28 16 226
5692 226 5 14 -92 316 80 4 4 -36 93 -315 12 90 305 -27 199 -77 104 80 247 -79 -123 80 45
5715 45 -113 19 -321 -147 -23 -26 146 -174 11 -74 -128 -61 218 236 227 47 179 264 -236 -161 252 -209 326 -19
5739 -19 -46 -198 -45 183 52 -174 -77 44 1 50 160 104 -246 -34 31 404 49 47 -15 88 13 -195 -17 -214
5763 -214 64 90 -33 -94 104 102 -43 -115 193 257 197 -52 207 286 -44 238 -140 -245 -44 173 114 -253 -53
$$ packed form
5593a00j29K35J30m3n4p4j25K45q2p8j16K15j86L27J7j93j3kJ49m81M04K6qk23
5617a59N0J37r6K7Q8r3l6rO3L3jJ74j81j0o8N4J17pN9k16J5j28R5O5O7k3k56L65
5645A26M3M8j92o0J54j11j46K8L48Q3l33r7L10k95q1J85o2l0nO1K28j60j0J06
5669A38k21K4M14k74j92K36j73k8J42j32n5K10o7R6K9R0l6k79k75M30m9j2K10
5692B26k21Rj06M08k36p6%m0J29m08L27P8K15l32K26k76J81k4J67l26m4K03l5
5715D5j58J32l40J74J24lJ72l20J85q5n4O7K79J8rj80J32Q5n00P5M13m61N35l45
5739a9k7j52J53K28j31k26R7J21m3M9J10n6l50K12O5L73l55ko2J03p5k08J78j97
5763b14K78K6j23o1J98kj45p2L08O4o0k49K59P9l30K82l78j05K01K17n9l67K00
$$ plain form
5786 -53 127 110 73 -26 18 29 0 128 -198 22 -62 -38 -7 209 -184 -51 -154 -45 -1 211 -56 33 -124 307
5810 307 136 -39 249 -107 46 -181 -156 -132 -189 246 150 -34 -16 144 -208 316 28 237 -285 67 -10 101
5832 101 -98 15 -11 77 -61 -93 -76 4 -29 181 109 -151 78 30 63 72 55 159 122 47 42 -8 147 -173 -179 -147 -3
5859 -3 -40 -127 -113 187 -483 -38 28 215 -82 -30 0 135 245 -125 -193 81 -267 87 44 -63 -19 -104 -22 -37 -3
5884 -3 -270 20 34 44 -95 -264 -147 -59 -114 268 -225 -229 -31 153 33 -118 3 12 131 221 -20 -237 -61 160
5908 160 128 64 106 202 -108 128 -47 -3 128 -88 49 -126 91 54 39 -41 -10 -35 95 -137 -276 -178 29 60
5932 60 -17 -11 -247 -133 -95 -15 -12 -189 18 -74 -279 -28 -4 59 -13 17 -140 145 66 -141 49 -169 -98 25 221
5957 221 349 236 -262 146 61 258 -187 -142 -90 -705 27 -249 316 -167 73 15 -191 -40 134 -66 30 68
$$ packed form
5786e3J80j7l7r9M4J1k9J28l26K20q4K4L1K16l93J33j03J09M4K12k67Q9j57M31
5810C07j71j75K88l56J53k27K5K4n7M35r6j84J8J60l52N24k88K09n22L52p7J11
5832A01j99J13k6Q8j38l2J7Q0l3K10p2k60K29m8L3Rj7J04l7p5nn0J55l20oL2J44
5859cl7q7J4L00o70M45O6J87k97N2L0J35J10l70o8K74l48L54m3j07M4q5Q2j5L4
5884ck67K90J4J0j39j69J17Q8n5L82m93mJ98J84j20j51J21RJ19R0k41k17J76K21
5908A60l2o4M2R6l10K36j75M4J31k16J37j75K17l7j5q0L1k5J30k32j39R8K07L1
5932F0p7Ok36J14L8Q0Lj77K07r2k05K51K4O3p2L0j57K85p9k07J90k18P1J23J96
5957B21J28j13m98M08q5J97m45M5N2o15P32k76N65m83K40n8k06J51J74k00R6L8
$$ plain form
5979 68 124 23 21 88 -205 -164 49 -275 -317 55 -64 97 -172 -35 22 -69 -22 108 37 142 28 217 228 91
6003 91 89 89 47 -49 -7 43 114 -104 136 -11 242 -155 13 120 -59 -107 -3 -253 155 183 -12 163 26 -97
6027 -97 -44 8 284 182 18 -113 1 -54 -272 144 -316 138 -104 66 -73 283 -34 67 129 -230 -48 -122
6049 -122 -118 -10 137 47 -363 -104 142 -148 326 -135 -210 113 87 28 99 22 -195 23 20 86 -222 17 151 35
6073 35 -275 -75 -62 163 35 -142 270 88 -62 -9 -45 216 -30 180 5 -5 -53 268 -17 -78 -42 97 123
6096 123 14 133 105 60 -209 180 -30 113 114 -390 120 -63 -152 -102 -32 47 130 -108 -48 -104 146 70 80 56 16
6121 16 -153 161 -47 70 -28 84 -135 34 -139 -45 46 -354 -34 -60 -162 -42 -178 -38 -181 9 329 100
6143 100 130 -172 -228 182 27 195 -223 256 -151 -31 -96 120 -17 -298 -279 -90 35 -120 -67 51 -107 -181
$$ packed form
5979F8N6j01kO7k93M1K13l24m2L72j19J61k69J37N7r1M7J30p1J05j14J89J1j37
6003I1k%m2r6M2N0P1k18K40j47K53l97J68J07j79m8J04k50M08K8j95J75j37j23
6027i7N3N2K76j02j64j31J14n5k18M16m60M54k42J70j39L56l17J01O2l59J82p4
6049a22MJ08J47r0m10K59K46k90M74m61p5L23k6n9P1p7k17K18lO6l08K39J34j16
6073C5l10K00J3K25j28j77M12j82j50N3l6K61k46K10j75j0m8L21k85o1L6J39K6
6096A23j09J19k8m5k69L89k10J43Jn04N10j83q9N0P0P9Q3k38O0n6K50p6J0k4m0
6121A6j69L14k08J17r8J12k19J69j73R4R1m00L20k6j02J20j36J40j43J90L20k29
6143A00L0l02n6M10j55J68m18M79m07J20o5K16j37k81J9J89J25j55N3J18j58p4
$$ plain form
6165 -181 103 -138 -107 -48 -259 -54 278 -97 5 60 -377 144 27 -27 160 -39 190 372 11 -21 -60 18
6187 18 -81 -74 -125 154 132 132 19 -108 -109 176 -12 -96 -74 -53 198 188 42 194 -110 -47 71 -290 21 11 16 17 -157
6214 -157 -131 2 190 99 43 98 -83 -65 35 -93 -45 296 -127 223 -21 32 -60 75 -12 -254 52 -160 233
6237 233 -82 156 173 350 253 20 -46 -168 -25 -244 19 65 130 33 -87 152 -294 252 106 151 123 -226 -27
6260 -27 -98 -152 106 -389 -294 -25 60 -122 92 307 44 114 97 109 173 -95 -13 19 -309 -299 43 191 152 190 167
6285 167 -137 -8 -19 188 -21 -263 -48 -38 280 30 344 130 -100 -11 169 124 -111 84 -12 72 96 -167
6307 -167 -193 -58 -59 -1 317 167 103 -94 18 102 -123 -17 -169 -80 -155 -44 75 121 25 -129 -61 16 -70 -25 -104
6332 -104 65 -168 96 87 66 118 7 291 -73 73 11 116 156 184 44 -14 -143 13 5 -171 -3 -140 -175 131
$$ packed form
6165a81K84k41L1N9k11K05L32l75J02N5m37N21j17n4J87j99K29J82l61l2l9P8
6187A8r9Pn1K79k2%j13j27jK85j88q4K2K1K51j0j46J52l04O3J18l61L11j0NJj74
6214a57K6J33J88r1n6N5j81J8J00j28M8L41m23L50k44N3r2J35q7k42L06k12L93
6237B33l15K38J7J77r7k33o6j22J43k19K63M6O5r7j20K39m46N46j46M5k8l49J99
6260b7p1n4K58m95R5K69Q5j82K14K15k63P0j7J2O4k68Q2L2l28J0L42J48l9L8k3
6285A67l04J29j1K07k09k42K15J0L18k50L14k14k30Q9J80m5k35J95r6Q4K4k63
6307a67k6J35jN8L18j50o4j97J12Q4k25J06j52Q9p5J11J19M6r6j54O8P7q6M5p9
6332a04J69k33K64rk1N2j11K84l64J46o2J05M0K8j40n8j29J56qj76J68j37l5L06
$$ plain form
6356 131 217 -156 -37 189 -8 -117 101 -90 -186 -81 4 -57 52 93 84 -12 -16 -156 135 -104 38 -13 -138 215
6380 215 205 77 -68 -123 -12 -19 -444 -196 -112 -19 575 302 217 20 162 -43 83 -96 -125 -236 6 133 -66
6403 -66 -35 -125 287 -3 -204 43 222 215 -89 -86 71 -217 119 64 -161 -59 131 327 53 39 -72 98 -53
6426 -53 53 97 73 -69 -1 -49 -117 -196 -302 225 -93 -64 -221 -74 186 175 48 219 149 35 8 105 -21 175
6450 175 17 100 246 -63 7 -43 33 47 -104 -151 269 -231 -85 -221 -66 -94 -75 -79 -79 45 283 17 211 -415
6474 -415 -232 -201 259 -127 -115 103 -232 -167 -147 -5 -89 -239 214 273 434 -143 10 -170 265 -88 -60 801
6496 801 -193 -294 -597 -917 1 -60 -137 -286 -304 322 12 539 -74 461 73 -192 -529 437 454 146 14
6517 14 -816 -308 -143 328 -1004 -657 58 -636 25 -655 -299 396 -20 -78 528 -221 -398 -58 -219 -214 581
$$ packed form
6356A31Q6l73J19K26j97j09K18j91r6J05Q5o1J09M1rr6mj40K91k39J42n1j25L53
6380B15j0j28j45n5J11pm25K48Q4R3N94k73q5j97J42k05J26j79k9j11K42J27j99
6403f6L1r0M12k90k01K47J79pl04LJ57k88L36n5k25J02J90J96k74j4j11J70j51
6426e3J06M4k4j42O8m8o8p9j06N27l18K9j57J47K60j1j27J71p0j14k7R7j26J96
6450A75j58Q3J46l09P0n0P6J4j51m7M20n00J46j36J55k8J9m%J24K38k66J94o26
6474d15J83L1M60l86J2K18l35O5K0J42q4j50M53N9J61n77J53j80M35l53K8Q61
6496H01r94j01l03l20R18o1p7j49j8O26l10N27o13N35l88k65l37R66J7l08j32
6517A4q30N08J65M71j332L47P15o94O61o80L56O95m16n8O06p49j77L40j61NP95
$$ plain form
6538 581 7 175 129 -319 84 -157 219 65 -188 480 83 287 -141 189 51 -3 248 265 143 -151 -104
6559 -104 61 336 92 144 -55 248 14 -137 -136 29 -148 -122 71 212 -128 53 34 -163 -49 -176 26 -50
6581 -50 260 228 -13 -8 -1 184 17 22 218 85 258 -165 46 10 -138 -4 183 298 53 -77 -99 -175 77 158
6605 158 294 29 -282 -171 -95 104 -143 344 42 -23 166 -107 312 6 -103 -15 -98 140 -122 216 140 -93
6627 -93 141 100 41 174 -83 18 142 -141 -258 -11 -49 129 111 -170 -182 99 -64 6 -120 121 -32 -143
6649 -143 65 82 -64 32 -53 -112 -159 69 115 -16 78 -281 -83 -9 213 -175 -59 -46 140 -49 -77 -13 209 66
6673 66 91 -91 -269 -100 -23 83 -64 38 -149 279 -67 294 62 165 -122 96 -119 -168 -323 332 -12
6694 -12 133 448 22 189 -310 -166 -668 228 -115 -509 74 291 202 234 -97 73 66 -19 -63 -63 -196 174 209
$$ packed form
6538E81n74J68m6m48M03k41L76j54k53O68l97K04m28L30j38n4K51J7j22k94M7
6559a04J65K75k44N2j99L03k34j51JJ65j77K6J93J41l40J81j9j97J14j27K02p6
6581e0L10l2k41NPJ85j67NJ96j33J73m23K11l6j48J34J87J15k45j30k2p6K52Q1
6605A58J36k65l11J11P6J99k47M87l02o5J89k73M19l06j09Q8q3K38k62L38p6k33
6627i3K34m1n9J33k57J01J24k83j17K47l8J78j8k81j2K81j63P0j26K41j53j11
6649a43K08J7j46R6q5n9m7K28M6j31R4l59J98P4K22l88J16J3J86j89k8O4K22j43
6673F6K5j82j78J69P7J06j47J02j87M28l46L61k32J03k87K18k15m9j55O55l44
6694a2J45L15m26J67m99J44n02Q96l43l94N83K17q9L2l31J70pq5m4%j33L70L5
$$ plain form
6717 209 -12 -130 51 194 200 385 77 -104 -173 130 -64 -45 173 -156 -241 118 108 -18 -92 -176 60 -16 30
6740 30 226 176 187 70 -3 193 -157 26 33 -108 82 -39 238 -298 -34 60 -12 27 217 62 58 69 -57 -125
6764 -125 -110 -174 44 74 -150 -112 -71 127 -11 -13 -163 8 76 -61 -270 84 1 224 100 -10 181 123 -205
6787 -205 202 -105 40 54 -68 0 88 206 94 252 -95 15 -8 -205 -130 84 -396 -192 146 70 280 193
6809 193 -40 -86 -44 -67 356 -202 112 -288 69 -69 208 31 -210 -33 -14 127 59 164 -132 213 -362 82
6831 82 46 -168 0 -17 -180 239 -202 -112 -20 183 -110 82 -222 42 101 -36 30 -73 198 11 -799 -126
6853 -126 131 101 -50 -26 -24 -171 209 -195 -2 -46 234 -297 -257 19 58 -250 181 142 -294 -41 -53 112 -57
6876 -57 193 140 -69 106 33 -25 42 -61 38 119 -75 -3 79 -162 59 -245 16 256 58 11 -4 74 -7 -309
$$ packed form
6717B09k21j18J81J43OJ85l08j81o9L03j94J9K18l29q5L59j0j26p4q4K36p6M6
6740C0J96n0J1j17p3J96l50J83Pj41J90j21K77n36K64R4p2L9J90j55mJ1j26o8
6764a25J5o4K18L0k24L8M1J98j38kj50J71O8j37k09L54q3K23j24j10J91n8l28
6787b05M07l07J45J4j22O8Q8J18j12J58l47J10k3j97P5K14m80K04L38p6K10q7
6809A93k33m6M2k3M23n58L14m00L57j38K77j77k41J77J9J41o8J05k96L45n75M44
6831H2l6k14J68j7j63M19m41R0R2K03k93J92l04K64N9j37O6j03K71j87q10O73
6853a26K57l0j51K4Kj47L80m04J93m4K80n31M0K76L9l08M31l9m36K53j2J65j69
6876e7K50n3k09J75p3n8O7j03R9Q1j94P2Q2k41K21l04K61K40j98m7j5P8q1l02
$$ plain form
6900 -309 -151 13 -75 38 13 29 -119 -163 125 139 -187 -27 38 -97 -204 137 263 197 144 -207 7 70 55
6923 55 113 93 -158 -173 -254 -27 110 -30 43 217 -199 -152 0 19 -71 -154 322 149 233 180 -93 -86 -85 -96 89 -172
6949 -172 -56 137 -239 246 -98 128 -5 -131 -84 -124 12 -53 -82 11 264 134 -352 108 -48 -79 -43 -271
6971 -271 377 66 -88 -189 127 -138 57 46 -96 46 -138 8 -113 202 -185 -4 152 44 306 -143
6991 -143 274 -5 -2 111 32 283 -364 177 -136 -225 171 272 3 -39 75 -72 -50 -149 25 16 -77 277 -35
7014 -35 41 92 -106 -199 79 -131 -57 -78 -191 25 60 112 -188 -134 77 -9 -63 139 113 193 -189 266 -83 -214
7038 -214 119 -11 176 0 -109 -19 -311 -52 -126 -29 26 180 -85 -135 312 142 418 -102 -112 -119 -17 -29 12
7061 12 -64 237 118 218 -51 -53 -31 173 -19 172 -173 56 -311 91 -137 -147 34 31 47 62 -5 -287 29 -31
$$ packed form
6900c09J58J64q8J13k5J6j48m4K88J4l26J60O5j35j07L41J26o6n3l51K14O3j5
6923E5N8k0k51j5q1K27J37j40P3J74m16M7J52J9r0q3M76j73Q4n3k73PJj1J85k61
6949a72J16J93l76M85l44K26j33j26M7m0J36o5k9R3K53j30m86M60j56l1L6k28
6971b71O48l11j54j01L16k65J95j1j42J42j84J46j21L15l87J81J56j08K62m49
6991a43M17k79LJ13p9K51o47N41l13q9L96J01k69m2J14j47K2r9J74rr3L54l12
7014c5P6N1j98r3K78k10P4k1j13K16L5N2l00N4K11q6n4K02k6Q0l82M55l49j31
7038b14L33j30J87j76j09R0k92K59p4R7N5J54k65n0M47j70K76n20j0pJ02j2M1
7061A2p6L01j19J00k69kK2K04j92J91l45K29l67M02k28j0J81lJ6J5o7k82L16o0
$$ plain form
7085 -31 143 -188 -18 44 25 -51 133 -207 -147 169 95 -137 -86 8 149 181 -57 243 -147 329 252 -3 -75 165
7109 165 -32 92 66 -29 54 -185 88 176 82 -282 181 92 -186 35 -182 -16 114 -377 -983 142 -36 -90
7131 -90 151 -128 -243 200 -131 -203 57 -97 90 -92 92 18 -166 153 156 -192 -149 -63 -67 -269 73 -287 47
7154 47 -83 15 -2 -19 -293 -112 -33 -181 137 -81 73 304 235 82 52 -259 91 -76 98 263 -28 37 21
7177 21 -46 -101 -295 -201 -342 57 9 218 73 203 -7 40 71 124 -231 2 20 -197 78 149 -3 -149 -14
7200 -14 -162 -188 -150 87 -163 -192 148 54 -2 -13 -169 235 164 308 -37 -134 -30 203 -48 208 198 -94 -4 144
7224 144 -57 119 -18 -54 24 74 31 -133 -211 -9 16 -80 -18 292 -208 -237 -47 52 -137 -38 216 470 -80 68
7248 68 5 1 -122 -122 -127 -361 -35 193 -81 198 -5 -105 145 -122 72 -60 -49 42 -103 -192 -7 -33 139 38
$$ packed form
7085c1J74l31J70O2j9p6J84l40O0L16p4k32N1R4J41L2k38L00l90M76p7k55p2K40
7109A65j97J24k6r5Q3k39K73Q8r4l64M63q9k78K21k17J66J30m91o06J125j78n4
7131i0K41k79j15M43l31p2K60j54J87j82J84p4j84L19Ll48M3Q6mk02L42l60L34
7154D7j30R8j7j7k74J81P9j48L18k18J54K31o9j53l0l11L50j67J74J65k91O5j6
7177B1o7n5j94R4j41L99m8K09j45J30k10M7L1N3l55K33J8k17K75P1j52j46J35
7200a4j48k6L8K37k50k9L40r4n6j1j56M04p1J44l45r7J04K33k51K56j0k92R0J48
7224A44k01J76j37l6P8N0m3j64p8K02K5r6O2L10n00k9J90R9j89R9K54K54n50J48
7248F8o3mj23%nk34L26K28k74K79k03j00K50k67J94j32J1R1j45q9J85k6J72j01
$$ plain form
7272 38 171 -263 -20 23 39 -283 12 169 69 -220 2 40 -63 -178 -115 116 -28 -88 -109 -111 267 45 14
7295 14 29 -168 -55 -22 -34 -56 -155 -145 -117 109 100 81 23 259 5 -193 29 89 -17 -141 -84 -92 34 -48 -86 -220
7321 -220 -5 115 185 146 3 -123 102 257 77 171 20 168 127 -62 -204 -16 -167 177 61 -120 55
7342 55 -101 228 110 86 139 185 15 134 -121 -113 184 -12 132 222 63 121 218 -61 36 -105 197 101 -140 -13
7366 -13 -129 4 -81 -257 194 154 40 158 -225 49 -200 -224 -1 -216 49 134 239 227 201 99 -360 222
7388 222 169 -128 90 -125 6 185 102 90 176 49 -213 242 -38 -25 -43 1 50 52 -84 56 323 103 1
7411 1 400 -28 -53 -5 -64 105 -73 -209 -45 -97 106 -39 -190 144 -46 8 -269 -24 -228 -74 -97 -10 66
7434 66 178 -210 88 -309 -143 33 36 331 -194 -62 -5 -171 89 144 86 -170 -13 91 -245 -8 14 230
$$ packed form
7272C8J33m34K43M3J6l22K95J57j00k89K22L8j03j15O3K31j44o0k1kL78k22l1
7295A4J5j97J13L3j2k2r9J0K8K26rj9n8K36k54j98K22O0j06j24N7qJ26q2l8j34
7321b20K15J20P0l9j43j26K25J55j80R4j51J48m1j89j42J88j51L44j16j81J75
7342E5j56L29j18k4N3M6j70J19k55QK97j96J44R0j59N8R7k79R7j41L02r6k41J27
7366a3j16J33q5j76M51m0j14J18l83K74k49k4K23k15K65Q5J05j2k6j02m59N82
7388B22n3k97K18k15J31J79q3j2Q6j27k62M55k80J3j8M4M9Kj36J40K67k20j02
7411AL99m28k5M8n9J69j78j36J64n2K03j45j51L34j90N4k77K45k04J54k3Q7P6
7434F6J12l88K98l97J66J76LK95n25J32N7j66K60N5n8k56J57J04l36K37K2K16
$$ plain form
7456 230 54 -134 49 142 57 6 -114 25 -37 -30 76 39 5 -173 46 172 -57 -92 163 -125 -160 35 -27 -112
7480 -112 -220 104 -133 33 82 118 160 165 -107 -100 162 39 91 -93 -151 -256 300 16 -234 30 277 -192 258
7503 258 269 175 -147 -234 201 173 17 -27 49 18 -93 -246 228 -49 -357 8 -109 -300 119 -40 -159 143
7525 143 -91 -63 70 208 186 150 13 -201 178 234 287 39 -73 0 -25 79 105 -60 26 44 202 100 159 78
7549 78 167 -21 -20 -6 46 -42 -124 242 230 203 -260 -55 -112 -337 -25 15 340 -130 104 179 234 -184 148 -326 20
7574 20 134 83 -124 -245 -15 0 197 375 -25 -66 -227 48 -162 -112 252 39 -99 -6 -260 -83 62 19
7596 19 112 -83 -75 206 -9 -226 -49 37 -204 75 -109 69 113 -22 54 -54 183 -95 -73 230 -54 -70 -139
7619 -139 144 -66 338 110 73 -64 870 627 -796 195 -45 -30 -230 -127 109 3 -94 140 -159 -175 -246
$$ packed form
7456B30j76j88J83R3q5n1j20J39o2PJ06l7l4j78K19J26k29l5K55k88l5J95o2q5
7480a12j08L24k37J66M9L6M2Nk72PK62j23N2j84n8j05N56k84k50K64K47m69M50
7503B58J1r4l22q7M35k8j56m4P6l1j11j53M74k77l08L65j17j91M19j59j19L02
7525A43k34K8J33J38k2l6j37k14L79N6N3k48j12P3k5J04K6j65Q6J8J58j02N9q1
7549G8Q9j88JJ4N2q8q2L66j2k7m63K05n7k25L12M0L25m70K34P5N5m18L32m74L46
7574B0J14n1k07j21K30J5J97J78m00m1j61K75k10N0L64k13j38R3k54J77J45m3
7596A9R3j95QK81k15k17J77Q6k41K79j84J78M4j35P6j08K37k78K2L03k84j6o9
7619a39K83k10M04k28l7j37R34k43j423R91k40J5k00J03K36j06r7K34k99j6p1
$$ plain form
7640 -246 196 109 -61 -48 -105 -34 -300 143 15 46 69 -130 41 -114 -130 5 -63 -62 268 -30 224 267 85 -71
7664 -71 115 334 66 60 -326 204 68 -298 86 281 174 -56 252 -89 109 36 78 -61 -146 -225 117 111 154
7687 154 -126 -147 -261 206 23 110 122 -41 -11 184 193 23 -35 -50 -22 53 6 -187 86 127 -103 -309 -189 -31
7711 -31 202 202 -80 -56 106 70 203 -245 -155 -175 15 -254 120 36 206 23 -3 70 -176 -59 -9 66 -287 -94
7735 -94 -165 -22 51 -222 -210 24 61 -133 158 93 153 178 -223 -212 14 44 292 124 64 -20 55 -128 -96 26 98
7760 98 -146 241 57 -195 48 48 -58 -29 173 99 -107 -34 -109 -233 -26 -48 130 -19 -101 120 -38 -99 -45 205
7784 205 208 -86 34 114 -191 -37 -159 92 78 89 -137 -8 -10 106 24 82 9 89 -123 -75 69 -167 32 -151
7808 -151 286 -177 132 -48 -259 -117 -5 -32 138 -87 8 -106 54 -210 157 -10 -180 20 -241 65 -112
$$ packed form
7640b46M42q7j70J3n7P1k66M43j28L1K3j99J71j55j6J35o8JL30k98K54M3j82j56
7664g1J86K19k68ol86N30j36l66L84J95j07k30L08l41J98p3M2j39q5p9L42oM3
7687A54k80k1j14M67j83Q7J2j63L0J95Rj70n8j5K8P5m7j93K73M1k30k06J20J58
7711c1K33%k82K4J62l6J33m48R0k0J90k69L74q4J70j83k6P3k46J17N0P5l53J93
7735i4p1J43P3k73J2K34L7j94K91o5O0K5m01J1K26L0K48j68o0q4P5j83L2J22P2
7760I8k44L87j84k52K43%j06K9K02p4k06P3p5j24K07k2J78j49q2K21j58o1N4K50
7784B05Lk94J20Q0l05J54j22K51j4J1k26J29kJ16q2N8p3Q0k12M8J44k36J99j83
7808a51M37m63L09j80k11J42J12k7J70k25R5j14J60k64L67j67j70K00k61L06j77
$$ plain form
7829 -112 -143 -74 157 -67 199 -154 81 182 100 332 -30 -106 166 43 -74 148 105 136 -368 -3 233 -87
7851 -87 -109 11 -232 -113 53 -52 -11 213 144 144 -118 116 444 -132 65 229 -157 29 -126 -207 -43 3 -18
7874 -18 -84 186 -18 -193 -117 -128 -128 77 -77 -74 -88 164 -187 -231 -15 44 -134 205 -303 -298 -148 -25 34 108 210
7899 210 218 -209 -11 -19 53 -88 41 111 -82 -60 490 -13 -110 20 -182 -111 147 46 82 183 70 -16 100 22
7923 22 39 -151 -93 37 25 -101 28 304 -155 268 -53 122 117 179 62 56 153 -280 181 -42 -256 227 -235
7946 -235 -82 60 167 -148 214 -266 -254 26 -512 509 119 -84 97 51 -149 -51 -202 -3 -12 336 -19
7967 -19 55 339 -481 351 -29 -151 -75 410 -315 -60 -116 215 -75 234 -18 -216 32 374 -132 -82 -134 314
7989 314 189 130 249 174 -15 -34 97 -30 198 -64 -154 21 -98 -194 -63 52 -62 158 58 -42 -71 18
$$ packed form
7829a12l1O9K31k24K66l53K35J01q2K32l62p6K72j23j17K22m3L1n04L65K36l20
7851h7k2J20k43J19J66j05M1K24o9%k62K34L28n76J97J64l86J86j55q1J64M6k1
7874a8o6K70k04j75P6j1%K05j54Lj4K52l51m4K16N9j78L39n08NJ50J23N9P4J02
7899B10Qm27J98qP2j41J29P0j93K2N50n03r7J30k02P1K58j01L6J01j13q6J16p8
7923B2J7j90N8J30j2j26J29K76m59M23l21J75nO2j17oR7m33M61k23k14M83m62
7946b35J53J42J07l15L62m80J2K80n38J021l90k03J81m6k00R8j51J99rL48l55
7967a9P4K84q20Q32l80j22P6M85p25K55n6L31k90L09k52j98K48L42n06N0n2M48
7989C14j25n9J19p5j89j9J31j27K28k62r0J75j19r6J31J15j14K20j00j00k9Q9
$$ plain form
8011 18 26 -11 262 125 134 -142 -182 -121 249 117 -5 280 19 -123 44 43 -304 107 -18 72 -220 168 78 -156
8035 -156 39 -77 -13 -405 -142 24 130 46 91 -54 32 -273 108 172 117 171 -105 71 -226 -340 61 -97
8057 -97 -41 -379 14 181 19 -104 -192 -104 -88 20 -21 -236 -37 2 12 -40 -43 -294 -3 -22 -24 -45 -80 172 -202
8082 -202 -23 176 140 71 162 -208 3 -106 220 8 35 -39 -114 -67 227 -212 264 -17 -13 158 138 173 52 -77
8106 -77 8 56 161 173 -111 -139 25 232 62 235 -34 -73 22 104 43 -166 90 -160 -126 -104 134 -25 123 151
8130 151 -195 -58 63 -202 149 183 -28 -78 -115 -71 103 56 13 198 193 152 -75 306 189 122 145 39 -57 156
8154 156 111 305 20 145 -228 -194 108 -14 144 -12 -102 -103 -64 58 34 66 58 177 128 39 141 -134 2 -209
8178 -209 79 -42 -193 -294 -86 304 -143 17 37 -25 124 258 -47
$$ packed form
8011A8Ql7K73j37Rk76m0O1L70j32j22K85k61j42J67jl47M11j25R0k92L88r0k34
8035a56J95j16O4l92K63J66J06q4M5j45Q6l05L81O4n5N4k76J76k97j14M01j58
8057i7N6l38L93J67j62j23q8Q8J6J08m1k15J99L9J0n2lk51K91j9kk1l5K52l74
8082b02J79J99l6o9R1l70K11j09L26k12K7p4p5M7K94m39M76k81MJ71k0L5j21j29
8106g7Q5M8J05J2k84k8J64K07j70J73k69l9R5Q2o1k09K56k50L4K2K38j59J48K8
8130A51l46J37J21k65L51L4k11n0l7M4J74m7m3J85nm1k27L81j17o7K3j06r6K13
8154A56m5J94k85J25l73L4L02j22J58j56r0jL9J22k4L2qJ19m9q9J02k75J36k11
8178b09K88j21j51j01K08L90m47J60K0o2J49J34l05
8191d7
$$ Imaginary data points
##PAGE= N=2
##DATA TABLE= (X++(I..I)), XYDATA
$$ plain form
0 0 0 0 0 0 0 0 0 0 0 0 -8 8 -8 8 -9 16 -16 24 -32 32 -40 48 -56 72 -80 96 -112 128 -146 168 -193 222 -250
33 -250 283 -321 362 -406 454 -507 567 -631 699 -776 860 -952 1052 -1160 1280 -1410 1554
50 1554 -1709 1885 -2077 2292 -2534 2805 -3116 3471 -3886 4375 -4964 5686 -6600 7798 -9441
65 -9441 11850 -15737 23069 -41875 202467 359351 99381 87063 25068 -46217 -119342 -121059
77 -121059 -157130 -151330 -124826 -88689 -85494 -38196 1797 20922 24168 47407 45478 43321 41799
90 41799 41619 23679 13936 6790 -196 -13425 -15244 -15835 -17150 -16659 -10736 -8972 -5097 196 3446
105 3446 2049 4522 6596 6927 3261 2786 2253 763 -284 279 -1245 -1745 -1508 -1066 -1230 -985 -484 -259
123 -259 -177 219 291 381 536 580 582 54 277 248 43 -118 -91 -135 -22 -61 -240 -117 -146 135 -173 -256 52 -154
$$ packed form
0@%%%%%%%%%%qJ6j6J6j7K5l2M0n6O4p2Q8j04J28j52J76k08K40k74L14l61M15m72
33b50N33o04O83p68Q60r61J074j198J330j475J636j812K004k212K440k690K964
50A554l263L594l962M369m826N339n921O587p357Q261r339J0650j2286J4398j7239
65i441K1291k7587L8806o4944K44342J56884k59970j2318o1995p1285p3125j717
77a21059l6071N800K6504L6137L195M7298L9993J9125L246K3239j929k157j522
90D1799j80j7940r743p146o986j3229j819n91j315M91N923J764L875N293L250
105C446j397K473K074L31l666m75n33j490j047N63j524n00K37M42j64K45N01K25
123b59Q2L96P2R0J55M4Kn28K23k9k05j61K7m4J13l9j79J23k9K81l08q3L08k06
$$ plain form
147 -154 28 121 287 88 23 215 -60 127 52 -131 -112 -130 -246 52 -206 -182 173 -4 -200 -223 -410 -352 -314
170 -314 239 -121 -118 147 2 28 -64 -45 -68 -52 -136 -71 -236 -95 385 129 -180 132 -363 217 14 -156 -93 191
194 191 176 -23 -46 22 -187 122 -122 -214 273 -156 84 19 -67 -105 133 39 116 -138 -130 -15 -54 167 69 -181 43
219 43 107 115 -191 58 -73 -25 55 157 48 195 159 226 42 -248 174 -39 191 355 -192 -169 75 108 -27 313
243 313 -251 96 -82 -104 -31 -187 111 -216 -135 97 -30 180 242 -103 -154 134 -249 -70 -172 139 60 143 -78
266 -78 152 -4 80 -141 -85 153 16 -156 15 52 -167 -13 -229 -192 -154 -16 48 201 54 -45 -69 23 -21 46
290 46 24 -74 114 -136 13 237 190 -296 71 -120 -92 176 190 108 56 -168 -139 -204 -114 105 -41 -3 -210 165
314 165 -111 -149 -136 -231 -42 172 -70 -6 -47 151 -58 -293 -236 29 14 -7 43 98 216 -40 39 -264 -80 24
$$ packed form
147a54J82R3J66j99o5J92k75J87p5j83J9j8j16K98k58K4L55j77j96k3j87N8L8
170c14N53l60LK65j45K6r2J9k3J6q4O5j65J41M80k56l09L12m95N80k03j70O3K84
194A91j5j99k3O8k09L09k44r2M87m29K40o5q6l8K38r4P7k54QJ15l9K21r8k50K24
219D3O4Ql06K49j31M8Q0J02j09J47l6O7j84k90M22k13K30J64n47K3K44L3j35L40
243C13n64L47j78k2P3j56K98l27Q1K32j27K10O2l45n1K88l83J79j02L11p9Q3k21
266g8K30j56Q4k21N6K38j37j72J71L7k19J54k16L7L8J38O4J53j47r9k4R2m4O7
290D6k2r8J88k50J49K24m7m86L67j91K8K68J4q2n2k24K9o5R0K19j46L8k07L75
314A65k76l8J3r5J89K14k42O4m1J98k09k35N7K65j5k1N0N5J18k56P9l03J84J04
$$ plain form
338 24 -55 271 15 178 -46 -188 177 -77 95 20 2 -376 -176 52 -87 90 201 -73 -222 -269 -179 6
360 6 287 -78 -128 173 47 301 9 -61 -63 -177 -157 148 50 249 -240 -258 54 281 -94 127 200 -361 6 137
384 137 192 -196 -215 -158 158 104 -25 -171 -90 -93 108 85 -96 -364 -7 -87 -20 -48 9 -64 225 111 55 -115 74
409 74 -57 293 115 192 77 -66 91 -120 13 -29 -170 -122 -334 -99 153 113 -214 11 12 -127 174 -159 -61
432 -61 -13 214 66 43 117 -258 2 3 -48 8 -2 106 -185 -150 34 60 -62 231 -20 -50 208 -138 219 -65
456 -65 -11 -92 -74 -3 -48 -26 -149 25 -42 -105 -2 -215 89 -112 -97 8 -148 410 -218 -157 297 258 47 106 96
481 96 -42 -186 -155 -127 1 16 -53 -223 -33 122 23 -55 -89 -114 -50 -66 39 -154 374 -40 99 -194 -30 -77
505 -77 -214 -3 168 -119 154 -300 56 -55 -163 -305 88 -91 -266 -69 -376 184 94 40 -147 144 -8
$$ packed form
338B4p9L26k56J63k24j42L65k54J72p5j8l78K00K28j39J77J11k74j49m7R0J85
360FK81l65n0L01j26K54k92p0kj14K0L05r8J99m89j8L12K27l75K21P3n61L67J31
384A37N5l88j9N7L16n4j29j46Q1lK01k3j81k68L57q0O7k8N7p3K89j14n6j70J89
409G4j31L50j78P7j15j43J57k11J33m2j41M8k12K35K52m0l27K25Jj39L01l33R8
432f1M8K27j48k3P4l75K60Jn1N6j0J08k91L5J84K6j22K93k51l0K58l46L57k84
456f5N4q1J8P1m5K2j23J74o7o3J03k13L04k01J5J05j56N58o28O1M54l9k11N9j0
481I6j38j44L1K8J28J5o9j70J90J55r9p8l4k5O4j6J05j93N28m14J39k93J64m7
505g7j37K11J71k87K73m54L56j11j08j42L93j79j75J97l07N60r0n4j87K91j52
$$ plain form
526 -8 -70 28 -111 9 -63 -52 -140 262 44 22 305 139 126 47 27 194 -13 -154 -158 287 -183 148 63 -80 288
551 288 -234 58 -76 13 171 187 -140 -292 196 16 80 32 -268 -103 -24 -1 238 60 261 36 -27 41 -30
574 -30 -1 -201 86 67 -297 -197 -111 -307 239 -95 -66 263 -150 -238 21 -13 1 -74 283 120 -25 116 29 -60
598 -60 100 21 209 52 81 -131 -31 141 -115 242 96 40 -51 82 26 34 75 188 54 159 -4 -223 82
621 82 -136 -146 12 115 -180 56 119 -105 1 27 -316 -20 -116 45 211 -74 176 115 -114 -230 -277 145 63
644 63 -23 -386 -50 30 -75 -223 62 -67 -290 143 28 4 -298 199 38 -182 -120 -1 29 -118 58 218
666 218 32 59 -234 185 -7 -53 -162 -22 104 106 -101 -192 -51 -51 -102 -110 142 -87 -28 -229 217 63 104 -99
690 -99 196 -166 -33 -180 -15 47 -194 -41 -47 -107 188 28 10 103 13 -66 -160 18 126 -270 23 -31 -201 88
$$ packed form
526ho2R8j39J20p2J1q8M02k18k2K83j66j3p9k0J67k07j41mM45m70L31q5j43L68
551B88n22K92j34Q9J58J6l27j52M88j80O4m8l00J65P9K3K39j78K01k25o3O8p1
574c0K9k00K87j9l64J00Q6j96N46l34K9L29m13q8K59l4J4p5L57j63j45J41q7q9
598f0J60p9J88j57K9k12J00J72k56L57j46n6r1J33n6QM1J13j34J05j63k19L05
621H2k18j0J58J03k95K36O3k24J06K6l43K96r6J61J66k85K50o1k29j16m7M22q2
644F3q6l63L36Q0j05j48K85j29k23M33j15k4l02M97j61k20O2J19L0j47J76J60
666B18j86K7k93M19j92m6j09J40J26Kk07r1J41%n1qK52k29N9k01M46j54M1k03
690i9K95l62J33j47J65O2k41J53oo0K95j60j8R3r0p9r4J78J08l96K93n4j70K89
$$ plain form
714 88 -53 273 80 -1 -272 47 -213 -44 114 106 142 -27 -25 163 -181 -72 -236 -8 168 102 137 49 26 -160
738 -160 -140 62 -7 -96 -65 -38 132 -216 128 213 -158 28 -15 -76 31 150 -202 17 24 -266 -159 -141 -416 67
762 67 -18 -14 195 -93 -55 -181 152 -68 -105 76 -10 -13 19 6 -155 241 -99 83 131 216 -255 34 221 -8 -83
787 -83 55 -215 100 -216 65 120 68 552 122 -84 -39 -23 86 67 240 -105 -257 -237 45 117 -117 35 -49
810 -49 118 -196 222 47 145 -71 -84 213 47 -32 101 -74 112 252 -182 -119 -69 -38 72 -12 219 244 103
833 103 28 -47 -104 -91 -193 -347 35 -263 -123 -157 30 -68 -235 75 -3 -35 205 90 -5 -79 -203 70 211 -31
857 -31 180 -62 113 39 4 -82 1 49 -48 -54 165 112 -254 155 -89 -143 -61 -14 -104 -11 73 60 -8 -4 -28 38 -150 -142
885 -142 -153 -81 -193 304 93 -65 -32 33 266 21 -320 -6 112 -106 48 -128 235 -54 -7 30 -92 -49 -104
$$ packed form
714H8j41L26j93q1k71L19k60J69J58qL6j69KJ88l44J09j64K28J76o6L5q8k3j86
738a60K0K02o9q9L1K7J70l48L44Q5l71J86m3o1J07J19l52K19Pk90J07J8k75M83
762F7q5MK09k88L8j26L33k20l7J81q6lL2j3j61L96l40J82M8Q5m71K89J87k29p5
787h3J38k70L15l16K81N5n2M84m30k06M5J6J09j9J73l45j52K0K82P2k34J52q4
810d9J67l14M18j75R8k16j3K97j66p9J33j75J86J40m34O3N0L1J10q4K31K5j41
833A03p5p5n7J3j02j54L82k98J40l4J87r8j67L10p8l2K40j15r5p4j24K73J41k42
857c1K11k42J75p4l5q6Q3M8r7oK19n3l66M09k44n4Q2M7r0R3Q4j3o8Mk4O6j88Q
885a42j1P2j12M97k11j58L3O5K33k45l41L14J18k18J54j76L63k89M7L7j22M3n5
$$ plain form
908 -104 139 209 -3 -175 141 158 -244 -14 -68 74 56 259 151 -109 -77 103 -143 -38 58 -92 143 -63
930 -63 -76 -141 220 73 298 43 -16 -6 75 -98 47 -173 -94 -128 354 111 137 4 -296 186 139 -4 -65 -45
954 -45 205 159 -90 -93 29 -60 -196 36 -137 -107 127 136 164 243 31 -175 -47 240 266 -85 -6 52 74 149 -136
979 -136 149 -222 -80 -169 -106 165 308 -64 -99 84 -142 -182 0 4 154 71 175 -58 247 -165 -89 201 78
1002 78 -7 190 -133 42 -180 141 3 -129 -285 -142 79 21 19 -97 11 22 -206 -41 135 106 43 147 -100
1025 -100 91 4 204 168 -71 -120 196 -304 25 -106 -38 36 -139 -9 18 -91 -216 -64 -133 82 304 -239
1047 -239 336 135 15 -52 107 -127 -37 -301 -76 -83 -69 -180 364 302 186 81 178 71 -35 93 -29 -169
1069 -169 135 68 -29 -154 -209 50 -92 73 -469 29 309 426 -98 225 131 156 -202 -49 135 -132 -205 -200 81
$$ packed form
908a04K43P0k12j72L16J7m02K30n4J42j8K03j08k60L2J80k46J05R6j50K35k06
930f3j3o5L61j47K25k55n9J0Q1j73J45k20P9l4M82k43K6j33l00M82m7j43o1K0
954d5K50m6k49lJ22q9j36K32j73L0K34RK8P9k12k06J28K87K6l51P9N8K2P5k85
979a36K85l71J42q9O3K71J43l72l5J83k26m0J82MJ50q3J04k33L05m12P6K90j23
1002G8q5J97l23J75k22L21j38j32j56J43K21n8kj16J08J1k28J65J76k9o3J04k47
1025a00J91q7K00l6k39m9L16n00L29j31O8P4j75J30K7j09j25J52o9K15K22n43
1047b39N75k01j20o7J59k34R0k64K25pJ4j11N44o2j16j05R7j07j06J28j22j40
1069a69L04o7r7j25n5K59j42J65n42M98K80J17n24L23r4K5l58J53J84k67p3NK81
$$ plain form
1092 81 173 15 168 120 -80 6 -11 -137 -137 -84 -176 -116 179 184 148 33 -272 129 -82 -166 175 215 -114 7 38
1117 38 45 -101 75 136 -64 -88 3 75 52 -29 -192 -182 173 -295 219 30 190 109 -288 352 -155 6 -69 -243
1141 -243 -106 182 112 -50 -3 -49 51 -118 -48 -99 -50 2 -62 158 190 89 -4 -316 -219 104 -143 -45 -239 177
1165 177 178 -259 15 -36 37 -44 -17 108 74 66 144 -101 16 -20 -77 -141 -155 148 121 74 -41 25 -96 92 350 235
1191 235 141 59 -12 184 217 10 -31 -34 48 41 -30 -254 236 128 -50 116 -152 236 -98 200 -48 -228 153 96
1215 96 -55 108 -164 8 -218 77 -176 -270 -68 -76 -103 124 509 -30 -42 -229 -6 75 -54 23 -314 -93 238
1238 238 66 -73 180 -220 -259 -139 -106 16 -199 -120 -210 -40 -168 122 150 -105 -39 166 2 -128 6 -136
1260 -136 104 115 -123 200 86 22 115 87 338 15 -101 -85 88 -197 50 -205 -189 -29 -180 111 60 -98
$$ packed form
1092H1R2j58J53m8k00Q6j7j26%N3r2O0K95Nl6j15l05M01k11q4L41M0l29J21L1
1117C8Pj46J76O1k00k4R1P2k3q1j63J0L55m68N14j89J60q1l97O40n07J61p5j74
1141b43J37K88p0j62M7m6J00j69P0n1M9N2o4K20L2j01r3l12R7L23k47R8j94M16
1165A77Jm37K74n1P3q1K7J25l4qP8k45J17l6n7o4j4L03k7m7j15O6j21J88K58j15
1191B35r4q2p1J96L3k07m1lQ2pp1k24M90j08j78J66k68L88l34K98k48j80L81n7
1215I6j51J63k72J72k26K95k53r4K02qk7K27L85n39j2j87K23Q1j29P7l37K21L31
1238B38j72j39K53m00l9J20L3J22k15P9r0J70j28K90K8k55O6K05j64j30J34j42
1260a36K40J1k38L23j14o4R3k8K51l23j16J6J73k85K47k55J6J60j51K91n1j58
$$ plain form
1282 -98 64 103 205 -246 -142 293 79 -142 19 270 37 31 244 -1 165 10 -143 -42 85 360 -18
1303 -18 -218 -11 136 -51 -2 -64 71 -361 -111 58 128 -258 -61 173 118 145 34 2 -129 -28 66 -165 124
1326 124 260 -31 74 208 60 196 118 -50 152 -26 31 -179 -245 266 -16 80 74 98 -352 99 -32 -285
1348 -285 -276 -414 -19 -20 134 586 -180 -169 250 127 -165 -104 155 -41 -331 146 -77 795 -240 -622 -315 -332
1370 -332 -329 644 -21 359 543 -163 74 -29 259 -378 195 115 -20 -194 -142 -165 26 4 -19 15 274 99 67
1393 67 -14 -224 121 150 -39 -263 132 53 374 -88 -120 42 -139 -33 129 229 -78 -163 -70 -247 -52 172
1415 172 83 -110 73 271 84 -129 -78 329 -140 -81 102 -129 3 122 -17 -95 44 394 192 69 213
1436 213 43 37 -29 -231 140 156 -130 -139 -115 -150 -136 165 -134 33 -150 -122 -126 227 -85 -18 -159 218 -82 -98 13
$$ packed form
1282i8J62L9J02m51J04M35k14k21J61K51k33oK13k45J66j55j53J01J27K75l78
1303a8k00K07J47j87M9o2J35m32K50J69P0l86J97K34n5K7j11l2j31J01R4k31K89
1326A24J36k91J05J34j48J36p8j68K02j78N7k10o6N11k82R6oK4m50M51j31k53
1348b85Rj38L95jJ54M52p66J1M19j23k92O1K59j96k90M77k23Q72j035l82L07j7
1370c32LR73o65L80J84p06K37j03K88o37N73q0j35j74N2k3J91k2k3L4K59j75l2
1393F7q1k10L45K9j89k24L95p9L21m62l2J62j81J06J62J00l07q5R3j77J95K24
1415A72q9j93J83J98j87k13N1M07m69N9J83k31J32J19j39p8J39L50k02j23J44
1436B13j70oo6k02L71J6k86rK4l5J4L01k99J67j83K8mL53l12O7j41L77l00j6J11
$$ plain form
1461 13 -187 52 -123 100 -349 103 268 40 50 245 13 74 -171 111 -95 -52 188 141 -76 -186 55 75
1483 75 96 -228 -64 423 -53 -86 108 -8 -137 6 154 240 -17 -345 -166 90 -28 -196 119 54 -111 -120
1505 -120 106 -183 156 55 108 -34 -222 57 -8 -115 -145 138 -154 -11 -61 55 -11 -42 2 133 -36 -161
1527 -161 -27 -68 16 -1 152 -43 188 -166 -142 -156 -72 428 267 -97 41 -155 136 73 -18 323 -18 187 48
1550 48 173 -31 320 -80 110 52 170 -75 47 -54 16 -150 115 154 -38 -55 31 -81 251 100 -88 193
1572 193 -220 43 139 162 111 -146 -9 27 79 -43 -2 187 -8 -235 -59 122 85 136 -27 -46 31 158 106 169
1596 169 -12 108 168 -90 54 -16 -208 81 -240 -143 30 183 22 140 -137 99 174 33 -275 -63 -87 180
1618 180 206 29 118 166 147 11 -423 68 168 -21 240 80 -207 -117 77 -108 33 46 -13 -51 -140 -121 275
$$ packed form
1461A3k00K39j75K23m49M52J65k28J0J95k32O1k45K82k06M3K40m7k17j10K41K0
1483G5K1l24J64M87m76l3J94j16j29J43J48Q6k57l28J79K56j18j68L15o5j65r
1505a20K26k89L39j01N3j42j88K79o5j07l0K83k92J43n0J16o6l1M4J31j69j25
1527a61J34m1Q4j7J53j95K31l54K4j4Q4N00j61l64J38j96K91o3r1L41l41K05j39
1550D8J25k04L51m00J90n8J18k45J22j01P0j66K65L9j92j7Q6j12L32j51j88K81
1572A93m13K63R6K3n1k57J37L6N2j22M1J89j95k27J76J81l7N1j63j9P7J27n2O3
1596A69j81J20O0k58J44p0j92K89l21R7J73J53j61J18k77K36P5j41l08K12k4K67
1618A80K6j77Q9M8j9j36m34M91J00j89K61j60k87R0J94j85J41J3n9l8q9J9L96
$$ plain form
1641 275 -25 200 -71 267 -13 76 86 84 -35 23 -93 -92 42 15 164 -137 70 -124 -218 45 373 -125 -138
1664 -138 -168 -268 -85 93 -111 107 333 -55 7 131 -73 -11 -24 -186 269 -102 239 81 27 125 63 211
1686 211 251 -144 -188 62 149 -127 1 172 122 104 -43 -323 -164 -134 -234 -95 -38 -141 -218 -128 -334 178 68
1709 68 -114 -277 14 233 -157 -150 176 15 6 126 -136 84 87 141 -51 123 -114 86 -42 -226 83 38 -192
1732 -192 -165 147 -83 -175 26 -174 68 -71 -191 -82 -164 -293 58 213 -266 -170 94 -376 -228 -125 -10
1753 -10 -30 -220 -75 -103 -153 61 -114 -258 -47 151 -161 -52 112 -57 -69 -17 -25 73 -81 -18 134 -104 170
1776 170 346 -1 -255 -62 69 25 -8 -160 116 84 -34 81 14 -24 77 -181 270 94 102 -36 65 62 -37
1799 -37 240 207 48 -115 135 -29 41 -192 -286 -23 424 -113 -59 -293 145 49 56 -164 66 -14 106 -237 -128
$$ packed form
1641B75l00K25k71L38k80Q9J0kj19N8j16JJ34k7J49l01K07j94r4K63L28m98j3
1664a38l0j00J83J78k04K18K26l88O2J24k04O2j3j62M55l71L41j58n4R8o2J48
1686B11M0l95m4K50Q7k76J28J71n0j8j47k80J59L0j00J39N7j03p7R0k06N12j10
1709F8j82j63K91K19l90PL26j61rJ20k62K20LN4j92J74k37K00j28j84L09m5k30
1732a92K7L12k30r2K01k00K42j39j20J09q2j29L51J55m79R6K64m70J48J03J15
1753a0k0j90J45k8n0K14j75j44K11J98l12J09J64j69j2N2qR8j54O3J52k38K74
1776A70J76l47k54J93J31m4l3j52K76l2j18J15o7l8J01k58M51j76Qj38J01lr9
1799c7K77l3j59j63K50j64P0k33r4K63M47n37N4k34M38r6Pk20K30q0J20l43J09
$$ plain form
1822 -128 -602 165 316 77 243 -237 500 -213 220 -582 -195 -4 707 -966 -59 -725 -285 -986 -124 233
1842 233 -138 -126 -109 -19 -1 153 -302 349 -93 -25 60 72 169 179 -85 15 -11 134 188 33 116 -266 -80 -234
1866 -234 49 -12 240 -45 -186 -103 321 7 -82 -15 -21 94 53 -30 -82 -12 120 -9 -128 52 35 95 -102 94
1890 94 12 -198 165 -145 -184 -160 -148 13 -71 35 -312 -142 -245 -105 -46 -186 -29 193 133 -12 -214 -100 299
1913 299 -135 159 -47 148 217 190 70 173 -17 16 24 67 51 3 -255 12 -193 -66 63 225 -158 68 194
1936 194 -53 72 100 -243 76 158 40 -148 58 85 -185 -193 -426 120 -114 -130 -67 266 212 81 -210 -2 -31
1959 -31 -9 74 86 -329 144 139 1 -14 -130 -273 166 -81 167 -57 120 -65 -265 80 114 199 -161 -75 -109 -64
1983 -64 56 36 105 300 -260 -252 -147 48 -219 73 57 -154 -45 107 37 0 4 -178 20 81 2 155 135 33
$$ packed form
1822a28m74P67J51k39J66m80P37p13M33q02L87J91P11j673R07o66M40p01Q62L57
1842B33l71J2J7R0J8J54m55O51m42O8Q5J2R7J0k64J00k6J45N4j55Q3l82J86j54
1866b34K83o1K52k85j41Q3M24l14q9O7oJ15m1q3n2P0J32j29j19J80j7O0j97J96
1890I4q2k10L63l10l9K4J2J61q4J06l47J70j03J40N9j40J57K22o0j45k02J14L99
1913B99m34K94k06J95O9k7j20J03j90L3QM3j6m8k58K67k05J27J29J62l83K26J26
1936A94k47J25K8l43L19Q2j18j88K06K7k70qk33N46k34j6O3L33n4j31k91K08k9
1959c1K2Q3J2m15M73nj38j5j16j43M39k47K48k24J77j85k00L45L4Q5l60Q6l4M5
1983f4J20k0O9J95n60QJ05J95k67K92j6k11J09J52p0l7Mj82J98O1p9J53k0j02
$$ plain form
2007 33 -52 141 -140 63 -321 -99 -87 -96 90 28 9 -77 8 -117 -200 -33 2 -50 -12 -189 -142 -65 -149 -103 14 111
2033 111 48 -97 6 64 297 -127 -62 -169 -127 54 -286 -142 -153 -156 72 22 84 83 -113 -280 284 -34 -12 174
2057 174 -163 -56 -314 -1 -225 -170 139 -125 -67 -240 75 42 471 57 152 -27 -166 -307 196 64 128 -91
2079 -91 -80 -110 -308 -144 -282 293 45 100 -7 -377 148 -72 -2 -336 -57 50 -91 63 231 -5 -175 -30
2101 -30 -146 213 326 -123 -80 70 -31 -156 77 174 139 -49 155 286 9 -72 -57 -219 58 22 -168 61
2123 61 224 76 -223 74 27 -62 189 16 -113 61 -37 109 -91 -69 41 129 153 -108 -254 -5 -634 -95
2145 -95 -187 212 24 82 82 116 62 -101 -228 -115 88 127 -74 -160 -126 -1 -124 7 -4 -269 210 -64 -68 -29 23
2170 23 -94 -35 -79 -23 119 1 132 225 -42 -140 -271 -156 123 137 226 -178 -106 254 170 163 -11 -204 311 202
$$ packed form
2007C3q5J93k81K03l84K22J2rJ86o2j9q6Q5j25q3J67L5n2L8j77M7P7q4M6J17R7
2033A11o3j45J03N8K33m24O5j07M2J81l40J44j1lK28n0O2jj96j67N64l18K2J86
2057A74l37J07k58L13k24N5L09k64N8j73L15l3M29m14R5j79j39j41N03j32O4k19
2079i1J1l0j98J64j38N75k48N5j07l70N25k20P0l34K79J07j41J54J68k36j70J45
2101c0j16L59J13m49M3J50j01j25K33R7l5j88K04J31k77q1J5j62K77l6j90K29
2123F1J63j48k99K97m7q9K51j73j29J74r8J46k00K2J10Q8K4k61j46K49o29N39
2145i5r2L99j88N8%L4n4j63j27J13K03L9k01q6L4J25j23J31j1k65M79k74mL9N2
2170B3j17N9m4N6J42j18J31R3k67r8j31J15K79J4Q9m04P2L60q4pj74j93N15j09
$$ plain form
2194 202 72 72 -61 -552 -7 1 -356 184 -27 78 36 133 21 184 -72 45 -52 -95 58 -13 -30 247 56
2217 56 -194 -322 -126 204 -75 -140 96 121 -67 254 -183 87 -68 -172 35 85 52 -175 -148 27 19 -162 -86
2240 -86 -167 18 -172 27 1 -156 364 169 249 -93 22 120 -130 139 66 246 -41 -116 2 67 126 153 -150
2263 -150 225 -106 -642 -44 -36 31 -74 4 112 -211 -4 -68 61 -57 4 8 168 -237 18 -134 -126 -140 -154 48
2287 48 80 -171 -225 48 -51 -43 416 -105 81 25 -201 -179 -34 -90 83 15 -167 -20 53 130 -77 41 -83 160
2311 160 -39 84 41 -146 309 -50 -108 -131 -150 -140 152 -54 69 -170 37 100 -109 -116 154 -66 46 16 -14
2334 -14 -33 -86 13 78 -143 -147 -36 138 143 -76 -1 69 -117 -96 -231 197 -43 -55 127 -99 -124 36 -105 25 72
2359 72 137 -148 50 159 -164 -6 -248 -133 107 -84 -146 325 -45 -100 143 -177 68 66 28 -116 -296 -101
$$ packed form
2194B02j30%j33m91N45Ql57N40k11J05m2R7j12J63k56J17r7m3J53p1j7K77j91
2217E6k50j28J96L30k79o5K36K5j88L21m37K70j55j04K07N0l3k27K7J75qj81P6
2240h6q1J85j90J99k6j57N20j95Q0l42J15R8k50K69p3J80k87p5J18O5N9K7l03
2263a50L75l31n36N98QO7j05P8J08l23K07o4J29j18O1MJ60m05K55j52Qj4j4K02
2287D8L2k51n4K73r9QM59n21J86n6k26K2J45n6J73o8j82J47P3P7k07J18j24K43
2311A60j99J23m3j87M55l59n8k3j9J0K92k06J23k39K07O3k09pK70k20J12l0l0
2334a4j9n3R9O5k21mJ11J74Nk19P5P0j86K1j35M28k40j2J82k26k5J60j41J30M7
2359G2O5k85J98J09l23J58k42J15K40j91o2M71l70n5K43l20K45kl8j44j80J95
$$ plain form
2381 -101 60 -307 -71 231 211 -125 38 -38 42 76 -112 66 -155 1 -54 -369 -240 17 -113 -77 -89 -43 15
2404 15 -45 -244 89 -35 -16 347 53 12 173 -22 185 -49 -159 -80 -148 -70 29 93 60 -100 293 144 -109
2427 -109 214 -44 204 106 38 -48 -9 276 -115 30 10 -63 65 62 -359 0 -60 90 -452 -187 224 36 -106
2450 -106 56 -33 75 -3 60 -42 -186 -133 -177 -168 13 161 -39 -91 33 187 183 -163 11 -59 67 75 151 -63 -207
2475 -207 -261 80 -59 86 -18 -49 295 213 -35 146 13 -33 -140 425 398 200 -154 -285 -122 -480 -165 349
2497 349 -75 459 -259 -684 -241 390 19 -99 943 326 128 219 638 283 -73 -151 -290 -405 316 -361
2517 -361 624 -4 284 -598 -1 179 449 439 -450 288 -252 395 40 -151 119 167 94 -86 33 97 230
2538 230 -383 -237 255 -337 -61 235 -144 43 -115 -99 8 184 199 163 83 135 -154 295 -52 -205 -53 -251
$$ packed form
2381a01J61l67K36L02k0l36J63p6Q0L4j88J78k21J56n5l15J29K57j30L6j2M6N8
2404A5o0j99L33j24J9L63k94m1J61j95K07k34j10P9o8P8R9O4l3j60L93j49k53
2427a09L23k58K48r8o8q6L9K85l91J45k0p3J28lm21L59o0J50n42K65M11j88j42
2450a06J62q9J08p8O3j02j44N3m4RJ81J48k00n2J24J54ml46J74p0J26QP6k14j44
2475b07n4L41j39J45j04l1L44q2k48J81j33m6j07N65k7j98l54j31J63l58L15N14
2497C49m24N34p18m25M43O31l71j18J042o17j98R1M19l55l56p8j39j15P21o77
2517c61R85o28K88q82N97J80K70j0q89P38n40O47l55j91K70M8p3j80J19O4J33
2538B30o13J46M92n92K76K96l79J87j58J6J07J76J5l6q0N2k89M49l47j53J52j98
$$ plain form
2560 -251 -171 290 89 192 -270 263 241 -33 348 -463 32 19 12 196 27 -300 255 -309 -621 -523 -148 78
2582 78 -16 146 -50 87 -108 100 147 -138 30 100 -6 51 -74 -233 26 -294 -188 -119 -45 -32 318 295 164
2605 164 414 -67 -322 -81 395 -134 253 -117 -148 22 119 90 141 250 -175 -98 65 254 -48 -142 -12 253
2627 253 -220 113 0 297 146 -88 -110 -16 105 56 166 95 59 -180 11 67 79 -48 -19 293 -200 285 -79
2650 -79 202 -64 -102 -178 -198 126 191 -323 2 98 105 107 -207 51 54 -163 90 94 -9 -23 77 14 114 158 121 -54
2676 -54 86 -4 216 -218 -204 160 -58 -132 265 -38 131 106 -47 -180 -98 74 -40 -272 232 -226 8 52
2698 52 337 92 -74 -33 -328 123 -45 227 -199 40 47 20 -31 116 -40 -227 50 1 105 -74 -146 153 -252
2721 -252 248 144 -176 127 72 -164 -88 -23 -174 159 -71 -174 219 -260 64 81 110 61 89 88 153 -12 138
$$ packed form
2560b51Q0M61k01J03m62N33k2k74L81q11M95j3pJ84j69l27N55n64l12R8L75K26
2582G8r4J62j96J37j95K08M7k85J68P0j06N7j25j59K59l20J06O9P4J3L50k3j31
2605A64K50m81k55K41M76n29L87l70l1J70R7k9N1J09m25P7J63J89l02r4J30K65
2627B53m73L33j13K97j51k34k2R4J21m9J10p1l6k39J91N6J2j27K9L12m93M85l64
2650g9K81k66l8p6k0L24O5n14L25R6PKl14K58Lk17K53Mj03j4J00o3J00M4l7j75
2676e4J40r0K20m34J4L64k18p4L97l03J69k5j53j33Q2J72j14k32N04m58K34M4
2698E2K85k45j66M1k95M51j68K72m26K39Pk7n1J47j56j87K77m9J04j79p2K99m05
2721b52N00j04l20L03n5k36P6O5j51L33k30j03L93m79L24J7K9m9K8jO5j65J50
$$ plain form
2744 138 64 21 14 -39 -216 9 1 -13 103 -141 -155 21 260 87 115 -228 -17 136 -5 93 -99 45 22 -308
2768 -308 98 -58 -182 -15 -71 13 129 -92 -19 89 218 -10 189 171 -21 72 -213 91 231 139 -75 157
2790 157 -74 161 -25 116 -59 65 276 27 -126 81 -17 168 154 84 253 86 -117 113 11 226 18
2811 18 -48 61 -17 224 -58 51 -62 115 -176 24 -137 -26 -47 -74 196 -158 -210 -52 58 118 57 -149 121
2834 121 -116 5 157 -52 -10 -48 166 -85 -161 -22 61 -2 49 -219 -195 -166 130 45 -237 -148 45 -164 211
2857 211 59 -205 -6 56 -34 -127 114 101 36 2 12 122 186 48 -311 201 -103 -258 137 -279 -81 29 -18
2880 -18 -84 134 -38 163 383 92 49 58 27 171 84 16 267 64 -178 -140 -136 -18 -97 -67 176 -97 -178 196 -129
2905 -129 -25 -81 -20 -79 -100 -101 -128 69 31 59 277 -70 -74 152 -97 190 302 15 5 55 88 102 207 223 -119
$$ packed form
2744A38p4m3pn3j77K25qj4J16k44j4J76K39j73K8l43K11J53j41R8j92J44k3l30
2768c08M06j56j24J67n6Q4J16k21P3J08J29k28J99j8j92R3k85L04J40r2k14K32
2790A57k31K35j86J41j75J24K11k49j53K07r8J85j4p0J69j67k03K30j02K15k08
2811A8o6J09p8K41k82J09j13J77k91K00j61J11k1k7K70l54n2J58J10O0o1k06K70
2834A21k37J21J52k09M2l8K14k51p6J39Q3o3N1k68K4K9K96q5k82Q9J93k09L75
2857B11j52k64J99O2r0r3K41j3o5l4J0J10O4j38l59N12l04j55L95m16J98J10m7
2880a8o6K18j72K01K20k91m3Rl1J44q7o8K51k03k42L8MJ18p9L0K43k73q1L74l25
2905a29J04n6O1n9k1jk7J97l8K8K18l47mK26k49K87J12k87j0N0L3J4J05J6l42
$$ plain form
2930 -119 234 -177 22 13 -125 73 -106 -48 161 -230 -48 38 -242 135 205 -9 11 274 -303 -77 207 213 611
2953 611 188 345 180 -48 26 -84 -335 135 -70 -53 225 167 78 -3 -190 -131 -24 20 -30 9 122 -20 -209
2976 -209 27 -11 -38 -131 66 29 -13 -18 -226 29 261 -130 -9 -191 -44 75 17 -38 10 -134 -51 -111 154 178
3000 178 11 95 -168 181 190 -13 -40 76 90 138 72 29 76 70 -60 -135 -39 49 -13 -170 74 209 -97 -147 119
3025 119 12 -142 28 -323 -211 -100 146 40 122 92 -60 108 -152 -124 42 -82 81 -1 82 178 201 -182
3047 -182 -26 80 -214 213 179 148 -12 195 65 -98 124 -202 110 40 111 17 50 42 -360 -338 2 -374 75
3070 75 14 26 32 -153 102 -90 -189 39 168 -31 -171 8 -204 50 -45 -121 -267 -17 -15 -226 -37 -82 133 -292
3094 -292 -158 -23 329 -111 -113 -125 -171 162 -110 114 -42 112 128 -132 -127 -127 165 190 -102 60 -11 -173 46 -25
$$ packed form
2930a19L53m11J99rj38J98j79N8K09l91J82Q6k80L77P0k14K0K63n77K26K84OL98
2953F11m23J57j65k28P4j10k51M70k05J7K78n8q9q1j87N9J07M4n0L9J13j42j89
2976b09K36l8k7r3J97l7m2nk08K55K32l91J21j82J47J19n8n5M8j44Q3o0K65K4
3000A78j67Q4k63L49Rk03k7J16J4M8o6m3M7oj30p5R6Q8o2j57K44J35l06n0K66
3025A19j07j54J70l51J12J11K46j06Q2l0j52J68k60K8J66j24J63q2Q3R6K3l83
3047a82J56J06k94M27l4l1j60K07j30j63K22l26L12p0P1r4L3qm02K2L40l76M49
3070G5o1J2Oj85K55j92r9K28J29j99j40J79k12K54r5p6j46K50Kk11J89m5K15m25
3094b92J34J35L52m40kj2m6L33k72K24j56J54J6k60N%K92K5k92J62p1j62K19p1
$$ plain form
3118 -25 10 154 20 -172 185 165 -50 -37 -81 148 71 238 23 -152 256 -187 -7 83 -43 48 -27 56 94 -91
3142 -91 84 -11 -106 -53 136 -35 83 -30 49 141 12 70 12 -13 72 -112 -228 69 -28 1 -2 93 202 -43 -23
3167 -23 202 61 194 57 53 68 -27 256 467 -10 -153 13 -88 48 129 39 -22 -183 122 112 -94 -92 -100 101
3191 101 -8 134 -94 239 -71 -39 16 -99 101 37 -218 128 -87 -280 -73 -161 21 -106 53 -26 -78 -97
3213 -97 52 97 -156 -116 5 34 176 -147 -117 -83 -109 -162 -114 -56 -71 -126 59 -100 -93 245 71 353 84 -36 -43
3238 -43 -142 325 -103 3 176 -69 333 -261 4 -84 29 88 41 48 -73 -331 -18 29 -222 89 -14 -73 -30
3261 -30 -40 -15 -24 -102 559 -2 -217 201 -261 182 -8 -70 -105 5 -95 -228 -201 346 92 -147 154 -136 41
3284 41 74 45 163 285 65 -246 252 -191 -275 152 86 30 92 -205 -84 -648 -148 162 26 -86 -41 10 18 -284
$$ packed form
3118b5L5J44j34j92L57k0k15J3m4K29p7J67k15j75M08m43J80R0j26R1p5Q3L8j85
3142i1J75r5r5N3J89j71J18j13P9R2j29N8n8k5Q5j84j16K97r7K9lR5J09k45K0
3167b3K25j41J33j37mJ5r5K83K11m77j43J66j01J36Q1r0o1j61L05j0k06KqK01
3191A01j09J42k28L33l10L2N5j15K00o4k55L46k15j93K07q8J82j27J59p9n2j9
3213i7J49M5k53M0J21K9J42l23L0L4k6n3M8N8j5n5J85j59PL38j74K82k69j20p
3238d3r9M67m28J06J73k45M02n94K65q8J13N9m7Pj21k58L13M7k51L11j03n9M3
3261c0j0K5rp8O61n61k15M18m62M43j90o2l5J10j00j33K7N47k54k39L01k90J77
3284D1L3k9J18J22k20l11M98m43q4M27o6n6O2k97J21n64N00L10j36j12M5N1Ql02
$$ plain form
3308 -284 56 92 67 159 -205 58 -135 -2 -39 57 -221 -147 25 36 -13 87 -169 -26 -22 244 50 68 -152 120
3332 120 -134 141 -100 -71 53 -47 211 246 228 -103 -58 98 25 -3 -12 103 48 -51 -81 -80 159 -166 -114 202 -28
3357 -28 0 -256 126 -73 75 23 -43 93 -91 -334 134 -24 277 -185 -300 -413 248 214 -355 65 -228 -16
3379 -16 -230 434 -189 -65 131 -60 -179 -159 -80 -87 76 293 13 -148 237 -162 312 -213 267 11 163 -80
3401 -80 -133 0 96 -98 -160 73 121 81 -193 34 -227 -226 4 53 -95 -42 -34 39 -317 72 -99 -157 -92 100 198
3426 198 -66 79 11 -217 127 66 -166 -12 221 197 -74 155 -43 101 -79 -197 87 51 -112 228 -78
3447 -78 87 -38 95 133 -218 15 -55 240 117 -82 -174 74 96 -138 -232 -177 -93 -33 -149 114 -79 125 -119
3470 -119 -97 -134 10 -138 -219 -130 -76 152 -242 123 -23 -139 -76 -71 55 172 163 -146 265 279 8 142 97 -44
$$ packed form
3308b84L40L6k5R2l64K63j93J33l7R6k78P4J72J1m9J00k56J43MK66j94J8k20K72
3332A20k54K75k41K9J24j00K58L5j8l31M5J56p3k8rJ15n5r9l0JK39l25N2L16k30
3357b8K8k56L82j99J48n2o6J36j84k43M68j58L01m62j15j13O61l4n69M20k93K12
3379a6k14O64o23J24J96j91j19K0P9pJ63K17k80j61L85l99M74n25M80k56J52k43
3401h0n3J33R6j94o2K33M8m0k74K27k61JK30M9j48N3QP3l56L89j71n8O5J92R8
3426A98k64J45o8k28L44o1k32J54K33k4k71K29j98J44j80j18K84l6j63L40l06
3447g8J65j25J33L8l51K33p0K95j23j99r2K48K2k34r4N5Q4O0j16K63j93K04k44
3470a19K2l7J44j48q1Q9N4K28l94L65j46j16O3NJ26J17rl09M11J4k71J34m5j41
$$ plain form
3494 -44 -202 -109 -32 1 -64 94 7 -13 40 -28 340 187 206 -323 -300 203 -85 77 -164 125 143 132 -136 -117 -153
3519 -153 -120 32 -299 88 43 -318 37 -74 30 -56 39 -104 31 -171 -54 -56 287 218 66 -199 211 -245
3541 -245 41 109 51 -245 72 171 24 85 -320 219 122 161 -71 -18 248 -255 -73 300 217 50 225 -164 -188
3564 -188 -71 -395 -150 9 -181 46 2 11 -4 40 -71 3 229 -177 -166 123 -93 -118 -105 12 -23 170 -37
3587 -37 -43 -253 127 18 -30 55 55 -110 -94 -119 67 287 69 248 113 -96 4 -24 -307 -228 225 -175 -249 -96
3611 -96 -71 -142 -17 72 -119 -4 -60 192 -67 69 -139 -78 342 44 -133 45 -97 -32 22 -92 107 -16 67
3634 67 51 -32 104 224 -211 53 63 40 -153 4 -104 191 34 23 121 -154 245 -365 -42 193 -26 71 -208
3657 -208 -41 108 -115 88 -143 120 121 -170 -137 87 176 18 94 -229 5 -104 230 -22 -68 -43 -53 -360 -145
$$ packed form
3494d4j58R3P7L3o5J58q7k0N3o8L68j53J9n29K3N03k88J62k41K89J8j1k68J9l6
3519a53L3J52l31L87m5l61L55j11J04q6R5j43J35k02J17kL43o9j52k65M10m56
3541b45K86O8n8k96L17R9j47O1m05N39r7L9k32N3K66n03J82L73q3j67J75l89k4
3564a88J17l24K45J59j90K27m4Rj5M4j11P4K26m06J1K89k16k5J3J17l5J93k07
3587c7ok10L80j09m8Q5%j65J6k5J86K20k18J79j35k09J00k8k83P9M53m00p4J53
3611i6K5p1J25Q9j91J15n6K52k59J36k08O1M20k98j77J78j42O5N4j14J99j23Q3
3634F7j6q3J36J20m35K64J0k3j93J57j08K95j57j1R8k75L99o10L23K35k19R7k79
3657b08J67J49k23K03k31K63Jk91L3K24Q9j58P6l23K34j09L34k52m6K5j0l07K15
$$ plain form
3680 -145 75 -65 -71 -61 -231 -26 -122 -235 -92 61 128 115 76 -88 -30 -54 255 -74 -173 233 200 44 -50 -14
3704 -14 -239 -66 -60 21 -10 -76 295 156 0 -200 -194 -106 -76 157 -324 120 52 -184 328 -143 42 -330 -48 -23
3728 -23 25 -59 134 -15 -209 4 -283 -136 -90 103 94 -312 -318 -7 -31 40 37 209 197 206 58 286 -134 -258 -45
3753 -45 -98 11 307 -73 6 -98 91 134 123 8 134 279 104 -23 -225 -55 -127 108 -85 -147 -338 -140
3775 -140 -102 121 290 -53 70 -32 -112 263 -140 -9 68 -182 -235 -127 -134 -37 -66 152 172 -60 171 -178 -193
3798 -193 -36 -184 -79 -23 -194 -198 -271 -144 -199 162 4 -184 -97 -174 -234 -251 -115 28 131 211 382 -129 1
3821 1 -504 -247 321 -43 207 -21 -673 306 622 -38 -376 -507 -154 -390 -303 -467 -415 609 54 52 -455 -3
3843 -3 378 379 -179 -458 -210 -254 812 -340 -352 -481 -418 -412 -100 -505 59 -578 843 214 -546 -574 -924 22
$$ packed form
3680a45K20j40oJ0j70K05r6j13J43J53O7j3l9j64N8k4L09l29r9M06l3j56r4L6
3704a4k25J73OQ1l1o6L71j39j56k00OQ8L0K33m81M44o8k36N12m71J85l72K82K5
3728b3M8q4J93j49j94K13k87J47M6J93rm06oL11k4P1lJ72j2Rj48K28m20j24K13
3753d5n3J09K96l80P9j04J89M3j1j15J26J45j75j27k02J70p2K35j93o2j91J98
3775a40L8K23J69l43J23j02q0L75m03J31P7k50n3J08pR7k9K18K0k32K31l49j5
3798a93J57j48J05N6j71mp3J27n5L61j58j88Q7p7o0j7J36J43J03Q0J71n11J30
3821An05K57N68l64K50k28o52R79L16o60l38j31L53k36Q7j64N2J024n55kn07M52
3843cL81Jn58k79K48m4J066j152j2j29O3OL12m05N64o37J421o29p60k8l50R46
$$ plain form
3865 22 -60 26 214 -230 88 142 446 555 191 30 -29 36 109 698 -181 -583 453 -69 -35 -94 -280 296 324
3888 324 491 -68 237 -199 -238 194 97 -97 507 468 603 -486 -121 25 -251 62 82 -275 48 234 -61
3909 -61 -53 -78 50 -10 -58 68 115 133 -52 -15 168 154 158 -138 -263 -96 149 128 238 16 -88 14 270 -161
3933 -161 -107 -21 264 -170 94 -186 113 -232 -62 -50 124 -79 78 -119 -118 -146 -68 187 248 -137 -111 136 210
3956 210 -207 -268 42 -54 184 116 110 -164 65 19 40 -69 109 209 19 -355 -30 -15 138 -205 -56 -136 -106
3979 -106 31 26 -287 140 299 -227 -247 -171 -43 65 100 -19 -36 -22 -58 -175 8 185 -133 -12 -40 191 -70
4002 -70 69 77 61 87 -110 200 -29 117 97 94 -8 -1 34 119 -88 3 56 -75 -135 19 -146 10 -5 8 11 34 124
4029 124 242 87 35 24 87 -149 6 -205 -180 -10 -59 145 -196 -13 -160 -171 -65 113 -32 7 12 -257 14
$$ packed form
3865B2q2Q6J88m44L18N4L04J09l64j61n9O5P3N89q79m02J036n22L4n9j86N76K8
3888C24J67n59L05m36l9M32r7j94O04l9J35j089L65J46k76L13K0l57L23J86k95
3909f1Qk5J28o0m8J26M7J8j85L7J83j4Mk96j25J67K45k1J10k22j04J02K56m31
3933a61N4Q6K85m34K64k80K99l45J70J2J74k03J57j97Jk8P8K55O1l85K6K47P4
3956B10m17o1L10r6K38o8ok74K29m6K1j09J78J00j90l74L25J5J53l43J49q0L0
3979a06J37nl13M27J59n26k0P6J28J08L5j19j7J4l6j17J83J77l18J21k8K31k61
4002g0J39Qj6K6j97L10k29J46k0lj02PL5Q5k07R1N3j31o0J54j65J56j5J3LK3R0
4029A24J18j55n2j1O3k36J55k11K5J70m9K04l41J83j47j1J06J78j45L9Nk69K71
$$ plain form
4052 14 -258 -23 -67 -222 -38 170 274 -101 -60 9 137 51 193 -29 112 58 -120 9 -362 47 177 -160
4074 -160 -98 -153 34 25 -76 199 -148 70 147 44 -287 -70 -93 -286 216 8 -8 -228 -349 13 -154 24
4096 24 178 36 -68 117 5 -146 104 35 -9 -74 16 -47 153 86 158 162 -158 11 62 95 102 7 -33 69 32 27
4122 27 162 41 -98 257 35 7 -70 -62 -167 90 -26 51 -60 23 -306 -195 160 -34 315 108 341 -80
4144 -80 -15 -101 -96 243 288 75 -54 21 2 -175 -177 -251 193 133 -221 -120 159 -132 -301 74 54 64 -199 -34 -208
4169 -208 80 65 100 113 -127 -83 30 138 -80 19 -229 -14 108 162 55 -255 98 36 -288 9 -63 65 195
4192 195 417 -112 150 74 81 -241 90 -148 -61 -134 9 320 -129 93 100 -198 135 -52 168 16 193 52
4214 52 -16 231 28 236 15 12 -188 -199 93 -185 -167 -66 169 120 118 -105 -1 -48 71 165 -181 -118 45 87
$$ packed form
4052A4k72K35m4j55J84K08J04l75M1O9J28q6J42k22J41n4j78J29l71M09J30l37
4074a60O2n5J87rj01K75l47K18P7j03l31K17k3j93N02k08j6k20j21L62j67J78
4096B4J54j42j04J85j12j51K50o9m4o5R0o3K00o7P2Ml20J69N1L3Pr5m0J02l7n
4122B7J35j21j39L55k22k8p7Qj05K57j16P7j11Q3l29J11L55j94L49k07K33m21
4144h0O5q6NL39M5k13j29P5j9j77kp4M44o0l54J01K79k91j69L75k0J0k63J65j74
4169b08K88j5L5J3k40M4J13J08k18R9k48K15J22N4j07l10L53o2l24K97p2J28J30
4192A95K22n29K62p6Pl22L31k38Q7p3J43L11m49K22Pk98L33j87K20j52J77j41
4214E2o8K47k03K08k21lk00j1K92k78J8J01K35m9kk23J04m7J19R4l46O3J63M2
$$ plain form
4238 87 90 100 -184 195 -72 -97 -141 234 5 172 202 68 54 -7 -44 -199 148 -104 90 -118 -93 -117 -160 94
4262 94 -327 157 -163 93 -209 -13 150 290 207 -114 168 210 85 45 -122 -181 -156 -197 17 102 -5 113 -62
4285 -62 105 -7 -191 -14 -65 340 58 -223 164 -106 -24 116 -156 13 -155 -152 72 -94 -22 -151 155 75
4307 75 109 143 8 43 -74 127 -213 -51 -149 -91 130 -57 164 -6 -174 141 12 -7 144 121 126 -89 124
4330 124 -173 51 17 80 -39 -20 51 -13 -123 22 264 -88 -205 -238 -105 -100 66 -151 -101 -12 9 -125 237 20
4354 20 -155 -377 316 105 127 -42 -117 -148 -267 -74 0 166 25 -126 -105 170 -8 59 310 -181 -56 -180
4376 -180 38 -196 -110 75 177 -19 64 -319 38 -93 -82 -60 -204 -150 70 115 42 92 135 -269 49 -33 -215
4399 -215 10 232 0 211 -13 136 -68 -24 79 140 -303 -203 -84 153 -26 -269 -38 191 -143 3 -26
$$ packed form
4238H7LJ0k84L79k67k5m4L75k29J67L0j34j4o1l7j55L47k52J94k08K5k4m3K54
4262I4m21M84l20K56l02J96J63J40q3l21K82M2j25m0j67n9K5m1K14Q5j07J18j75
4285f2J67j12j84J77n1M05k82k81L87k70Q2J40k72J69j68LK24j66P2j29L06q0
4307G5L4L4j35L5j17K01l40J62r8N8K21j87K21j70j68L15j29j9J51k3Nk15K13
4330A24k97K24l4O3j19J9P1o4j10J45K42l52j17l3J33NJ66k17N0Q9K1j34L62k17
4354B0j75k22O93k11K2j69p5l1j19J93P4J66j41j51K1K75j78O7K51m91J25j24
4376a80K18k34Q6J85J02j96Q3l83L57j31J1K2j44N4K20M5p3N0M3m04L18q2j82
4399b15K25K22k32K11k24J49k04M4J03O1m43J00J19K37j79k43K31K29l34J46k9
$$ plain form
4420 -26 -24 218 127 73 -102 160 105 60 -11 -20 -73 149 -21 -206 81 10 -108 -101 -93 -136 -27 87 -214 204 34 339
4446 339 -25 23 43 -95 61 -101 -65 -70 46 63 -23 161 40 -177 107 -203 17 -102 -1 74 -120 234 93
4469 93 153 125 -135 -240 208 156 -274 -16 45 30 69 149 154 94 30 60 -176 69 -150 110 -162 -3 107 -339
4493 -339 -143 -82 26 141 112 -171 123 -154 -16 17 208 -115 -141 -56 107 85 4 -197 169 -37 21 135 -44
4516 -44 37 20 50 -226 -56 -13 192 91 -18 -173 18 -94 32 -171 44 87 87 28 0 14 -28 -101 118 -73
4540 -73 -220 -132 241 -168 86 -45 86 -147 -146 194 -13 44 7 136 -223 117 -135 -68 211 123 52 -61 -172
4563 -172 239 -56 -162 62 -238 34 -36 164 -147 136 52 80 -418 -11 -305 -74 -34 -58 102 -42 -2 -122
4585 -122 251 32 218 77 -125 25 1 42 47 39 16 -82 -254 126 -38 40 124 -120 -128 -91 37 -54 -123 28 -40
$$ packed form
4420b6KK42r1n4j75K62n5m5p1rn3K22j70j85K87p1j18PQm3J09J14l01M18j70L05
4446C39l64M8K0j38J56j62L6nJ16J7q6J84j21k17K84l10K20j19J01P5j94L54j41
4469I3O0k8k60j05M48n2m30K58O1j5L9Q0No0o4L0k36K45k19K60k72J59J10m46
4493c39J96O1J08J15k9k83K94k77J38L3J91l23k6Q5J63k2q1k01L66k06N8J14j79
4516d4Q1j7L0k76J70M3K05j01j09j55J91j12J26k03K15M3%n9k8J4m2p3K19j91
4540g3j47Q8L73m09K54j31J31k33JL40k07N7l7J29l59L40k52O7K79q8p1j13j11
4563a72M11k95j06K24l00K72p0K00l11K83q4K8m98M07k94K31M0k4J60j44M0j20
4585a22L73k19J86j41k02J50k4M1Nqk3r8j72L80j64P8Q4k44qL7J28r1o9J51o8
$$ plain form
4610 -40 -89 -126 -191 -59 200 222 -174 -269 -53 129 75 -132 -24 56 26 114 62 -55 -294 206 -97 78 -86 -260
4634 -260 -150 -102 54 -26 -101 160 -11 129 -119 -149 -48 -208 -93 172 -120 -61 67 25 -180 -22 -216 300
4656 300 230 -200 236 111 113 114 -235 -24 -20 -227 -135 188 238 -2 214 84 -102 175 74 -332 140 -67 1
4679 1 59 48 133 15 -153 -158 -109 -161 -3 -112 -96 207 40 -102 -61 -83 -243 -176 51 -2 4 -299 256 -23 -196
4704 -196 88 214 59 -14 -67 12 -7 277 51 -22 234 5 -140 310 8 171 -55 25 -241 351 166 -381
4726 -381 -200 49 -157 -96 143 217 -51 -236 66 31 17 172 88 219 -21 -62 153 159 -217 -107 231 -272 -87
4749 -87 -59 11 63 260 135 206 66 -207 -42 -335 -66 -179 -193 -341 -8 80 167 -114 151 70 284 -71 138
4772 138 72 -273 -47 195 29 -154 62 -240 315 247 -150 -128 -119 7 155 11 -171 -93 172 -25 129 134 -95
$$ packed form
4610d0m9l7o5J32K59K2l96r5K16J82n4k07J08Q0l0Q8n2j17k39N00l03J75j64j74
4634b60J10M8J56q0p5K61j71J40k48l0J01j60J15K65k92N9J28m2k05J58j94N16
4656C00p0m30M36j25KJl49K11Mk07R2L23N0k40K16j30j86K77j01m06M72k07O8
4679AN8j1Q5j18j68nM9n2J58j09J6L03j67j42M1k2j60O7K27n3Ol03N55k79j73
4704a96K84J26j55p3n3P9j9K84k26p3K56k29j45M50l02J63k26Q0k66N92j85n47
4726c81J81K49k06O1K39P4k68j85L02l5j4J55q4J31k40m1K15Ol76J10L38n03J85
4749h7K8P0N2J97j25P1j40k73J65k93K69j13j4j48L33Q8Q7k81K65q1K14l55K09
4772A38o6l45K26K42j66j83K16l02N55o8l97K2RJ26J48j44j82P8K65j97J54Nk29
$$ plain form
4795 -95 44 -40 193 -129 -372 -241 135 58 -92 -67 -10 -77 68 -152 209 64 -323 -199 180 -101 -63 128
4817 128 329 -116 81 90 107 317 4 -6 22 97 187 -147 -126 8 24 -65 -185 -58 -55 377 10 174 207 21
4841 21 -83 -57 18 -164 -107 -158 -274 -301 -192 234 -62 69 109 323 -8 209 -52 -85 -38 -56 37 -52 -77 -241
4865 -241 201 199 -78 138 150 -119 -116 157 89 18 -57 -444 -304 11 29 152 277 36 73 -258 73 -60 -167
4888 -167 -99 82 29 215 -188 -90 -23 -36 84 -54 308 58 136 113 -142 -179 209 -404 -188 18 -141 5 27
4911 27 -67 279 11 -142 62 10 -43 -193 -90 261 -191 -143 -198 -160 -112 142 29 -281 -264 185 86 -87 -25 -70
4935 -70 -58 23 -246 11 -205 -156 -8 92 94 -174 -25 -124 5 238 26 -198 183 -27 -11 -53 -52 197 -209 -102
4959 -102 23 -63 -60 135 369 -56 -314 87 -228 271 259 -2 -53 -57 -169 203 -152 -221 99 45 -150 311 3
$$ packed form
4795i5J39q4K33l22k43J31L76p7j50K5N7o7J45k20L61j45l87J24L79k81L8J91
4817A28K01m45J97RJ7K10l13j0K8P5R0l34K1J34J6q9j20J27LM32l67J64L3j86
4841B1j04K6P5j82N7n1j16k7J09M26k96J31M0K14l31K17k61l3M7j8R3q9k5j64
4865b41M42kk77K16J2k69LK73o8p1p5l87J40L15J8J23J25k41L7l31L31j33j07
4888a67O8J81n3J86m03R8O7j3J20j38L62k50P8k3k55l7L88o13K16K06j59J46K2
4911B7r4L46k68j53K04n2n3j50J03L51m52M8n5L8M8K54j13l10J7M49r9j73O2m5
4935g0J2Q1k69K57k16M9J48J00Kk68J49r9J29K33k12k24L81k10J6m2JK49m06J07
4959a02J25q6LJ95K34m25k58M01l15M99j2k61n1mj12L72l55o9L20n4j95M61l08
$$ plain form
4982 3 134 53 115 133 297 -184 -45 -167 0 108 139 -11 -262 143 -162 92 69 72 76 -176 -65 73 152 86
5006 86 149 188 84 -172 -148 -196 34 -210 -115 -32 309 121 -513 -6 -157 30 -95 66 -223 -325 269 -451
5028 -451 -263 138 -107 -143 -59 -12 -8 -342 -192 192 111 -128 -234 191 -14 -68 -142 -22 -108 -42 136 -170 -174 -120
5052 -120 151 77 -51 -307 -55 174 -228 -28 185 -145 -95 46 33 -14 -70 15 -33 -26 133 144 -81 -21 112 -174
5076 -174 12 -133 174 -82 -22 -158 -250 -304 4 -301 79 110 100 117 -98 83 67 -14 41 -48 39 107 42 -147
5100 -147 -183 116 -359 -63 129 -2 -25 -30 -76 197 91 -136 -192 -67 -248 -85 -59 -60 -195 165 34 -84 -81 93
5124 93 108 204 165 141 -51 -44 68 -38 -229 73 65 180 -38 -156 82 -63 34 19 -195 -234 381 205 144 67 130
5149 130 137 260 -106 21 73 227 -7 -68 281 -5 56 -16 329 176 57 -114 150 -6 168 193 -292 406
$$ packed form
4982CJ31q1O2J8J64m81J39j22J67J08L1j50k51M05l05K54k3LMk52J11J38P9o6
5006H6O3L9j04k56K4m8K30k44R5Q3L41j88o34N07j51J87j25J61k89j02N94p20
5028d51J88M01k45l6Q4M7Ml34J50L84q1k39j06M25k05n4p4J20q6O6J78l06mN4
5052a20K71p4j28k56K52K29m02K00K13l30N0J41j3m7n6Q5m8PJ59J1k25O0J33k86
5076a74J86j45L07k56O0j36r2n4L08l05L80L1j0J7k15J81j6q1N5q9Q7O8o5j89
5100a47l6K99m75K96J92j31k3nm6K73j06k27n6J25j81J63K6jj35L60j31j18LJ74
5124I3J5R6l9k4j92PJ12j06j91L02qJ15k18j18K38j45R7j5k14l9O15j76o1p7O3
5149A30PJ23l66J27N2J54k34o1L49k86O1p2L45j53j19j71K64j56J74K5m85O98
$$ plain form
5171 406 163 -9 109 -78 155 -11 -16 37 -138 22 141 119 156 52 -31 -38 -65 82 -80 205 51 383 82
5194 82 -332 153 -296 102 -162 -121 82 -83 81 -130 -121 -105 -92 56 -123 136 -249 -35 -75 -105 -153 7 -159
5217 -159 -209 -115 186 29 -71 79 -96 -154 121 423 317 -187 -153 269 208 425 7 -172 267 -39 -95 -48
5239 -48 490 295 11 -421 -175 -137 8 119 59 -47 -302 -102 -45 126 375 -23 47 177 142 -206 506 197
5261 197 151 -184 227 -211 -380 180 113 241 272 -50 -265 391 28 -207 -333 -99 -73 -130 10 -257 6 316
5283 316 287 -29 6 162 -5 117 15 21 28 -131 -146 -39 -2 -95 334 -212 31 -369 -167 196 -411 342 -171
5306 -171 -87 83 -20 -105 30 -96 26 28 -54 -124 -168 -39 0 -36 90 260 253 60 58 67 98 -128 -167 299 295 -39
5332 -39 245 -32 -92 134 82 75 136 -20 -57 26 191 -40 -89 143 -39 -136 -2 -132 296 -166 217 -81 -46 114
$$ packed form
5171D06k43j72J18j87K33j66nN3j75J60J19k2L7j04q3pk7J47j62K85j54L32l01
5194H2m14M85m49L98k64M1K03j65J64k11RJ6J3J48j79K59l85K14m0l0m8J60j66
5217a59n0R4L01j57j00J50j75n8K75L02j06n04L4M22o1K17m18j79M39l06n6M7
5239d8N38j95k84m32K46L8J45J11o0j06k55K00N7J71K49l98P0J30l5l48P12l09
5261A97m6l35M11m38j69N60o7J28L1l22k15O56l63k35j26K34K6n7J40k67K63L10
5283C16k9l16L5J56j67J22j02OPj59j5J07L7r3M29n46K43m00K02L63o07P53n13
5306a71Q4J70j03q5J35j26J22Kq2p0m4J29L9l6J26J70pj93kRL1k26l9M66ml34
5332c9K84k77o0K26n2pO1j56l7Q3J65k31m9K32j82r7J34j30M28m62L83k98L5J60
$$ plain form
5356 114 -184 -61 0 -83 117 -59 259 84 125 169 -163 -95 16 93 141 -163 -54 156 -130 -160 274 -210 -6
5379 -6 -5 -452 129 393 -37 -37 -190 4 -17 17 216 -177 153 291 27 11 94 -203 126 -174 104 147 -33 72
5403 72 -25 -250 88 -136 199 188 -71 -135 -311 213 -165 224 -109 176 -62 -171 -154 -109 170 -83 -200 83
5425 83 85 316 -112 -48 152 -59 64 61 -180 -67 81 -110 -51 -221 -92 -189 24 149 101 -156 162 -321 322
5448 322 295 20 51 68 -243 150 -38 -21 -161 62 218 102 232 146 163 -88 17 -84 158 117 192 -30 -48
5471 -48 -99 301 -12 -264 258 -28 -68 131 179 -51 -254 -98 102 -25 326 -42 71 -14 -112 236 -57 -9
5493 -9 25 5 -272 217 255 50 29 335 -279 126 -156 -39 14 -46 155 -121 186 144 -74 -198 210 -161 255
5516 255 141 13 -51 19 -69 122 83 -171 -1 60 85 72 94 88 -64 197 -151 65 224 78 -54 206 -31
$$ packed form
5356A14k98J23O1q3K00j76L18j75M1M4l32O8J11P7M8l04J09K10k86l0M34m84K04
5379fJm47N81K64m30%j53J94k1L4J99l93L30J38k64j6Q3k97L29l00K78M3j80J05
5403G2r7k25L38k24L35j1k59o4j76N24l78L89l33K85k38j09J7M5K79k53j17K83
5425H3KK31m28O4K00k11J23lk41J13J48j91N9j70J29r7K13J25m8k57L18m83O43
5448C22k7k75L1J7l11L93j88J7j40K23J56j16J30q6J7k51J05j01K42m1P5k22j8
5471d8n1M00l13k52N22k86m0J99M8k30k03J56K00j27L51l68J13q5r8L48k93M8
5493iL4k0k77M89L8k05k1L06o14M05k82J17N3o0K01k76L07m2k18j24M08l71M16
5516B55j14j28o4P0q8J91l9k54J70O1K5j3K2oj52K61l48K16J59j46j32K60k37
$$ plain form
5539 -31 -158 24 -284 -131 -47 -6 -49 -109 -177 126 -115 -343 -32 -317 -263 -215 -171 8 -49 -56 159 -90 -183 -99 -310
5564 -310 -36 -59 43 275 -41 -84 -10 -308 -232 16 62 149 -172 157 226 108 168 -87 90 -88 20 -314 -186
5587 -186 -67 -97 199 40 55 52 -101 99 86 93 -120 -148 52 -264 39 97 -11 -268 -117 -88 16 146 15
5610 15 42 -121 -57 28 173 -36 60 -13 41 28 -208 32 43 -132 -33 80 -139 -163 23 164 -21 42 17 -95
5634 -95 -11 27 -163 56 190 -232 -20 -197 -17 155 -94 -20 565 -187 78 24 -157 95 130 147 108 -153 4
5657 4 76 -145 245 -5 -161 -96 -443 61 166 -6 -90 -126 -32 261 20 -109 -166 301 173 56 -81 -411 -216
5680 -216 304 78 15 218 -61 -28 96 242 213 38 185 -112 -1 194 -150 -145 -189 -65 156 258 250 115 18
5703 18 -131 -41 -222 92 -54 37 61 20 -35 -89 -61 22 64 29 -29 -15 -211 -137 91 -108 241 -58 236 341 246
$$ packed form
5539c1j27J82l08J53Q4M1m3o0o8L03k41k28L11k85N4M8M4J79n7pK15k49r3Q4k11
5564c10K74k3J02K32l16m3P4k98P6K48M6Q7l21L29O9j18O0k55J77j78J08l34J28
5587a86J19l0K96j59J5lj53K00j3Pk13k8K00l16L03N8j08k57J51K9J04J30j31
5610A5K7j63O4Q5J45k09R6p3N4j3k36K40J1j75R9J13k19k4J86J41j85O3k5j12
5634i5Q4L8j90K19J34m22K12j77J80J72k49P4N85p52K65n4j81K52L5J7l9k61J57
5657DP2k21L90k50j56O5l47N04J05j72q4l6R4K93k41j29n7M67j28j17j37l30J95
5680b16N20k26o3K03k79L3J24J46k9j75J47k97J11J95l44Nm4J24K21J02qj35r7
5703A8j49R0j81L14j46R1K4m1n5n4K8Q3M2l5n8J4j96P4K28j99L49k99K94J05r5
$$ plain form
5728 246 -18 222 -15 231 -153 -281 142 -44 -150 -172 -31 179 -69 136 -18 83 212 -20 39 374 73
5749 73 93 181 174 -226 99 -158 114 41 11 74 -139 105 330 17 -130 -105 -20 162 171 0 106 -27 65 48 112
5774 112 -160 166 -9 69 178 -71 -61 -13 -194 -55 -105 -33 65 -88 100 15 153 -10 123 -103 -103 86 73
5797 73 204 -40 -23 -320 -66 173 -88 -292 115 -164 -285 -71 -216 135 -112 53 -156 101 24 -16 199
5818 199 60 90 140 73 -148 -37 -46 -136 128 176 -53 54 124 -13 -43 170 295 289 -213 -109 -4 -62 26 -179
5842 -179 129 46 198 -174 109 -141 -164 53 -161 -8 -374 -46 -55 -111 23 -188 -109 -94 -174 71 195 160 12
5865 12 144 -40 -177 31 151 -32 5 -201 -142 -263 -39 -53 -85 61 19 -148 -145 128 51 154 1 328 -27
5888 -27 -41 11 -168 -88 25 -296 -193 -139 -66 210 -38 -16 107 -22 91 209 438 -136 -16 39 24 81 -123
$$ packed form
5728B46k64K40k37K46l84j28M23j86j06k2J41K10k48K05j54J01J29k32N9L35l01
5749G3K0Q8pm00L25k57K72p3l0O3k13K44K25l13j47K5Q5J82Rj71J06j33R2j7O4
5774A12k72L26j75P8J09k49J0M8j81J39n0P2R8j53J88q5J38j63J33k26%J89j3
5797G3J31k44J7k97K54K39k61k04M07k79j21K14j45L51k47J65k09K57p7m0K15
5818A99j39L0N0o7k21J11rr0K64M8k29J07P0j37l0K13J25on02J04J05n8Q8k05
5842a79L08q3J52l72K83k50k3K17k14J53l66L28rn6J34k11P9J5q0K45J24l5j48
5865A2J32j84j37K08J20j83L7k06N9j21K24j4l2J46m2j67LK73p7J03j53L27l55
5888b7j4N2j79Q0J13l21J03N4P3K76k48K2J23j29J13J18K29n74J20N5j5N7k04
$$ plain form
5911 -123 -183 116 -132 33 -128 114 12 -153 238 -220 10 -29 0 85 -101 6 -35 -38 272 -92 -82 104 -92
5934 -92 45 52 41 156 26 -154 -219 -106 -58 23 -65 -346 115 -43 -4 619 -310 -109 -191 55 -81 247 -38
5957 -38 -146 44 13 151 30 101 -169 -96 43 527 -703 154 -21 36 -32 -76 88 -54 -62 -42 -364 119 -93
5980 -93 -125 -33 -10 -59 67 -16 -352 -240 -240 64 -95 -9 60 -49 -51 354 198 -156 -203 21 87 -130 -91 82 -7
6005 -7 -139 70 161 295 48 -253 -149 3 78 71 202 314 -62 -31 -92 -237 70 319 -31 -114 -12 16 175
6028 175 58 -128 137 206 59 -151 49 -177 18 -30 -269 137 152 181 -37 -10 -154 9 23 -224 -27 -287
6050 -287 -139 66 -75 136 83 25 -32 260 -96 234 254 -27 -73 -232 -323 113 89 -131 -97 -181 91 -139 193
6073 193 -42 4 65 -152 210 20 -114 -119 62 -153 -161 -66 134 -150 160 -181 113 266 186 -240 -199 -107 37
$$ packed form
5911a23o0K99k48J65j61K42j02j65L91m58K30l9K9Q5j86J07m1lL10l64J0J86j96
5934i2J37Pj1J15j30j80o5J13M8Q1q8k81M61j58L9O23r29K01q2K46j36L28k85
5957c8j08J90l1J38j21P1k70P3J39M84j230Q57j75N7o8m4J64j42qK0l22M83k12
5980i3l2R2K3m9J26q3l36J12%L04j59Q6O9j09kM05j56l54m7K24O6k17L9J73q9
6005gj32K09R1J34k47l01J04J52P5pJ31J12l76L1o1j45L07K49l50q3J02K8J59
6028A75j17j86K65O9j47k10K00k26J95m8k39M06J5K9k18K7j44J63J4k47J97k60
6050b87J48K05j41K11n3n8n7K92l56L30K0k81m6j59r1M36k4k20L4q4K72k30L32
6073A93k35M6O1k17L62j90j34nJ81k15qR5K00k84L10l41K94J53q0m26M1R2J44
$$ plain form
6096 37 102 2 77 -69 146 -194 -32 48 -14 -100 -127 -79 -20 125 226 52 -80 178 124 -1 271 44 141 -4
6120 -4 62 37 134 -188 -125 217 118 -12 150 265 -51 130 5 6 -143 -107 -42 15 -142 -91 342 -3 6 25 16 -159
6146 -159 -232 -162 168 187 0 28 169 118 107 100 199 211 -128 -349 -144 -205 -128 198 -98 59 119 -251 -175 -34 157
6171 157 -151 -144 108 67 100 -16 -4 -291 -210 -150 885 -974 20 83 -142 358 147 12 109 74 -125 237 1
6194 1 144 19 332 -87 -98 -92 193 -63 8 160 -18 -147 62 229 8 43 -141 -253 119 112 22 33 -45 -328
6218 -328 -112 -67 295 209 -11 -55 68 218 33 130 211 -51 152 31 -100 -83 -84 244 91 -237 171 -194 266
6241 266 -8 -277 209 -373 -141 98 41 97 -134 96 -56 -60 33 40 81 -19 218 -123 -231 72 80 42 2 2 29
6266 29 -72 56 43 -673 49 101 -146 113 -227 117 -249 -120 27 192 -53 10 66 96 -22 -283 -35 72
$$ packed form
6096C7O5j00P5j46K15l40J62Q0o2q6k7M8N9J45J01j74j32K58n4j25K72k27R7j45
6120dO6k5R7l22O3L42r9j30J62J15l16J81j25Jj49L6O5N7j57N1M33l45RJ9rj75
6146a59p3P0L30J9j87K8J41n1j1pR9J2l39k21K05o1P7L26k96J57O0l70P6J41J91
6171A57l08PK52m1L3j16J2k87Q1O0J035j859R94O3k25N00k11j35R7l5j99L62k36
6194AJ43j25L13m19j1OK85k56P1J52j78j29K09J67k21L5j84j12L72pr0J1p8k83
6218c28K16M5L62q6k20m4J23J50j85R7Q1k62K03j21j31J7jL28j53l28M08l65M60
6241B66k74k69M86n82K32K39n7N6k31K30j52mR3PM1j00K37l41j08L03Ql8m0%K7
6266B9j01J28j3p16P22N2k47K59l40L44l66J29J47J65k45O3N6L0j18k61K48J07
$$ plain form
6288 72 3 -232 21 -154 -66 -71 43 191 191 101 24 -9 -41 -107 199 174 -73 -57 -174 -149 106 157 -15 80 111 84
6314 84 50 -24 91 -102 -62 -61 326 -170 178 -73 119 86 119 -7 83 40 185 21 -127 66 220 24 -60 -49
6338 -49 -129 35 188 184 88 125 -276 -41 -337 -24 -157 125 122 311 140 -22 103 297 76 -52 15 54 68 108
6362 108 -134 -266 -98 49 -38 -8 -155 -91 26 55 -101 -134 -92 42 86 -144 -137 41 -199 28 147 -46 -2
6385 -2 65 -60 -156 21 -127 -188 -44 -9 -101 -83 -190 -21 4 75 22 102 0 10 -22 65 -20 -224 173 51 -109
6410 -109 -34 -60 -291 221 318 46 47 212 128 -156 -7 -140 23 -15 -94 70 -20 -72 93 -147 269 -108 91
6433 91 -45 185 -71 70 68 -3 -147 203 -47 105 -173 163 24 80 212 157 11 -105 329 -156 -73 -28 -36
6456 -36 -156 -39 -22 -215 -218 2 -164 21 -58 -32 -51 23 171 -92 -82 35 148 -101 -242 10 123 163 -30
$$ packed form
6288G2o9k35K53j75Q8nJ14J48%r0p7l3l2o6L06k5k47J6j17K5K55N1j72R5L1k7
6314H4l4p4J15j93M0JL87m96L48k51J92l3L3j26R0m3J45j64j48J93J54j96q4J1
6338d9q0J64J53mr6L7m01K35k96L13j33K82lJ89j71j62J25J94k21j28O7L9J4M0
6362A08k42j32J68J47q7L0j47O4J17K9j56l3M2J34M4k30PJ78k40K27J19j93M4
6385bO7j25r6J77j48o1J44L5r2J8j07J69K5P1n3Q0j02J0l2Q7q5k04L97j22j60
6410a09P5k6k31N12R7k72JJ65q4k84J49j33J63l8p9J64r0n2J65k40M16l77J99
6433I1j36K30k56J41kp1j44L50k50J52k78L36j39N6J32n5j46j16M34m85Q3M5q
6456c6j20J17J7j93lK20j66J85p9K6j9P4J48k63J0J17J13k49j41K52J13M0j93
$$ plain form
6479 -30 -20 -82 -243 105 15 107 393 128 -114 -35 -87 -11 18 -668 250 -207 663 447 -131 472 -233 642 -34
6502 -34 -47 -827 337 -544 -20 254 544 558 548 -600 -256 190 -296 -391 -86 -115 -74 -101 -52 786 -754 305
6524 305 820 -130 343 566 512 225 714 297 -116 927 -409 72 -315 -453 140 321 78 341 -56 9
6544 9 3 85 183 -46 59 -381 153 -101 -332 -216 322 -140 72 11 238 109 -79 80 -30 -12 -74 -102 22
6567 22 33 23 -73 320 176 36 -53 -25 -78 -90 -147 -266 -31 56 -3 -179 29 -210 -339 85 144 20 79 171 41
$$ packed form
6479c0J0o2j61L48r0R2K86k65k42P9n2P6K9o86R18m57Q70k16n78O03p05Q75o76
6502c4j3p80J164q81N24K74K90J4j0j148L44M46m86r5L05k9M1k7M9Q38j540J059
6524C05N15r50M73K23n4k87M89m17m13J043j336M81l87j38N93J81k43K63l97O5
6544IoQ2R8k29J05m40N34k54k31J16N38m62K12o1K27j29j88J59j10J8o2k8J24
6567B2J1j0r6L93j44j40q9K8n3j2n7j19K35Q7n9j76K08k39j29M24N9j24N9R2j30
$$ [...]
8191e5
##END NTUPLES=NMR FID
##END=
