##TITLE=1H_DE-164_oil_TFA
 200.13Hz, DMSO-d6+CCl4.
 8 sc
 15.7.2026
##JCAMPDX= 6.0         $$ Bruker NMR JCAMP-DX V2.0
##DATA TYPE= NMR FID
##DATA CLASS= NTUPLES
##ORIGIN= UXNMR, Bruker Analytische Messtechnik GmbH
##OWNER= pz
$$ XWIN-NMR		Version 3.5
$$ Wed Jul 15 13:16:56 2026 Russian Standard Time (UT+4h)  she@DPX200
##.OBSERVE FREQUENCY= 200.1313
##.OBSERVE NUCLEUS= ^1H
##.DELAY= (6, 6)
##.ACQUISITION MODE= SIMULTANEOUS
##.ACQUISITION SCHEME= undefined
##.AVERAGES= 8
##.DIGITISER RES= 18
##SPECTROMETER/DATA SYSTEM= spect
##.PULSE SEQUENCE= zg30
##.SOLVENT NAME= DMSO
##.SHIFT REFERENCE= (INTERNAL, DMSO, 0, 14.3821)
##AUDIT TRAIL= $$ (NUMBER, WHEN, WHO, WHERE, WHAT)
$$ ##TITLE= Audit trail, XWIN-NMR		Version 3.5
$$ ##JCAMPDX= 5.01
$$ ##ORIGIN= Bruker BioSpin GmbH
$$ ##OWNER= she
$$ F:/spectra/data/she/nmr/H-C/1/audita.txt
$$ ##AUDIT TRAIL=  $$ (NUMBER, WHEN, WHO, WHERE, WHAT)
(   1,<2026-07-15 13:15:42.50 +0400>,<she>,<DPX200>,
      <created by zg, POWCHK disabled, PULCHK disabled
       configuration hash MD5:
       00 E9 B6 7A A2 85 ED C7 34 08 36 98 17 FE 4E 26
       data hash MD5: 16K
       13 D5 E2 F5 83 AA 06 14 3E 7B 11 77 1E EE C3 1F>)
$$ ##END=
$$ 
$$ hash MD5
$$ 75 A2 F1 95 62 C5 4B 4E BC 13 66 DE B5 25 6A 57
##$RELAX= 
##$RELAX= 
##$RELAX= 
##$RELAX= 
##$RELAX= 
##$RELAX= 
$$ Bruker specific parameters
$$ --------------------------
##$DU= <F:/spectra>
##$EXPNO= 1
##$NAME= <H-C>
##$PROCNO= 1
##$TYPE= <nmr>
##$USER= <she>
##$AMP= (0..31)
100 100 100 100 100 100 100 100 100 100 100 100 100 100 100 100 100 100 
100 100 100 100 100 100 100 100 100 100 100 100 100 100 
##$AQSEQ= 0
##$AQ_mod= 1
##$AUNM= <au_zg>
##$AUTOPOS= <>
##$BF1= 200.13
##$BF2= 200.13
##$BF3= 200.13
##$BF4= 200.13
##$BF5= 200.13
##$BF6= 200.13
##$BF7= 200.13
##$BF8= 200.13
##$BYTORDA= 1
##$CFDGTYP= 0
##$CFRGTYP= 5
##$CHEMSTR= <none>
##$CNST= (0..31)
1 1 145 1 1 1 1 1 1 1 1 1 1 1 1 1 1 1 1 1 1 1 1 1 1 1 1 1 1 1 1 1 
##$CPDPRG= <>
##$CPDPRG1= <>
##$CPDPRG2= <>
##$CPDPRG3= <>
##$CPDPRG4= <mlev>
##$CPDPRG5= <mlev>
##$CPDPRG6= <mlev>
##$CPDPRG7= <mlev>
##$CPDPRG8= <mlev>
##$CPDPRGB= <>
##$CPDPRGT= <>
##$D= (0..31)
0 0.7 0 0 0 0 0 0 0 0 0 0.03 0 0 0 0 0 0 0 0 0 0 0 0 0 0 0 0 0 0 0 0 
##$DATE= 1784106941
##$DBL= (0..7)
120 120 120 120 120 120 120 120 
##$DBP= (0..7)
150 150 150 150 150 150 150 150 
##$DBP07= 0
##$DBPNAM0= <>
##$DBPNAM1= <>
##$DBPNAM2= <>
##$DBPNAM3= <>
##$DBPNAM4= <>
##$DBPNAM5= <>
##$DBPNAM6= <>
##$DBPNAM7= <>
##$DBPOAL= (0..7)
0.5 0.5 0.5 0.5 0.5 0.5 0.5 0.5 
##$DBPOFFS= (0..7)
0 0 0 0 0 0 0 0 
##$DE= 6
##$DECBNUC= <off>
##$DECIM= 32
##$DECNUC= <off>
##$DECSTAT= 4
##$DIGMOD= 1
##$DIGTYP= 9
##$DL= (0..7)
0 120 120 120 120 120 120 120 
##$DP= (0..7)
150 150 150 150 150 150 150 150 
##$DP07= 0
##$DPNAME0= <>
##$DPNAME1= <>
##$DPNAME2= <>
##$DPNAME3= <>
##$DPNAME4= <>
##$DPNAME5= <>
##$DPNAME6= <>
##$DPNAME7= <>
##$DPOAL= (0..7)
0.5 0.5 0.5 0.5 0.5 0.5 0.5 0.5 
##$DPOFFS= (0..7)
0 0 0 0 0 0 0 0 
##$DQDMODE= 0
##$DR= 18
##$DS= 0
##$DSLIST= <SSSSSSSSSSSSSSS>
$$ [...]
##$SUBNAM0= <"">
##$SUBNAM1= <"">
##$SUBNAM2= <"">
##$SUBNAM3= <"">
##$SUBNAM4= <"">
##$SUBNAM5= <"">
##$SUBNAM6= <"">
##$SUBNAM7= <"">
##$SUBNAM8= <"">
##$SUBNAM9= <"">
##$SW= 18.0517328524113
##$SWIBOX= (0..15)
0 0 2 0 0 0 0 0 0 0 0 0 0 0 0 0 
##$SW_h= 3612.71676300578
##$TD= 16384
##$TD0= 1
##$TE= 0
##$TE2= 300
##$TE3= 300
##$TEG= 300
##$TL= (0..7)
0 120 120 120 120 120 120 120 
##$TP= (0..7)
150 150 150 150 150 150 150 150 
##$TP07= 0
##$TPNAME0= <>
##$TPNAME1= <>
##$TPNAME2= <>
##$TPNAME3= <>
##$TPNAME4= <>
##$TPNAME5= <>
##$TPNAME6= <>
##$TPNAME7= <>
##$TPOAL= (0..7)
0.5 0.5 0.5 0.5 0.5 0.5 0.5 0.5 
##$TPOFFS= (0..7)
0 0 0 0 0 0 0 0 
##$TUNHIN= 0
##$TUNHOUT= 0
##$TUNXOUT= 0
##$USERA1= <user>
##$USERA2= <user>
##$USERA3= <user>
##$USERA4= <user>
##$USERA5= <user>
##$V9= 5
##$VALIST= <valist>
##$VCLIST= <CCCCCCCCCCCCCCC>
##$VD= 0
##$VDLIST= <DDDDDDDDDDDDDDD>
##$VPLIST= <PPPPPPPPPPPPPPP>
##$VTLIST= <TTTTTTTTTTTTTTT>
##$WBST= 1024
##$WBSW= 4
##$XGAIN= (0..3)
0 0 0 0 
##$XL= 0
##$YL= 0
##$YMAX_a= 179347
##$YMIN_a= -201143
##$ZGOPTNS= <>
##$ZL1= 120
##$ZL2= 120
##$ZL3= 120
##$ZL4= 120
##$ABSF1= 10
##$ABSF2= 0
##$ABSG= 5
##$ABSL= 3
##$ALPHA= 0
##$AQORDER= 0
##$ASSFAC= 0
##$ASSFACI= 0
##$ASSFACX= 0
##$ASSWID= 0
##$AUNMP= <proc_1d>
##$AZFE= 0.1
##$AZFW= 0.1
##$BCFW= 1
##$BC_mod= 2
##$BYTORDP= 1
##$COROFFS= 0
##$CY= -3
##$DATMOD= 1
##$DC= 2
##$DFILT= <>
##$DTYPP= 0
##$F1P= 0
##$F2P= 0
##$FCOR= 0.5
##$FTSIZE= 0
##$FT_mod= 4
##$GAMMA= 1
##$GB= 0.15
##$INTBC= 1
##$INTSCL= 1
##$ISEN= 128
##$LB= 0.25
##$LEV0= 0
##$LPBIN= 0
##$MAXI= 10000
##$MC2= 0
##$MEAN= 0
##$ME_mod= 0
##$MI= 1.114404
##$NCOEF= 0
##$NC_proc= 0
##$NLEV= 6
##$NOISF1= 3.799351
##$NOISF2= 2.8
##$NSP= 1
##$NTH_PI= 0
##$NZP= 0
##$OFFSET= 14.38212
##$PC= 1
##$PHC0= -4222.056
##$PHC1= 15.5923
##$PH_mod= 1
##$PKNL= yes
##$PPARMOD= 0
##$PSCAL= 0
##$PSIGN= 0
##$REVERSE= no
##$SF= 200.129724274929
##$SI= 16384
##$SIGF1= 3
##$SIGF2= 2
##$SINO= 400
##$SIOLD= 16384
##$SREGLST= <1H.CDCl3>
##$SSB= 0
##$STSI= 0
##$STSR= 0
##$SW_p= 3205.1282051282
##$SYMM= 0
##$S_DEV= 0
##$TDeff= 0
##$TDoff= 0
##$TI= <>
##$TILT= no
##$TM1= 0
##$TM2= 0
##$TOPLEV= 0
##$USERP1= <user>
##$USERP2= <user>
##$USERP3= <user>
##$USERP4= <user>
##$USERP5= <user>
##$WDW= 1
##$XDIM= 8192
##$YMAX_p= 0
##$YMIN_p= 0
$$ End of Bruker specific parameters
$$ ---------------------------------
##NTUPLES= NMR FID
##VAR_NAME=  TIME,          FID/REAL,        FID/IMAG
##SYMBOL=    X,             R,               I
##VAR_TYPE=  INDEPENDENT,   DEPENDENT,       DEPENDENT
##VAR_FORM=  AFFN,          ASDF,            ASDF
##VAR_DIM=   8192,          8192,            8192
##UNITS=     SECONDS,       ARBITRARY UNITS, ARBITRARY UNITS
##FACTOR=    0.0002768,     1,               1
##FIRST=     0,             0,               0
##LAST=      2.2672688,     0,               0
##MIN=       0,             -201143,         0
##MAX=       2.2672688,     179347,          0
$$ Real data points
##PAGE= N=1
##DATA TABLE= (X++(R..R)), XYDATA
$$ [...]
$$ plain form
1847 -52 128 29 50 111 -67 -116 216 -197 -105 -123 101 -161 43 112 -125 138 168 102 -273 -45 -199 -27 -220
1870 -220 249 -318 -51 124 -89 -82 16 -125 1 137 -56 50 14 -52 146 -198 41 188 27 -38 -148 11
1892 11 -83 58 260 -176 -162 -68 87 -185 121 -5 -53 -83 183 -170 117 197 104 -99 108 226 109 52 160
1915 160 -179 -26 85 152 112 -158 254 -78 -52 180 101 254 -203 84 20 -98 284 48 27 46 172 -182
1937 -182 24 14 -139 32 81 -45 165 125 66 -98 -183 226 63 -10 -129 -27 63 -17 52 -28 191 -3 -195
1960 -195 -119 -38 148 143 117 11 59 -149 93 -80 110 -281 -4 -22 -29 -157 50 337 -202 57 66 47 58 302
1984 302 125 114 -60 -95 -164 88 -153 -17 204 197 -3 53 38 55 53 178 -79 126 -134 142 315 -5 -155
2007 -155 129 -152 -19 -44 -238 -90 41 145 197 -145 86 116 -243 -180 10 -279 125 198 -88 -99 -124 32
$$ packed form
1847e2J80r9K1O1j78m9L32m13R2j8K24k62K04O9k37K63L0o6l75K28j54J72j93
1870b20M69n67K67J75k13PR8j41J26J36j93J06l6o6J98l44K39J47j61o5j10J59
1892A1r4J41K02m36J4R4J55k72L06j26m8l0K66l53K87Q0r3k03K07J18j17n7J08
1915A60l39J53J11O7m0k70M12l32K6K32p9J53m57K87o4j18L82k36k1J9J26l54
1937a82K06j0j53J71M9j26K10m0n9j64q5M09j63p3j19J02R0q0O9q0K19j94j92
1960a95P6Q1J86nk6j06M8k08K42j73J90l91K77j8pj28K07K87n39K59Rj9J1K44
1984C02j77j1j74l5o9K52k41J36K21pk00N6j5J7kJ25k57K05k60K76J73l20j50
2007a55K84k81J33k5j94J48J31J04N2l42K31L0l59O3J90k89M04P3k86j1k5J56
$$ plain form
2029 32 -250 -56 29 -126 239 84 -237 -4 -14 -112 -93 16 -48 77 7 102 44 -94 149 -209 -38 -90 1 -51
2053 -51 12 -166 93 -3 -205 -38 234 17 199 -15 -168 -13 -228 174 320 111 184 101 82 19 -129 17
2075 17 -32 96 -2 -82 172 339 98 -153 131 100 65 -64 94 -16 -179 21 -85 104 2 13 -48 -36 -241
2098 -241 13 206 274 99 -144 77 -236 246 95 -30 24 16 143 -189 -7 -53 272 -23 -50 -36 10 181 191
2121 191 -163 -122 192 -184 -208 97 -128 14 -173 -163 258 -17 46 290 -102 -127 128 -58 -31 210 -149 119
2143 119 24 100 28 36 -38 -257 117 -84 16 -38 -251 86 -102 -19 30 -129 75 182 115 -148 95 426 -228
2166 -228 160 107 -16 -109 -90 -202 71 307 -249 66 227 -48 69 -124 205 -194 -153 -116 -250 196 35 -70
2188 -70 305 -87 259 68 1 -186 148 72 141 159 103 191 83 -125 -44 -137 132 -293 192 13 -170 18 237
$$ packed form
2029C2k82J94Q5j55L65j55l21K33j0r8J9J09o4J25p0R5n8j38K43l58J71n2R1n2
2053e1O3j78K59r6k02J67K72k17J82k14j53J55k15M02J46k09P3q3j9o3j48J46
2075A7m9J28r8q0K54J67k41k51K84l1l5j29J58j10j63K00j06J89j02J1o1J2k05
2098b41K54J93O8j75k43K21l13M82j51j25N4qJ27l32J82m6L25k95k7J4M6J71J0
2121A91l54M1L14l76k4L05k25J42j87J0M21k75O3K44l92k5K55j86K7K41l59K68
2143A19r5P6p2Qp4k19L74k01J00n4k13L37j88Q3M9j59K04J07o7k63K43L31o54
2166b28L88n3j23r3J9j12K73K36n56L15J61k75J17j93L29l99M1L7j34M46j61j05
2188g0L75l92L46j91o7j87L34p6O9J8n6Q8j08k08Q1r3K69m25M85j79j83J88K19
$$ plain form
2211 237 -194 -72 -6 -297 117 29 -13 -96 -1 -53 90 224 -153 27 8 70 -18 105 110 -99 -214 -66 -212 19
2235 19 -145 -24 -235 -88 3 30 -39 89 300 -66 130 252 194 173 66 136 75 43 204 63 26 -204 86
2258 86 -219 -17 -70 66 62 -21 71 74 79 9 70 245 81 -53 -41 -34 93 156 -13 -194 -55 -20 -193 -49 -94 -17
2284 -17 169 -97 65 -24 121 -19 -119 -192 96 -142 -102 -19 -73 -161 68 95 -150 -93 85 -261 -162 -196 81 70
2308 70 98 -25 35 -53 131 174 16 -156 -28 -41 64 262 51 258 -26 -26 -89 153 -129 -95 243 48 55 34
2332 34 -111 36 83 133 27 -158 39 173 -276 -98 110 -164 -59 -272 -158 -340 11 87 244 -194 -14
2353 -14 140 -109 86 142 56 -39 259 295 -34 47 -26 34 -41 18 89 -11 155 -26 224 195 20 -184 -339 138
2377 138 -151 307 -26 -78 14 -21 -383 -175 151 21 -46 -305 67 -122 221 -48 203 15 108 -70 18 -70
$$ packed form
2211B37m31J22O6k91M14q8m2q3R5n2J43J34l77J80j9O2q8J23Nk09j15J48j46K31
2235A9j64J21k11J47R1K7o9J28K11l66J96J22n8k1j07P0o1l2J61j41l7k30K90
2258H6l05K02n3J36mq3R2LNp0O1J75j64j34J2PJ27O3j69j81J39L5j73J44m5P7
2284a7J86k66J62q9J45j40j00p3K88k38M0Q3n4q8K29K7k45N7J78l46R9l4K77j1
2308G0K8j23O0q8J84M3j58j72J28j3J05J98k11K07k84%o3K42k82L4L38j95Pk1
2332C4j45J47M7N0j06j85J97J34m49J78K08k74J05k13J14j82L51P6J57m38J80
2353a4J54k49J95N6q6r5K98L6l29Q1p3O0p5N9P1j00J66j81K50k9j75k04j55M77
2377A38k89M58l33n2R2l5l62K08L26j30o7k59L72j89L43k69K51j88R3j78Q8q8
$$ plain form
2399 -70 -16 149 -38 -79 161 -213 76 -132 -4 160 -87 -120 65 -117 8 -124 -111 85 55 -33 248 -189
2421 -189 -88 162 -100 -64 13 217 -107 -155 159 106 -233 37 -75 -135 -144 208 193 85 49 -305 13 316 -155
2444 -155 68 -66 267 26 102 -261 -109 208 88 145 -283 -160 -224 -95 98 88 -78 38 -46 85 216 -53
2466 -53 209 213 -76 158 59 -34 139 2 236 -75 19 -161 -59 -127 -108 80 -94 -205 -165 -19 28 390 -79
2489 -79 4 -60 -57 131 -73 20 64 -131 20 -217 221 187 31 107 83 9 140 71 80 -81 -89 158 155 -167 -291 -66
2515 -66 -17 -185 73 32 173 126 270 1 133 30 -128 -145 -4 -141 251 -32 17 -173 5 -215 -61 85
2537 85 156 72 -189 77 -36 326 -48 39 -293 -193 402 -70 220 149 -67 -180 70 12 -210 37 -77 -53
2559 -53 -117 81 256 3 37 165 117 71 -46 -126 49 -66 -108 -172 247 137 -97 -73 -230 154 -189 252 113
$$ packed form
2399g0N4J65j87m1K40l74K89k08J28J64k47l3J85j82J25j32J3J96l0q8K81m37
2421a89J01K50k62L6P7K04l24m8L14n3l39K70j12o0rL52j5j08l6l54L18L03m71
2444a55K23j34L33k41P6l63J52L17j20N7m28J23o4J29J93j0j66J16q4J31J31k69
2466e3K62Mk89K34r9r3J73j37K34l11R4j80J02o8J9J88j74j11M0J46M7L62m69
2489g9Q3o4LJ88k04R3M4j95J51k37M38l4j56P6k4p4J31o9Rj61qK47ll22j24K25
2515f6M9j68K58m1J41m7J44k69J32j03j58j7J41j37L92k83M9j90J78k20J54J46
2537H5P1q4k61K66j13L62l74Q7l32J00N95m72K90p1k16j13K50n8k22K47j14K4
2559e3o4J98J75k53L4J28m8m6j17q0J75j15m2o4M19j10k34K4j57L84l43M41j39
$$ plain form
2582 113 -60 153 64 21 46 -81 -176 -89 -175 115 92 -68 -44 -142 -222 -149 -251 148 67 30 106 66 118 76 117 13
2608 13 227 -15 -105 13 -179 47 -108 -277 115 15 -163 -2 39 -137 -117 155 -129 205 -286 -73 -117 -175
2630 -175 -352 99 1 -287 -16 -49 31 -180 -43 217 151 -7 -245 202 259 -13 -18 -34 -204 -121 117 -49 38
2653 38 55 -132 -54 37 280 120 -78 339 17 -231 -53 -26 -101 239 88 -11 -224 31 -49 62 10 -43 97
2676 97 306 -10 -191 -47 31 -17 -85 356 -57 -97 128 -251 -295 75 173 141 -75 -54 -21 72 221 -223 209 223
2700 223 -125 127 -10 -34 262 -283 -143 -115 139 69 -247 -188 -133 49 -118 -140 -63 -146 196 -276 110 -92 293
2723 293 79 179 349 -8 -57 -34 156 -37 -83 75 32 195 -1 130 -46 -34 100 -162 128 -99 -19 199
2745 199 -154 26 24 57 -151 -280 -243 -218 -33 -41 -94 41 58 -48 45 259 -15 -13 -139 -88 195 -292 -80 2 216
$$ packed form
2582A13j73K13q9m3K5j27r5Q7q6K90k3j60K4r8q0P3j02L99q1l7P6m0N2m2M1j04
2608A3K14k42r0J18j92K26j55j69L92j00j78J61M1j76K0K72k84L34m91K13m4n8
2630a75j77M51r8k88K71l3Q0k11J37K60o6j58k38M47N7k72nj6j70Q3K38j66Q7
2653C8J7j87P8R1K43j60j98M17l22k48J78K7p5L40j51r9k13K55q0J11n2n3J40
2676I7K09l16j81J44P8m8o8M41m13m0K25l79m4L70R8l2k16K1L3R3J49m44M32J4
2700B23l48K52j37k4K96n45J40K8K54p0l16N9N5J82j67k2P7q3L42m72L86k02L85
2723B93k14J00J70l57m9K3J90j93m6J58m3J63j96J31j76J2J34k62K90k27Q0K18
2745A99l53J80kL3k08j29L7K5J85qn3J35J7j06R3K14k74Kj26N1K83m87K12Q2K14
$$ plain form
2770 216 -303 131 106 -92 -19 38 127 96 -49 -54 141 2 205 62 -81 -153 227 -53 71 -266 -3 -248 271
2793 271 118 108 -214 -137 -157 -42 42 37 -15 -75 -131 -172 170 -74 21 37 99 111 -73 -150 -42 32 -358 -143 105
2818 105 -251 -113 132 -47 15 84 135 193 -106 42 63 107 150 -216 82 185 -117 103 139 -80 -61 -43 64
2841 64 175 -107 -70 207 19 -75 179 -137 -58 170 -254 209 199 122 154 -29 -195 301 198 144 98 123 80 130
2865 130 46 -77 25 87 -82 189 369 265 96 209 218 201 -91 -131 0 -78 158 -165 -116 108 -32 156 3
2888 3 -56 139 -184 65 -128 -4 79 169 -41 172 -290 -82 -6 -109 -206 63 190 84 197 -62 274 80
2910 80 -110 42 129 80 97 119 300 -147 -14 54 -52 293 -139 95 121 75 376 -422 -76 -139 -82 -57 -60 -8 -198
2935 -198 -143 104 149 114 179 7 130 182 -186 -39 -110 -49 200 -88 145 -65 -152 162 -12 167 0 45 -197
$$ packed form
2770B16n19M34k5j98P3N7Q9l1j45nJ95j39K03j43j43p2L80k80J24l37K63k45N19
2793B71j53j0l22P7k0J15Q4nn2o0n6m1L42k44R5J6O2J2j84p7J08P4l90K15K48
2818A05l56J38K45j79O2O9N1N8k99J48K1M4M3l66K98J03l02K20L6k19J9J8J07
2841F4J11k82L7K77j88r4K54l16P9K28m24M63j0p7L2j83j66M96j03n4m6K5m3N0
2865A30q4j23J02O2j69K71J80j04j69J13Rj7k92m0J31p8K36l23M9K24j40J88j53
2888Cn9J95l23K49j93J24Q3R0k10K13m62K08P6j03r7K69J27j06J13k59L36j94
2910H0j90J52Q7m9J7K2J81m47J33O8j06L45m32K34K6m6L01p98L46o3N7K5lN2j90
2935a98N5K47M5l5O5j72J23N2l68J47p1O1K49k88K33k10q7L14j74J79j67M5k42
$$ plain form
2958 -197 -179 -73 -65 -143 152 -259 0 -129 23 -78 118 44 -192 -20 75 -262 -46 186 -77 19 -34 146 86
2981 86 -236 -17 -257 87 -22 -76 197 -117 -36 62 -26 156 41 -74 -12 -53 -213 3 -124 227 -6 -123
3003 -123 268 -156 -91 68 -108 -104 54 -77 -339 141 99 97 173 106 -53 -47 5 204 112 132 65 -127 -379 22 63
3028 63 106 -352 112 -16 79 -92 -79 207 253 -169 4 -117 -110 -69 338 159 -58 -28 -11 203 135 -10 -62 50
3052 50 159 -32 -31 10 88 -76 -158 -26 -402 49 108 -83 147 -192 102 295 -56 185 -261 8 -120 353
3074 353 -273 13 -12 90 -207 93 224 -54 -142 -222 97 -62 165 -3 -100 -100 37 -193 117 -230 21 -99
3096 -99 71 116 43 -47 223 -222 260 41 49 -119 143 -42 -40 -97 -104 70 61 -134 20 163 -38 -240 -5 -5 24
3121 24 -33 106 100 -37 123 -124 98 87 -86 -217 318 182 206 -167 -204 84 -19 -12 105 364 9 35 -82
$$ packed form
2958a97J8J06Qp8K95m11K59j29J52j01J96p4k36J72R5l37K16K32k63R6n3J80o0
2981H6l22K19k40L44j09n4K73l14Q1R8q8J82j15j15O2m1j60K16j27L51k33j17
3003a23L91m24O5J59j76MJ58j31k62M80m2kP6o7j59ON2J99r2K0o7j92k52M01M1
3028F3M3m58M64j28R5j71J3K86M6m22J73j21PM1M07j79k17L0J7K14o8j45n2J12
3052E0J09j91JM1P8j64q2J32l76M51N9j91K30l39K94J93l51K41m46K69j28M73
3074C53o26K86k5J02k97L00J31k78q8q0L19j59K27j68r7%J37k30L10l47K51j20
3096i9J70M5p3r0K70m45M82k19Qj68K62j85Kn7pJ74rj95J54J43k01k02K35%K9
3121B4n7J39oj37J60k47K22j1j73j31N35j36K4l73l7K88j03PJ17K59l55K6j17
$$ plain form
3144 -82 258 -264 58 -24 124 74 8 33 328 6 84 63 321 63 51 4 70 190 21 -378 -183 184 23
3167 23 235 50 138 5 275 71 203 228 75 -111 -39 133 -51 26 -66 -66 67 34 -222 -59 221 -133 69
3190 69 143 20 -155 94 123 -162 -26 -176 -96 -105 19 14 140 -2 -48 98 56 -76 -89 -228 -121 -118 116 209 45
3215 45 364 0 130 178 105 38 94 38 -100 102 -113 -93 254 128 45 168 328 227 34 14 -74 5 -41 122
3239 122 -158 -161 -19 -97 136 39 -137 138 -75 95 102 -198 -48 44 79 94 -138 -68 69 192 -41 78 95 62
3263 62 144 -15 75 364 159 -410 79 -56 155 -169 228 119 209 -177 -175 104 50 266 79 -217 -141 -169 -89
3286 -89 -66 -109 250 134 -188 23 81 -56 -404 -68 42 -82 -92 -152 7 225 -87 -144 242 -163 -105 32 205
3309 205 -236 165 -100 -62 -19 69 21 100 182 -237 -190 -36 160 -62 156 194 -118 230 -179 -167 13 -75 -160 258
$$ packed form
3144h2L40n22L22q2J48n0o6K5K95l22P8k1K58k58j2m7O6J20j69l99J95L67j61
3167B3K12j85Q8j33K70k04J32K5j53j86P2J72j84P7r2%J33l3k56J63K80l54K02
3190F9P4j23j75K49K9k85J36j50Q0rJ24nJ26j42m6J46m2j32j3j39J07LK34R3j64
3215D5L19l64J30M8p3o7N6n6j38K02k15K0L47j26q3J23J60j01j93k0q8P9m6J63
3239A22k80lJ42p8K33r7j76K75k13J70Pl00J50R2L5J5k32P0J37J23k33J19J7l3
3263F2Q2j59R0K89k05n69M89j35K11l24L97j09R0l86KK79n4K16j87k96P6k8Q0
3286h9K3m3L59j16l22K11N8j37l48L36J10j24j0o0J59K18l12n7L86m05N8J37J73
3309B05m41M01k65L8M3Q8m8P9Q2m19M7J54J96k22K18L8l12L48m09J2J80q8q5M18
$$ plain form
3333 258 96 -91 94 176 -24 -5 -74 69 5 155 -36 -74 2 2 -117 -88 -141 179 -196 -256 243 -29 72 87
3357 87 1 -204 218 88 73 289 21 135 -351 159 8 -372 235 -39 -117 -49 89 50 1 4 304 5 151
3380 151 89 116 104 -31 -107 180 -241 -253 -109 -75 -174 -63 -74 -67 -47 -28 -104 -76 -11 132 -285 222 169 98 -33 -52
3406 -52 101 41 115 59 -59 -220 256 -29 -20 -43 -161 158 -110 -17 -142 -21 26 -191 57 -270 228 91 131
3429 131 -189 -15 -34 222 -132 -132 -96 11 138 208 102 -57 34 -28 -91 15 -126 -240 -232 -115 130 -259 219
3452 219 185 -307 82 108 237 37 -195 -73 96 204 -32 -20 -171 -192 -31 -178 162 112 29 161 276 -94
3474 -94 60 -190 12 -35 6 -47 245 84 -425 249 -287 118 78 -171 -38 5 3 -63 163 -105 -278 372 295
3497 295 -27 -155 -76 -252 -107 -12 146 60 191 128 25 -42 319 61 264 -151 288 -282 41 -132 -55 246
$$ packed form
3333B58j62j87J85Q2k00J9o9J43o4J50j91l8P6%j19K9n3L20l75o0M99k72J01J5
3357H7q6k05M22j30j5K16k68J14m86N10j51l80O07k74p8O8J38l9m9LL00k99J46
3380A51o2K7j2j35p6K87m21j2J44L4r9J11j1PK0J9p6K8O5J43m17N07n3p1j31j9
3406e2J53o0P4n6j18j61M76k85Rk3j18L19k68R3j25J21M7k17K48l27M98j37M0
3429A31l20J74j9K56l54%L6J07J27P0j06j59R1o2o3J06j41j14QJ17K45l89M78
3452B19l4m92L89K6J29k00k32J22J69J08k36J2j51k1J61j47L40n0q3J32J15l70
3474i4J54k50K02m7M1n3K92j61n09O74n36M05m0k49J33M3ko6K26k68j73O50p7
3497B95l22j28P9j76J45R5J58q6J31o3j03o7L61k58K03m15M39n70L23j73P7L01
$$ plain form
3519 246 171 -6 -128 61 -28 253 -150 -162 65 -26 -73 145 -65 38 35 192 125 -7 4 -19 58 41 -36 -111 -100
3544 -100 44 270 57 -57 -2 -48 209 -71 293 -88 -247 -14 -16 -18 207 -97 250 152 -31 -22 -102 -76 -94 143
3568 143 -166 -128 -186 178 29 -41 -356 -10 -91 8 -121 127 129 182 17 -219 -25 240 282 149 185 30 -19 -83
3592 -83 -85 -103 -60 -331 -92 -239 116 -24 72 -39 -29 -81 106 -22 -207 -28 -94 -276 -18 -151 -46 187 94
3615 94 113 -42 -57 -92 -191 -29 -259 450 -196 129 11 -168 -161 -112 34 -73 1 -150 -111 -18 -100 127 -5 75
3639 75 -178 226 67 -73 45 93 -245 -127 169 -100 2 86 -228 62 -204 46 8 13 -82 318 -23 70 46
3662 46 -85 -12 -45 92 -18 -77 -23 135 -241 -103 130 -65 -118 -218 -144 33 161 28 -148 74 49 423 22
3685 22 207 82 316 134 55 -234 139 -33 -95 236 -128 224 -59 -60 263 104 -94 -493 -84 135 -71 -22
$$ packed form
3519B46p5j77j22J89q9K81m03j2K27r1m7K18k10J03lJ57o7j32J1k3P7j7p7p5J1
3544a00J44K26k13j14N5m6K57k80L64l81j59K33kkK25l04L47r8j83Rq0K6j8K37
3568A43l09L8n8L64j49p0l15L46q1R9j29K48KN3j65k36J94K65M2j33L6j55m9o4
3592h3kj8M3k71K39j47L55j40R6j11J0n2J87j28j85J79o6j82K58j33J05K33r3
3615I4J9j55j5l5r9J62k30P09o46L25j18j79PM9J46j07P4j51L9R3q2K27j32Q0
3639G5k53M04j59j40J18M8l38J18K96k69J02Q4l14K90k66K50l8Nr5M00l41R3k4
3662D6j31P3l3J37j10n9N4J58l76J38K33j95n3j00P4J77J28j33j76K22k5L74m01
3685B2J85j25K34j82p9k89L73j72o2L31l64L52k83jL23j59j98l99M09K19k06M9
$$ plain form
3707 -22 64 37 12 -5 227 86 235 -80 13 -13 289 9 -17 -91 53 -327 193 144 88 93 41 -65 -109 -57 52
3732 52 25 179 -140 -91 -60 -130 98 -58 30 51 -134 -104 51 1 -150 -248 27 288 140 44 75 -32 -21 529
3756 529 93 -164 -48 -62 -39 98 44 -186 16 -72 65 189 -39 -308 21 -47 -86 144 -17 -238 712 315
3778 315 203 -232 -53 -256 -230 -46 -64 -77 134 -19 -188 -32 65 52 -191 208 -12 -93 -163 84 106 190 -30
3801 -30 1 71 -216 -94 218 95 23 -105 418 -320 16 186 28 -142 94 -19 257 -74 -120 -17 80 155
3823 155 -126 20 -46 211 -150 -67 -144 -17 -83 1 -125 -144 -309 90 -195 94 -173 -73 -32 167 273 16
3845 16 -42 22 -276 -193 291 -160 195 6 133 189 -74 7 -56 144 65 241 161 -18 256 239 -165 20 -19 -278
3869 -278 -155 222 140 138 -304 21 41 -103 -160 72 133 110 100 -98 20 -151 118 5 132 50 -289 -104 67
$$ packed form
3707b2Q6k7k5j7K32j41J49l15R3k6L02k80k6p4J44l80N20m9n6Nn2j06m4N2J09
3732E2k7J54l19M9L1p0K28j56Q8K1j85L0J55n0j51r8K75K61j48r6L1j07J1N50
3756E29m36k57J16j4K3J37n4k30K02q8J37J24k28k69L29o8l9K30j61k21R50l97
3778C15j12m35J79k03K6J84j8j3K11j53j69J56R7j3k43L99k20q1p0K47K2Q4k20
3801c0L1P0k87J22L12j23p2j28N23p38L36J70j58j70K36j13K76l31m6J03R7P5
3823A55k81J46o6K57l61Q3p7J27o6Q4j26j9j65L99k85K89k67J00M1J99J06k57
3845A6n8O4k98Q3M84m51L55j89J27N6k63Q1o3K00p9J76q0j79K74j7m04J85l9k59
3869b78J23L77q2km42L25K0j44n7K32O1k3j0j98J18j71K69j13J27q2l39J85J71
$$ plain form
3892 67 -122 -60 9 -88 34 80 281 -60 81 -28 -147 219 -216 2 -165 33 231 140 202 63 -108 -128 -61
3915 -61 18 -26 36 -63 98 426 -74 9 91 114 -16 -47 38 256 132 -266 94 -266 95 -17 67 165 217 102
3939 102 -73 -223 -13 170 -18 33 21 50 -82 -148 -50 117 -242 -44 138 137 59 225 -118 32 -40 93 62
3962 62 -125 2 48 -87 99 141 219 8 -45 -37 2 -120 192 43 -131 166 158 -156 187 -247 -82 -158 -72 -31
3986 -31 -169 31 -29 78 228 378 52 65 47 -139 50 78 43 106 51 -150 -225 -34 -128 -53 19 -182 119 252
4010 252 116 -254 39 -368 80 -20 -52 -99 -48 -204 -11 190 -84 19 238 185 -282 43 -17 -100 15 -74
4032 -74 104 -63 273 -9 34 81 -267 37 37 77 -207 68 -118 60 -220 -63 -139 135 51 202 -52 63 -245
4055 -245 139 35 -96 191 89 -24 -151 144 66 108 -15 52 24 27 -284 61 -29 0 93 84 -241 -60 41 75
$$ packed form
3892F7j89O2O9r7J22M6K01l41J41j09j19L66m35K18j67J98J98r1O2j39j71k0O7
3915f1P9m4O2r9J61L28n00Q3Q2K3j30l1Q5K18j24l98L60l60L61j12Q4R8N2j15
3939A02j75j50K10J83j88N1j2K9j32o6R8J67l59J98J82jp8J66l43J50p2J33l1
3962F2j87J27M6j35J86M2P8k11n3QL9j22L12j49j74K97ql14L43m34J65p6Q6M1
3986c1j38K00o0J07J50J50l26J3j8j86J89K8l5O3n5k01p5J91r4P5P2k01L01J33
4010B52j36l70K93m07M48j00l2m7N1j56J93K01k74J03K19n3m67L25o0q3J15q9
4032g4J78j67L36k82M3M7l48L04%M0k84K75j86J78k80J57p6K74q4J51k54J15l08
4055b45L84j04j31K87j02j13j27K95p8M2j23O7k8Ll11L45r0K9R3rl25J81J01L4
$$ plain form
4079 75 -85 -97 65 -20 -225 -52 -34 -69 31 -19 -130 11 11 337 55 -31 280 -420 4 -205 -65 38 115
4102 115 -168 -32 63 15 -4 -209 -427 195 -158 28 48 -48 98 -11 36 -249 89 114 22 86 -24 -45 -73 -157
4126 -157 16 -66 -156 -105 24 113 -52 -203 50 131 -130 179 56 155 161 -211 -150 140 -71 -99 59 -49 75
4149 75 -170 -50 87 -280 -112 157 288 164 -10 -111 -62 -138 57 90 -89 106 -373 31 -309 265 -57
4170 -57 -36 45 116 128 -71 -338 203 -33 281 -103 88 75 -157 75 -218 168 152 -146 -182 -76 -58 -195 90
4193 90 -348 48 -80 128 -219 124 87 158 26 224 226 90 36 -89 54 -8 -109 171 78 191 -18 -134 -131
4216 -131 24 43 95 24 240 174 42 -3 30 -6 -112 -52 -12 127 -149 147 154 -214 -10 -156 44 100 110 92 -192
4241 -192 -29 -81 -95 -186 160 111 104 168 225 75 -37 14 -292 -35 -27 148 343 -73 168 41 -131 83 -28 49
$$ packed form
4079G5j60j2J62q5k05J73J8l5J00n0j11J41%L26k82q6L11p00M24k09J40J03P7
4102A15k83J36R5m8j9k05k18O22l53J86K0r6J46j09M7k85L38K5r2O4j10k1k8q4
4126a57J73q2r0N1J29Q9j65j51K53Q1k61L09j23R9Ol72O1K90k11k8J58j08J24
4149G5k45J20J37l67J68K69J31j24j74j01M9p6J95L3j79J95m79M04l40N74l22
4170e7K1Q1P1J2j99k67N41k36L14l84J91j3k32K32k93L86j6k98l6J06J8j37K85
4193I0m38L96j28K08l47L43l7P1j32J98Kj36n4j25J43o2j01K80r3J13k09j16L
4216a31J55J9N2p1K16o6j32m5L3l6j06O0M0J39k76K96Pl68K04j46K00N6J0j8k84
4241a92J63n2j4r1L46m9pO4N7j50j12N1l06K57QJ75J95m16K41j27j72K14j11P7
$$ plain form
4265 49 -32 -60 -42 -205 53 -74 108 285 -180 163 115 17 -72 186 -14 -29 143 -102 -187 -28 106 83 -299
4288 -299 20 129 158 201 107 3 -32 45 124 209 157 -170 38 11 -12 101 -11 264 20 21 57 149 140 -24 24 -3
4314 -3 -93 -191 -148 109 48 155 -195 223 -156 103 205 -416 -16 -221 -47 -59 -413 -220 -62 -111 53 -73 -7
4337 -7 148 -125 345 -52 -138 -226 -384 57 -14 -114 322 131 -49 83 71 -111 -60 82 -71 13 -16 -96 167
4360 167 96 -183 231 77 39 56 186 73 -184 17 32 -43 246 167 -44 103 -296 221 -13 -81 222 211 -54
4383 -54 -52 -78 127 -124 -9 -17 8 237 -230 -11 93 -88 266 -77 -117 -27 -48 3 -55 -60 62 -86 -72 -128 90
4408 90 220 -84 254 -47 -163 -118 -35 29 108 -110 -59 132 47 -182 -117 75 26 75 23 -234 -118 9 -38 30
4432 30 -190 51 -237 93 -105 98 73 208 -41 151 133 57 -234 -113 86 -114 -90 251 -365 -12 188 -67
$$ packed form
4265D9q1k8J8j63K58j27J82J77m65L43m8r8q9K58k00j5J72k45q5J59J34k3l82
4288b99L19J09K9M3r4j04l5P7P9Q5n2l27K08k7k3J13j12K75k44JL6R2rj64M8k7
4314cr0r8M3K57o1J07l50M18l79K59J02o21M00k05J74j2l54J93J58m9J64j26O6
4337gJ55k73M70l97q6q8j58M41p1j00M36j91j80J32j2j82N1J42j53Q4k9q0K63
4360A67p1k79M14j54l8J7J30j13k57K01J5p5K89p9k11J47l99N17k34o8L03j1k65
4383e4Kk6K05k51J15qK5K29m67K19J04j81L54l43m0R0k1N1n8nJ22j48J4n6K18
4408I0J30l04L38l01j16M5Q3O4P9k18N1J91q5k29O5J92m9M9n2k57J16J27m7O8
4432C0k20K41k88L30j98K03k5J35k49J92j8p6k91J21J99k00K4L41o16L53K00k55
$$ plain form
4454 -67 -92 -73 -90 -90 178 5 97 138 -75 -167 124 160 -233 13 75 -125 -191 -6 123 -63 -19 -21 -16 -16 -58 223 -98
4481 -98 -34 21 -78 94 -101 43 59 234 -21 -126 121 -225 -74 146 -14 -158 -38 -101 18 144 -2 7 129
4504 129 -109 59 -198 -55 132 245 -48 32 164 94 -83 -83 132 -58 6 -79 35 38 -168 -90 80 53 -23 212
4528 212 133 123 -28 213 35 -2 -200 -45 27 34 -49 -219 -120 -95 -67 169 -11 -117 43 167 -51 -25 -69 -1
4552 -1 -72 -13 -181 -183 -214 35 110 -2 -107 96 -217 23 -135 145 111 -64 40 -252 -285 -104 171 22 99 -44
4576 -44 100 -178 -119 91 103 36 80 187 -42 183 291 -61 48 -157 -161 117 222 202 43 -136 -68 -25 -95 -124
4600 -124 3 139 302 -26 88 -104 -123 -128 36 -86 -145 -140 -188 -100 33 105 36 184 13 81 69 -1 93 -140 -30
4625 -30 78 264 -81 117 -81 123 -17 153 112 -60 13 -79 241 18 -8 146 211 12 -542 165 -209 -127
$$ packed form
4454f7k5J9j7%K68j73R2M1k13r2K91L6l93K46O2k00o6J85J29j86M4kN%m2K81l21
4481i8O4N5r9J72j95J44J6J75k55j05K47l46J51K20j60j44J20o3J19J26j46RJ22
4504A29k38J68k57J43J87J13k93Q0J32p0j77%K15j90O4q5J14Lk06P8J70k7p6K35
4528B12p9j0j51K41j78l7j98J55P2Pq3j70R9K5K8K36j80j06J60J24k18K6m4O8
4552ap1N9j68kl1K49P5j12j05K03l13K40j58K80l4j75J04k92l3J81K75j49P7j43
4576d4J44k78N9K10J2o7M4J07k29K25J08l52J09k05mK78J05k0j59j79O8M3p0k9
4600a24J27J36J63l28J14j92j9nJ64j22n9Nm8Q8J33P2o9J48j71O8j2p0R4k33J10
4625c0J08J86l45J98j98K04j40J70m1j72P3r2L20k23k6J54O5j99n54P07l74Q2
$$ plain form
4647 -127 124 -19 -38 -132 1 61 199 31 -158 -210 -257 -81 41 240 -204 -23 -191 -135 -173 34 249 -104
4669 -104 -48 -92 92 193 145 107 84 -53 -27 -109 -74 57 17 -69 -197 299 49 138 26 -176 -14 -95 57 -33
4693 -33 287 -114 -343 -172 -57 -486 -74 -22 44 199 46 -148 -149 177 -46 0 -32 -243 -2 -27 -56 -251 -102
4716 -102 360 29 276 123 92 158 240 -22 9 -18 59 86 97 107 -207 -24 -71 13 -105 -173 -141 -232 13 -136 -133
4741 -133 -96 -43 33 -217 -217 -151 420 -133 98 -139 137 -62 -89 29 -71 214 427 78 -131 242 -219 76
4763 76 -192 -380 10 181 -110 -134 -36 211 -97 -99 -33 213 2 91 -19 -189 -281 -26 -81 54 -16 -87 398 -26
4787 -26 55 -84 -89 -91 24 98 -118 59 140 -14 -171 -4 13 -175 197 28 59 -75 -77 32 -30 197 74 -210
4811 -210 -3 135 18 121 -162 1 65 13 67 254 220 4 -72 -315 141 -81 -236 222 306 16 -18 50 176
$$ packed form
4647a27K51j43j9r4J33O0J38j68j89n2m7J76J22J99m44J81j68N6l8K07K15l53
4669a04N6m4J84J01m8l8k3j37K6q2L5J31m0q6j28M96k50Q9j12k02J62q1J52r0
4693c3L20m01k29J71J15m29M12N2O6J55j53j94jL26k23M6l2k11K41k5k9j95J49
4716a02M62l31K47j53l1O6Q2k62L1k7P7K7J1J0l14J83m7Q4j18o8L2r1K45j49L
4741a33L7N3P6k50%O6N71n53K31k37K76j99k7J18j00K85K13l49k09L73m61K95
4763G6k68j88L90J71k91k4R8K47l08kO6K46k11Q9j10j70r2K55n5J35p0p1M85m24
4787b6Q1j39nkJ15P4k16J77Q1j54j57J67J7j88L72j69L1j34kJ09o2K27j23k84
4811b10K07J38j17J03k83J63O4n2N4J87l4k16p6k43M56k22j55M58Q4k90l4O8J26
$$ plain form
4834 176 103 135 205 81 181 -57 -83 -143 109 18 -229 12 -32 237 24 45 52 -14 53 291 156 171 -13 -219
4858 -219 272 88 -127 75 18 5 -366 -358 -131 227 89 -84 86 203 209 -13 -263 87 -284 -166 -80 -177 -154
4881 -154 -135 -257 132 -104 17 351 -71 -175 -236 83 -292 -130 140 143 -158 11 -275 66 -11 -219 -60 186
4903 186 34 -115 -118 -38 243 23 134 -151 68 362 142 33 119 -133 -54 -43 -104 190 -30 -14 -108 134 -71
4926 -71 -41 56 -77 137 167 5 -90 -128 11 45 124 -11 -68 29 -143 -69 161 -65 -91 155 -44 -11 132 -112
4950 -112 -128 131 -107 386 131 23 -306 -180 119 60 6 -13 176 -108 18 150 139 -85 -150 213 9 70
4972 70 -336 14 -151 -242 85 73 334 -301 33 -128 -100 -187 196 169 314 147 -62 -51 86 -134 207 118 -32
4995 -32 -194 276 -128 -214 335 -40 235 -77 107 -42 185 169 233 -19 -68 -205 154 262 96 -127 3 -108
$$ packed form
4834A76p3L2P0j24J00k38k6o0K52r1k47K41m4K69k13K1Po6O7K38j35J5j84k06
4858b19M91j84k15K02n7j3l71QK27L58j38j73J70J17Ok22k50L50l71J18Q6r7K3
4881a54J9j22L89k36J21L34m22j04o1L19l75J62K70Ll01J69k86L41p7k08J59K46
4903A86j52j49lQ0K81k20J11k85K19K94k20j09Q6k52P9J1o1K94k20J6r4K42k05
4926g1L0R7j33K14L0j62r5l8J39L4P9j35n7R7j72P4K30k26k6K46j99L3J43k44
4950a12j6K59k38M93k55j08l29J26K99n9n4j9J89k84J26J32j1k24o5L63k04O1
4972G0m06L50j65r1L27j2K61o35L34j61K8q7L83k7J45j67k09J1J37k20L41q9j50
4995c2j62M70m04q6N49l75K75l12J84j49K27j6O4k52m9j37L59J08j66k23J30j11
$$ plain form
5017 -108 75 47 -52 67 -50 -62 13 62 -51 57 -252 -176 267 169 -9 -111 -96 248 6 -107 -86 -148 29
5040 29 117 206 148 71 115 -140 -189 -137 77 -63 20 54 -31 137 -43 300 -203 201 75 205 -20 -30 177 53
5064 53 30 -81 153 34 -1 246 26 -89 207 -96 -292 -128 23 -87 93 2 -94 -185 414 138 -28 -7
5086 -7 -86 -58 -107 -308 61 -46 -84 -6 -354 41 46 139 -39 39 326 -92 -115 295 -103 -19 198 56 -124 -10
5110 -10 275 47 81 -48 -209 -122 -193 99 91 11 227 -226 -30 -14 81 -51 -25 -83 -83 124 -258 -90 -60 -10 -348
5135 -348 250 -339 -142 -170 143 58 150 48 -204 -42 -33 260 61 316 -28 9 150 -120 63 63 70 101 -163 148
5159 148 61 -114 -14 248 10 -110 152 -114 29 -99 -34 29 -65 -113 217 79 28 84 82 11 100 -117 156 113
5183 113 8 245 -66 170 -124 -36 -180 181 -28 182 219 -56 -27 92 226 -24 135 21 -260 201 -75
$$ packed form
5017a08J83k8r9J19j17j2P5M9j13J08l09P6M43r8j78j02J5L44k42j13K1o2J77
5040B9Q8Q9n8p7M4k55m9N2K14j40Q3L4q5J68j80L43n03M04j26J30k25j0K07j24
5064E3k3j11K34j19l5K47k20j15K96l03j96J64J51j10J80r1r6r1N99k76j66K1
5086gp9K8m9k01L69j07l8P8l48L95NR3j78P8K87m18k3M10l98Q4K17j42j80J14
5110a0K85k28L4j29j61Q7p1K92qq0K16m53J96J6R5j32K6n8%K07l82J68L0N0l38
5135c48N98n89J97k8L13q5R2j02k52J62RK93j99K55l44L7J41k70J83%PL1k64L11
5159A48q7j75J00K62k38j20K62k66J43j28O5O3r4m8L30j38n1N6kp1Q9k17K73m3
5183A13j05K37l11K36k94Q8j44L61k09K10L7k75K9J19J34k50J59j14k81M61k76
$$ plain form
5204 -75 42 177 -45 -149 8 72 41 25 62 117 0 -15 -1 65 242 40 80 124 272 -139 -161 -205 -40 65
5228 65 -87 265 -181 -74 -33 4 -136 -52 185 -4 43 -173 -50 46 36 247 307 -112 3 -40 -13 48 -123 179
5252 179 -44 -40 157 159 -175 -264 -50 212 48 37 63 -64 -169 -94 -204 -90 -100 20 -8 -63 -119 -80 -52 14 -46
5277 -46 -116 43 -286 16 91 93 95 -104 -264 23 -186 47 -177 91 -129 16 -87 -181 -30 -166 -17 76 288
5300 288 -10 -127 -172 -62 124 65 -14 -1 194 -32 141 115 -54 -17 168 -265 237 9 -22 -33 275 -268 110
5323 110 147 -133 -50 86 -164 -189 16 -65 -17 243 103 -23 -7 184 -129 122 88 -147 162 -215 335 1
5345 1 -39 83 -340 -147 -177 -258 59 176 106 81 91 -66 293 -229 66 18 124 -21 67 110 236 464 118 -467
5369 -467 113 113 86 -218 -101 33 -145 -9 -180 -138 92 113 -138 -263 133 178 22 -8 -46 -141 -131 -251 -181 76
$$ packed form
5204g5J17J35k22j04J57O4l1j6L7N5j17j5J4O6J77k02M0M4J48m11k2m4J65J05
5228F5j52L52m46J07M1L7j40Q4K37j89M7k16J23R6j0K11O0m19J15m3K7O1j71L02
5252A79k23MJ97Kl34q9K14K62j64j1K6j27j05P5j10J14j0J20k8n5n6L9K8O6o0
5277d6p0J59l29L02P5KKj99j60K87k09K33k24K68k20J45j03r4J51j36J49R3K12
5300B88k98j17m5J10J86n9p9J3J95k26J73k6j69L7J85m33N02k28l1j1L08n43L78
5323A10L7k80Q3J36k50k5K05q1M8K60j40j26J6J91l13K51l4k35L09l77N50l34
5345Am0J22m23J93l0q1L17J17p0k5J0j57L59n22K95m8J06j45Q8M3J26K28l46n85
5369d67N80%k7l04J17J34j78J36j71M2K30K1k51j25L96M5j56l0l8r5J0j20P0K57
$$ plain form
5393 76 -16 75 19 -92 -7 -20 340 -293 83 -133 -122 -186 -15 -41 -36 -237 422 10 206 -51 -128 176 284 69
5417 69 204 -85 124 74 -12 -39 166 -96 -184 270 -49 -109 -206 -117 -269 52 70 115 -56 118 126 308 -77 -142
5441 -142 52 17 150 -212 96 163 -73 179 -260 -39 92 -305 -186 -148 -133 251 -14 -181 115 -108 -29 -142
5463 -142 -234 88 -93 143 -367 271 -61 -328 -145 115 -96 -143 -141 50 -79 -16 62 -183 -5 46 -25 -80 10
5486 10 -84 79 191 -42 49 -121 299 22 -207 -156 144 -102 -156 187 47 313 119 178 27 12 256 38
5508 38 -157 -134 135 -101 -143 58 175 -192 -114 49 -128 247 -73 114 183 61 -48 56 -155 -331 -200 38
5530 38 89 216 176 -49 188 165 103 -181 -20 189 74 7 52 94 51 267 -281 -146 134 370 -168 -232 37
5553 37 -3 -240 -61 242 -78 -100 115 -48 82 272 -63 -6 205 -241 -224 43 -38 1 157 -51 60 -41
$$ packed form
5393G6r2R1n6j11Q5j3L60o33L76k16J1o4J71k6Nk01O59m12J96k57p7L04J08k15
5417F9J35k89K09n0q6k7K05k62q8M54l19o0r7Q9j52L21J8M5j71J74QJ82l85o5
5441a42J94l5J33l62L08O7k36K52m39K21J31l97J19L8J5L84k65j67K96k23P9j13
5463a42r2L22j81K36n10O38l32k67J83K60k11m7KJ91j29O3P8k45J78N1p1n5R0
5486A0r4J63J12k33R1j70M20k77k29N1L00k46n4L43j40K66j94N9j51j5K44k18
5508C8j95K3K69k36m2K01J17l67P8J63j77L75l20J87O9j22j09J04k11j76J31K38
5530C8N1J27m0k25K37k3o2k84J61K09j15o7M5M2m3K16n48J35K80K36n38o4K69
5553C7m0k37J79L03l20k2K15j63J30J90l35N7K11m46J7K67q1L9J56k08J11j01
$$ plain form
5575 -41 -8 -211 214 156 -129 161 35 213 -132 -96 -166 24 147 116 247 218 292 82 222 -51 -4 113 182
5598 182 -42 178 -73 -69 108 329 -135 -36 133 40 -129 97 -128 -60 282 51 52 -43 -113 18 238 -38 -263
5621 -263 39 -38 264 17 -349 -5 -103 146 140 122 -54 44 109 204 55 -95 -70 375 -113 -218 133 26 86
5644 86 402 108 32 -59 -95 -11 218 204 -97 -3 -83 240 24 -148 -254 -400 -25 -193 -148 -171 44 175 115 118
5668 118 31 37 213 112 112 40 61 15 -93 -12 15 -100 -212 -63 78 -107 -132 38 -29 197 -45 -177 81 27
5692 27 15 190 17 -122 -40 -225 -134 -6 -77 -49 36 91 9 -3 -117 121 -11 -107 -30 102 -37 -114 -79 48 46
5717 46 -48 99 -162 31 62 80 -277 -80 -7 -115 -358 172 -114 56 59 279 12 -91 130 -77 -109 -61 -164
5740 -164 -50 65 145 -473 13 115 56 -109 -63 -21 157 -11 -131 46 123 14 117 -126 196 183 210 -5
$$ packed form
5575d1L3k03M25n8k85K90j26J78l45L6p0J90J23l1J31k9P4k10J40k73M7J17O9
5598A82k24K20k51MJ77K21m64R9J69r3j69K26k25O8L42k31Jr5p0J31K20k76k25
5621b63L02p7L02k47l66L44r8K49oj8j76R8O5R5j49j50K5M45m88j05L51j07O0
5644H6L16k94p6r1l6Q4K29j4l01R4q0L23k16j72j06j46L75j68M5k3K15J31o0L
5668A18q7OJ76j01%p2K1m6j08Q1K7j15j12J49J41j85k5J70o7K26k42j32K58n4
5692B7j2J75j73j39Q2j85R1J28p1K8Q5N5q2j2j14K38j32r6P7J32j39p7L5J27k
5717D6r4J47k61J93L1J8l57J97P3j08k43N30k86J70LK20k67j03K21k07l2M8j03
5740a64J14J15Q0o18M86J02n9j65M6M2J78j68j20J77P7j09J03k43L22j3K7k15
$$ plain form
5762 -5 75 56 -99 15 109 103 106 -141 97 92 63 235 -185 252 -53 48 -296 -44 -79 21 -11 -76 49 -200 -51
5787 -51 451 376 -91 102 132 -73 41 -17 190 197 454 21 -209 109 -188 -54 6 -102 -212 -93 94 466
5809 466 12 42 -187 -135 -135 102 51 -36 -163 -106 71 121 105 102 154 -293 68 71 -96 -64 42 198 3 156 -47
5834 -47 -63 175 38 255 -180 183 -253 -30 141 -40 -134 150 97 32 67 51 -72 96 -164 -216 348 28 83
5857 83 93 -116 237 -71 3 -151 46 -103 92 -177 -221 -299 93 210 -148 195 264 182 -141 124 260 -64
5879 -64 78 -85 242 -201 -40 -67 15 -92 108 -183 131 218 -152 13 -188 -249 6 -2 60 270 -11 -217 180
5902 180 109 246 -127 -19 -274 234 -114 -267 -103 -139 -40 -199 -126 -188 -308 -78 133 -125 -232 -310 -52 88
5924 88 -50 72 88 296 134 -267 49 191 -308 -57 238 -67 -307 -184 192 59 49 -146 165 150 161 -142
$$ packed form
5762eQ0j9j55J14R4oLk47K38nk9J72m20M37l05J01l44K52l5J00l2o5J25k49J49
5787e1N02p5m67J93L0k05J14n8K07PK57m33k30L18k97J34O0j08j10J19J87L72
5809D66m54L0k29N2%K37n1q7j27N7J77N0j6lN2m47L61Lj67L2J06J56j95J53k03
5834d7j6K38j37K17m35L63m36K23J71j81r4K84n3o5L5j6j23J68k60n2N64l20N5
5857H3J0k09L53l08P4j54J97j49J95k69m4p8L92J17l58L43O9q2l23K65J36l24
5879f4J42j63L27m43J61k7Q2j07K00k91L14Q7l70J65k01o1K55qO2K10k81k06L97
5902A80p1J37l73J08k55N08l48j53J64l6R9j59P3o2j20K30K11k58j07p8K58J40
5924H8j38J22J6K08j62m01L16J42m99K51K95l05k40J23L76j33j0j95L11j5J1l03
$$ plain form
5946 -142 -206 74 49 89 171 19 70 -134 57 83 -11 117 -280 361 -187 -163 -33 116 251 -175 63 -62 151
5969 151 -47 -11 -9 65 90 -107 -294 -98 14 31 22 -29 55 -95 72 11 170 453 170 69 153 116 -137 254
5993 254 -50 -66 -256 68 172 277 -208 1 -134 77 251 43 13 4 146 44 -50 -155 272 71 143 55
6015 55 -51 -248 -49 -91 -241 -17 -103 127 -108 -19 260 9 -145 -133 39 -97 -233 99 -45 -314 111 -103
6037 -103 -177 -161 -107 90 210 47 59 -93 328 150 -121 198 -105 74 -40 -217 157 139 -79 214 -82 -195
6059 -195 168 128 59 -67 -227 65 115 16 -180 6 2 41 141 -12 -123 43 1 43 -83 -112 -176 -76 -139 -431
6083 -431 114 189 -296 -36 -43 -55 -26 146 -158 12 -50 235 -155 -151 0 34 -70 152 -66 212 238 -64 273
6106 273 -78 -139 42 259 -97 134 62 187 114 -172 142 -266 -294 -34 86 -61 320 -366 100 -41 -151
$$ packed form
5946a42o4K80k5M0Q2j52N1k04J91K6r4J28l97O41n48K4J30J49J35m26K38j25K13
5969A51j98L6KP4K5j97j87J96J12J7rn1Q4j50J67o1J59K83k83j01Q4l7k53L91
5993B54l04j6j90L24J04J05m85K09j35K11J74k08l0rJ42j02r4j05M27k01P2q8
6015E5j06j97J99m2j50K24q6K30k35Q9K79k51j54J2J72j36j36L32j44k69M25k14
6037a03p4J6N4J97J20j63J2j52M21j78k71L19l03J79j14j77L74j8k18K93k96j13
6059a95L63m0o9j26j60K92N0r9j96J86mL9J00j53j11J66m2M2j26k9o4J00o3k92
6083d31N45P5m85K60pj2K9J72l04J70o2K85l90MJ51L4j04K22k18K78K6l02L37
6106B73l51o1J81K17l56K31p2J25p3k86L14m08k8K60J20j47L81o86M66j41j10
$$ plain form
6127 -151 17 23 114 -75 -458 -18 -133 39 493 278 432 -28 296 98 -145 13 160 -163 85 -152 -14
6148 -14 -50 -39 59 114 -18 89 -17 -96 29 -97 -82 134 178 -64 -8 154 19 -17 13 -75 53 -99 -24 -5 0
6173 0 105 -53 146 228 82 108 87 72 -49 227 -46 -23 180 -106 3 -96 149 -138 -245 34 -183 6 -171
6196 -171 182 132 -223 -81 28 -230 -188 23 13 31 -170 49 16 -65 159 -163 -51 -157 73 152 253 162 -264
6219 -264 -200 7 13 -61 29 -156 148 -51 384 105 32 135 -119 -58 -216 -366 -109 -51 145 180 -7 -51 -10 35
6243 35 213 -102 -273 -21 14 99 -56 300 160 48 476 -33 -5 -44 200 148 -49 45 -218 112 13 50 290
6266 290 -76 -66 292 36 120 -179 54 74 -67 144 12 111 -97 -41 -69 85 170 -61 -201 9 -247 28
6288 28 -248 -69 146 -204 -44 -93 -121 -5 110 -141 -285 -81 -46 364 -173 -137 -161 -109 -51 -330 281 224 -308
$$ packed form
6127a51J68OR1j89l83M40j15J72M54k15J54m60L24j98k43J58J47l23K48k37J38
6148a4l6J1R8N5j32J07j06p9J25j26J5K16M4k42N6J62j35l6L0q8J28j52P5J9N
6173@J05j58J99Q2j46K6k1j5j21K76k73K3K03k86J09r9K45k87j07K79k17J89j77
6196a71L53n0l55J42J09k58M2K11j0J8k01K19l3q1K24l22J12j06K30P9J01r1m26
6219b64O4K07Op4R0j85L04j99M35k79p3J03k54O1j58j50K57N8J96L5j87m4M1M5
6243C5J78l15j71K52L5Q5j55L56j40j12M28n09K8l9K44n2j97R4k63L30r9L7K40
6266B90l66J0L58k56Q4k99K33K0j41K11j32R9k08N6k8J54Q5k31j40K10k56K75
6288B8k76J79K15l50J60m9k8J16J15k51j44K04L5M10n37L6k4N2N8k79O11n7n32
$$ plain form
6311 -308 -160 -138 -89 5 -100 45 -125 141 145 79 -110 136 89 -46 298 -179 -70 52 226 62 149 171 -37
6334 -37 82 109 -100 215 206 -26 -229 266 25 -186 113 -7 -2 84 -37 -105 155 295 136 197 -33 49 -42 25
6358 25 3 125 179 -46 -41 -65 125 -87 -193 166 -139 -19 -98 -39 210 -217 312 76 96 38 -74 10 -165 -46
6382 -46 -264 154 -186 207 2 -76 134 -14 -200 -6 -316 84 20 -43 -197 98 33 -262 -55 -106 -12 222
6404 222 121 86 55 -130 -128 -439 136 207 118 -53 -54 -42 91 46 -194 -293 -45 159 -55 -201 183 3 39 -287
6428 -287 -32 224 -76 -106 -63 -12 71 -65 135 -144 -164 -11 112 -64 132 -194 132 46 -246 83 48 -3 -142
6451 -142 38 25 121 188 -56 75 167 14 79 -8 95 114 121 229 -41 -143 -323 -207 152 -112 -5 106 46
6474 46 -37 -36 -124 225 323 27 4 -280 183 -141 57 203 -94 295 -34 100 49 145 -175 187 259 -50 124
$$ packed form
6311c08J48K2M9R4j05J45j70K66Mo6j89K46m7j35L44m77J09J22J74j64Q7K2k08
6334c7J19K7k09L15rk32k03M95k41k11K99j20NQ6j21o8K60J40j59O1k30Q2r1O7
6358B5k2J22N4k25Nk4J90k12j06L59l05J20p9N9K49m27N29k36K0n8j12Q4j75J19
6382d6k18M18l40L93k05p8K10j48j86J94l10M00o4o3j54K95o5k95K07n1R4K34
6404B22j01l5l1j85Kl11N75P1q9j71jJ2J33m5k40r9K48K04k14j46L84j80L6l26
6428b87K55K56l00l0M3N1Q3j36K00k79k0J53J23j76J96l26L26q6k92L29l5n1j39
6451a42J80j3R6O7k44J31R2j53O5q7J03J9PJ08k70j02j80J16L59k64J07J11o0
6474D6q3Jq8L49R8k96k3k84M63l24J98J46k97L89l29J34n1R6l20L62P2l09J74
$$ plain form
6497 124 -20 33 -152 155 -191 -99 199 162 37 -79 17 170 78 -166 -206 78 -68 186 -113 -59 -48 119 -209
6520 -209 18 -8 14 -197 -205 -8 -191 -125 -73 23 46 -47 -120 -172 97 114 3 150 68 -178 102 127 2 52 34
6545 34 107 -145 -50 29 412 20 43 -221 -25 19 -142 -377 -275 0 342 -20 -59 90 118 -17 -245 -303 238
6568 238 -30 -51 -5 71 26 168 -64 -236 14 -75 -148 -145 56 83 88 -14 -64 9 147 -12 205 -58 -11 217 -72
6593 -72 37 189 125 154 42 -125 84 -38 -3 -118 -184 -352 -56 50 -37 -43 -78 -174 -58 -44 -67 37 -234 -34
6617 -34 -262 68 -210 19 -31 5 190 -74 160 -205 95 -44 17 -25 -11 -6 60 -112 -97 31 -184 -51 3 -37
6641 -37 90 -38 20 127 -93 170 23 -78 66 -111 14 71 36 275 -137 188 -115 108 -143 -261 118
6662 118 242 -200 -112 25 -295 -17 -32 -13 35 89 59 149 -87 67 232 7 129 282 -69 -37 59 80 -168
$$ packed form
6497A24j44N3j85L07l46R2K98l7j25j16R6J53r2k44m0K84j46K54k99N4J1J67l28
6520b09K27k6K2k11qJ97j83O6N2R6K3r3p3n2K69J7j11J47q2k46K80K5j25N0j8
6545C4P3k52R5P9L83l92K3k64J96M4j61k35J02K75L42l62l9J49K8j35k28n8N41
6568B38k68k1M6P6m5J42k32j72K50q9p3LK01K7Nj02n0P3J38j59K17k63M7K28k89
6593g2J09J52o4K9j12j67K09j22L5j15o6j68K96J06q7ol5r6J16J4k3J04k71K00
6617c4k28L30k78K29n0L6J85k64K34l65L00j39O1m2J4NO6j72J5J28k15J33N4m0
6641c7J27j28N8J07k20K63j47j01J44j77J25N7l5K39m12L25l03K23k51j18L79
6662A18J24m42Q8J37l20K78j5J9M8N4l0R0k36J54J65k25J22J53l51L2R6K1k48
$$ plain form
6685 -168 -224 131 20 -11 195 274 342 122 40 101 -54 8 -21 177 -35 88 38 209 72 -148 74 113 -105
6708 -105 172 -259 -102 -61 197 -6 -108 -41 -230 -58 340 59 -75 -59 102 -69 -25 189 -20 -86 108 -3
6730 -3 -133 179 -44 22 -99 49 29 -439 -202 73 -33 -247 6 118 167 2 -70 -229 166 -29 -11 265
6752 265 -271 110 107 126 -114 -309 230 -130 289 -132 81 161 277 145 69 -270 54 -49 -50 -54 -15 119 -38
6775 -38 -132 166 17 -79 50 -297 58 -12 -61 69 -31 1 -7 -16 -167 65 -31 78 -86 -45 -195 123 -44 -79
6799 -79 -186 -96 -209 -88 25 -187 98 -69 170 59 -38 20 25 -61 -6 -226 -113 -38 354 -70 4 178 48
6822 48 -94 106 78 29 16 -165 -109 118 -41 22 77 38 -69 177 -62 -68 147 163 -221 -10 -19 -111 -69 -220 -96
6847 -96 65 74 -55 25 -73 205 16 -244 -2 261 151 22 80 -116 162 27 -269 -75 218 -21 32 86 63
$$ packed form
6685a68n6L55j11l1K06P9O8k20q2O1j55O2k9J98k12J23n0J71j37k20K22L9k18
6708a05K77m31J57M1K58k03j02O7j89J72L98k81j34J6J61j71M4K14k09o6J94j11
6730cj30L12k23O6j21J48k0m68K37K75j06k14K53J12M9j65p2j59L95j95J8K76
6752B65n36L81lJ9k40j95N39l60M19m21K13Q0J16j32p6l39L24j03jmL9J34j57
6775c8r4K98j49r6J29l47L55p0m9J30j00L2qrj51K32r6J09j64M1j50L18j67l5
6799g9j07R0j13J21J13k12K85j67K39j11r7N8Nq6N5k20J13P5L92m24P4J74j30
6822D8j42K00k8m9j3j81N6K27j59O3N5l9j07K46k39oK15J6l84K11rr2M2j51J24
6847i6J61Rj29Q0r8K78j89k60K42K63j10j29N8j96K78j35k96J94K93k39N3N4k3
$$ plain form
6870 63 26 -376 -62 -242 -160 235 218 86 50 -146 119 -68 5 -17 53 88 -126 -196 -19 -126 -18 94 6 -76
6894 -76 -26 -213 -159 -12 403 37 101 -44 171 51 247 73 -153 94 -73 -105 -131 -128 -97 89 -176 -62 -216
6917 -216 -124 39 -67 -58 -30 247 -107 32 199 57 -9 273 181 -146 174 -154 199 -208 -30 -167 -6 -81
6939 -81 -50 -106 -220 -213 66 32 -129 59 -90 -21 -179 -10 -48 0 62 33 -26 87 -218 104 -62 -59 11 208 88
6964 88 119 21 -31 -210 -108 332 28 -57 -67 -86 -215 -92 106 -34 1 76 -378 -186 -74 -84 -21 -168 -86 23
6988 23 -279 64 32 -12 93 290 -157 46 -70 -180 159 -3 128 -127 156 21 -41 -253 1 35 -7 120
7010 120 60 -193 -79 -67 -128 110 -272 24 -55 -108 -131 -22 124 82 -224 138 91 -120 5 48 -34 42 -97 -40
7034 -40 -99 7 10 137 184 98 -35 -350 -100 -109 109 312 -20 -202 116 8 118 27 -61 -125 -169 -209 -180 332 176
$$ packed form
6870F3l7m02L14j80Q2L95j7j32l6j96K65j87P3k2P0L5k14p0J77j07J08J12q8q2
6894g6N0j87N4J47M15l66O4j45K15j20J96j74k26K47j67l2k6LL1J86k65J14j54
6917b16R2J63j06RK8K77l54J39J67j42o6K82r2l27L20l28L53m07J78j37J61p5
6939h1L1n6j14PK79l4j61J88j49O9j58J69l8M8O2k9n9J13l05L22j66LP0J97j20
6964H8L1r8n2j79J02M40l04q5j0j9j29J23J98j40L5P5m54J92J12j0O3j47Q2J09
6988B3l02L43l2m4J05J97m47K03j16j10L39j62J31k55K83j35o2k12K54L4m2J27
7010A20o0k53J14J2o1K38l82K96p9n3k3J09J46m2l06L62m7k11J25M3q2P6j39N7
7034d0n9J06LJ27M7q6j33l15K50rK18K03l32j82L18j08J10r1q8o4m4m0K9N12j56
$$ plain form
7059 176 -168 -99 -111 43 67 115 -120 111 163 -48 49 -264 -395 -118 101 89 -78 -7 -79 0 53 153 128 68
7083 68 131 83 130 -43 168 -80 -182 297 168 -94 120 -186 51 74 -131 -120 -339 63 -72 -5 -141 101
7105 101 -387 234 93 -176 -13 68 139 91 38 -174 -109 -31 210 139 235 -25 168 -53 269 25 43 273 517
7128 517 92 -38 -23 199 115 46 -133 132 69 45 84 19 30 -91 35 -45 156 -144 -68 285 4 -160 -168 145
7152 145 55 23 241 -14 -261 -58 -38 -53 177 134 135 23 -119 -39 86 -8 -805 -224 -499 -31 100 -82 281
7175 281 97 375 -161 313 581 -602 -149 805 -99 -615 16 11 -63 -28 182 -88 92 -238 -179 101 -86
7196 -86 102 1 114 -64 -184 -35 -87 -107 -174 -264 -62 41 -84 37 -50 2 -37 229 89 88 268 -11 -241
7219 -241 34 -112 -163 46 198 -154 218 119 86 23 -63 21 72 -116 -265 174 -92 -138 76 -118 -177 -184 -242 -31
$$ packed form
7059A76l44O9j2J54K4M8k35K31N2k11R7l13j31K77K19j2j67P1p2P9N3J00k5o0
7083F8O3m8M7j73K11k48j02M79j29k62K14l06K37K3k05J1k19M02j35O7j36K42
7105A01m88O21j41k69J63Q1P1m8n3k12O5P8K41p1R6k60J93k21L22k44J8K30K44
7128E17m25j30J5K22q4o9j79K65o3k4L9o5J1j21J26q0K01l00P6L53k81j64qL13
7152A45r0l2K18k55k47K03K0j5K30m3Jj12j42Q0J25r4p97N81k75M68J31j82L63
7175B81j84K78n36M74K68j183M53R54r04n16O31np4L5K10k70J80l30N9K80j87
7196h6J88j01J13j78j20J49n2k0o7r0K02J03j25J21q7N2l9K66j40jJ80k79k30
7219b41K75j46n1K09J52l52L72r9l3o3q6Q4N1j88j49M39k66m6K14j94n9pn8K11
$$ plain form
7243 -31 64 282 9 159 -126 21 163 22 -211 91 -530 313 -83 11 -150 -107 -91 -54 56 63 3 -93 -1 154
7267 154 92 -48 -91 -22 10 -28 139 -55 172 -110 59 -308 -58 171 -44 19 110 -61 -318 -240 -109 -31 81
7290 81 -105 261 31 -117 21 -41 81 -104 -103 -62 -108 360 90 -77 46 119 79 -99 -157 -53 254 165 40
7313 40 293 -21 -67 182 -327 94 -16 -177 130 50 142 -32 -90 296 5 95 -85 -176 174 79 69 -114 216
7336 216 -253 -135 -125 -186 -250 -130 124 -140 -128 -137 -67 143 -26 223 -78 -107 2 -131 -122 -26 -57 -155 -19 -162
7360 -162 74 8 -234 120 -45 58 80 -173 -98 -21 269 -185 -264 31 -25 240 -17 77 27 56 137 82 -48 181
7384 181 8 12 14 -258 -19 -2 -10 -81 -60 -159 -90 -56 -31 13 -64 -65 -94 59 -70 38 -122 -132 39 112 238 -16 88
7411 88 111 142 28 14 -44 179 165 171 -99 301 -55 -91 -228 55 -60 12 206 -73 -3 -59 -13 84 -223 39 -189
$$ packed form
7243c1R5K18k73J50k85J47J42j41k33L02o21Q43l96R4j61M3J6L7J10Po0r6R2J55
7267A54o2j40m3O9L2l8J67j94K27k82J69l67K50K29k15O3R1j71k57P8J31P8J12
7290H1j86L66k30j48J38o2J22j85JM1m6M68k70j67J23P3m0j78n8J04L07q9j25
7313D0K53l14m6K49n09M21j10j61L07q0R2j74n8L86k91R0j80r1L50r5j0j83L30
7336B16m69J18J0o1o4J20K54k64J2rP0K10j69K49l01k9J09j33RR6l1r8J36j43
7360a62K36o6k42L54j65J03K2k53P5P7K90m54p9K95n6K65k57R4n0K9Q1n5j30K29
7384A81j73MKk72K39J7qp1K1r9O9L4K5M4p7jk9J53j29J08j60j0J71P3J26k54J04
7411H8K3L1j14j4n8K23j4Ok70M00l56l6j37K83j15P2J94k79P0n6M6R7l07K62k28
$$ plain form
7436 -189 -24 -38 64 -20 -47 -47 -24 -150 83 84 99 -223 135 -128 78 -150 -176 -121 84 -85 203 203 -111 137
7460 137 -139 89 -23 34 -135 193 -134 151 122 45 -151 164 -171 117 347 -35 29 -198 -140 -207 -139 65
7482 65 288 -331 -69 133 103 109 -23 -299 86 -3 36 -158 -243 99 153 -129 -128 -338 -117 -164 -249 -78 -133 -16
7506 -16 -209 -85 -108 -19 -496 -133 -162 3 251 -7 -251 -86 -96 -19 -130 -33 84 42 -31 -119 70 -118 -174 -139
7530 -139 139 158 353 -41 3 -51 -167 70 75 -4 -76 -19 330 15 8 -190 93 53 -10 232 99 -15 -135 134
7554 134 110 218 -141 -150 235 216 73 -108 103 63 -122 -154 179 185 -116 -8 -113 -184 -171 -4 27 168 -82 175
7578 175 22 14 160 33 -74 237 -78 -82 159 61 149 233 -74 213 62 107 -211 -38 -46 42 -251 203 -46 181
7602 181 -141 -29 -28 209 -9 -357 113 -142 56 -237 135 -242 180 4 -35 -169 78 -38 36 -21 -284 -74
$$ packed form
7436a89J65j4J02q4k7%K3j26K33JJ5l22L58k63K06k28k6N5K05j69K88%l14K48
7460A37k76K28j12N7j69L28l27K85k9p7j96L15l35K88K30l82O4k27N8o7O8K04
7482F5K23o19K62K02l0Oj32k76L85q9L9j94q5L42N4k82Jk10K21m7q5J71n5J17
7506a6j93J24k3Q9m77L63k9J65K48k58k44J65j0P7j11R7J17m2p3q8J89j88n6L5
7530a39K78J9J95l94M4n4j16K37Np9p2N7L49l15pj98K83m0o3K42j33j14j20K69
7554A34k4J08l59rL85j9j43j81K11m0j85l2L33Ol01J08j05p1J3J67L1J41k50K57
7578A75j53qJ46j27j07L11l15mK41r8Q8Q4l07K87j51M5l18J73qQ8k93M54k49K27
7602A81l22J12JK37k18l48M70k55J98k93L72l77M22j76l9j34K47j16P4n7k63K10
$$ plain form
7624 -74 -229 156 211 48 265 112 -31 -109 315 -318 -41 -66 -72 38 102 176 -44 -10 89 127 0 -30 -128 -65 7
7649 7 -63 65 -75 169 21 51 163 133 205 16 149 126 118 -72 -108 99 -129 42 113 1 -23 -177 80 85 -194
7674 -194 109 33 -204 -16 -162 60 -126 321 -66 -65 -29 -53 -99 209 79 -517 121 0 -90 -149 -152 -62 -133 -98
7698 -98 91 168 -197 -289 -17 187 -17 -69 -53 -78 -35 -388 154 10 226 -19 -27 14 -124 -80 -5 5 -32 53 275
7723 275 -93 -204 61 13 184 -25 -65 -239 175 -131 -214 266 -292 158 28 -97 -70 212 -56 -110 -104 222
7745 222 115 -53 -246 -140 -2 61 204 -46 -88 142 -17 -31 118 -1 -131 107 29 -233 -108 -117 494 -4
7767 -4 46 15 11 -319 -44 31 1 -24 -283 51 148 -226 61 -63 79 66 -96 -230 199 82 -188 52 41 -148
7791 -148 -12 235 -238 359 197 -40 124 -62 -10 75 14 -43 83 149 -103 -159 -255 23 -154 -60 -11 -218 -329
$$ packed form
7624g4j55L85N5j63K17j53j43p8M24o33K77k5oJ10O4P4k20L4R9L8j27l0r8O3P2
7649Gp0J28j40K44j48L0J12l0P2j89J33k3qj90l6K07k28J71P1j12k4j54K57Nk79
7674a94L03p6k37J88j46K22j86M47l87JL6k4m6L08j30n96O38j21r0n9lR0p1L5
7698i8J89P7l65r2K72K04k04n2J6k5M3l53N42j44K16k45qM1j38M4P5J0l7Q5K22
7723B75l68j11K65m8J71k09m0j74M14l06q3M80n58M50j30j25K7K82k68n4OL26
7745B22j07j68j93J06J38O3J43k50m2K30j59j4J49j19j30K38p8k62J25rO11m98
7767dN0l1ml30K75P5l0k5k59L34R7l74K87j24J42j3j62j34M29j17k70K40j1j89
7791a48J36K47m73N97j62k37J64j86N2Q5o1n7J26O6k52n6r6K78j77R4M9k07j11
$$ plain form
7814 -329 -59 -121 -234 -86 -133 -34 98 27 -35 41 -34 110 67 158 -6 127 7 175 -176 23 -52 40 133 61
7838 61 44 137 -33 54 -136 -19 128 254 -65 -139 -105 -235 116 -88 -95 155 -67 124 -76 -80 -93 -12 269 -108
7862 -108 99 0 218 -161 -174 -153 119 302 -123 51 -18 204 48 -74 113 -292 81 62 -59 -226 -207 -128
7884 -128 115 6 89 -10 81 -46 148 -102 -142 -12 20 -253 -76 57 -147 228 86 119 3 -93 -197 -123 -108
7907 -108 -66 138 25 323 -97 137 377 71 100 -57 280 -9 50 99 148 143 -82 -80 -47 98 105 21 -7 -34 162
7932 162 -84 -71 -38 -126 -99 -91 243 -113 19 51 -135 -86 71 290 -120 -74 -121 34 173 -150 96 -100 211
7955 211 -7 67 -7 -73 126 14 -174 -98 58 -164 48 1 150 -30 -130 12 98 -9 204 -131 -173 -208 267
7978 267 -12 33 119 134 -190 -7 159 -184 264 -292 97 9 139 -32 -114 42 108 93 81 172 210 77 214
$$ packed form
7814c29K70o2j13J48m7R9J32p1o2P6p5J44m3R1j64J33j20J68l51J99p5R2R3p2
7838F1j7R3j70Q7j90J17J47J26l19p4L4j30L51k04pK50k22J91k00mj3Q1K81l77
7862a08K07r9K18l79j3K1K72J83m25J74o9K22j56j22J87m05L73j9j21j67J9P9
7884a28K43j09Q3r9R1j27J94k50m0J30L2k73J77J33k04L75j42L3j16r6j04P4J5
7907a08M2K04j13K98m20K34K40l06K9j57L37k89N9M9M9nk25KL3J45Pq4k8k7J96
7932A62k46J3L3q8K7QL34l56J32L2j86M9J57K19m10M6m7J55J39l23K46j96L11
7955B11k18P4p4o6J99j12j88P6J56k22K12m7J49j80j00J42Q6j07K13l35m2l5M75
7978B67k79M5Q6J5l24J83J66l43M48n56L89q8J30j71q2J56O6j5j2R1L8j33J37
$$ plain form
8001 214 -18 51 -158 -48 -151 172 -100 -62 1 -121 167 -167 -108 -50 273 -233 -96 -160 -216 205 -308 -38
8023 -38 61 -142 163 130 -92 12 -249 -205 -211 63 -37 -324 112 -115 -47 287 2 93 48 77 34 -1 -58 84
8047 84 90 -274 -180 -30 -209 174 -52 -19 219 -68 -176 138 27 142 157 -34 149 -355 30 46 92 -68 169
8070 169 -40 -98 122 -186 -10 136 -100 -62 -129 -98 -45 31 14 -67 -20 70 394 -28 91 -12 -78 127 -291 72
8094 72 -89 133 70 -227 55 -169 -174 92 -195 227 202 -41 168 -63 -128 -60 231 275 -36 -55 -242 -149 119
8117 119 -118 34 40 88 126 -223 7 -83 14 -166 -87 -8 234 -216 -45 81 -40 -19 18 48 -80 -167 -265 -30
8141 -30 -54 -92 8 -255 10 -207 -35 50 -28 154 -191 62 3 -96 267 -83 -67 -25 90 60 89 100 -134 -80
8165 -80 259 -252 29 -70 -342 297 -61 -36 -106 29 -22 13 -98 54 -127 -8 -83 184 -201 253 228 -169 77
$$ packed form
8001B14k32O9k09J10j03L23k72L8O3j22K88l34N9N8L23n06J37o4n6M21n13K70
8023c8R9k03L05l3k22J04k61M4oK74j00k87M36k27O8L34k85R1m5K9m3l5n7J42
8047H4Ol64R4J50j79L83k26L3K38k87j08L14j11J15J5j91J83n04L85J6M6j60K37
8070A69k09n8K20l08J76J46k36L8o7L1N3P6j7q1M7R0L24m22J19j03o6K05m18L63
8094G2j61K22o3k97K82k24nK66k87M22k5k43K09k31o5O8K91M4l11j9j87R3K68
8117A19k37J52OM8L8l49K30r0R7j80P9P9K42m50J71J26j21K1L7L0j28q7r8K35
8141c0k4l8J00k63K65k17J72Q5p8J82l45K53n9r9L63l50J6M2J15l0K9J1k34N4
8165h0L39n11K81r9k72O39l58K5p0J35n1L5j11J52j81J19p5K67l85M54k5l97K46
$$ plain form
8188 77 64 -9 130
$$ packed form
8188G7j3p3J39
8191A30
$$ Imaginary data points
##PAGE= N=2
##DATA TABLE= (X++(I..I)), XYDATA
$$ plain form
0 0 0 0 0 0 0 0 0 0 0 0 0 8 -8 8 -8 16 -16 16 -24 32 -32 40 -48 56 -64 80 -89 104 -120 137 -159 181 -205
33 -205 231 -261 295 -330 370 -414 462 -514 572 -633 702 -775 855 -945 1042 -1150 1266 -1394
51 -1394 1537 -1693 1869 -2065 2287 -2539 2829 -3166 3562 -4041 4627 -5367 6335 -7658 9589
66 9589 -12681 18431 -32792 149890 140481 -201143 -131225 32239 129647 72405 -51380 -175545
78 -175545 -100551 76084 114939 -43725 -117644 -60622 31089 106183 92381 -59340 -130788
89 -130788 -26402 104145 110351 26270 -59083 -75593 -1340 105402 80470 -49858 -97636
100 -97636 -36449 27174 51918 5603 -75682 -81556 12319 84440 41760 -41027 -55674 -17056
112 -17056 40662 76801 25737 -56015 -50092 17749 56602 38140 -13759 -51030 -34399 24151
$$ packed form
0@%%%%%%%%%%%Qj6J6j6K4l2L2m0N6o4P2q8J04j20J44j69J93k24K57k96L40l86
33b05M36m92N56o25P00p84Q76r76J086j205J335j477J630j800J987k192K416k660
51a394K931l230L562l934M352m826N368n995O728p603Q668r994J1702j3993J7247
66I589k2270L1112n1223J82682r409l41624O9918J63464R7408n7242j23785j24165
78a75545P4994J76635L8855j58664p3919N7022R1711P5094j3802j51721p1448
89a30788J04386J30547O206q4081q5353j6510P4253J06742k4932j30328m7778
100i7636O1187O3623K4744m6315q1285n874R3875P2121m2680q2787j4647L8618
112a7056N7718L6139n1064q1752N923O7841L8853j8462n1899l7271J6631N8550
$$ plain form
124 24151 47531 -4771 -52650 -37155 2057 31690 29478 -14915 -44131 -15044 33402 43962
136 43962 9349 -25938 -27344 731 35885 32482 -13477 -37296 -14292 16419 25012 4002 -25170
149 -25170 -28815 -2183 24753 17729 -13532 -24072 -8610 13449 23724 9035 -16015 -16610 4903
162 4903 20917 15164 -4525 -16668 -10891 7090 17762 3730 -16671 -16108 -1034 12136 11991
175 11991 -3913 -15630 -8016 8683 15090 3961 -9310 -9382 9 10793 11103 -2234 -10770 -5507
189 -5507 5101 9496 3323 -6882 -9341 -2291 6630 6972 -2402 -7836 -4199 2880 7696 3973 -4348
204 -4348 -6283 -144 6029 5885 -752 -5404 -3710 1821 6149 2836 -3762 -4864 -1062 2971 3939 -403
220 -403 -4458 -3684 786 3819 2242 -1766 -3241 -829 2525 3715 426 -2445 -2242 647 2835 1757
$$ packed form
124B4151K3380n2302m7879J5495L9212K9633k212m4393k9216K9087M8446J0560
136D3962l4613l5287j406K8075L5154l403m5959k3819K3004L0711Q593k1010k9172
149b5170l645K6632K6936p024l1261j0540J5462K2059J0275j4689k5050n95K1513
162D903J6014n753j9689j2143N777J7981J0672j4032k0401N63J5074J3170j45
175A1991j5904j1717P614J6699O407j1129j3271p2R391J0784L10j3337q536N263
189e507J0608M395o173j0205k459P050Q921L42r374n434L637P079M816l723q321
204d348j935O139O173j44o637m652J694N531M328l313o598j102L802M033R68m342
220d03m055P74M470L033j577m008j475K412L354J190l289k871K03K889K188j078
$$ plain form
236 1757 -1051 -2668 -1497 1287 2456 102 -2050 -1996 -250 1513 1261 -686 -1836 -974 986 2196
252 2196 663 -811 -1383 -232 1369 1445 -422 -1206 -914 -68 1085 1021 -563 -1238 -591 771 1328 -26
270 -26 -1031 -994 -43 1050 653 -197 -568 -343 355 660 219 -367 -906 -382 781 521 -73 -369 -681 50
290 50 607 68 -406 -847 -114 419 671 312 -710 -320 -4 583 674 -41 -506 -255 243 541 226 71 -676
311 -676 -189 112 550 410 -258 -284 -32 421 351 -108 -362 -303 -70 382 479 -343 -524 -381 210 524 122 -562
333 -562 -300 40 495 -34 -252 -472 -45 -115 555 88 -368 -300 57 367 415 -152 -504 -276 224 540 -109
354 -109 -624 -423 35 380 562 -117 -531 -500 305 612 -22 -504 -636 86 221 434 62 -299 -711 7 848
375 848 397 3 -739 -425 263 446 59 -436 -618 3 631 404 -294 -500 -105 556 353 176 -714 -358
$$ packed form
236A757k808j617J171K784J169k354k152N4J746J763k52j947j150Q62J960J210
252B196j533j474n72J151J601P6j867p84K92Q46J153o4j584o75O47J362N57j354
270b6j005L7R51J093l97q50l71K25O98L05m41n86n39N24J163k60n94k96l12P31
290E0N57n39m74m41P33N33K52l59j022L90L16N87R1p15m65K51M98K98l15j55p47
311f76M87L01M38j40o68k6K52M53p0m59k54N9K33M52R7q22j81J43N91L14m02o84
333e62K62L40M55n29k18k20M27p0O70m67m56O8L57L10M8n67l52K28N00L16o49
354a09n15K01M58L45J82o79m14L1Q05L07o34m82j32P22J35K13l72l61m12P18Q41
375H48m51l94p42L14O88J83l87m95j82O21O28k27o98k06L95O61k03j77q90L56
$$ plain form
395 -358 -78 469 256 -242 -488 -87 245 420 129 -246 -438 76 755 327 -430 -436 -322 123 522 -4 -333
416 -333 -313 -10 378 317 -225 -487 -114 414 286 -63 -361 -356 -133 458 -8 -606 -533 -207 231 352 98 -606
438 -606 -312 161 520 219 -369 -180 36 23 347 237 -214 -289 99 398 98 -130 -22 -93 199 295 -33 -447
460 -447 -205 65 183 169 -225 -391 -218 182 42 22 -270 -252 -65 476 290 -46 0 38 169 272 49 -204
482 -204 -3 -237 94 289 -243 -116 -141 277 335 107 -357 -113 -31 73 -95 -24 -106 154 149 175 -146 109 71
505 71 141 276 138 -98 -355 6 206 357 29 -234 -442 -124 6 64 -247 -243 38 -124 122 130 42 -370 122
528 122 166 104 -220 -48 -235 179 141 -21 -127 -275 204 267 32 -73 -195 -193 -273 74 210 -332 -13 -49 184
551 184 -236 182 -148 -148 251 -83 -100 -7 -253 11 190 49 -119 124 -204 51 374 15 -60 -351 7 85
$$ packed form
395c58K80N47k13m98k46M01L32J75k91l75j92N14O79m28p57oJ14M45L99n26l29
416c33K0L03L88o1n42k62L73N28j28l49k98NK23N91m66n98P3L26M38J21k54p04
438f06K94M73L59l01n88J89K16j3L24j10m51p5L88K99l00k28J08p1K92R6l28m14
460d47K42K70J18j4l94j66J73M00j40k0k92J8J87N41j86l36M6L8J31J03k23k53
482b04K01k34L31J95n32J27k5M18N8k28m64K44Q2J04j68P1q2K60nK6l21K55l8
505G1P0J35j38k36k57L61K00J51l28k63k08L18J30N8l11MK81j62K46Qq8m12M92
528A22M4o2l24J72j87M14l8j62j06j48M79O3k35j05j22Kq0L47J36n42L19l6K33
551A84m20M18l30%L99l34j7R3k46K64J79j41j68K43l28K55L23l59p5k91L58P8
$$ plain form
573 85 -197 12 -194 -68 64 184 80 -38 60 -70 210 27 -351 -27 -394 -167 33 -130 45 237 -254
594 -254 195 210 244 123 -129 311 -109 -95 163 33 -149 -248 178 38 -17 134 108 -30 -146 43 -231 11
616 11 63 -101 -150 39 -4 101 42 -259 40 -41 36 104 187 -156 15 -111 -157 113 186 219 89 -31 18 -411 22
641 22 -63 -61 -153 46 39 -139 168 50 85 -12 -33 -122 104 -8 95 243 -90 126 -51 -91 90 -229 115 -187
665 -187 -25 -146 -57 60 140 59 223 -15 -299 232 -277 85 341 44 132 92 -94 -90 -169 -17 151 3 -77
688 -77 -58 -77 -81 78 391 20 141 -33 62 22 98 -132 -149 -173 55 2 -156 -54 6 2 -188 33 113 -252 188
713 188 -298 -133 -235 -22 71 -85 56 28 9 -19 -154 -111 -21 81 114 -44 148 390 53 -157 -28 -47 176
736 176 -21 6 -218 19 53 29 132 -106 -120 -64 181 145 -78 47 10 129 -92 211 201 64 -206 -81 -36
$$ packed form
573H5k82K09k06J26J32J20j04j18R8j30K80j83l78L24l67K27K00j63J75J92m91
594b54M49J5L4j21k52M40m20J4K58j30j82r9M26j40n5J51k6j38j16J89k74K42
616A1N2j64m9J89m3J05n9l01K99q1P7O8Q3l43J71j26m6K70P3L3j30j20M9m29M33
641B2q5Kr2J99pj78L07j18L5r7k1q9K26j12J03J48l33K16j77m0J81l19L44l02
665a87J62j21Q9J17Q0q1J64k38k84N31n09L62K56k97Q8m0j86Mp9J52J68j48q0
688g7J9j9mJ59L13l71J21j74R5m0P6k30j7k4K28n3j58J02O0mj90K21Q0l65M40
713A88m86J65j02K13R3j56J41k8j9k8j35M3R0J02L3j58J92K42l37k10J29j9K23
736A76j97K7k24K37L4k4J03k38j4N6K45l6k23J25l7J19k21L03j0j37k70J25M5
$$ plain form
759 -36 27 76 113 61 240 -29 96 -7 74 -69 16 -162 -16 24 54 165 97 -126 -143 140 -62 -290 -72 164
783 164 -181 13 -194 -79 -90 270 -9 73 26 -108 -40 -50 -214 113 -63 61 -113 -42 148 221 -14 169 -226
806 -226 70 -105 6 -56 50 -16 -36 106 -115 13 -53 175 205 34 -190 -174 170 -101 -44 18 -320 2 82
829 82 166 -190 -243 12 182 -145 -88 -129 -165 -9 218 325 118 34 -132 212 354 -23 -40 105 -25 139 73
852 73 14 -192 120 -57 -223 235 85 -38 -191 141 -84 108 -210 -168 -143 107 173 121 54 76 -16 196 -220
875 -220 -199 -24 -176 -74 -42 60 -193 -139 -40 70 165 157 -20 94 165 -194 98 85 -31 -133 61 -215 -189 -137
899 -137 -69 -208 -126 -450 -136 41 -175 -135 -96 114 9 82 39 -78 229 66 199 -417 -924 -278 331 713
921 713 167 -366 475 160 -540 -102 90 -7 17 -18 45 -30 -208 201 -394 186 -102 238 276 215 184 256 66
$$ packed form
759c6O3M9L7n2J79k69J25j03Q1j43Q5j78J46M0L0J11o8k23j7K83k02k28K18K36
783A64l45J94k07J15j1L60k79Q2m7j34O8j0j64L27j76J24j74P1J90P3k35J83l95
806b26K96j75J11o2J06o6k0J42k21J28o6K28L0j71k24J6L44k71N7O2l38L22Q0
829H2Q4l56n3K55J70l27N7m1l6J56K27J07k07q4j66L44J42l77j7J45j30J64o6
852G3n9k06L12j77j66M58j50j23j53L32k25J92l18M2K5K50O6n2o7K2r2K12m16
875b20K1J75j52J02L2J02k53N4R9J10R5qj77J14P1l59K92j3j16j02J94k76K6N2
899a37O8j39Q2l24L14J77k16M0L9K10j05P3m3j17L07j63J33o16n07O46O09L82
921G13n46n33Q41l15p00M38J92r7K4l5O3p5j78M09n95N80k88L40L8o1l1P2j90
$$ plain form
944 66 -32 137 -228 198 -49 13 -172 80 243 -20 -112 150 51 -91 46 2 -2 -19 -103 220 -109 -82 212 -112
968 -112 76 -131 -174 84 92 340 -36 -117 -109 -262 33 106 -77 290 119 -191 31 -224 12 93 104 -73 -56 -135
992 -135 6 38 -191 45 7 -114 95 159 -73 -81 -102 80 26 37 -81 -324 -4 113 -231 -183 -156 -162 -184 244 40
1017 40 189 -72 -19 223 27 19 193 -8 132 38 -70 -236 -143 1 45 -19 -23 24 -39 62 -249 469 -152 -34
1041 -34 71 8 68 31 57 -97 217 182 -411 -212 -91 -187 -9 -159 -50 87 29 -2 -37 -21 -144 -6 -132 -60
1065 -60 -299 -74 -163 -198 -191 -221 -167 -15 181 86 360 -274 196 13 111 149 226 -250 75 -98 -105 -203 -61 255 -266
1090 -266 299 263 370 -112 81 -161 537 636 862 585 -845 -224 23 417 492 -72 -222 -503 54 500 397
1111 397 307 -38 -157 -39 146 48 -264 330 104 -40 -599 -377 -85 107 -84 177 137 115 146 -265 11 -100
$$ packed form
944F6r8J69l65M26k47O2j85K52J63k63r2K62r9j42J37m4mj7q4L23l29K7K94l24
968a12J88k07m3K58QK48l76q1Qj53K95P3j83L67j71l10K22k55K36Q1J1j77J7p9
992a35J41L2k29K36l8j21K09O4k32qk1J82n4J1j18k43L20J17l44M8K7ok2M28k04
1017D0J49k61N3K42j96qJ74k01J40r4j08j66R3J44M4o4mM7o3J01l11P18o21J18
1041c4J05o3O0l7K6j54L14l5n93J99J21r6J78j50J09J37n8l1l5J6j23J38j26P2
1065f0k39K25q9l5Pl0N4J52J96r5K74o34M70j83R8L8P7m76L25j73pr8J42L16n21
1090b66N65l6J07m82J93k42O98R9K26k77j430O21K47L94P5n64j50k81N57M46j03
1111C97r0l45j19J18J85r8l12N94k26j44n59K22K92J92j91K61m0k2L1m11K76j11
$$ plain form
1133 -100 15 -97 35 209 254 -98 -78 31 -193 -91 -180 72 3 151 53 -182 -37 -226 -14 279 -89 -230
1155 -230 -370 -105 -58 133 157 140 -16 153 267 -112 -84 -297 316 50 -11 88 -18 259 -69 -110 -217 2
1177 2 -34 122 -57 57 73 -102 -131 -27 174 -117 -63 13 -77 -150 122 207 76 71 187 98 216 -293 73 429
1201 429 -151 8 -88 155 -45 91 168 -193 147 -85 14 -81 75 -179 0 -239 -101 53 173 35 113 19
1223 19 44 42 -66 2 -23 -10 -86 -363 27 -188 7 77 -161 355 -138 113 -184 176 16 -75 -31 -204 169 100
1247 100 -129 -46 213 49 98 0 134 90 60 60 108 -56 -165 99 232 131 -214 -199 78 -355 -185 -434 -123
1270 -123 72 93 265 -280 114 57 141 106 132 14 -6 136 49 3 -55 -221 96 -121 336 -92 90 -208 44
1293 44 100 120 55 -196 -184 129 -15 84 -168 -59 202 -4 -304 -206 -30 132 153 -140 -56 -142 387 -101 -159 56
$$ packed form
1133a00J15j12J32J74M5l52K0J09k24J02q9K52o9J48r8k35J45j89K12K93l68j41
1155b30j40K65M7J91K4j7j56J69J14l79K8k13O13k66o1R9j06K77l28m1j07K19
1177Bl6J56j79J14J6j75k9J04K01k91N4P6r0p3K72Q5j31nJ16q9J18n09L66L56
1201D29n80J59r6K43k00J36P7l61L40k32R9r5J56k54J79k39J38J54J20j38P8r4
1223A9K5kj08O8k5J3p6k77L90k15J95P0k38N16m93K51k97L60j60r1M4j73L73o9
1247A00k29Q3K59j64M9r8J34m4l0%M8j64j09K64J33j01l45J5K77m33J70k49L11
1270a23J95K1J72n45L94n7Q4l5K6j18k0J42q7m6n8j66L17k17M57m28J82k98K52
1293D4N6K0o5k51J2L13j44R9k52J09K61k06l00R8J76J62K1k93Q4q6N29m88n8K15
$$ plain form
1317 56 134 -111 -183 36 -243 -17 1 142 11 -210 18 64 -97 153 -7 49 -3 112 24 397 -98 -101 236
1340 236 144 88 124 -91 18 100 -229 33 -89 52 61 158 13 -197 -296 -27 -1 111 -68 39 -168 -152 -75 -24
1364 -24 73 121 -117 76 182 -156 196 7 186 121 -191 286 205 3 -28 192 189 60 109 -206 34 27 -8 -110
1388 -110 261 291 25 -103 -52 -41 -20 115 -116 62 190 85 -11 46 -16 -78 -239 148 -68 -8 100 -68 178
1411 178 30 -101 131 -137 14 -346 -28 -149 -31 86 -51 -16 -138 -128 -83 -127 -27 -18 65 -232 20 91 68
1434 68 310 48 126 -24 64 94 308 -10 -197 100 -99 11 45 -44 141 25 -3 -200 -395 168 18 20 -132
1457 -132 -78 107 -127 -130 -131 180 85 -46 100 -28 173 338 -50 451 178 -98 47 -102 52 62 -183 -41
1479 -41 193 138 116 146 62 5 173 228 -20 -166 6 144 158 80 230 140 245 -71 -8 -66 -104 66 36 57 -1
$$ packed form
1317E6P8k45p2K19k79K26J8J41j31k21K28M6j61K50j60N6n2J15q8L73m95lL37
1340B36r2n6L6k15J09Q2l29K62j22J41RR7j45k10r9K69K6J12j79J07k07J6P7N1
1364b4R7M8k38J93J06l38L52j89J79o5l12M77q1k02l1K20lj29M9l15K40pl5j02
1388a10L71L0k66j28N1J1K1J35k31J78J28j05r6N7o2o2j61L87k16O0J08j68K46
1411A78j48j31K32k68J51l60L18j21J18J17j37L5j22J0M5m4J00RQ3k97K52P1k3
1434F8K42k62P8j50Q8L0K14l18j87K97j99J10L4q9J85j16k8j97j95N63j50Kj52
1457a32N4J85k34ljL11r5j31J46j28K01J65l88N01k73k76J45j49J54J0k45J42
1479d1K34n5k2L0q4n7J68N5k48j46J72J38J4p8J50r0J05l16O3n8l8J70l0K1n8
$$ plain form
1504 -1 229 -198 -127 296 5 57 52 -92 -375 -174 75 28 -36 223 -46 -51 -66 -207 -256 -165 -40 136 -125 -190 74
1529 74 -168 351 -133 176 29 -147 -211 101 -20 -3 93 84 -128 51 106 40 315 -163 -23 64 -145 -83 26
1552 26 94 191 4 -160 -198 24 -137 -54 147 -237 -146 11 11 -346 240 -87 35 26 138 183 -173 212 -98 -15
1576 -15 -75 -215 315 165 -160 29 -264 282 60 59 93 93 58 -42 -111 -77 39 -7 -231 -74 30 0 68 -103
1600 -103 -99 -197 -42 -51 235 -22 53 49 -120 -70 161 14 64 110 -27 202 -214 -75 -205 179 -234 -87 -176 81
1624 81 292 16 -83 164 -76 190 -70 -49 232 176 -226 -23 63 -134 102 -109 70 -157 251 -34 57 -305
1646 -305 179 -57 -194 70 -118 -274 87 67 -117 211 -38 139 121 22 32 137 236 83 51 45 -197 -2 17
1669 17 -24 -65 40 -32 73 -81 -7 -219 12 57 -53 168 -182 28 115 48 -93 -81 -46 -33 470 -12 130 143
$$ packed form
1504aK30m27P1M23k91N2nj44k83K01K49m7o4K59k69nj5j41m9R1J25J76k61o5K64
1529G4k42N19m84L09j47j76o4L12j21J7R6rk12J79N5o6K75m78J40Q7k09O2J09
1552B6O8R7j87j64l8K22j61Q3K01l84R1J57%l57N86l27J22rJ12M5l56L85l10Q3
1576a5o0j40N30j50l25J89k93N46k22jL4%l5j00o9L4J16m6k24J57J04l0O8j71
1600a03Mr8J55rK86k57P5mj69N0K31j47N0M6j37K29m16J39j30L84m13J47q9K57
1624H1K11k76r9K47k40K66k60K1K81n6m02K03Q6j97K36k11J79k27M08k85R1l62
1646c05M84k36j37K64j88j56L61k0j84L28k49J77j8r9J0J05R9j53l2ok42J95J9
1669A7m1m1J05p2J05j54P4k12K31M5j10K21l50K10Q7o7j41J2L5J3N03m82J42J3
$$ plain form
1693 143 -107 -141 231 -134 -48 -165 -80 -41 0 -127 -309 81 57 -134 48 -94 -59 124 125 -11 -62 204 281 -84
1717 -84 60 -38 -47 39 219 -203 50 -33 -392 -68 147 -315 180 -8 15 143 118 23 138 81 -67 -79 -55 -57 36
1742 36 57 79 -70 -62 -71 -45 268 30 258 100 334 102 -203 -407 -449 -301 -12 -274 3 220 52 -63 -5
1765 -5 141 282 -15 -86 -188 -17 -81 -24 119 -109 121 -47 -4 -35 -97 -19 29 18 -162 71 252 61 -111 68
1789 68 60 -123 -200 -253 24 -176 -237 37 132 142 -91 324 -82 -277 -25 -129 87 -65 -147 36 -15 -28 178 -188
1813 -188 -156 -28 -15 18 -172 44 -70 -110 99 -127 133 112 138 69 -101 -47 114 366 -3 -139 50 -66 -162
1836 -162 191 -48 31 26 130 -159 229 -176 310 -75 -334 -193 9 -47 273 76 220 37 -4 74 205 340
1858 340 58 -13 152 -72 198 -173 225 57 -107 147 -391 62 -134 165 -109 21 9 224 52 73 30
$$ packed form
1693A43k50l4L72l65Q6j17Q5L9M1j27j82L90k4j91J82j42L5J83Jj36n1K66P7l65
1717h4J44r8rQ6J80m22K53q3l59L24K15m62M95j88K3J28k5r5J15n7j48j2K4kR3
1742C6K1K2j49QrK6L13k38K28j58K34k32l05k04m2J48K89k62K77K17j68j15N8
1765eJ46J41k97p1j02J71o4N7J43k28K30j68M3l1o2P8M8j1j80K33J81j91j72J79
1789F8qj83p7n3K77k00o1K74R5J0k33M15m06j95K52j04K16j52q2J83n1j3K06l66
1813a88L2J28J3L3j90K16j14m0K09k26K60k1K6o9j70N4J61K52l69j36J89j16r6
1836a62L53k39P9nJ04k89L88m05M86l85k59J41K02n6L20j97J44j83m1P8J31J35
1858C40k82p1J65k24K70l71L98j68j64K54n38M53j96K99k74J30j2K15j72K1m3
$$ plain form
1879 30 42 -44 -34 103 -48 74 293 -338 228 295 123 -300 143 -77 -199 -241 60 -300 57 -82 -71 91
1901 91 -105 -46 88 218 -90 -81 -55 93 41 -116 78 -2 -250 -45 -76 -193 -109 186 -100 -248 -323 13 101 -87
1925 -87 141 191 29 133 -180 -107 9 -2 -59 -16 -98 -54 115 132 -113 -103 -123 57 125 204 -87 66 126 61 -14
1950 -14 194 -7 165 3 218 312 -18 175 -78 -111 24 73 65 241 128 229 -137 -43 -58 211 -322 -35 195
1973 195 -107 -263 -328 0 -34 -168 8 -224 -246 172 -110 184 54 80 11 -208 -175 33 285 31 156 7
1995 7 394 -74 -48 -254 -233 210 -109 149 4 -205 -102 -9 -243 -70 -39 136 -203 -217 24 58 117 -45 -202
2018 -202 -146 24 -57 -30 -49 -244 134 131 -239 153 -70 198 87 -26 25 -183 55 199 -87 78 -110 -245
2040 -245 149 -34 203 331 -28 -14 -11 211 85 -152 -217 90 -15 -88 -126 36 253 79 228 -145 -192 9
$$ packed form
1879C0J2q6J0J37j51J22K19o31N66O7j72m23M43k20j22m2L01l60L57j39J1J62
1901I1j96N9J34J30l08RK6J48n2j57J94q0k48K05l1j17Q4K95k86j48p5L36Q8j88
1925h7K28N0j62J04l13P3J16j1n7M3q2M4J69J7k45J0k0J80O8P9k91J53O0o5p5
1950a4K08k01J72j62K15R4l30J93k53l3J35M9qJ76j13J01l66R4j5K69n33K87K30
1973A95l02j56o5L28l4j34J76k32k2M18k82K94j30K6o9k19L3K08K52k54J25j49
1995GL87m68K6k06K1M43l19K58j45k09J03R3k34J73L1J75l39j4K41L4N9j62j57
2018b02N6J70q1K7j9j95L78ll70L92k23K68j11j13N1k08K38J44k86J65j88j35
2040b45L94j83K37J28l59J4LK22j26k37o5L07j05p3l8J62K17j74J49l73m7K01
$$ plain form
2062 9 -235 120 -146 65 -161 -209 125 -68 -235 -29 65 -172 34 128 -85 -47 106 350 68 -60 68 152
2084 152 77 22 -135 -15 126 216 -33 -208 -124 59 -266 280 -108 -47 75 -245 1 131 80 -91 0 -377
2106 -377 5 -72 -242 303 -75 -280 -71 -68 -82 -179 -137 -65 -112 -83 -200 -132 -285 -92 108 -99 -163 -141 -23 13
2130 13 33 56 -143 29 121 200 -32 140 -198 398 192 -64 -155 -122 331 132 -11 161 -186 -182 250 79 182
2153 182 -61 137 308 -123 -44 -185 95 -104 -262 -216 45 -152 -207 -215 -297 75 -168 26 -195 -194 -82 90 124
2176 124 227 -134 151 76 -245 89 234 238 -12 137 170 176 19 11 -201 -29 184 267 60 -87 25 35 137
2199 137 -93 -16 36 46 -288 -160 -213 -5 91 22 -327 141 188 -169 -43 197 -40 8 149 -8 35 -40 -77 158
2223 158 -21 22 -147 71 50 -90 165 -77 -53 -83 167 109 -240 -10 304 -101 -180 82 10 -200 279 7
$$ packed form
2062Ik44L55k66K11k26m8L34j93j67K06R4k37K06R4k13L8J53K44k82j28J28Q4
2084A52p5n5j57J20J41R0k49j75Q4J83l25N46l88O1J22l20K46J30n1j71R1l77
2106c77L82p7j70N45l78k05K09Lj4r7M2P2m7K9j17O8j53J93K00k07o4K2J18L6
2130A3K0K3j99J72R2P9k32J72l38N96k06k56r1L3M53j99j43J72l47MM32j71J03
2153A82k43J98J71m31P9j41K80j99j58M6K61j97n5qq2L72k43J94k21JJ12J72L4
2176A24J03l61K85p5l21L34J45Mk50J49L3Oj57qk12J72K13Q3k07j47J12J0J02
2199A37k30P7N2J0l34J28n3K08R6o9l49M68M7l57J26K40k37M8J41j57M3p5l7K35
2223A58j79M3j69K18k1j40K55k42K4l0K50n8l49K30L14m05p9K62p2k10M79k72
$$ plain form
2245 7 13 62 -130 -232 127 -166 32 63 -22 -200 356 168 53 28 -77 -34 136 62 64 111 -153 -3 -53 88 -33
2270 -33 234 -102 107 46 -75 -241 121 261 130 269 81 -276 -94 241 29 205 144 29 -221 -129 36
2291 36 82 -198 -190 97 54 177 153 -71 -19 45 126 25 -181 69 -149 92 104 74 -159 -51 391 -117 -58 24
2315 24 -32 -198 25 122 -125 33 -111 -19 66 10 -171 -247 109 1 3 -30 70 -119 17 30 -12 -17 109 111 155 -111
2341 -111 16 -152 -260 -25 -75 56 20 78 168 24 -109 -83 77 14 -84 88 100 151 260 6 -89 76 -10 -148
2365 -148 -51 -97 -140 -61 -94 -99 43 65 278 83 -182 -143 47 -135 -228 -97 -52 26 -85 -109 113 71 122 -282 183
2390 183 -59 118 -49 79 7 -222 -237 -113 -163 34 -187 11 -44 282 129 118 -2 49 104 72 -77 174 -34
2413 -34 62 222 -13 32 54 240 -235 -109 -96 125 65 59 -162 64 -247 -282 -69 135 120 -150 243 38 -152
$$ packed form
2245GOM9j92j02L59k93J98L1q5j78N56j88j15k5j05M3J70p4KM7k64J50n0J41j21
2270c3K67l36K09o1j21j66L62J40j31J39j88l57J82L35k12J76o1j15k50R2J65
2291C6M6k80QK87m3J23k4k24N2O4Q1j01k06K50k18K41J2l0k33J08M42n08N9Q2
2315B4n6j66K23R7k47J58j44R2Q5n6j81p6L56j08Kl3J00j89J36J3m2nJ26KM4k66
2341a11J27j68j08K35n0J31l6N8R0j44j33K6J60o3r8J72J2N1J09k54r5J65q6j38
2365a48R7m6m3P9l3nJ42K2K13j95k65L9J90j82r3J31M5P8j11k4K22m2N1m04M65
2390A83k42J77j67J28p2k29j5J24n0J97k21J98n5L26j53j1j20N1N5l2j49K51k08
2413c4R6J60k35M5K2J86m75J26J3K21o0ok21K26l11l5K13K04j5k70L93k05j90
$$ plain form
2436 -152 -129 -283 81 -102 224 122 -67 176 104 168 4 -130 -45 -264 0 226 148 -70 67 -84 -10 198
2458 198 -50 -71 136 -217 231 -75 316 -205 -216 -22 32 -71 -64 111 -6 -163 -314 120 -45 116 80 51
2480 51 59 50 -164 -139 -32 417 18 -238 70 86 54 124 84 -293 -104 -145 -26 211 121 71 125 -24 17 -57 -279
2505 -279 4 -31 147 -14 -97 -88 36 -229 125 63 93 -13 -5 302 103 20 -172 156 -82 -47 -116 -4 139 -151
2529 -151 46 -66 -45 -67 -49 -11 75 -33 203 -16 286 -41 -426 -58 178 24 217 -121 -9 121 -90 -341
2551 -341 84 9 261 112 -69 -148 59 -71 -35 195 18 -308 -137 -66 -36 -217 -231 -123 57 -27 -79 -109 223
2574 223 63 74 -60 -66 204 187 42 -135 156 296 333 -183 80 -144 -2 10 45 197 56 -118 -14 28 -53
2597 -53 -24 37 -122 129 -160 -12 -137 -106 136 -262 -25 197 -175 73 0 -111 134 -138 178 -239 157 234
$$ packed form
2436a52K3j54L64j83L26j02j89K43p2O4j64j34Q5k19K64K26p8k18J37j51P4K08
2458A98k48k1K07l53M48l06L91n21j1J94N4j03PJ75j17j57j51M34j65J61l6k9
2480E1Qrk14K5J07M49l99k56L08J6l2P0m0l77J89m1J19K37r0n0N4j49M1p4k22
2505b79K83l5J78j61q3RJ24k65L54o2L0j06QL07j99q3j92L28k38L5o9J12J43k90
2529a51J97j12K1k2J8L8Q6j08K36k19L02l27l85L68K36j54J93l38J12J30k11k51
2551c41M25p5K52j49j81p9K07j30L6K30j77l26J71P1L0j81j4J08J80q4n2l0L32
2574B23j60J1j34oK70j7j45j77K91J40L7n16K63k24J42J2L5J52j41j74J04M2q1
2597e3K9O1j59K51k89J48j25L1K42l98K37K22l72K48p3j11K45k72L16m17L96P7
$$ plain form
2619 234 92 -97 101 310 9 16 243 -203 -116 44 35 38 -9 -95 115 -121 -231 123 -192 128 -36 -200 240
2642 240 132 -230 17 14 37 61 -98 -262 -57 130 -308 102 159 -11 110 203 17 77 1 -46 -34 -4 61 215
2666 215 -23 -153 -8 300 -144 99 -127 128 -108 231 -41 157 91 120 -316 182 260 -111 -67 222 -169
2687 -169 -285 76 -80 196 -152 32 -86 -93 -4 187 138 -184 87 50 87 -254 -75 -62 -171 -238 -49 -125 17
2710 17 38 -122 181 71 -109 -29 -77 142 -4 243 -70 -114 -248 -19 162 -169 78 -93 -51 53 248 200
2732 200 -1 -186 38 -31 115 31 -204 -74 -116 -187 -150 57 148 23 89 -162 -152 -94 -228 -136 19 160 151 42
2756 42 54 75 -336 -173 -67 74 -240 -153 289 -244 47 -114 -52 112 207 86 -17 -11 68 -41 179 19 199
2779 199 -73 -35 27 104 53 -62 141 55 -31 -232 91 -115 86 144 42 -255 57 -175 -166 -395 -3 173 157
$$ packed form
2619B34j42j89J98K09l01PK27m46Q7J60rLm7q6K10k36j10L54l15L20j64j64M40
2642B40j08l62K47lK3K4j59j64K05J87m38M10N7j70J21R3j86O0p6m7J2L0O5J54
2666B15k38j30J45L08m44K43k26K55k36L39k72J98o6K9m36M98P8l71M4K89l91
2687a69j16L61j56K76l48J84j18pQ9J91m9l22K71l7L7l41J79J3j09o7J89p6J42
2710A7K1j60L03j10j80Q0m8K19j46K47l13m4j34K29J81l31K47j71M2J04J95m8
2732B00k01j85K24o9J46q4k35J30m2p1L7K07R1j25O6k51J0N8j34R2J55J41rj09
2756D2J2K1m11J63J06J41l14Q7M42n33K91j61O2J64R5j21j03OP9j09K20j60J80
2779A99k72L8O2P7n1j15K03q6q6k01L23k06K01N8j02k97L12k32Rk29L92J76j6
$$ plain form
2802 157 110 49 49 -81 -201 -102 -87 -170 174 -149 -145 -237 118 -111 -173 -2 -107 -48 222 2 -49 167 -10 -15 -7 -83
2828 -83 162 -210 -212 -62 -123 199 -10 -2 209 31 160 -52 -178 -245 -45 -64 -117 -25 -181 123 70 -32 -147 26
2852 26 -320 -61 -55 -293 14 -38 197 -152 119 294 -3 -18 239 3 -9 3 -43 -39 155 46 -59 162 76 59
2876 59 151 -125 -26 170 93 -94 -304 -155 239 125 -73 57 70 43 -182 -29 -221 72 170 242 -192 24 265
2899 265 -216 115 -293 17 -135 87 -79 -163 87 -104 29 223 12 -45 -193 25 57 35 -139 76 -15 -119
2921 -119 -73 309 39 -311 -100 -105 -62 93 -126 -135 106 63 -119 -36 133 -42 -109 -208 -217 399 120 -30 -437 -89
2945 -89 235 168 10 219 18 -163 90 48 -79 209 -138 39 253 183 11 54 3 -96 -6 -129 192 -181 69
2968 69 118 -114 -16 -167 -61 -490 -39 63 -28 61 -74 -141 134 40 104 -35 78 -72 361 257 -39 -168 -198
$$ packed form
2802A57m7o1%j30j20R9J5q3L44l23Mr2L55k29o2J71j05N9K70k20n1K16j77nQp6
2828h3K45l72kJ50o1L22k09QK11j78J29k12j26o7K00j9n3R2j56L04n3j02j15J73
2852B6l46K59Ok38L07n2K35l49K71J75k97j5K57k36j2J2m6MJ94j09j05K21q6j7
2876E9R2k76R9J96p7j87k10J49L94j14j98J30J3k7k25J53j92K93R8P2m34K16K41
2899B65m81L31m08L10j52K22j66q4K50j91J33J94k11n7j48K18L2k2j74K15r1j04
2921a19M6L82k70l50K11nM3J55k19rK41m3j82Q3J69j75o7r9rO16k79j50m07L48
2945h9L24o7j58K09k01j81K53m2j27K88l47J77K14p0j72M3n1r9R0j23L21l73K50
2968F9M9k32R8j51J06m29M51J02r1Q9j35o7K75r4O4j39J13j50M33j04k96j29l0
$$ plain form
2991 -198 -209 -14 446 -42 26 -202 118 -96 -19 64 127 -107 75 -134 21 368 174 184 146 268 95 -121
3013 -121 200 -59 184 45 150 -91 -117 307 167 26 100 -126 232 46 -214 99 -261 367 63 56 152 65
3035 65 61 -104 -68 -166 -45 153 -124 94 63 -43 -86 -135 28 -84 -155 19 -236 50 195 -90 -4 -137 -152 -46
3059 -46 19 198 201 153 91 -112 160 105 12 -114 -31 -73 47 88 -55 54 47 25 159 -176 770 -187 -96 -108 124
3084 124 184 33 141 7 -120 -150 63 89 -43 -133 1 -31 86 40 -168 -129 196 -184 -99 -172 -63 -51 60
3107 60 18 283 -254 79 -133 -43 103 100 244 168 -176 112 -94 -136 -141 85 -152 7 99 58 141 155 -146 -27
3131 -27 7 -150 182 121 63 -62 179 -41 -29 -128 -13 120 -136 53 -398 -47 102 -94 -52 -168 10 -12 89
3154 89 -470 206 -145 239 185 450 382 -370 272 66 -74 38 165 332 -129 -176 133 35 83 245 -71 -121
$$ packed form
2991a98j1J95M60m88O8k28L20k14P7Q3O3k34J82k09J55L47j94J0l8J22j73k16
3013a21L21k59K43j39J05k41k6M24j40j41P4k26L58j86k60L13l60O28l04pR6q7
3035F5mj65L6r8J21J98k77K18l1j06m3m9J63j12p1J74k55K86J45k85Q6j33j5J06
3059d6O5J79Lm8o2k03K72n5r3j26Q3m2J20M1j43J09pk2J34l35R46r57R1j2K32
3084A24O0j51J08j34j27l0K13K6j32r0J34l2J17m6k08L9L25l80Q5p3J09J2J11
3107F0m2K65n37L33k12R0J46lJ44p6l44K88k06m2nK26k37J59R2m1Q3J4l01J19
3131b7L4j57L32o1n8j25K41k20J2r9J15J33k56J89m51L51J49j96M2j16J78k2J01
3154H9n59O76l51L84n4K65o8p52O42k06j40J12J27J67m61m7L09r8M8J62l16n0
$$ plain form
3176 -121 -162 -162 228 1 244 125 211 -11 210 -93 261 -338 -221 -213 31 140 -117 -267 -62 -151 -71 193 -37
3199 -37 85 9 50 2 84 79 196 -86 153 41 216 -135 -219 -177 123 -55 108 -42 63 -104 121 -141 -159
3222 -159 87 -82 167 42 -36 -75 2 -258 153 -76 -135 45 26 31 366 210 46 -44 201 40 79 361 103
3245 103 -216 -80 64 -47 259 -121 97 -98 69 43 69 -161 -87 60 59 -33 49 238 -15 -497 132 39 -46
3268 -46 191 -347 150 -63 5 62 34 -125 16 -36 -25 235 -25 -40 -58 -230 -269 182 -56 91 -41 -19 -1 -234
3292 -234 -387 -111 -135 8 76 75 -95 137 36 -16 -44 334 -83 108 59 150 -60 45 130 19 194 94 -129
3315 -129 -15 123 -10 64 -293 -245 -16 -11 -117 259 -205 123 28 129 -118 59 -18 75 78 -280 -155 -106 94
3338 94 -293 112 49 406 -71 -114 59 46 -80 -20 351 208 142 232 -36 152 96 -99 123 69 -42 -161 -192
$$ packed form
3176a21m1%L90k27K43j19Q6k22K21l03L54n99J17QK44J09k57j50K05q9Q0K64k30
3199c7J22p6M1m8Q2nJ17k82K39j12J75l51q4M2L00j78J63j50J05j67K25k62j8
3222a59K46j69K49j25p8l9P7k60M11k29n9J80j9NL35j56j64r0K45j61L9K82k58
3245A03l19J36J44j11L06l80K18j95J67k6K6k30P4J47jr2Q2J89k53m82O29r3q5
3268d6K37n38M97k13O8N7k8j59J41n2J1K60k60j5j8j72l9M51k38J47j32K2J8k33
3292b34j53K76k4J43O8jj70K32j01n2k8L78m17J91m9R1k10J05Q5j11J75j00k23
3315a29J14J38j33P4l57M8K29Nj06L76m64L28r5J01k47J77p7R3Ll58J25M9K00
3338I4l87M05o3L57m77m3J73j3j26O0L71j43o6R0k68J88n6j95K22n4j11j19l1
$$ plain form
3361 -192 -301 -142 169 -98 25 -298 171 16 -76 85 -88 -101 11 -280 -92 -177 109 -149 52 195 -201
3382 -201 -178 -397 93 62 97 190 96 -208 146 -52 204 182 -92 70 64 -114 -276 55 1 21 -103 126 -25
3405 -25 65 102 167 -38 -80 29 -53 66 -27 93 -4 217 -72 325 112 -162 84 182 180 -179 89 196 20 -336
3429 -336 18 99 42 -267 -26 -15 -105 174 -188 -80 75 180 357 -154 -131 253 26 -33 -332 199 -174 24
3451 24 13 233 184 23 -252 -24 113 -109 -47 75 -13 -82 -83 2 -35 -64 -131 -314 98 274 -117 -116 -163 -29 67
3476 67 50 89 -50 -127 -191 204 192 51 67 29 -105 81 207 -46 208 140 -36 123 -229 -160 166 7 39 -64
3500 -64 55 170 159 120 9 -165 -46 -6 -130 -13 -43 -120 -121 -58 -108 -205 -214 226 -147 -360 188 180 234 -43 -42 100
3526 100 82 -31 322 91 -99 185 -103 87 -123 -46 -116 -255 -82 -317 -214 -14 103 -188 144 -67 -53
$$ packed form
3361a92j09J59L11k67J23l23M69j55r2J61j73j3J12k91J88q5K86k58K01J43l96
3382b01K3k19M90l1L5R3r4l04L54j98K56k2k74J62oj78j62L31n4K0j24K29j51
3405b5R0L7O5k05m2J09q2J19r3J20r7K21k89L97k13k74K46R8kl59K68J07j76l56
3429c36L54Q1n7l09K41J1r0K79l62J08J55J05J77n11K3L84k27n9k99N31l73J98
3451B4j1K20m9j61k75K28J37k22O2J22q8o9jQ5l7k9o7j83M12J76l91Jm7J34R6
3476F7j7L9j39p7o4L95j2j41J6l8j34J86J26k53K54o8j76J59l52O9L26j59L2j03
3500f4J19J15j1l9j11j74J19M0j24J17l0p7jO3n0r7rM40l73k13N48qN4k77JJ42
3526A00j8j13L53k31j90K84k88J90k10P7p0j39J73k35J03K00J17k91L32k11J4
$$ plain form
3547 -53 -76 222 196 -174 181 -128 70 198 -12 24 38 275 -318 80 -69 -173 -112 423 -61 20 -44 -114 75
3570 75 273 99 -140 -200 -213 -112 -157 -121 66 7 15 -194 -272 81 227 -123 -65 -31 64 -113 -190 -29 89 134 -40
3595 -40 270 -167 -13 -403 185 -62 204 -157 205 -205 48 217 140 -1 -42 264 16 -229 134 -55 -208
3616 -208 241 75 -26 -9 -2 -123 39 181 134 -215 196 -101 134 0 -8 218 -32 55 -280 -191 51 57 185
3639 185 -100 114 445 75 -49 193 0 -133 55 96 -253 -55 -110 -163 137 99 -181 -226 89 -31 102 240
3661 240 -115 119 89 -117 224 -129 72 88 -8 -96 77 34 -52 -66 92 -328 184 102 84 -37 24 -59 -79 240
3685 240 -121 36 -204 -269 114 -154 -90 -239 163 182 -183 249 96 74 151 -147 100 200 -348 200 259 -173
3707 -173 168 -114 170 5 -50 154 -1 22 -21 -14 -155 -37 -31 -45 -17 -106 198 21 -61 196 -47 158 -91 152
$$ packed form
3547e3k3K98k6l70L55l09J98J28k10L6J4K37n93L98j49j04O1N35m84Q1o4p0J89
3570G5J98j74k39o0j3J01m5L6J87n9Qk09p8L53J46l50N8L4R5j77p7J61J18M5j74
3595d0L10m37J54l90N88k47K66l61L62m10K53J69p7j41m1L06k48k45L63j89j53
3616b08M49j66j01J7Pj21J62J42m7l49M11k97K35j34qK26k50Q7l35Q9K42OJ28
3639A85k85K14L31l70j24K42j93j33J88M1l49J98n5n3L00l8k80m5L15j20J33J38
3661B40l55K34l0k06L41l53K01J6r6q8J73m3q6j4J58m20N12q2j8j21O1q3k0L19
3685B40l61J57k40o5L83k68O4j49M02J9l65M32j53k2P7k98K47J00n48N48N9m32
3707a73L41k82K84j65n5K04j55K3m3Pj41J18Oj4K8q9L04j77q2K57k43K05k49K43
$$ plain form
3731 152 133 -188 171 -69 281 -15 90 4 154 -70 -198 -220 -60 60 -42 -54 -54 232 -173 222 -151 130
3753 130 44 377 11 -88 -9 193 45 -54 304 312 -8 -149 -9 -85 147 73 -242 -101 80 164 274 114 -164
3776 -164 87 88 -304 243 60 86 22 211 118 69 -130 41 -231 -2 151 -16 -227 7 196 -248 -333 44
3798 44 68 42 -227 -81 171 -47 153 104 147 -168 148 -8 -1 -75 -439 35 -72 227 61 313 97 138 108
3821 108 -117 212 -68 157 -100 167 158 -231 -2 -128 286 221 -77 -46 40 27 105 153 -143 -11 37 -158 -72
3844 -72 1 -208 -102 42 152 -131 118 78 2 -107 20 231 -76 67 -33 -11 37 -50 126 -126 -86 62 -136
3867 -136 78 -293 -257 4 -240 92 102 31 22 187 -136 117 112 -256 30 163 -28 -98 -166 -21 81 -120 -200
3890 -200 90 130 -46 51 104 -121 135 213 -55 138 -35 53 -193 144 -197 -167 193 141 137 291 2 -59 -177
$$ packed form
3731A52j9l21L59k40L50k96J05q6J50k24j28k2J60J20j02j2%K86m05L95l73K81
3753A30q6L33l66r9P9K02j48r9L58Ql20j41J40p6K32p4l15J41J81Q4J10j60k78
3776a64K51Jl92N47j83K6o4J89r3m9j99J71k72K29J53j67k11K34J89m44q5L77
3798D4K4k6k69J46K52k18K00m9M3l15L16j56Pp4l64M74j07K99j66K52k16M1l0
3821A08k25L29k80K25k57K67rl89K29j26M14o5k98L1Q6j3P8M8k96J32M8j95Q6
3844g2P3k09J06J44J10k83K49m0p6j09J27K11l07J43j00K2M8q7J76k52M0J48j98
3867a36K14l71L6K61k44L32J0p1rJ65l23K53nl68K86J33j91p0o8J45J02k01q0
3890b00K90M0j76R7N3k25K56P8k68J93j73Q8k46L37l41L0L60n2mJ54k89o1j18
$$ plain form
3913 -177 17 -91 22 156 -93 213 -26 229 -133 102 -50 88 111 36 -223 11 179 26 -94 -161 -41
3934 -41 -58 -113 -246 57 212 26 45 17 224 -151 -126 -73 75 3 -154 -140 124 -105 -275 106 126 -119 -171 91
3958 91 -55 -250 -206 -104 -60 102 -57 132 85 -195 -195 -82 -119 127 62 -175 -103 132 -446 -231 31 -99 15
3981 15 149 15 -38 160 -71 -19 155 183 -37 42 85 -18 -8 167 -227 52 -48 186 159 117 103 -170 33
4004 33 272 43 -134 -199 -116 -137 162 154 77 113 191 104 -96 -28 268 -59 107 159 180 -60 -22 -312 -78 -159 -211
4029 -211 54 -3 174 60 -65 -92 -8 101 -113 194 -281 -180 -50 -165 -412 -38 0 108 34 -138 -160 -106
4051 -106 7 -4 136 -331 39 18 115 -181 -236 -16 183 -10 -116 148 89 21 -58 142 -61 14 35 -74 -170
4074 -170 62 22 -54 -9 96 -72 132 -150 -265 46 8 104 -56 -373 112 -33 -79 -71 -261 -254 -71 -24 -91 -98 178
$$ packed form
3913a77J94j08J13J34k49L06k39K55l62K35j52J38K3p5k59K34J68j53j20o7J20
3934d1j7n5j33L03J55j86J9k8K07l75K5N3J48p2j57J4K64k29j70L81K0k45n2K62
3958I1j46j95M4J02M4J62j59J89m7k80%J13l7K46o5k37P2K35n78K15K62j30J14
3981A5J34j34n3J98k31N2J74K8k20P9M3j03J0J75l94K79j00K34k7m2j4k73K03
4004C3K39k29j77o5Q3k1K99qp7L6P8q7k00O8K96l27J66N2K1k40L8k90K34q1n2
4029b11K65n7J77j14j25k7Q4J09k14L07m75J01J30j15k47L74L8J08p4j72k2N4
4051a06J13j1J40m67L70k1R7k96n5K20J99j93j06K64n9o8p9K00k03P5K1j09r6
4074a70K32m0p6M5J05j68K04k82j15L11l8R6j60l17M85j45m6Qj90PJ83M7o7pK76
$$ plain form
4099 178 164 -55 200 -125 27 -129 129 -96 -104 -339 -139 202 120 33 320 -47 -130 12 166 -158 -135 -42 -22
4122 -22 32 43 228 57 -409 89 -326 54 -205 4 39 -32 -157 50 51 323 68 118 -94 -159 52 18 245
4145 245 12 86 -115 70 -125 -116 59 -222 24 226 -215 -83 394 159 -322 23 394 97 -262 69 180
4166 180 262 -359 263 103 62 98 57 -46 244 80 -226 13 36 50 -149 118 -107 143 -286 -13 -58 -198
4188 -198 -69 -162 -110 -156 -93 -78 131 143 52 151 12 -157 188 4 -176 -104 -28 177 -49 -127 -16 11 0 234
4212 234 241 -98 74 -158 -364 -19 -17 -49 -77 9 -42 133 140 -208 -105 -105 -62 214 88 -190 -245 55 -26 -167 38
4237 38 95 110 -77 -309 -66 -88 -66 -52 121 101 39 -158 447 54 9 -22 97 381 -169 63 271 84 69 -176
4261 -176 300 -136 -14 -87 -88 177 -88 99 -158 -59 -18 -64 -231 -23 -49 63 -320 -98 -177 -294 -219 233 -14
$$ packed form
4099A78j4k19K55l25J52j56K58k25qk35K00L41q2q7K87l67q3J42J54l24K3R3K0
4122b2N4J1J85j71m66M98m15L80k59K09L5p1j25K07JK72k55N0k12o5K11l4K27
4145B45k33P4k01J85j95RJ75k81K46K02m41J32M77k35m81L45L71k97l59L31J11
4166A80Q2o21O22j60m1L6m1j03K90j64l06K39K3J4j99K67k25K50m29K73m5j40
4188a98J29r3N2m6O3J5K09J2r1R9j39j69L45j84j80P2P6K05k26p8J11K7j1K34
4212B34Pl39J72k32k06L45Kl2k8Q6n1J75Pl48J03%M3K76j26k78n5L00q1j41K05
4237C8N7J5j87k32K43k2K2J4J73k0o2j97O05l93m5l1J19K84n50K32K08j87j5k45
4261a76M76m36J22p3jK65k65J87k57R9M1m6j67K08k6J12l83K22p9j17P5M52k47
$$ plain form
4284 -14 12 83 245 -126 -21 15 -206 106 70 336 -41 30 -40 179 23 13 -182 61 99 42 5 45 81 0 -71
4309 -71 -102 177 112 -22 126 -28 117 28 -265 32 250 211 -234 77 37 109 55 -109 -51 -322 -168 21 35
4332 35 -193 -72 24 -29 -191 -53 347 3 -208 88 152 82 61 -121 -59 115 -205 14 -132 -100 -17 -152 -91
4355 -91 193 -28 51 102 17 -283 31 -190 -68 -14 315 -277 -73 -282 -99 38 -50 246 161 134 263 144 -53
4378 -53 54 -170 24 -216 122 5 66 -37 14 71 -437 1 -30 -144 190 2 -76 237 -14 -118 -21 -65 78
4401 78 182 -332 201 215 -24 -173 148 -72 -83 32 93 -2 7 43 -312 -76 304 -183 -319 -19 75 -258 -164
4424 -164 -142 -19 124 74 -20 -46 104 32 386 -67 -46 -118 -43 110 -221 75 -76 2 123 -238 -41 -203 152
4447 152 -47 -182 79 183 -182 -77 -9 111 307 -227 -294 -110 -44 -253 -91 196 -156 53 7 -202 26
$$ packed form
4284a4K6P1J62l71J05L6k21L12l6K66l77P1p0K19j56j0j95K43L8n7l7M0L6q1p1
4309g1l1K79o5j34J48j54J45q9k93K97K18l9m45L11m0P2n4j64N8k71J54J89J4
4332C5k28J21R6n3j62J38M00l44k11K96O4p0k1j82O2J74l20K19j46L2Q3j35O1
4355i1K84k21P9N1q5l00L14k21J22N4L29n92K04k09J83J37q8K96q5k7J29j19j97
4378e3J07k24J94k40L38j17O1j03N1N7n08M38l1j14L34j88p8L13k51j04R7m4J43
4401G8J04n14N33J4k39j49L21k20j1J15O1r5RL6l55K36L80m87j36L00R4l33R4
4424a64K2J23J43n0r4k6J50p2L54m53K1p2P5J53l31K96j51P8J21l61J97j62L55
4447A52j99j35K61J04l65J05O8J20J96n34o7J84O6k09J62K87l52K09m6k09K28
$$ plain form
4468 26 -115 -36 -78 -18 -133 -80 51 -34 17 72 111 22 74 -277 91 -103 3 203 -92 184 -257 -113 249 -188
4492 -188 -125 -138 64 94 -94 -186 -19 -45 76 -8 -271 59 -65 146 65 -118 -205 -64 -6 -321 -95 -85 205
4515 205 -244 -63 22 13 -171 -4 -219 -17 -118 -134 -35 -9 -126 153 -50 90 -109 -23 -22 -173 97 2 -48 35
4539 35 -10 113 125 178 -143 -77 17 48 56 49 45 30 65 92 122 -200 149 8 182 -155 -119 -89 -140 26 237 -26 -131
4566 -131 -154 -132 111 -139 135 -27 261 -311 -210 -214 258 94 -65 263 -255 -45 415 -141 -392 104 209
4587 209 -26 -72 -233 -131 -200 167 157 -7 -47 7 5 -151 -42 40 155 38 23 -36 -78 -154 76 -307 -110 154
4611 154 152 -89 -311 328 45 -31 -98 -42 -116 -220 145 -267 155 57 136 -93 -152 -161 -243 146 -247 -34 -6 -290
4635 -290 171 323 -89 52 79 111 -30 -14 -95 -64 62 -45 -65 161 61 -101 54 -204 -221 -132 -76 -45 -127 -155
$$ packed form
4468B6j41P9m2O0j15N3J31q5N1N5L9q9N2l51L68j94J06K00k95K76m41J44L62m37
4492a88O3j3K02L0j88r2J67k6J21q4k63L30j24K11q1j83q7J41N8l15K26J0K90
4515B05m49J81Q5rj84J67k15K02j01j6R9K6j17K79k03J40j99Q6Jj51K70r5n0Q3
4539C5m5J23J2N3l21O6R4L1Qpmj5L5K7L0l22L49j41J74l37L6L0n1J66K11k63j05
4566a31k3K2K43k50K74j62K88n72J01mM72j64j59L28n18K10M60n56k51M96J05
4587B09k35m6j61J02o9L67j0j64m0N4kj56J09Q2J15j17j5n9m2p6K30l83J97K64
4611A54kk41k22O39k83p6o7N6p4j04L65m12M22r8P9k29n9rq2L89l93K13K8k84
4635b90M61J52m12J41K7L2j41J6q1L1J26j07k0K26j00j62J55k58j7Q9N6L1q2k8
$$ plain form
4659 -155 10 -83 129 -136 -259 211 -49 -73 149 38 113 -196 -22 11 -35 -162 179 -28 -80 143 -2 -333
4681 -333 293 84 -295 19 36 -105 102 119 8 202 117 -155 -68 2 209 -115 -203 -74 -143 114 256 -38
4703 -38 -134 87 297 -90 -27 58 10 -195 25 43 -61 54 8 -99 14 -71 197 -7 86 245 159 49 64 113
4727 113 188 24 332 101 -39 -8 272 -93 143 156 -239 134 23 -28 -75 234 -3 -54 -107 -210 -59 -144 -81
4750 -81 171 40 -87 63 -64 165 -23 -13 -90 -118 77 -83 59 108 -242 -56 -23 -27 -34 44 -204 55 66 134
4774 134 29 25 60 169 190 -148 -152 14 -102 16 239 301 -220 -94 156 -38 -135 145 9 -85 215 5 51
4797 51 86 -45 -132 209 42 -266 1 169 109 -140 95 209 16 -72 91 43 91 -69 -71 108 -58 291 292 57
4821 57 68 -35 75 -114 38 -267 447 -94 48 208 172 37 -38 -8 3 -115 -246 -104 40 91 -176 -52
$$ packed form
4659a55J65r3K12k65j23M70k60k4K22j11P5l09J74L3m6j27L41k07n2K23j45l31
4681c33O26k09l79L14J7j41K07J7j11J94q5k72Q7P0K07l24q8J29o9K57J42k94
4703c8r6K21K10l87O3Q5m8k05K20J8j04J15m6j07J13q5K68k04R3J59q6j10J5M9
4727A13P5j64L08k31j40L1K80l65K36J3l95L73j11n1m7L09k37n1n3j03J51q5O3
4750h1K52j31j27J50j27K29j88J0p7k8J95j60J42M9l50J86L3mpP8k48K59J1O8
4774A34j05mL5J09K1l38mJ66j16J18K23O2n21J26K50j94r7K80j36r4L00k10M6
4797E1L5j31q7L41j67l08K67J68o0k49K35J14j93q8J63m8M8j60kJ79j66L49Jk35
4821E7J1j03J10j89J52l05P14n41J42J60l6j35p5L0J1j18j31J42J44N1k67J24
$$ plain form
4843 -52 -194 -70 -329 117 7 -21 152 109 183 150 123 -160 -104 78 -10 36 41 -270 -49 -21 -213 -222 111 196 129
4868 129 181 -229 -176 79 -52 -185 -95 -41 128 69 -329 -59 -235 -48 231 316 78 190 106 73 205 57 125
4891 125 -32 -129 -72 -75 -31 130 -34 52 -9 186 -232 -201 -242 -226 -50 -60 -201 219 -204 -9 115 -23 -169 -26
4915 -26 154 20 82 -286 90 -356 -66 15 326 -143 -108 73 178 335 132 213 -250 31 -3 149 -48 -54 -54
4938 -54 82 -158 330 112 64 -16 -240 20 -52 144 68 -137 -169 200 266 113 -18 64 4 -65 -61 188 -98 58
4962 58 55 173 -124 107 282 -229 -121 33 -119 226 -144 -13 106 21 -25 -139 161 -119 -40 316 -1 36
4984 36 41 55 -69 -326 -7 -270 14 -201 -156 -11 72 -83 -163 -206 9 -40 24 -114 11 135 326 -72 -75 143
5008 143 -169 -37 -143 49 -282 -18 -25 -229 -123 -39 -160 -144 198 192 119 -225 302 -115 -12 45 -26 -84 98
$$ packed form
4843e2j42J24k59M46j10k8J73m3P4l3k7k83N6J82q8M6Nl11K21K8j92rL33Q5o7
4868A29N2m10N3K55j31j33R0N4J69n9l98K70j76J87K79Q5k38J12q4l3J32j48O8
4891A25j57r7N7lM4J61j64Q6o1J95m18L1m1J6J76j0j41M20m23J95J24j38j46J43
4915b6J80j34O2l68L76m46K90Q1L11m69L5J81J05J57k03Q1m63K81l4J52j97o%
4938e4J36k40M88k18m8q0k24K60p2J96p6k05l2L69O6j53j31Q2o0o9MK49k86J56
4962E8lJ18k97K31J75n11J08J54j52L45l70J31J19q5m6j14L00k80P9L56l17L7
4984C6NJ4j24k57L19k63K84k15M5J45Q3j55q0m3K15m9O4j38J25J24J91l98lK18
5008A43l12J32j06J92l31K64pk04J06Q4j21J6L42op3l44N27m17J03N7p1n8J82
$$ plain form
5031 98 -68 235 -75 109 75 -330 88 -79 147 -149 -23 -186 260 -10 173 -303 7 -59 57 -66 -208
5052 -208 -155 52 -86 290 -65 -10 -6 161 15 -286 -93 -81 -348 -154 131 159 -23 229 -175 111 -21 122
5074 122 256 -12 168 -189 47 -100 -198 -130 216 232 -108 53 24 93 -46 -73 -59 88 -163 -206 -117 134 236
5097 236 -27 -2 4 -32 -246 284 -124 161 39 -40 -117 308 11 -106 73 -1 47 93 -111 -165 42 238 148 -39
5121 -39 -251 -61 -303 -109 -126 -77 -180 -120 193 106 -36 -4 422 -86 -12 55 -21 -55 -130 189 -142 56 7 -23
5145 -23 7 -1 -103 -183 -126 -228 -13 130 -157 84 -85 27 -25 -46 24 -61 -28 16 15 -59 -160 158 76 -132 -73 16
5171 16 224 -18 -37 -128 155 -121 -175 -179 27 -200 -151 -89 -137 177 226 -43 105 -272 64 -56 134 130 343 -77
5195 -77 -384 -62 139 -178 27 -111 86 -61 42 8 51 313 -156 -24 87 -85 -212 49 33 101 92 47 411
$$ packed form
5031I8j66L03l10J84l4m05M18j67K26k96J26j63M46k70J83m76L10o6J16j23j42
5052b08N3K07j38L76l55N5MJ67j46l01J93J2k67J94K85K8j82K52m04K86j32J43
5074A22J34k68J80l57K36j47r8O8L46J6l40J61k9O9j39k7J4J47k51m3Q9K51J02
5097B36k63K5Ol6k14N30m08K85j22p9p7M25k97j17J79p4M8M6k04n4K07J96r0j87
5121c9k12J90k42J94j7M9j03O0L13q7j42L2M26n08P4O7p6l4p5L19l31J98m9l0
5145b3L0qj02q0N7j02K15J43k87K41j69J12n2k1P0q5L3M4jp4j01L18q2k08N9Q9
5171A6K08k42j9r1K83k76n4mK06k27M9O2m8L14M9k69J48l77L36j20J90mK13m20
5195g7l07L22K01l17K05j38J97j47J03l4M3K62m69J32J11j72j27K61j6O8rm5L64
$$ plain form
5218 411 -337 144 163 18 -184 35 142 -72 -66 -67 -295 60 -31 -109 -122 107 -14 -66 30 -57 239 -189 -134 -243
5242 -243 -85 -207 166 166 -112 329 -6 -229 293 -9 26 -91 94 59 -17 -203 101 -21 96 265 -56 231
5264 231 180 42 -183 -53 371 64 148 -221 181 -61 1 -124 -231 54 -81 -153 -123 0 23 -81 64 -269
5286 -269 139 30 90 -21 -92 42 -71 -83 -99 20 214 -143 -258 -36 -234 -29 -52 -124 -80 -234 70 -89
5308 -89 177 -94 -49 -108 -12 122 -257 85 -45 9 31 -263 -262 -157 -248 115 11 -89 2 78 37 10 0 135 -143
5333 -143 -9 -21 -139 -8 20 -80 -42 -218 157 -127 -143 -537 -282 183 -280 76 -19 -71 -46 -152 32 72 73
5356 73 -271 23 268 -19 -63 -21 -19 163 -44 -15 -139 103 129 -29 -190 -168 -75 -159 -270 -116 10 -119 70
5379 70 -112 -212 -15 110 20 -253 -72 43 247 -158 -172 229 20 -9 -192 -134 101 55 180 235 -122 37
$$ packed form
5218D11p48M81J9j45k02K19J07k14Ojk28L55r1p8j3K29j21n2R6q7K96m28N5j09
5242b43J58j22L73%k78M41l35k23N22l02L5j17J85l5p6j86L04j22J17J69l21K87
5264B31n1j38k25J30M24l07Q4l69M02k42O2j25j07K85j35p2L0J23K3j04J45l33
5286b69M08j09O0j11p1J34j13j2j6J19J94l57j15K22j98K05k3p2M4j54L04j59
5308h9K66k71M5n9R6J34l79L42j30N4K2k94JJ05r1L63j04j00R1P6m1k7j0J35k78
5333a43J34j2j18J31K8j00L8j76L75k84j6l94K55M65m63L56r5n2K5j06J84M0J
5356G3l44K94K45k87m4M2KJ82k07K9j24K42K6j58j61K2R3q4j11J54J26j29J89
5379G0j82j00J97J25r0k73J81J15K04m05j4M01k09k9j83N8K35m6J25N5l57J59
$$ plain form
5401 37 -113 96 -71 12 -111 -106 99 145 -127 113 51 -110 -17 144 -1 17 -190 -149 350 -190 110 -4 55
5424 55 56 51 -146 181 -149 -154 84 -179 -57 150 248 20 -138 109 -225 -29 -22 -59 25 -1 -116 98 -162 12
5448 12 -34 18 53 -100 365 -19 237 1 70 66 247 -140 144 -30 8 -44 280 -93 2 -65 36 107 -201 21
5472 21 155 -79 37 -173 -19 -111 46 179 77 34 -106 24 84 19 15 -38 54 285 26 -112 -244 212 -74
5495 -74 247 -119 132 -207 30 342 86 -155 28 141 112 71 -40 170 56 135 -152 -44 -98 -27 343 -142
5517 -142 -139 203 317 281 4 87 35 23 292 -25 -4 -98 -140 -76 18 -21 39 -163 95 -56 -55 80 -21 -45 -44 68
5543 68 -185 148 -142 -119 -143 -30 149 14 -96 -34 218 -17 45 -124 -140 -244 145 0 -30 91 -155 -63 269
5566 269 95 -102 157 101 -86 13 64 330 2 -138 -129 -120 -44 -22 -119 -132 -14 -43 426 -190 136 -36 -184 31
$$ packed form
5401C7j50K09j67Q3j23NK05M6k72K40o2j61R3J61j45J8k07M1M99n40L00j14N9
5424E5Jnj97L27l30nK38k63J22K07R8k28j58K47l34J96Pl7Q4k6j15K14k60J74
5448A2m6N2L5j53M65l84K56k36O9mJ81l87K84j74L8n2L24l73R5o7J01P1l08K22
5472B1J34k34J16k10J54r2J57J33j02m3j40J30O0o5mn3R2K31k59j38j32M56k86
5495g4L21l66K51l39K37L12k56k41J83J13k9m1j11K10j14P9k87J08n4P1L70m85
5517a42LL42J14l6k77Q3n2j2K69l17K1r4m2O4R4l9O0k02K58j51JJ35j01k4JJ12
5543F8k53L33k90K3k4J13J79j35j10O2K52k35O2j69j6j04L89j45l0J21k46R2L32
5566B69j74j97K59n6j87R9N1K66l28j40RRP6K2r7j3J18k9M69o16L26j72j48K15
$$ plain form
5590 31 46 -56 -314 -22 -235 -162 -182 -101 -57 153 94 123 -43 87 192 104 -40 165 112 -57 -211 245 -50
5613 -50 -120 48 224 152 17 -109 -91 -76 47 -140 -16 -213 226 -243 100 -5 232 -24 -143 45 64 7
5635 7 -56 -104 -36 -203 512 111 -235 -187 -88 110 262 -323 -180 186 -17 -25 -22 175 131 147 -129 -263 -144 212
5659 212 -64 89 -179 299 -40 171 -124 102 -78 -7 21 90 -1 5 -279 15 95 243 53 71 -58 -240 316
5682 316 -121 -105 -160 54 -6 119 -167 152 -18 -109 -119 92 214 151 -201 55 237 20 337 -323 73 -53
5704 -53 -193 -141 -95 136 -105 -169 199 66 365 237 -34 41 200 222 -77 29 127 47 -145 -82 67 -34 187
5727 187 3 115 53 23 -269 230 -95 68 -87 83 40 -120 -232 -24 191 -72 -284 251 210 -140 -275
5748 -275 -131 342 -268 104 -27 -51 -241 -146 93 -146 -88 108 -189 43 -111 29 -79 -87 -304 167 80 83 -82
$$ packed form
5590C1J5j02k58K92k13P3k0Q1M4K10n9K9j66J30J05q8j44K05n3j69j54M56k95
5613e0p0J68J76p2j35j26J8J5J23j87J24j97M39m69L43j05K37k56j19J88J9n7
5635Go3m8O8j67P15m01l46M8R9J98J52n85J43L66k03qLJ97m4J6k76j34J19L56
5659B12k76J53k68M78l39K11k95K26j80P1K8O9r1Ok84K94Q0J48j90J8j29j82N56
5682C16m37J6n5K14o0J25k86L19j70r1j0K11J22o3l52K56J82k17L17o60L96j26
5704e3j40N2M6K31k41o4L68j33K99j28k71P5J59K2k99J06R8q0j92O3J49j01K21
5727A87j84J12o2l0k92M99l25J63j55J70m3j60j12K08K15k63k12N35m1l50j35
5748b75J44M73o10L72j31k4j90R5K39k39N8J96k97K32j54J40j08qk17M71q7Lj65
$$ plain form
5771 -82 8 -309 -286 83 57 51 -15 -117 -128 -127 12 -56 10 178 241 17 22 -68 91 42 3 91 117 -195 -194 89 52 -48
5799 -48 -190 -61 -148 43 -316 215 -262 84 -89 -359 -330 -115 104 132 122 80 51 7 -102 -29 42 -21 -97 -115
5823 -115 178 -208 -57 185 208 117 -4 148 -34 322 221 29 -81 -126 -176 203 -162 68 3 71 -161 -40
5845 -40 -157 -53 -140 -16 -298 -63 -98 122 167 -40 112 -51 -45 -175 -16 41 -115 24 -12 -40 2 -30 -356 163
5869 163 -52 461 -106 29 -31 51 2 -17 160 262 -260 149 -80 3 277 130 58 71 209 375 -116 179
5891 179 196 -105 -216 -301 131 161 -211 -13 95 158 -231 -226 -12 47 5 149 85 -212 -65 200 40 -56 313
5914 313 -112 -139 -206 161 -16 242 -96 124 -107 19 -146 -47 -27 250 380 -260 -143 401 -164 -7 -150
5935 -150 72 208 76 -48 170 7 3 190 95 8 131 -96 -130 63 -100 95 -93 -170 -159 61 62 24 -150
$$ packed form
5771h2R0l17K3L69k6oo6j02j1JJ39o8O6J68O3k24Nr0J59m9l9Q8K6l12JK83l7j00
5799d8j42J29q7J91l59N31m77L46j73k70K9K15K19K8j0m2k9m4j09P3P1o3p6j8
5823a15K93l86J51K42K3r1j21J52j82L56j01j92j10m5n0L79l65K30o5O8k32J21
5845d0j17J04q7J24k82K35l5K20M5k07J52j63Oj30J59N7j56J39l6k8M2l2l26N19
5869A63k15N13n67J35o0Q2m9j9J77J02n22M09k29Q3K74j47p2J3J38J66m91K95
5891A79J7l01j11q5M32L0l72J98J08O3l89NK14N9m2J44o4k97J47K65j60r6L69
5914C13m25k7o7L67j77K58l38K20k31J26j65R9K0K77J30o40J17N44n65J57j43
5935a50K22J36j32j24K18j63mJ87r5q7J23k27l4J93j63J95j88p7J1K20Jl8j74
$$ plain form
5958 -150 -55 36 -5 -145 204 50 -215 -96 127 -80 35 52 197 261 -166 -167 36 -5 -155 -215 -146 -85 -187 -117
5982 -117 -121 -152 211 -743 -603 221 180 194 47 -93 -49 18 130 25 259 116 6 -99 -64 -276 -20 -85 -60
6005 -60 -157 -169 -166 -25 3 -60 203 333 -102 -1 -116 -66 -18 187 48 49 99 -207 70 -84 100 -111 -213 -220 192
6030 192 -181 182 -325 153 99 -270 -41 -49 174 -184 -240 -44 -1 -188 288 90 98 28 -207 -96 1 -83 201
6053 201 -333 100 -33 -337 22 -40 -46 -60 61 -66 -147 26 -46 16 -27 -137 -59 -88 126 134 -34 -39 -6 25 -139
6078 -139 -83 180 -209 -25 -84 9 49 32 125 41 -132 221 -48 184 78 -124 16 188 179 6 106 97 32 73
6102 73 53 -295 -2 277 92 -146 -95 -85 62 -116 -80 -97 19 -158 -212 220 23 221 213 -16 106 179 216 -242
6126 -242 -40 -144 -126 79 36 38 426 765 -374 204 -343 306 395 87 24 49 42 144 -28 74 -329 -34 -91
$$ packed form
5958a50R5R1m1j40L49j54k65J19K23k07J15J7J45O4m27jK03m1j50o0O9O1j02P0
5982a17ml1L63r54J40Q24m1J4j47j40M4O7J12j05K34j43j10j05L5k12K56o5K5
6005f0r7j2LJ41K8o3K63J30m35J01j15N0M8K05j39JN0l06K77j54J84k11j02pM12
6030A92l73L63n07M78n4l69K29qK23l58n6J96M3j87M76j98Qp0k35J11R7q4K84
6053B01n34M33j33l04L59o2oj4J21j27q1J73p2O2m3j10P8k9K14Qj68nL3L1j64
6078a39N6K63l89J84n9R3M0j7R3q4j73L53k69K32j06k02J40J72rj73J00ro5M1
6102G3k0l48K93K79j85k38N1J0J47j78L6j7J16j77n4M32j97J98qk29J22P3L7m58
6126b42K02j04J8K05m3KL88L39j139N78n47O49Q9l08o3K5pJ02j72J02m03K95n7
$$ plain form
6149 -91 315 -151 146 94 -30 -84 54 -164 -96 78 56 295 -58 -57 -311 353 -69 -42 -189 -192 5 172 -17
6172 -17 13 -100 -269 -136 165 -26 119 -16 195 -34 -149 58 -123 -5 -69 97 135 80 125 -77 53 105
6194 105 9 -25 -92 14 152 -205 7 -87 -75 -78 -62 177 419 -2 -5 177 -37 186 -64 174 114 162 12 -44
6218 -44 52 -109 18 34 90 -16 -155 -187 -105 -189 69 -61 16 61 -117 75 -18 -240 15 34 -111 -136 -147 -68 -306
6243 -306 -34 -30 81 -350 -109 -181 35 21 184 -19 128 -232 -80 -137 -105 -47 258 235 49 142 62 -122 -95 -141
6267 -141 -107 -247 203 -83 -4 45 141 -204 104 -94 62 -39 -37 293 -15 -24 -102 -26 -216 56 -113 101 185 143
6291 143 -244 -9 -171 -297 -161 -149 -61 96 -74 44 -103 -141 53 101 59 -41 -69 -104 334 134 -112 -29 -111
6314 -111 -94 -45 -103 -178 -40 294 -216 -88 -109 239 27 40 130 -52 -87 56 -187 -129 105 -100 -118 3 62 -158
$$ packed form
6149i1M06m66K97n2j24n4J38k18O8J74k2K39l53Jk54O64m22K7j47lJ97J67j89
6172a7L0j13j69J33L01j91J45j35K11k29j15K07j81J18o4J66L8n5M5k02J30N2
6194A05r6l4o7J06J38l57K12r4J2lJ6K39K42m21lJ82k14K23k50K38o0M8j50n6
6218d4R6j61J27J6N6j06j39l2Q2q4K58j30P7M5j78J92r3k22K55J9j45k5j1P9k38
6243c06K72MJ11m31K41p2K16j4J63k03J47l60J52n7L2N8L05k3j86R3q0j84K7m6
6267a41L4j40M50k86P9M9R6l45L08j98J56j01KL30l08rp8P6j90K72j69K14Q4m2
6291A43l87K35j62j26J36J2Q8J57j70J18j47l8J94M8m2j00k8l5M38k00k46Q3q2
6314a11J7M9n8p5J38L34n10J28k1L48k12J3R0j82l5J43k43N8K34k05j8J21N9k20
$$ plain form
6338 -158 -127 128 97 -35 -72 -112 -182 -125 113 -41 333 96 -143 -110 71 -31 -70 5 161 -66 -96 50 123 -171
6362 -171 -51 45 64 -235 -119 205 28 3 -132 -169 -165 -98 -129 -77 102 29 129 37 -131 62 73 -8 2 -302 88
6387 88 72 -133 22 85 -3 125 -31 -129 82 92 -78 -24 126 -77 297 6 143 10 126 -285 -101 71
6409 71 151 -97 405 87 44 125 -296 -109 139 -219 -62 67 4 31 46 181 119 182 -39 187 13 161 -58
6432 -58 -19 121 -33 49 -12 56 30 -333 -1 -47 17 -316 1 -63 48 87 157 44 -105 21 103 98 -26 125 74
6457 74 10 31 81 -212 216 -69 11 -62 141 66 -209 105 229 -128 117 -116 196 117 -45 -50 64 100 -21 -131
$$ packed form
6338a58L1K55l1j32l7m0p0N7K38j54L74k37k39L3J81j02l9P5J56k27l0J46P3k94
6362a71J20R6J9k99J16L24j77k5j35l7MO7l1N2J79p3J00r2j68J93J1q1J0l04L90
6387H8j6k05J55O3q8J28j56r8K11J0j70N4J50k03L74k91J37j33J16m11J84J72
6409G1Q0k48N02l18m3Q1m21J87K48l58J57J29o3K7J5J35o2O3k21K26j74J48k19
6432e8L9J40j54Q2o1O8k6l63L32m6O4l33L17o4J11L9P0j13j49J26Q2nj24J51n1
6457G4o4K1N0k93M28k85Q0p3K03p5k75L14J24l57K45k33L12p9j62nJ14L6j21j10
$$ [...]
8191a71
##END NTUPLES=NMR FID
##END=
