##TITLE=1H_DE-162k_TFA
 200.13Hz, DMSO-d6+CCl4.
 8 sc
 15.7.2026
##JCAMPDX= 6.0         $$ Bruker NMR JCAMP-DX V2.0
##DATA TYPE= NMR FID
##DATA CLASS= NTUPLES
##ORIGIN= UXNMR, Bruker Analytische Messtechnik GmbH
##OWNER= pz
$$ XWIN-NMR		Version 3.5
$$ Wed Jul 15 13:27:41 2026 Russian Standard Time (UT+4h)  she@DPX200
##.OBSERVE FREQUENCY= 200.1313
##.OBSERVE NUCLEUS= ^1H
##.DELAY= (6, 6)
##.ACQUISITION MODE= SIMULTANEOUS
##.ACQUISITION SCHEME= undefined
##.AVERAGES= 8
##.DIGITISER RES= 18
##SPECTROMETER/DATA SYSTEM= spect
##.PULSE SEQUENCE= zg30
##.SOLVENT NAME= DMSO
##.SHIFT REFERENCE= (INTERNAL, DMSO, 0, 14.3821)
##AUDIT TRAIL= $$ (NUMBER, WHEN, WHO, WHERE, WHAT)
$$ ##TITLE= Audit trail, XWIN-NMR		Version 3.5
$$ ##JCAMPDX= 5.01
$$ ##ORIGIN= Bruker BioSpin GmbH
$$ ##OWNER= she
$$ F:/spectra/data/she/nmr/H-C/1/audita.txt
$$ ##AUDIT TRAIL=  $$ (NUMBER, WHEN, WHO, WHERE, WHAT)
(   1,<2026-07-15 13:26:38.76 +0400>,<she>,<DPX200>,
      <created by zg, POWCHK disabled, PULCHK disabled
       configuration hash MD5:
       00 E9 B6 7A A2 85 ED C7 34 08 36 98 17 FE 4E 26
       data hash MD5: 16K
       1E 63 E0 B9 8B 0C 6E AE CC 7B 49 31 18 DF 49 FF>)
$$ ##END=
$$ 
$$ hash MD5
$$ B1 8A EB EB 67 F8 BF 08 CD D0 72 F3 20 0F E2 EB
##$RELAX= 
##$RELAX= 
##$RELAX= 
##$RELAX= 
##$RELAX= 
##$RELAX= 
$$ Bruker specific parameters
$$ --------------------------
##$DU= <F:/spectra>
##$EXPNO= 1
##$NAME= <H-C>
##$PROCNO= 1
##$TYPE= <nmr>
##$USER= <she>
##$AMP= (0..31)
100 100 100 100 100 100 100 100 100 100 100 100 100 100 100 100 100 100 
100 100 100 100 100 100 100 100 100 100 100 100 100 100 
##$AQSEQ= 0
##$AQ_mod= 1
##$AUNM= <au_zg>
##$AUTOPOS= <>
##$BF1= 200.13
##$BF2= 200.13
##$BF3= 200.13
##$BF4= 200.13
##$BF5= 200.13
##$BF6= 200.13
##$BF7= 200.13
##$BF8= 200.13
##$BYTORDA= 1
##$CFDGTYP= 0
##$CFRGTYP= 5
##$CHEMSTR= <none>
##$CNST= (0..31)
1 1 145 1 1 1 1 1 1 1 1 1 1 1 1 1 1 1 1 1 1 1 1 1 1 1 1 1 1 1 1 1 
##$CPDPRG= <>
##$CPDPRG1= <>
##$CPDPRG2= <>
##$CPDPRG3= <>
##$CPDPRG4= <mlev>
##$CPDPRG5= <mlev>
##$CPDPRG6= <mlev>
##$CPDPRG7= <mlev>
##$CPDPRG8= <mlev>
##$CPDPRGB= <>
##$CPDPRGT= <>
##$D= (0..31)
0 0.7 0 0 0 0 0 0 0 0 0 0.03 0 0 0 0 0 0 0 0 0 0 0 0 0 0 0 0 0 0 0 0 
##$DATE= 1784107598
##$DBL= (0..7)
120 120 120 120 120 120 120 120 
##$DBP= (0..7)
150 150 150 150 150 150 150 150 
##$DBP07= 0
##$DBPNAM0= <>
##$DBPNAM1= <>
##$DBPNAM2= <>
##$DBPNAM3= <>
##$DBPNAM4= <>
##$DBPNAM5= <>
##$DBPNAM6= <>
##$DBPNAM7= <>
##$DBPOAL= (0..7)
0.5 0.5 0.5 0.5 0.5 0.5 0.5 0.5 
##$DBPOFFS= (0..7)
0 0 0 0 0 0 0 0 
##$DE= 6
##$DECBNUC= <off>
##$DECIM= 32
##$DECNUC= <off>
##$DECSTAT= 4
##$DIGMOD= 1
##$DIGTYP= 9
##$DL= (0..7)
0 120 120 120 120 120 120 120 
##$DP= (0..7)
150 150 150 150 150 150 150 150 
##$DP07= 0
##$DPNAME0= <>
##$DPNAME1= <>
##$DPNAME2= <>
##$DPNAME3= <>
##$DPNAME4= <>
##$DPNAME5= <>
##$DPNAME6= <>
##$DPNAME7= <>
##$DPOAL= (0..7)
0.5 0.5 0.5 0.5 0.5 0.5 0.5 0.5 
##$DPOFFS= (0..7)
0 0 0 0 0 0 0 0 
##$DQDMODE= 0
##$DR= 18
##$DS= 0
##$DSLIST= <SSSSSSSSSSSSSSS>
$$ [...]
##$SUBNAM0= <"">
##$SUBNAM1= <"">
##$SUBNAM2= <"">
##$SUBNAM3= <"">
##$SUBNAM4= <"">
##$SUBNAM5= <"">
##$SUBNAM6= <"">
##$SUBNAM7= <"">
##$SUBNAM8= <"">
##$SUBNAM9= <"">
##$SW= 18.0517328524113
##$SWIBOX= (0..15)
0 0 2 0 0 0 0 0 0 0 0 0 0 0 0 0 
##$SW_h= 3612.71676300578
##$TD= 16384
##$TD0= 1
##$TE= 0
##$TE2= 300
##$TE3= 300
##$TEG= 300
##$TL= (0..7)
0 120 120 120 120 120 120 120 
##$TP= (0..7)
150 150 150 150 150 150 150 150 
##$TP07= 0
##$TPNAME0= <>
##$TPNAME1= <>
##$TPNAME2= <>
##$TPNAME3= <>
##$TPNAME4= <>
##$TPNAME5= <>
##$TPNAME6= <>
##$TPNAME7= <>
##$TPOAL= (0..7)
0.5 0.5 0.5 0.5 0.5 0.5 0.5 0.5 
##$TPOFFS= (0..7)
0 0 0 0 0 0 0 0 
##$TUNHIN= 0
##$TUNHOUT= 0
##$TUNXOUT= 0
##$USERA1= <user>
##$USERA2= <user>
##$USERA3= <user>
##$USERA4= <user>
##$USERA5= <user>
##$V9= 5
##$VALIST= <valist>
##$VCLIST= <CCCCCCCCCCCCCCC>
##$VD= 0
##$VDLIST= <DDDDDDDDDDDDDDD>
##$VPLIST= <PPPPPPPPPPPPPPP>
##$VTLIST= <TTTTTTTTTTTTTTT>
##$WBST= 1024
##$WBSW= 4
##$XGAIN= (0..3)
0 0 0 0 
##$XL= 0
##$YL= 0
##$YMAX_a= 261058
##$YMIN_a= -252442
##$ZGOPTNS= <>
##$ZL1= 120
##$ZL2= 120
##$ZL3= 120
##$ZL4= 120
##$ABSF1= 10
##$ABSF2= 0
##$ABSG= 5
##$ABSL= 3
##$ALPHA= 0
##$AQORDER= 0
##$ASSFAC= 0
##$ASSFACI= 0
##$ASSFACX= 0
##$ASSWID= 0
##$AUNMP= <proc_1d>
##$AZFE= 0.1
##$AZFW= 0.1
##$BCFW= 1
##$BC_mod= 2
##$BYTORDP= 1
##$COROFFS= 0
##$CY= -3
##$DATMOD= 1
##$DC= 2
##$DFILT= <>
##$DTYPP= 0
##$F1P= 0
##$F2P= 0
##$FCOR= 0.5
##$FTSIZE= 0
##$FT_mod= 4
##$GAMMA= 1
##$GB= 0.15
##$INTBC= 1
##$INTSCL= 1
##$ISEN= 128
##$LB= 0.25
##$LEV0= 0
##$LPBIN= 0
##$MAXI= 10000
##$MC2= 0
##$MEAN= 0
##$ME_mod= 0
##$MI= 1.114404
##$NCOEF= 0
##$NC_proc= 0
##$NLEV= 6
##$NOISF1= 3.799351
##$NOISF2= 2.8
##$NSP= 1
##$NTH_PI= 0
##$NZP= 0
##$OFFSET= 14.38212
##$PC= 1
##$PHC0= -4222.171
##$PHC1= 13.9923
##$PH_mod= 1
##$PKNL= yes
##$PPARMOD= 0
##$PSCAL= 0
##$PSIGN= 0
##$REVERSE= no
##$SF= 200.129724274929
##$SI= 16384
##$SIGF1= 3
##$SIGF2= 2
##$SINO= 400
##$SIOLD= 16384
##$SREGLST= <1H.CDCl3>
##$SSB= 0
##$STSI= 0
##$STSR= 0
##$SW_p= 3205.1282051282
##$SYMM= 0
##$S_DEV= 0
##$TDeff= 0
##$TDoff= 0
##$TI= <>
##$TILT= no
##$TM1= 0
##$TM2= 0
##$TOPLEV= 0
##$USERP1= <user>
##$USERP2= <user>
##$USERP3= <user>
##$USERP4= <user>
##$USERP5= <user>
##$WDW= 1
##$XDIM= 8192
##$YMAX_p= 0
##$YMIN_p= 0
$$ End of Bruker specific parameters
$$ ---------------------------------
##NTUPLES= NMR FID
##VAR_NAME=  TIME,          FID/REAL,        FID/IMAG
##SYMBOL=    X,             R,               I
##VAR_TYPE=  INDEPENDENT,   DEPENDENT,       DEPENDENT
##VAR_FORM=  AFFN,          ASDF,            ASDF
##VAR_DIM=   8192,          8192,            8192
##UNITS=     SECONDS,       ARBITRARY UNITS, ARBITRARY UNITS
##FACTOR=    0.0002768,     1,               1
##FIRST=     0,             0,               0
##LAST=      2.2672688,     0,               0
##MIN=       0,             -252442,         0
##MAX=       2.2672688,     261058,          0
$$ Real data points
##PAGE= N=1
##DATA TABLE= (X++(R..R)), XYDATA
0 0 0 0 0 0 0 0 0 0 0 0 0 0 0 0 0 -3 8 -8 8 -8 8 -16 16 -19 24 -25 32 -34 41 -47 53 -61 69 -79 89 -102 114
37 114 -126 142 -157 176 -198 216 -241 266 -295 326 -359 398 -437 482 -532 583 -644 711 -787
56 -787 873 -970 1084 -1217 1375 -1569 1809 -2120 2535 -3131 4059 -5717 9721 -43334 -64479
71 -64479 -168039 -252442 -74404 46811 69912 130991 164514 38576 -69144 -77980 -154350
82 -154350 -222664 -45110 147957 169675 205229 228246 78699 -75621 -124937 -175708 -210123
93 -210123 -91823 75375 97297 78833 126378 59843 -82789 -107020 -118484 -158747 -64353
104 -64353 80828 114220 118877 174151 145178 -13717 -100445 -82759 -120213 -109040 35059 104503
116 104503 78012 87726 51393 -69339 -142497 -127372 -103285 -68100 43845 134050 105951 93632
128 93632 101919 1778 -94513 -87288 -75869 -54948 24863 98627 108369 85406 58321 -27580
140 -27580 -141773 -149256 -99251 -76870 -1891 94052 109254 95613 75236 6122 -70696 -88882
152 -88882 -55353 -33463 -6376 73405 114074 78272 49484 -2294 -84413 -104633 -84960 -70549
164 -70549 -25023 47693 92958 73079 29654 3501 -45575 -82463 -52622 -20899 13565 83378
176 83378 107727 70784 32595 -9137 -56714 -90850 -83621 -39012 -2632 40016 79370 58335
188 58335 23865 2726 -52567 -89933 -70910 -35888 9786 60708 93646 91870 47906 4429
200 4429 -34376 -80979 -77154 -36579 -12864 25595 61536 52385 27852 -3352 -39668 -62513 -67689
213 -67689 -38057 4372 32774 66752 70552 33416 8449 -19081 -54311 -50561 -24887 4975
225 4975 34706 46931 46642 23386 -16564 -39934 -63076 -70136 -28582 10969 33800 59834 60499
238 60499 37955 6027 -32499 -48943 -45101 -27461 10169 32494 45380 60407 36627 -5751
250 -5751 -34139 -59141 -60131 -39184 -15478 20480 44789 48033 38267 3565 -23411 -26794 -36143
263 -36143 -27454 2596 22165 40725 44803 25437 4340 -23954 -42221 -39656 -35810 -11275 22328
276 22328 29265 30738 22185 -6116 -22832 -31671 -33361 -15825 4571 28971 47795 40433 29286
289 29286 8937 -26784 -39805 -38837 -32898 -6004 18223 32465 38095 20295 -252 -18120 -38177
302 -38177 -35215 -23467 -11357 20066 40506 40322 35085 13065 -7917 -20760 -35231 -28024 -7486
315 -7486 6893 24736 24499 10672 4360 -12483 -28115 -28122 -25142 -6012 16816 22029 27968 23679
329 23679 6136 -5977 -21893 -28887 -11964 1563 15309 26103 19527 13920 1102 -21972 -29696
342 -29696 -31560 -25255 -2246 10781 21721 33035 24470 9797 -7209 -25811 -23831 -16102 -6434
355 -6434 14443 22743 25085 26444 6808 -10644 -18069 -28019 -24030 -12623 -999 16582 20728 16921
369 16921 12908 -6044 -16138 -12453 -13861 -2506 12039 14484 19154 15960 4047 -4872 -17574
382 -17574 -19064 -11675 -11013 2862 17402 13379 12918 4687 -14593 -19645 -18118 -13176 -1778 6966
396 6966 20918 26179 14577 9196 -1712 -19712 -18026 -15732 -14874 2345 15837 19486 15305 2977
410 2977 -4171 -13308 -21557 -12808 -8515 -2715 16806 17585 9623 12270 5536 -6049 -10732 -12295 -5017
425 -5017 808 8347 17140 7138 -453 2261 -12631 -20281 -8081 -3950 993 10871 13591 11344
439 11344 2939 -1579 -5486 -17377 -11548 3595 3495 11891 20804 9033 1586 -1636 -11995 -18079
453 -18079 -15879 -5768 738 657 12181 16313 2580 2073 -2142 -18928 -15032 -2656 716 6928
467 6928 13880 16829 8626 -3166 -2541 -8272 -15400 -1686 1617 -5027 5976 10575 2426 -1165 -4512
482 -4512 -7216 -8675 -4622 5921 4880 6627 17546 6122 -6967 -1250 -4202 -10022 -3125 2435
496 2435 5644 7149 8584 6126 -8267 -12233 -5313 -13546 -11115 5302 6635 7734 13867 8357 715
511 715 -3149 -4290 -5985 -10762 -1829 7905 4212 9231 10998 -4061 -7238 -5008 -12782 -10935 -2016
526 -2016 4116 4058 876 5196 3858 -4073 1069 691 -7050 1613 6930 3227 7043 6618 306 -4247
542 -4247 -8181 -7592 -6526 -2394 8120 5628 429 4807 -1243 -7706 -2772 -4956 -4096 4251 7330
557 7330 7743 7394 7171 6924 -4577 -8885 -4393 -8794 -5366 3520 919 3167 6972 1260 -3240 -5263
573 -5263 -7181 -4323 -2254 4081 6677 2458 8543 6827 -5331 -2851 1477 -4108 -1614 1039 -658
588 -658 -325 663 1019 -3495 -8248 -2065 -3137 -7118 3991 8237 4082 6842 2790 -4453 -4067 -2028
604 -2028 972 856 2381 8272 3454 -1037 3325 -3613 -7903 -2517 -5407 -7335 -633 5037 6642
619 6642 3676 2990 3745 -4447 -4716 1742 -2889 -1086 8249 3995 889 2402 -224 -3108 -5667 -4263
635 -4263 -1670 -4436 1547 5082 -3368 -1868 3084 -3055 -3018 1948 976 1614 3071 5199 3104 -1752
651 -1752 1987 -235 -9690 -3978 1399 -2386 2683 5105 -282 -1905 -2467 -2842 -4410 -4186 3240 3160
667 3160 30 6602 6405 1066 4607 1070 -5076 -3157 -1326 -419 205 1163 4257 -257 -3557 909
683 909 -3652 -5149 2066 238 -1557 2978 3417 2674 1409 -642 482 -1431 61 4061 -347 -233
699 -233 3236 -2362 -4177 -2240 -4121 -2114 -1013 -1332 1461 1581 2848 3751 -2149 -2329 -172 -3047
715 -3047 -434 2640 1853 4728 2958 -65 -258 -3647 -2587 -1338 -5038 -2622 565 -33 3064 2250
731 2250 -117 1939 -732 -1373 946 -90 2836 3948 295 1528 738 -1572 1003 -1166 -3020 91
747 91 -793 37 780 -2004 289 -450 -3493 78 550 748 4565 2662 930 1452 -1002 181 -739 -4279
765 -4279 -860 -509 -839 1712 240 -607 1114 -3052 -3580 -1905 -2493 1019 2275 178 2786 2286 1497
782 1497 2203 -1265 -1150 432 -2390 -367 824 -1035 1688 64 -2780 -1137 -2139 -786 2045 -812
798 -812 362 1694 457 2013 713 -779 2323 518 -373 2189 527 1200 1915 -2278 -2275 -2365 -2901 -8
816 -8 -924 -684 1952 246 949 2033 -1301 110 685 -1368 5 779 1078 3416 553 -758 -349 -2882
834 -2882 -995 -893 -3623 -817 441 -1229 712 50 -109 2018 -451 -514 735 208 2512 2116 -541
851 -541 1143 -155 -1361 801 -1117 -930 1144 -796 -389 -147 -1461 729 -187 -1969 459 -361 1299
868 1299 3942 919 1036 1722 -630 164 -676 -1498 809 -570 -1204 562 -1026 -169 960 -2452 -2007
885 -2007 -974 -1598 734 693 315 2265 313 486 1531 -1187 292 1234 -1250 -302 -593 -1172 882
902 882 -575 -1809 -660 -1849 59 842 -1322 1109 1301 -945 367 427 -7 1878 853 449 1218
919 1218 117 1842 784 -1876 -420 -1271 -2469 159 -378 -524 1684 473 191 185 -649 1538 562
936 562 -698 765 -78 476 2852 252 -302 1180 -1238 -1041 -944 -1441 54 -738 -1207 120 -1352 2
954 2 1814 -813 -294 1095 -85 1425 968 -704 509 -468 -234 18 -1381 560 1270 -1661 -565
971 -565 -402 -1875 415 -444 -1918 -401 -64 977 1355 152 1942 1120 -1152 748 -357 -1232 1802
988 1802 386 -967 196 -478 265 262 -975 -74 -889 -1232 1047 -919 -606 2421 146 -584 922 -10
1006 -10 1015 893 286 449 -1117 -419 938 -2057 -1420 1079 -1465 -882 244 -776 203 427 -303 -281
1024 -281 -1171 360 1441 -691 763 1220 -656 1118 875 -1343 40 -28 -900 -857 -756 868 739 -889
1042 -889 658 75 -1431 1213 864 -786 701 506 18 879 -57 964 604 -820 430 -885 -1267
1059 -1267 1268 -206 -1030 99 -928 -390 355 -572 376 136 63 1046 -675 -278 1546 -453 -884 598
1077 598 -796 215 738 -700 -166 -1094 -791 141 -1408 -904 475 -743 -92 450 -168 1190 988 -291
1095 -291 94 -469 76 821 -181 317 605 -677 430 175 -1272 370 160 -629 -148 -688 -60 1121
1113 1121 -80 607 305 -352 1133 719 -210 795 314 -315 242 -839 -228 734 -423 22 -336 -153
1131 -153 841 254 -274 285 -1363 -480 1372 -113 261 1161 -44 768 -262 -303 435 -738 -989 -786
1149 -786 -1641 88 798 -232 445 -942 -424 405 811 -1034 989 -152 418 -231 -904 436 908 -842
1167 -842 497 688 -128 730 471 -815 -754 -103 -269 293 -583 803 149 245 895 -525 -152 1347 -219
1186 -219 -383 598 -332 349 327 46 315 -394 -34 264 -1045 -303 867 -467 -325 10 -327 586 205
1205 205 -174 295 -498 -44 169 -479 25 390 -708 273 -171 -864 613 33 -459 -50 -645 138 281
1224 281 -306 710 240 -370 606 53 -107 871 199 -60 83 -939 469 640 -363 56 -117 -258 627
1243 627 -141 -310 347 -360 -4 367 -470 701 639 79 469 -506 -278 493 -245 -318 -119 -606 59 231
1263 231 -507 398 -61 -324 439 -474 -285 847 -220 321 -157 -512 386 124 -146 478 -354 -38 416
1282 416 -659 -23 466 -588 -115 -420 -773 547 374 -26 415 -61 120 449 -288 359 611 -162 445
1301 445 31 -560 641 -276 -242 -39 -464 -315 158 -519 11 -274 -283 335 -298 -235 756 -111 101 257 -456
1322 -456 -178 266 10 249 -527 -583 363 -376 -261 236 -475 122 -72 -445 267 192 209 110 -68 -56 385 132
1344 132 95 206 -753 569 136 218 1403 349 185 344 -466 -269 483 -116 107 163 -323 474 340 44
1364 44 170 52 45 250 -244 -2 190 -335 148 -103 -719 64 52 -210 96 -218 110 255 18 129 -340
1385 -340 -326 230 -12 -432 304 -102 -247 17 -614 -65 269 60 -145 -533 -312 387 -179 -7 285 -29
1405 -29 173 238 -285 8 211 232 228 -262 -318 477 204 197 -19 -465 61 157 -605 234 49 -220 234 -220 -207
1428 -207 609 83 68 -26 -379 221 32 -340 197 40 -304 -121 -349 -94 211 -165 -175 1 -472 211 180
1449 180 33 491 -98 -293 387 -480 390 125 -132 163 -168 -363 455 -252 33 59 -671 -692 208 359 -542
1470 -542 390 -272 1020 83 -119 -464 -31 565 -259 -422 508 -343 245 939 -364 235 -287 121 312
1489 312 407 -32 903 23 -1114 -757 368 129 238 49 -932 395 -908 361 347 -175 -724 185 -671
1508 -671 -121 -156 -74 -98 59 -661 188 -323 -182 329 -198 224 -195 277 299 -98 -116 253 12 192 -275 -534
1530 -534 -70 571 -347 157 -497 -209 132 -244 -366 -76 -338 -216 2 -268 455 -205 321 96 -295 -442
1550 -442 38 95 -142 113 44 126 -79 -374 150 440 -344 198 -31 107 247 -112 117 173 -15 467 -116
1571 -116 -109 46 -5 -287 256 -38 55 202 233 60 3 33 178 -405 -11 262 163 69 5 -282 116 177 -221 10
1595 10 87 16 185 -220 -48 34 -146 -17 252 -164 412 316 281 147 -18 -165 -48 13 190 127 -428 418 -184
1618 -184 -311 -156 -28 -10 104 -192 63 260 81 192 133 -355 115 232 33 90 -264 -104 164 -325 -118
1639 -118 -40 -489 109 92 -215 167 67 -78 239 -135 -208 449 -62 95 364 88 108 -137 208 125 -174 139
1661 139 90 -270 -100 219 -139 97 -189 -112 262 -169 45 345 48 119 20 -311 -142 189 196 235 78 -75
1683 -75 -48 -437 218 -23 -61 -156 204 -62 12 80 48 113 -151 189 -54 -209 74 300 -273 44 -189 -282 -38
1706 -38 2 150 90 -81 -212 167 -108 133 162 62 6 -137 63 239 -71 224 158 -120 -140 155 234 42 313
1729 313 -60 -37 -202 -191 205 107 256 167 -172 -28 -37 -4 82 39 -8 -66 126 155 368 -218 -49 122 31 198
1753 198 333 -235 -213 -69 -41 212 -148 173 224 -135 104 85 -147 310 37 80 107 163 38 274 98 189 56
1776 56 -161 353 345 -70 351 -85 -177 210 -18 135 147 -41 -250 -75 -20 190 100 -96 -8 -349 107 64 42
1799 42 98 105 -116 279 70 5 -164 -126 -11 50 18 31 210 12 -31 155 -366 172 -31 110 249 -118 290
1822 290 135 -76 248 20 265 62 -96 4 -101 142 150 74 -34 24 -52 180 102 -99 74 166 53 -101
1844 -101 48 2 82 47 -125 182 163 -63 124 86 -106 -65 -83 74 136 1 -25 156 -103 185 -39 47 365
1867 365 -158 -63 -193 -255 69 193 -130 -46 85 393 -104 -62 -152 -272 42 153 -131 -124 17 80 -83 -190 -233
1890 -233 -37 236 30 -54 21 134 -158 217 148 -161 131 -191 71 148 269 14 269 -20 313 -170 120
1911 120 -2 13 204 -71 -245 -27 -85 157 -71 118 -122 110 32 150 251 15 -113 -12 107 -141 -67
1932 -67 113 -20 -409 -65 243 -106 378 16 134 179 -106 95 315 -89 -91 230 -225 90 69 -138 32 9
1954 9 -142 -24 -334 19 -44 -41 186 -14 -338 116 -176 187 263 51 31 -184 20 117 -90 42 48 102 174 266
1978 266 -129 -202 168 45 219 56 14 94 -14 -212 258 -31 -164 208 -324 -108 -102 29 -40 193 -147 68
2000 68 -158 -128 115 -13 -92 54 -252 64 -61 6 218 7 35 -124 195 -141 156 -279 -57 170 51 189
2022 189 -149 -170 -195 -66 25 -134 62 77 79 -138 -42 18 115 91 140 59 -110 -133 -2 40 -179 -27 151 182 -139
2047 -139 -79 -33 -150 264 -161 -235 -70 -58 247 117 -55 306 -28 42 -199 254 89 -130 34 290 -78 26
2069 26 377 -14 -91 -163 52 116 -88 25 -64 -188 -113 -88 -28 -201 266 -259 5 -311 -50 -54 227 -135 18
2092 18 -24 329 -51 -85 -38 183 246 264 -142 161 59 -309 127 -40 -141 49 -118 -183 172 -263 45 -48 -153
2115 -153 0 201 49 204 144 -79 109 -48 31 82 -53 -80 -6 -70 57 53 33 -104 149 -150 88 15 -68 -73
2139 -73 -272 -265 183 -62 45 -204 31 161 -101 -95 196 -37 231 31 -155 110 -162 -83 114 169 67 254
2161 254 20 78 -174 -144 -51 -123 12 6 204 -26 239 -286 -127 -80 24 -228 117 -97 142 -42 -11 -169 57
2184 57 88 -174 -80 -74 207 -5 -90 69 -73 153 162 130 -93 -33 -110 -158 63 -1 -112 -120 -26 74 -96 131 187 28
2210 28 121 -469 -94 39 -103 76 39 225 366 32 -183 327 93 224 63 -139 184 213 26 -13 -91 12
2232 12 66 228 -318 267 101 -99 -39 -180 311 -106 -160 -16 -155 -53 -43 235 129 -17 -49 -295 215 -355
2254 -355 262 109 -134 -310 16 -54 128 -62 -102 79 46 -156 -122 33 257 137 -75 186 37 13 -176 -194
2276 -194 -104 -113 -219 83 -129 0 132 -106 85 136 -220 84 106 43 -55 150 -256 76 -48 -197 97 -184
2298 -184 283 165 -206 55 121 -85 -214 -27 -116 201 -169 40 -72 -53 93 -163 -27 -86 -126 119 172 -136
2320 -136 193 53 57 506 261 28 197 -13 -170 -104 163 -138 215 -69 251 115 54 -169 -118 11 -91 -253
2342 -253 -26 109 30 26 37 24 83 204 -149 -125 8 30 -1 -25 312 186 -389 -47 -28 -118 -44 -110 -78 136 120
2367 120 169 73 72 54 -151 -59 288 135 -86 -35 44 -134 1 -287 217 77 -85 -143 -107 -67 -21 -214 76 117
2391 117 32 104 -33 -39 123 303 -102 -58 141 123 -82 -23 -82 140 150 -50 -169 -107 103 -86 -245 46 175
2414 175 54 -33 -102 -38 -272 -107 171 -83 -212 154 -48 -40 -171 152 -170 -28 121 222 96 286 217 -16
2436 -16 -112 294 61 -84 249 -206 70 -18 270 -24 -76 -143 166 -305 -135 92 -173 -89 26 -11 251 313 -36
2459 -36 -197 -180 -357 -139 -43 -101 -97 314 163 -16 -199 213 -95 -62 -209 31 -84 -2 -59 -22 221 43 202
2482 202 -162 121 184 13 346 202 -117 -148 46 150 127 -52 -253 -94 -58 99 200 -78 -222 243 27
2503 27 147 -473 49 51 -91 -281 143 70 120 191 -191 22 204 -153 173 23 -218 150 -18 -50 377 -66
2525 -66 -75 -320 6 -10 -5 74 -118 28 -79 187 -296 -17 143 108 -74 146 -60 114 93 -1 -44 -39 -193 35
2549 35 -200 -76 -3 -125 -18 137 -71 29 265 22 -76 -99 101 44 -146 -71 229 17 358 13 -352 251
2571 251 -204 222 52 -130 49 -50 -20 -183 63 -13 50 -244 -186 115 -147 251 251 -179 49 91 -68 9 2 125
2595 125 -442 255 105 162 76 206 132 40 -189 -69 -183 306 34 182 -93 189 18 72 -161 -26 -274 -118
2617 -118 14 151 -414 -33 354 -217 -34 -235 101 -117 -57 -245 138 9 31 16 -138 -94 -58 212 85 28
2639 28 61 348 18 116 46 -23 -226 -15 97 -136 -43 222 -153 -334 1 271 -61 291 -61 94 194 -52
2661 -52 -90 52 -298 96 -202 -270 43 131 35 87 -349 240 349 39 -144 -114 -59 220 165 12 135 107 229
2684 229 -7 -52 -160 516 -58 398 -61 -142 38 156 -11 -64 277 -195 145 -191 -177 93 40 221 -140 92
2706 92 83 107 -146 212 -11 102 150 -72 130 -229 123 137 -306 -73 162 -121 382 -79 -14 -88 -195 92 53
2729 53 84 72 316 164 -92 -92 15 202 -204 -11 125 -126 -64 -17 -324 12 -44 45 -320 -229 -239 -205 322 43
2753 43 41 -240 -17 -202 -194 -138 -92 43 286 -39 -98 146 0 -320 122 -30 24 221 -112 209 -37 70 -128
2776 -128 9 107 -93 -37 -260 106 42 -144 96 88 330 -230 9 -142 -41 -62 -109 320 190 187 -64 -3 418
2799 418 156 -349 -93 104 370 -245 38 12 36 176 -84 -188 341 30 -264 57 185 -98 117 160 26
2820 26 -105 122 -177 -122 204 -200 -117 -129 -307 -1 87 97 -2 38 -269 -35 -5 -137 88 92 -76 81 313 63
2844 63 -108 -5 160 98 -4 411 -97 119 209 94 -116 200 176 22 76 -50 -80 -163 -431 -45 206 89
2866 89 142 229 144 262 -131 -112 -206 -173 81 11 -265 -99 98 -360 99 91 -186 -245 -107 40 -83 11 -114 -97
2890 -97 -289 130 16 -81 -94 -148 -205 50 -53 14 53 -90 -306 -34 -221 -61 -178 -152 71 64 -109 -37 12 -11
2914 -11 18 -290 58 60 122 50 -167 114 422 -143 -56 -96 48 -203 -20 109 41 1 -116 -89 -156 183 -110 -91
2938 -91 37 191 -144 152 272 68 145 149 155 116 -152 24 161 -76 -31 -120 43 -68 45 -3 -236 -33 245
2961 245 257 -80 -5 77 457 234 160 -271 -81 -3 -125 -87 -13 -233 101 6 161 -59 136 356 -152 284 79
2984 79 2 93 59 -80 28 -225 0 47 100 -22 -40 75 7 29 -90 -25 -15 -304 320 -63 201 86 -172 -35
3008 -35 165 -86 -111 163 -39 -384 -264 21 142 -38 -59 -32 61 -99 92 27 223 -156 -224 191 94 -207 -77
3031 -77 -19 136 -147 -25 -44 22 -262 -12 74 85 -27 -79 142 222 -134 249 -71 23 -95 109 215 85 -75
3054 -75 -28 -160 -126 -78 -214 -89 -280 640 -278 -267 -117 6 201 -165 -39 -61 231 190 -24 -175 -284 -218 98
3077 98 -219 44 221 166 -103 255 149 0 -127 -125 -11 287 -114 251 146 -384 -130 9 129 -105 129
3098 129 -109 51 328 11 -39 201 72 -33 151 30 -235 -44 -21 116 -35 116 610 35 -135 -60 -137
3119 -137 9 148 75 -65 -88 -32 32 -224 77 -125 -268 139 -41 46 302 -36 -82 204 77 45 175 -76
3141 -76 -38 -268 131 -110 -99 -69 24 130 -14 268 184 37 198 -122 -130 -133 -20 -94 -89 169 -50 -12 -354 -111 -163
3166 -163 -59 -72 75 -49 128 -68 162 -181 -32 -218 88 167 250 20 -58 26 116 -8 -14 -16 -145 128 247
3189 247 -130 -15 186 -83 -9 106 87 -117 30 6 219 -8 130 -210 -30 -59 154 -99 14 120 -203
3210 -203 -133 143 -31 -217 -7 25 174 131 125 -7 110 60 -242 222 -34 72 89 -98 -1 130 38 -115 7
3233 7 -4 4 204 -12 143 -120 -37 253 -190 -189 118 -60 -209 113 -155 -39 75 4 57 -59 86 157 -3 78
3257 78 -96 -25 -30 143 -200 -14 -10 -86 -44 -10 -215 -76 227 -9 -109 68 67 -31 128 -13 -291 -2 -6 -141 92
3282 92 -263 132 -56 -76 173 -106 -2 -128 -7 98 -283 -6 -78 -61 -78 95 -119 60 109 -214 23 9
3304 9 271 -246 88 16 -117 38 188 -25 -26 247 62 113 -134 91 92 4 148 212 172 -63 123 -266 365 -84
3328 -84 122 13 195 251 112 199 139 -105 -3 3 187 -198 -21 -213 -106 -63 -60 -237 272 -187 19 -65 121
3351 121 399 27 201 139 -188 33 106 -326 2 -136 23 -162 -283 -139 -7 -104 -69 75 47 191 3 -229
3373 -229 200 42 -49 -19 -260 36 107 240 255 245 105 -45 230 -27 70 -60 85 105 -29 157 92 -101 290
3396 290 68 -258 209 -120 -155 91 74 36 224 -57 41 132 -5 -194 -18 -104 89 19 131 105 -132 -100 142
3419 142 -204 -47 203 -11 370 -86 -28 -232 139 124 161 -115 27 115 151 -16 -92 7 -315 -42 -84 -52 66
3442 66 37 195 -177 88 242 -129 25 141 -415 103 -54 -90 -130 -103 -89 -107 -109 91 135 -218 73 -389 52
3465 52 -69 -75 -53 -267 -17 54 138 -68 -190 -19 244 -161 -176 -205 63 -95 -106 -13 -113 20 -62 217 77 -38
3489 -38 -36 238 -190 -111 50 200 -38 115 -108 108 -10 -44 -47 -8 177 52 75 309 28 116 -170 -22 285
3512 285 110 -32 -109 -243 -52 -110 36 -206 -78 6 -115 -89 39 230 -241 -80 22 35 48 69 228 284 -25
3535 -25 -123 159 -230 20 171 314 -267 39 18 -139 154 -135 -10 8 -72 -95 11 -161 -251 127 -109 5
3557 5 -241 154 -96 173 -47 -151 90 114 95 -117 -163 -101 -132 -105 -44 -66 21 14 156 86 -120 -57 51 98 -165
3582 -165 -183 -68 38 82 -19 69 161 -52 -46 -178 -202 254 -58 48 90 -128 144 -254 183 -123 10 -185 16
3605 16 28 86 271 34 -170 -178 -100 246 -92 -277 -10 143 112 210 -22 13 -73 -178 -15 44 -16 94 -176 123
3629 123 -169 -16 -148 -26 -87 -146 -119 -254 52 -41 -206 26 -123 77 -138 40 -63 -78 -9 -15 171 -62 -67
3652 -67 103 -119 -249 164 55 -34 -145 -171 -26 80 -72 21 -98 70 -49 -32 147 79 -107 -208 -142 -135 -98
3675 -98 28 40 -39 273 -14 157 -58 81 -66 80 15 232 -10 -286 -198 267 120 -42 130 133 130 -264 121
3698 121 -250 -19 -248 27 172 17 26 -45 31 146 173 123 -44 -94 -18 167 -169 173 -157 -129 9 3 78 -43
3722 -43 143 -96 -101 174 199 -25 -15 194 83 -145 108 114 71 -54 129 201 -79 -24 -154 -85 14 45 160 148 180
3747 180 41 189 -85 339 222 110 -155 -169 1 147 -35 90 3 182 185 -50 -146 109 -16 -74 111 21
3769 21 -88 108 -9 250 80 -31 220 94 126 152 19 2 41 -92 -139 -86 5 -191 -38 -292 -34 -9 -303
3792 -303 -19 -158 40 172 -21 -153 200 -98 136 30 -234 -178 -147 39 216 -64 122 183 -12 269 81
3813 81 189 -10 -143 -191 46 -87 162 -81 129 -162 -138 -137 54 -213 -42 141 -224 222 49 -208 -115 17
3835 17 -115 189 97 180 82 133 29 -124 10 -117 -15 35 65 127 73 -173 -119 -58 -206 -146 -74 -37 2 -201 214
3860 214 78 40 1 -81 52 273 35 -123 -61 160 218 -204 22 81 135 18 257 -116 -228 3 138 119 111
3883 111 247 -128 34 239 62 -87 16 51 -12 -65 234 -161 8 1 -122 -24 112 206 19 261 -235 171
3905 171 22 12 -129 -204 288 48 5 -30 189 -150 231 110 259 68 -393 275 284 -109 -128 -83 72 -29 -108
3928 -108 165 -159 138 -7 129 55 66 -180 -152 -234 -262 137 12 2 11 -118 6 -210 -30 -86 -234 -48 68
3951 68 -8 -2 -191 -125 -112 -185 -207 -165 30 83 44 161 18 107 -63 178 110 52 176 -171 -66 181 -135 85 58
3976 58 88 257 -53 -88 78 81 -8 157 -117 199 118 -138 -180 -170 -129 138 94 28 19 -115 -78 -137 -67 89 -56 170
4002 170 185 -128 -90 89 163 191 145 -11 55 -13 19 14 -171 -91 205 -213 9 24 4 -126 -373 0 58 113 -101
4027 -101 129 107 -160 133 -135 108 -96 -111 -132 -96 -129 -64 -5 -198 29 11 -130 127 -13 54 -273 93 -74
4050 -74 142 -54 -288 81 225 256 -140 363 -199 53 242 39 -46 81 -30 145 9 98 -111 21 -26 -77
4072 -77 -65 142 101 -168 -53 -79 175 103 64 50 14 198 174 -43 -30 -194 172 72 212 -17 39 93 8 -171
4096 -171 -134 -3 147 68 85 -127 16 71 12 -98 -235 -159 -6 263 146 24 -157 -174 99 456 6 -121
4118 -121 105 158 330 -32 192 -121 -115 -68 175 -37 126 -102 169 -213 -172 -83 -137 -1 -11 -29 -57 -1 5 -140
4142 -140 -153 -73 58 12 0 53 70 -133 -108 -111 179 65 -92 93 -200 -71 27 148 83 191 -127 -48 43 -89
4166 -89 43 299 -271 -33 64 8 47 -27 55 121 284 247 -125 -7 203 3 -27 -146 1 64 -172 -329 135
4189 135 72 155 -74 236 -191 -63 -96 -86 -223 52 26 15 44 81 -121 -227 -179 -15 -73 14 -93 -129 -127 67 -252
4214 -252 66 -90 -57 -187 20 173 -188 -144 93 149 71 -147 -279 349 107 -59 253 63 106 0 -318 75
4236 75 -9 115 -115 -64 283 -123 35 -31 107 136 -6 184 32 -147 101 -87 46 -419 -148 -51 -180 -145
4258 -145 1 63 115 -198 66 107 -57 32 33 42 -93 96 -206 111 49 123 175 44 102 -204 -245 96 183 152 35
4283 35 -69 -4 21 233 -85 88 -33 -144 -134 107 55 -150 -88 -308 146 89 -141 122 93 116 316 133 18
4306 18 -57 -142 -163 -29 275 87 -92 115 204 -310 -330 -106 138 5 214 -13 39 -51 172 -156 -158 139 -55
4329 -55 36 143 -165 87 -35 273 -15 -181 -75 37 190 -123 250 -134 -112 59 335 241 -225 -82 178
4350 178 130 -83 -147 139 21 73 -66 170 -123 40 211 -2 -211 -35 -127 -219 24 -2 -69 -154 215 132 193
4373 193 -151 93 20 -17 305 -151 -41 -12 -20 108 -245 -15 -150 -52 105 89 259 24 -69 128 245 -264 -174
4396 -174 -269 -150 -48 -84 112 -145 -56 -78 -64 85 -189 192 71 -27 110 160 -97 66 233 83 49 -35 -56
4419 -56 6 234 132 261 59 20 -70 -258 3 -151 262 -147 5 126 -14 25 -188 123 248 -111 -84 94
4441 94 0 -95 -11 -166 99 -22 10 -142 147 58 123 -74 44 33 -151 193 -97 -297 -71 138 242 -66 -166
4464 -166 -237 -115 97 -81 -54 -301 -107 182 -164 46 -46 43 -259 -155 -49 227 -26 32 -123 -293 -127 103
4486 103 100 13 11 -137 -84 46 -246 -23 188 39 -19 -96 273 -78 -12 187 340 -45 38 -29 -122 202 172 -211
4510 -211 -52 -134 115 -44 -111 -119 235 -253 -207 -25 177 138 -93 -83 138 84 -45 -39 -25 148 64 -567 38 17
4534 17 -226 304 248 -151 -255 -152 293 205 -238 -40 -16 36 335 23 -96 258 43 228 -116 -79 73 -38
4556 -38 39 107 -69 33 -10 22 -115 -83 -178 157 -134 208 -264 -50 52 51 47 -215 -152 208 47 -69 17 -23 -23
4581 -23 18 91 -317 -29 13 -26 226 201 15 132 -223 90 -25 -109 98 188 264 201 -96 256 66 150 -157 104
4605 104 259 140 -65 -94 55 -118 98 -155 193 -163 -398 211 -111 269 -190 117 262 17 -111 111
4625 111 18 -117 113 -69 -82 37 80 16 84 284 -120 -299 14 -152 132 152 -81 -318 -141 -100 153 0
4647 0 382 246 -85 -39 290 -289 -248 215 139 266 -40 54 -46 -55 -32 -184 6 -212 86 63 232 -6 -29 -44
4671 -44 31 74 -194 77 320 87 -159 99 187 125 124 -106 73 239 -9 48 377 -128 135 -123 73 39 -367
4694 -367 -146 27 -16 28 82 57 -72 25 8 68 179 16 1 -7 74 -11 -78 -97 -10 38 -9 253 -275 -148 10 -186
4720 -186 33 -253 15 230 -59 176 133 134 -95 -189 105 178 79 208 70 102 -20 -296 -127 -49 56 -75 126
4743 126 0 -88 -23 33 22 -3 60 122 -401 -23 87 135 31 -4 214 16 224 122 -49 -9 54 -61 165 135
4767 135 -80 -139 -269 243 -118 13 -316 288 103 -324 27 -85 111 -69 -493 -158 394 -66 -290 -82
4787 -82 887 414 58 -664 532 -199 71 -47 -698 975 -389 211 -395 -684 291 48 256 -137 356
4806 356 227 -53 -191 -745 648 164 -149 -267 -447 510 -17 143 -2 -265 111 359 -685 666 -88
4825 -88 286 240 196 555 757 82 150 499 158 -105 -515 -304 -220 244 -813 305 -462 -43 482 -6 39
4846 39 -4 121 177 141 -76 3 246 -34 224 209 -143 510 115 404 -468 -24 -376 -209 200 -131 -251 -220
4868 -220 -228 -208 93 -223 227 -68 -160 121 -177 73 261 -331 265 355 69 11 -304 46 195 170 -136 -111 87
4891 87 190 -119 57 48 12 68 -188 63 -220 495 170 -402 94 63 -195 31 -450 65 133 414 191 196 -37
4914 -37 -301 -220 320 -89 -122 -180 -144 -176 -18 92 36 250 -426 3 227 12 -245 -170 -224 -217 -49 -67 22 151
4938 151 200 -264 163 -73 -108 57 -213 -21 -140 -133 205 118 -308 -134 -18 -5 -86 -73 -100 326 104 0 160
4961 160 394 -238 -154 -207 35 220 104 -100 227 -84 -198 482 -56 62 -123 27 17 -79 130 36 31 138
4983 138 212 10 4 -101 39 -29 44 8 -139 -64 15 -163 208 111 352 122 -121 -35 429 66 84 103 161 136 416
5008 416 -104 29 139 -70 18 -45 -269 -326 227 84 -161 -19 -87 37 37 9 -30 -231 -2 -101 -224 -115 273
5031 273 -142 -15 -176 56 -97 -74 189 189 66 -182 -207 106 77 -31 -47 109 161 -138 176 129 -161 -24 124
5054 124 -81 -209 -227 36 124 113 -137 77 45 123 161 -125 -6 126 51 -16 -267 -212 272 310 69 -196 -43
5077 -43 58 84 1 -228 -79 -15 -215 -199 38 77 -197 180 -136 52 -255 -17 -56 -391 -31 286 44 237
5099 237 -247 57 -204 116 -182 193 212 -285 2 -80 55 -49 381 -372 411 -7 296 160 -123 94 -875
5120 -875 40 190 -29 517 83 -13 -223 560 268 -285 219 423 -47 93 -697 563 -90 -334 -429 217
5140 217 123 430 231 -254 395 -153 172 37 -218 -340 46 147 -43 -68 109 -200 -203 -102 -371 22 90 -255
5162 -255 -171 -93 -479 -232 -12 31 57 -32 9 -262 -40 -81 73 -201 201 -151 6 118 -234 -32 -238 15
5184 15 128 -159 -66 133 339 -77 193 -320 283 -222 -438 -20 -6 -494 -116 -479 -34 105 -160 -780 85
5205 85 -364 -272 131 -342 433 -298 297 -35 315 332 91 112 -85 304 112 330 308 -4 30 -48 7 -398 293
5228 293 289 -441 -164 -91 -19 -45 487 -263 -480 -180 -629 132 -115 -190 -178 -309 275 33 -299 -82 354 -637
5250 -637 119 342 -250 466 -245 39 -411 168 155 -410 -371 -655 -269 -97 150 -166 413 551 -401 271 -467
5271 -467 378 159 238 -122 12 -631 -331 403 -317 46 -55 -417 114 173 -83 152 110 -206 -521 50 268
5292 268 395 161 122 -193 46 448 -181 -52 139 274 -147 -37 77 -171 134 -133 45 28 -208 -223 -9
5313 -9 -264 -99 -88 271 -195 -57 407 -212 -206 645 142 -211 -277 105 216 261 -164 86 -127 192 -178 -153 127
5336 127 -155 191 29 155 35 -121 -181 -63 -62 -310 -183 -142 47 173 242 24 145 48 -323 -139 190 268
5358 268 -187 -75 -78 -111 108 16 81 74 -287 24 65 67 -273 -35 -9 -38 37 88 89 116 41 40 39 265 -142 -181 -14 -68
5386 -68 159 -102 95 223 125 30 53 73 10 67 -22 50 143 -12 38 -85 -129 226 -281 30 -40 63 84 -85 125
5411 125 -58 7 86 210 57 21 -13 120 108 141 -224 79 153 -4 -30 -94 209 -142 -191 -275 -128 38 -120 49
5435 49 -213 -43 -94 178 127 40 -294 -342 -179 114 -17 35 186 5 30 -194 -321 97 23 344 -226 -235 36
5458 36 -160 219 -174 -23 17 4 -323 -56 -168 1 -124 46 -87 -20 -37 -230 134 5 -130 -213 130 66
5480 66 63 -91 31 -97 -226 11 -50 -209 195 36 5 142 -153 8 -69 192 -149 62 16 -107 61 -160
5502 -160 152 100 -126 170 -123 124 7 12 -53 -205 -163 199 33 162 -70 -130 131 -58 -669 -258 291 -98
5524 -98 -12 177 29 -107 -203 684 61 -54 -174 -74 -153 21 237 -224 -141 -106 -116 123 -149 174 -75 14 -16
5547 -16 -176 -6 -13 72 -107 74 -30 252 -68 5 -50 74 -167 -132 -159 27 -111 77 87 76 63 -109 419 788
5571 788 -263 149 -19 -150 25 37 89 59 -141 122 7 194 -60 -312 -85 -118 -7 -139 39 -111 -310
5592 -310 -431 -108 193 74 -88 172 131 114 -159 -260 -248 -44 -48 9 -63 39 -1 -75 12 127 -205 68 -79
5615 -79 223 -168 161 -3 -42 -228 144 69 -248 0 -154 60 -215 -167 37 -190 33 -10 50 113 -218 131
5637 131 237 -1 -126 142 185 225 77 -252 26 53 -335 -5 -108 -57 -62 55 33 196 11 -74 -38 -177 245
5660 245 -4 -97 -58 -46 123 44 93 -73 -168 -25 42 195 254 -64 60 191 -238 155 232 -82 -262 -41 81
5683 81 119 -74 -127 101 16 -35 -51 91 223 68 163 304 163 28 74 -134 26 66 -360 48 -215 124 -62
5706 -62 46 219 138 -228 -106 -53 -56 35 171 117 -56 -179 48 97 -108 354 212 43 -66 30 -218 -161 180
5729 180 288 127 116 -109 -22 -67 -10 148 14 54 -157 -255 306 332 -44 -195 -68 129 50 -165 -45 -45 -86 -12
5753 -12 -18 -48 -280 -134 50 -191 -145 -170 165 -45 -112 -64 -132 11 39 51 130 68 -54 70 114 37 42 328 -101 -234
5779 -234 -304 -84 -2 208 91 -2 -321 -107 164 -30 113 -48 251 18 -105 1 -55 68 -162 166 -17
5800 -17 -124 73 -36 88 112 134 -154 21 149 -50 -64 4 -33 -9 -106 74 114 -13 -68 98 -215 53 148 198
5824 198 -151 204 -29 -36 5 -70 -258 -82 -144 110 -223 -46 -24 155 526 -83 -303 -281 -171 182 359 -136
5846 -136 47 -2 259 84 340 101 120 -40 -92 96 -17 19 127 -143 -309 -94 -20 142 -172 -77 472 44
5868 44 -117 33 -203 12 140 -196 54 -233 -195 -20 -97 -55 5 15 -12 -38 6 -106 -269 43 -35 87 66 165
5892 165 170 50 -201 -221 -257 -188 219 183 136 32 -102 -79 -28 -252 -44 39 -178 -313 -132 -170 85 53 152 172 12
5917 12 36 -123 -158 -263 -74 -85 -276 -176 -3 -24 157 167 -106 86 -55 -150 4 -213 78 284 129 -25
5939 -25 58 175 37 180 190 -85 -37 42 -71 85 51 -114 -17 -50 -99 44 73 4 154 34 -188 -156 40 -87
5963 -87 135 14 290 -365 114 -70 156 -179 100 62 -180 27 -44 226 97 115 163 155 -70 -92 -232 119 65
5986 65 -178 -50 205 -133 91 -26 -5 -51 167 -113 49 73 -88 224 -92 35 49 84 -61 243 236 -76 -22
6009 -22 -58 148 113 243 215 -111 259 -70 -47 166 95 -156 271 -106 -18 426 -102 -26 90 -148 -242 -131 -45
6032 -45 98 -161 193 158 208 47 -42 -38 262 55 -18 13 -53 404 -32 -76 -98 78 -17 -231 85 11 -8 -135 -188
6057 -188 -114 55 16 -243 -46 -145 -91 74 112 69 -165 -144 -65 -36 -97 -52 -110 44 13 -100 152 344 97 -2 180
6082 180 66 -410 202 213 -120 104 -131 -208 -2 98 390 222 -7 -145 61 67 93 78 109 -93 4 104 -111
6105 -111 -67 210 11 122 226 -237 -268 -39 90 148 143 27 -43 231 -22 -183 -91 -47 74 124 -124 -120 20 -83
6129 -83 93 -78 -17 -17 71 72 100 -18 84 97 92 -80 89 -79 -281 141 -21 63 46 199 97 253 3 -54 -166
6154 -166 78 142 14 73 15 -133 2 149 -51 74 1 19 427 -223 25 254 155 225 2 61 255 125 250
6177 250 261 -17 -78 19 168 -99 241 -14 120 192 -67 -123 -173 159 2 150 -341 3 -61 76 123 -91 -116
6200 -116 181 -515 60 -33 92 -380 -17 -314 154 99 -353 242 -574 -268 -66 -331 348 63 589 -274 259
6221 259 761 -172 -15 -163 59 -413 284 -875 -214 -233 596 187 -520 89 -187 110 469 478 567 -217 -77
6242 -77 -43 -32 154 66 -257 -75 -180 24 227 -73 -123 99 -43 91 74 85 175 268 140 116 144 -100 138 87
6266 87 41 -233 220 -119 143 -130 -56 182 35 -170 -89 -108 -139 -178 54 -20 159 -214 -98 -128 -144 244 160 209
6290 209 57 154 149 -111 -175 397 273 104 -84 -309 -35 -154 -304 3 -1 -19 -418 198 -105 -112 -250 -58 -157
6313 -157 37 292 -23 -168 -55 -62 -11 -128 -119 -208 224 -42 -29 61 288 5 130 14 104 292 139 105 36 64
6337 64 142 -54 124 49 75 -104 -87 138 -89 -97 29 -222 137 80 -84 -24 255 -144 66 -211 73 -211 -180
6360 -180 -274 -162 94 121 17 121 26 176 96 -257 20 -89 370 169 -146 21 -115 -209 6 -146 52 86
6382 86 -106 206 -6 -5 -35 -184 -13 -8 -125 141 153 -36 -285 171 151 22 49 80 101 -8 167 -308 -31 21
6406 21 -17 124 -73 80 -120 16 9 -81 168 47 17 -257 -170 -14 -180 -69 -106 -14 -179 49 33 -180 -167 2
6430 2 285 -50 10 23 -279 -54 -116 208 60 117 -82 -66 -138 -211 -70 159 -148 142 -111 128 19 -137 -31
6453 -31 16 112 -106 -156 137 169 -26 112 170 254 56 -26 92 -80 -172 -201 119 48 239 -83 107 -10 -12 101
6477 101 58 7 -10 -114 132 -35 -303 -17 264 172 87 171 -274 164 -145 -57 -225 160 269 237 -56 -13 67
6500 67 174 119 -295 32 37 -59 -247 -122 73 -121 -89 -123 105 168 249 215 -252 20 -72 -71 39 -92 -218 46
6524 46 87 228 -89 78 79 -210 -86 -37 -190 118 135 11 -342 162 291 -66 -32 -62 92 -86 -33 -241 -74
6547 -74 135 -197 -43 -50 -86 -123 -2 -118 -66 -149 -13 -161 3 44 -6 162 -37 218 -10 -93 -30 86 -243 92
6571 92 47 -146 -172 45 121 359 86 202 73 -35 70 12 11 -268 -162 -68 -111 -2 -213 69 -70 46 15
6594 15 -36 -91 223 73 -206 99 -88 173 -208 59 67 60 -27 -119 -60 -7 -297 85 58 24 17 -130 119 120 -55 65
6620 65 181 201 39 -163 -175 -218 118 -10 -72 -12 -42 -200 50 -383 50 187 -46 213 -86 -53 123 209 53
6643 53 159 -137 -48 68 -115 12 183 -97 141 -53 94 158 90 57 50 162 -1 161 -23 -64 63 107 145
6666 145 88 99 150 193 -128 -182 23 -37 -53 178 -137 -131 -20 101 -230 -54 238 52 -85 20 149 94 -184
6689 -184 117 187 75 -163 52 -143 -234 222 366 -268 92 128 172 194 -216 3 62 176 -241 47 183 -7
6711 -7 16 118 -114 -236 -128 -126 280 -77 -330 132 362 225 6 287 -317 186 -138 -507 -41 149 -413 185
6733 185 813 -107 279 -54 186 1224 40 -130 -334 -345 -127 223 224 -37 236 61 136 88 85 -113 93 117
6755 117 248 88 -197 52 -110 -45 -159 -64 -46 68 130 94 19 -37 -8 68 125 73 -24 49 -287 -55 -173 76
6779 76 -102 84 111 -33 185 -111 -48 -58 386 179 -151 -204 -53 -135 176 -73 38 -145 -87 -328 -207 -149 95
6802 95 86 74 61 195 -227 -13 18 -178 68 -63 219 -129 52 85 -90 -105 -95 -81 60 56 199 211 81 209
6826 209 -116 129 120 103 229 27 -49 274 -210 95 -165 -247 92 43 27 31 -88 -272 547 103 41 124 -30 159
6850 159 35 83 -128 229 189 22 -139 138 -118 146 79 97 -134 -220 1 -133 -44 606 -628 -439 43 263
6872 263 220 70 358 -243 -93 98 52 42 163 -146 -37 15 99 -142 -37 51 -106 5 -424 -93 82 -14
6894 -14 -90 -121 101 -107 300 67 -314 -98 -116 289 -117 164 -8 -13 -38 -73 -7 -61 -182 256 140 -287 -122
6917 -122 71 -83 34 89 -181 8 -212 53 -233 123 -60 122 83 -4 -97 126 17 -51 -44 -282 18 242
6939 242 37 55 -143 -20 -54 150 142 -35 -110 -149 -47 205 -7 131 121 -35 -29 -72 409 -106 70 10 -80 106
6963 106 7 71 122 139 186 219 146 20 -53 -69 59 98 17 -338 -301 -135 119 -86 9 -205 -149 -35 -143 -75 -37
6988 -37 74 24 42 391 -21 41 -6 77 95 72 -173 130 63 106 68 -172 -185 93 224 -222 -266 -222 -4 -301 51
7013 51 -65 -316 153 -102 73 -403 104 -106 -42 185 -87 42 147 -229 -181 42 -177 -51 -20 42 -162 105
7035 105 8 -26 203 30 226 -32 -212 161 -198 232 117 -171 13 2 -132 21 -180 31 -57 -213 276
7056 276 183 -118 104 153 132 227 0 321 98 103 61 165 103 -9 165 -153 -96 -133 -241 221 125 11 -92 61
7080 61 -327 -449 12 148 -75 -132 -121 -203 281 285 71 98 143 -146 -84 75 -110 -132 -158 -127 290 -221 -100 -58
7104 -58 63 47 127 31 -26 33 148 -19 150 -156 -283 154 -104 -84 -214 -162 27 105 24 -243 -16 -132 9
7127 9 -126 -66 -221 13 -55 100 -217 -134 86 -5 58 58 192 -37 -73 35 -25 25 -245 -31 -51 -40 2 22 6 14
7153 14 17 -117 -10 124 86 59 62 98 185 -3 17 119 27 -30 -141 142 148 405 -186 184 81 98 -2 2 150 -17
7179 -17 50 -277 104 -4 -86 397 -64 188 -106 110 -337 -240 112 -79 -206 17 117 161 97 130 169 150 -152
7202 -152 -260 91 -220 139 -86 -73 -63 -2 92 150 -211 39 194 122 -46 27 480 -77 -272 -236 -95 -9 -89
7225 -89 429 86 -134 -109 200 -76 -49 -110 98 -43 91 23 -114 47 201 -99 49 -42 -140 6 84 -62 -102
7248 -102 12 -179 177 -100 -35 271 298 -215 -262 62 -162 60 -146 -82 128 87 64 -176 266 83 20 -78 -97
7271 -97 168 15 60 87 -263 439 67 -46 -47 -214 -109 -228 -69 220 -106 322 4 188 -17 31 -44 -311
7293 -311 144 -91 129 -221 72 50 -31 171 -238 -54 -295 -12 -136 130 -116 -1 -56 -205 242 -20 -83
7314 -83 -177 -8 -65 -153 72 67 -116 16 102 130 -88 23 -96 64 -204 72 80 -292 -242 -103 -112 118 9 63 -188
7339 -188 -208 -249 33 -142 -87 -106 11 -37 153 -7 -13 153 24 134 223 -258 -110 -2 82 -255 -53 -439 126
7362 126 271 -197 -41 194 158 -6 47 104 -108 -124 -138 -228 84 44 31 -179 -21 -203 -46 -84 -212 -60 -116
7385 -116 225 52 -79 -70 -130 6 -59 99 291 84 -146 397 -603 119 -37 -533 -409 302 -670 196 -839
7406 -839 24 -240 -399 837 -76 -138 1376 138 79 -195 260 -69 199 -113 124 278 98 -96 -54 -77
7426 -77 70 72 192 47 -139 68 -168 8 -88 -117 92 6 -37 64 -35 -135 86 125 -87 -214 66 233 -4
7449 -4 -96 16 -17 4 150 -296 105 34 64 191 120 99 114 169 -287 -62 307 -198 -167 152 70 -214 -19 -44 -12
7474 -12 -29 -43 274 157 107 88 -132 -193 -55 -216 300 110 206 -103 -35 -225 -28 404 -149 -34 -184 -72 1
7497 1 3 113 -52 -46 257 -305 86 2 -191 -145 -340 146 41 47 133 -93 -167 57 51 12 -61 301 -5 -161 -105 -40
7523 -40 -17 121 65 159 -156 -21 154 62 -142 53 9 -143 155 21 268 -194 54 -381 23 -89 116 9
7545 9 -148 -177 22 94 177 195 -219 -113 -172 -14 -232 -98 -71 103 150 -177 -36 -8 -48 251 211 140 274 -180
7569 -180 208 48 22 135 -81 4 -80 1 94 -90 32 77 -320 226 5 -104 -288 -179 14 -85 60 -110
7591 -110 138 -292 -70 -78 287 36 -42 42 -100 -23 90 170 -43 43 100 -83 56 -8 -33 -104 195 47 77 14
7615 14 -23 -168 161 270 188 238 3 1 -113 -220 3 45 -126 -158 46 -43 -161 -99 355 -201 346 35 88 -159
7639 -159 435 -165 -24 272 -125 63 155 -35 -184 -219 71 -354 -37 -325 188 -158 -21 204 -8 25 21 224
7661 224 -85 -287 92 -74 12 -273 -43 112 -165 -11 32 89 135 181 -95 147 -337 -100 22 -154 39 3
7683 3 -12 46 -77 115 59 -116 -62 226 161 5 250 146 209 50 -70 -155 179 19 34 -53 80 -40 -59 -64 118
7708 118 7 -255 -339 -156 68 -103 0 -109 -121 -2 54 87 13 -85 -64 166 28 -153 241 35 -91 80
7730 80 -37 110 -9 68 -9 -106 -33 235 72 12 -206 164 -42 240 -75 -331 431 -194 26 149 -9 -26
7752 -26 -122 -43 -144 -42 69 242 268 112 13 127 300 -44 -29 -1 -280 68 -224 95 -214 -180 228 49 -281
7775 -281 -2 -165 -215 -6 -99 -153 145 -163 -217 438 -167 77 -168 97 -136 46 -4 -25 -115 -49 -212 -270 271
7798 271 -120 258 -25 -149 -62 -48 245 198 -250 -162 -281 -24 41 -143 210 89 188 161 -110 185 -31 -156
7820 -156 -79 121 -184 -20 -318 28 189 -37 -157 6 -11 -75 -72 -107 -8 -235 28 56 -93 -158 281 28 -73
7843 -73 -106 152 -23 -112 136 -142 -183 -162 -83 -90 136 132 -41 -204 -225 140 32 -18 48 -10 40 31 8 47 48 80 68 4
7871 4 50 64 43 -51 -55 -76 -107 157 -9 -172 -73 -7 178 29 -36 -7 81 84 -63 31 118 -44 272 -176 82 -154
7897 -154 -339 -35 -49 45 -74 14 159 -72 -96 377 -81 79 -85 42 -78 58 -44 -40 96 37 176 27
7919 27 225 -68 218 -73 -194 14 -133 37 -19 -261 32 -41 133 -158 -65 -213 -21 78 -39 -25 36 -3 16
7942 16 -26 108 24 -144 45 -154 213 -115 40 72 -35 -98 192 -104 38 1 -91 135 127 95 85 2 206 -123
7966 -123 435 132 5 97 80 63 135 198 6 10 255 133 -32 -56 288 -150 -368 -122 -88 36 73 43 -197 -108
7990 -108 -143 330 -166 143 -122 -92 -118 -244 -191 -193 -142 24 -30 64 130 2 44 -2 -141 307 70 -147 292 109
8014 109 72 -110 -5 -72 306 -39 -4 -87 21 92 -113 44 -45 107 211 -108 117 -10 90 -390 55 -153
8036 -153 -162 -153 -131 -3 -236 -70 -180 -32 -113 84 -50 -91 56 222 -24 48 140 185 -55 -39 -22 290 86 52
8060 52 96 -128 -121 131 57 -40 39 -31 137 -117 -100 90 -119 15 161 265 92 159 237 -70 80 295 -137 -127
8084 -127 -81 63 -259 142 -47 -172 214 -92 -29 -128 20 -87 182 -59 -122 -118 146 221 -191 146 96 -285 77
8107 77 -133 -234 80 75 -39 -98 88 -43 94 -34 78 -81 -118 77 73 10 -112 -5 101 239 190 100 127 24
8131 24 141 -259 56 -134 -30 -103 39 135 -36 5 3 -141 98 107 5 -51 135 17 162 136 -182 -64 -124 -124
8155 -124 -174 296 -8 -66 139 451 219 -176 -39 151 -48 62 68 374 402 -96 70 -49 32 -259 -75 99
8177 99 -94 -36 55 98 10 10 -11 75 -180 139 164 -169 -68 81
8191H1
$$ Imaginary data points
##PAGE= N=2
##DATA TABLE= (X++(I..I)), XYDATA
0 0 0 0 0 0 0 0 0 0 0 0 0 8 -8 8 -8 16 -16 24 -24 32 -40 48 -56 64 -75 88 -104 120 -136 157 -177 205 -232
33 -232 262 -296 333 -373 419 -468 522 -581 646 -715 792 -877 967 -1070 1177 -1297 1430
50 1430 -1574 1737 -1914 2111 -2334 2583 -2869 3196 -3577 4028 -4570 5236 -6079 7183 -8697
65 -8697 10914 -14483 21187 -38209 179591 261058 -70701 -86689 -146371 -225211 -176769 7591
77 7591 72054 117794 170939 96626 -104752 -126592 -89169 -161144 -141144 32794 99660 125248
89 125248 190167 159392 15575 -55243 -64441 -131410 -157573 -7244 110262 101414 125122 106049
101 106049 -51444 -142547 -140757 -175657 -156263 3802 139958 135668 122005 145056 44665
112 44665 -94953 -91436 -76991 -103343 -14195 103358 115793 104755 101550 26123 -95710 -144821
124 -144821 -133275 -142176 -77621 73902 121822 92703 101780 54506 -49754 -89643 -76843 -58215
136 -58215 -6992 78870 119245 82517 63410 45416 -53328 -121780 -101993 -88898 -51835 36619
148 36619 82465 74577 59498 29449 -42869 -112188 -92260 -32470 -1011 61892 122436 104123
160 104123 72530 34215 -50331 -109341 -100986 -64672 -31856 10800 73848 90390 47333 14552
172 14552 -33475 -93963 -86044 -51848 -29618 28565 91771 107310 80402 34764 -9878 -60239
184 -60239 -86194 -57532 -26871 8236 66219 70758 31423 7113 -29868 -69928 -73885 -50186
196 -50186 -11050 24720 59928 83431 56674 18742 -4621 -49891 -70178 -39258 -10034 24179
208 24179 62313 67516 44599 1290 -40267 -65495 -82837 -62145 -15643 14373 53410 79780
220 79780 53896 21305 -8002 -44415 -58861 -48993 -16452 25034 48933 63995 52824 9375
232 9375 -16334 -40001 -70142 -58738 -25745 4157 35289 45815 40258 23969 -10117 -31840
244 -31840 -42825 -39607 -715 30184 38710 51105 41012 12252 -13491 -43387 -52202 -37199 -17677
257 -17677 12399 31318 36543 40836 13345 -25671 -39584 -47533 -37381 -5260 20571 46444 57605
270 57605 44594 24579 -9904 -38725 -40778 -42820 -28833 5496 24287 36170 37876 13831 -10426
283 -10426 -32233 -45206 -34301 -20294 4143 34504 37273 34247 27126 -849 -19309 -26062 -28959
296 -28959 -13046 3140 17378 31099 22069 6913 -10353 -36125 -37595 -23874 -14531 8725 27938
309 27938 33959 34779 13688 -8131 -16863 -28527 -23944 -7965 4699 29012 40485 27223 12232
322 12232 -11238 -30842 -34030 -37375 -23447 3811 19074 31696 30819 14027 5011 -9940 -26220
335 -26220 -23520 -16450 1198 23271 25890 24780 17464 -3900 -15415 -26586 -31764 -14793 -993
348 -993 8534 18178 14002 9108 1821 -15921 -19123 -16101 -10020 10671 20597 21631 25746 12198 -5968
363 -5968 -16285 -26380 -21314 -10029 -1177 16212 19973 14856 14228 -2987 -18820 -20564 -24268 -14827
377 -14827 5334 16776 27237 26834 16832 8020 -11887 -22377 -15777 -15182 -5063 11085 11838 14704
391 14704 14964 1236 -10092 -19300 -18949 -9245 -5853 6886 20225 13719 11755 6503 -10882 -12813
405 -12813 -7219 -6488 -230 6260 13179 15258 4318 -1477 -10444 -23358 -15626 -8217 -7400 10621 21598
420 21598 15218 9060 -688 -9395 -14300 -15964 -5414 239 5606 22515 19213 5253 6191 -4038
434 -4038 -18712 -17580 -13227 -6225 2539 10755 16728 7905 486 3161 -9245 -15420 -3633 -3708 478
449 478 15423 15022 8501 4016 -1011 -7427 -15974 -8885 3908 915 6392 13223 -1287 -6651 -1963
464 -1963 -9950 -13153 -5916 2104 6904 7270 14074 13450 -1228 -2418 -5057 -19149 -10751 4050 4175
479 4175 8535 12674 8290 413 -8143 -9763 -14790 -16110 -246 4131 -458 13801 16856 2879
493 2879 -80 -2032 -7460 -6973 -1974 4756 3233 4261 13107 3373 -8514 -2007 -6339 -12536 -2476
508 -2476 1798 2368 6621 7283 2680 -6256 -6948 99 -3984 -121 11236 5635 4984 11246 1507 -6837
524 -6837 -5542 -7615 -9957 -9262 452 8666 5272 7081 6143 -8371 -9171 -4483 -8852 -2798 6447 7021
540 7021 8461 7896 5036 1638 -4382 -3052 -6122 -11333 -1819 3731 -3 5697 3634 -4103 -2950
555 -2950 -4583 -7507 -3209 2234 8435 6152 2650 7717 1922 -4375 466 -2953 -3293 5257 3594
570 3594 1886 3227 -794 -2838 -6252 -6798 -4018 -4792 1245 8260 2351 4283 10121 324 -4604 -3667
586 -3667 -5997 -2814 2655 6746 7082 1876 3675 293 -10612 -6586 -2019 -7252 -3239 1566 -236
601 -236 3355 5969 3726 105 -4201 -994 -1132 -3444 5701 6585 933 5007 1080 -7745 -4649 -1167
617 -1167 -1576 -1880 -576 4222 507 -2738 2371 -2411 -6596 2179 1421 -791 5600 8125 5292 2157
633 2157 344 -489 -5518 -5152 408 -4256 -2001 7871 2851 -1192 2082 -2991 -6664 -5057 -2155 95
649 95 342 5786 8007 -771 706 5840 -2526 -3261 979 -2733 -2422 1043 1620 212 -2378 -492 -1442
666 -1442 -7942 -2055 2654 -807 3888 5008 -1767 -263 1500 -1041 -935 -322 3369 2903 201 4618
682 4618 1789 -4100 -588 -3029 -8375 -2873 750 930 2613 2346 3646 1769 -1106 1279 -2102 -3375
698 -3375 3115 1471 607 5137 3487 1105 -251 -3941 -3366 -2837 -2058 693 -1736 -1578 2636 -658
714 -658 -1489 971 -1154 174 1596 115 2498 2636 1791 2675 -2743 -3639 -848 -2127 -579 1349 -910
731 -910 1441 419 -3017 -1233 -2491 -2395 135 -1434 1021 4854 2894 4128 2622 -1914 -492 -1367
747 -1367 -2489 260 -1097 926 2559 -1030 145 429 -2833 -854 -1521 -3100 520 1668 2705 3684
763 3684 629 971 2167 -1089 428 498 -1114 1875 8 -2054 -49 -1628 -1273 -870 -4016 -1315
779 -1315 1112 419 2518 519 -785 1351 -1316 -1266 1364 255 1804 2498 -449 732 105 -1695
795 -1695 -630 -3723 -4293 -728 -1077 820 2098 146 2341 1258 -1819 353 -117 -338 2488 207
811 207 417 2592 1125 1568 -131 -2844 -836 -1200 -1944 875 -940 -658 1421 -1441 -755 769 242
828 242 2447 1689 87 2237 1496 791 1482 -2347 -1717 195 -1828 -318 714 -513 1434 -852 -2557
845 -2557 -1031 -1892 -607 542 -1412 982 2632 1151 2622 1544 -1182 646 -1217 -1676 -1 -655
861 -655 569 848 -2171 -570 -35 -1373 714 -801 -1721 1399 865 826 1642 159 1607 940 -859
878 -859 1098 959 610 2193 -797 -1683 240 -1402 -1090 -572 -1891 95 206 136 1935 200 232 1614
896 1614 -1300 -1001 922 417 1850 2007 -468 768 -73 -842 -159 -2828 -1860 186 -2213 -588 960
913 960 -242 1222 230 -1073 72 -80 936 1851 -713 903 1447 -693 887 485 -1244 406 -349
930 -349 -1670 -65 -454 438 299 -1996 -404 67 -21 2263 890 7 2376 861 -480 378 -257 290
948 290 129 -1392 523 74 -170 1714 -1263 -2112 -92 -1422 -1130 141 -747 242 1409 663 1576 211
966 211 132 1421 -1191 -894 692 -849 960 912 -2141 -939 -400 -1147 -422 -1398 65 397 -1444 540
984 540 872 -576 1464 1223 -1155 673 885 708 1464 -396 -244 -656 -1651 413 -422 -1373 1482 499
1002 499 -1364 695 352 55 535 -585 -425 -307 496 2369 147 -137 2274 86 -1624 375 -1068
1019 -1068 -1109 90 -1107 -442 -260 126 1098 -783 -876 1012 -836 -15 1609 -762 435 1099 -525
1036 -525 -416 -102 358 950 -1543 -786 142 -1491 473 621 -2226 -786 224 -678 531 747 997 1312
1054 1312 -245 107 296 -634 1240 527 -1146 382 296 -237 1231 -249 -385 -284 -1119 -117 -412 -746
1072 -746 1610 340 -871 747 71 349 1209 -265 51 385 -353 1085 -118 -775 553 -419 -1057
1089 -1057 106 -879 276 832 -883 -415 -245 -341 993 -29 -263 573 -118 500 841 -585 262 708
1107 708 -1366 -670 -452 -608 628 -536 -427 507 -878 282 715 -1019 -156 229 -217 607 235 314
1125 314 1531 -540 -535 -382 -252 642 117 -1397 -313 -581 -45 1228 -451 -892 341 -210 63 658
1143 658 -742 980 555 -1065 764 -373 -284 1360 -262 -172 882 -330 11 -20 -691 -547 -289 -72
1161 -72 -22 -528 912 1181 -1530 425 -346 -122 740 -336 -801 -451 544 78 340 -558 -339 646 -440
1180 -440 -275 -301 -580 1353 133 -715 418 126 204 837 116 318 471 -317 754 -472 -407 1337 -99
1199 -99 -690 223 -407 30 240 -737 -169 -537 -476 571 -379 -173 1335 -319 179 459 -633 679 619
1218 619 -856 -302 -645 -58 879 -537 -81 357 -587 -24 48 -790 283 -61 -378 162 -219 477 1075
1237 1075 -110 -43 237 -312 543 -96 -264 378 -516 -410 281 -452 248 813 -321 157 350 -216 666
1256 666 235 -517 609 -269 -92 239 -96 194 394 -648 174 -344 -510 664 -144 -534 -33 -668 213
1275 213 368 -1048 293 -184 -402 312 -314 -4 569 -380 -225 152 -830 215 454 -554 -188 -67 -375
1294 -375 400 -398 19 125 -341 163 303 -275 665 451 -165 184 -78 -274 812 -173 -19 -24 -439 366
1314 366 -161 -507 509 -14 -263 33 -317 270 463 185 -4 -10 -205 760 312 -311 359 -374 -25 485
1334 485 -207 117 301 -61 -135 -366 -360 339 -308 -199 76 -242 349 339 -1151 -133 -298 -329 432 14 -553
1355 -553 231 -120 -220 87 -425 161 454 -259 90 -91 -118 675 -163 -389 452 -57 268 155 -161 311
1375 311 281 -140 -120 -341 -739 181 -148 -60 132 -422 260 441 -348 314 483 -228 256 -124 -380 262 70
1396 70 -16 -70 -561 38 -59 -368 -148 -465 -318 294 -326 -159 503 -101 173 99 49 556 259 -133 186 -401
1418 -401 2 183 -412 -37 513 -502 131 0 -429 217 -102 -27 53 -451 458 526 -81 367 207 -163 441
1439 441 23 -145 210 -127 -238 29 -533 -161 -22 -328 202 -634 -221 295 -421 -515 374 6 232 -152
1459 -152 134 241 -300 107 -18 -586 -4 446 -360 -49 -187 -65 110 119 293 -112 468 140 723 -350
1479 -350 111 500 201 509 47 -217 -451 53 -265 -413 -398 -540 92 -84 615 -176 -76 -64 -6 -386 -257
1500 -257 -250 -407 -89 -341 -327 -247 -140 -198 -24 44 -343 26 72 263 30 -189 310 -358 -187 754 -259 249
1522 249 90 -250 585 -170 67 579 16 -99 -236 119 319 -390 268 -528 -313 -816 -318 273 290 -219
1542 -219 -114 402 147 379 405 390 114 215 -51 102 174 -263 275 -290 -309 303 35 -180 165 -184 -415
1563 -415 239 57 5 224 -180 157 -3 -396 536 40 -180 311 -229 149 -47 -160 -175 -222 -234 130 -203
1584 -203 -210 358 1 -2 490 -53 -265 216 424 -71 -210 -14 229 -126 -206 256 5 -211 35 -233 -122 253
1606 253 -64 -251 -185 -202 83 228 198 612 -189 366 150 -351 237 321 -54 5 218 -165 299 5 -56 62
1628 62 -240 94 23 -33 74 -10 27 128 -31 -162 -164 133 -71 7 -343 29 -132 -202 180 -174 -197 127 -285
1651 -285 -289 78 -74 -36 24 -52 240 140 -129 258 -250 -58 13 80 264 34 -25 103 113 -91 433 56 34
1674 34 183 -367 -153 444 116 163 -82 -211 86 251 -137 158 -78 186 101 -264 127 96 -152 -131 -48 -441
1696 -441 72 88 336 151 -164 372 167 -37 28 -170 376 65 -583 -219 87 -130 25 -57 -86 -34 -2 44
1718 44 37 -20 -206 274 -214 173 155 5 84 2 -71 11 -136 -108 150 -113 -252 0 -292 -135 254 -84 -96 162
1742 162 117 182 288 80 307 221 -162 210 228 240 -227 27 219 85 -121 -145 -52 -120 -100 -289 -146 343 -382
1765 -382 17 -200 -239 209 207 -354 117 -81 -20 -52 -157 -251 -231 -173 264 40 -379 177 47 -57 41 -155 -73
1788 -73 92 -17 -36 68 64 132 135 -19 192 4 -32 206 -146 -258 235 -360 131 -133 -247 100 87 92 115 50
1812 50 -237 276 -12 34 18 273 123 -234 29 225 30 30 156 -303 -14 -72 -65 131 -67 37 298 -26 107
1835 107 81 -228 130 178 -154 -85 236 9 94 -226 198 100 -24 -142 -47 -138 94 -90 -193 122 -175 165
1857 165 -48 -77 48 -14 6 -250 91 71 -169 -160 -153 126 269 133 295 -199 -55 -22 -215 77 -23 55 292
1880 292 -258 -98 130 -75 -123 39 29 40 104 -160 16 -264 -101 22 -21 -259 275 -335 16 -12 -218 126
1902 126 -205 15 84 -60 -55 68 -9 -49 -46 -322 109 102 -133 -157 -59 1 500 -196 -209 132 -57 352 -97 30
1926 30 -52 -79 -45 35 223 -82 234 75 -56 145 -84 106 -52 -255 79 156 -247 66 -265 -31 32 123 -142
1949 -142 137 -52 -29 -14 -83 -110 180 -95 231 -182 -92 71 -32 103 -159 -149 42 -45 -155 178 -100 110
1971 110 -75 -40 -44 219 27 217 -99 -47 -69 -78 -34 64 -47 -159 -96 -20 -194 -49 142 118 23 37 -88 83 53
1996 53 -107 -36 -19 206 127 144 -155 -160 -15 267 -45 304 -181 1 521 44 -86 -114 205 246 -225 -79 289
2019 289 116 44 75 -265 252 350 -192 104 58 -16 -102 -4 -73 75 -312 -29 424 -70 145 106 -178 -144 -77 197
2043 197 -77 -64 186 54 -294 221 68 137 65 137 -16 66 93 -89 -162 -17 111 15 100 -28 -91 -99 120 11
2067 11 202 381 -81 -133 198 -27 213 68 -194 -179 -186 22 215 264 150 165 -388 164 12 141 261 152
2089 152 -22 120 -210 0 119 51 111 -41 -371 -99 105 292 -112 51 -56 -5 -151 317 -102 -90 211
2110 211 -98 -81 124 12 -94 320 -219 9 -220 -53 134 70 -153 -23 -16 56 12 -132 -275 133 -158 152
2132 152 -218 -94 396 122 116 55 -230 71 8 -173 25 -57 37 53 -21 -229 -6 107 -53 -61 58 343 29
2155 29 -236 -104 110 128 150 -121 -316 -168 -56 141 -43 -112 320 -86 -28 85 -297 -86 120 -25 -196 28
2177 28 -99 -59 196 151 -70 205 -294 -266 128 53 74 225 46 146 -28 -146 113 72 -17 -233 -79 -51 -9
2200 -9 -297 147 111 32 121 164 13 215 56 -7 92 -233 -116 238 -29 -77 -258 162 285 -51 -118 182 -391
2223 -391 80 -292 280 173 -93 -106 139 -146 216 102 -268 54 31 -324 86 -35 143 155 -76 -1 74 56
2245 56 21 182 63 10 -58 165 50 54 -108 127 -72 -155 61 128 -21 -46 -149 -164 -150 -98 -36 62 186 -204 -118
2270 -118 246 -274 -215 202 -76 222 169 59 210 6 -110 -4 40 269 273 26 -78 -8 8 87 10 155 184
2293 184 54 127 200 -76 225 -132 -418 -141 31 -8 -133 170 65 36 60 4 -141 -89 22 122 -27 -82 21
2316 21 96 -4 -150 -20 -160 253 -72 -21 362 193 304 -4 48 127 55 37 177 -230 10 -306 -85 -117 -30
2339 -30 166 66 -140 -24 -86 -126 -50 -57 126 -46 -111 5 107 44 -157 -201 146 -126 -36 -6 199 -32 -62 -107
2363 -107 -147 63 -80 88 -46 131 130 -145 42 -121 128 -78 10 15 24 211 256 -67 4 100 -361 -51 -218 -29
2387 -29 -160 -248 -125 -22 101 -30 -71 118 34 10 -49 162 -33 65 -259 107 276 -75 -4 77 -134 313 193
2410 193 33 150 -220 52 -120 125 72 199 179 -17 -69 229 318 194 -105 -60 -69 108 -219 189 157 123 -46
2433 -46 -282 -186 73 -62 103 -20 -7 -27 188 136 -97 348 271 -65 -175 -22 -169 116 -179 -32 -41 90 62
2456 62 -417 -175 27 -105 -106 52 -19 -85 13 -208 -173 -35 -33 5 36 37 -180 -17 25 128 -179 -123 156 197 268 105
2482 105 -233 94 -90 -23 -38 -5 -282 31 -113 -36 -30 -112 109 270 -33 -104 80 -111 24 180 -89 78 -37
2505 -37 -121 -130 109 114 -44 -115 -90 40 -59 351 -82 -2 -109 27 -127 56 250 5 -49 143 172 186 6 148
2529 148 -145 11 -163 12 192 69 -59 3 -77 -137 -101 -111 -65 114 -253 -135 -144 -104 234 -153 -99 -136 233 -134
2553 -134 -6 32 6 157 -169 -52 -159 -35 -88 18 -103 -208 -7 -145 -157 332 54 -83 -317 -30 -62 -214
2575 -214 15 112 143 4 -122 -189 114 -26 -113 -16 -2 -111 12 64 137 -93 36 2 -96 336 -6 -25 -18 -72 -23
2600 -23 200 -70 7 104 -73 -62 49 -84 215 55 144 198 -163 88 244 209 -59 180 32 226 166 -72 -206
2623 -206 -108 149 77 -191 134 42 -43 31 -37 -112 67 4 -60 17 -41 -84 103 -224 -78 209 -84 95 20 -25 -137
2648 -137 -3 -181 -49 -18 -41 -83 -50 -262 144 -52 155 163 -188 356 -130 148 -66 -198 88 29 -204 318
2670 318 -218 198 75 -76 -328 372 -225 -148 6 -151 -2 -130 55 35 10 75 -25 -171 -59 109 -131
2691 -131 -62 134 127 36 -64 -24 -90 -184 -157 7 226 98 39 201 32 166 -306 -62 -139 370 -130 -7 192
2714 192 17 252 92 361 181 -104 14 153 27 -267 269 1 88 -110 -101 -89 186 -134 -284 -212 -148 198
2736 198 52 -162 143 45 97 138 -44 -215 -46 -26 -198 196 -52 38 -131 -82 171 177 5 -187 -98 162 32
2759 32 -28 15 -127 21 30 -98 -4 -170 -8 -300 -174 -50 327 -33 -34 -19 -121 -36 -43 199 245 146 -25 -211 96
2784 96 -299 -56 -42 -279 92 -70 -25 -40 -109 -292 -104 -52 -3 -296 131 130 141 -128 38 -222 -5 -100 152 136
2808 136 329 144 -212 10 -265 -151 166 -123 -145 -101 70 -222 126 210 -51 331 -67 -104 2 313 -82
2829 -82 104 350 -6 137 -97 0 178 -61 -72 49 -216 -71 -103 17 -96 29 94 294 71 -95 -177 -62
2851 -62 -327 254 172 356 47 -99 -70 47 -144 68 17 104 -285 -151 -181 167 -101 80 265 139 -92 43
2873 43 -45 109 338 4 189 -44 193 15 -150 -99 99 226 48 -197 -62 4 72 -92 27 96 -10 -3 -243
2896 -243 -222 -114 157 8 -94 -89 121 23 -108 -108 366 -214 17 239 -139 -281 81 -47 108 -17 197 40
2918 40 -81 80 -111 101 49 13 -113 -3 71 -167 -115 165 -179 -223 -276 11 83 129 394 100 -269 -31 16
2941 16 227 -285 -134 -17 44 13 -9 30 50 -22 -163 23 31 -65 7 -91 123 156 25 25 -62 -64 61 -103 -190 -145 70
2968 70 -84 -218 9 -43 -189 -209 133 -65 -97 108 109 -71 -59 -52 97 156 -175 83 -292 52 -5 -7 195 -67
2992 -67 -348 -200 -221 -152 -52 70 15 139 -122 -138 107 89 -94 -13 7 319 -37 -1 82 39 -37 109 244 -232
3016 -232 -72 89 156 252 184 -66 135 -82 -23 -202 153 -69 112 89 -55 197 109 220 43 -37 -93 -112 123
3039 123 -27 -5 -189 266 -51 -18 -100 169 -147 251 96 -34 -221 -178 -157 -227 111 -73 -15 -89 84 31 98
3062 98 -20 -193 -49 -44 -300 236 -93 74 -158 182 -25 19 105 105 16 -44 23 -72 -62 61 44 -180 74 -138
3086 -138 7 -100 25 164 12 -135 -317 232 -185 95 149 -121 -157 39 -75 -229 -112 -138 151 -52 95
3107 95 83 16 238 -131 -44 -19 -57 -204 250 74 3 -26 -135 67 379 -196 -127 51 23 112 75 123 -33 124
3131 124 -34 10 -192 -38 -187 -35 136 -111 188 -25 48 73 -197 -40 67 32 294 208 -214 130 -125 37
3153 37 -260 -266 275 -339 161 -93 -212 -56 100 70 79 179 195 -126 -83 -87 21 191 -40 27 -85 -1 -29 121
3177 121 -153 55 99 -275 -166 54 100 -163 -67 -48 -93 1 -50 178 40 -23 -139 196 56 -35 112 -87 178
3200 178 -109 104 124 201 -228 -58 172 -227 -29 179 -111 300 220 6 -47 121 -302 52 100 -128 -93 -94 -3
3223 -3 -104 -33 -148 10 -156 -115 23 -254 123 22 231 -43 -158 78 -43 -66 79 72 77 89 -59 5 190 -207
3247 -207 71 98 -397 54 94 -69 107 125 -16 208 8 142 159 -288 -30 175 1 -9 -161 -246 39 -91
3269 -91 59 -121 -70 52 -12 -142 -352 -99 -142 93 -338 74 14 72 -19 -150 -151 19 -30 236 -39 -135 4 191
3293 191 -23 182 280 -60 -31 -91 100 121 26 -184 -155 -148 70 124 92 -11 35 -64 310 -227 -391 20 -201 -112
3317 -112 -72 -81 207 67 13 -127 88 62 67 130 -36 69 -233 233 -180 52 -139 208 -1 -222 194 -244 35
3340 35 -26 -179 142 -47 -315 -75 -79 -81 -148 -202 37 47 -27 50 63 181 -69 213 92 -300 -53 279 6 185
3364 185 98 357 -220 65 128 -47 -45 246 44 133 -5 -145 -57 95 268 126 128 -72 -224 -241 166 189 155 -126
3388 -126 -83 74 -36 -112 -185 -121 -71 108 -67 -47 -61 -90 -96 -138 70 -56 17 241 21 88 120 -58 132 318 -130
3413 -130 107 -4 27 219 148 -37 -118 -87 29 132 83 143 69 -42 -298 -126 54 68 12 -239 158 14 -290
3436 -290 80 151 -63 78 -93 126 88 7 228 84 89 -59 -158 -116 -63 146 130 -61 -219 -6 -165 -116 110
3459 110 64 -132 -183 63 -127 36 -51 -114 179 79 -111 38 12 51 -265 37 295 108 3 209 207 -129 -64
3482 -64 -143 -52 87 198 -117 206 89 153 -35 -83 55 140 101 44 -198 68 89 -115 85 -42 -284 2 134
3505 134 -50 192 -33 115 -119 -68 64 -242 -166 77 -137 -95 -37 147 59 -236 0 229 10 -47 -165 17
3527 17 175 85 13 -242 156 -187 -197 220 161 -293 125 -73 32 27 59 -153 -28 90 -278 86 83 -217 42
3550 42 87 171 48 -138 275 -51 170 -94 -115 -348 -5 293 -48 163 -8 -193 180 -114 63 12 104 -278
3572 -278 3 -93 185 -34 223 248 -165 -24 93 164 -340 -23 56 53 -33 -187 288 -141 34 401 110 308
3594 308 43 -51 335 -18 48 -56 222 -80 324 -36 -21 -24 -35 -83 138 -78 -9 -30 -32 21 6 -267 41 54 65
3619 65 45 96 106 95 -40 82 286 -51 151 124 -67 61 195 39 -6 180 -113 -311 -23 -282 0 19 41
3642 41 148 56 -12 97 -26 -16 38 40 -162 -9 452 105 130 -242 118 46 -141 79 -51 3 18 -68 -384 76
3666 76 5 125 -140 -116 -7 199 -139 39 190 180 152 5 -22 -30 -101 18 -107 56 -116 -132 119 130 41 36 82
3691 82 39 -222 -48 55 75 -31 -10 106 -214 -39 -3 -262 56 263 -124 -8 -161 -78 -51 166 264 -231 200
3714 200 -103 195 26 -17 -152 199 -8 -55 -189 252 54 120 60 174 7 -158 -84 148 -171 -108 223 -203
3736 -203 94 -118 -94 117 56 60 -10 63 262 -195 208 132 -67 202 76 -77 -71 -35 -61 26 -59 -41 15 63 401
3761 401 -189 100 87 -41 90 -158 36 -223 -144 -245 -96 207 -1 224 36 178 -267 -208 6 31 -18 -34
3783 -34 -14 -58 -11 89 -197 132 316 199 -142 -26 433 -257 -14 227 42 5 92 -119 -174 46 266 -104
3805 -104 11 114 165 102 0 11 193 -179 2 166 28 135 212 50 -79 -47 -99 269 -4 166 -148 186
3827 186 67 -82 -4 56 106 -52 129 170 -169 -318 44 43 -188 8 -101 -43 152 54 -184 -220 -32 -171 -65
3850 -65 250 -152 -26 181 -79 258 257 -291 108 -122 -223 -77 -12 330 130 -29 -136 69 -145 -46 -6 -51
3872 -51 -206 98 87 95 223 127 -34 -156 9 -110 42 -187 -260 -43 201 61 -17 -38 -59 260 504 8 13 77
3896 77 149 -153 -77 179 109 -7 -109 -82 -64 -177 167 -98 -253 -19 65 73 32 -135 -98 -21 -35 -73 -33 347 -73
3921 -73 -40 93 11 22 405 -46 -51 -2 94 131 116 259 58 -265 -17 146 145 -86 110 389 13 -26 125 199 -83
3946 -83 -116 78 275 -121 148 -80 144 328 66 193 -23 -234 160 -93 -444 -112 90 54 155 178 -160
3967 -160 -144 54 53 -47 8 30 33 288 29 -18 253 -62 -426 -70 -190 284 193 -163 132 37 -73 215 -9
3990 -9 38 197 50 25 -161 -59 1 -196 -58 -42 -24 -19 137 -11 -84 -10 -170 -32 -17 -72 109 50 -172 38 -195
4015 -195 -135 46 86 336 139 -1 -183 -332 -201 91 -122 8 309 -451 84 -71 -59 38 -102 -206 -193 -144
4037 -144 -31 335 97 -96 -57 87 282 -8 51 -168 -291 -27 -184 12 92 157 -189 -26 -46 12 96 -93
4059 -93 38 -178 78 43 -145 -74 -20 293 -147 82 115 -94 -126 146 203 -32 -342 106 56 202 -20 125 -19
4082 -19 -248 229 9 101 69 -14 75 53 296 134 -89 401 -168 -70 242 -146 242 16 -214 54 -102 42
4104 42 -132 -120 -93 -82 -173 -6 97 59 -146 -57 237 -156 167 -11 -22 58 -217 -173 -150 213 234 65 -68 -129
4128 -129 47 -147 70 151 242 -5 -269 -100 142 -190 -196 -48 -79 -75 -95 -35 192 22 133 -33 -185 -541 -105
4151 -105 157 37 84 218 -24 -149 132 86 20 -136 75 -47 -132 255 -374 -148 227 -92 81 -20 -70 81
4173 81 -197 85 84 -75 45 281 -216 274 -72 156 -48 -1 23 151 -72 34 -51 -60 139 69 109 14 -182 68
4197 68 198 -159 -72 78 64 16 0 54 5 -56 93 26 52 -59 -135 19 112 122 162 -164 11 -181 45 -289 -75
4222 -75 163 -119 -28 -254 228 -52 63 114 -21 53 -24 -296 -27 -56 8 -214 -11 84 7 260 -80 80 -273
4245 -273 22 -211 196 5 -39 -178 158 135 80 -141 -78 -55 178 -120 -33 -32 222 112 157 70 299 -57 -140 -179
4269 -179 -62 83 34 -6 -186 205 69 81 -25 -34 57 -15 36 109 19 158 77 -136 206 50 -116 15 179 116
4293 116 -61 60 -12 360 44 143 147 -22 110 80 156 -75 116 -4 127 -57 179 125 -201 90 -14 -133
4315 -133 47 -83 -84 -61 -206 -349 181 -117 67 -327 -4 -41 -41 -249 -212 -302 -100 -128 -1 -384 -123 -114 65 91
4339 91 -42 -161 -130 94 -144 -340 -14 113 -100 26 9 -25 -114 -86 -143 31 188 -32 -196 132 -125 11
4361 11 -46 -388 -249 -94 18 -64 120 381 -118 6 -269 23 154 93 20 -23 -15 135 128 -114 -87 -58 -51 63 42
4386 42 254 -81 7 267 -81 -188 -80 -14 23 38 275 -63 -92 -93 35 20 60 71 76 -219 95 196 75 203
4410 203 69 105 47 -102 116 -93 -1 -125 2 -65 -37 120 -243 -203 -22 203 297 -24 47 247 -59 128 -345
4433 -345 60 111 -65 -277 115 -54 54 -141 116 182 -76 58 142 86 -208 25 -167 249 53 276 -244
4454 -244 -89 -236 14 174 -155 -51 29 -66 100 -51 -62 63 -1 237 181 150 44 -255 183 -117 33 -46
4476 -46 -378 228 -218 -82 -130 307 298 102 123 144 -53 -221 -170 -120 -82 -41 -47 -212 -5 -130 7 -141 -252 196
4500 196 90 298 127 -25 -89 159 -134 208 -255 4 211 -52 92 150 328 151 -87 -28 175 -126 58
4521 58 94 34 253 -26 -91 75 -360 -171 232 -204 -179 77 50 46 43 7 180 -89 67 99 255 -23 38 150
4545 150 252 75 200 -414 -8 155 -67 -163 -127 -71 -284 -29 -75 83 72 -67 0 -149 139 53 -152 -56 -16
4568 -16 -49 -181 -130 -53 -195 -13 19 -170 26 178 90 -161 52 64 -124 56 -98 131 13 -62 96 -273 356
4591 356 -238 89 204 57 109 -85 236 -29 27 -36 -69 0 230 59 85 -51 -105 -73 75 251 15 -17 196
4614 196 73 -121 -138 280 -327 82 -80 -11 74 113 6 221 -331 -169 14 -91 -94 18 168 -34 -137 -222
4636 -222 -86 66 0 -118 252 -182 -104 188 -186 98 -111 12 38 -46 -311 121 150 -153 106 191 -218 -7
4658 -7 133 178 -172 -34 -154 -256 -44 -126 119 -87 -14 -63 -180 -116 -110 -72 -45 -16 5 103 29 9 69 -34 -10 -90
4684 -90 -89 -19 -26 288 -34 -40 -101 30 62 163 145 -82 202 -5 71 -248 -182 155 130 22 -101 -70 -67 -8 -15 -41 -270
4711 -270 -179 16 -108 -122 51 156 -61 -157 178 -96 -122 -174 64 79 -70 110 -134 -18 -110 129 40 -160 -325
4734 -325 -151 -108 -82 -230 -162 -104 -144 -219 -16 -216 170 249 -108 28 176 25 305 -275 150 67 47 96 -162
4757 -162 -115 163 -11 -83 -77 51 132 95 249 -223 85 -304 117 -55 96 -180 109 -555 827 -205 -46
4778 -46 -109 -9 72 -213 -529 -105 122 296 750 -154 -117 743 736 -313 -147 36 597 175 258 108 85 -12 183
4801 183 271 388 -548 -150 271 254 -144 -27 103 170 -273 -363 -42 -173 -95 266 26 -375 -364 -496 -658 -401
4823 -401 -52 56 205 128 499 209 -394 -137 491 -301 -242 220 300 -293 106 242 -343 -400 -30 241 -180
4844 -180 -178 -444 -350 116 493 -84 88 287 -191 -234 -232 109 411 8 -115 236 22 319 297 -139 167 -105
4866 -105 -420 121 -105 -27 111 30 -269 -184 90 -52 393 -130 162 403 -350 -215 -429 248 -224 -76 -1
4887 -1 -91 232 -121 17 195 235 292 536 137 87 216 -208 165 -436 110 156 281 -263 261 -69 222 94
4909 94 44 -109 101 40 -326 -116 -56 -17 440 -154 -3 -89 -16 -152 -71 -117 18 594 -200 -38 -123 157 -392
4932 -392 125 103 -288 101 -55 61 177 -180 222 86 -45 32 -180 154 -226 -29 21 42 -170 241 7
4953 7 42 171 -139 346 -253 66 19 -110 219 -17 331 9 -115 11 148 132 124 -76 138 -45 36 178 210
4976 210 -194 -120 -136 -115 9 178 120 -46 -67 -174 35 149 -312 0 257 -293 -186 208 -34 -323 111 58
4998 58 -73 -47 -64 226 44 -55 48 162 -158 375 37 -127 -159 -203 113 -223 102 -278 180 -65 -95 23
5020 23 -6 97 78 88 199 174 0 111 -36 284 -244 -186 124 9 -33 -77 111 124 -129 -261 -150 63 -71
5043 -71 -91 471 44 72 1 -48 138 -216 -129 -68 81 -200 346 -68 41 -125 -181 42 -121 -70 -144 -129 24 159
5067 159 -19 -98 -100 168 105 -30 -160 -115 -128 104 -50 -215 388 -177 207 -76 23 229 59 380 -173 68
5089 68 -124 -57 33 37 85 110 221 -42 19 305 -227 24 88 100 83 -48 -8 323 348 -67 -161 -259 -385 315 -276
5114 -276 -70 175 -77 501 33 723 449 210 -195 434 333 148 311 -462 -368 386 -253 11 -456 705
5134 705 -346 159 44 -798 184 426 157 189 242 -254 263 -284 -158 -194 262 27 -308 -84 -170 -80 -70 41
5156 41 115 10 38 87 -159 249 22 161 255 -51 1 -209 90 178 246 185 -269 192 -125 183 -261 -455 295
5179 295 161 15 348 -294 60 119 -125 347 -311 -146 -4 -45 305 -290 118 -387 100 -145 -633 332 159
5200 159 -74 72 -286 -521 5 690 493 83 -672 -920 -277 -27 648 -371 -346 -8 -222 -409 -94 -93 -274
5221 -274 -66 -324 -357 -77 30 557 -79 262 523 23 152 -267 -227 213 97 -435 38 -106 -205 183 142
5242 142 8 -8 -155 -421 -207 -289 105 -38 260 -366 -250 194 -308 121 -23 142 191 169 43 -509 -99
5263 -99 123 -140 -187 446 455 -419 938 281 685 -783 -14 -78 -103 -268 -17 18 344 -319 -2 264 136 214
5285 214 -382 -741 -473 227 -159 -85 81 -70 -121 372 138 -278 153 -64 -144 -169 234 -141 197 376 1
5306 1 200 -176 31 -18 -284 -90 87 -173 -176 109 161 -78 108 -131 423 277 136 -145 68 92 -15 -41 165
5329 165 -133 -279 39 -3 55 13 115 2 -195 64 -293 219 16 57 -135 -31 16 -80 208 -340 189 52
5351 52 -223 85 -96 -61 267 -41 197 -85 -135 124 -91 -131 -140 34 -43 91 -297 72 -215 273 -145 111
5373 111 -272 -171 -174 81 -149 -80 44 -37 175 144 -235 198 76 -144 336 225 -358 59 226 223 -29 -203
5395 -203 320 -123 -82 -153 -95 -89 178 -195 169 -47 56 -261 254 -243 -53 -30 -227 -125 154 261 4 69
5417 69 138 89 -217 -280 177 -70 73 -11 113 -168 -212 -207 -81 64 100 123 -161 54 9 175 -30 2 236 -95
5441 -95 -163 107 87 -235 235 -34 -28 -35 23 -269 -49 89 95 -54 90 47 118 63 -97 -71 97 273 -253 22 -14
5466 -14 19 -32 -118 235 158 227 236 133 247 -108 -75 -47 184 180 -46 -261 -112 134 -20 4 -72 -220 202 210 -34
5491 -34 -183 -165 -82 84 268 -119 -273 -123 122 275 8 53 -83 305 -277 -83 -202 -10 51 36 -55 -12 -154
5514 -154 -64 280 235 -97 -83 -87 107 -464 -328 329 -55 -90 21 313 352 -539 -432 -125 49 359 -253 -135
5536 -135 -133 -35 40 -62 223 -57 -180 -25 -281 29 -164 22 210 -10 28 6 -71 72 61 162 72 -248 66
5559 66 -11 63 395 185 -147 -187 -99 152 -106 335 -104 326 -55 -51 -120 56 -88 -130 -337 -90 -131 -270 -70
5582 -70 4 -49 -379 113 -40 61 -146 -74 -15 -14 -127 -85 155 -69 -122 -39 42 -56 104 95 94 -16 -283 316 -34
5607 -34 -54 108 -143 -41 82 179 -232 49 206 -52 11 154 116 24 -58 -27 -108 70 -14 143 -113 -3 5 143
5631 143 -175 82 164 0 13 168 145 29 28 -137 42 69 236 -126 8 -394 -115 648 109 120 -135 -103 -179
5654 -179 64 66 -63 142 -340 264 -36 -47 -171 127 2 -5 -267 -116 112 227 -92 -89 127 -26 69 169 288
5677 288 -64 67 137 111 64 44 -54 -4 73 127 10 -123 140 128 26 -124 -75 284 171 -155 54 59 149 12
5701 12 23 -115 276 -146 177 123 91 -82 -179 174 -105 -77 -212 51 -51 -84 -243 -131 128 162 -105 90 44
5724 44 -169 -104 -97 3 -191 -39 -235 30 -164 -325 -52 -105 108 47 112 157 -68 -71 -109 -40 84 162 2 -110
5748 -110 91 109 202 -47 -39 69 17 48 -88 -156 66 125 121 96 188 -290 76 107 272 153 99 96 176 -160 183 165
5774 165 -98 91 183 -69 261 27 132 91 -32 -49 -158 102 50 -108 -82 56 -278 -108 43 450 -262 -103
5796 -103 -14 191 -86 -40 176 235 -28 96 61 -22 -57 -331 156 210 -226 144 -2 -28 -61 -359 -290 -170 -92 76
5820 76 -41 20 157 34 61 -293 -139 205 -126 148 -76 82 225 -47 -41 -122 -397 -280 315 -138 672 339
5842 339 -85 -649 -40 120 224 48 -107 182 21 -44 220 -30 -137 -50 359 -185 173 -205 76 -21 -75
5863 -75 63 138 -63 -15 -77 -143 180 -14 108 -160 50 39 -43 -104 131 -6 -11 -283 242 42 101 -17 63 13
5887 13 -141 70 -78 -44 220 -205 -34 121 -157 -87 -92 226 -42 178 128 182 228 -180 75 -200 104 55 -33
5910 -33 -95 63 22 353 126 -22 229 260 -47 -126 -139 -16 12 144 -65 37 -212 -270 1 -122 -107 -59 -44 -53
5934 -53 100 11 -112 -89 193 -89 -69 36 -9 244 138 145 42 101 -160 -130 -28 74 -195 72 -20 -167 188
5957 188 120 -319 99 -42 -19 199 -113 -52 153 -35 56 106 114 -139 92 272 35 85 -41 238 -42 151 82
5980 82 190 45 21 33 60 159 112 52 96 31 -46 -10 -24 -231 -70 332 -253 -152 8 -360 -29 153 -70 -101
6004 -101 -191 -145 -6 173 -259 249 -35 -80 -540 -284 139 80 68 100 -109 -86 -63 -75 525 -121 91 -74 142
6027 142 19 -57 -150 89 -50 51 -111 -89 -28 -43 41 -43 -26 -64 108 -40 -155 -147 -160 -260 72 -154 -288 27
6051 27 325 -145 74 134 11 142 0 97 208 -105 159 5 -6 -56 178 -191 117 28 174 161 -4 287
6073 287 329 138 -283 139 158 -20 -148 -66 -249 -146 383 114 -81 162 202 191 182 197 -201 -263 -98 -67 -245
6096 -245 -240 50 -21 181 -123 182 160 215 -139 -14 -95 -25 132 47 103 88 -111 78 -51 167 -49 -65 -31 141
6120 141 65 -376 -150 -14 49 -299 70 -91 152 65 181 -139 10 -117 -156 -16 134 146 39 55 152 -174
6142 -174 137 94 -124 -65 13 -65 -106 104 207 32 29 -111 195 -93 -29 -93 -35 -119 62 -150 -202 -133 129 61 -280
6167 -280 21 -262 6 354 57 118 -114 -46 -212 184 -491 14 -5 20 -11 -106 207 -98 -145 -7 -259 119
6189 119 158 164 -151 275 -240 -254 22 -22 -110 -19 141 -231 -408 -302 -687 -86 -263 212 244 124 -173 -102 -550
6212 -550 321 244 472 -381 -446 -497 -411 174 -703 -190 -112 75 168 459 -612 -146 235 215 -501 295 365 178
6234 178 -47 448 -7 445 3 -11 -394 -78 108 -142 37 -135 115 175 85 -118 93 50 195 -75 32
6255 32 -66 114 37 103 186 60 -24 -39 144 -196 129 -58 -80 148 -187 217 -213 -90 -111 -96 218 -9 -271
6278 -271 167 92 316 121 -116 -127 45 -198 35 105 74 159 -286 235 40 -105 -123 232 -27 -230 206 369
6300 369 261 271 -65 165 38 69 -323 269 23 34 262 -199 -252 31 184 -167 15 63 33 -62 -183 -10
6322 -10 -83 -233 11 53 -130 20 110 -35 -15 -228 118 293 90 -100 100 182 187 107 -122 -36 50 203 75 87
6346 87 -98 176 -110 -61 -6 221 -117 104 102 258 -3 80 196 -20 120 -225 -9 -48 108 -58 -77 18 79
6369 79 -82 73 35 225 -129 -290 78 -246 -75 370 241 -87 -70 -90 -203 -82 -41 -141 108 118 276 187
6391 187 178 431 -38 -127 -32 -74 160 -371 223 -79 185 -23 -109 201 229 -202 -125 196 -91 265 -122 -152 -61
6414 -61 -13 -77 89 206 130 -100 93 -99 -90 52 -62 -290 178 63 141 -16 165 -23 -63 23 187 -167 194
6437 194 259 134 -110 10 193 147 -64 -220 -85 -152 169 344 -30 143 25 -61 -345 -87 -53 -126 106 129
6459 129 -358 -197 -136 112 111 -165 54 170 238 -36 54 -236 -27 38 -133 -52 21 -37 -25 -30 279 76 13 -87
6483 -87 -27 119 33 51 -159 360 190 60 -103 204 100 80 -67 -116 201 52 267 -14 -301 -165 -3 -35
6505 -35 110 -249 -125 221 74 96 117 -59 26 -148 -108 -118 74 279 -187 -191 269 102 253 36 19 -60 37 178
6529 178 13 -271 -114 296 45 40 -53 -88 -34 101 201 -79 177 -120 14 -85 -8 -210 107 93 188 69 -21
6552 -21 -135 137 72 246 34 137 300 125 -88 15 88 44 50 -196 237 239 281 292 -232 -171 -219 -149 213 -467
6576 -467 -393 -122 -68 -20 -66 -146 302 -90 86 122 -149 284 -145 -6 -151 -88 -51 -182 -187 35 -149 -67 141 84
6600 84 1 -12 6 -148 -118 30 -146 25 -24 -100 -62 93 -372 -118 114 9 -181 -43 -112 142 12 32 47 -90
6624 -90 184 -75 193 209 -30 11 109 50 357 68 206 -151 -23 -29 121 201 105 205 -180 -144 33 -130 -29
6647 -29 145 38 65 -109 89 43 -46 -156 -10 83 98 107 77 -93 51 50 112 238 -166 -40 111 8 -75 48
6671 48 -252 -66 15 -271 -16 -108 16 -112 -179 165 46 122 -300 29 -259 142 100 -116 114 163 48 -87
6693 -87 -80 -48 -195 -169 -65 -97 80 178 -14 106 -5 3 218 232 -32 108 -114 -443 145 -60 268 -197 5
6716 5 -143 64 12 89 -28 -645 -584 660 692 223 225 143 -455 -317 999 -264 -131 -866 -913 -190 148 -57
6738 -57 427 492 50 -264 -68 -148 -70 -34 67 53 11 -97 -181 -72 -85 270 158 34 64 -360 -65 -38 -138 115
6762 115 -51 -206 -8 -65 280 74 87 33 60 -51 -14 -159 -202 32 170 -37 -86 65 -194 470 344 -59
6784 -59 68 102 -83 -8 -79 -80 169 -94 94 -99 79 112 173 42 -153 -144 -127 -331 9 74 -323 138 -233 -53
6808 -53 212 151 13 216 -168 -43 309 90 -224 251 17 156 42 -89 89 207 -57 -16 -295 -183 8
6829 8 36 -132 94 19 -146 -23 40 -41 -177 95 127 -56 -147 71 -81 90 301 -111 -15 -120 125 44 -97
6852 -97 177 -45 -58 -18 59 76 129 -228 61 56 -95 -3 349 852 -152 -446 -628 -14 -240 401 -228 -46 -116
6875 -116 6 133 184 5 -95 160 -23 -103 68 -67 -223 11 -160 69 50 -79 -17 130 -69 -169 -98 -83
6897 -83 -107 -252 -111 185 -93 87 -20 57 -151 188 -32 181 -89 8 10 137 -150 36 -78 109 55 -29 80
6920 80 49 -120 101 -19 80 92 60 -19 139 17 231 -373 -190 275 -23 -6 69 185 -130 276 -41 344 208
6943 208 221 107 68 -228 156 -50 333 63 -202 33 153 151 26 227 -62 61 149 -96 -354 4 -175 195
6965 195 235 51 -19 73 -31 -15 -192 -239 43 -268 -196 29 35 -239 123 15 -176 107 -346 -135 301 89 -228
6988 -228 -339 -121 -145 -58 37 8 -436 73 27 -213 96 56 -46 -65 -257 -9 -73 34 123 -39 -20 229 -46
7011 -46 140 -25 -111 -106 -85 -118 -41 -1 45 -228 41 -104 34 -254 -91 160 126 64 -45 111 65 78 -9 -80 -299
7036 -299 23 213 100 -41 -92 -123 -71 108 237 -94 -53 203 -41 308 81 -158 126 -55 124 -56 78
7057 78 68 -65 31 -223 105 -41 -75 -189 5 212 6 149 217 121 72 -78 -150 83 -213 -281 242 106 189
7080 189 -169 -32 236 3 -88 51 -51 94 4 -205 306 -250 184 -12 -69 91 -35 19 -3 -179 -198 -186
7102 -186 -88 132 338 -122 -57 -164 326 53 265 1 -139 67 -9 206 308 185 -116 15 -61 53 114 -174
7124 -174 -12 237 0 -145 75 -204 222 55 -10 55 4 1 201 -102 92 -202 -96 111 43 152 -24 -133
7146 -133 160 60 -75 -218 -150 -2 28 16 109 82 28 57 -299 -228 -23 85 -74 -34 60 -69 80 -95 -346
7169 -346 -1 -11 40 57 280 192 195 223 57 -296 308 38 -177 101 63 -267 -65 -62 32 192 15 -44 -86 -84 -32
7194 -32 173 -114 -24 -377 -102 -275 190 -181 44 173 -71 25 -33 240 -210 -30 -15 -95 123 155 27 142
7216 142 -14 70 109 -37 -62 94 -112 -156 21 113 60 -44 -162 8 -139 100 -316 -90 -3 162 4 200
7238 200 -46 -138 -86 110 70 118 36 261 187 -7 47 -71 -142 -264 353 -246 -40 138 48 120 -198 -183 332 -200
7262 -200 58 136 -114 157 304 -5 -72 36 53 7 97 -46 115 -55 -171 -231 -333 207 -14 -363 -208 12
7284 12 174 -146 -75 16 -185 -178 -195 -36 -197 98 62 -237 -327 239 41 -176 34 82 126 -284 52 -74 -107 79
7308 79 58 -299 263 219 76 39 -222 152 -240 175 -97 23 -147 100 58 65 111 195 -114 -161 136 94 95 95 27
7333 27 -23 21 94 98 -82 280 50 -55 -62 -303 -134 54 170 -162 -108 29 -127 209 -21 -205 51 110 -77
7356 -77 -211 -100 197 -40 113 -310 -134 41 149 -21 77 73 -101 -69 -218 -42 52 93 -165 50 52 475 4
7379 4 32 -8 22 -13 -212 -70 -271 344 17 -260 -160 -9 163 -52 -55 127 297 7 81 -568 356 157 479
7402 479 682 527 198 27 342 -773 527 -170 62 -927 485 427 -200 138 -36 -370 -149 29 -135
7421 -135 -40 -197 -52 205 -222 -116 111 -89 95 -3 -105 -29 71 -59 -23 159 173 85 175 -193 32 36 -107
7444 -107 -54 136 -152 182 -73 -75 161 1 -286 46 199 -135 54 45 -110 287 257 -203 -160 35 90 -145 -173
7467 -173 85 212 58 112 213 17 50 30 -124 191 -1 -5 -285 -247 3 -29 176 -177 -229 277 -179 4 12
7490 12 6 200 -164 -81 97 322 87 32 317 170 -124 -116 -116 -169 -54 92 -31 191 178 112 38 84 122 33 84 -10
7516 -10 -277 -185 -166 36 39 66 -103 -172 -87 77 136 -144 71 -90 -114 314 -45 103 -14 70 310 217 -55 -40
7540 -40 20 -15 14 -132 -186 15 -90 -127 31 22 42 33 -194 138 -78 53 -141 -208 -163 151 -247 -3 40 -1 -86
7565 -86 -172 -53 -111 11 126 31 8 -149 19 172 198 159 -180 -76 -84 18 176 -71 64 -123 -60 -76 45 203
7589 203 -310 -39 -9 113 105 -85 243 77 -101 -75 -200 82 -34 -211 179 -115 341 -101 -325 94 -45
7610 -45 -41 196 -11 -173 219 -126 70 70 -114 -37 -13 -177 83 167 292 50 19 46 -11 -87 271 -77 290 5
7634 5 59 105 120 132 -49 115 191 -152 254 -205 25 -121 114 117 -100 266 66 316 -80 23 143 111 59 -162
7658 -162 104 -167 -20 39 -91 -57 74 -53 -308 38 -259 83 130 -68 -123 -11 26 141 239 -74 115 -133
7680 -133 -368 329 36 155 -89 169 15 183 248 314 -29 -14 -34 -255 46 28 -4 -280 -50 134 -466 302
7702 302 -250 142 -105 129 18 -76 79 50 192 -302 -82 -16 -159 196 -83 -101 -130 46 9 47 -14 140 2
7725 2 -93 -126 123 -107 -144 -225 -241 94 -89 -125 34 28 -165 116 10 52 -91 68 206 -56 -148 -60 172 -27
7749 -27 -28 111 129 -26 151 -69 -41 3 -56 -20 -109 -60 131 122 214 -179 -3 -269 -27 -193 28 -158 62 -77
7773 -77 -184 77 -67 106 430 -64 -22 -94 -11 -48 -156 -112 176 -71 344 -11 -22 55 -194 115 198 132 376
7796 376 331 -102 31 44 -17 10 -297 175 -36 -43 99 74 7 -337 111 -51 -41 -36 -66 211 12 -43 61 15 -217
7821 -217 212 38 -12 -183 100 -142 38 34 56 -292 49 0 67 267 15 -63 -123 38 147 16 45 -91 -87 90
7845 90 -238 -141 102 -43 -396 2 -145 272 -176 338 106 100 -106 -156 9 122 -256 46 93 -111 201 -216
7867 -216 34 -116 196 -104 36 41 -224 131 -163 14 168 120 67 31 71 14 -28 42 262 -88 -138 -9 -333
7890 -333 187 -26 -10 -95 35 164 32 -174 124 -351 127 128 133 -61 -109 78 -95 143 49 82 186 47 -56
7913 -56 26 110 -186 -127 61 213 -85 183 121 134 -92 182 141 147 114 132 55 43 -125 -116 -19 177 -58 87 -87
7938 -87 -1 201 112 163 -22 -101 -10 -142 203 78 -18 -23 247 -71 -359 -30 118 99 -5 -80 133 -33 19 83
7962 83 -118 -54 140 8 79 -27 24 -24 -53 -45 197 161 -50 281 -88 35 9 5 -16 138 107 -205 -60 -271 243
7987 243 -92 -147 -45 -85 194 11 59 79 139 -65 -155 131 135 128 -80 -116 -297 -9 89 -92 30 -178 -13 65
8011 65 8 -103 -48 -255 287 39 -174 -229 -39 35 112 -103 239 -174 -186 -137 -69 88 52 -199 130 -48 -100 232
8035 232 40 -200 -55 -107 -62 -275 -90 -151 15 149 -125 33 -272 110 -124 -96 88 126 -90 -92 194 -157
8057 -157 46 43 -476 -225 57 -138 -109 -148 100 79 0 -108 94 38 -129 102 209 -17 -104 38 29 -111 74
8080 74 125 165 119 15 -185 41 195 34 -103 151 -247 81 22 18 341 24 -144 -95 -235 11 -274 -7 158
8103 158 76 20 -128 9 -157 -87 141 100 8 326 -27 -193 -61 150 -163 -44 -144 -107 -89 -45 -38 1 301 120
8127 120 -75 94 -50 -145 300 -2 87 -40 271 75 140 79 58 239 6 -3 0 60 19 61 -280 -58 18 97 55
8152 55 251 156 -83 45 39 -47 -22 57 57 -26 97 -165 -41 -45 -9 -162 -183 -9 75 -48 81 -18 96 -41 236
8177 236 -141 -23 34 40 -165 26 69 369 68 -150 -58 175 85 -182
8191a82
##END NTUPLES=NMR FID
##END=
