##TITLE=1H_DE-162_oil_TFA
 200.13Hz, DMSO-d6+CCl4.
 8 sc
 9.7.2026
##JCAMPDX= 6.0         $$ Bruker NMR JCAMP-DX V2.0
##DATA TYPE= NMR FID
##DATA CLASS= NTUPLES
##ORIGIN= UXNMR, Bruker Analytische Messtechnik GmbH
##OWNER= pz
$$ XWIN-NMR		Version 3.5
$$ Thu Jul  9 15:06:45 2026 Russian Standard Time (UT+4h)  she@DPX200
##.OBSERVE FREQUENCY= 200.1313
##.OBSERVE NUCLEUS= ^1H
##.DELAY= (6, 6)
##.ACQUISITION MODE= SIMULTANEOUS
##.ACQUISITION SCHEME= undefined
##.AVERAGES= 8
##.DIGITISER RES= 18
##SPECTROMETER/DATA SYSTEM= spect
##.PULSE SEQUENCE= zg30
##.SOLVENT NAME= DMSO
##.SHIFT REFERENCE= (INTERNAL, DMSO, 0, 14.3821)
##AUDIT TRAIL= $$ (NUMBER, WHEN, WHO, WHERE, WHAT)
$$ ##TITLE= Audit trail, XWIN-NMR		Version 3.5
$$ ##JCAMPDX= 5.01
$$ ##ORIGIN= Bruker BioSpin GmbH
$$ ##OWNER= she
$$ F:/spectra/data/she/nmr/H-C/1/audita.txt
$$ ##AUDIT TRAIL=  $$ (NUMBER, WHEN, WHO, WHERE, WHAT)
(   1,<2026-07-09 15:05:35.76 +0400>,<she>,<DPX200>,
      <created by zg, POWCHK disabled, PULCHK disabled
       configuration hash MD5:
       00 E9 B6 7A A2 85 ED C7 34 08 36 98 17 FE 4E 26
       data hash MD5: 16K
       84 A6 BC 0A 8D 38 EC 22 C4 F1 19 E9 86 2B 03 BF>)
$$ ##END=
$$ 
$$ hash MD5
$$ AC 39 F6 81 42 EA 1F B2 8E D5 69 4C D9 2C 36 AB
##$RELAX= 
##$RELAX= 
##$RELAX= 
##$RELAX= 
##$RELAX= 
##$RELAX= 
$$ Bruker specific parameters
$$ --------------------------
##$DU= <F:/spectra>
##$EXPNO= 1
##$NAME= <H-C>
##$PROCNO= 1
##$TYPE= <nmr>
##$USER= <she>
##$AMP= (0..31)
100 100 100 100 100 100 100 100 100 100 100 100 100 100 100 100 100 100 
100 100 100 100 100 100 100 100 100 100 100 100 100 100 
##$AQSEQ= 0
##$AQ_mod= 1
##$AUNM= <au_zg>
##$AUTOPOS= <>
##$BF1= 200.13
##$BF2= 200.13
##$BF3= 200.13
##$BF4= 200.13
##$BF5= 200.13
##$BF6= 200.13
##$BF7= 200.13
##$BF8= 200.13
##$BYTORDA= 1
##$CFDGTYP= 0
##$CFRGTYP= 5
##$CHEMSTR= <none>
##$CNST= (0..31)
1 1 145 1 1 1 1 1 1 1 1 1 1 1 1 1 1 1 1 1 1 1 1 1 1 1 1 1 1 1 1 1 
##$CPDPRG= <>
##$CPDPRG1= <>
##$CPDPRG2= <>
##$CPDPRG3= <>
##$CPDPRG4= <mlev>
##$CPDPRG5= <mlev>
##$CPDPRG6= <mlev>
##$CPDPRG7= <mlev>
##$CPDPRG8= <mlev>
##$CPDPRGB= <>
##$CPDPRGT= <>
##$D= (0..31)
0 0.7 0 0 0 0 0 0 0 0 0 0.03 0 0 0 0 0 0 0 0 0 0 0 0 0 0 0 0 0 0 0 0 
##$DATE= 1783595135
##$DBL= (0..7)
120 120 120 120 120 120 120 120 
##$DBP= (0..7)
150 150 150 150 150 150 150 150 
##$DBP07= 0
##$DBPNAM0= <>
##$DBPNAM1= <>
##$DBPNAM2= <>
##$DBPNAM3= <>
##$DBPNAM4= <>
##$DBPNAM5= <>
##$DBPNAM6= <>
##$DBPNAM7= <>
##$DBPOAL= (0..7)
0.5 0.5 0.5 0.5 0.5 0.5 0.5 0.5 
##$DBPOFFS= (0..7)
0 0 0 0 0 0 0 0 
##$DE= 6
##$DECBNUC= <off>
##$DECIM= 32
##$DECNUC= <off>
##$DECSTAT= 4
##$DIGMOD= 1
##$DIGTYP= 9
##$DL= (0..7)
0 120 120 120 120 120 120 120 
##$DP= (0..7)
150 150 150 150 150 150 150 150 
##$DP07= 0
##$DPNAME0= <>
##$DPNAME1= <>
##$DPNAME2= <>
##$DPNAME3= <>
##$DPNAME4= <>
##$DPNAME5= <>
##$DPNAME6= <>
##$DPNAME7= <>
##$DPOAL= (0..7)
0.5 0.5 0.5 0.5 0.5 0.5 0.5 0.5 
##$DPOFFS= (0..7)
0 0 0 0 0 0 0 0 
##$DQDMODE= 0
##$DR= 18
##$DS= 0
##$DSLIST= <SSSSSSSSSSSSSSS>
$$ [...]
##$SUBNAM0= <"">
##$SUBNAM1= <"">
##$SUBNAM2= <"">
##$SUBNAM3= <"">
##$SUBNAM4= <"">
##$SUBNAM5= <"">
##$SUBNAM6= <"">
##$SUBNAM7= <"">
##$SUBNAM8= <"">
##$SUBNAM9= <"">
##$SW= 18.0517328524113
##$SWIBOX= (0..15)
0 0 2 0 0 0 0 0 0 0 0 0 0 0 0 0 
##$SW_h= 3612.71676300578
##$TD= 16384
##$TD0= 1
##$TE= 0
##$TE2= 300
##$TE3= 300
##$TEG= 300
##$TL= (0..7)
0 120 120 120 120 120 120 120 
##$TP= (0..7)
150 150 150 150 150 150 150 150 
##$TP07= 0
##$TPNAME0= <>
##$TPNAME1= <>
##$TPNAME2= <>
##$TPNAME3= <>
##$TPNAME4= <>
##$TPNAME5= <>
##$TPNAME6= <>
##$TPNAME7= <>
##$TPOAL= (0..7)
0.5 0.5 0.5 0.5 0.5 0.5 0.5 0.5 
##$TPOFFS= (0..7)
0 0 0 0 0 0 0 0 
##$TUNHIN= 0
##$TUNHOUT= 0
##$TUNXOUT= 0
##$USERA1= <user>
##$USERA2= <user>
##$USERA3= <user>
##$USERA4= <user>
##$USERA5= <user>
##$V9= 5
##$VALIST= <valist>
##$VCLIST= <CCCCCCCCCCCCCCC>
##$VD= 0
##$VDLIST= <DDDDDDDDDDDDDDD>
##$VPLIST= <PPPPPPPPPPPPPPP>
##$VTLIST= <TTTTTTTTTTTTTTT>
##$WBST= 1024
##$WBSW= 4
##$XGAIN= (0..3)
0 0 0 0 
##$XL= 0
##$YL= 0
##$YMAX_a= 280542
##$YMIN_a= -277570
##$ZGOPTNS= <>
##$ZL1= 120
##$ZL2= 120
##$ZL3= 120
##$ZL4= 120
##$ABSF1= 10
##$ABSF2= 0
##$ABSG= 5
##$ABSL= 3
##$ALPHA= 0
##$AQORDER= 0
##$ASSFAC= 0
##$ASSFACI= 0
##$ASSFACX= 0
##$ASSWID= 0
##$AUNMP= <proc_1d>
##$AZFE= 0.1
##$AZFW= 0.1
##$BCFW= 1
##$BC_mod= 2
##$BYTORDP= 1
##$COROFFS= 0
##$CY= -3
##$DATMOD= 1
##$DC= 2
##$DFILT= <>
##$DTYPP= 0
##$F1P= 0
##$F2P= 0
##$FCOR= 0.5
##$FTSIZE= 0
##$FT_mod= 4
##$GAMMA= 1
##$GB= 0.15
##$INTBC= 1
##$INTSCL= 1
##$ISEN= 128
##$LB= 0.25
##$LEV0= 0
##$LPBIN= 0
##$MAXI= 10000
##$MC2= 0
##$MEAN= 0
##$ME_mod= 0
##$MI= 1.114404
##$NCOEF= 0
##$NC_proc= 0
##$NLEV= 6
##$NOISF1= 3.799351
##$NOISF2= 2.8
##$NSP= 1
##$NTH_PI= 0
##$NZP= 0
##$OFFSET= 14.38212
##$PC= 1
##$PHC0= -4222.124
##$PHC1= 17.3923
##$PH_mod= 1
##$PKNL= yes
##$PPARMOD= 0
##$PSCAL= 0
##$PSIGN= 0
##$REVERSE= no
##$SF= 200.129724274929
##$SI= 16384
##$SIGF1= 3
##$SIGF2= 2
##$SINO= 400
##$SIOLD= 16384
##$SREGLST= <1H.CDCl3>
##$SSB= 0
##$STSI= 0
##$STSR= 0
##$SW_p= 3205.1282051282
##$SYMM= 0
##$S_DEV= 0
##$TDeff= 0
##$TDoff= 0
##$TI= <>
##$TILT= no
##$TM1= 0
##$TM2= 0
##$TOPLEV= 0
##$USERP1= <user>
##$USERP2= <user>
##$USERP3= <user>
##$USERP4= <user>
##$USERP5= <user>
##$WDW= 1
##$XDIM= 8192
##$YMAX_p= 0
##$YMIN_p= 0
$$ End of Bruker specific parameters
$$ ---------------------------------
##NTUPLES= NMR FID
##VAR_NAME=  TIME,          FID/REAL,        FID/IMAG
##SYMBOL=    X,             R,               I
##VAR_TYPE=  INDEPENDENT,   DEPENDENT,       DEPENDENT
##VAR_FORM=  AFFN,          ASDF,            ASDF
##VAR_DIM=   8192,          8192,            8192
##UNITS=     SECONDS,       ARBITRARY UNITS, ARBITRARY UNITS
##FACTOR=    0.0002768,     1,               1
##FIRST=     0,             0,               0
##LAST=      2.2672688,     0,               0
##MIN=       0,             -277570,         0
##MAX=       2.2672688,     280542,          0
$$ Real data points
##PAGE= N=1
##DATA TABLE= (X++(R..R)), XYDATA
0@%%%%%%%%%%%%%%%qJ6j6J6j6J6k4L2l7M5m8N6o9Q1r2J04j20J36j57J78k01K26
37A18k51K81l13L52l92M32m80N33n91O54p20P93q74R63j062J168j287J420j568
56h24J739j932K152k409K713l078L528m098M844n878P424j0009J5502n0491J3644
71b7173j03327j47070R5263L2370n0974P6542J46069J6804M2580J20052j1338
82A89798r7349O0716M6719j13459o4615J0597r7287j00127J8500R817m6978M8154
94a35514J07435k796j4193J06514N8035l0587L9465L9248o9336n0196Q899n4372
106B602q6768J0028K9222o1437k3877P1720J0221k1845P3874O0800j7663J8129
118F5006M1566k4942l8860J5814q025o7112j9074J1811n6542l3555N0551J6881
$$ y = [0, 0, 0, 0, 0, 0, 0, 0, 0, 0, 0, 0, 0, 0, 0, 0, -8, 8, -8, 8, -8, 8, -16, 16, -21, 24, -24, 32, -37, 44, -48, 56, -64, 72, -85, 93, -108, 118, -133, 148, -165, 187, -205, 227, -253, 280, -311, 343, -377, 416, -458, 505, -557, 611, -676, 744, -824, 915, -1017, 1135, -1274, 1439, -1639, 1889, -2209, 2635, -3243, 4181, -5828, 9674, -40817, -27173, -130500, -277570, -182307, -149937, -200911, -124369, 21700, 38504, 81084, 201136, 189798, 92449, 153165, 199884, 86425, 21810, 32407, -64880, -165007, -146507, -136690, -183668, -135514, -28079, -30875, -45068, 61446, 119481, 88894, 128359, 167607, 98271, 48075, 56974, 2602, -84166, -74138, -44916, -106353, -130230, -58510, -48289, -70134, 3740, 64540, 46877, 65006, 106572, 81630, 42770, 58584, 50559, -16553, -35627, -23816, -80358, -113913, -63362, -46481]
130d6481j7349L7889M8010L570R025L8098Q589k3191P429l077o0796k8469J4750
143a2003k7478l5296J2016J0924r291J4204L6674J4528O543L9706J9833k4128
155D6232M789J9294k6664k8756o154k1655k8610p192j760j4205J012L0749J2730
168b0190k475L3323L1503j645P378J0398j1842j0552n168j6726k6914j4444o6
181b7420j5743j3675J7693J1158k752J6070J8149Q975J2799J0935M108l212m521
194C2564l641j5161j3845k867j5709j5656K636p90j325R837J0598J0664Q938J0757
208A7000J0642k69J438M406j3717j4169j706q475j0264n996m529K002K288L515
222a7834Q326N918J0234R716k542J293O562k595l259o573j0254l758m057o004
$$ y = [-46481, -63830, -25941, 22069, 25639, 34664, 72762, 81351, 58160, 65589, 62512, 1716, -26753, -12003, -39481, -74777, -62761, -51837, -61128, -46924, -10250, 4278, 10821, 50527, 70360, 46232, 51021, 70315, 43651, 14895, 8741, -12914, -41524, -48716, -50476, -64681, -63669, -32920, -20190, -22665, 10658, 42161, 40516, 47894, 58292, 46450, 35898, 30730, 14004, -12910, -27354, -27420, -43163, -56838, -39145, -27987, -30739, -14669, 3480, 12455, 25254, 36189, 40297, 37085, 32564, 28923, 13762, -83, -2950, -18659, -34315, -31679, -32469, -33794, -23957, -13359, -2695, 6243, 17000, 27642, 27373, 28811, 33217, 19500, 5331, 3625, -4850, -15114, -21110, -25639, -23637, -21349, -17834, -9508, -3590, 6644, 16360, 13818, 15111, 21673, 19078, 15819, 9246, -1008, -4766, -8823, -14827]
236a4827l473k797N683O014l047O736J2376N606M845L72k189K240k988o253o297
251B001p969k555l163p926K029M336K952N559J880L631Q974L103J054J525l021
266A2410j180m224n991j928m877n074p67l957K45N285M95N105O516J321L947L312
282A0638K632J796m117l500j406p142k934r49n997q6J348j115L111K819M697N874
298E669L36J285J699p49K369j858o962r63r22m105k534k174K206K342k724J167
314e918M021K236M891O89k280K587R78j897k115l714k73n34n463j063J600N81
330e674K991j0J70M325J902R14J870j823Qo05l204Q0j673k254J361k340k070J765
348d267O28K424J602j200K450K462o25K085n61k83R7l888k013O34l125j010L06
$$ y = [-14827, -18300, -21097, -15414, -9400, -12447, -5711, 6665, 12271, 17116, 17488, 15299, 17539, 14551, 8298, 2001, -5968, -8523, -11686, -19612, -17583, -13247, -10295, -4736, -2856, 775, 9749, 12852, 13906, 15431, 12410, 11230, 7006, 1015, -913, -5790, -10864, -11631, -15588, -15343, -10058, -9563, -4458, 2058, 3379, 7326, 10638, 13270, 15066, 10949, 7449, 6043, -1099, -4033, -4982, -10979, -11065, -9717, -10832, -7721, -4902, -205, 5669, 6005, 7290, 8989, 8240, 10609, 8751, 1789, 826, -96, -4201, -6735, -8909, -6703, -4361, -7085, -5918, -1897, 339, 5230, 5919, 3639, 6226, 7204, 5307, 3192, -522, -795, -1329, -6792, -7855, -6255, -5674, -2683, -2693, -2523, 1802, 3704, 4618, 6488, 4665, 4673, 4068, 864, 944, -729, -2983, -1622, -3962, -6032, -4267, -3639, -1215, 387, -813, 1637, 4099, 3474, 5559, 4998, 4715, 4812, 924, -1089, -455, -3580, -4590, -4284]
365d284j869J539M82J870M013N15M90J282r61J085L93l587p8n58k332n30j559
382d089R58K097j408k68J296J79K937O09j636J681O74m02p9q76N33l98k909n76
400a677j57j780J921P09j666J071J260J804J317j148N84N44j547p06j226q86K313
417G30j434k729J171P56M35J084l55R49J2n89J475p21k18K259j737j738R31j099
435h18l73J81q27M56n21J78K463k80P6J880p66mJ117k236j05Q4r85p73q25J188
455h90R36j610j77J720j237J103J748j283l25J256p04Po8J070l91j988M26m38
473h45k504K091J490k335mJ445O28K00K60J881M27j817P78j078j997K130M92k502
491a260K89N65k95j58N40J209r93k83K200j812j605L485k23k388J120N03r39l97
$$ y = [-4284, -6153, -4614, -4132, -2262, 1751, 2266, 2756, 4038, 3077, 4162, 4555, 968, 890, 332, -2000, -2530, -4089, -3131, -1034, -2442, -2710, -1414, -1235, 1702, 2311, 675, 2356, 3030, 2628, 2549, 1673, 2206, 1808, -1101, -1677, -1834, -3614, -1693, -984, -2650, -1579, -319, 1485, 2802, 1654, 2238, 2782, 1235, 529, -697, -1583, 730, -704, -3433, -2262, -1506, -1071, 13, -342, 607, 619, 30, 1505, 784, 566, 2825, 1088, -650, 281, -818, -1191, -1010, -1837, -1381, -1902, -1724, 739, 459, 535, 2415, 1649, 1645, 2762, 526, 421, 505, -480, -1253, -2078, -890, 46, -1564, -1741, -21, -1258, -155, 1593, 310, -15, 1241, 537, 544, 476, 1546, 1155, -833, -407, -845, -3349, -1258, 232, -2103, -2107, -662, -34, 166, 426, 2307, 2734, 917, 1695, 617, -1380, 750, 1242, -1260, -971, -406, -701, -859, -319, 890, -103, -386, 1814, 2, -1603, 1882, 1659, -729, 391, 894, -45, -442]
509d42Q14r9k021O16K227j897q99K800q54j255J550m5o77P93J36q32j115R32Q31
528E63j612L55J802k064L45J860p05r17J259O17j113j429J349R45k067M76Q04
545D68k007N43J230k20m89L26J100k07j157J552L88j281M04K4j773J076J544j903
563c82q66M86O93o07k12J383j81j143J407k11j221J412J138j546n12p7R12p27
581b54n44J398r16j443J571j61j106J573J016r63j92K47p6J69J24O97j206l70
599d36J207q84p94Q82L40m21J9L47m40n2O04l88r85Q8Q97k47m38M64L5N37l8k38
621E9o5k40M57L53p39j180K113p92l42k51P81j69K67J66m30K9m59P04r68K82N89
642A65l68J74J132j397P80l15P71k62n79L5q83R5j34J348j020P7R05r44j20O88
$$ y = [-442, 372, 273, -1748, -1132, 1095, -802, -1701, 1099, 245, -1010, 540, 495, -182, 611, 747, -85, -1200, -268, 563, -1049, -694, 1108, -956, -611, 1249, 544, -373, 886, 1503, 390, -1039, 310, 1255, -812, -336, 468, -1539, -996, 234, 14, -475, -149, 951, 744, -413, 1139, 1527, 246, 650, 674, -1099, -23, 1521, -382, -1248, -762, -69, -676, -888, 495, 314, -829, 578, 367, -854, 558, 1696, 150, -362, -439, 473, -254, -798, 600, -316, -1759, -188, -349, -1455, 118, 1134, 171, -21, 226, 150, 319, 443, 1140, -66, -436, 771, -113, -907, -25, 315, -106, -87, 260, -180, -232, 372, -16, -1001, -913, -16, -263, -701, -237, -202, 335, 297, 59, -6, -246, 211, 564, -175, -1355, 758, -34, -376, -627, 154, -15, 252, 418, -12, 17, -442, 262, -706, -424, 165, -203, -29, 1103, -294, 486, 171, 942, 680, 101, 136, -747, -652, -786, 562, -458, -381, 524, -420, -540, 148]
662A48Q7j6o16M49N0J19M39k89j039P43l5q52N25M30l95m08K60N58m8k18J158
683A050o88p61O90J10l45L48r5l08J05l91O08k71n3O42r23j73L82K92k12K40n50
704c03L92K6j45K29j50r0J19l35l45P10n4k58k7l47K96K82k54M83k89n15N97n3
726c1k68N03k24K71o8l27K79K78J62j12n50n1N75n03R7K5O2Kk06l8J76k94O05
749C63On63J48L68j87M0R0m43K95P07p79j84l26j50M99k01K58L44j37j84M36p61
771c61r4M05K14K45L6j176J646j193J406j333q95J456l45k56N29r25J142L51r61
790a09J10K50m96O59m25P0L58l61j1j52K03J01r8m25N07k27m12O94l69Q0J98l79
812b34R8K44l30M82J65n93R7q4J12L51l36o9L4j35J22L14l91L3J32l28K72q9L27
$$ y = [148, 235, 219, -397, 52, 102, 221, 660, 371, -668, 75, 40, -812, -287, 143, -252, -660, -400, 158, 110, -108, 1050, 362, -399, 291, 401, 56, 404, 309, 1, 106, -285, 323, 52, -1, 641, -282, -455, -73, 219, 7, 247, -303, 89, 115, -30, 199, 49, -41, 78, -257, -602, 108, 54, -204, -231, -578, -282, 0, -254, 229, -60, -575, 22, -31, -299, 204, -20, 251, 183, -144, 135, 413, 575, 463, -87, -138, 437, -66, 31, 56, 118, 120, -86, -124, 52, -242, 363, 369, -194, -46, 322, 135, 175, 265, -178, 117, 824, 45, -139, -465, -615, -116, -317, -59, 285, 148, -36, 400, -361, -455, -50, 164, 409, 445, -731, 915, -278, 1128, -205, -1100, 356, 11, -245, 284, -641, 501, 852, -109, 1, 251, -245, 414, -11, 59, 417, 56, 45, -107, 96, 197, 99, -326, 181, -46, -458, 236, -133, -53, 145, -234, -136, 108, -222, 260, 425, -168, -71, -155, -43, 308, -28, -97, -63, -198, -76, 238, -153, -120, 12, -316, -44, -133, 194]
835A94K98o65J20P1p1K98k09l11K99K36p20N58P5j89J1l61J91N1p2M33j66l04
857b33R0J54M08k90l73K96N2k14K48j27kN70o34p3R5N2K44R2o91K00J71j35K32
880A32J19j75k93J7M25j59j42N19l04p9Q2k13j08M98l77l8N7l7Q6N7j52LK46m25
904b61J93QK2J47k38J40J25k43L11q5l56L04p3k5nj03K19K71m59J70k00L14J02
927B78k42j3j51P1Q8L3k02J41J88j49Q5j86K08Q0q55J034p78L4K05J128j039k22
949b64L01p5J71j63K57P7k77m4j62J39L34l37k8L69r6j81K95l37j76L93k70K24
971A50o6k00J79P8j60J92k05j76N03k78k33J92J30J05n0j08j24R3j7lq6J9L49
994B84l29J53j85k72L77O6j09K9l83N17K47l05j09l3J25p0J07L3j72L38m11K36
$$ y = [194, 492, -173, -53, 18, -53, 245, 36, -275, 24, 260, -460, 98, 173, -16, -5, -366, -175, -124, -196, 237, 71, -233, -143, 11, 419, 129, -244, 52, 104, -110, 138, 11, 9, 579, -55, -128, -33, 19, 263, 355, -336, -136, 35, -100, 132, 251, 76, -217, -200, 225, 66, -76, 443, 139, 60, 142, -71, -179, 319, -58, -96, -39, -76, 10, 67, -85, -82, 164, -261, -68, -60, -38, 109, -129, 11, 136, -107, 204, 119, -237, 67, -6, -31, -36, -139, 80, 351, -108, 62, -138, 176, 278, 36, 23, -128, -57, 31, 64, -138, 3, 191, 42, 127, -59, 149, 229, -626, 408, -370, -336, -131, 997, -42, -264, 37, -38, 133, -30, 227, 304, 27, -17, -179, -40, 294, -43, -71, 298, 202, 21, 316, -21, -197, 196, -74, 150, 84, -116, 63, 141, -19, 173, -32, -208, 295, 17, -216, -24, 106, 211, 161, 53, -71, 22, 5, 2, -84, -65, 284, -45, 108, -77, -349, 28, 94, -15, 14, -369, 148, 395, 90, -19, -52, 73, 3, 110, 143, -29, 309, -102, 134]
1016A34k74J67o3j60N20m58J06LQ7k80L96k57j98K51J25j79N6P7J69K6k83k96
1038c31M15n7Nj02L77k01l80K10L55k55j78K34N6k26Kj0J83l31K52Q8j89J50o0
1061Gj7KJ81j23o7k2J18r1r9j98K36K34k68K00l79J45J65p3m5p6K14l54M63Rj84
1086b2K92l38J16l83N33k56N4k66K77K2j84J86J3l22J84MJ3J06J38KRM7r6K44
1110C73m64P3m1K31q3j77k1J09o3K30k23J0K6K67q2k50K47k08J83r4l9Ro4p9P6
1135e4N6J06k58J63J06q3q5K6O6k75L75j72Lj45J42j3j03L92k59k04O4K45j42
1158d9l3K24l18K26n9j49p1J10Q5J86n9j45O6k25%R1K53k65J65j49J05j33o6K32
1182B2J12l22K7J64R9nr4J23J37l14j31M2L05j88j8K61j20k0l39K08r0J51l28
$$ y = [134, -140, 27, -36, -196, 324, -134, -28, -25, 62, -218, 178, -79, -277, -26, 99, -80, -24, 53, 222, 248, -35, -331, 84, 27, 32, -70, 307, 106, -274, -64, 291, 36, -142, 92, 148, -78, -76, -86, 97, -234, 18, 106, -83, 67, 7, -10, -8, 173, 50, -17, -39, 79, -12, -111, -309, -73, 161, -107, 93, -286, -141, 24, -49, -94, -170, 44, -310, 153, 162, -22, 270, -68, 48, -335, 198, -58, -4, -270, 7, 29, -155, 31, 44, -278, -94, -90, -77, 29, 167, 169, 178, 225, 129, 373, -91, -18, -59, 172, 89, -88, -109, 0, -63, 167, -56, -46, -20, 247, 165, -85, 162, -46, 137, 43, 4, 13, -51, -130, -54, 2, 108, -150, 13, 119, 36, -49, -23, 43, -232, 143, -29, -26, -171, -29, -42, -145, 247, -12, -216, -152, 93, -49, -82, 142, -176, 50, -9, -158, -229, -119, -34, 152, 93, -52, 14, -211, -211, -120, 133, -132, 33, -116, -11, -144, -210, 22, 134, -188, -161, 3, 102, 97, 3, 126, 263, -51, -182, -140, 165, -23, -41, 220, 100, 80, -259, -51, -141, 10, -318]
1205c18mJ86J63L3j56k2K4K75k36j64K78l76L05J31j0k16r7L34r7q7M6P7J8J87
1229B74j80O3k74J34j22L8J01J75l63m5J57Q6j38K09k7l7M2Lj72j88L08k28M53
1252B69j54o7P3j30m57N88m5j96J14j75K20p9j35K96j70J1Q2l9J34j43P2K6q1
1275A4P2k38OO0m8k3J71j38K7J17J13K2nk95m5J85l52N16J5j28J75j40k17J42
1299FJ82k81O3q8M58l01K09j55l52K58Q1J68l05m7Om9q4L07K56o11L85j11K5J95
1323B15n02N71k24j9k71K80j12k1R9K74m08L32l8k76L0j25K01J51r1j70K09j73
1345f8r8K12Rj08r5k1K4M0p6P7j02J07J10K43k27%Q6j59J56k15R4n4j0j5L39j64
1371H5j19jJ23j15P5M0j43M29m23N8n5q5K72k4j49n4L20P0l18o0j6p8K21l73p8
$$ y = [-318, -322, -136, 27, 60, -96, -118, -94, 181, -55, -219, 59, -317, -12, 119, 109, -107, -204, 130, 33, -54, -8, 69, 87, 274, 94, 157, -117, 17, -105, -67, 34, 209, -154, -199, -42, 44, -94, 115, 88, 51, 93, 96, -76, -264, 44, -184, 269, 115, 48, 121, -9, -466, 122, 77, -119, -5, -180, 40, -39, -174, 122, -48, -37, 45, 6, 140, -3, 69, 95, 14, 86, -152, -146, -86, -134, -157, 14, -124, -97, 20, 133, 155, 150, -145, -190, -5, -357, 159, 174, 46, 221, 81, -136, 6, 188, -93, -30, -118, 340, 39, 248, 93, -259, -1, 80, 248, -57, -104, -98, -147, -231, 76, 332, -279, 106, -5, 20, 215, -287, 284, 60, 41, -230, 50, -62, -83, 16, 290, -118, 214, 176, -100, -70, -195, 6, 157, 66, -104, 105, -68, -166, 46, 55, -53, -148, -169, -145, -105, -181, -104, -206, -99, 11, 254, 27, 27, 113, -46, 110, -105, -11, -65, -75, -90, 249, 85, -34, -35, 88, -27, 48, 88, -55, 374, -49, 9, -46, -131, 141, 117, -32, -86, 234, 304, -14, -74, -90, -168, 53, -320, -398]
1396c98J67K68J2j11R9j92J14K5K65J10k04j90M3n2J40j78p9J28j24J58q0K32
1418A53l86J86m7L52k79j24rJ5O4O1j54M07m15l0J82K17q1j3Lp6j74K27k04J49
1442B4P7k22M8q2l4J10Q5L0r6k53K46o2J21J08j33q8R8K42l23L26j35j18J06r9
1466b4J67j55QJ55q5P8r7q4K01j83j31P6K3j91K19M6o7j8k72L75o9M9J09k83P3
1491h0J49J69q6l23q2L19j29J89j71J21k78K86N9K3j22m1k13J89p7J28j16l34
1513d20M39j32r5L79l20K52k56M12n18Q6K48n7K25k95j85N38k56J60j51r9K17
1534A72m67J59r3J34K23m2pq8j83K49j7k00J98j92K18r1N9J30j98j24M2R9k39
1557b58K39K5k27J49j41J02J80l58K09J9O5k04OL76M9m04L88k09r5O8K38j86j49
$$ y = [-398, -231, 37, 49, -62, 37, -155, -41, -16, 249, 359, 155, -35, 8, -44, 96, -82, -161, -33, -157, 1, -79, 153, -233, -47, -94, 258, -21, -145, -154, -139, -75, -14, -168, 239, -176, -206, -24, 193, 112, 99, 102, 26, -148, 79, -125, 24, 101, -121, -73, -155, -189, -79, 6, 36, -60, -313, -67, -129, -8, 100, -33, -121, -23, 219, -104, 222, 87, -31, 75, -24, 143, -12, -4, 151, 66, 144, 47, -37, 164, -19, -150, -74, -51, -242, -23, 23, -44, -62, -334, 41, -28, 21, 130, -153, -80, 69, 238, 152, -171, -253, 66, -63, 126, -45, 76, -202, 84, 143, 166, 44, 3, -210, -21, -98, 30, -86, -420, 19, -113, -208, 171, -149, 103, -153, 259, -259, -173, 75, 18, 243, -52, -237, 301, 45, 205, 54, -45, 172, -295, -136, -229, -95, 128, 86, 79, -9, -192, 57, 40, -160, 38, -154, 64, -27, 32, 162, -36, -160, -118, -19, -258, -19, 6, -221, -72, -213, -111, 69, -289, -80, -61, 4, -200, -194, 182, 231, -173, 215, 6, -89, -21, 217, 31, -118]
1580a18J95J79l25J19J26l73Q9M16n07J91J63k51K12j61K25k64Q4p2J40m7J3q
1602B6k37K99J03j35K4J94j55k7o8M06k80k62o0N11l40K5J16Q1j7q5l57J68J52
1625H2j26P0N9k29Q2J61K60m04m5K26k07Q1P4jk84N34j83Lk30O9j34k0J32M4q5
1650g1J32k5j86M90m50J25o5R6j86K30k13j41J76J30J47k88J69q2MJ33j24k13
1672b12K11P0j23O2r2Q4r5r6J63k03R3K57J3j74Q0J9j12J06OQ0j06J50R3k30j34
1697i0J08J4m39N67p3j4j96j91K3K58M11n34P6N09j163Q33O09k63l07k41l91K48
1719b46L03l59M31j52M6k60M33l82K85k8%n34O44j26J5r3Om2J25N9l09K9O32n71
1743i4N3J32J82p7L8k90oR7n5O9k76K78j73j1K41K72n64L42k09p3L43k88n6K11
$$ y = [-118, 77, 256, -69, 50, 176, -197, -108, 308, -199, -8, 155, -96, 116, -45, 180, -84, 0, -72, 68, 21, 34, 26, -211, 88, 191, 56, 80, 274, 119, 92, 24, 430, 150, -112, -172, 339, -1, 24, 140, 221, 204, 119, -238, -70, 82, -44, 26, 85, -144, -62, 99, 359, -45, -90, 136, -71, 10, 84, 83, -201, 333, 150, 153, -77, -8, -142, -162, -30, 14, -71, 61, 36, -150, 340, -110, 15, -50, 46, -140, 90, -123, -264, -88, 42, 189, -99, 70, -12, -8, 125, 1, -212, -1, 69, -54, 8, -84, 0, -95, -191, -28, -231, -138, 119, 132, -42, 38, 57, -55, 51, 57, 137, 31, 181, 274, 44, -90, 18, 32, -407, 160, 87, 73, -123, -314, -291, -33, 378, -156, -80, 429, -734, 99, 708, 445, 138, -103, -494, -246, 57, -302, 129, -23, 23, -237, 196, -186, 99, 71, 71, -463, 181, 55, 70, -23, -17, -59, 66, 125, -184, -155, 477, -94, -41, 91, 273, 196, 234, -56, -62, 35, -20, 49, -227, 51, -122, -133, 108, 380, -184, 158, -51, -124, 219, -69, -125, 86]
1767H6n6j48K38k77J36K39L8n78M69J8j2L6j82O4rr7J0k23K58j21qp0r4K10K88
1792B15j65j14m2K03Mj12J54p4p5J91l72Q2L77n69K48j2L79l80N8J30k20rN4O
1816d3r9qk6L38k47p7R3J83k41L14N1j84m6q5p2J67j62Q2J70j25J30j68jj4j09
1841a79j9R9M0mL48k17j75K36l78J62J91N6R4j08q7j47Q1r0r4L6K18m7J8Jo8k7
1867f0j55K29j56K5R4j20k8M07l85k3L06j04j01J02j22j09J29m6Q4J52kJ50l67
1890a00P4q4J74r2k15O6J40J16j04pJ98l43J74j42k81M48r4P4J02j42K75l84K84
1913A37r4O5J53k22k7j9L38k56M5j04m3K3lL41m42J32k69K2O2J15Q9k2nj18K36
1938A34q1J03l22J14J9J77p6k3j07J54k92L06j15OM6n6l0Qj35P6L53m26L23m3
$$ y = [86, 30, -118, 120, -157, -21, 218, 256, -322, 147, 165, 153, 189, 7, 71, 62, -35, -25, -248, 10, -111, -119, -189, -283, -73, 215, 50, -64, -106, 97, 101, -11, 143, 69, -6, 185, -187, -105, 272, -297, -49, -61, 318, -62, -4, 126, -94, -103, -49, -43, -142, -150, -176, 162, -85, -162, -69, 114, -127, 187, 238, 54, 8, -77, -149, 18, -144, -62, 108, -17, 113, -55, -56, -70, -179, -198, -99, -59, -63, 285, 68, -107, 129, -249, -87, 104, 160, 254, 146, 59, -88, -7, -97, -191, -155, 63, 16, 34, 35, -33, -60, -215, 14, -142, -117, -23, -143, -171, 236, -149, -172, 134, 30, -71, 31, -91, -200, -71, -117, -33, 119, 117, 267, -100, -26, -110, 64, -28, -243, -177, -37, 79, -25, -32, 166, -177, -3, -145, -426, 22, -72, 2, 104, -38, 237, -147, 137, 43, 108, 261, 39, 12, -7, 331, 75, 120, 16, -27, -4, -7, 334, -108, 24, -245, -223, -161, -46, 43, 21, 16, -102, 134, 53, 156, -166, -52, -33, 144, 68, 45, -62, 92, -200, 106, -9, -3, 43, -13, -43, -35, -170, -94, 259, -167, 156, 113]
1962A13l8j69M6J7J30r0r3J33l4O8k76K03Q6l55M28p0l70K88K56m04L28ok63q5
1986a57R0J45n5N1N4j51RJ1q7J40j81J00K44k00j06K27kk81M80j96k84p3L15K
2010I5l3r5J22j52k05N61k37j63RJ29K40n71L57r7J41j17n1k8L79l49J8N6j47
2033a38J93q3j96Q1N7K8J82p6J84L8j99J34k33L4j74J93J73l41O6J27M8j76K14
2056A36l18K6N5K37l08O8J00M6J30n79M64r7pK25j32K60j24k31K82m46L10J98
2078B95k80M2J78j18j54j22j37N39l07J69j58O4n5m5M1J56j95P2K7l51N27k57
2100f9pK56l95K30j22J67lk66p0M95l09m6J13k37J74K70j56p5q5J66K29l08p1
2123a19K11q1j05J44k34J44K43j87k41L42k32M6m7J61k1k6o0J81k7j32J5Q0l8
$$ y = [113, 75, -94, -48, -31, 99, 9, -84, 49, 15, 83, -193, 10, 96, -259, 169, 99, -271, 17, 273, -131, 197, 191, -72, -157, -67, 78, 23, 74, 128, -23, -14, -3, -90, 50, -131, -31, 213, 13, -93, 134, 132, -149, 331, 135, -149, -222, 93, 95, 62, -33, 89, -63, -268, 293, 56, -107, -98, 31, 271, -300, 57, -40, 101, -16, -67, -95, 284, -65, -47, 9, -138, 55, -28, -224, -143, -86, -58, 124, 48, 232, 270, 71, 205, -28, 6, -168, 25, 198, -143, -77, 50, 98, -78, 136, -182, -156, -101, 136, -172, -104, -4, 42, 172, -407, 57, -40, -47, 178, 46, 306, 182, -49, 233, -213, 97, 295, 15, 57, 235, 117, -37, -159, -296, 243, -64, 105, -53, 11, -44, -89, -48, 108, -87, -15, 12, -339, 188, -69, -76, 180, -215, 15, -107, 60, 57, -209, -279, 216, -93, -139, -26, -263, -89, 181, 25, -50, -135, 31, 260, -48, -119, 92, 11, -94, 50, -184, -40, 203, 16, -225, 117, -115, -69, -116, 45, 24, -2, -62, 119, 92, -40, -25, 55, 17]
2146A7k37O9K97m5k34N1K26ok29J31j74K95j40j34O0L42o02K79J25k74K17o0n1
2169g7k77K73L69k08k61J93L6R4k94K88j65Q0j05M2J25J70l46R4q5J07k18L19
2191A54q3k34J42R7k84O20m65j12J51J22R8j43N4k03N7M1L19l23J42l81K21n9
2213f9J57k06J71N0k81k0L09j40K6J98l63J08K05j24K85l82QK71Oj73j46J30q4
2236f4o9k63L06N0J10q9K24k00J26q7k21N0K9k2J32K94m61l9J70M7n05M68l0K14
2260A70l2j19j03J08J14M8k53L26l16k0J53j94L38l16L19l94J87K20k25J05l03
2281a87Q9J75J68N9k61j55q4K38K19o24M86M4j09j95L08k14K8k23p3L49J0m03
2303c55O73l11k25K26N4l98J87K81l12M4J24k02J3M4m2J86k18J85Q7Jj13Mr0K69
$$ y = [17, -220, -151, 146, 101, -133, -82, 144, 138, -91, 40, -134, 161, 21, -113, -53, 289, -313, -34, 91, -183, 34, -26, -77, -354, -81, 288, 80, -181, 12, 48, 142, -152, 136, -29, 51, -54, -12, 113, 283, -63, 31, -54, 53, -165, 154, 71, -163, -21, 76, -208, 412, -53, -165, -14, 108, 206, 63, 117, -86, -29, 12, 331, 8, 150, -231, -10, -69, 88, -118, 53, 103, -178, -198, 111, -29, -3, 195, -168, -60, 145, 21, 306, -76, -68, 203, 209, 36, -110, 20, -64, -133, -396, -90, -40, 70, -19, 205, 5, 131, 44, -177, -127, -98, -120, 12, 306, -155, -194, -24, 23, -482, -14, -44, 170, 138, 19, -84, 24, 138, 186, -67, 259, -57, -77, 76, -118, 220, -96, 223, -171, 16, 236, 11, 116, -187, -98, 77, 245, 304, 43, -112, -196, 42, 261, -363, 123, 167, 58, -137, 171, -43, -15, -238, -311, 38, 48, -355, 318, 7, -218, 8, 62, -336, -149, 132, -180, -136, -12, -214, -201, -157, -199, -13, -231, -46, 41, 42, -71, -67, -157, 112]
2327A12J2j76M2L8J11m1K8M8o2M0p5l1l85L50j55J0R1J4P8NOl3m5P9j74Q1K4l
2355a1k75J33R8L0n9p1J42j0J44k41j41K97J77k50J96j45L93l16k55M7QK15k10
2378a04K52m15L30k36J15J53k44j29N40r9l33K47l17K88Q7k15J61l09N2J69k0
2399b7n6k33N03J37k45k44J09J89k33pK4L9O9m0M9K8J9Oq5q3J47k50K42l7m6j37
2425a62K51N3k77J42R7R2j34M2k49L56k2lk03K05l32N7J62M3j73Q9j69J11Q1q9
2449c2k0r8M92o41N07l39N1J51j24J20k5L7K07j60r8J67m68J95J52o4j87J92J10
2472A25k99q5K36J27k63K54%K9J8k14j04J63J36j18n5N2J12m23L47j41L1M4J17
2495H9J03J2N8J20m02J07nJ59k01K52j24r6k2r1j5l0R4R7Q8k60j08K93l1k58Q4
$$ y = [112, 124, -52, -10, 28, 139, 98, 126, 174, 112, 152, 77, 46, -339, 11, -144, -134, -43, -29, 49, 54, 60, 27, -18, 61, -113, -32, -8, -11, -286, -153, -55, -25, -84, -155, -13, -23, 121, -120, -261, 36, 213, -37, 159, 14, 407, 91, -164, -117, -109, 106, -104, 148, -267, 63, -173, -58, 95, -149, -278, 262, 163, -170, 77, -240, 48, 135, -80, 81, -228, -176, -7, -27, -83, -316, 187, 324, 79, -165, -56, 133, -100, -107, -83, -44, 25, -15, 34, 62, 81, 87, 2, -81, 66, -184, 58, 21, -25, -162, 89, 142, -135, 7, 104, 196, 62, 104, -145, 211, 189, 186, -17, 188, -144, -87, 75, 118, -55, 34, -135, -24, 57, -32, -52, -150, 342, -299, 208, -131, -80, 71, -53, 67, 42, 79, 286, 126, 28, 195, -273, -78, 74, 10, -177, 15, 125, -174, -259, -23, 104, -159, 95, 95, 124, 142, -72, -176, -13, 123, 5, -50, 2, 114, -309, 38, -103, -72, -28, 89, 192, 204, 262, 382, -20, 87, 82, 241, 40, 292, 168, 72, 50, -41, -56, -86, 8, 105, 193, -67, -175, 118, 87, -171, -87]
2520h7k3j14K34q2K81q6m9J98j37j35N6r7Q0J4q6K38k20j57M33m12k7M94m24j2
2544a20M8J20J08k10L10n6l08K4J16r4R7OO3j84j8K67j31J56k07j74P3M12m49
2567a51Q5R9k76K98om9q6m1K47l94J64L1R1Qj40L28l44K07J57r1r4J12l89j1k8
2592b73J57J98P6j40J76n19%M08k44K16l0J34l19J99l61K17j00M27p5j64l9J79
2614A23R3k93N38o14n4K55j1j7j34J69j81K28j19J65k03J40j33q3K07j87J44j74
2636a41J97P3j67n6k8N7P7o1K12P3n8k56O8k51L55p5J13k88L53o8j43j9J51j22
2660dJ14j72N4j07J55J91j19j04J39K56l89k04K96q3j86K14j95J23J93J1l05L94
2682B72l98K14m1j50m0K8N2j85J57j4L4L74k67j98K41l32K18k5j88L22m3r0O2
$$ y = [-87, -110, -224, 10, -72, 209, 123, 74, 272, 135, 0, 56, -41, 39, 53, -33, 205, -15, -172, 261, -151, -178, 316, -108, -120, -72, 48, 156, -54, 256, 200, -108, -84, 32, -62, 35, 41, 104, -80, -98, 169, 38, 194, -13, -187, -114, 298, -151, -66, 33, -243, 55, 49, 0, -86, -127, 120, -274, -110, -79, 12, 20, -120, 208, -136, 71, 228, 137, 43, 155, -234, -245, -273, -116, 82, 158, 18, 194, -325, -325, 83, -161, 55, 25, 159, -160, 39, -322, -105, -205, 222, 147, -17, -56, 123, 216, -77, 461, -153, -207, 48, 37, 20, -114, 55, -126, 102, -17, 148, -55, 85, -48, -131, 76, -111, 33, -141, 56, 129, -38, -94, -122, -65, 12, -49, 163, 236, 178, -78, -10, -261, 94, 19, 132, -156, 197, 129, -14, -33, 118, -4, 110, -62, -8, -115, 40, 231, 112, 8, 147, 403, 14, -190, 106, 23, -163, 51, -144, -21, 172, 183, -122, 272, -126, 88, 47, -103, -143, -115, -63, -248, -91, -105, -71, 303, 36, -162, 79, -253, -35, -60, -248, 74, 31, -59, 3]
2705CO4N3j50L86m54N0j10K35J1M6j47j29J20j0k05M7L31R1k99M7j21L05j95K9
2729bQ4j24J14Nj9J23j79k39J07J26Q0K5L5m15M11k29p7m5K04P5k7J21k74Q4k0
2754e6L4l1J5j53n5J68K59J87n10J23J6N7J8q4L11j95j95n0J07k52M55l19K74
2777A24j29L13n77N07o2j50K67k8l38N0K63j61k24K96l10O7n1j2L64k39N5k73
2799b48R6r6J14MQ2R2J7j73j14M19k02j86Q0J51l30K32L2P1k1q8jj72J35K30j82
2824e8j51k01M11j77J73L2P7l30K74K7L41l52k27r0K21N9K54k54p5J41pK72m18
2847e8L4J12j80K92l06P8O0k0K2k02k47O76k43k5J31j44K14k53J12oj52K59j78
2870b4M0L2p2J61o2q3r7J18J73J6j91L3J91j55k2N1j98n1J87p8L2j10K38k40P5
$$ y = [3, 67, 120, -30, 356, -98, -48, -158, 77, 88, 134, -13, -142, -22, -32, -237, -190, 141, 232, -67, -20, -141, 164, -31, -2, 82, -42, 72, 77, 58, 181, 2, -237, -130, -4, 76, 101, 136, -279, 132, -97, -174, -219, -15, 60, 33, 154, -120, -36, -56, -22, -53, -38, -191, -246, -78, 181, 368, -142, -19, -3, 54, 72, -12, 299, 104, -91, -141, -34, -286, 169, -150, 124, -5, 308, -269, 238, 176, 26, 293, 265, -73, -23, 240, 79, -145, 151, -159, -92, -143, -155, 209, -30, 25, -248, -152, -248, -134, -130, -48, 44, 61, -112, -226, 193, -9, -195, -115, 36, -294, -62, -30, 41, 20, -68, -69, -241, -106, 124, -58, -209, -410, 1, -176, -3, 29, 106, -224, 50, 77, 418, 66, -161, -251, -30, 29, 283, 29, -46, 95, 88, 360, -58, -24, 88, -92, 200, -106, -28, 32, 12, 34, -168, -415, 261, 18, -7, 124, -20, 194, -59, 53, 47, -105, 154, -24, 16, 48, -24, 137, 75, -8, -105, 13, 186, 202, 11, 44, 235, 80, 58, 109, -89, -140, 47, -31, 1, -109, 129, -111, -36]
2895c6j39M05k79n3K37J31l81K47j33l0L48m09K81qk85L1J92k45J62J60l35j00
2917b39L20k95J10J07K08k84R5j15J75j77J58j26OJ33n2N5j55K61k49J39k27J95
2939D3k10j9l1K51k3r0l2L3K11k15J53j83K70k40Q7K1l2K60j51n3P3k42QJ64j30
2964g7K22m96K62k02J87j90K04K14l34M12k64m5j14K56l59N33k61j62K43J0J94
2985B33k41K1J5K27k67K13k88j17L08k80j14K39J72j61K16k58J78l38M56j96j84
3006a66Q3m2K7j08q7J78O8J01j01J29j26J2K7K8J52j81k1j77L03k6J66k99J59
3029I9j94K36l54k6L95k07K12J17k67M03M6n66K30n7j85O0M7q9R8j34L37l31R5
3052c5n8K9J24k20R3J77j36j15J19R3m0l06J37J50l37J93L63m17K23k39K18j75
$$ y = [-36, -175, 230, -49, -102, 135, 266, -115, 132, -1, -31, 317, -92, 189, 181, -104, -73, 119, -126, 36, 196, -139, -239, 81, -214, -104, 3, 211, -73, 22, -93, 82, -95, 63, -63, -57, 76, 24, 79, -76, 185, -64, 75, -152, 43, -167, -186, -217, 34, 11, -79, -111, -78, 133, -82, 71, -112, 158, -82, 5, 26, -6, 254, 103, 50, 123, -119, -111, 53, -77, 145, -351, -89, -291, -104, -294, -90, 124, -210, 202, -62, -107, -221, 35, -324, 209, -52, -214, 29, 39, 233, -8, 13, 28, 255, -12, 201, -87, -204, 104, -176, -290, -51, 121, -40, 176, -82, 96, -242, 214, 18, -166, -83, -125, -98, -206, -293, -115, -47, 54, -47, 82, -44, -32, -5, 23, 175, -6, -27, -204, 99, 73, 239, -60, 99, -95, 141, -213, -239, 156, -51, 161, 278, 11, 414, 460, -106, 124, 67, -118, -58, -11, -100, -2, -136, 201, -130, -35, -93, -64, 60, -160, -67, 110, -26, -141, -22, 71, 31, -275, -138, 12, -325, -132, 231, -186, 37, -202, 16, -159]
3074a59J66j72R6J1j51L3K21J29l07J22P2q2J63o9J57rj85j55J65K9Q0R7m23J80
3098IK74l26j42J30J21l01m3L04L5k75O5L13qk02J01K8j28j64K68j74o3L34p6
3121H0J33k76L3j60J86O5q0K47l74l6J48J67l82M37k72J68o3j3k53K75O7j36P1
3144C2L5r8j62K61M5j57j11J27ol2L06j36N8l28J62n4n5oK21k00L47q3o0O2k1
3169A47j45k36M32j41n3n0R2j18M4j25P7L1P3j04K8Q8p0L08k53k86N16l74r2l08
3193e19O30j13J37j10o1L8J36p2k13K15k10J36J8M6J60j02J13j75J00j4J31j64
3215A07K04J0m90L33j70Q9M8j64NJ7O8j51OK21N9p0l12L75k53K85l15j64M79k57
3239d0o0L58j22j30K21k13n1J45l5Q4l01lJ81j59J19J98p1k50L06m3J5l07J67
$$ y = [-159, 7, -165, -69, -58, -209, -176, 45, 174, -133, -11, 61, -21, 142, 73, 230, 221, 36, -119, 46, 75, 155, 252, -171, 9, 283, -43, -185, -55, 66, -235, -278, 26, 61, -214, -149, 164, 156, -46, 55, 83, -45, -209, 59, -115, -178, 156, 80, 213, -63, -30, -190, -4, 61, -19, 228, -146, -182, -34, 133, -249, 188, -84, 84, 21, 8, -245, 30, 97, -39, 32, 67, -31, -193, 68, 113, -44, -155, -28, -34, -66, 240, 104, 162, -166, -4, -58, -113, -119, 102, -98, 249, 166, 106, 168, 147, 2, -234, 198, 57, 4, -46, 46, -72, -28, -153, -76, -45, 28, -76, -48, 40, -30, 278, 25, -261, 255, -119, -211, -519, 111, -2, 135, 25, -36, 2, 138, 66, -147, 68, -142, -6, 12, 58, 218, 116, 229, 54, 154, 140, 271, 107, 311, 321, -169, 164, -6, 83, 131, -33, -28, -11, 57, -94, -88, 133, 192, 122, -190, 185, -68, 217, -98, -262, 217, -40, -100, 258, 136, 6, 227, 14, -37, 108, 73, 157, -144, -147, 34, -125, -6, 192, 121, -129, 177, 134, 149, -158, 9]
3262Ik3m0J57N1J06l58J47j85J45j22R5j44P3M5o2O6J6K2O1j41p3J67J07R4l86
3287a73K66k48J68P0j08j00L43l52J58j89L9RK15k28L99k48J50k20J12o6L4K10
3309B41J04l11q2Q2p4O5j95L46j78m5R6K2j09J61j05K37j28l09M54m08J54k27
3331b09K14m1j69RJ21N4P6j77J22J49j85jj70J06j03R9j32L15M2l72J72L3j68
3354b15L42R4k50j4M5k4J96k45j48L94p9l67M36l04j36J99k33K02L08p6n4Q9j47
3377A3J7l9r2M4J35pN0k4q3j56L0K4K94m27O4J23j12J46j6K01k75M6O9o9l24L85
3403A7J14R6j46M2j5l49K18O5J05m25L80k14j02J60L05J22j61n53K47J42r4j12
3425a58M22m39O7J7l23M84m3Q0j57j09O2j00l3K10M5p6j40J63L4J07l29J34N6
$$ y = [9, -14, -54, 103, 154, 260, -98, 49, -136, 9, -113, -18, -162, -89, -44, -106, -40, -24, -2, 59, -82, -155, 12, 119, 213, -173, 93, -155, 13, 83, -25, -125, 218, -134, 24, -165, -126, -117, 98, -130, 269, 21, 171, -49, 63, -3, 31, 241, 345, 34, -48, 34, -40, 25, -170, 176, -2, -47, 49, 71, -38, 123, 18, 255, 127, -182, 272, -136, 18, -209, 5, -36, -205, -196, -75, -21, 55, -122, 0, 149, -36, -37, -207, -101, -204, -105, -237, 78, 120, -252, -80, -47, -215, 127, 221, -29, -43, 2, -22, 174, -71, -219, 175, 96, -271, 165, -139, -275, -76, -309, -107, 201, 125, 71, 160, 13, 30, -9, -101, -57, 78, 71, 121, 97, 14, -142, -112, -88, 206, -221, -157, -34, -146, 0, -16, 185, -90, -44, 25, -44, -368, 17, 131, 227, 81, 123, 108, -241, -23, 42, 147, -278, 102, -112, -214, -54, 251, 373, 212, -341, -94, 48, -46, -158, 264, -175, -108, -91, -414, 70, 27, 107, -50, -159, -97, -197, -230, -20, 25, -51, -191, -28, 6, 113, -216, -82, -26]
3448b6K3p0K63L8n21L44j62N8K39M0l95J18L07l48J03N6j97j8j27K20q1J6L48
3471B28k91R2k8l3K87k02K20m37J72m85K93L29l11L63k03J8N7j04J6j36K00j18
3493g3J5Q8p9J90k29k03L23jJ61j32j31J03R8J71l23K88p0n72K90R3j36K55j30
3516dJ04j08K07l15j29K52k60L15k01K69o8L24l25Ro4jK54j82j06J95k76P4j52
3539a88L24J66l32o2%j6J78k72K34j35R6k53K69k12K04Q0j92M53m20K56l31J92
3561C9m6j78K70m7n5J42p3m7O9k40K9q8K98q4j70Q4J13k52M90l48j24L93k07j13
3585a45L31n3k24K60j82n5J83J71l15k17k8L34k35N1K51k62q2j0j48O58k53M8
3607G8k80J36L14j40k0J9k98m6Q3K12j62k0J88J6j60M76o01J17K87r6R6n8k56
$$ y = [-26, -3, -73, 190, 228, -293, 51, -111, -53, 186, 226, -169, -51, 256, -92, 11, 67, -130, -148, -275, -55, -136, -120, 228, -63, 29, 1, -32, 255, 53, 273, -164, 8, -477, -184, 145, -166, 197, -6, 12, 69, -35, -19, -155, 45, -73, -58, 30, -49, 141, -88, -291, 32, 31, 192, 60, -71, 32, 130, 301, -22, 266, 196, -376, -86, 7, -129, 126, -4, 100, -8, 199, -116, -245, 7, -253, 62, -139, 130, 62, 386, 61, 70, 6, 5, 259, 77, -29, 166, -110, -36, -188, 136, 302, -30, -92, -92, -108, 70, -202, 32, -103, -7, -260, 9, -203, 1, 81, -111, 342, -78, 178, -153, 39, -7, -185, 85, 38, -17, 125, 52, 5, 74, -166, -137, -225, 73, -11, -181, -97, 16, -236, 254, -94, -218, 175, -32, -145, 186, 133, -91, 169, -13, -68, 115, 286, -29, -246, -274, 60, -175, -124, 127, -135, -217, -227, -375, 283, 30, 78, -202, -66, 248, 108, 88, 107, -191, -237, -154, 58, -104, -124, 64, 80, -80, 396, -205, -88, 199, 103, 199, 141, -115]
3630a15N3J3J17J7j17k64M32j43k3j06J67p9L47j39q8o9j73p7K91J1j76J64O2
3653A05K75o24L88j22k2n5k0L13j33k60K35R5n29M10k01mN13l88l43k68R11j79
3675I7j12o7qJ14J22K5l06Q7j04q9L65j04j55J23l7l70N21p1J4R0Nm63J38J8J24
3700d3K30P4k68r6K28k83K25PK80k81k53L55K9l07K74j23J17M8l61L14r1j53J1
3723f7M1j22N47k90k37J11p0q2J25N0K0P7l27K24J77l07J12k6q7R4R2K91l18K3
3747E1Q3k25L40j47k03O8K4J09J00j98p2n4J2M5N5K4l47M58j05N0OK9j63O2r3
3772i1J48Q1k41J47q9O4J29J50k85J61k41K99m31L28j17P0q6K18k55M6K42l90
3794a43m7L06N3j36j1l7r5M67l19N3J33k72Q3K63k14N4j20k1K61l25L3J66j19
$$ y = [-115, -62, -49, 68, 85, -32, -296, 136, -7, -30, -136, 31, -48, 299, 160, 72, 3, -170, -247, 44, 55, -121, 43, 105, 380, -244, 144, 22, 0, -55, -75, 238, 105, -155, 80, 175, -354, 56, -145, -149, 364, -24, -367, -635, 276, 97, -15, -82, -90, 24, 146, 171, -135, -48, -152, -241, 124, 20, -135, -12, -49, -419, 102, 31, 45, 135, 140, -323, -185, -167, -43, 187, 261, -7, -103, 125, -158, 67, 74, 354, 73, -180, 175, 204, -103, 171, 48, 165, 213, -148, 166, 75, -78, -67, -26, -148, 399, 109, -128, -17, -87, -169, -44, 6, 26, 103, -224, 0, 177, -130, -18, -44, -131, -37, 55, 346, 28, 51, 134, -91, 249, 102, -101, -33, -9, 100, 200, 2, -70, -124, -112, -67, -12, 12, -335, 123, 18, 68, 74, 103, -60, 2, -91, 57, 138, -103, 44, -45, 19, 148, 298, 13, 174, -67, 232, -199, 129, 12, 82, -4, 214, -41, 5, 247, -143, -190, 116, 169, 33, 22, -15, -110, 357, 38, 91, 224, -48, 35, 298, 84, 138, 18, -3, 258, -67, -34, 132, 13]
3817A3o2k6J63K1k92K07k66K30j52J60J88o1j77N8J88k71q0N6N27n67K93r3p0
3840a3q8L39k10k46K80j06M0M9K30m33j0J33r9L7j7M3q3K70l45J82J77l48J93
3863b5K33rm31L67m73N10M4q1j85K73m6l25J85o0k65N49l38O6J22m02J84qj09
3886b24M27j88p8K22k38L5p3N1p5Q0J51P5l14j1K81o4j47L9L15k16k71R5N5j3
3910h6O1j34J71J83j36n6m7j48Q1K18j02q2J68J1r0K2M1m3J05k75J96l00K26N
3934a1R0q5J30j10j79L29k11J9J04j53k88L87K00l23K23p6j05j2J59Q1k74J67
3956F2o9J69k55L9Q4j33J74J19k8k56R7J24Mk60J19J09L6k90L80j9m4J00p6k58
3980g2K84m23J04J47k1K9j32j09M38J04m08j05K02k81L38j89lk1J48J16j78j64
$$ y = [13, -49, -75, 88, 109, -183, 24, -242, -12, -164, -4, 184, 123, -54, 4, 192, -79, -159, -103, 424, -143, 150, 57, -13, -101, 238, 28, -218, 62, -44, -4, 45, 275, -158, -168, -35, -134, -97, -114, -71, -154, 116, -229, -47, 130, -218, -25, 208, 199, -232, 135, -338, 172, 216, 135, -50, 223, 177, -148, 37, -23, -288, 261, -77, -11, 111, -291, -107, -115, -224, 203, 15, -63, 159, -79, -44, -117, -66, -141, -61, 90, 165, -149, -160, 121, 57, -90, -51, 264, 48, -223, -128, -73, -86, -25, -159, 12, 195, 59, 3, -44, -192, -111, 107, 5, -77, 91, 102, 12, 34, 75, 32, 137, -138, 58, -242, -16, -11, 79, -6, 124, 14, -165, 164, -47, -28, 76, -77, -365, 22, 222, -101, 122, 46, -59, -71, 88, 169, -105, 62, -7, 162, -93, -54, 30, -103, 71, 190, 162, -94, 3, 127, 131, -129, -10, 99, 135, -155, 225, 206, 162, 262, 186, -72, 212, -211, -107, 40, 19, 48, -84, -193, 245, 349, -59, -164, 38, -243, 95, -94, -97, -118, 30, 146, -32, -196]
4002a96L60k07l3J0P5J14j08K17k73oJ47l18J70n7L94k94J19k5j01j57J51j41
4024a59K26j42j1L31k76K98k25j24P7J32Q3r2l77K15p0M1K81l35K15kl60M82k02
4047FJ37k55q2K33j06M9J59r4k3j58Q6J73j18K76m76J40R5p7K11n7J8k18qj75
4071b64K71j40J02j48o4M27m88K72J66j07k4J8o8J34k65L68k72j53N8J49j05O6
4093f7J51J50m51O4J28j02L19k56M0O5P4k58L96JR1r6n52K42L4k31K48Mj24j07
4117b37R7J24Q7k56K02r1L28N9k78j61L38q6j30j8j74j8K87K2j94K47n0o3P7J89
4141C01j99q1nj53L17m45P96n79J72N7j70J08k43o9J12J77q2j69j4j48J68N4J15
4164B0O3K2j95j79K50n0M4l8O8k00K73r0pJ89m9K5k50J8j47K33P4o4K2P2p6j14
$$ y = [-196, 164, -43, -76, -66, 9, 123, 15, 232, -41, -47, 100, -218, -48, -105, 289, -5, 114, 89, -12, -169, -18, -159, 67, -75, -86, 245, -31, 267, 42, -82, -5, 127, 210, 118, -259, -44, -114, -73, 208, -127, 88, 86, -274, 208, 6, 143, -112, -194, 39, -67, -18, 141, 47, 24, -134, -48, 125, 7, 283, -193, -53, 42, -35, 176, 119, 137, -81, -89, -264, 7, -133, -31, -179, -243, 184, -304, -32, 134, 27, 3, 21, -47, 87, -178, 190, -82, -235, -177, -28, -133, -67, 84, 234, -217, -153, -25, -127, 192, -64, -24, 41, 115, -143, 253, 254, 345, 249, -303, -61, -27, -258, -10, -6, -130, -237, -140, -16, 71, -185, 17, -74, 254, 313, 35, -126, 212, 126, -4, -22, -196, -214, 73, 95, -99, 148, 98, 35, 112, 301, 102, 21, 16, -137, 180, -265, 531, -48, 124, 181, 11, 119, -124, -193, -81, 96, 14, -155, -169, -317, -149, -95, 20, 83, 105, -90, -269, -19, -69, -25, -63, 5, -195, 78, -12, -19, 170, 121, 146, -104, -86, -233, 0, 74, 10, 32, 104, 28, -86]
4190h6M7K8k17L4K3Q4L8K56j36j9l10O5J24k8KK81k15j08o9J17J80m08M28J28
4214B39m50j41N13j50J8Mm8j19P3J55q9R2L01k55j78P2O2m24L99n8K48k62o3J85
4238A24l47K50p3R3J41j50k69K92j44J81j8j29J38k41Q6N0J12k9k19L1K47n1l34
4261b59L49l86N29l36M5K25l46J00Q9J30k20J64n9m7J60j64J70k24J38Jn4j15
4283a10K69l40J44j75R3J4J73l34N39k28J22j81m2l08j9R22r37O15m88J61K83
4304A73l70K80j6o8l03M79J81m77J57k33M35Jm9k98J98J37k65k68R1Q4N83o20
4326a68J33L8k96L68l38K14K16k97J85K87l82j26J6J89j72J18p2J44j2n3J4l81
4348c75M48l35K29k3M0m07N12j98K07L1k77M06l15P6j38N1j88O4J8K18k59M62
$$ y = [-86, -39, -11, -228, -194, -171, -87, -49, 207, 71, 52, -258, -193, -69, -97, -95, 186, -29, -137, -206, -89, 91, -317, 111, 239, -211, -352, 161, 11, 29, 33, -15, -134, -61, 94, 5, 97, 398, 143, -35, 37, 99, -325, 74, 16, 264, 2, -61, 124, -223, 27, -46, 47, 188, 38, -231, 61, -83, 98, 80, -49, 89, -152, -66, -16, 96, 67, -152, -121, 126, 75, -259, 90, -296, 233, -103, -58, 167, -179, -79, 10, 140, -80, 84, 25, -22, 138, -26, 144, -80, 58, 59, 5, -110, 159, -181, -37, -212, -119, -105, 68, -266, 273, 45, 167, -14, -56, -364, -383, 539, -398, 217, -271, -110, 173, -197, 83, 67, -1, -304, 175, 356, -121, 36, -197, 238, 239, 190, -108, 90, 227, -38, -306, -215, -131, 452, -168, -35, 3, -293, 75, -263, -49, 167, -130, 55, 342, -40, -166, -150, 39, -133, -15, -87, 57, 45, -8, 6, -375, 73, -262, -33, -56, -16, -423, 89, -109, 98, 129, -148, 258, -57, 19, -119, -68, -256, -192, -174, 44, -215, 247]
4370B47k06k03j23J85q2J57L08l89J29k04K83j26K70n20M53j69J89l02j17R14
4390F94o65l03J84J55o87O98p7l31N33n58J035r03L85k23L98J99o8r25M74M70
4410D85M30m18J20j054k13M91O10r51O17r68J188r1m53l74L88J121j292n20O28
4429b56N37n44J90j161J304N2l08j144J663L3K93n8k64m07K67K97m55l10L56j54
4449f9O4J4O1l63M62l9p7Q9l94L02k23K85k21k7r0R9K47j07N3j56P8O5J03o8k60
4474a72K23k0j26l69M30k3J3k40M28j60M9r9j9K79l84L71k54k06K04j35K91q8
4496gn0l02L18Lj04k7J86J79k65O1K48n7l02Q2J86k92M67n74L13k12J2K20l78
4519b95J66K82k63J69r3l6j20J14o6J29Q8m9n0K28q6j78K59r1O8j50o3j14K3k2
$$ y = [247, 41, -162, -285, -100, -182, -25, 283, -106, 23, -181, 102, -24, 246, -274, 179, 10, 199, -103, -220, 694, 29, -274, -90, 65, -622, 76, -1, -332, 201, -357, 678, -225, 160, -63, 335, 534, 466, -459, 15, 485, 915, 497, 617, -437, -650, -159, 451, -500, 117, -851, 337, 246, -207, -581, -193, 928, -364, -884, -256, 281, -263, -73, -1234, 70, 122, -186, -1330, 333, 366, 659, 601, 337, -70, 197, 494, 39, -271, 85, -69, -5, 9, 70, -293, 169, 130, 53, 142, -252, 50, -173, 112, -109, -136, -226, -127, 120, 13, 66, -90, -12, 53, 156, 88, -172, 51, 31, -95, -464, -34, -57, -44, -284, 144, -16, 33, -66, -85, 194, -190, 181, -73, -279, -75, -210, 81, -7, -57, -359, -41, -38, -142, -169, 17, 196, -69, -8, 240, 183, -119, -37, 149, -143, 324, -250, 63, -149, -137, 83, -295, -129, 153, -110, 59, -34, -70, -190, -76, -142, -13, 75, 26, -24, 204, 118, -60, 199, 108, 176, 26, -37, -151, -128, -150]
4543a50K11j5J03k52N1K98j63M3J43j66m25K97l09K51o6N81l87o4k47J76N1M8
4565Ij00N9k04J60J88j41P9O4jm6O5j03k07K48k01M7j3m9Q0Mj7J50j86J75j4L
4591D9J13J00k92k29K16J22R7k74Q8j01J21q3L13j73Q6J18l06K8j63J81l4J8L35
4614C30k08M8l50J03k17J96J69l11O39j95j28n4k30M19l90m4K12j57J74l18L93
4635H1J7j19ko4l0J71m7j8k18r1K12j42J8j70M59j15Q1K2j29L43k35j69j35N14
4659B34m43L29L9J69k49j09k2o2O4J0N1j01j76K21J90J00k12j43l8j05J39J92
4681G8N7O6j98M5RoL5j24k2m11M83J9n8J92j79KJ96k31L28j30k41J23j31K05K3
4706A30pl96K92L7P6k22K17m4o5k66l6J91o1L80k38n9k04N15l18j10J82k5K7N2
$$ y = [-150, 61, 46, 149, -103, -52, 246, 83, 126, 269, 103, -322, -25, -334, -83, -149, 432, 45, -19, -266, -90, -39, 9, -91, -32, -236, -76, 112, -29, 50, 114, 113, 67, 132, 29, -178, 70, -131, -84, -97, -146, -66, -62, -79, 71, -115, 60, 46, 49, 162, 262, -30, -259, -43, 79, 176, -98, -10, -111, 10, -73, 240, 67, 153, 271, -35, -7, -170, 11, -23, -5, 330, 122, 170, -180, -77, -294, -98, 71, -240, 399, 204, 76, 22, -208, 211, -179, -223, -11, -168, 6, -312, 81, 98, -21, -23, -87, -117, 54, 7, -11, -229, -320, -108, -250, -232, -402, 57, -58, 23, 45, -84, 259, 24, -145, -280, 234, -209, 120, 159, 328, 79, -30, -52, -114, -50, -40, 11, -90, -266, -45, 145, 245, 33, -110, -148, -253, -114, 78, 135, 201, 3, 48, 57, 51, 86, -38, -60, -471, 12, 31, -27, 165, -14, -12, 184, -47, 281, 151, -90, 33, -98, 107, 130, 123, -273, 19, 56, 132, -90, 127, 83, 18, -248, -284, -93, -154, 226, -12, -71, -275, 240, -78, -188, -6, -31, -4, 48]
4730D8jj93O6R8l07J70Q3Q9k76L09l57J09mK42j79n7J18j96M40j19n4J84k00r7
4754h4j53M8L32k52J50r9O8R4j89J52Rk37L33j42j21K13M8k83j41R8mL26k69K06
4778A03o8k06J06j78L36m31K84j31J52j03K12R7n10L37R7j49m8J69ko1K30k38
4800bK09q9J66n21O6J65r9N6J09K17l99o5J55J31J1l2k7Pr1K57k10o3P8k9j31
4825a31J57j98L52j18k32J95j08J04qO0K57j74k44m0K45o8j88m6k41N33k96m8
4847b37L84l49j77J35L54J34M8j83p72Q54n15L91k15l69L0K41R07p61m0k14O23
4868B69o0M6l16L4J62R2m87K80k07J81J72Ll11K51l58l7N2O2N4K22j40K05k3k2
4892A24j11j89K89J51m92K04K24m87K95o4j55K19K89l66J10j16o6j20J55k36L13
$$ y = [48, 47, -146, -80, 18, -289, -119, -36, 53, -223, 86, -271, -162, -166, 76, -103, -160, -42, -238, 202, 83, 29, 213, 13, -84, -237, -189, 143, -109, 41, -58, 10, 104, -85, 67, 76, -161, 172, 30, -91, 122, 170, -113, -254, -156, -160, 166, -103, 103, 35, -171, -65, -243, 93, -338, -54, -185, -33, -136, 76, 173, -337, 0, 97, -52, -100, 69, 67, 6, 236, -2, 207, 118, 284, -237, -171, -6, -105, -49, 60, 277, -122, -187, -32, 99, 110, 78, 51, 58, -33, 224, 14, -49, 29, 0, -131, 26, -172, 180, 62, -170, 25, -83, 21, 13, 73, 330, 156, -88, -128, 117, 49, -139, -185, -426, 107, -189, -237, 147, -202, -379, -244, 110, 244, 292, 109, -663, 191, -324, 67, -148, -517, -487, -246, 661, -100, -140, -354, 269, 209, 255, -61, -27, 135, 227, -260, 20, -187, -6, 166, 169, -142, 109, -249, -286, -234, -172, -118, 104, -36, 169, 146, 124, 13, -176, 113, 264, -228, -24, 200, -287, 8, -56, -211, 8, 297, -69, 41, -75, -141, -261, -106, -342, -29]
4913b9K5J06j63N3R3J9j17k8P1P9j3k0K19l86R7K7p3N4J26k05o5J10M2j56L18
4938A84k6l29K73L7kl00J67o1q7o0K44%j59P3j5J03r1L2j30J44O3J02l33L67k17
4963b1J47j63j98N03j38O8j04j10L42k38j00L4n6J26j49o7J67J49J36m30J92r4
4985dj8P2l2K44j21j56j63k7K72j73K71J91k17l46K85l9J57l55j15L72J43k63
5007b2j35K23j60r9n8N22j12k48N1L6J58j94P2r4K11m40M83j32l35K59j23K1J94
5030G8j60Q9k7j0k2j17R8J68J95l03m3J11j39K55O7k99J15j22K43j45n0J08k36
5053a46K31J12j90j61J31J75q3k01R6J24jl0k04J21o5j34L28j11k21Q6M4K05n9
5076D7j12p5J86j73J57P2rM6l8J6R1k17Q0j70L3j19K47j52K11j32j64K32j75r9
$$ y = [-29, -4, 102, -61, -8, 85, 104, -13, -41, 30, 109, 96, 76, 295, -91, 6, 33, -40, 14, 140, -65, -130, -20, 22, -134, 184, 158, -171, 102, 139, 137, -163, 4, -57, -144, -204, 40, 40, -119, -46, -61, 42, -49, -17, -147, -3, 60, 162, -171, 196, -21, 126, -37, -235, 268, 130, 198, 94, -16, 326, 88, -12, 22, -34, 92, -57, -124, 43, 192, 328, -102, 90, -4, -22, 50, 18, 262, 141, -15, -178, -205, 67, -106, 165, 356, 139, -207, 78, 39, 196, -159, -274, 98, 241, -22, -157, 66, -94, -193, -251, 271, 159, -89, -38, -2, 156, -38, 34, -60, 151, -289, 194, 62, -273, -14, -137, -116, 78, -82, 7, -20, -30, -52, -169, -71, 97, 292, -11, -54, 57, -82, 173, 240, -59, 56, -66, 177, 32, -18, 90, -146, 85, 197, 7, -154, -23, 152, 69, -132, -36, 88, 87, 57, -147, -26, -91, -225, 103, -8, -229, -143, -99, 106, 47, -65, -140, 46, -127, 30, 102, 93, 139, 101, 117, 208, -9, 71, -99, -66, -185, 62, -90, 121, -11, -175, 57, -118, -217]
5100b17L05l30K98j28L60l97q5L16k82K32k21J78k99K44J83m20M26r8K9k84K36
5121D6l8j84M1K70p8k72J45P%K75k13N9J63m33L68l70K12K47o1j57P5j99L35l22
5145h4k11L21K20m99P08m82k30K9K41K74k36M77p61L69N4j89q9Mo3j6K96%q8J10
5169A55O0q6n5J30j10J71k01L10n21J16K9j23J19K4j78J11J41k73K81pm2Mk02
5192a47K73l93l0M50j77j05J64L0r5R8o52N31J03k30R9P0P1j34R8j04K11l43O
5215b06J91J66m24K54j8K1J09N9M7k58M39j81j83q9qJ93j52L4K53m10L49l70K26
5238D2j0k41J9j8M6K4J45j34N1r1L8j7K83j59j31J35K7Rj23L84l82o9K1J22R9
5263G0K2N5pj77l8PL31n43M17l35J29R3j13K12L6n6p5r0J08%LOr4m1NJ98N2j26
$$ y = [-217, 88, -242, 56, -72, 288, -109, -194, 122, -160, 72, -149, 29, -270, -26, 157, -263, 163, 65, 94, -190, 46, 8, -176, -135, 135, 57, -215, -70, -63, -63, 212, -1, 58, 221, -212, 156, -214, -2, 245, 184, 27, 102, -97, 238, -84, -295, 26, 246, -253, 455, -27, -257, -228, 13, 287, 51, 528, -233, 136, 190, 1, -88, -84, -147, -163, 133, 133, 45, 155, 215, 129, 74, 204, 94, 265, 64, 374, -147, -31, -2, -125, -6, 18, -160, -49, 92, -181, 100, 93, 51, 55, -147, 126, -267, -297, 153, -24, -129, 35, 65, -30, 68, -584, -53, 50, -180, -81, -11, 60, -74, 24, -80, 131, -212, -206, -15, 151, -273, -19, -37, -16, 93, 152, 199, -59, 380, 199, 16, -73, -81, 112, -40, -6, 247, -163, 186, -184, 42, 32, -209, -190, -208, -162, -138, 7, -127, -76, -167, -129, -146, 137, -22, -153, -18, 9, 18, -105, 279, -103, -172, -151, -29, 70, 92, 147, 140, -37, -75, -68, 263, -280, 137, -198, -69, 24, -89, 123, 159, 103, 28, -62, 46, 46, 49, 55, -39, -80, -75, 123, 175, 49]
5291D9j0j10KL26j61p4J10j53J82l60J55J13k77L07k73J61J89k1k53L8Q3K47k03
5314F7j7j34J01M5l7l5l01K01p0J24J6Q2j00j97L15k79K78k9p4Q5k60K85n2l1
5338a7j61L66l96M05r5P5j79o0O0M6jr8k1K07Po2J28l20J65l27L71n1n9o0J07
5363C0j32P8L9n9j31K10J11k43J35j47n3O9o2Q9O12k40n78K75J7J26k04j06N03
5386C39j95k01K16M1j85j0P1o7J2j51o4R6J81r8nJ33k35N7K7Q7R4L9j63K29l17
5411f9O8o3J25k22l6J37j1j53Q3K72k40K25m1j29J4j84O49n87j32O72l18J1k1
5434E0o4p2J18j51l9J64j52K87j30P0p5J28J3l45M6L92m3k23p5m9R7pn4N3j04
5459a65J80J29J28j01k85J31j17J24r5J16p8J52l11j6J43J69J4n11M52j87L53
$$ y = [49, 39, -71, -69, 257, 96, 22, 132, -21, 161, -199, -44, 69, -208, 99, -174, -13, 176, 155, -98, -60, 23, 270, 67, 50, -84, 17, 62, 25, -10, -311, -110, -180, -56, -40, 42, -58, -255, 60, -219, 59, 30, -44, 41, -219, 66, 14, -17, -178, 188, -208, 197, 102, 177, -2, -62, -2, 44, 43, -55, -76, 131, 138, 76, 204, -116, 49, -278, 93, 42, -17, -77, 30, -102, -24, 15, -44, -175, 35, 146, -97, 38, -109, -162, -93, -155, -66, 546, 306, -272, 3, 20, 146, -58, -164, 339, 144, -57, 159, 200, 15, 5, 76, 9, 21, -130, -194, -98, 83, -15, -20, 113, -122, -65, -38, 49, 143, 182, 19, 248, -69, -1, -64, 61, -161, -197, -60, -71, -224, -141, 131, -109, 116, 75, -54, -40, -224, 425, -162, -294, 378, 60, 71, 50, -14, -86, 32, -119, -158, 6, -146, 141, 11, 81, 6, 134, 147, -198, -152, 240, 197, -26, -101, -150, -53, -60, -114, -61, -165, 15, 144, 272, 171, -114, 17, -100, 24, -71, 45, -33, 119, -192, -208, -65, 104, 118, -393, 59, -128, 225]
5480B25j99J4J56k69O7J01J4k71M23m27r2O6L25q4M9k23J7l3K85l34K4K26k58
5503a98L05J12j12Lj00P9p8J3nk9O2j77J50j60J99k87L37J53k14R1m25L62j74
5526i3K27rp3M5j43K99j90R3j74J8j70K77k22R1K48l59K29k06Q4j32j31K53p3
5549a11R0J99k73l8K57m3J06J98k36p6k34J68J42k84K3K27O3k06J8l72K91J80
5571H9k00j12R3o1J65j05K79p3j01j59k86N01j04L3L68m93%L63l23p7J24K17k6
5594A12j49q0J93k91J96k28J43J66j49J65n5J27k24P6j04R0l7l0K65j65J78k21
5616b2N1M1j83J79j06l5L26n14K87k42K06J87m89M11j43K7r5j55L98l3M8m2l30
5639b28L60j94L18k87K15ql26P7K00Q5k35j97L31k04J44k17K40q2L4J70l79J16
$$ y = [225, 26, 40, 196, -73, -6, 95, 109, -162, 261, -166, -258, -192, 133, 49, 98, -125, -108, -141, 144, -190, -166, 60, -198, 107, 219, 107, 110, 10, 89, 11, 24, 19, -10, 52, -125, 25, -135, 64, -223, 114, 267, 53, 144, -281, 81, -93, 134, 125, 52, 97, -46, 253, 63, 156, -18, 0, -170, 107, -115, -24, 224, -135, 94, -112, -28, -160, -291, -38, -111, -21, 178, -95, -133, 124, 81, 187, 385, 149, 73, -161, 7, 149, -135, -112, 115, 178, -28, -10, -382, -91, 89, -111, -223, -130, -191, -26, -131, 148, 75, -26, -185, -471, 30, -74, -41, 327, -166, -166, 197, -126, -203, -79, 138, 112, -37, -117, 76, -215, -19, -247, -104, 62, -87, 78, 23, 150, -74, 2, -102, -12, -49, -79, 186, 21, 199, -22, 29, 70, -113, 66, -40, -75, 251, -263, 24, -218, -12, 175, -314, 97, -46, -19, -114, -269, 129, 96, 144, 102, -228, 132, -62, 256, -31, 184, 176, -150, -73, 127, 212, -23, -220, 111, -93, 51, -166, 74, -8, 26, 196, -183, -67]
5661f7l0M98l54N5k40J38J53R3k29J11Q3j75O1l48K20j06r3N3M53j66k0N0r9O7
5685A08l7J49m58L15J39k18o3m01M54N8k92J4J82Q5J8j35K38k21J73L9j91N7J03
5708A16m1L1j23J01o0k32J37j1J39j03J20k34J02l0l6M11j99K14l06J48M67p72
5730a61N9k85N16k10J13m5O9j01J86j56L3K93m89Q4K56m24K52K09m70N86k14j64
5752f3K13j5j75K1M7J0j46K53j7k83K55l47K68l5J42j68m6R3M3K79k69j19M15
5775C56l29J54j13p7j87j87M13J3j92L38j44j62Q5K40k6m07l29J18J24Q6K02m8
5797g2J36R3l24K25Q0j05J25o9k9j70r5Q8K92l70r1L60J29l21K27l2j59M5j58
5820a95K26j59j83L88Q1k32j20J37j0J8M2L6k22J19L34k49j46n7J83J7r6J72j19
$$ y = [-67, -97, 401, 47, 102, -138, 0, 153, 246, 17, 128, 211, 36, 97, -251, -31, -137, -230, -177, 276, 110, 90, 140, 41, 108, 71, 220, -238, 77, 216, -2, -65, -466, -12, 46, -246, -232, -50, 35, 53, -82, 156, -65, 108, 147, -44, 13, 116, 75, 106, -17, 84, 24, -208, -71, -82, 57, -46, 74, -160, -58, -88, -124, 287, 88, 302, -4, 144, 611, -161, -102, -387, 129, -81, 32, -13, 56, -45, 141, -15, 18, 311, -178, -94, 162, -262, -10, 199, -271, 315, 101, -63, 150, 135, -40, -19, 28, 38, -108, 145, 128, -155, 100, -247, 21, -14, 128, -40, -86, 7, 50, 329, 60, -59, 356, 27, 181, 68, -9, -196, -383, 30, 43, -149, 189, 45, -117, -32, 208, 182, -225, -554, -436, -312, -226, -24, -72, 64, 157, -167, 58, 138, 33, 158, 89, 60, -110, -205, -117, 175, -195, -286, 74, 203, -118, 109, 77, -82, -37, -195, 31, -128, -311, 77, 158, -74, -194, -57, -67, -49, -7, 29, -193, -74, 260, 11, -135, -192, -9, 8, -88, 84, -35]
5843c5j07L19q5r2k30K56o5K80k81kK42M4k36l05M11l08J26K74l95m5J17J06m
5866a5K3r5P1M8k65K49j94M1K41j40N2k96L11RQ1Q2l69J27J77j26J30p1J67j80
5890E8M8j5J6o8M6j23j74K34J63l41qo7J12L88k06m68K82J61L9j2q2K88n02L70
5914A39k83K14j18M0l4j81M19k09K28nQ4j29l38J64M5j50J21l95L67P4j41J06
5936A8P7l4j43K28m18L08P2j75RQ1J58j13l12J77K46j65K02Q6o43J55L6K98m74
5959c26K36l8L4J23j34K97l65K67J43k77n3O0N7O3J26j94K06l34k5J76R0k13Q6
5982Ej61J32P9N8j29j02P6q4P2N8m2p4J40o8R4J18K5k80o2L07j05l52R6L26J1
6007A38MJ05k85J53j96k2K35o7j21NN8j82P3J12P9l1j61J06on9J78q4n4M2n0q
$$ y = [-35, -142, 177, 92, 0, -230, 26, -39, 241, -40, -42, 200, 244, 8, -297, 114, -194, -68, 206, -189, -234, -117, -11, -15, 8, -87, -16, 32, -233, 16, -178, -137, 104, -36, 16, -280, 31, 40, 121, 203, -166, -39, 138, 12, 142, 71, 238, 58, 106, 91, 107, 39, 85, -38, -212, 22, 185, -156, -164, -231, -119, 269, 63, -405, -123, 38, 77, 65, -17, 271, -231, 139, -144, 70, -48, -8, -42, -223, 196, -13, 215, 210, 294, 165, -173, -9, 36, -114, 7, -388, -21, 53, -88, 18, 95, 61, -82, 146, -272, 36, 108, -67, -58, 23, 181, 68, -244, -67, 179, 14, 216, 302, -341, -186, -150, 148, -326, -90, -128, -94, 29, -105, 192, -173, 94, 237, -40, -93, -33, 24, 87, 213, 19, 225, -109, -134, 42, 132, -81, 5, -156, -24, 55, 113, -16, -118, -42, -126, -54, 4, -38, -112, 28, -40, 54, 172, 197, -83, -145, 162, 57, -295, -199, 127, 138, 142, 247, -38, 115, -81, -103, 132, 65, -56, -51, 7, -175, -102, 10, 89, 58, -103, 3, -3, -62, 116, 32, -22, 20, -30, -38]
6033c8N9j25J77k62K18j14l4J70J09qL0J00l94K13j79j95P3K00j44J87R2l4N5
6056A56k5j69k8m2L05k10j02p0M77m22J62p5K71l77K26j10N9m31N23l7M3k50K67
6079A41j23j27K68j02j90K34L1k52J95j43o8K0K88r3l9k35o1K34k6J81j58M1o0
6102d4j69J95n7J8PJ93k69K86j2j22j11K40j60l5j9K37l67L42k06J12k96L95k16
6125e8p4L14K5l33j69K88m5K22j25p4l09L74j18m5J85j16p1K18j04K27j76P7k11
6148i8J22Q1l3j37j09K13J96m19J46j23K91j21j52l8J38j1N8J86J13k33k12P0
6170g2N1k1l1K34j53r9K02m34K87O5m5j88L44J9K8k87M3K00n4j03P8r2J89k08
6194d7J52q4P4j15J17o8M0j98J26k7NO3m20N22l51K44k63J64J36j44J25MJ11n3
$$ y = [-38, 21, -104, 73, -189, 29, -85, -119, 51, 160, 152, 182, 282, -112, 101, -78, -273, -200, 0, -144, 43, 135, 101, 156, 131, -38, -66, -108, 197, -13, -115, -185, 292, -130, 32, -43, 228, -149, 77, -33, 26, -405, 118, 81, 124, -126, 141, 18, -109, 159, 57, -133, 101, 132, -120, 75, -68, -136, -116, 172, 79, 40, -195, -256, -22, -48, 133, -25, 16, -44, -213, -18, -75, -57, -50, 143, -126, 160, 148, 26, -85, 155, -5, -40, -59, 178, -189, 153, -53, 59, -237, 158, -58, -132, 182, 207, -126, -295, -7, -52, 170, 45, -29, -338, 36, -82, -127, 58, -58, -129, 89, -15, 212, 36, 113, -98, 24, 105, 72, -65, -174, 39, 235, -184, -38, -161, 130, 9, -143, -181, -43, -54, 4, 190, 303, 70, -142, -72, -21, -42, -73, 161, 8, -91, 111, -323, -36, 29, -16, -204, 140, 159, 187, -100, -57, 143, 89, -14, 64, -28, 161, -47, 105, 21, 95, -20, 97, 29, 69, -129, -3, -30, -25, 38, -382, 140, -211, 33, -230, -66, 70, -74, 51, 55, 166, 113]
6218A13Q1r1j61Q1j20J27p9L7J12l86L99j79k08K33%J18J38k00J90l84J14j45
6240b10J66Q6j5J15k95L69p8j21k36K65j73j2K40K7l56L40p3q7J99J8q1k59p3
6263b44o0K90j35R2j82K79k80K21o3K38K31j50OL57j70J59m99l32M78M91o40L06
6285C93k17O20j387L83m05N50O3k38j1M30M14r87Q12p24R1M84m53M23n09L28K58
6306C18K4o23K04L34p41P78L62o69K49j50P70q95J33j35P22l92l67o26K05K91
6326b08L45m21Q41n41j97R51r10K42k65L75k71J20j72M18j78K97k54n78M35q7
6346e8L10l09j68O29n51K59K66L61o00O6l92M71P2o33Q55o95J47L4l14J36K29
6367A15j76P8j04j24J21O8J05j54j19K24j65J59J5j67M6n7J51nJ18l20J13L36
$$ y = [113, 194, 103, -58, 23, -97, 30, -49, -12, 100, -286, 113, -66, -274, -41, -41, 77, 215, 15, 205, -179, -65, -210, -44, 42, 27, 142, -153, 216, 138, 17, -219, 46, -127, -139, 101, 128, -228, 112, 39, -48, 151, 169, 88, -171, -244, -304, -14, -149, -57, -239, 40, -240, -19, -82, 156, 387, 237, 243, 600, 430, 589, 90, -242, 236, 727, 87, 393, 176, 796, -591, -208, -613, -63, 0, -238, -249, 181, 595, -392, 420, -304, -213, 271, -182, 241, -268, 60, 318, 342, -281, -77, 257, -484, 294, 656, -13, 236, 86, 856, -39, 94, -41, 681, 289, -78, -704, -499, -208, 137, -284, 557, 16, -181, 770, -140, 102, -163, 212, -59, 61, -111, 307, 129, 426, 172, -406, 29, -58, 252, -57, -225, 404, -147, 112, 378, 739, 139, 205, -187, 284, 356, -277, 578, -117, 30, 64, -250, -114, 115, -61, 17, -87, -211, -90, -22, 83, -71, -190, 34, -131, 28, 43, -124, -78, -135, 16, 11, 129, -191, -78, 258]
6389B58p2j29k08K32J98k03J1k8l3M74k59j25n3j72J52j07l5j0K22p4J51q0K6
6412A36R9j42l5j6k0L0M7j69J3J72j22m8K34j74j04L33Lk36J02j76O6l13L81j03
6436d2j07L84j42k40L2M0K53m28M51l58K80P1j21N4j87J38J86k02q1J65k34K29
6458A41n2k16K27j87J78k6j83J50j18M0k41K57k1J46r8p6O0l27L29kJ1J46k83
6481a45J71j50J97j1j49j72N31j87j2j6q3K0M8K27m02K03j10J10K5P1N5k09l26
6504c14N28Q7p1k04J04m83O49m85Oq1M22JJ05l95K12J54k44p3J31L2q7l33K94
6527d5K62k04l01L81r6n9K66r0k8M1k33m6J20Q9n8O0p4k00L73M4j07j59J90k54
6551a28j8J90j66j2J70k29K02lj15J3J63k81K22J62m31L95l5o4r9L00j70k99K83
$$ y = [258, 186, 57, -151, 81, 279, 76, 87, 59, 26, 500, 241, 116, 63, -109, 43, -64, -99, -109, 113, 39, 190, 110, 136, 235, 93, 58, 42, 22, 52, 99, -70, -57, 115, -7, -55, 179, 5, -99, 234, 237, 1, 103, -73, -7, -320, 61, -42, -149, 235, 93, -147, -115, -75, 178, -250, 201, -157, 123, 194, 73, 127, -60, 78, 264, 62, -19, 146, -88, 141, 89, -127, 100, -87, 91, 65, -118, 32, -86, -46, -287, -30, -51, 95, -3, -79, -19, -346, -17, -19, -8, 138, -145, 26, -124, 73, 62, -87, -259, 272, 85, 73, 57, -26, -6, 42, 269, -133, 70, -40, 70, 95, 166, 221, 12, -314, 214, 301, 230, 26, 130, -353, 296, -189, -183, -264, 158, 159, 264, -131, 81, 235, -9, -82, 49, 81, -6, -339, -45, 217, 13, -288, 93, -3, -62, 204, 114, 86, 127, -106, -152, -32, 57, -1, 59, -15, -215, 158, 202, 95, -64, 126, -128, -146, 44, -122, -134, 36, -193, 9, 6, -109, -96, 67, -214, 8, 170, -261, 134, 99, 35, -64, 236, 66, -233, 50]
6574E0j15N1R9J48l92RL13l11K77k86J66m3R3j03r8J23J50j91K11J03k98KL03
6597B61l80j7o6K64j55J33M3J87m68K73l7j34J03L2J37j79J41l04J58j97L95n
6619A85j5l34J60r2j10J61jQ4P7k83n6OK34o0j39L07j84J49j55k0L33l68j09K94
6643F4O7O4n2k28K26j86L53m6k03k74k5K25j90K40j3j61jJ87k28J22k84K30J59
6666D6j56k72L17l2r7m8L39P6n20K46K12P8k25o9l62M74j83K59q7j3k04K41K0
6689D0J57j03k36j35K58L01m23K3N9j1J18j26J45J05J5l02J81k26L63k37nJ15
6711G6l08O2Q9K50j52J10l61K98lj88J00j40NJ78R8j29L9m9j4M3j08j72N38O4
6735C26l04l77O62k25k56J04J90k74q1N27k48l74K94O8j3K56k86j49M02m10R6
$$ y = [50, -65, -14, 85, 233, -159, -150, 163, -148, 129, -157, 9, -34, 59, -44, -142, -19, 131, -60, 151, 254, -44, -42, 261, -119, -136, -202, 62, -93, 40, 83, 270, -198, 75, 38, -96, 7, 39, 176, -3, 138, -166, -8, -205, 190, 185, 170, -164, -4, -96, -206, -45, -46, 38, 115, -168, -224, -218, 16, -44, -183, 124, -60, 89, -66, -86, 247, -121, -230, 64, 131, 195, 143, -85, 141, -45, 308, 262, 59, -215, -240, -15, -205, 35, 22, -139, -140, 47, -181, -59, -343, -113, 46, -110, -382, -65, -97, -194, -242, 97, 173, -347, -101, 111, 189, -36, -105, -467, 7, -176, 83, -4, -17, -221, 20, 40, 197, 94, -142, -277, -19, 282, -141, -118, -59, -70, 48, -78, 67, 172, 187, -115, 66, -160, 203, -34, -39, 76, -232, -170, -81, 169, 17, 127, -234, 64, 61, -127, -27, -167, -162, 16, 114, -15, 24, -25, -39, 4, -104, -276, 262, 326, 22, -355, 307, 82, -174, -70, 120, -154, -235, 292, 44, -330, -36, 32, 19, 275, -11, -160, 242, -168, -72]
6756g2L07l07K33l45p6j69K67K07l7k27L60p9m3J03J42j64Or5n9M6J50k58J46
6779C6k75M30l40J88j39N4n4J93L4j68J39k47O0L00M4j99J77k71j36L04l16J67
6801a9k9J86n9j05J40j0l48K51M1K51k53k3J5Lk5j95L93l31J55J97j35k38J25
6824a3J84m16N2j7K49J10j29q3l7K39k71j11K33K16m25K16j19N2L89k07j7k4k91
6847b20J03L25k39N34m21r5p2K52j88j14o3M19r4j59L8m4j67L79j78n8K7J3L8
6870A6J64j32j17L53k70k14j4L24j74j70L27j39j90K57j27K79j98k48J64L02j04
6891H9j48L89m24m4L52k02k84K25j37J00K25J68m77J82J44j78J34m32L15K21m11
6912a93K31O6J08j61p9K67L6k65o9K79l5k17J66j35j24J08L07m05Q7J12J25l29
$$ y = [-72, 235, -72, 161, -184, -260, -429, -162, 45, 8, -219, 141, 62, 19, 122, 264, 100, 106, 11, -48, -2, 148, -110, 36, -239, 191, -149, 39, -100, -46, -100, 93, 127, -41, 98, -149, -89, 211, 255, 56, 233, -38, -174, 130, -186, -19, -48, 138, 79, -26, 114, 104, -244, 7, 48, 299, 46, 23, 38, 41, 16, -179, 214, -117, 38, 235, 100, -138, -13, 171, -245, -193, -210, 39, 149, 20, -63, -100, 139, -132, -243, -10, 206, -219, -3, -122, -70, 319, 112, 95, 71, -220, -117, 208, -31, 503, 82, -13, -85, 167, -21, -135, -198, 221, 127, -32, 6, -38, -205, 174, -4, -62, -35, -22, 16, 180, 48, -69, 284, 14, -200, -214, 110, -64, -234, 93, -46, -236, 21, -106, 173, -25, -273, -109, 193, 89, -59, 330, -94, -138, 214, 12, -272, -47, -184, -84, 141, 309, -168, 14, 158, -20, 114, -318, -3, 218, -193, 38, 104, 212, 51, -28, 239, 275, 10, -59, 220, 185, -32, 134, -1, -125, -17, 290, -115, -28, 84, 209, -120]
6934a20R1m4m2R4mj02q8L79l01j74L11RJ02k11J02J31n0j44K06l63K3K37K27l61
6958i2L0Q7j97J53j66K26O4k39J14p7O0J36k27K46k09M1j7J57j69Q9l6m3J93k09
6982h5K02q2J92k98rj16J47J25j81L8pj9j5p3J30L52m55M1Jj60K26%k16L32j87
7007a17J58j58Q7P2j87M80l99J33p3Q9j44j2J06O5j74PQj48J90N7n6k76M14O1
7031A83k26j2j22L67j55p3J19j24N2k7J76k94K02k6k5k57J81P9K33k25j08J61
7053G9r9J79j25K82l94N3RK51k18j89K22Q1j82K8J49l23M91l99O4K37m00nK71
7076F2J76j08j49Pj46Q0J16p1K98k47P6l33K00K53l19J48l0k3k26L04M7l48Q7
7099a46O9Q7j58J72k33R4J29N5j29J53N7J56l41O8k3j56K59K3k87K22Q5j08l3
$$ y = [-120, -29, -73, -115, -21, -25, -127, -215, 164, -137, -311, 0, 9, 111, -100, 2, 133, 83, -61, 145, -218, -195, 42, 269, -92, -62, 25, -172, -19, -185, 41, 105, -134, -20, -97, -37, 99, -128, 118, -91, -50, -67, 90, -79, 10, -26, -69, 124, -85, 117, 35, 227, -71, -80, -196, -49, 76, -105, -67, -74, -93, -108, -181, -51, 301, -154, -113, -112, -272, -46, -46, -262, 70, -117, 41, -117, -30, 42, -145, 335, -64, 69, -4, 85, -59, -71, 35, 100, -74, -67, -59, -207, -17, 40, -16, -292, 122, 183, -43, -55, -177, 190, 35, -38, 81, -43, 9, -18, 158, -136, 66, 40, 15, -242, -61, 18, 251, 26, -82, 79, -20, 159, 34, 316, -78, -25, -16, 235, 17, -172, 50, 131, -51, -23, 126, -197, 294, -105, -41, 196, -204, -209, 62, 238, 130, -19, -12, -158, -78, 38, -33, 265, 18, 94, -239, -39, 214, -105, 43, 13, -10, -236, 68, 115, -233, -146, -77, 10, -148, 24, -209, -115, 14, 69, -60, 93, 150, 306, -35, 33, 10, -146, 113, 136, -151, 71, 156, 48, 15]
7122A5j49K65k1k16K37j48Jj4o5J11J59k34J50J55m00J06K92m13J50R4K5k67L93
7145B26j96j19o3j10J06O9K18j56M5j6k33P52l31k69K06o6J0j26L0L6j17j3L89
7168B72k62K3J18j37R5J68k73O6O5k78O0L66l15L36l03k3j5J38q7l34K93J16j09
7191b0K14l81n1K35PJ41N4k12L49l87j36k4L04j93Q2k10L40j09O5j10K55j73j47
7214a07L32k89M6Q7p9j58J43L55m28j66J83o3K64j99J0j42K5k6J00L67k27j50
7236a22K37k25L28j97J38l29J57k2J68k24lJ42k8j14J4K60j84k44J22O8L1j52
7258a79M76j86j30J64M6j89M8o7k70K16J07L88n57NM19k10n7N8K5k02j42K27l03
7281c13K51J57k98R8J27J4j38J0m3j48L20j4PJ21n7K1j36J05P8l1r0J4l61K23
$$ y = [15, -134, 131, 110, -106, 131, -17, -16, -30, -95, 16, 175, -59, 91, 246, -154, -48, 244, -169, -19, 75, 100, -167, 226, 30, -89, -152, -262, -156, -87, 131, -25, 20, 4, -229, 523, 192, -77, 129, 63, 73, -53, -23, 13, -104, -117, 272, 10, 33, 151, 14, 109, 277, 4, 70, 135, -143, -83, 283, -32, 304, 1, -22, -37, 101, 14, -320, -27, 89, -20, 194, -187, -238, -3, 4, 145, 199, -13, 336, -51, -187, -211, 93, -100, -18, -228, 112, 3, 68, -42, 213, 40, -107, 225, -64, -18, 69, -10, -168, -25, 330, -98, -264, -81, -144, 120, -79, -69, -211, -186, -212, -112, 255, 28, -122, 115, -110, 218, 21, 159, -170, -13, -35, 133, -91, -94, 48, 20, -94, -80, 180, -4, -248, -126, -58, -27, -179, 297, 111, -19, 145, 191, 2, 50, -17, -287, -71, 36, 424, -133, -128, 291, 81, 24, 82, 107, -95, -237, -10, -313, -62, 95, -203, -105, 22, 36, -102, -92, -135, -283, 37, 23, 30, 151, 94, 115, -21, 84, 162, 131, 41, 55, -306, -83]
7305h3j16l5K54n1K93q7j39k36J82r7N0O4j1Q7l73K36%J92p6n3o9K27n7j53K05
7330A54k39P9k4k11M67j31o7q8P5K07l75L39j09m6j4l9R4j19N7j09M8L5L41k90
7354C5N0l54K16k3M8k66L7L46m5J45l1J9l49J19J8o8M7J65j77K76n33L49p3J54
7378A05J89k2l48l01L13k1J7Q9O8N2j07n5M5K2j70J26L50l87K1JO0o1k4K08q9
7403H1j94J14Q0j62K04l95J47L27k02K7R8k36J78k86K04J66O3k78J8QL88l73Q3
7426F0k12N7Oj18K18n4Q7k1K23r8k23P6J15k03J65L8K1j41R5m5l3m3J66J44j98
7451H2p1k90K87k04K6RK98rj61j81K24m11L99j18l9K35J5k92J27K23j67K41m1
7474A82l98J97K6j71MJ99J21r3J22o4J99k28M0j25j96J02J29o6k50L87J86m15
$$ y = [-83, -199, -234, 20, -31, 262, 175, 36, -200, -18, -115, -65, -1, -12, 75, -298, -62, -62, 130, 54, 1, -68, 159, 102, -51, 154, -85, -6, -30, -241, 226, 95, 28, -60, 15, 222, -153, 186, 77, 31, 17, -22, 72, -47, 10, -99, -51, -16, 325, 35, 85, -269, -53, -76, -28, -294, -257, 89, 44, 189, 158, 177, -172, -53, -35, -103, -56, 109, -68, 208, -325, 24, -49, 105, 294, 272, -76, -377, -64, -85, -68, 21, 89, 141, 34, -21, 24, 46, -124, 2, 352, -35, -14, -13, 47, -14, -38, 170, 81, -113, 1, 81, -81, 123, -272, -125, 202, 0, 27, 125, -111, 67, -219, -15, 151, 214, -64, -46, -38, 350, -23, 60, -152, -95, -89, -207, 11, -43, 44, 23, 246, 148, -75, 1, 116, -87, 78, 116, 137, -4, 91, 46, 13, -30, 136, 280, 82, 11, -279, 8, -196, -170, -161, 137, 128, -33, -214, 10, -401, -2, -120, -159, 76, 91, -201, -74, 149, -18, 223, 182, -216, -19, 7, -164, -160, 39, 160, 67, 189, 125, 324, 96, 136, 11, -185, -83, 46, -20, -270, 117, 303, -112]
7496a12J32j67J37j95L48l5j22L4k24J05L62k92J71l5k53K85n1l66L79j19J7k4
7518b5p5J93m1k10J72K90q6lj17j21m2J27q6J61mj27Mm3N9N4j3J56l53J51k60
7543b39j17O08l48O0L4J15p9k52j30K88J07j30qM00m67K18Lj62J00L30m26j44
7565b39L26k52J97M7k11l6J09O3M00m43R4j05J60m1M9k97K92k79K03j2r4K18j49
7588@M21n96r9K66L7k70K00J38J85n43K26J92k28Q2j54M5J22j13J43J91l72O1
7610f6K71j38K1O2m69J69J58k06J28J14O3o7L5o0J32l95K09J4K1J45k61K64j97
7633e3K96j90N1nk58M61l15j12J54J04j49J27l73J55J75j97K9J26j20M9k6R3K31
7656B53O3k02rj31k09K44K10k32j24R9O0j85N39l34J64j7m64Q7L9J77J65r3n8
$$ y = [-112, 20, -147, -10, -205, 143, 108, -14, 20, -204, -99, 263, -29, 142, 107, -146, 139, 88, -278, 101, -18, -1, -25, -100, 93, 52, -158, 14, 304, 218, 215, 98, -23, -65, 62, -24, 137, 133, 6, 10, -33, 26, 80, 67, 223, -130, 21, -239, -356, 252, -96, -36, -2, 113, 34, -218, -348, -60, 47, -83, -91, 309, -158, 60, 63, -99, 1, 331, -95, -239, 87, -165, 32, 79, -132, -168, -59, 4, 404, -39, 55, -50, 110, 69, 118, -179, 113, -166, 37, 25, -69, 149, 0, 421, -175, -274, -8, 29, -241, -41, 97, 282, -261, -35, 157, -71, 11, -143, -98, 24, -89, 54, 245, -127, -66, 205, 67, 88, 150, -319, -150, 8, -198, -70, 44, 107, 40, 75, 15, 147, -248, -39, -25, -4, 141, -120, 144, -53, 243, 53, 104, 99, -159, 302, -13, -125, 29, 133, -16, 111, -262, -107, 68, -129, -100, 26, -94, -45, -71, 22, 253, 316, 114, 105, -26, -235, 9, 219, -13, -137, -38, 22, -163, 376, 42, 206, 189, -275, -188, -149, 28, 193, 100, 42]
7679D2k26L92k14J32l68J47j14K24p2J79M0l54K76j14J75j10K27m04L41k44PJ37
7701I9k01P6J91j12J81j53K04k15j49j63O4N8K36l14J60K37l21M0k7J69j9M4J12
7724A97j58J17l01mK40k34K48k74M15J7n05J93m1j27j01L15k64J50M53l69k29
7745b62M84k24N7R5P3k21R0k26L06o09O74l69N5n9R9R6J4Q0n07J94o0L31k08J1
7769h6J78Q6l72NL21j59J79p2l02J04O4r3P7R0J84K4k65K09k06Q5J37m89M63n7
7793A05j80J64K20l44q6L60l40K55l00K45o3n21K68K69J15l54L0K72O5k54N4k54
7815b74M69k25R3Q0j91j07J13n5N3K8l7j26L53l60J82M8j51J67K17k65j45L63
7837B30m12J77R1k94J48n5K31J19p6l15J75l0j50K45rm5j56jq4K13j12j1k6J91
$$ y = [42, -184, 208, -6, 126, -242, -95, -209, 15, -57, 122, 162, -192, 84, -30, 145, 35, 262, -142, 199, -45, -38, 99, -102, -26, 165, 53, 234, 81, 285, 70, -79, -242, -178, -120, 116, -198, -38, 199, -122, -82, -109, 60, 41, 85, 197, 39, 156, -145, -149, 91, -143, 105, -169, 246, 263, -242, -49, -90, -217, -318, -3, -267, -117, 336, -33, -262, 222, -2, 55, 150, 223, 2, 92, -134, 172, -437, 237, -132, -77, -136, -37, 59, 73, 153, -354, -160, -220, 111, -97, -86, 92, 178, -194, -189, 132, -27, 152, 80, -222, -118, -54, -147, -70, 20, 204, 228, -37, 172, -34, 51, 188, -301, 162, 105, -75, 89, 309, -35, -121, 239, -101, 154, -146, 99, 36, -485, -217, 52, 167, -187, -157, 115, 180, -74, -20, -274, 195, -30, 63, 143, -48, -155, -42, -97, -44, -16, -53, -179, 174, -186, -4, 44, -107, 60, 277, 12, -133, 230, -182, -5, 86, -208, -60, -115, 116, 235, 159, -156, 19, -11, -161, 84, 75, 30, -126, -127, -211, 2, -110, -121, -147, 44]
7861D4J63j94k93K02J75j60j73L78l6l41K31J03k56K18Mp2K9K31l74J87k7J97
7883B36k47k31M00k65L23k18j42k3K02j94L90k30pl5J22j9j85J80j85o9o5K14
7905d8Ln9J57J56l22L29m1l86K90r9j11m8L54m05OJ29J53J66k13J24j53j79J95
7928bLk52L33p7m6j70M37j08j13K34j47J07l53M9r9N27M2l68J77M8l83K97k2k43
7952a29K31L6j02O1J8k02L20m27J43J41L1k48K28k90J30l7l9K93R4m49J3L16k66
7975a34J88j34K12L0r1l75K21J80k46L95k16QrJ02r0l26K82p6K79q3k28J1r7J64
7999c3j35K57n7oN2k54J00rK75j40m9k19K64j55N1p7L36l37M9J42j37P3m8P4J84
8024B01j19J58k80K04m10K09M2J14j08j93J8K36K7k73J62K23m63L91N1l01J68
$$ y = [44, 207, 13, -280, -78, 97, -63, -236, 142, 106, -235, -4, 99, -157, 61, 65, -7, 22, 253, -121, 66, 39, 236, -11, -242, 158, -107, 216, -2, -144, -167, 35, -159, 231, 1, -6, -41, 81, 62, -123, 57, -128, -197, -262, -48, -45, -104, 53, 209, -113, 216, 175, -211, 79, -20, -131, -179, 175, -230, -224, -95, 58, 224, 11, 135, -18, -197, -2, 1, -251, 82, 5, -41, -211, 226, 118, 5, 239, 92, 199, -154, -105, -204, 323, 365, -3, 174, 222, -161, 136, 114, -129, 102, 138, 36, 97, 115, -87, 233, -194, -51, 90, 121, -127, 101, -189, -59, -96, -135, 158, 252, -197, -184, 132, -134, 54, -80, 132, 162, 71, -304, -83, 97, -149, 246, 30, 38, 29, 131, 41, -285, -3, -79, 200, 117, -111, -100, -197, -33, -168, 89, 32, 26, 78, -176, -76, -85, 190, 50, 1, -218, 46, -109, -58, -135, 201, -136, -87, 55, -82, -9, -57, 17, 201, 82, 240, -40, 164, -246, -37, 5, 119, 11, -182, -164, 72, 99, -174, -12, 211, -252, 139, 190, -111, 57]
8045E7J24j1l22P8r6L73k97J80k58J38J39J34r0j86q1L4J31l37K79r1K46k35J02
8068A1l5r0O1j59J79j55L46J36l51K45m12L19l21j96M39j0J10k84J69J26k06J71
8090I3k04K10k9j3P6k06j10M38j60k78K22P2o8Q6m1k7p4Q3j26O7k20K06M5m1l2
8115c1L9k4J03k20K25k34K02q7J6j01L9p8M84m04P2q9K37l1k41J01k2J3O6O0k12
8140a17M8J46k36Q0Q6J59R5l23J5q4L0J77m8j80J14N6k7k6j6r0M0P0K73k91K13
8165A64j86j46L16Oj8l09L63q1k67k08L07J7J65j33j87L83l44K55j24L1Pj58o5
8188b12j3M10k20
$$ y = [57, 181, 170, -152, -74, -170, 203, -94, 86, -172, -34, 105, 239, 149, -37, -118, -84, 47, -290, -11, -102, 144, -91, 11, -24, -114, -53, -212, -33, -188, 158, 294, -57, 188, -224, 95, -226, -422, 17, 7, 117, -167, 2, 128, -78, 93, -111, 99, 70, 57, 133, -73, -183, 255, 95, -183, 39, 111, 43, 129, 88, 61, -13, 70, -56, 11, -209, -3, 42, 1, -31, 8, -16, 87, -133, 92, -142, 60, -27, -11, -112, -73, -151, 333, -71, 1, -88, 149, 118, -123, -22, -44, -31, 35, 95, -117, -69, 77, -159, -79, 7, 166, 261, -62, -47, -131, -101, 76, 28, -152, -38, 18, -9, -35, -51, -141, -101, -31, 242, -49, 164, -22, -168, 148, 154, 136, -173, 190, 109, -158, -366, -59, -42, 123, -10, -197, 186, -158, 97, -27, 4, 11, -147, -212, -225, 185, -35]
8191c5
$$ Imaginary data points
##PAGE= N=2
##DATA TABLE= (X++(I..I)), XYDATA
0@%%%%%%%%%%%Qj6J6j6K4l2M0m8N6p2Q3r9J20j36J55j79K08k40K79l21L65m14
33b19M70n33N99o72P55q45R44j054J170j298J439j592J759j941K142k362K602
50A364k866L159l482L839m239M689n200N786o463P256q205R360j0804J2664j5168
65h310J8745k4296L4178n7101K12010J05316k70342M3551l6630j45907o4650O5500
77a27936o0216l2229Q1589M0058m2892J31220J54847j8159j5911Q7597k8952q1824
89H7192R994j122j01466m4094J6892p1127r1742N5442N6494l3510M0786R4747
101A8486q17O681P9131K1695m1857K2293L0469p9400q0584J8639k6172q1230J5358
114i7308L8505l6845M821O5980J7654Q39N8136M5295k5735m226K9047m2080n4426
$$ y = [0, 0, 0, 0, 0, 0, 0, 0, 0, 0, 0, 0, 8, -8, 8, -8, 16, -16, 24, -24, 32, -40, 43, -56, 64, -72, 83, -96, 112, -128, 151, -170, 195, -219, 251, -282, 317, -355, 400, -445, 499, -555, 615, -683, 756, -836, 923, -1018, 1124, -1238, 1364, -1502, 1657, -1825, 2014, -2225, 2464, -2736, 3050, -3413, 3843, -4362, 4998, -5806, 6858, -8310, 10435, -13861, 20317, -36784, 175226, 280542, 10200, 53751, 17121, -128786, -193436, -127936, -188152, -220381, -138792, -98734, -141626, -10406, 144441, 126282, 110371, 197968, 169016, 87192, 97186, 96064, -5402, -49496, -32604, -103731, -195473, -140031, -83537, -117047, -76261, 18486, 17669, 24350, 103481, 125176, 83319, 105612, 136081, 56681, -23903, -5264, -31436, -112666, -97308, -58803, -95648, -90827, -24847, -7193, -6354, 51782, 97077, 71342, 67116, 96163, 54083, -343]
127c43K2069j0039o8522j4560J7084k1146r724L6888K8888J919L1826M1291j2561
140D3070Q79M3923q010m4759n507q391m2343k6591M12j2021j8110K0374K2879
153c4195j0620K0281N3689J0019l985K4230P466j5148n386p278k8030k5104j704
166a5765j4304l2116L996K0280q930M618K7912J3282J3208K3962J0434l464J363
179D4476P046j3938k6155l954p455l0123j1609J790o204L335J1568J0544J1316
192i363J3216J7477Q682K536R516l933j6149k825q006j8349q540o056p453k706
206c1953K182P911N910P150J6115M042J49J3100N458n902l316o310o180p034j0417
221i095n629n046k799L394k316K121J4792Q022M833O761J266L882K552n544o759
$$ y = [-343, 21726, 11687, -56835, -71395, -54311, -75457, -85181, -48293, -19405, -17486, 14340, 55631, 43070, 43949, 87872, 79862, 35103, 29596, 21205, -21138, -47729, -47317, -59338, -77448, -57074, -34195, -44815, -24534, 29155, 39174, 35189, 59419, 66885, 51737, 46351, 39073, 11043, -14061, -15765, -30069, -62185, -58189, -37909, -46839, -42221, -14309, -1027, 12181, 36143, 46577, 43113, 44476, 51522, 37584, 11429, 7475, 20, -30103, -41712, -39922, -46126, -42791, -31223, -20679, -9363, 3853, 21330, 30012, 32548, 42064, 38131, 21982, 19157, 11151, -7198, -15738, -21794, -29247, -31953, -29771, -21860, -15950, -8800, 7315, 11357, 11506, 24606, 30064, 24162, 20846, 14536, 8356, 1322, -9095, -14724, -19770, -22569, -19175, -21491, -19370, -4578, 3444, 8277, 15038, 16304, 20186, 22738, 17194, 10435]
236A0435p568n298l681j2289m119O788P24P36L652L759R767P129J510L059K60
251A4864N59O5q674l695k87o815n267m739m009M335K188j19N893M332N622O881
267A1134J392M083J243m547k177o059o316j517o005m707J059j873Q07N155M036
282d292M774K217J623N420o00L8K844m110l668m32n193l161j259k735J69j719
298a0084j054M050L079M745M343j298L197M768k283k194j646k217j712o295l837
313h438K183n83J147J301j792L786N074n9J699L22J154J537m221k073K335k217
329A155j894k347l712J557Q18j164K041M22J472L833L25K391J787j222R03j977
345D388m552j5j319j828q23k680J059L003l45K168K476L41K338p96m28K652j262
$$ y = [10435, 2867, -2431, -6112, -18401, -22520, -15732, -15008, -14272, -10620, -6861, 2906, 10035, 11545, 14604, 14864, 15423, 15488, 6814, 3119, 2832, -3983, -9250, -13989, -17998, -13663, -11475, -11594, -5701, -1369, 4253, 11134, 12526, 16609, 17852, 13305, 11128, 5069, -1247, -2764, -8769, -13476, -12417, -14290, -13483, -8328, -4292, 482, 2699, 4322, 9742, 9142, 9180, 12024, 7914, 4246, 3814, -1379, -4540, -5799, -8534, -8365, -10084, -11138, -7088, -4009, 736, 5079, 3781, 6978, 11746, 9463, 7269, 5623, 3406, 1694, -4601, -8438, -6255, -6838, -5691, -4390, -6182, -2396, 2678, 2619, 4318, 4640, 5794, 7331, 3110, 1037, 3372, 1155, -739, -3086, -6798, -5241, -4423, -5587, -3546, -3124, -1652, 2181, 2506, 4897, 6684, 5462, 6365, 4388, -164, -179, -1498, -3326, -4149, -6829, -5770, -2767, -3112, -944, 1532, 1873, 4211, 3415, 2987, 5639, 4377]
362D377j771L3k524j013r53j015O65j397j573J762O12J098L090m93Q47K582p36
379C591k71J5j073O79l097l125N34n38K50O34j700J175K927k6J218Q79Q57P80
397C709k110p11J348j801k25L87k897k28R66N58N22j133M37K040p29K6J223l8
415A344J742m90l146N76Q99q11m81r16p21K1k92J076O17o34K819j86j586J819
433A650N52j091j84n99q94o57p32J393j005r06J579rk01K211p80J78J814j062
451A257n00L28N36P73k602j038J738j497r18J613j308m27J436L80M71M12J342
468A996N85j645k17R50k078N89J505k992j442J660J49n48M52J302L49j584P81
485a88N01j155K142J358k838J93J491j064k25L49o3j218q52J255o62j740L108
$$ y = [4377, 2606, 2639, 115, -898, -1851, -2866, -2201, -3598, -5171, -3409, -2797, -1699, 1391, 898, 1745, 4327, 3591, 3320, 3335, 2262, 2941, -156, -3281, -2747, -3285, -3035, -2401, -4101, -2926, 1, -25, 1193, 2072, 2929, 3709, 1599, 888, 2236, 435, 210, 597, -2300, -2528, -1562, -1004, -482, -1615, -1178, 862, 133, 159, 1382, 1344, 3086, 2596, -550, 26, 925, 114, -367, -1283, -2004, -1983, -2275, -1199, -582, -1216, 1603, 1417, -169, 1650, 2202, 1111, 927, 328, -566, -1223, -1955, -562, -1567, -2473, -894, -903, -1104, 1107, 327, 505, 2319, 1257, 757, 1085, 1621, 2394, -208, -1246, 492, -1005, -1923, -310, -1618, -2045, -609, -229, 242, 654, 1996, 2581, 936, 719, 1669, -409, 180, 1685, -1307, -2749, -1089, -940, -1488, -1036, 266, 615, -969, -188, 313, -842, 1300, 2658, -180, 13, 1504, 440, 215, 564, 501, -717, -1569, -314, -976, -2716, 392]
502C92J012k644J246J916j132k32P81m30j408m86K094j352j996K730mj804J462
519A45P92r66N20R4j089o22J238J072j547o75J992j512p34J879l69j478J204O01
537E45p36m75R79J705j741q64J629r90p95J716o57j581Q22M22j73l22P71P52j408
556d01NJ548j329N37J751j537j368J197L34l16j038N58K35j645O87R36j613R80
574d79J703j104q38J079L67M5n48R14p19j554J119M02j579O91J591j446o48O56
592c48M95K31k56N82q73n09J370K4j076O01R80j105k11L90m09L19j20L49j025
611e91n17K226n83q82O84k00m10L42M32q27l84L04J304o01j229K148q19j035L95
630b43L04o2M74l68j03o45K86R21m70l84R48j137j40P88n04j1J393J86j729L49
$$ y = [392, 1404, -1240, 6, 1922, 790, 558, 1339, 909, -499, -985, 1109, -243, -2239, 491, 487, -1317, 145, 937, -29, 491, 585, -504, -1126, 112, 1184, -363, -1038, 954, -558, -1292, 587, 218, -1260, -56, 545, -191, -666, 313, 2018, 277, -587, 1042, 52, -743, 973, 316, -1265, -443, -21, -194, -516, 255, 1007, -401, -396, 1152, -177, 360, 2111, 574, -794, 403, 737, 421, -617, -59, 176, -1469, -782, 154, -1459, -479, 1224, 120, -718, 361, 728, 773, 225, 1139, 420, -1134, -15, 387, -1192, -501, 1090, -356, -1004, -348, 147, 378, 122, 704, -169, -678, 692, 716, -360, 241, 1221, 116, -95, 295, -114, 205, 85, 434, -591, -1108, 1118, 535, -347, 337, 137, -273, 69, 501, -326, -710, -406, 898, 297, -932, 1216, 397, -638, -243, 61, -1, 473, 105, 2, -643, -357, 564, 94, -290, 658, -479, -619, 169, -335, -346, 1047, 1233, -496, -147]
650a47J439l03j374L74P90j149k37R62p85Q8N68J84p67m28Q62P63m97j36K39n47
670a01N14J33q81K02O19p68k34K0L83R0k25M83l3r61N84O56n31j77O01m41L64
691B97l88Q9L24L4J42p67l16O03L57n88N9n8L37J01k96J41K10m23L42n44n2M31
713C5K02k18N1K5k08K90Q9j98k96kN06m05k57Q15l22j47N6m92L01N64k4j11n88
736c34J75L31m87R7N74j85l07J05Nj50J19P7jj16l09O72l46M49n3m04o2l09J12
759c47O73M11j207L75m21M50K73p1k11m20k63L67k85p8L77k27N20J29M0l34J063
780H14j311j65L18P9N80m42L78q8m80J39M01l53M31k01n05M08K26l96J06L88m94
801a67K90m29M86K33o56M56j22k45J99l49O5O36m93K41j02k72K27j22P6J90l37
$$ y = [-147, 1292, 989, -385, -11, 779, -370, -607, 355, -430, -342, 226, 410, -357, -785, 77, 840, 343, 207, 446, -101, 413, 546, -335, -133, 486, -282, -516, -496, -113, -23, -248, 235, 202, -759, -175, 481, -50, -227, 374, -67, 297, -91, -2, 322, 356, 498, -269, -585, 18, 375, -213, -154, -212, 125, 226, -70, 71, 281, -142, 200, -344, -396, 35, 237, 19, 70, 95, -113, 177, 266, 68, -228, -230, 276, -129, -386, 429, 107, -40, 16, -476, -175, 389, 365, 254, -334, -159, 172, -315, -218, 356, 171, -136, -31, -26, -176, -57, 20, 19, -97, -406, 266, -80, 369, 316, -88, -150, -459, -347, 326, 737, -470, -95, -516, -66, 207, 136, -75, -495, -758, -391, -676, -754, -377, -604, -84, 45, 85, -249, 814, -497, -662, -344, -265, 315, -127, 251, 163, -317, -178, 223, -130, 301, 100, -405, 3, 229, -167, -61, 327, -167, 123, -306, 180, 413, -243, 213, 91, -154, 45, -304, -239, 397, -96, 145, 43, -229, -2, -124, -48, 142, -195]
822a95j79M22j79Q8L58k19N9j96j45NJ08N5K60m33j20M78j90K99j42l03J40J79
844A50j42M40l45j88r4K83J48j01l05J52O8k28J69L86n21L37l56J28j00j63J82
865a00J87j03R0k45j51N30n17K34L4j64L68j15l76K87j04J94J25j18j27J7k15
886b69K75J53JO0k61J14J08j50j07K50k27K94l45k0R1M4k55p4K26P2K68k79o7
909i8K26J76j92L5k05J06J41l17M3Q0J85k64lr9L48k96M18k05j89N0K58k84K15
932A29m22L24K34m93K71Q7J5N4J49p86Q44p95L58j90L1L43j05J6j63N10m49M3
954Ej27lK04j62No1J60l30N69j86k36L37l04P9M1k41M17l99K67J1k42L40n4k1
978F9q0K6k21K87k99K05J18O5N9k61J3o3Q1r1J84n5l13K77J61j0k1j13J17j14
$$ y = [-195, -374, 48, -131, -43, 315, 96, 155, -41, -186, -181, -73, -18, 242, -191, -311, 167, -23, 276, 134, -169, -29, 150, 8, 448, 103, -85, -179, 104, 252, 151, -154, -2, 66, -162, 7, 393, -128, 209, -147, -19, -119, -282, -100, 87, -16, 74, -171, -322, 208, -309, -75, -41, -205, 163, 48, -328, -41, -145, 49, 174, 56, -71, -54, -269, 6, 159, 160, 220, -41, 73, 181, 31, -76, 174, -53, 241, -104, -124, -33, 11, -244, -318, -92, -20, 248, -31, -98, 128, 304, 112, 147, -58, 48, 189, -128, -85, -5, 180, -84, -87, -186, 162, -134, 284, 79, -110, -60, 198, -86, 129, -293, 31, 265, -228, 43, 130, 145, 199, 348, -438, 406, -389, -31, -221, -190, 153, 48, 64, -99, 411, -38, 5, -122, -125, 79, -83, -78, -139, 21, -309, 260, 74, -162, 175, -129, -50, -9, -250, 167, -232, 35, 46, -196, 144, 90, 69, -11, 15, -206, 81, -218, -13, 105, 170, 229, -32, -19, -82, -1, -92, 92, 37, -276, 1, 162, 152, 131, 18, 135, 21]
1002B1j72K65o8r3J03L1l26R0K60l52K43j16L05m52K36m8K84l91K79l51L78j44
1024a8j96M04j39j89J42N0M4N5k96Nr9L60j78J29j47J63p2j35K69j41j58J40k28
1047b35K19J08j82K17lj14J02q4q3O8k39K37j05L9J08k96J62j01non8J45L17Q5
1071B96k90K53k31k50K19Q6p7r5K49m3j38o4Q4o4L45k21j27o7J8J87K21j50l08
1094a67L04n09K76K82j26l40K47J5j0K13l86K70M9Q3n7l27L30k27J12j50L11j68
1116B5o30P81M0j99N3l3j3k70Q3L08k89N6M9l26J61N7k5L19j38M0K52n61M71k39
1140b8M6J66O1l01Q3J54k10k45N53o7j23k64P6L9p1R1j72K39j67L23m7j5j48O0
1164C3P5O1j72o8M4J68k0j67J58p1k83N06k68o6On5J81L9j13N1J04%k37J59k08
$$ y = [21, -151, 114, 46, -47, 56, 87, -239, -149, 111, -241, 2, -114, 191, -261, -25, -73, 211, -180, 99, -252, 126, -18, -214, 190, 51, -138, 4, 54, 98, 153, -143, -138, -237, 123, -55, 74, -73, 90, 18, -117, 152, 11, -147, -7, -235, -16, 92, -90, 127, 124, 10, 112, 28, -55, 13, -226, 11, -94, -55, 53, -243, -81, -182, -187, -193, -251, -106, 211, 296, 6, 259, 28, -222, -3, 83, 6, -89, 160, 117, -21, -85, -1, -65, 280, 59, -68, -135, -117, 70, 291, 141, -167, 137, -372, -96, 186, 60, -280, -33, -18, -28, 185, -201, 69, 118, 201, 144, -183, 147, -80, 32, -118, 193, 25, -605, 176, 216, 17, 70, 37, 24, -246, -163, 145, -144, -88, -39, -365, -204, -147, -172, 147, 9, 49, 301, -260, 211, -28, 18, 184, 245, -56, 27, 181, -29, -274, 279, 212, 89, -175, -99, -60, -131, -40, -212, 27, -140, 183, 136, 121, -27, 33, 108, 169, -3, -71, -27, 141, 121, -46, 112, 41, -242, 264, -4, -70, -64, -119, 62, 101, -12, 39, 143, 143, -94, 65, -143]
1189a43r4J4K76J01m66N54J17l49J70j56l0J18k12J87l03N2Q4R4q6N9j1qj4J32
1213H6N3k10N4k2K99P1l31jJ29k62o8L87k00n2J64l0J57l07K21q4J68k73m17L05
1237a63k3J50O3l5q1k24K99l49L47J15j02J8l6J53J25k82j91J97P9R7k33L78m10
1260a08L13n59M32K23p5j59l30K02j08K53J47n06J88q2K24o9N9J49j42O3j96R4
1282A3K0lK5L5j58L93l58pJ19J6m6nK73j80k40M8j19l7J73k53K74J24J11j11k75
1307a68L21k09N9r1J63J9q6J71k20J26P1l60L5K8L39o31M64J57L7k07j13J45j10
1330f0J69J7j74Q8j40Q0k51J27K03N6j39R4j94q1N74j0k38n3j60J87k81k57P05
1353B62n17M75l9k36k9M1l27L55L12l82J36K06j73J7NJ12l09J11J79j54K2r1j13
$$ y = [-143, -237, -223, 53, 154, -312, 242, 359, 10, 180, 24, -6, 112, -100, 87, -216, -164, -80, 14, -72, -13, -24, -32, -46, 86, 139, -71, -17, -39, 260, 331, 0, -1, 128, -134, -202, 185, -15, -67, 97, 67, 224, -83, 138, 54, 222, -51, -468, -163, -186, -36, 27, -8, -89, -313, -14, -363, -16, 99, -3, 15, -21, 132, 257, -25, -216, -19, 60, 157, -76, 302, -108, 205, -354, 78, 301, 226, 67, -263, -61, -169, 84, 231, -275, -87, -169, 55, -14, 45, 194, 52, 115, -81, 13, 33, 30, 55, 90, -68, 325, -33, -40, 79, 95, 49, 44, 317, 137, -103, -55, -174, -211, -38, -291, -17, 107, 218, 107, -168, 153, -56, 3, -88, 75, 94, 8, 179, -41, 85, 156, -204, -169, -141, 198, -433, 31, 188, 225, 18, -95, 50, -60, 109, 126, -48, 40, -100, -20, -271, -144, 59, 115, -24, 70, -124, -205, 369, 359, 121, 68, -92, 95, -186, -443, 262, -255, 220, 181, -55, -84, -43, -370, -15, 297, -85, 51, 257, 84, 101, 106, 218, -91, 20, 199, 45, 67, -24, -137]
1376a37N0n8J4j20L70j04k04K79q0L39k33k97K57k45J21J80l1Q0n8j33p9J29J44
1399A84NP8l40nJ51kl0p9k42L69p7n8J89r2n0j27J83J92l75oL80k37j2j08J91
1424H2j5l5j13O7k0K21j30p2j27J7pL64l97J22oL3j13m5k8Q4J28L2Pj31J3K82
1450B13m5j39R1k65J72q9J12Rm3q0K63l08K62j52K0M5q8nL3rj24j7J68l15J47
1475a44J05J48q7O7n8R6o7j40q8K85j62l0Q1k3r1L38k13j7J12j08r0J57j40J26
1499E7P4j06q8L5l6K37m95J98oLJ7J05K94k56r9k51K35N5L05m06L5K83j29j7j48
1524a04L13m7j54J98j4l12J6L06k98o1P3L7Q4J25k32K00j22K12k61J30P5l2k00
1547f8J38M7j78j35K16L3j93J29j75L67ml29J92J98l02j5O2l7J72O4l66L74k67
$$ y = [-137, -87, -145, -131, -251, 119, 15, -189, 90, 10, 349, 116, -181, 76, -169, -48, 132, 101, 181, 123, -10, -89, 40, 184, 189, 267, -73, -78, 73, 71, 41, -38, -280, 89, 12, -46, 143, 51, 1, -126, 57, 249, -126, -132, 248, 11, -1, -109, 82, 67, 32, -81, -14, -34, 187, 57, -15, -142, -125, -132, 232, -165, -43, -49, -16, -129, -174, -202, -118, 10, 42, 49, -82, -69, 213, 168, 29, 120, -145, 27, -62, 50, 59, 16, -64, 199, -109, 153, 1, 21, 66, -22, -27, 6, -3, -127, -144, 24, -291, -144, -39, 109, 22, 89, 31, 127, 60, -80, -168, 117, -45, -75, 6, -17, -108, 230, 17, 0, 112, 4, -86, 71, -69, 57, 131, 25, -63, -28, -64, 173, -322, -124, -130, -127, -110, -5, 289, 33, -66, -317, -82, -27, 278, -128, -93, 190, 61, 44, -104, 209, 162, 8, 206, 192, -120, -104, 202, -96, -157, -84, -47, 37, 162, -70, 130, 8, 220, -41, 89, 164, 132, -68, 70, 117, -61, -196, 20, 53, -140, -11, -186, 181, 177, -152, 40, 238, -64, -79, -17, -54, 118, 182, -184, 190, -77]
1570g7J06l88J36N3K57k22J00O5K53q1j65Qr1J24J97l31qJ24p5QO0k62L63k84
1594a30J42pq5J59R9L25o08L9o1K61k29L65k14OM8j58K7J38k04K7J30m2n7J20
1618I1p7m1j04l4Q5j77J93L76m18r4J65K02K8k22l4J91l47K00L0K6M2J06K1L3
1642B41j84n3J29l51M0K62l75K91j52O8J50N0j27j86J63pL11k47L1j19j54L16
1664I7k55K54j4JJ25j57ok77J99J41j5q6j09K74j04M0j14q1J80k75L5L53k22L7
1688B1k37J28pk08p1L11Oqj5J33J0k57J96J89k31K14p3O1p18L42K79k99j82l95
1712h11N51Q21m16l21M83P0l67lR4O7J12j34J73p28L50j33K50k06J78j9p9K91
1734B23j21l1j89L22k63j2J33j70J8N2J05j9j63K97k09m1K24j03J08j62k29J21
$$ y = [-77, 29, -359, -223, -170, 87, -135, -35, 30, 283, 202, 37, 45, -46, 78, 275, -56, -64, 60, -15, -7, 53, -209, 154, -130, 12, 5, -80, 79, 178, 503, -105, -66, -127, 134, -95, 270, 56, 62, 110, -48, -21, 117, -87, -60, 70, 28, -29, 91, 14, -27, -131, -165, -80, -257, -64, 312, -106, -200, -35, 167, 195, -27, -61, 130, -217, -17, 13, 39, 81, 187, 208, 241, 57, 4, 133, -218, -178, 84, -291, 0, -152, -84, 66, 116, -11, -197, -34, -41, 270, 23, 54, -65, -219, 97, -158, 96, 82, 83, 208, 51, 45, -232, -33, 108, 93, 7, -102, 172, 68, 108, -6, -87, 93, -182, -147, 206, -16, 21, -216, -88, -95, -303, -374, -63, -57, -65, -80, 53, 63, -194, 2, 191, -40, 174, 101, 162, -556, -214, 65, -234, -416, -811, -260, 561, 145, -176, 307, 377, 10, 7, 101, 168, 280, 146, 319, -409, -59, -192, 58, -148, 30, 11, -68, 223, 102, 71, -118, 204, -59, -71, 62, -108, -90, -38, 67, 48, -115, 182, -27, -68, 156, 53, 161, -1, -230, -109]
1756a09JrJ14k45N85k60m7O7k49K30q3K11m1l8l44J27K06j87%q6M26m45J12J75
1780A11j55J79m03K21J54p8k27K29j30n3J92J2P1L0l97m0J84N1J2J54m24K84P3
1803E0l0J53k90J15J21L9Q2K7j2k58j1K17l52M43k79P1j24K37j40k09K31j70J8
1826g1j41R6J93J91l97J07M5J09k94LN6J11j01j32L89j21J20k07k07K73j29j18
1848b25k4J92J13m7P2rJ37n45N41j62J81l29l8P6n1J20o1L0L9J39q9k08K91j64
1872b1q0K96k37J48n9j07K98p29N60N1k44J97L7j33n9J62M0j73R9k32N1R7P0M9
1896H1j16j82qR6K16j27Q7K1k31K55n2L3k21J10k1L66m66R0l2N6k13K15K44j56
1920D5kL9n0n1M4p8M9K3P7j48O7K42l90K34R1j38p6J64l38L55j03J9l6l0j07J88
$$ y = [-109, -108, -117, -3, -248, 337, 77, 30, 97, -152, 78, -5, 206, 165, 127, -217, -90, 116, -71, -71, -157, 269, -176, -64, 111, -44, 135, -268, -47, 107, 29, -198, 31, -99, -152, 40, 52, 123, 153, -244, -284, -100, -49, -37, 117, -307, -23, 50, 20, 173, -117, -2, 119, 158, 240, 267, 255, -3, -14, 203, -149, 294, 15, 86, -38, 199, 59, -150, 81, -89, -71, -212, -116, 77, 268, -129, -22, 23, 132, -162, -159, -103, 8, -93, -225, 164, 43, 163, -44, -251, 22, -107, -225, -249, -57, 56, 9, 81, 72, 209, -336, 205, 43, 224, -105, -143, -67, -118, 2, -59, -29, 10, 149, 60, -148, 143, -21, -101, 195, -42, 106, 47, -60, 238, -491, 69, 120, -124, 73, 110, -23, -82, 80, 120, -53, 46, -186, -135, -38, 32, 81, -35, -217, -225, -129, 87, -40, 47, 68, -163, 92, 40, 73, -148, -38, -59, 307, -159, -69, -101, -45, -258, -43, 201, 45, 43, 82, 32, -19, 25, -53, -4, 19, 96, -52, 15, 257, -133, 101, 192, 54, -22, 142, -196, 159, 56, 75, 39, 9, -98, 90]
1946I0j9J5nk35L27J20j69o1K42n5l57J36o8j07j12K11r4L07O2l40K30O1k85J15
1970Ij13J53m15L52m5N7KJ13r5k76M79Kk08l0m3J1n1O7J61N6k48K01k41j50R3
1995a59L04j31J12j80jK26l06J06Nl8mK4j74J07R6k9jQ8q8J16k78K68K05j77P4
2020A65K7j61J31j28j37J90j77M2J97k41K2K47k75m2K08j87OJ04%O1k37K21J07
2043A43j84K35k29L40l65mR5K8j82J98j22O9M4j08K61l1k91J86J48m3j83r7J02
2066A0j65o6K01Nk5q8OJ64J00q7n4k7J2k11J98j96M76m44N4J68P5o6r7k41L60
2091F2j52J06K37j22M8j97k02L47J57k05j94O5l8j74M54k31J53l57o7K42n7J95
2113G0j26J1K32j96J60n36L34K13k45J8O6n7n7Q8J73j82K0L31k35j43Q5JJ37j17
$$ y = [90, 71, 86, 81, -154, 173, 293, 124, 63, 305, 250, -107, 29, -39, -146, -258, -47, -141, 166, 228, -112, 118, 179, -106, 9, -104, 49, -366, -14, -59, -2, 0, 113, 18, -258, 221, 223, 15, -15, -58, -47, -98, -31, 130, 186, -62, 139, -102, -252, -159, 145, 14, 126, -54, -55, 171, -135, -29, -24, -62, -66, -42, -216, -109, -13, -42, -43, 45, -43, 73, -205, 63, 268, 91, 165, 192, 31, 162, 34, -103, 87, -90, -48, 149, -92, -70, 177, -98, -140, 68, -119, -113, -9, -9, 52, -185, 36, 143, -41, 194, -35, 305, -60, -64, 31, 59, -123, 75, -47, 22, 66, -42, 219, 188, -103, 83, 231, 188, 5, -92, 10, -155, -221, -20, -15, -40, -128, -122, 42, 142, 55, 1, -26, -14, -225, -27, -223, 253, -191, -137, 31, 106, 40, -57, -298, 62, -90, 16, 253, 131, 179, -18, -220, 127, 284, 79, -115, -50, -88, -262, 192, -39, 114, -243, -310, -68, -125, 70, -56, -45, 187, -9, 151, -385, -51, 162, -83, -65, 1, -56, -113, -25, 148, -34, -14, 317, 82, -61, 24, 25, 162, 45]
2137D5j60r4j96O33l7M9k62K86k75q9j37M07p6L5J45r3l0k81j58J43J36m7rm2
2161a07M6j43l9M82j31n4r1p0q7K54J3k80Q9K53p2k43J72R4k27K09O9P7p4k23
2185h3R7j58J66k4oK44k24m3K25j84J9K9M5k73K28l19L56j92k2R4J61l65M56m43
2209b16k3K60n9K02m9Kl43J67J51k70K8PL87l71j61M63j93j79K23L5j16K70l67
2232a52J66k38K12j25K14L6j28q1k9L3j08J31K43j5k62j5J40p2k08L00r6K9J36
2255A11j67j09K47j80j9m5O6K2J59j52k24K92J16j78q2K40j35j50M18j81j0rp7
2278d7P4K95p0j45j60K48r6K54n05n5J03J57m19L69n1J85l58L68o9k18N62j88
2300B34O0n14Q1Q6N5q7j65K33LJ0k9O0j0l45M20j32N2J89k37K01k05r9m5R4J24
$$ y = [45, -115, -209, -405, 228, 191, 240, -22, 264, -11, -100, -237, 170, 94, 129, 274, 181, 151, -130, -288, -145, -9, -56, -65, -107, -61, -204, -243, 239, 108, 54, -37, -107, -194, 60, 73, -207, -118, 135, 63, -180, -8, 86, -141, 68, 137, 214, 140, -83, 14, -144, 22, -2, -8, 236, 12, -31, 194, 10, 29, 58, 103, -170, 58, -261, 95, -97, -119, -25, 136, -229, 227, -216, -239, 21, -38, 164, 115, 117, -226, -59, 92, -178, -150, -143, 244, -127, -288, 175, -18, -197, 26, 61, -55, 215, -152, 14, -224, -12, -137, 77, 113, -15, -96, -125, -92, -200, -69, 174, 159, -103, -118, 22, -50, -258, 42, -54, -25, 111, -56, -165, 82, -98, -117, -162, -96, -74, 85, -67, -291, 1, 117, -61, -143, 97, -38, -188, 230, 49, 39, 30, -47, 27, 322, 252, 107, -53, 195, 99, 353, -152, -207, -104, 53, -366, 3, -48, 137, -221, 147, 78, -140, 422, 234, 294, -220, -139, -53, 2, -85, -250, -17, -14, -4, -33, 27, 17, -328, 92, -40, 12, 201, -36, 165, -40, -139, -184, -90, 34]
2325C4J21m10R5J69K2J57k09P9J43j31o8k63P3M19k53j33J78P2j95K4L2J85l11
2348a70KJ93q5r9L8M8P8n8K47k61J91lj25K02j88o0L2Q0j83K0l1J64j98P9L48
2373B61j59o2j65K51N5l93K43J16j69K86k31L1j4m1j25K20r6J09l28M43k25K6
2395C3j02J99m9n1j05J56R8k28k00M23P5k45j36K0J21j42J60l7n6j80M55k29J72
2418A52M0J28j72j57J32pk81N9J49l40J21J6R5J96j26J20j43R2k6l4K67j71l7
2441G3k24K8J71Pj93K88k3l48J13j5J30k8K18Rl99J53j4MJ55o2K2l8O2r5k30K87
2467E1o1P3l1l49J54K10o7J28j97k9J9K15J15k21l6N7p4n5l0K30j2j12K1j03k4
2492a28q4K18P2J31l03J23R2j30p5K23j19m1J12j66J82k86K29O3k16L21l59l7
$$ y = [34, 155, -255, -160, 9, 31, 188, -21, 58, 201, 70, 2, -261, -188, 231, -22, -155, 23, 95, -100, -76, -44, 141, -170, -168, 25, -60, -159, -121, -73, 5, -53, 194, -67, 124, 121, -4, 198, 10, -50, -18, 62, -121, -101, -132, 32, -166, -87, 261, 102, 40, -125, 126, 181, -212, 31, 147, -22, 264, 33, 64, 50, 9, -116, 104, 8, 117, -211, 232, 7, 33, -69, 130, 81, 30, -75, 81, 179, -49, -249, 174, 249, 4, -132, -112, 9, -133, 27, -10, -66, -246, 209, -20, 152, 192, 320, 148, -9, 123, 116, -165, -106, 43, -297, -176, -160, -65, 131, 5, 125, -18, 74, 48, 14, 281, 110, 73, -151, -123, 48, 55, -138, 150, 127, -221, -108, -123, 7, -21, 197, 206, -193, -40, -54, -50, 105, 43, 65, 27, 89, -6, -236, 51, -10, 63, 32, -317, -163, 47, -20, 108, -89, -118, -99, 116, 231, 10, -26, 31, -43, -98, -128, 102, 90, -22, -1, -104, -128, -212, 6, 78, 209, -94, 29, 121, -9, -84, 139, 20, -21, 91, -75, 107, -179, 50, 113, -103, 218, -141, -178]
2514a78J72O6J28L5k71j73J50N9J18l70K98j0Ol2P0j33Q3k81J02O9K7M9j31K06
2538E9L18m51L08j35P2k66O8q2L42l33j66M92k23J25l00j8J36O3j61j8j6J11k45
2561c20J19K66M8l12L22ro9l28K20J11n2n1L4J1J18j15j48L8K40k47J59J88l22
2584i9K15l72K6J85O9R8j81O1j62O0M9M04m42M2p7P2J30J3m7j3J03k97o3L02l24
2609b48N18k48j81J35J62l84K57j23p4R5J39j55r8L89k07K9k54L9P8O7j75K81
2631D2p7j85L18l22M38J14m23K90l60K22p8K41m15L27P1l76K4K37k39K63q5J77
2653B04r9k73L05l37J53j00o4R7K22j53l81N62J10l63o1N2K36l13K56k23K33j73
2675a10J60k01K09O5l7l66L12K68o40M18j13J26n5M16n63K02j40m0J5p8M00m98
$$ y = [-178, -6, 60, 188, 223, -48, -221, -71, -12, 106, -264, 34, 24, 30, -2, 68, -65, 18, -263, -161, -92, -65, -16, -147, 59, 377, -74, 234, 99, 171, -95, -27, -109, 233, -100, -266, 226, 3, 128, -172, -190, -54, 9, -152, -170, -186, -75, -320, -201, 65, 113, -199, 123, 114, 45, -283, -63, 48, -4, -55, -21, -10, 108, -7, -155, -117, 123, -124, 35, 223, -99, 116, -256, -230, -45, 24, 122, -59, 2, -160, -100, -51, 353, -89, -47, -124, -52, 78, 91, 44, 31, 134, -163, -226, 76, -248, 270, 22, -159, -24, 138, -246, 11, -112, -186, -91, 48, -107, -205, 184, -23, 6, -248, -209, -131, -64, -239, 42, -35, -220, 98, -224, 214, 328, -95, 195, -165, 57, -21, 220, -195, 132, 203, -173, -149, 88, -151, 112, 27, 204, 105, -168, 137, -200, -47, -147, -211, -114, 108, -45, -426, 136, 246, -117, -178, -126, 110, -203, 53, -170, 63, -110, 50, -151, 58, 123, 86, -280, 32, 300, -340, 78, -35, 91, 36, 452, -111, 91, -49, -89, -74, -152, 248, -250]
2697b50J88Q1J20m24M78k24j44L01j42j71M89m09K82k76Kj92l1K40N9m3K85l68
2719a49J56K12j18j74j30K56k25m4J78K7K46l01j4J27j54J14K46K4j55K03l61
2740c6K37j43j12j39L15k05K71k94L3QJ69l84J34J95j1J08p0j93j11L98j01k52
2762a83J71j09O9J41l12K72j57L25m9k38j53L0L3R0J17K38j88k04K95k07R0k11
2784a40J68Q6r3l7J02o5Q4K14m08N1q1nL46pj04J92o18J09L05q5k60J96R1Q6K63
2809C90m71J93J26l03L73m35j06K41K50m20Q2k2M2j59K64K25l26o6J98K76j93
2830A59J6j20Nn5o5Q3k17k2L82M0L7j71J33l13LK16j02j63p6J33R2N1NJ65k10
2855FJ1R3j49%k52K93N8J4J6k44M77j98N2j45J91k66J20j3L9m0Rkj86J66k09J54
$$ y = [-250, -62, 19, 139, -285, 193, -31, -175, 126, -16, -187, 302, -107, 175, -101, -99, -291, -322, -82, -23, -66, 219, -149, 7, 219, 101, -73, -203, 53, -172, -216, -38, -11, 235, -66, -80, 47, -107, 7, 253, 277, 122, 325, -36, 201, 58, -54, -193, 122, -83, 188, -106, -73, -65, 104, -280, -146, 49, 38, 146, 76, -117, -228, 170, 69, -183, -12, -121, -52, 89, -223, 49, -108, 217, 168, -70, -223, -193, -160, -70, 47, 285, 97, -107, 188, -19, 71, -140, 28, 114, 21, -16, 86, 21, 105, 319, -89, -38, -119, -124, 222, 215, 111, 303, -315, -206, 99, 14, -246, -50, 41, 127, 390, -81, 112, 238, -65, 308, -127, -233, 8, 258, -162, -80, -102, -60, -219, 45, 270, -56, -122, 76, 352, 159, 175, 55, 60, 5, -60, 23, -194, -216, 166, 206, 243, 72, 205, -108, -105, 111, 9, -154, -230, -97, -5, 46, 51, 216, 6, 17, 110, -39, -39, -291, 2, 60, 74, 90, -154, 323, 125, 177, 32, 223, -43, 77, 64, 103, 63, 72, 70, -116, 50, -159, -5]
2881ep6P8j88K76k4j43o6P0RL18r4r9N7K0j42J01J57l63k17J93L25j28O6O7l71
2906a79M1J4J40J32k13Q2q4R9J08l02q7J55P8J16m13M54L7l44K84l5j41O1j06
2929a03K7q4Q8O2R4j92J24J55j58j3O6Mk8J06O9j13o4L33l85M9J64j84j24J11
2953DK70k86j25K73j44p9L20l67J75M7l39KM08k43K58l09J45P7m4N0j36j9j0O8
2977dj33K7O2k24K61J05j77J57R6o5j02K33o2l90L41j71J62j34J31j85J44k80
2999b08j98L80p1m3M47l84k25O21Q3l25q1M6N6r3k94K01n6K71j65K21k91O7R8
3022E7J29k89K29m28K62k31J11N2J3R2M7j02k04L67q6o4k13L64K9l9M6k73J76
3045D5P6L3j70j28n6J47L45l31R8j5q6o6L43k56j2O9p3j68J24l9O6K86J4l56r
$$ y = [-5, -81, -3, -191, 85, 61, -82, -148, -78, -69, 249, 155, 56, 113, 133, -9, 92, 249, -114, -331, -138, 187, 59, 125, 192, -179, -138, -124, 16, 148, -65, 17, -67, 32, 140, -162, -249, -94, -16, 100, -313, 141, 178, -166, 118, 83, -58, 3, -103, -76, -160, -72, -10, 84, -108, 16, 171, 13, 0, 66, 70, 42, 148, 217, 104, 40, 373, -12, 37, 201, 17, -107, 4, 274, -12, -137, 136, -8, -87, 233, -134, 41, 88, -251, -249, 159, -84, 174, -135, 10, 87, 43, 93, -43, -62, -72, -4, -137, -110, -48, -272, -11, 94, -83, 74, 170, 105, 3, 236, 174, -216, 125, -46, 116, -18, 113, -72, 72, -208, -406, -26, -97, -140, 307, -77, -302, 319, 402, 77, -4, 42, 98, 5, -289, -88, -144, 127, -38, 183, -108, -41, 57, 186, -103, 126, -302, -40, -271, -160, -108, -95, -3, 44, -58, -262, 105, 19, -45, -258, 106, 135, 96, 142, -131, 45, 121, 154, -16, -144, -200, -53, 292, -39, 59, 44, -42, -108, 235, -21, -33, 36, -37, -205, -81, -120, -54, 232, 246, -110, -119]
3070a19J92k38q1K8L64J4K5m28N70j65j23O3L3k09J39q3MJ39j38j11L80l06j40
3093a90N3K36O1l06K7k44L28P6k11L42k2o7j25K6q3J89n4K35j41l14J05P3J51
3116A45n79M88n0J59m08J57K07l64M46j38m7j62M2L0r2J2L64j95J92q3M7r6Rr5
3140a1r7K20j56K39m21L9J35J06k55J80m4k0J86Qk39L53k72Q5m1O9o7m2K26k00
3164a9oj56J01K58j87j45J36J58l29k67N22Q0r0o0N7j6p6P9q2N9n2J93m68J28
3188a82K38K96r6r6k66L68l38K38k21L4K6M8m4k4n9l3J51l8J27k39n2K93l80K67
3212A8L8j08j1J44j52j08j18M53k77J82k31O9J21k09K25p3K1R9l3q2Q9j18J94
3235A33l59J19K78k87J27J17m26M09j27p7K62j66k64M73L1j52l1k1L1K78m19L1
$$ y = [-119, 73, -165, -246, -218, 146, 160, 185, -243, 327, 162, 39, 102, 135, -74, 65, -18, -14, 125, -13, -124, 256, -50, -190, -137, 99, 160, -146, -119, -363, -35, 41, -170, 172, 150, 83, -42, -16, -99, 90, 36, 271, 130, -184, -79, -6, 145, -434, 54, 4, 163, -245, -88, 119, -245, 201, 63, 16, -146, -104, -74, -166, -154, 210, 15, 207, 124, 171, 75, 84, -11, -108, 112, -44, 195, -226, -187, -52, 54, -201, -21, -65, -85, 101, 109, -130, 223, -49, 36, -5, 64, -3, -45, 181, -19, -25, -181, -80, 178, -9, -154, -18, 140, -189, -456, 66, 146, 56, -4, 53, 37, -39, 40, -42, 17, -35, 158, -310, -182, 56, 352, 256, 160, -106, 262, -76, 162, -59, -25, 1, 49, 5, -19, -78, -111, 40, 2, 129, -110, -162, 131, -249, 18, 56, -52, -63, 81, -71, -179, -297, 156, -121, 61, -170, -101, 20, -189, 36, -37, -16, 83, 50, -32, 57, -61, 133, -226, -107, 171, -116, 11, 128, -298, 111, -16, -93, 169, 3, -261, 212, 243, 91, 60, 39, 70, 348, -71, -40]
3257d0o3J23l4M23l98r5l9l1L8L2K58k53k14J56o0K54J18r8O9k52j46N03l41j10
3281b00N5J46j63J72j9nL11q8p8j64M5j56K50o5q6j72K29q4J6J54j22o9j39J90
3305d2p1P8L7k54L89j61K12k57k2J14j20n3r2L48j00j85K13l21J52K30j77m5k4
3328a51n9J13P1j02K39r3j30n8M20k40J71l47L00q0k6nk49l3J11J44o1K78j04
3351A09k98L4L14k41j05J77j1J10n4r4J84m2KO1j92J20m0j23JJ87k67J31Q2p1
3375b6l18J59Q6K02l36K88j56K67l7j85K55j11l5j8k74L06j85R5K66j27r6J19
3397A39k98J58k84L2K78q7K36k64K50k80n1K96k83J12K04J06j91j14J29l03K81
3418F6j45Q9Q8j13J6j79J74j92J32J00k70J92k41N11k33q7J47j27R9J7J96k63
$$ y = [-40, -103, 20, -14, 409, 11, -84, -123, -154, -116, -84, 174, -79, -293, -137, -197, 57, 175, 77, 146, -106, -252, 251, -90, -200, -145, 1, -162, 10, -9, -14, 297, 209, 131, -33, 12, -144, 106, 41, -45, -217, 12, -72, -56, 98, -24, -93, -232, -42, -113, -35, 2, -252, 137, -24, 188, -69, -91, 23, -97, -150, -242, 106, 6, -179, 34, -287, -135, 95, -82, -127, -151, -210, -97, -26, -128, 111, 18, -112, -170, 250, 10, 181, -166, 134, 54, 28, 23, -226, -259, -148, -4, -65, 213, 109, -189, -155, 159, -82, -187, -10, -21, 89, 35, -59, 125, 83, 85, 146, -46, 74, 34, -89, -88, 99, -168, -37, 45, -26, -344, -185, -99, 103, -233, 55, -101, 166, 129, -56, 199, 88, 53, 35, -239, 67, -118, -23, 243, 116, 20, 139, -159, -1, -285, -253, 25, -62, 174, -90, 160, -120, -171, 125, -158, -46, 158, 264, 73, -41, 88, -215, 66, -79, 10, 98, -15, 1, -178, -4, -196, -64, 36, -234, -42, -283, 228, -5, -92, 55, -72, 27, 44, 240, -23]
3440b3RJ27j65J77J01j00l66N47j48k91J88j08OJ3J89k02L53k25j46Q7k4k14L14
3463I9l42K45j24R0J59j35J70l40J65l5J27Q1j23J18m14K54J29n7J21k47jj01
3485a61J09j49J66r6R0J0J26j14l0J95J11n36J77K48Q0j35l9K4j20j40K99J46
3507B61l0j70P3k66j01M22j84N1k3J30k39Q3r0K23J66k15j36R5p9k09L97mj32
3530B3Jq4j48K84r8J15qp1j93J23J29p2j02K24pj21j1J81j72P7r6j81K73r7N5
3555B4q2Q6j8l11L66m3K42l87P9K06n62P23k63k34K27m5k5P0j35K43k47J49j79
3578a16K79k26k38J97J90J19k23N0l40M42k5J18k07K4j41m3K35j93NJ74j36J26
3600G1q7Pn9o3q8K94m4j86O3J40M9K75j02j35j97K43j54J60l9k25R3j04K00L6
$$ y = [-23, -14, 113, -52, 125, 226, 126, -240, 307, 159, -132, 56, -52, -46, -33, 156, -46, 307, 82, -64, 23, -1, -215, 99, -243, 2, -122, -32, 127, -8, 162, -178, -13, -48, 79, 160, 37, 155, -259, -5, 124, 67, 188, -59, -60, -161, -52, -201, -35, -131, -41, -31, 95, -19, -49, 146, 257, -279, -102, 146, 226, 91, 52, 76, -44, -184, 115, 261, 231, 61, 134, -132, -233, 189, 5, 56, 33, 163, -76, 7, -83, 140, 306, 91, -45, 50, -29, -238, 159, 155, 23, 24, -60, -208, 76, -22, 93, 85, 14, -179, -56, 73, 1, -101, 123, 116, -5, -16, 165, -7, 70, -26, -207, 66, -31, 24, -58, 28, 10, -301, 65, 22, 264, -123, -44, 162, -400, 323, 60, -174, 53, 8, -17, 53, -82, 161, -86, 63, -116, 163, -63, -301, -104, 86, 205, -18, 32, -308, 134, 109, 227, 20, 44, -97, -140, 95, -98, -93, 81, -55, 71, -16, -9, -68, -131, -219, 75, 31, -155, -92, 48, 97, 372, 270, 135, -62, 181, 27, 187, 148, -77, 16, -88, 112, 148]
3624A48j87Q8o4J15k48Q7P1Q8j95j6J96n5N2j28N7J72m96M86k52k2p0J23K56j30
3648G6M5l12J82J5J58r5k4j36K5L6L45k94N1n6m3k6o9l2K13j53o08J241p89N59
3672C09r9j79Q1k07J25j87J27J44J26j23k20R7J0m8J55j4RR1o9p2j41L79l69K71
3696A96k15K80k09r9J49k84M10R2p6j18j35k6K1j56J90l8J16k08J05j22J24J71
3718A68M2q7k88p4K14J05rl03J94J99J5K5j89k46N07o87O29l56M82M36j036M03
3740A44J7j13j40L7j13M25m63J35j03K52k77K94j13j2K66j75k98M84l23K80j49
3761E5J41l11K71q6p1M5j3l38L95M3j84K07k08n4K1J43O9k28K82J91m50n7j56
3784b93L50M9j79J27j93J43j62m5q4J64K27P9k0k30n2LK6n7O8j34J37K4R4j16
$$ y = [148, -39, 49, -15, 100, -148, -61, 10, 98, -97, -113, 83, 28, 80, -48, 9, 181, -315, 171, -81, -103, -173, -50, 206, 76, 121, -191, -9, 6, 164, 69, 45, -91, -66, -30, 315, 21, 72, 16, -27, -53, -122, -154, 59, -94, -702, 539, -250, 309, 210, 31, 112, -95, 30, -157, -30, 114, 240, 117, -103, -6, 4, -44, 111, 97, 106, 197, 128, 56, -85, 294, -75, 196, -19, 261, 52, -47, 102, -182, 228, 320, 244, 126, -9, -35, -14, -170, 20, -18, 98, -110, -5, -127, -3, 168, 210, 123, -165, -239, -25, 80, 71, -232, -38, 161, 176, 201, 12, -234, 273, -414, 215, -141, 341, 777, -259, 144, 161, 48, -92, -55, -168, 257, -206, -71, -174, 78, -199, 95, -18, -30, 236, 61, -237, 247, -76, 204, 55, 196, -115, 156, 70, -1, 44, 31, -307, 88, 131, -53, 154, -54, -108, -87, 56, 125, -103, 179, 370, -80, -137, -293, 57, 106, -73, 54, -139, 4, -158, -203, -287, -123, 104, 183, 163, -67, -119, -116, -90, -147, -79, -213, -76, -52, 42, -74]
3808g4K17l27J06K11p6k29K23k23K30j3p4J1J75J94k71o6j44J64j88O6O0K80o2
3831A90J90m89J79j87j69K37p3K08k73J14M9R2O1k87K96k56R9R0L7j61J04J01
3853A52N3j45r7P9l3Q1j5k50J88rKJ57k1r0J25k80L59m59r9M86M1K04l55k44P1
3878i9k3P2j90J97pJ79j38j72K30R6k37j6K39r7j40j7n3R3J18M9K7j54J62q3l5
3903Aj55M70k33J5L9q6P1L7K5j01j42K59m98L39L6j10O4j24J03j91J02p9Q8N3
3927a7K21j81j94K85k90J95q4k90J16L7R3O1J25K2l19K21K30m92L03P6l61L81
3949A38r1O6k62J18k23K25N0lj65J36r4j85L44k86L00j55j34K60o4j03J26l7N1
3972A2rJ38J82l49L4j1n0j84j5K25J17k3J44k27j20L43J80n12L28m26J64k4L0
$$ y = [-74, 143, -184, -78, 133, 57, -172, 51, -172, 58, 45, -29, -18, 157, 351, 80, 14, -130, 34, -154, -88, -28, 252, 190, 380, -109, 70, -117, -286, -49, -122, 86, -187, -73, -24, 68, 129, -158, 138, -118, -19, 71, 108, -53, 51, 152, 205, 60, -37, 42, 9, 90, 75, -175, 13, 4, 6, 163, 142, 52, 177, -103, 256, -203, -302, 184, 225, 429, 74, -170, -99, -122, -50, -240, -43, -50, 129, -9, -181, 49, 145, -92, -108, 131, 34, -106, -123, -176, -83, 35, 84, 111, -43, 119, 36, 1, -154, 316, 83, 98, 137, 51, 122, 159, 184, 83, -59, 200, -298, 41, 77, -33, 31, -93, 10, -181, -79, -158, -70, -17, 204, 23, -171, 114, -176, 19, -65, -355, -239, -202, -109, -48, 77, 99, -220, 1, 231, -261, 42, 118, -243, 138, 47, 113, -149, -31, -254, -29, 21, 18, -147, -11, -105, -290, 54, -232, 68, -87, -221, 39, -25, -128, -2, -39, 12, 3, 141, 323, -26, 8, -3, -53, -237, -252, -27, 90, 67, 211, -16, -136, 207, 387, -125, 203, -223, -59, -83, -53]
3995e3L45j59k73k5J83J47k01M2P1j76p9J41r4L04j48L1j73K50N5j13j42kN8r9
4019a10J72N2k15l11J56K3R1K8Q0P0j6k07K75k5p7Q1J11j30R0k28J24k11L08m8
4043H3J5R6l69L72k44o5Q8J26j89J15L5Q4l47Q9R0j23K87l22J92n2Q5q5L11j04
4067A68k69J19j10P0J37j11p5k29K21J6J21K00m24J80J00Kl18M13l93J35J28o2
4089A9J94j52j35j77M88k85q6k11M74l31K75k30J10J12Nj68K8L5j21J30J22l21
4111b25K73j64o8L84K5l7O4l76J47j1J76k29N8M3J20r5P0j64k37K09O0J90k73
4134f0n4j20J63k59K49L7J70J9p8n2l2l7J81j52l1N5Ol4O7q3N4m6M04l11j8P9
4160A17l53K5K37k1L33j13m58K28j11j5J39o7L80k74m9p7J40K23l76K89k23L7
$$ y = [-53, 292, 133, -140, -165, 18, 165, -36, 6, 77, -99, -178, -37, -131, 173, 25, 56, -117, 133, 188, 75, -67, -69, -11, -110, 62, 114, -101, -412, -256, -233, -142, -114, -34, 36, 20, -187, 88, 63, -14, 67, 178, 48, 138, -90, 34, -177, 131, 83, 98, 194, -175, 197, -47, -112, -24, 102, -87, 28, 63, 147, -200, -111, -21, -144, 143, -179, 13, -39, 46, -39, 272, 168, -101, 18, -92, -22, 115, 4, -71, -300, -79, -63, 58, 258, -166, 14, 114, 116, -202, 211, -182, -47, 81, 19, 213, 61, -74, -251, 237, -48, -134, -345, 129, -202, 73, -157, -47, 65, 70, -98, -70, -35, -156, -26, 96, -225, 48, -116, -184, 200, 225, 188, 252, -124, 23, 12, 188, -41, 17, 60, 180, 85, 155, -9, -246, -37, 23, 213, -60, -114, -234, -71, -330, -81, -44, 126, 145, 67, 15, -17, -54, 127, -25, -56, -1, 5, -29, 38, -45, 9, -37, 367, 56, 38, 117, -236, -211, 26, 5, 338, 225, -233, -5, -116, -131, 8, -59, 321, 47, -2, -79, 61, 284, -92, 197, -26, 11]
4182A1J41q8k75K40J21j35m5J28m1j33k72L27M7K84l39J41j93M4J54O4j29M9j73
$$ y = [11, 152, 64, -211, 29, 150, 15, -30, 98, 57, -76, -348, -21, 26, 310, -29, 112, -81, -37, 117, 181, 52, 101, -72]
$$ [...]
8191e6
##END NTUPLES=NMR FID
##END=
