##TITLE=1H_DE-162_oil2
 200.13Hz, DMSO-d6+CCl4.
 8 sc
 10.7.2026
##JCAMPDX= 6.0         $$ Bruker NMR JCAMP-DX V2.0
##DATA TYPE= NMR FID
##DATA CLASS= NTUPLES
##ORIGIN= UXNMR, Bruker Analytische Messtechnik GmbH
##OWNER= pz
$$ XWIN-NMR		Version 3.5
$$ Fri Jul 10 14:28:25 2026 Russian Standard Time (UT+4h)  she@DPX200
##.OBSERVE FREQUENCY= 200.1313
##.OBSERVE NUCLEUS= ^1H
##.DELAY= (6, 6)
##.ACQUISITION MODE= SIMULTANEOUS
##.ACQUISITION SCHEME= undefined
##.AVERAGES= 8
##.DIGITISER RES= 18
##SPECTROMETER/DATA SYSTEM= spect
##.PULSE SEQUENCE= zg30
##.SOLVENT NAME= DMSO
##.SHIFT REFERENCE= (INTERNAL, DMSO, 0, 14.3821)
##AUDIT TRAIL= $$ (NUMBER, WHEN, WHO, WHERE, WHAT)
$$ ##TITLE= Audit trail, XWIN-NMR		Version 3.5
$$ ##JCAMPDX= 5.01
$$ ##ORIGIN= Bruker BioSpin GmbH
$$ ##OWNER= she
$$ F:/spectra/data/she/nmr/H-C/1/audita.txt
$$ ##AUDIT TRAIL=  $$ (NUMBER, WHEN, WHO, WHERE, WHAT)
(   1,<2026-07-10 14:27:07.28 +0400>,<she>,<DPX200>,
      <created by zg, POWCHK disabled, PULCHK disabled
       configuration hash MD5:
       00 E9 B6 7A A2 85 ED C7 34 08 36 98 17 FE 4E 26
       data hash MD5: 16K
       A7 74 85 F4 B8 D4 1A 94 F2 82 A3 58 CF 36 19 05>)
$$ ##END=
$$ 
$$ hash MD5
$$ 8D 06 BB 36 B0 BF 8C F4 CA 35 4A 37 70 A6 DD BF
##$RELAX= 
##$RELAX= 
##$RELAX= 
##$RELAX= 
##$RELAX= 
##$RELAX= 
$$ Bruker specific parameters
$$ --------------------------
##$DU= <F:/spectra>
##$EXPNO= 1
##$NAME= <H-C>
##$PROCNO= 1
##$TYPE= <nmr>
##$USER= <she>
##$AMP= (0..31)
100 100 100 100 100 100 100 100 100 100 100 100 100 100 100 100 100 100 
100 100 100 100 100 100 100 100 100 100 100 100 100 100 
##$AQSEQ= 0
##$AQ_mod= 1
##$AUNM= <au_zg>
##$AUTOPOS= <>
##$BF1= 200.13
##$BF2= 200.13
##$BF3= 200.13
##$BF4= 200.13
##$BF5= 200.13
##$BF6= 200.13
##$BF7= 200.13
##$BF8= 200.13
##$BYTORDA= 1
##$CFDGTYP= 0
##$CFRGTYP= 5
##$CHEMSTR= <none>
##$CNST= (0..31)
1 1 145 1 1 1 1 1 1 1 1 1 1 1 1 1 1 1 1 1 1 1 1 1 1 1 1 1 1 1 1 1 
##$CPDPRG= <>
##$CPDPRG1= <>
##$CPDPRG2= <>
##$CPDPRG3= <>
##$CPDPRG4= <mlev>
##$CPDPRG5= <mlev>
##$CPDPRG6= <mlev>
##$CPDPRG7= <mlev>
##$CPDPRG8= <mlev>
##$CPDPRGB= <>
##$CPDPRGT= <>
##$D= (0..31)
0 0.7 0 0 0 0 0 0 0 0 0 0.03 0 0 0 0 0 0 0 0 0 0 0 0 0 0 0 0 0 0 0 0 
##$DATE= 1783679226
##$DBL= (0..7)
120 120 120 120 120 120 120 120 
##$DBP= (0..7)
150 150 150 150 150 150 150 150 
##$DBP07= 0
##$DBPNAM0= <>
##$DBPNAM1= <>
##$DBPNAM2= <>
##$DBPNAM3= <>
##$DBPNAM4= <>
##$DBPNAM5= <>
##$DBPNAM6= <>
##$DBPNAM7= <>
##$DBPOAL= (0..7)
0.5 0.5 0.5 0.5 0.5 0.5 0.5 0.5 
##$DBPOFFS= (0..7)
0 0 0 0 0 0 0 0 
##$DE= 6
##$DECBNUC= <off>
##$DECIM= 32
##$DECNUC= <off>
##$DECSTAT= 4
##$DIGMOD= 1
##$DIGTYP= 9
##$DL= (0..7)
0 120 120 120 120 120 120 120 
##$DP= (0..7)
150 150 150 150 150 150 150 150 
##$DP07= 0
##$DPNAME0= <>
##$DPNAME1= <>
##$DPNAME2= <>
##$DPNAME3= <>
##$DPNAME4= <>
##$DPNAME5= <>
##$DPNAME6= <>
##$DPNAME7= <>
##$DPOAL= (0..7)
0.5 0.5 0.5 0.5 0.5 0.5 0.5 0.5 
##$DPOFFS= (0..7)
0 0 0 0 0 0 0 0 
##$DQDMODE= 0
##$DR= 18
##$DS= 0
##$DSLIST= <SSSSSSSSSSSSSSS>
$$ [...]
##$SUBNAM0= <"">
##$SUBNAM1= <"">
##$SUBNAM2= <"">
##$SUBNAM3= <"">
##$SUBNAM4= <"">
##$SUBNAM5= <"">
##$SUBNAM6= <"">
##$SUBNAM7= <"">
##$SUBNAM8= <"">
##$SUBNAM9= <"">
##$SW= 18.0517328524113
##$SWIBOX= (0..15)
0 0 2 0 0 0 0 0 0 0 0 0 0 0 0 0 
##$SW_h= 3612.71676300578
##$TD= 16384
##$TD0= 1
##$TE= 0
##$TE2= 300
##$TE3= 300
##$TEG= 300
##$TL= (0..7)
0 120 120 120 120 120 120 120 
##$TP= (0..7)
150 150 150 150 150 150 150 150 
##$TP07= 0
##$TPNAME0= <>
##$TPNAME1= <>
##$TPNAME2= <>
##$TPNAME3= <>
##$TPNAME4= <>
##$TPNAME5= <>
##$TPNAME6= <>
##$TPNAME7= <>
##$TPOAL= (0..7)
0.5 0.5 0.5 0.5 0.5 0.5 0.5 0.5 
##$TPOFFS= (0..7)
0 0 0 0 0 0 0 0 
##$TUNHIN= 0
##$TUNHOUT= 0
##$TUNXOUT= 0
##$USERA1= <user>
##$USERA2= <user>
##$USERA3= <user>
##$USERA4= <user>
##$USERA5= <user>
##$V9= 5
##$VALIST= <valist>
##$VCLIST= <CCCCCCCCCCCCCCC>
##$VD= 0
##$VDLIST= <DDDDDDDDDDDDDDD>
##$VPLIST= <PPPPPPPPPPPPPPP>
##$VTLIST= <TTTTTTTTTTTTTTT>
##$WBST= 1024
##$WBSW= 4
##$XGAIN= (0..3)
0 0 0 0 
##$XL= 0
##$YL= 0
##$YMAX_a= 201358
##$YMIN_a= -138729
##$ZGOPTNS= <>
##$ZL1= 120
##$ZL2= 120
##$ZL3= 120
##$ZL4= 120
##$ABSF1= 10
##$ABSF2= 0
##$ABSG= 5
##$ABSL= 3
##$ALPHA= 0
##$AQORDER= 0
##$ASSFAC= 0
##$ASSFACI= 0
##$ASSFACX= 0
##$ASSWID= 0
##$AUNMP= <proc_1d>
##$AZFE= 0.1
##$AZFW= 0.1
##$BCFW= 1
##$BC_mod= 2
##$BYTORDP= 1
##$COROFFS= 0
##$CY= -3
##$DATMOD= 1
##$DC= 2
##$DFILT= <>
##$DTYPP= 0
##$F1P= 0
##$F2P= 0
##$FCOR= 0.5
##$FTSIZE= 0
##$FT_mod= 4
##$GAMMA= 1
##$GB= 0.15
##$INTBC= 1
##$INTSCL= 1
##$ISEN= 128
##$LB= 0.25
##$LEV0= 0
##$LPBIN= 0
##$MAXI= 10000
##$MC2= 0
##$MEAN= 0
##$ME_mod= 0
##$MI= 1.114404
##$NCOEF= 0
##$NC_proc= 0
##$NLEV= 6
##$NOISF1= 3.799351
##$NOISF2= 2.8
##$NSP= 1
##$NTH_PI= 0
##$NZP= 0
##$OFFSET= 14.38212
##$PC= 1
##$PHC0= -4224.492
##$PHC1= 17.3923
##$PH_mod= 1
##$PKNL= yes
##$PPARMOD= 0
##$PSCAL= 0
##$PSIGN= 0
##$REVERSE= no
##$SF= 200.129724274929
##$SI= 16384
##$SIGF1= 3
##$SIGF2= 2
##$SINO= 400
##$SIOLD= 16384
##$SREGLST= <1H.CDCl3>
##$SSB= 0
##$STSI= 0
##$STSR= 0
##$SW_p= 3205.1282051282
##$SYMM= 0
##$S_DEV= 0
##$TDeff= 0
##$TDoff= 0
##$TI= <>
##$TILT= no
##$TM1= 0
##$TM2= 0
##$TOPLEV= 0
##$USERP1= <user>
##$USERP2= <user>
##$USERP3= <user>
##$USERP4= <user>
##$USERP5= <user>
##$WDW= 1
##$XDIM= 8192
##$YMAX_p= 0
##$YMIN_p= 0
$$ End of Bruker specific parameters
$$ ---------------------------------
##NTUPLES= NMR FID
##VAR_NAME=  TIME,          FID/REAL,        FID/IMAG
##SYMBOL=    X,             R,               I
##VAR_TYPE=  INDEPENDENT,   DEPENDENT,       DEPENDENT
##VAR_FORM=  AFFN,          ASDF,            ASDF
##VAR_DIM=   8192,          8192,            8192
##UNITS=     SECONDS,       ARBITRARY UNITS, ARBITRARY UNITS
##FACTOR=    0.0002768,     1,               1
##FIRST=     0,             0,               0
##LAST=      2.2672688,     0,               0
##MIN=       0,             -138729,         0
##MAX=       2.2672688,     201358,          0
$$ Real data points
##PAGE= N=1
##DATA TABLE= (X++(R..R)), XYDATA
0@%%%%%%%%%%%%%%%%%qJ6j6J6j6K2l0L2l8M6n4O2p0Q0r1J05j20J37j55J75j96
38a03K19k44K72l04L38l75M15m61N11n62O20o84P53q31R15j008J112j226J356
57G13j505J675j870K098k369K698l109L637m343N332o824R356k0288J43112k6110
72A02203j38611L9762l8765j03318N2958J32249r552j5240N1521o1291j17002
83a05086P9090J13005l6448j3782M7269o5009q5719L3374L7046m0723J3744O2773
95C9534m3864p5444M8431M5538l1892K7290M9679m4717l4783M0456K482m3374
107b0664K8888N4232m2040m7472M0415j92n4940K1854L8584l7308j9415L1758
119f300k922k3589K8033L3326k2193n489L4476j8854l6836L0195K0132l1162n093
$$ y = [0, 0, 0, 0, 0, 0, 0, 0, 0, 0, 0, 0, 0, 0, 0, 0, 0, 0, -8, 8, -8, 8, -8, 14, -16, 16, -22, 24, -30, 32, -38, 42, -49, 56, -64, 73, -82, 93, -103, 116, -128, 144, -160, 178, -197, 218, -243, 268, -294, 326, -358, 395, -436, 479, -529, 583, -643, 713, -792, 883, -987, 1111, -1258, 1440, -1669, 1968, -2375, 2957, -3867, 5489, -14799, 128313, 102203, -36408, 3354, -35411, -138729, -85771, 46478, 36926, 21686, 73207, 11916, -105086, -25996, 87009, 50561, 36779, 84048, 19039, -66680, -33306, 3740, -36983, -23239, 39534, -4330, -79774, -31343, 14195, -17697, 9593, 59272, 14555, -20228, 20228, 22710, -20664, 8224, 62456, 20416, -27056, 13359, 13167, -41773, -19919, 18665, -18643, -38058, -6300, -9222, -32811, -4778, 28548, 6355, 866, 35342, 16488, -20348, 9847, 29979, -1183, -6276]
132f276J8008j2524j8244J1160Q772j6501M305K0122j9976j8725K9398J3391j5443
145b533P825J4308p242q730P016P46j3945L416J1133j8679j2244J7209o6j1254
159a3040Q372M644q011J285Q920j280p093R348Q494j1977r74J3701n157o793O043
174F482m140p489K407K213m328l602M439K226o473M449Q666m251n5O252k596r41
190C259R11m14J63j467k189j183k639L528J679o901J212M263k526j063Q19L70
206b178K350k43o28J053J64N061O93n848O53K419k802j349j608j246K169j182
222b522j111J303J503L395k84l530J425P73j070K434j390j631L056J00j190L5
238A296q3J332k222l796R01k25k40K341n72m16K851m41L38Q52o84N66j200j907
$$ y = [-6276, 11732, -792, -19036, -7876, 896, -15605, -11300, 8822, -11154, -29879, -481, 12910, -2533, 5292, 19600, 12358, 3628, 10644, 11390, -2555, 861, 11994, -6685, -18929, -1720, -1786, -13040, -4668, -24, -8035, -6750, 2170, 890, -6203, 3145, 11639, -338, -1312, 12389, 7232, 439, 6482, 2342, -5147, -2740, -527, -4855, -8457, -4018, -1792, -8265, -3816, 4850, 599, 544, 6796, 4200, 3259, 4170, 3756, 3919, 2452, 263, -920, -3559, -31, 1648, -5253, -4041, 222, -2304, -3367, -2548, -2178, 172, -71, -699, 354, 518, 5579, 6272, 424, 1077, 3496, 694, -655, -2263, -3509, -1340, -2522, -3633, -2330, -827, 2568, 2284, -1246, 179, 952, -118, 2316, 926, -705, 2351, 2451, 1261, 1296, 1213, 2545, 323, -3473, -2572, -2797, -3037, -696, -1268, -1684, 1167, 726, 1064, 1916, 1232, 1798, 598, -1309]
256a309J303o81K23K020j342o15J168j518m74K097j373j203o11O29K690q83M1
273A62K186p36l35M64k243O43J830j658j944n18J391J657j404l62J148p76J7L64
291a14j712J699J448j852k81K93P86J544j063l96N83j350O06L89j455N29Q00j393
309i39O03m39J56J735r03n1k9r27J521L20j393O43N24p62L66p09N16P01j314L9
329c42J13j373J098K04p45J038j19n53R24L45J14l96r94Q61Q6j217N6R31QK31
349B70q21J08J282K57p81q50l39N90K87r76P94L53L51K74n20K67O52p09o2l42
369H5j104N09O53k97p8K29k23P59o37l14J47J74l0k11n47J008L43o8K29o70K12
390A69M25r07r6O65n58J28k49k92R99l13o0O55n29l17L72j35O04l5j030K00P26
$$ y = [-1309, -6, -687, -464, 1556, 214, -401, 767, -751, -1225, 872, -501, -1704, -2315, -1686, 1004, 121, 162, 2348, 1612, 1277, 1741, -502, 141, 1971, 313, -1631, -2149, -758, 899, -505, -867, 281, -495, -478, -114, -1826, -127, 1321, -531, -812, -519, 267, 1811, 748, 352, 935, -415, 191, 580, -875, -346, 454, -939, -336, -775, -619, 1116, 213, 162, 133, -794, 727, 1047, -346, 297, 821, 59, 425, -284, 232, 933, -381, -342, -229, -1602, -504, -300, -1045, -7, -126, -679, 245, 590, 704, 308, -686, 175, 261, -956, -900, 31, 39, 270, -551, -443, 839, 1096, 315, -535, -874, -284, 3, -973, -179, 174, 525, 799, 279, 546, 1198, 489, 427, 85, -1019, -510, 143, -154, -232, -3, -226, 533, -104, -418, -271, -97, -127, -338, -885, 123, 466, 398, 627, -43, 169, 594, -313, -409, 256, -302, -174, -423, -715, 284, -29, -89, 566, 37, -280, 92, -43, 561, 526, -504, -304, 422]
411D22k09O4m26J91N10o50q01R19K43J7n16m09N96J27k15J15r6k7N65n66J28L35
433C17j83Q3ol28Pj64K18L33k81l10O62m84n1K84o57R54j61k36j21K22L76j13
455C61p54L18L66n68J14J95o30L19M20j55j76L10K57j32m37J81P6m89P53K5m78
476a24j93P70l3l18j20R3k02n27N28r9o14J193M3r84O44K41j34j31L50m15l14
497c46p7P26m95LL42O2o00K74J73k19J01R1l18o1q3P24k38l84P86k89m85M39k59
520a33J71K0K1o2n04K77O39o98j14O51j62m78N60J46l34J8K38j40m75M02K60n73
542b70J13K35k67l57M72K70k71l77M60L82n90M29J3j49j94J56l32l4O86j96n06
563c27L93pJ79k38Q9O9n94N73k3l20k5N95l51j11Q1P5m6J05j16O0n31M53ql77
$$ y = [422, 213, 277, -149, 42, 552, -98, -899, 20, 263, 280, -236, -645, -49, 78, -137, -22, -118, -145, 420, -146, -18, 317, 134, 217, 211, -117, -110, -274, -56, 277, -4, -314, 348, -136, -187, 97, -560, 394, 233, -3, -124, 98, 474, 361, -393, -75, 291, -277, -163, 32, -598, -279, 141, -14, -190, 120, 377, 245, -192, -11, 65, -424, 329, 354, -124, -317, 453, 420, 102, -18, 75, -127, -654, -126, -225, -839, 354, 397, -587, 57, 298, 164, 33, 383, -32, -346, -423, 303, -192, -189, 153, 215, -385, -111, 62, -157, -56, 35, -283, -344, -427, 297, 59, -325, 461, 172, -313, 126, -133, 38, 58, 79, 17, -487, -210, 429, -269, -383, 268, 106, -372, 188, 334, 0, 18, 256, 116, -359, 43, 303, -270, -157, 78, -189, -546, -74, 196, -75, -452, 8, 390, -200, 229, 242, 93, -101, 55, -277, -311, 375, 179, -327, 66, 59, 238, 0, 89, 158, -436, 137, 114, -206, -231, 364, 13, -98, -17, 58, 12, 117, 1, 61, -470, -17, -25, -402]
587d02J59L82l74j07L08j71K99k3K85j90l68o7L98l30L42l0j0j58N1J11Mj02J3
610B0J06m49J83K64l89K78k18K79k13J17K29l70j58L28J84l11L33%l25K41m12
631b83K77k62R5M85k69k27K76k85R0J51K0k12K69k41J3M9k33L92l49p4J43K20
653D5j21K95k98J0K8J2N0j44J91m2k55K32r9P2R0J90k85m05N13j6k20L18l47L82
677A96m92K29K56M5r2J06K69o04Q3j8l3%k06N6J81j7J27j32l4mJ18k64R3L41l56
702a52J85q6J35l58L10L7%j07M2K8o5j87K29j66N5Q2N0K74r1j19j82k41J28L07
726A08j50P4j03j14L69L1l82J58Q3P9j18O6o7j9J76q1n0N7j40o9K23o0l53J51
750a31K65k79K37L9k28N15m93J97K29Mn15J26K41l88N47n53M19l74J28o2K22l66
$$ y = [-402, -243, 139, -235, -342, -34, -205, 94, 71, 356, 166, -202, -269, 129, -201, 141, 111, 101, -57, -6, 105, 109, 7, 20, 126, -323, -140, 124, -265, 13, -205, 74, -139, -22, 207, -163, -321, 7, 191, -120, 213, 213, -112, 129, -283, -6, -268, -173, 312, 43, -184, 92, -193, -103, 48, 68, -144, 125, -116, -103, -54, -287, 105, -244, -318, -175, 45, -76, 219, -79, -69, -41, -29, 21, -123, 68, 26, -229, 3, -96, -24, 66, 256, -29, -434, 79, 63, -157, 161, -186, 196, -296, -67, 189, 234, 142, 248, 517, -87, -4, -22, -55, -55, -261, -205, -24, -41, 86, -46, -80, -84, 34, -230, -137, 204, -152, 33, -53, 82, -276, 34, 71, 71, -36, 6, 34, -31, -218, 11, -155, -100, -18, 32, 306, 215, 96, -86, -327, -199, 108, -42, 32, -71, -185, 184, 215, -167, -9, 74, 153, 35, 101, 34, 15, 191, 110, 60, 117, -23, -92, 131, 71, -282, -131, 134, -145, 92, 131, -97, 418, -75, 122, 351, 355, -160, -34, 207, -181, 366, -187, 232, -142, -14, -76, 146, -220]
772b20J40k28K09K1k3L61j91j52L75k79r3K16j60K70j32m4j97K03k87L84k08K41
794B06l71Q8J10NN5j63o7J71O7K8m10L85m3l6J04l1j60J83j33l34K56L71r1J83
818C73l68l12K04K9lJ69j95R2K74k95J98l71K30l2J85q3k18K00J68q7j13r9Q0
841B6j06j46J97Q3O6k99K22j70k5J51j45J9j43M0K32j93L04j44j8q7m0p0r5J77
865a64nJ72k1o5K64j79M9k02J07j3j02J32k36K09J95j90P8k7J02j40J3J48j47
888b2N5L26l83J15j39Q0n9P1m7o3J68klJ28j67J02j9j42j49J29j16L8L03j53J36
913A87j24j92J76L6k28K30l93L28J11m3o8L6q9K51j89J02j29J20l45K99L0j63
935e7JKk7K45k9j13O8K0L6j48J01k35R5L9pJ30J15n02K07O5p7l6J4J63kl27O12
$$ y = [-220, -80, -308, -99, -78, -101, 260, 69, -83, 292, 13, -80, 136, -24, 246, 114, 70, -127, 76, -211, 173, -35, 206, -165, -77, 33, 38, 93, -70, -137, 34, 101, 129, -281, 104, 61, 25, 129, 98, -62, 121, -12, -346, -90, 281, 190, 373, 5, -307, -103, -74, -77, 92, -103, -11, 263, -32, 166, -205, 25, -7, 178, 95, -123, 77, 245, 158, 45, -54, 26, -80, -226, -29, 54, 120, -179, 43, -127, -152, -1, -146, -127, -270, -230, 2, -191, 113, -31, -49, -136, -176, -246, -341, -164, -169, 3, -18, -83, 181, 2, 51, -151, -44, -57, -159, -27, -263, -54, 141, -49, 29, 2, 104, -36, -23, 125, -22, 33, 359, -24, 91, -48, 32, -27, 44, -3, -66, 102, 100, 97, 225, 58, 160, 141, -1, -150, -21, -137, -99, 204, 51, 187, 63, -129, 47, 83, -145, 85, -308, 20, 131, 88, 20, 56, -33, 218, 29, 131, 2, 122, -223, 76, 106, -57, -56, -54, -81, 164, 135, 22, 90, 110, 146, -2, 99, -136, -41, -2, -9, 121, 236, -266, -59, 6, -71, -107, -93, 70, 68, -259, 353]
962C53l47J61P4j62jl05K00o6L50m26M04l60J04k2J41p6K0J23j26j3P2k7M7J02
986B20l20J22j32K19j02k01M02n19M80j3k28J68k20K33r0j90J06K84J44k90r1
1007a8K32k12l1J99j56Q1n8m8Q8k84K70J0L6M9o5Q4j24K2lj55O9K09n65L72J10
1032A12k01K89o9P3j20K12m24M10k88l18K07J89K56k29m0k20K30L0l1O7l77J72
1054g0N7r0J48n5k7M9J91k55O0O4q5J25j45k31M35Mk57Ok34K97K06k5n2Nm22L29
1080B8nk10MJ20M2J32n0J92n8j64pJ63p2k36J70k31K08j0N1L6k80Q6O3J54L9j94
1106b9j7nj12R6J59Mj17q4Q5J02k27K45k71J26J63J33m5q3M4k11R8j40R2MQ3N9
1132A52l98J06p8L90j84K68j43j01j7l72K03m1J43K54k71p1J74N2n5lmK61k90
$$ y = [353, 6, 167, 241, 79, 78, -227, -27, -93, 257, -169, 235, -125, -21, -43, 98, 22, 42, 165, 39, 26, 98, 71, 118, 220, -100, 22, -110, 109, 7, -194, 208, -311, 169, 156, -72, 96, -124, 109, 19, -171, -65, 219, 363, 73, -18, 214, 2, -29, 170, 14, 95, 37, -11, 77, -207, 63, 73, 109, 158, 93, 177, 53, 75, 72, -83, -14, 195, -370, 2, 112, -89, 200, 131, 204, 84, 296, -128, 282, -6, -324, -117, 72, 328, 99, 59, -161, 69, 99, 68, 135, -242, -70, -13, -103, 45, -10, -37, 12, 203, -52, 8, 72, -13, 112, -33, -264, 171, 175, -82, -76, -310, -13, 193, 168, 116, 121, -301, 28, 23, -187, -183, -63, -21, 111, 61, 253, 195, 31, 24, 187, 115, -121, 49, -182, 26, 16, 67, 103, -177, -91, -28, 126, 165, -29, -46, -51, -163, -67, 92, 96, -21, -105, -20, 82, -145, 100, -171, -45, 118, 251, 206, 123, 167, -44, 54, -86, 6, 10, 93, 152, -246, -140, -218, 172, -12, 256, 113, 12, -5, -377, -174, -215, -72, 182, -89, -160, 14, 66, 11, 8, 4, 265, -25]
1155b5o9n0J35P6l20J37k9J88M4K08r0Jj88J31j27k53O6R3J19j16K19j31j3n3
1179d7M2j5q0pk1J39p4P1R2k03J28J79j80l5J63l76J33Q5L19m97K52j04j7J12
1203E9j13J46j25j36O0K51l76L83k78%K8K10J15j06ro1k19P3J76K85l24j0j06
1226g7l3J58k42J20J11P5k71L93o2j2j26M3jj88M1K20m47L78m2kK5q4q1O5J54
1251A15q3j86L12k58K63K0k84P5J05P1k30O7oR0k42K14k70L15p8j44l7K11J28
1274A68k01p0r3P2K08k86J00K10l2j24Q9J5j35k9j18J90K6J53q4O8O5k90J29j59
1298a28K30j08J52k76K84p2p1J40k56j32K43m05O18k10J29l20P6J55j59J44j64
1319a30J05K11l4j71n8L4o3n2L72k08p0k4J60j2k04r6L00J15M6j54q8L4q3J32
$$ y = [-25, -94, -144, -9, 67, -253, -116, -145, 43, 87, 295, 205, 206, 18, 149, 22, -231, -165, -72, 47, -69, 150, 19, 6, -47, -5, -20, -100, -107, -128, 11, -63, 8, 100, -103, 25, 204, 24, -11, 152, -224, -91, -6, 313, -184, 68, -36, -53, 59, -54, 92, -33, -169, -109, 142, -234, 149, -129, -129, -101, 109, 224, 118, 109, 48, -171, -98, 78, 363, 39, 29, -77, -110, 48, -194, -74, 37, 112, -159, 234, 172, 160, 34, 77, 76, -112, -71, 149, -298, 80, 38, 36, 61, -23, -104, -39, 115, 32, -154, 158, -100, 163, 183, -101, -26, 79, 150, -80, -13, -19, 71, -171, 43, -227, 88, 10, -134, -171, 40, 168, -33, -103, -196, -124, 84, -202, -102, 108, 76, -48, 41, 56, -79, -108, -226, -36, -10, 143, 59, 127, 192, -98, 31, -128, 102, -6, 146, -130, 154, 82, 11, 151, -105, -237, 6, -399, 219, 9, 138, -182, -106, 49, -110, 34, -130, -25, 186, 152, -19, -77, -43, -106, -158, 214, 6, -64, -88, 72, 60, -144, -240, 60, 175, 221, 67, -21, 13, -70, 62]
1343F2k75K24m3K21m43K0K54j81L23k92R9KJ49N7k78M6l4J44k2K18k11J2k12J87
1367B7J3l08M93p2j42k2n4j5N9l4p0r7L08mO5k40K2L9o3K09j70Q7n7J59j66j07
1393a40n5M03j57J78j33k74r7J20j27L43M2k87J50m1j37K78k20J69J27k96J46
1414hN9l1N9k4j26K08l17J50j45J47j3l2K3J96%j02j12o1j8M05k85K84j33m11
1438b87L20k7J56l2k18J99j02j89M8J2Q9j00L45o13R6L84P7k1K8m47K59J24l03
1461b02K07J04j2J30k51J43l56L37J28m31K66q7k90R5m3J16k0P9N6n9N4L1J26
1484A21j59J95k77K11k63J19j38L13m64K34J99j7j96Q9j08pP0j0J20p7j32K40
1506F3Q1j71K33k83N3Qq8r9K03p0K60k09j0K15j03q4j52J71N6k79J22q6K28j41
$$ y = [62, -213, 11, -32, 189, -254, -234, 20, -161, 162, -130, -31, -29, 120, 177, -101, -55, -89, 55, 33, 251, 40, 52, -160, 27, 40, -268, 225, 153, 11, -11, -65, -80, -21, -55, -125, -222, 86, 82, 147, -93, -71, -32, -95, 114, -56, 31, -26, 133, -33, -140, -195, 208, 51, 229, 96, -178, -275, -155, -282, 61, 103, -184, -34, -75, -212, 66, -154, 15, 142, -154, -8, 51, 20, 79, 55, -71, 137, -180, -30, -175, -28, -41, -73, -50, 146, 146, 44, -68, -129, -147, 258, -27, 257, 124, -287, 33, 6, 162, 130, -88, 111, 9, -180, -132, -120, -31, -131, 214, -399, -303, 81, 158, 137, 165, -282, -23, 101, -202, 5, 109, 97, 227, -24, 119, -237, 100, 228, -203, 63, -24, -314, -219, -262, -146, -166, -87, -31, -90, -36, -5, 121, -38, 157, -120, 91, -172, -53, -191, 122, -342, -108, 91, 74, -122, -33, -141, -148, -78, -88, 32, -45, -177, 63, 144, -27, 206, -77, -24, -16, -104, -203, 0, -70, 190, -19, -29, 186, 83, -1, -153, 18, 74, -205, -83, -169, 59, -82]
1530h2J03k9KP8j15L47k69J1j74L90n12O7N9o1L67j90L08l92J90j57J42q3j4J57
1554A43r7j19L7k0L8j09K51k84k46K05K25O4J56j78R7j84o1J00k12J53J31j50
1576f0m6K22j32K31j56j31N9r8K25k22N2n9L3J50j56N7j61L61m08M70m5l69N39
1599C56o41M41k82k5Q9K83l78J09k14L69mO3K4q5l59L93j99j33M29k73J16j2j85
1622a18J99j17K3J52L9j92J93j44J27j32j2j4mJ9l0R3J7j00j52j1P7M8O6O3j65
1647g5k9L44l07o5J15l61N79k92K28j01J78j97J62k11R2p9K15k22j1j48K0J87
1669B2J35k39J9j00Q1J41r0K5q2J26J18K8j09J00p4r0J97k22n5J97k32K16k36
1692a24K82j42q0o2L6p7J38r3Q0j40p3N51p61Q35k14k75K74k33J63j26J04k7k3
$$ y = [-82, 21, -8, -6, 72, -43, 304, 35, 46, -128, 262, -250, -183, -124, -185, 182, -8, 300, -92, 98, -59, 83, 0, -14, 143, 46, -73, -36, -56, -18, -127, 124, -160, -406, -201, 24, 88, 244, 66, 163, -21, -82, 18, -194, -41, 90, -60, -106, 116, -16, 215, 59, -72, -13, -111, 114, -108, -56, -115, -82, 68, -88, -31, -192, 169, -239, 231, 186, -183, 356, -285, 156, -126, -151, -62, 221, -157, -48, -262, 107, 103, 166, 190, 105, -254, 139, -60, -193, 236, -37, 79, 67, -118, 81, -36, -13, 139, 178, -14, 179, 35, 162, 30, 18, 4, 0, 19, -11, 82, 99, -1, -153, -164, -87, -39, 27, 90, -75, -104, 240, -67, -132, -17, -378, 201, -91, 137, 36, 214, 17, 179, -32, 60, -19, 196, -26, -37, -185, -165, 22, 157, -82, -63, -163, -82, 59, -31, -6, -88, 38, 156, 184, 75, 175, 101, 11, 208, -14, -69, 128, -104, 112, -124, 158, 16, -64, -126, -90, -167, -29, -122, -42, -182, -255, 296, -465, 370, 156, -119, 155, -78, 85, -41, 63, 36, 13]
1715A3m2%m3Q6J51j17l09K61J11j69J03K10j03j74k47M45l4k66RO6K8L9k45K51
1739B4M6k65K69k00K79k23j49M92j23r6l0l8O4j57MR2m3J99l1j44L19l24j36J15
1763e6L04jj90K72l58m3P0j08n4J32R5j33O%K8J18qJ03k50k1L89k85L01m41L47
1788B17k63l1K05k07j12M5J34K07l98K07J72k93J32jj4K8pJ3J60j89j1N8o5n5
1812f8nj8K89j19J01l78J68k9J33j30q1R5p4p5L76k95k57P49l14j63K78m32Q6
1835a63K15K6K8k93J52N4jJ00K19l46L99m54P8P1O4R0k41m2O3j00j95J55J52R6
1859A27k66J12J45J48k00j81l3j3J07j25OK73k53K79K8o1j25%J7J07o0j80J98
1882E0q2O5O4l44L23l5j17K29l3kP9k85n5K38l77NM05q8j88l1K89j17j32K67k66
$$ y = [13, -29, -29, -72, 14, 165, 48, -261, 0, 111, -58, 45, 255, 152, -22, -269, 176, 142, -124, -115, -49, -21, 18, -227, 24, 70, -195, 74, -126, 153, -70, -219, 273, 150, 54, 24, -14, 50, -107, -103, -11, -54, 145, 114, -30, 289, -35, -171, -56, 248, 247, 57, 329, -29, -72, -2, -110, -164, -32, 63, -70, -64, -64, -36, 82, 74, 177, -73, -94, 295, 10, 311, -130, 217, -46, -77, 128, -79, -191, -146, -12, 195, -203, 4, 176, -117, 15, 14, 0, 28, 21, 34, 194, 5, -6, 52, -13, -68, -73, -91, 198, 79, 180, -198, -30, -59, 74, -56, -137, -42, -116, -191, 185, -110, -367, 382, 68, -95, 183, -249, -163, 52, 78, 106, -187, -35, 19, 18, 118, 337, -9, 390, -64, 14, 85, 149, 239, -2, -44, 19, -81, -276, -121, 31, 127, -139, -27, 118, 266, 66, -115, -148, -161, -54, -179, -173, 100, -153, 126, 154, 93, -32, -32, -15, 92, 32, -148, 50, -32, 33, 97, -247, 76, 41, -76, 153, 120, 118, 197, -88, -143, 95, -282, -277, 128, 40, -148, -179, 110, -7, -139, 128, -138]
1907a38P4J62kq9O1l1k21R2J30j41M68k31p6N4N2n3J22l67Q7J27N3l53K52J67
1931A99r4j24j64J99N5k80kQ4K3K8m4O0K2R5Kj54M4J15k53J99o6o9j88K17J09
1956A3K92k48k08K09R8N2k09p2k29O6K76j02L68j24k16P5j20J69k3o9r2J43k38
1979a89L5K64j63J83j88K8J29j9j51K76l01K60l10J55J83k51k2R2j60o2L51J09
2001B49j85j20J84k50k0N8J1n1M4O9P9k79L26r3o1k4M0K86r0k1l11K18k7r5NJ48
2027I0j45M15m94J47j32J09Q5k60p1J20J77l2P1j15J88k72L59j46nk55J97p8j46
2050a93K41j30l2K30j92J91j40k70l8M00j6M5k03L42l60K09P2k64J84k62J83P5
2072G2m1J6l29M17KK05j75l06K18k58J43q2J5K1J54J7r7k08J43j8K98m58K29l2
$$ y = [-138, -64, 98, 96, 7, 68, 37, -184, -92, 38, -103, 365, 134, 58, 112, 164, 111, 233, -134, -47, 80, 133, -220, 32, 199, 105, -19, -183, 16, 71, -209, -211, -127, -104, -76, -120, -60, -38, 57, 59, -95, -51, 64, -189, 10, -56, -125, -313, -96, 13, 305, 57, -151, 58, 156, 208, -1, -73, -302, -236, 40, -62, 306, 182, -34, 41, -79, 90, 67, -2, -94, 49, -189, -154, 110, -53, 130, -58, -30, 99, 80, -71, 205, -96, 164, -146, 9, 192, -59, -81, 11, -149, -211, 140, 249, 64, -56, 128, -122, -142, -84, -73, -124, -80, -11, 68, -211, 115, 22, -39, -63, -23, 263, 173, 152, -159, 59, 32, -63, -58, 90, -55, 360, -134, 13, -119, -10, 75, -185, -256, -136, 41, 9, 80, -35, 153, -119, 240, 94, 89, -166, 31, -47, -193, 48, -82, -114, 116, -76, 115, -25, -295, -333, 67, 51, 96, -107, 235, -125, 84, 156, -108, 76, -186, -3, 72, 31, 47, -282, 135, 137, 342, 167, -139, 79, -179, -36, -118, -103, -82, 72, 89, -8, -216, -73, -91, 207, -251, -22, -54]
2096e4L02j18j42l1J62j97l4L40k45J10l8p2j94J13J75M0j2k69j28M10l17M11
2118B12l13J31k43K87o4k1K79m44K15K10l75K3j5L4K9j01L06n12N30L5o9j20k17
2141b03L74k38J49r9M9k6o9J77m0P2k34P8J31l10K22KN4J3l24Q5L62k53K3m0k16
2166b61M98l13J61j32J25R5k12J26j08J08P0j90Q6l5j84J9J40l5pj6l8j11L08
2189I4p0j2K7J02q1j07J57k02j98K07L88k8k53Mp3j0J86k2l47K66j3m2K4N9J43
2214A99j47j77K24p8n6K5N11o43k5L31o3j55L43m66O52l14k00J94r9o9j19L80
2236B48j84j21J4J72J65l77J22K27j67n6k02K60j28R7l02L03l7o4r6Q4K05O5k7
2259B01k09lJ00o5j53J00J98J37l73j20J08L50k91k39M47j86k10K31j45J8J35
$$ y = [-54, 248, 130, -12, -43, 119, -78, -112, 228, -17, 93, 55, -17, -211, -98, 77, 117, 105, -164, -292, 118, -199, 212, -101, 30, -213, 74, 10, -11, 268, -176, 39, 249, -126, -103, -118, -84, -55, -156, 150, -362, 168, 203, 134, 14, -203, 171, -67, 82, -17, 32, 6, -63, 114, 74, 146, -88, -10, 121, -189, 33, 35, 89, 102, -222, -137, 225, -28, -5, -45, -261, 237, -76, 85, -47, 78, 173, -39, 87, -21, 87, 157, -33, 53, 18, -166, -147, -7, -42, -49, -65, -103, -214, 94, 24, 12, 39, 141, 60, -47, 110, -92, -290, -83, 305, 277, 24, 28, -45, -55, 131, 109, -238, 28, 15, -27, -3, 56, 199, 52, -125, 99, 21, -35, -10, 501, -142, -167, 164, 101, -54, 289, -177, 475, 161, -39, 155, 56, -13, -132, 248, 64, -57, -43, 129, 294, -83, 39, 266, 99, 43, -159, 101, -27, 70, -232, 71, 34, -30, -126, -42, 163, 228, 201, -8, -11, 89, 24, -129, -29, 169, 306, -67, -187, -79, 271, -20, -259, 188, 2, -208, 23, -122, -104, 31]
2280C1p6K74j16j78j63K66j94j85N49k91j53M39l79l8L61j29r0Q8J23j73rM9l2
2303b6R8k0Q0k48J42j7J52l52K50J5m43K64K46L6l85L33Q9l09j13J89J57L0j01
2326F7j00m2J37l32K37Q1r%o3Q7J0k2m2J80m4k15j16K04j0q7n9K27j74L04l19
2351a00J56l42M71k37M8J50k40P6J9k07J06K42k8p9q4K26l50K0J15J98K5o46L81
2374h0J55k84M09l95J05j52J30K42j62P9m9L3J18q7j4j2k17Oo2R0K08L8r1n4J10
2399F4j55j4Q4o5N7L12m37J52k82M34j54K33j30k98R1oK12j58J96l06R4k21K00
2422i7O3L0r5j40L18J66j90o1L8j06K57p0k3nO5j35K22j39k81J93J29J41l88N0
2446e8j03kPK46j73N9m6k0L9k3K09k40J68L7q3J18l90L86j54l09M86m63L58k4
$$ y = [31, -45, 229, 113, -65, -228, 38, -156, -341, 208, -83, -236, 203, -176, -214, 147, 18, -72, 16, 139, -34, -43, 6, -26, 72, 52, 132, -116, 26, 9, 161, -191, 59, 74, -369, -105, 141, 177, -208, 125, 214, -95, -208, -19, 138, 168, 67, -33, -75, 62, -270, -33, 48, 39, 39, -24, 63, 73, 51, 9, 189, 145, -70, -186, 18, 8, -79, -138, 89, -85, 219, -100, 56, -286, 185, -52, -4, 146, -94, -18, 1, -206, -100, 142, 114, 35, -49, 177, -173, -153, -38, 160, 185, -461, -80, 75, -209, 200, -195, -90, -242, -112, 130, -32, 47, -2, 31, 149, 62, 48, 36, -181, -175, -237, -147, 61, 99, 8, -46, 64, -91, -105, -21, -86, -29, 283, -154, -2, -284, 150, -4, 229, 99, -199, -108, -114, 98, -60, 136, -170, -76, -297, -97, -34, -4, -99, -239, 79, 245, 55, -6, 32, -74, 183, 113, 90, 85, 150, 15, 237, 98, -183, 10, 139, 280, -108, -58, -161, -163, -156, 90, -83, -24, -70, -90, -51, -74, 135, -105, 63, 100, 17, 135, -255, 131, -23, -332, 154, -309, 49, 25]
2470B5k05RN9Q5p0O3q4J02p8J51J35R2l61p9K94j56n4J45r8J27j22J12R7k21n3
2495h5K26j67J03j23P2J61J23j83n5j22j88K20l3J8k12K01P6l32L03J33r6k34
2517a94J44K30j74m3J92l25rj8L52Jp9j32Q5M3n3n1r4L56k95K59l32j10J50j30
2541b27K17K53j42j28J27l32N1K35r5J76j1j89j35K73P8r1J17j87L64j95k9j85
2563e5k66K10J02Kk17K57l16M03J14m37K71l50K93j24Q7K52j10p6J10k62mJ07
2585iM8Mj12l0J5K15K09k05k40k23J40Q6J42l7J13l4Oj18R8J18k49J72n0p3K77
2610B63j48k41K91l10J2Q9K6J67n1j60l6J96J5k13M1MM4KJ21m6M5j63J02M3k22
2635a29l3K93k12j52K7K54N9j66M6K9o3J10o8q4K98j02J04p9l57J02Q5M18l42
$$ y = [25, -180, -171, -112, -27, -97, -34, -118, -16, -94, 57, 192, 284, -77, -156, 138, -18, -72, 73, -25, 102, -20, 92, 189, -32, -85, 141, -26, 77, -46, 26, 187, 310, 127, 72, -50, -238, -18, -51, -33, -245, -44, 32, -300, 3, 136, 40, -194, -50, 180, 6, -37, 155, -170, -179, -197, 155, 156, 77, -55, 30, 73, 20, -31, -125, 231, -64, 195, -137, -247, -97, -227, -10, 243, 101, -27, 100, -232, -181, 54, -41, 135, 124, -65, -200, 73, 151, 60, 177, -10, 354, 159, 130, -55, -321, -111, -9, -7, -224, 33, -283, 120, 234, -203, 68, -282, 11, -113, -26, 226, 116, 40, 150, -112, -116, -9, 39, 43, -69, -99, -84, 131, 340, 135, -105, -328, -188, -102, 40, 3, 116, 82, 88, -30, 68, 186, -63, 109, 59, -14, 263, 115, -126, 165, -145, -133, -44, -18, 149, 98, -62, -98, 98, 113, -100, -59, -55, -11, -9, 112, 66, 111, -52, 50, 93, -129, -162, 131, -81, -233, -206, 48, 107, -59, -13, 16, -47, 63, -5, -89, 209, 107, 211, 132, -225, -123, -38, 380, 38]
2658C8l7J27Nk06q8K85k87P5j28K21L06j28j92J07j66q2Q2k0R7k1j10K32K61j14
2682B57Pk90N6p0J34j0O3j76M8K12j05j46J56p5k18J48K4P6Nk0o2J07k5j72J94
2707A18J1j45k62L14r9K5j55J15j63J73J91J71o36K13J17r0K5L49l22N6M3l76
2729c27K62n5oL1J9M0j62J46L21l01PP9J30j14l5j22N5k15K09j29K78k05M9J95
2753A50m09L82k57MO0l93M00m1J42o3j6m4j11K87k06o3K60k3o2k08L69j67M2l35
2777c02L25n0j1L29l02L8o1L5P1m4j05N6m7P6J59l33J53Jk16L43j9j71m2J67L10
2802C60l13k63M26k93J58j04Kj91K46N3J62q3l45L15j33j47J59J43J62k68L3q9
2824a0K3j44L25q8k68NQ1j27q6K10j51K59j06J5N9j8j55J19M1K3PpK5Q6k04L09
$$ y = [38, 1, 128, 133, -73, -161, 124, -163, -88, -216, 5, 311, 183, -9, 98, -68, -150, -68, -88, 9, -12, -122, 110, 371, 257, 264, -26, 30, -40, 94, 84, 147, -29, 19, 231, 126, -20, 136, 61, -157, -9, 15, 91, 96, 76, 14, 121, 96, -76, 118, 129, -16, -278, 36, -63, -38, -193, -78, -241, -68, 123, 294, -342, -129, -12, -102, -77, 272, -50, 6, 49, -327, -65, -120, -126, -95, -76, -36, -198, -52, 269, -32, -25, 54, 184, 70, 35, -87, -32, -247, -38, -167, 111, -94, -45, 150, -259, 123, -134, -130, -70, -463, -63, -104, 38, -25, -41, -85, -196, 91, -115, -178, 82, 59, -3, -211, 158, -9, 33, -302, 23, -27, -38, 291, -11, 27, -34, 1, 72, 28, -77, -21, -68, 8, 167, -166, -13, -12, -228, 115, 96, -75, -117, 50, 360, 47, -216, 210, -83, 75, -29, -27, -218, 28, 81, 243, 160, -185, 130, -3, -150, 9, 152, 314, 46, 79, -10, 13, -131, 194, 106, -162, -157, -76, -203, -289, -79, -230, 29, -77, -62, -3, -21, -176, -57, -16, 7, 14, 7, 32, 118, -86, 223]
2850B23l05L43k10R3p0j65K98l02l7Q7J28k60P6J91k10M6L4n7O3q6J92p9O0K76
2874C29j49j03q9J53j35j44J07j3M7Q3k0l67K64P9j35R7%k75N10l21l3J41j77
2897a51K56n7j10q1K73l30J57J65k23O4R6j94J93J8O0j34L6r4k5K28j11l1j54
2920a49M76k78NJ7j30l5L49m48J24j4J20n3q0K04mJ2r9J62j80j68L17k43j5j65
2944b75K94M4K3k70J77J08j88qJ51o1k08J80J8j01J50k10R5j5J76k40J05J3k09
2967b51M38k26J92j75m5K31n4j16J81m33M25o0j99J22J75k28M7Q4Q2k85J41L6
2989H2R8k17j8qJ7K29k07j28j29M23j91R6m1L5m8J43l2r5j6Nk10J09J29N8r3J6
3015Gm6K06l79K24J11l15L79k83J35%l9J46Q1k36j45M62o00N89m29J28N8N6m09
$$ y = [223, -82, 261, 51, 144, 74, -91, 207, -95, -132, -45, 83, -177, -101, 90, -120, -74, -40, -97, -34, -120, 72, -7, 53, 329, 180, 77, -12, 141, 6, -138, -31, -44, 3, 86, 66, -301, -37, 42, -93, 4, 4, -271, 239, -82, -115, 26, -151, 105, 48, -62, -143, 130, -200, -43, 122, -101, -37, 59, -135, 58, 76, 136, 2, 38, -56, -81, 147, 36, 5, -149, 327, 49, 54, 71, -59, -94, 255, -193, -69, -83, 37, -16, -96, 108, 104, 116, 17, 179, -1, -169, 148, -95, -110, -275, 19, 63, 86, -184, -7, 101, -87, -95, 56, -5, -213, -33, -15, -116, 34, -176, -81, -96, 80, -160, -55, -42, -251, 187, -39, 153, -22, -67, 164, 110, -6, 175, -258, 167, 107, -92, 30, 205, -23, 24, 108, 190, -95, 46, 82, 180, -37, -55, -63, -46, 183, -24, -152, -281, 142, -49, 47, 6, 41, -7, 136, 104, 9, -7, -2, -212, -103, 26, 84, -9, 7, -39, 167, -212, 12, 123, -192, 187, -96, 39, 39, 0, 146, 227, -9, -154, 308, -292, 297, -132, -4, 54, 110, -299]
3038b99M75k21N2j05L11k68M0J46k79J12j5k74J91J55K29pk25k09L66j16P7j51
3060a5o1l4J83o6r0K32k16K24l46J81P2k76K15k2K08l32L88m5q2k05M2N8N6Q1
3084A50l53J39N5m7j90J72K2J88l84N4j7J18J58k83J14K68j66J07j53j02J36K55
3106B41j99q4J5K67l14L9o2j7J99L8p3k37K87j10N5j68J37L5j33r0J20Pq1J78
3130E0k51OR3j43L29j90K06l3j31P3L9K16l59j90K4J91K67j71j43K53R0l17k7
3153a18J57r0K62m40L75k94o3J48J50j20J12j7p5qM3j37J54j42J60q1J69j35J2
3176B2r2K08k10j67K05n1j77J24J71J51J6l6n8k14q7L18l03K80J32j86O5m56L70
3199B5K13k31N0K38l52O8j16q5K29K6j10Q7M6k13j29L65J48l40k5J50j66J20k34
$$ y = [-299, 176, -45, 7, -98, 213, -55, -15, 131, -148, -36, -51, -325, -134, 21, 250, 243, 18, -191, 175, 59, 136, -15, -76, -110, 73, 7, -83, 149, -67, 157, -189, -8, 64, -212, 3, -19, 189, -143, 245, 200, 118, -87, -45, 13, 69, 150, -203, -64, -9, -56, -246, -74, -52, 136, -248, -194, -211, -93, 65, -218, -104, 164, -2, 105, -48, -150, -14, 241, 42, -42, -27, 240, -74, -35, -97, -114, 85, 123, 50, -187, 100, -10, 45, -123, 14, 49, -84, -174, -54, -47, -128, 50, -201, -195, -102, -245, 84, -106, 100, 67, -64, 9, 48, 264, -95, -285, -261, -70, 197, 26, -117, 136, 226, -91, -118, 39, -51, 211, -229, 146, -148, -211, -63, 87, -33, 79, 62, -13, -21, 22, -115, 39, -103, 57, -24, 145, 10, 22, -70, 138, -72, -239, -34, -85, -262, -138, 33, 184, 200, 164, 106, -108, -195, 123, -180, 100, 232, 46, 111, -345, 25, 238, 7, 57, 295, -57, 11, -105, -190, 39, 65, -45, 42, 88, -125, -254, 111, 259, -81, -106, 44, -122, -2, -236]
3222b36J40N63n13K04l07J27o8L50l45K22ln3j35M3m6o9K4K92Lk84j95N12m87
3245b61L03j26QK6J38J20qK2r2m2j91J68n5L33m20K14j25L4j7r8j2l89K23L33
3269H6q6J46r6j93K24j56nn0K91p6m04M30p0K9j21P2Q2j12qJ46j75p8M7L17Pk58
3295a1k06j29M19O2J21j78k41J39k63K70J20k60J74j17J29R6L1L0l51J05K68m13
3317b05J53L22k25Q7L5j68r4o9J68l05L37K18j54l02RJ10N7J28k49m0R8l7N31
3340D05l92K05l29M5K03k44J83k92M13k95J53m8K29j97o9J94j70l0j03O3k3j14
3362b13L38M4j08k01J58j19J16l08K36R8l69K43Q8R3j44K27rl03K38j58lK32q1
3385I5J41l66J60m1J84Q3R4n34J56J92k52K6K35j44J29m30M2J33L38j96n6n8j9
$$ y = [-236, -96, 467, -46, 158, -149, -22, -90, 260, -85, 137, 134, 81, -54, -11, -57, -126, -102, 190, 193, -91, -286, 226, -261, 42, -84, -76, -50, 88, 208, 200, 222, 130, 88, -103, 65, 10, 343, -77, 137, 12, 46, 29, -69, -81, -470, -247, 86, 0, 146, 50, -143, 81, -75, -80, -130, 161, 85, -319, 111, 41, 70, -51, 21, 103, -9, -17, 129, -46, -124, -77, 240, 247, -11, -217, -346, 73, 135, 256, 78, -163, -24, -287, -17, 103, -157, 17, -100, 29, 125, 156, 186, -165, -60, 208, -205, -52, 270, 45, 132, 167, -1, -95, -164, 4, -301, 36, 254, 100, -202, -193, -83, -26, 102, -147, -187, -89, -126, 405, 13, 218, -111, -66, 137, -107, 76, -216, 197, -98, 55, 7, 236, 39, -30, 164, -6, -36, -139, -76, -99, -213, 125, 169, 61, -140, 18, -101, 15, -293, -57, 41, -328, -85, 3, 96, -48, 179, 170, -133, 105, -53, -56, 176, 95, 236, -130, 30, -11, 173, 256, 350, -184, -28, 164, -88, -62, 173, 29, 158, -272, -230, -97, 241, 45, -11, -69, -88]
3408h8J48j22j18R2p3L77j53j4M1m40M59Lp0p0J43j76lr3M0J7P9k49M89l22n1
3433a54L32j82K70l19J06n6j35J79K10j18l47K59l82L58L88k88J26j3k17J09K19
3454C45m48K01k13j02K30j29L20k70J16k53L43k34N8K0J23j51N9j60K51j89J28
3475D5q2K11j35M3K49k85p0k9p7j84N74n27K81O4j22kj64P4L85l21j2J7K82qj52
3500E5O2RJl80K42K9J63j40j48k0j5N6P4K06j65q8J95j00Rk14K52K44m54J35L8
3525D6J21M1l23M1R8k0p4N6j15J86k61K45j69J19m3j03o1M5L53l02J37K52l99
3548a30J90J31o6k72l1P2L19k38P1l8ol36L24J56j57J81l51M12n47Q3J57k9OJ29
3572C0J1K10j73j47J86k54K71n1r4j78J96m0Q8r1j54J46O0J12j91M8n9N1J0o5
$$ y = [-88, 60, -62, -180, -88, -161, 216, 63, 49, 90, -350, 109, 112, 42, -28, 115, -61, -64, -157, -117, -100, -21, -270, 219, -103, -154, 178, -4, 266, -53, 53, -3, -138, 41, 251, 133, -214, 45, -337, 21, 409, 121, 247, 234, 17, 126, 345, -103, 98, -115, -217, 13, -116, 204, -66, 50, -203, 140, -94, -36, -16, 107, -44, 15, -145, 106, -83, 45, -37, 174, 39, 82, 331, 46, -24, -53, -130, -314, 260, -267, 14, 78, -44, -46, -210, -136, 249, -72, -84, -67, 215, 207, 55, 117, 126, 127, -253, -11, 18, 181, 41, -107, -127, -142, -86, -12, 194, 29, -59, 136, 36, 45, -169, 83, 327, -127, 8, 46, 167, 208, -115, -74, 24, 4, -70, -14, -129, 57, -204, 41, -128, -9, -52, -155, -216, -171, 182, -120, 17, 269, -130, 60, 191, 125, -147, -178, -106, 213, -25, 46, 8, 2, -334, -10, 146, -11, 170, -181, 231, -316, -233, -76, -105, -99, 30, 41, 251, 78, -69, 117, -137, 134, 83, -11, -189, 7, -33, 55, -36, -190, -44, 16, 128, -63, -15, -74, -23, -13, -78]
3596g8K57M4k32n6J85k63K92L1r9q1j73L74l56K76m6Rp7j19L28k04k3j4O6J74
3620B15k72p8j16K16J39O8r3k02J5O8k58K18J66n7J81j09j09k14L08l10L1L54
3642A61j6k49K02m3q4K48j37J4k90O6P9n1J24l4Q5k6r7K68j58k16L40j55K4M0
3666I5l91K00J69J8l2j92mj02L38k79K08O7K1P6j56L9q9l08L68q2q7J34L59m70
3690a00L64o0j99J64j17Q9p1p7P8m9j49K12K9q1l15N69k79J54j83K14j13m2KJ58
3714A98j60j68J14J55k81K63n1J44k82j2K29l4j44nJ78L8j15j5K0J2J48j61nK7
3738I3K68m02q8J52J7K06j29o4O4N1r9m6j1Q9j42J03r1K13j4j22p4R9l17L17J4
3763H7j72J10R0q2Q0l52M59m03j1J74j63K16j6j26j28J8N13o17K24n1J19J07r
$$ y = [-78, 179, 223, -9, -65, 120, -143, 149, 180, 81, 0, -173, 201, -155, 121, 75, 84, 7, -112, 216, 12, -11, -25, 41, 215, -57, -135, -251, -35, 104, 172, 79, -123, -108, -40, -298, -80, 86, 29, 210, 101, -8, -222, 86, -224, -193, 161, 145, -104, 98, 55, -29, 219, 82, 96, -194, -128, -49, -100, 24, -10, 75, 49, -48, 220, 62, -154, 186, 31, 55, 95, -296, -96, 73, 91, 59, -133, -137, -239, 99, -180, 28, 95, 116, 192, 36, 75, -14, -322, 46, -36, -123, 11, 370, -100, 264, 204, 5, 169, 52, 141, 70, -7, 71, 22, -127, 85, 114, 33, -282, 287, 8, 162, -21, 193, 80, 38, 40, 198, 38, -130, -16, 139, -142, 121, 70, 214, -68, -80, 149, 115, -29, -34, 144, 182, 67, 52, 72, 84, 232, 71, 66, 93, 361, -41, -129, 23, 40, 246, 117, 53, 117, 168, 69, 23, 12, 101, -41, 62, -29, 184, 170, 48, -26, 73, -244, 73, 87, -85, 25, 115, 33, 113, -239, 220, -183, -194, -20, -183, 33, 17, -109, -237, -219, 294, -323, -99, -150, -31, 76, 67]
3786F7j27K94j36j84J18mK3p5Q6n9k7J8K92n12K34K73m7l32Q9Q2Oj1k37J06P0
3811Gq5J4mQJ5K47q7j96j01m8J98Q3K5k59P9J19j06Q1K37m0p8k47M9k5RL22k01
3838A6Rk63O9K07J48j86J49k06J98k11RL0K33k62J31J98j94j87o0K38k22O9Q3
3861dj68N6K52J6k4j71J23j31N5J39pj83n2P4J9j0J99j64J48k88L1p0J19M29k80
3886A08k86j7K90j14Rk12K2K84o4j3r8K19N0l28R5K45l41j07L23k39K80n3l4n7
3910c8k01L39j18k18L88n0k3j85K90j32j91K58j26l77M07j04j61K82M9rj41J18
3932E7k15M8J24j39K93o7Q5r8o1J8pL2o4K32k72Q4m9r4j71R5J66j37K56O1j51
3957B6j43J42n4J28k5k94M08k65j92L83Mk68J51JM4J6j92K87j94O9l9n7K26k92
$$ y = [67, -60, 234, 98, -86, 32, 28, 51, -24, 62, 3, -24, -6, 286, -226, 8, 281, 234, -98, -9, 73, 79, 68, -169, -63, 7, -78, -64, -68, -60, -45, 202, 115, -81, -182, -230, -32, 51, 76, -183, -104, 15, -91, -10, 227, 187, 109, -138, -89, -114, -105, 217, 16, 25, -238, -169, 38, 186, 0, 149, -57, 141, -70, -61, -31, 202, -60, 71, 269, 75, -112, -172, 66, -156, -87, -4, -172, -116, 136, 152, 128, -43, 80, -51, 4, 143, 136, -47, -99, -25, -6, -16, 183, 19, 167, -121, -90, -160, -41, 388, 108, -178, -195, 95, -19, -10, -222, -200, 84, 20, 7, -91, 128, 178, -150, -55, 190, -151, -258, 65, -174, 106, 53, 19, -38, -239, 100, -18, -236, 152, 102, 79, -106, 184, 52, -139, 119, -7, -384, 23, -81, -242, 40, 89, 80, -61, 57, -158, -110, 14, -125, 168, 101, 186, 88, 27, 45, 38, 70, 6, 238, -34, 50, 1, -93, -264, -169, -3, -140, 116, 177, 26, -117, 25, -29, 99, 74, -220, 188, -77, -269, 114, 118, -150, 1, 2, 46, 62, -130, 157, -37, 32, -7, -64, 162, -130]
3981a30j03J34k0K65k28P6l62M49p9k9j51l4L86K40j14j55j40n6K15L06n87J84
4003F7m0j86K55k45M24k27K66k46k75L56j19J04k24j29M75l89J71r6k25K71Q2
4024G0k59J51J04K10k61j92J24J27j80K27j16J45r7mK1j21L59k07R9j59pk03L51
4047A82l12J54K59l93j6K6k0J3j47L78k85K28j38N7K52m22M34m12J22n4j8J20
4069Hqp8M14k82m1N2K0J40j8k11R3J80L4k82j86J92k12L83Ll86N32l28r5l0J02
4094dq4P8j21J53j43J56n7J27k02p5L09q6k0k4J51k8k40J63o6k49K74L4J35k14
4118c3q6l6Q0o3rrK11k8J79o3l71J97L32l06q9l7J89l1j34J82j24r4K86l72N00
4143B71m68j00L41j92L50q5k87P2L6M54m91N25j99m61K18k8N1m6J54qj07P8K7
$$ y = [-130, -233, -99, -119, 146, -82, -6, -368, 81, 2, -27, -178, -212, 174, 414, 300, 145, 5, -51, 164, 470, -117, 67, 27, -159, 96, -149, 275, 48, 314, 68, -207, 149, 30, 134, -90, -219, 256, -133, 38, -58, -283, -12, 70, -189, -38, 66, 276, 15, -177, -53, 74, -106, 121, 5, 150, 53, 49, 70, -51, 308, 101, 200, 41, 34, -169, 182, -130, 24, 283, -110, -126, -100, -120, -107, -254, 124, -161, 67, -71, -14, 238, -184, 250, -162, -40, -94, -112, 8, 0, -78, 336, 54, 13, 65, 85, 225, 207, -4, 89, 269, 303, 21, -165, 27, -185, 198, 201, -185, 347, 19, -76, -106, -4, -88, -10, -131, 22, -121, 35, -22, 105, -97, -172, 137, 51, 31, 7, 158, 130, -110, 53, -13, -262, 12, 46, 181, -33, -119, -155, -75, -138, -147, -156, 55, 27, 206, 143, -228, -31, 301, -5, -94, -131, 58, 27, -107, 75, -49, -143, 143, -229, 271, -197, -297, 44, -148, 202, 117, -170, -98, -62, 392, -99, 426, 227, -234, -16, -44, 7, -39, 115, 107, 0, 78, 105]
4166A05l01K26J15Kl00Q8P4j55j0j20L63Nk36J13j10R4J4K07n64L43j49j05J95
4189a06P2J09mj52K64j29k23K81mj45J50k47K74k07oj4j47L83r4j23J33o6L3m8
4213a6l6M3l3J06r3l27L32Rj3J79j44MJ01n4j28MJ01J53j72J4j16n0J4K63k10
4238f9M6J71r8M2k66J68m7K07J03l70Q6N8J5R4k76J75j49P5j67K16j59J58J34
4261A47K1j56Q9k86Q4J40q0k21J78R6J65k52O0O4j31k8J35l4K60m08Q3N9K3n0
4285d2J36J33l72K29j77J6K40k77K9Q4q8n0K43j85k28L25l7O0q6p5j59M34k22
4308f9l3p6J54j14p7M00q6k68J44Q8j72o9p1M08j80jj97K07j5K34n5j68m5m7K3
4333h5J79j7rk1k56K38K89k31j8J91k47j44L73n56J63L10j82m6J85l57M39j68
$$ y = [105, -196, 30, 145, 147, -153, -65, 9, -146, -156, -276, 87, 92, -144, -31, -141, -47, -33, 174, -390, -47, -196, -301, -106, -34, 75, 71, -81, 183, 54, -169, 112, 108, -37, 113, -134, 140, -67, -73, -87, -234, 149, 55, -68, 65, -1, 32, -16, -52, -9, -42, 64, -29, -356, -24, -15, -28, 151, 7, 11, 112, 58, -70, -66, 35, 188, 16, 30, -86, -136, -122, 141, -69, -23, 148, 50, 92, -174, -6, -53, 154, 257, -113, -27, 31, 46, 140, -136, 39, -110, -35, -202, 14, -145, 13, 147, 168, 12, 101, -185, -101, 39, -41, -262, -84, 12, 177, -75, -15, 49, -82, -110, 25, -9, 251, -157, -74, -15, 8, -42, 94, 227, -145, 84, -93, -77, 163, -114, -85, -1, -89, -139, 104, -81, -309, 16, -21, 39, -47, -122, -281, 153, -69, -102, -178, -24, -138, -215, 185, 99, -169, -25, 63, -109, -178, -249, 159, -21, -22, -219, -12, -27, 207, 152, -16, -61, -108, -85, 94, 77, 68, 47, -209, 29, 318, 87, 69, 260, 13, -131, 242, -314, -151, 159, -23, -69, 116, -241, 198, 30]
4355C0j24J29l15L85l64M48m34K58r3j57RJ39N0P1l4j93K14m6j07R8j76J41K12
4378A41j11J15o8j9q1j07r4K40N3k04r5K77j41L30k78k79L21M2JJ52Mm33K32Q2
4402H0k58J60j95K44R4lk7j18L22l91M57p5l98N5K09r3j54l3K38l14L07l86M5
4425b34M00j06j54R4k9p2Q1J4n93P82kk25J36M8j16P3J6l27L76l17K01J12r7J4
4449G5k22L07j49K3p2J17J67j96P9j45j76K05n3l19M10j50K70j75j45Ql1M09l86
4472a49K57p3j12j21M28k10j46K5k47K86M4J34k48K52j42Mm4k8R5J21k69L27l5
4495A49j95RJ24j16R1j50j68M73l46L46k22J81o2l06N8O6J40J5r8L39o25J74P2
4518e1J30J26j66P4J43m25l7J16p2L02l60L07k61J54L4J10j44K79k98Q6m8N8k00
$$ y = [30, -94, 35, -280, 105, -259, 189, -245, 13, -80, -237, -228, -89, -39, 32, -2, -195, 19, -27, -134, -36, -212, -71, 141, 30, 145, 77, 58, -23, -130, -224, 16, 69, -135, -230, 47, -94, 236, -42, -321, 0, 42, 43, 195, 199, -234, -2, 80, -178, -18, -213, 31, 125, 122, 95, -23, 299, -92, 365, 290, -108, -53, 156, 63, -91, -124, 114, -200, 107, -279, -234, 166, 60, -94, 0, -29, -101, -20, -6, -599, 183, 181, -44, 92, 140, 24, 97, 113, -214, 162, -155, 46, 158, 61, 75, -147, 160, 11, 34, -38, 79, 246, 50, 129, -16, -192, 13, -40, -359, 51, -99, 171, -4, -149, -141, -172, 237, -149, 108, 35, -77, -198, 230, 20, -126, -101, -348, -62, -18, 116, -132, 120, -22, -18, -62, -90, 5, 126, -143, 184, 149, -46, -37, 87, -29, 62, -88, -256, 217, -129, 217, -5, 176, 114, -192, -134, -68, 72, 87, -11, 328, -297, -123, -51, 79, 205, 39, 113, 256, -169, -206, -90, -162, 140, -220, 87, -174, -20, 14, 124, -20, 259, -39, 47, -1, 57, -143]
4541a43M2J87l69K12j72N17j58k40M00j59J42l96q8R7q1K89N1j37J03k71K69j83
4563h8K57l88qK70n7k2m3j01K64j02l1j10K14J04k79j60M97l11m2J19j7L7K88
4586B91k41J3j38q6J95L8j13L3J41Q6k78JM0mk6K16p4L0M6q2J21r9k10K79K4k30
4612b7M8j45O8J61k22J47J93j14l19K26n8K37k03q9J25K20l12j3K57j88k26J86
4634d8j06N86k89k30L4P3j38J32j31nK53Q0j70k43J81j89Q8J94j10k00N33m72
4656a77J49NJ81l02L4N6K42m12K22j36K7R4PJ21j49j65J77J11j92M7J57l06j50
4679c59J96K32M6nn1j59K2o6J86j06M79j77k43K36j27Q9k03N4k0k94K13K7J35
4702A05k03K58J35k31K4k79J92K40j12j45K80l25K46k7j5K5j09M8J36k62K1N8
$$ y = [-143, -101, 86, -283, -71, -243, 274, 116, -124, 276, 117, 259, -137, -225, -128, -209, 80, 131, -6, 97, -174, 95, -88, 169, -219, -227, 43, -14, -36, -79, -180, 84, -18, -49, -159, 55, 159, -120, -280, 217, -94, -136, -17, -34, 3, 291, 50, 63, -75, -161, 34, 72, -41, -8, 133, 219, -59, -58, -18, -22, -48, 168, 94, 124, 170, 88, 209, 110, -100, 179, 203, -27, 21, -124, -56, 105, -117, 30, 223, 109, -210, 16, -42, 195, -8, -97, 28, 248, -64, -77, 180, -8, -234, -48, -154, 432, 143, -87, -53, 20, -118, 14, -117, -122, 131, 211, 41, -202, -21, -210, -122, 72, -38, -238, 295, -177, -28, -23, 158, -144, -110, -54, 188, -224, -2, -138, -111, -17, -10, 111, -38, -203, -26, 85, -107, -60, 97, -209, -359, -163, 69, 115, 110, 59, -100, -78, -144, 42, -64, 415, 238, -5, 231, 104, 193, -10, 44, 24, -270, -57, -30, 105, -98, 160, 295, 64, 88, -191, 1, 241, 129, -16, 264, -61, 185, 158, 143, 168, 59, 107, 243, -19, 2, 60]
4724F0o8K31l82K02j71L62m20N0K90j88J0k47J25M02k82QR3N1l2l42Q3J93j51
4747a23R6l3J38k18nJ33n8Q4J41J1k84K22J25%j8m04L94k2j21k00K65n2j8j24
4771g1m2k09N47j17n7k39M46k29k0k00J37j0J35J58j26K3o2n2m3J5r4J36lp4J3
4796c8P9J28J3j40J9m1j48J94l46L01k07L6J26Pm6j02M31l24J26J09j72j50J69
4819B4q3Q0j19P3k8N8J05p0K07k99Q1k61J92J84j57r3k0L63k18j79J53l8k45Q6
4843b04L33r1q0L4R1m96M84j09K60j61k94J89l5rJ22K2j32K41k97P3K47j70o3
4866d5J09o6r0K67j8k59J42J34j66M8j25K30l3j63k19L98j24J55q8j60L64M9k86
4889E4Kj89N2J67q7l07K07o2J2Q5J13k0q8pK00J2KPK4j29k23Q0l3K37K3o7J2Q4
$$ y = [60, -8, 223, -159, 43, -128, 234, -186, -136, 154, -34, -24, -271, -146, 256, -26, -18, 75, 126, 94, -248, -165, 28, -123, -27, -60, 78, -140, -145, -12, -70, 14, 155, 166, -118, 104, 229, 229, 211, -193, 201, 179, 58, -142, 123, 71, 53, -71, -113, -322, 225, 108, 51, -188, 258, 29, 9, -191, -54, -64, 71, 229, 103, 126, 64, 12, -31, -16, -110, 26, 23, -51, -38, 41, 169, 182, 42, 61, 20, -128, 66, -280, 21, -186, -150, -24, -17, -63, -165, 266, -58, 68, 177, 5, -145, 24, -59, 21, -98, -25, -53, 5, 110, 40, 247, -52, 29, -232, -40, 144, -13, -106, -126, 237, 19, -160, -7, -45, -290, -204, 129, 38, -42, -8, 83, -413, 71, -38, 222, 61, -233, -44, -79, -88, 34, 56, -76, 165, -132, -59, 188, 18, -45, 64, -2, -92, 175, 157, -102, 40, 174, 8, 56, -69, 161, 128, -35, -254, 144, 20, 175, 87, -73, 291, 340, 54, 56, -133, -81, 86, -1, -308, -101, -163, -151, -66, 47, 27, -61, -68, 132, 144, 146, 153, 177, 48, -175, -95, -128, 109, 132, 65, 77, 161]
4917A61k10J76J19k53J17l70R2KL36j23J2j80P4k84N94k09k23K81M8K9j66J12
4939A35P4o80L70J29K5O8j68Q1j66J11l43K82J08qJ24m76J61L28k03J23J21k50
4961e4j25L34o7r1j37J43L4J31q3J35k21j24L32k73K79m33K00k34J69K78j12k1
4983F0j62K77J34j42j98j0J38P8k58k2J94k29K16o1j47J70r9J46l8J26k53q1O6
5006i5J68m0k66J1J58J29j08RP2q2L49m07J00j79J72L5J89Ln25M60j60m4o1J37
5030B5J70k46k54K93r4P6j99K80j24J4K47j21n1P5k3l3l41k04L94M37J95j097
5052e81J073k44j28k49J32K39O6m91j33L8J51L7j56K03o1J80m6Q8k85L88l40M8
5074g1L78L92p26L15l62L9L8M88k86o21Q32lj128l00J084j305J000k41R20n55
$$ y = [161, -49, 127, 246, -7, 110, -260, -168, -166, 170, 47, 59, -121, -47, -331, 263, 54, -169, 112, 160, 189, 23, 135, 209, -471, -101, 28, 53, 121, -47, 34, -132, -21, -364, -82, 26, 18, 142, -334, -173, 155, -48, 75, 196, -54, -179, 155, 88, -3, -140, 3, 37, 168, 85, 220, -1, -125, 207, -66, 213, -220, -20, -254, -85, 193, 81, 60, -102, 175, 309, 167, -31, -41, 97, 175, -83, -105, 89, -140, 76, 15, -132, 38, -61, 85, 47, 173, -80, -161, -95, 73, 33, -233, -222, -64, 65, -43, -34, 38, -44, 305, -102, -2, -181, -9, 26, 215, 218, -307, 153, -7, -51, -112, 25, 195, -51, -305, -12, -106, -30, -229, 51, -73, -59, 188, 67, 16, 91, 68, 35, -306, -510, -116, 321, 516, -581, 492, 248, 120, -129, 3, 242, 308, -183, -316, -278, -127, -90, -246, -43, -104, 76, 30, 118, -167, 221, -119, -71, 307, 699, -27, 288, -74, -35, 3, 491, 205, -416, 416, 413, -715, -1015, 69, -1236, -236, -477, 443, -112]
5094a12k31P85o86Q92q81J0K00M31m62k77N11j84K20k80q7K41J37l10k89K35J04
5115c3q3o2L37n60K92L68rl98M08j13mJ9q7k57K32k91J03M73n20j89J76K42j7
5138B7q4k2j21M22j63j11r8L11l15J02j29L31j16J30r7k94L21R9k43J37J13k67
5160f7K1J97k11j78N36k11k28L9J58J02L7m57L70j13J1J51M6k35M85k88j07l56
5182b98J52L99k35P9j76J41p6J59j30p5l9p8k8L35q5j37J48m16M23j1M9J4p8R3
5206A30K6k8m55J08K39P0j44O1O0j29J18M0j02m57N77J2r1O0j28R8j85J34M9j45
5230h2L18m37R3Q9j57M3J86j91L59m5o7J33l30k1O6j48J07K54k12l6L42k52K40
5253B52k47J15k04lJ64j14O4q4p6K14J09k93O8K8K1j12l3rK41j8j41K30J0Q2k19
$$ y = [-112, -343, 442, -244, 648, -233, -223, -23, 408, -54, -331, 180, -4, 216, -64, -151, 90, 227, -83, -372, -137, -33, -116, -178, 159, -401, -109, 259, 250, -148, 260, 147, 143, 162, 75, -182, 50, -241, -138, 335, -185, -374, -198, 44, 27, -57, -79, -200, 222, 59, -52, -150, 161, -154, -52, -181, 150, 34, 164, 67, -227, 94, 193, -50, 87, 200, -67, -46, 151, -60, -238, 298, 87, -141, -102, 56, 158, 195, -262, 108, -5, 6, 157, 203, -32, 453, 165, 58, -298, -146, 253, 18, 97, -79, 62, -14, 145, 15, -60, -99, -177, -205, 130, 45, -92, 56, -360, 63, 52, 101, 115, 37, 130, 156, 128, -327, -219, 20, 90, -54, 7, 67, -62, 56, 96, -6, -463, 114, 126, 35, 95, -33, 65, -120, 14, 63, -82, 236, -201, -108, -19, -176, -133, 53, -138, 221, 176, 109, 242, -88, -109, -43, -191, -84, 170, -42, -78, 264, 12, 252, 5, 120, -84, -87, 77, -37, 27, -57, -133, 81, 190, -103, -35, -7, 14, -98, -131, -140, 101, 83, -58, 172, 182, 264, 45]
5278D5j0J55m89K07J30j35L05K9k83P4J17r6k4jjJ20j23K2j5l41O09n98L99j92
5302i6K32Q5k21O7j97L83l96J95K0m1k81J30J0K9j02J69P5m07K79K00k40L11m6
5325A58j61P4J52j69J03k32j52J40p5K92k30K21P6l52K23O1k73L25j47j32j28
5346b26K24K14l7l04qJ35N26o70lJ79k57N0M51n12L17m9k31L30l02M76l49O3M
5369B1N8j8K6P5j70J58J97k88Q4j61q7J53K32j91k27J97j36j27K84J40k0k70k67
5392c37L01O5M6k21J05J30j80J6LJ40j99j39K29Q1r1k2J26n9j01K02k38Q5J73
5415A15j92K01l65J26L21l00J79j21k7p7K3n5K08j9k15N6J76k17J53N9j09j43
5437b23K31nq2K75j88J5J10j87pm4o3J19R3k28pL18nlj35O2r6j52L71r7J26j56
$$ y = [45, 35, 190, -299, -92, 38, -97, 208, 237, -46, 28, 145, 49, 25, 24, 23, 143, 20, 42, 27, -314, 295, -303, 96, -96, 136, 221, 0, 67, -130, 253, -143, 52, 72, 31, -250, -120, -110, -81, -183, -14, 61, -346, -67, 133, -107, 204, 158, -3, 71, 223, 54, 157, -75, -227, -87, -162, 130, -100, 121, 197, -155, 68, 129, -144, 181, 34, -98, -226, -2, 212, 175, -129, -137, -2, 524, -146, -149, 30, -227, -177, 274, -238, 79, 30, -201, 129, -173, 303, -46, 17, 21, 79, 61, 87, 162, -8, 150, 347, 59, 143, -18, -105, 48, 280, 89, -138, 59, -77, -204, 80, 220, 200, -70, -337, -36, 29, 75, -146, -41, 89, -91, -75, -72, 68, -131, -270, -41, 40, -51, -73, 53, -6, -107, 95, -143, -58, 115, -77, 124, -241, -115, 206, -94, 85, -36, -63, -140, -117, -172, 36, 17, -198, -142, 34, -183, -30, 29, -80, -223, 8, 3, -79, 196, 8, 23, 133, -54, -61, -105, -168, -49, 44, -184, -191, 127, 122, 119, -16, 46, -50, -202, 169, 72, 198, 42]
5463D2M1p3j62J68p2M38l82J00j62Q2o2L8j54K65j35q7J40k9j48J81Q9l62K30
5486a4q6K23k11K22j91K62k40j0J46j56r1J28r0l9O2J18K30l28N1M6J76j21Nn86
5510d94M97J4j10M38k98j01J75o1j17L31k58P5n8K03k11k08K58N2j45O7q9N6k9
5533a3r4K95k76k4J01j08J55q0l88M39K2n5J21l79L79j36N6M1q9J9%K29j84j46
5557a15j06L23k08j48M35k60L5LJ08K55r4n6k41K17q2j2J55k12j3L3p5J13m2m4
5581c1j8J83N3k39k2L04j60j3K2j35J20J05k44P9Pq5J27N6j10K21m4l7k90j51
5605c02M73k06L0K26j58k42L72p0j61K38m81K08J79rJ42n56K23P8Q2j53l7j36
5627b60L76K11k33p5k26K92k43MJ10o5K00k30J02N4Q1j43J52j6l2p7J45k1j98
$$ y = [42, 83, 10, -152, 16, -56, 382, 0, 100, -62, 20, -42, -4, -158, 107, -28, -115, 25, -4, -152, 29, 118, -244, -14, -100, 123, -88, 134, -57, 205, -35, -45, 101, -55, -146, -18, -108, -147, -85, 33, 263, -65, -14, 32, 208, 87, 92, -494, 3, 17, -93, 345, 47, -54, 121, 60, -57, 274, 16, 91, 33, 236, 25, -183, 75, 127, -18, 49, -40, 16, -13, -107, 188, -88, -112, -11, -119, 36, -44, -432, 7, 29, -26, 95, -284, 95, -41, 15, 56, -33, -14, -14, 215, 31, -115, -221, 102, -106, -254, 181, -79, -44, -41, 67, 322, 228, 172, -69, 148, 66, 54, 209, -3, -16, 17, -58, 55, 13, -31, -49, 134, 187, -52, -74, 230, 70, 57, 79, -56, 64, 169, -75, 4, 11, -74, 53, 109, -1, 220, 176, 139, -151, -302, 171, -35, -5, 221, 63, -179, 193, 123, -38, 200, -281, -73, 106, 97, 239, -317, -94, -16, 66, -87, -124, -260, 116, 327, 94, 19, -207, 85, -158, -154, -44, -109, 91, -139, -37, 17, 98, -45, 107, 91, 59, -18, 127, 106, -92]
5650i2K06j96M6o7R8P2k9q9J38J93k30j28K5k26L25n8N1k28m3K79J2Q1r7M9j38
5675d6l1j76K60NL7j64K4K46k90J24p7J97nk41J29K6m4L26l56j93M17o6M6j6l3
5700I9J22j93j84o9RM05l44J54o0K44l98P1J12K94l35K21j58Q9j32J0k5J08K6
5723F6k35J76o6J93j92l6P6q6K71k21j5m6J03m7k17J80P4Mm6j41K73Q6l61L45
5747A38q5K4r6R2J68k17m5M7J66p8l21K33K37j15j57P9K68P4m59j65J27L91n73
5770b67R5L09k95J88j10k51K81O5Qj1k21K7J69J28J6m22j11K66L55r4L4n6J14
5793B17j04k7j26K69m37K34k02J52k25M7K05k09M95q95L77N33m02J34K47l72M6
5814d3k87P87J44n51M63j56l50q1Q00k65l94M30o54l0O55n99L45p28J227K62j498
$$ y = [-92, 114, -82, -36, -103, -5, 67, 38, -51, 87, 280, 50, -78, -53, -279, 46, -12, 39, -189, -232, 47, 59, 140, 43, 92, -46, -77, -253, 7, 12, 49, -115, -91, 155, -135, -11, -88, 109, 104, -137, -8, 18, -26, 300, -56, -249, 168, 102, 148, 132, 99, 221, 28, -156, -225, -216, 189, -155, -1, -61, 183, -215, -144, -32, 262, -73, 148, -10, 79, -53, -43, -68, 40, 66, -169, 7, -59, 134, -58, -94, -18, -104, 167, -54, -69, -115, -12, -59, -276, -96, -22, -18, -64, -205, 68, 154, -207, 138, 53, 77, -19, 73, 241, 24, -21, 26, 192, 114, -207, 26, 263, 148, -9, 70, 338, 412, -47, -212, -85, 306, -267, -172, 137, -158, 30, -80, -331, -50, 15, 23, 12, -209, -182, -13, 115, 131, -291, -402, -136, 219, 125, 159, 103, 217, 113, 86, -40, 229, -208, 26, -176, -24, -249, -202, 3, -206, 289, -606, -229, 304, -98, 36, 283, -89, -43, -330, 457, 601, 50, 513, 357, 7, -74, 726, 461, 67, 497, -157, -187, 468, -131, 214, -514, 713, 975, -523]
5835e23Q39J85m11m42J79O55q17K69K1K94j54j79K5J26m7r0j38L39n59L30L02
5856B04m80L51k05K31j56RJ0j65L08oj70J07r0Kn7R5J81K6l57J63k7l4J87m84
5880c57L75O1k75P6J33j86K35Po1l3m8J73r1j7K55k09k89M61j39n7rj8n3Q2O9
5905H5K00j94j03R4k58n5k5J77J10k7N1K09k36L27n02N26K39o60K43L79j070P41
5927B51m77k02p9P4J470m97j177J070k92m99K95j0N75j152N98m58N22m27N68n92
5947d39P35n15j91O02j33L2m70O51l57M8n6oK82k73L74k53j13N6j00M41j01q9
5969A25K43k52mk2k51J46PK25k03j52J23J27j04Pj4q2M6P7j37m1J38L4j46L44
5993B34l60J08k24L09k8R8j17j92J84p4K31k51Q1J05R0q4l1j83J6qN2J07J12l01
$$ y = [-523, 316, 501, 90, -352, -173, 482, -335, -66, -45, 249, 95, -84, -59, 67, 20, -70, -208, 131, -428, -98, 204, -276, 75, -130, 101, -55, -46, -36, -201, 107, 101, -69, 38, -52, -50, -107, -12, 169, 195, -162, 1, -26, -60, 127, -357, 18, 79, -196, -120, 13, -173, 62, 69, 8, -25, -73, 100, 9, -8, 247, 38, -251, 210, 71, 14, 5, -13, -66, 16, 85, 285, 91, -12, 82, -176, -231, -256, -79, 31, 4, 55, 264, 28, 355, -147, 379, 618, -42, 201, 580, -490, 251, -226, -428, -507, -433, 1037, 540, -637, 433, 141, -358, -63, -73, 502, -650, -52, -510, 12, -415, 153, -439, 296, -219, -410, 192, 59, 91, -379, 272, -85, -37, -93, -99, 183, -90, 284, 31, -82, -26, -126, 315, 214, 125, 368, 116, 112, 90, -161, -15, -8, 217, 14, -138, -15, 112, 8, 15, 1, -81, -35, 42, -95, -136, 2, 36, -110, 234, -126, -18, -242, 67, 39, 137, 20, -172, 12, -62, 169, -82, -1, 104, 194, 110, 79, -104, -88, -96, -44, 63, 175, -126]
6017a26L10l68O2K83l07m2J62R1oo5J25n9j14q6K18k29J51J38J11o6k78k27K71
6040e1J70K46l79L5N9P8j66M6K15l51K20r0K40n01K89k54J26J93j96K51j26J05
6062A59k21J92k44K37k42L25k1l75K87k31K15Q4j86p6J28J46l01M0J63k2j4j56
6084a13j08N0J55j23M33m27K94k06Q3p2J77k19MR5j76N9p6J16j29J03J37K54J52
6107D63l35j03j69K35m7j21p5L8l53N21m44K71K72r8p3o5K6m55K86O7l3K62m5
6130B5m0K82l36J44k22J04K9j47J00j41K31j51K11Q1r7j36M4r7N4N1L5Nk5J68
6154A72j04q9K8J02k29P6J02q9K31p7n6k20P1L34j34k63K67l8l12K68l10J49L11
6177A90R0k75jk4J51j93O2j61Q2J25m4J5P5J0O4k77K27o1j96pR6J01J29N8k40
$$ y = [-126, 184, -184, -122, 161, -146, -188, -26, 65, 59, -6, 119, 60, -54, -140, 78, -151, 0, 138, 249, 183, -95, -322, -51, 119, 365, -14, 21, 80, 158, -8, 38, 253, -98, 122, 32, 272, -229, 60, -194, -68, 125, -71, 180, 54, 159, -62, 130, -114, 123, -119, 206, 185, -190, 97, -134, 81, 165, -21, -97, 31, 177, -124, -84, 79, 57, 43, -113, -221, -171, -16, -139, 294, -133, 161, -45, 38, -34, 143, -76, -72, 23, -153, -94, -170, -54, -183, -80, 57, 311, 463, 128, 25, -144, 91, 44, -77, -152, -114, -467, 54, -390, -119, 153, 55, -18, -83, -57, -512, -226, -159, -192, 70, 25, -15, 267, -69, 75, -147, -43, -14, -161, -61, -202, 29, -122, 89, 170, 73, -63, -19, -116, -62, -11, 24, 29, 4, 172, 68, -21, 7, 109, -120, -44, 58, -31, 200, 123, 67, -153, -82, 252, 118, -145, 122, 84, -228, 40, -270, -121, 190, 280, 5, 4, -20, 131, -62, 0, -161, -79, 46, 2, 17, 92, 102, 166, -111, 116, 55, -141, -148, -52, 49, 178, 236, -4]
6202dj80J32j80K00j60J76Q2m59L26l6L1K66j33k13L1L38j92M6J30j01l81K05
6224g6R9K0J33j89J9N9o0N0Q4P6J28l40j63K82j22l0qj51M1M0n3J24K19J21l53
6249e0l2J89j71k8L28l36j85L53j86J81J53k37n5J7L3k52J87K08q2JK0j85J39
6272A0J58l04M61j70l30QJ40j2r8J07M7o2N5J22j80j11j7L42l93M14m17K00r4
6295a24j89N39j76J78o2L3m66K97r5k7J90j58r5Q2Q1j69J60k9j2J03k97K53k03
6318a86L58Q8k50j2l5n0l4J43J82m95L75j52k12N30j85k5k41K08%j06J0J52M7
6341A10j91p6L59n34N89l00L42m92j15K11j89M36m2j32K96m53k6L6K05j41J31
6362B4J1l41K64K35j19k79K93j25J19P7l43L07j5j25K3j77K46n4K6m9j41j27M95
$$ y = [-4, -184, -52, -232, -32, -192, -16, 66, -393, -67, -103, -72, 194, 61, -152, -121, 217, 25, 71, 201, 100, -281, -76, 23, 43, 176, -13, 6, 65, 5, 55, 139, 215, 343, 3, -160, 122, 0, -30, -38, -189, -148, -108, -161, -37, 182, 303, -50, -82, 107, -64, -92, 236, -100, -285, 68, -118, 63, 216, -21, -76, -59, -26, -278, -91, 117, 35, 36, 56, -129, 10, 168, -136, 325, 155, -175, -167, -27, -39, -137, -30, 17, -45, 10, 132, -48, -159, -176, 166, -227, 187, -230, -30, -124, -313, 226, 50, 228, 166, 199, -267, 30, -65, -92, 98, -60, -155, -73, 8, -161, -1, -30, -42, 61, -236, 17, -186, 172, 260, 10, -2, -37, -87, -121, 22, 204, -291, 84, -68, -280, 250, 65, 40, -201, 7, 7, -99, -89, 63, 110, -81, -157, 202, -332, 257, -43, 299, -193, -308, -97, -286, 150, 108, -24, 272, -181, -207, -171, 34, -107, 24, 35, -306, -42, 193, 74, -205, 88, -37, 82, 159, -184, 123, 108, -17, 6, -171, 75, 21, 47, -2, -143, -270, 225]
6385B25l96L09j38jJ45l32M05j90j59J53K1j19J89j00k8k7k8J73j75k5J04J0m8
6408c2k9J26k02J37l45J14K95P2J84k85j28PK90k15K06l64j71K89NK2J10j85K72
6431A73l68J25l5K1J15J12R3j82k55J45J0j1j63L42K5r8r6m4J49p1Q1l6K14o6
6455A80p5K6J23n17J15N6M7J31p7j00M4J12J38m36K52Q9j51j35N3K02l0l85K73
6478f5L9J93m19K85Mp0k46J29K72k28J72J80M2m06l0j84L30N2n7j57Q1R5J6J1
6502C9m0j31M11l46j30K66r6J15m0m13O32m95J83m0J35J35k26J12l2J8m2r6j6
6525i7J3l29M38J07j97l3q2Q2K0K76l83J23r0Q7J67n8j32p6K42o2J08j26Q8m3
6549D3q9L11l16J50J05j19J49l37K24J49j77j53R1R7k82J34o1p6J30k92K96k1
$$ y = [225, -171, 138, 0, -1, 144, -188, 217, 27, -132, 21, 42, -77, 112, 12, -16, -43, -71, 102, -73, -98, 6, 16, -32, -61, 65, -137, 0, -345, -231, 64, 136, 320, 35, -93, -86, 204, -11, 195, -169, -340, -51, -46, -24, 86, -99, 173, -195, -70, -105, -84, 31, 143, 236, 54, -201, -56, -46, -57, -220, 122, 147, 49, -47, -91, 58, -13, 68, 32, 246, 180, 105, 131, 254, -263, -148, -92, -45, 86, 9, -91, -47, 65, 203, -233, 19, 108, -43, -178, -125, 77, 47, -338, -65, -26, 167, -252, 33, 37, -33, -279, -150, 122, -106, 66, 246, 288, -118, -148, -332, -2, 50, -7, -164, -83, 12, 28, 39, -1, -132, 279, -67, -197, 69, -27, 88, 48, -365, 267, -228, -45, -85, 50, 185, -41, 71, 39, 57, 15, -81, -97, -84, -413, 25, 132, -65, -98, -180, -98, -78, 198, -185, -62, -152, -65, 102, 44, -88, -164, 78, 16, 124, -2, 86, 43, -46, 265, -51, 99, 204, 85, 234, -103, 121, 270, 93, -60, 31, 128, -154, -20, -81, -157, -27, -319, -23, -44]
6571d4N9K25p9k57J36j90M1j8n6J72j27K17k66j17O04l43N5J63l23qK71j6o4Q
6595D3RJ54p3r6K18q9k47L10m75Q3N7K22k54L8k1kK25J07L0k83M3J66j78N8jk39
6621a95J19K05p5K5j93J79P0l99M80n38J23K7L13k10L6j03N3r0P2N5J75j00K55
6644B84m28J76N8j27r2o4M54o0j69j10J59j68J04m0k51K80O3j39l3j03K3n1M83
6667B49k21M27k94j17J58j7l02J46R3k84J19L17l12M3P7k13L09k28j38L3K60k96
6689a91K56o5j27J12R0p1NP7k10mM6k51L00K35p4n56N28l18K88n5m00M51k22R5
6713f1K27j58j04l6L28j89o0L16l22L00k29K42l5j27r8l3K9K8K30k55j30j21L10
6736E2k23J78j21M3j0J07J6m7J81j76j16rJ08n5J63K59k99N9r5M2J0M9L5m6K07
$$ y = [-44, 15, 240, 161, -96, 40, -150, -109, -127, -183, -11, -138, 79, -187, -304, 300, -43, 12, 175, -148, -156, 115, 99, 35, 43, 52, 206, 133, 37, 255, 166, -81, 229, -246, -163, -106, 116, -138, -100, -121, -123, 102, 209, 239, -44, -1, 165, -13, 45, 44, -195, -76, 129, 54, 79, -114, 65, 135, -264, 216, -322, -199, -172, 141, -69, -33, -136, -83, -173, -101, -46, 129, 29, 284, -144, 32, 90, -37, -129, -193, 261, 201, 32, -78, 81, -87, 17, -23, -274, 6, 69, -70, -103, -206, -183, -234, 249, 28, 455, 161, 44, 202, 185, -117, 29, 122, -162, -43, 274, -38, 5, 82, -131, 178, -50, -188, -155, 105, -191, 65, 0, -127, -15, 75, 4, 9, 86, -124, -128, -82, -333, -33, 202, 128, -428, 100, -218, 70, 15, -385, 66, -156, -61, 166, 8, -96, -132, 196, 7, -53, 263, -59, 241, 12, 254, 219, 92, -6, -39, -10, 18, 248, -7, -137, -258, 52, -171, 7, -114, -71, -81, 26, 42, -5, 176, 0, -116, -125, -17, -72, 91, 350, 51, 110, 15, 57, 67, 116, 151, 105, 312]
6761C12n3l14K57k73J28j20L5J66l01L55k57j45PK64q0j40Q3L34l75Mj64N83n02
6784a96J17P0J39k31L53k16l3Mj3K54p7j74N3P5k6k42J74O2o8j45L12o0j51J00
6808H1k92J32q8K53pN4j52K17m64J53J91k47J97p7J75K2k39K28j43Q3j60K61k75
6831i7j72L90k1k69L32k6l2j09l5J40J19Q6j65k5k41L45l8k71N0NP3j7j11N4M7
6856A2O9k6k01J97L6o5Q9k36J52J05l28J33K72k42k2K29P1k31k65M74k91J50k97
6879b15J28L69m72L39j59K10J85n33K34O1k96L83k18l19K49J9n5Q7o5N2Q6j78
6901a08M68k59j76k3J84j97K87J2l6p0j02j07j3L5j16M67k26j79J3q0J90L6k93
6924b93L29j70R6j94M57l00n4K53l14L79j94M9j53P1JkJ29k9J18k32K02k90nK3
$$ y = [312, 259, -55, 202, -71, 57, -63, -28, 138, -163, 192, -65, -210, -203, 61, -19, -159, -76, 258, -117, -113, -277, 306, -196, -79, -9, 130, -101, 252, 36, 3, 7, -6, 248, 171, -3, 50, 125, 99, -143, 31, 93, 25, -120, 192, 132, -19, 81, -211, -79, -167, 86, 79, 133, -19, 198, -266, -113, 78, -169, 28, -49, 126, 148, -91, 137, -6, 77, -83, 178, -97, -269, 121, 100, -169, 163, 137, 105, -4, -39, 101, 220, 306, 141, 116, -125, 220, 182, -89, -39, -34, 39, 22, -89, -35, 12, 81, 55, -146, 51, 87, 22, 111, -125, 27, 132, -196, -63, 209, -33, -55, 174, 245, 14, -251, 223, -68, 82, -215, -87, 282, -190, 149, -10, 200, 385, -148, 86, 147, -149, 234, 16, -303, -54, -35, -90, -3, -68, -16, 70, -108, 360, 101, -75, -98, 86, -111, 176, 188, 152, 82, -20, -127, -140, -105, -221, 246, 20, -159, -146, -226, -36, 0, -293, 36, -134, -38, -232, 225, -75, -129, 124, -190, 189, -5, 44, -109, -38, -37, -39, 90, 61, 179, -53, 149, -141, -146, -123]
6948a23LmK05K2j6K4q5p0J10j01o3J64K31n51L15K04l24k09L71j11J32r6k14K88
6972A02l6k75K68N1K9j75K26l10J34K47j86k12k4J97M3p3N9L9k25k3J92N5j59
6995e6j26L49o2O6k16kmJ80r8m7k40L39J49k15J52R9j1k18J40l20m3M7P3NPj0
7021f2J50J31j83PJ47j87j37J49P6n7k5q7l8mJ79K8j00O0q4N3j9k35M0P1Pj27
7047b47K43p0Q9o6J58m0OO2ql16n3J15J75K12m32K04j33k3P0R9l5J03L5k15J65
7072I8rj32J62k27L85k79k85L10l3J33q6rk07L41J33k55J4j20J17j51n5jK89j74
7096d1O8J86l08J23k7j26J8J80j39K7oJ52j39M4l9J35r8J87r6l4j46q1L65j39
7120F6j91M8J53j8j97L95k88P7P4j91JK63P4k92q0K48r8J64j58r3l4JJ3N6j55
$$ y = [-123, -120, -124, 81, 103, 87, 111, 26, -44, 66, -35, -98, 66, 297, -254, 61, 265, -59, -268, 103, -8, 124, 28, -186, 102, 66, -209, 59, 110, 139, -36, 190, -120, 14, 261, 75, -137, -161, 36, 79, 6, 65, 104, -121, -144, 48, 103, -56, -182, 167, 105, 171, -45, -47, -51, 129, 31, -16, -256, 83, 232, 17, 169, 268, 257, 39, 179, -141, -184, -137, -64, -59, -52, -62, 88, 219, 36, 43, 190, 3, -134, 15, 91, 34, 9, -78, -116, -120, 59, 87, -13, 47, -37, 16, -3, -238, -198, -127, -120, -247, -4, -74, 15, -51, 107, 67, 73, 135, 127, -189, -242, -127, 48, 260, -172, 32, -101, -124, -54, 45, 10, 113, 148, -67, 98, 89, -43, 119, -108, 277, -2, -287, 23, -10, 123, 37, 28, -179, 162, 295, 40, 54, -66, 51, -100, -155, -156, 133, -41, 27, 213, -95, 28, 1, -125, -107, 73, -66, -39, -45, 107, -32, 12, -27, 108, 10, 197, 101, 67, -79, -160, 205, 66, -125, -77, 76, 58, -139, 256, -32, 45, 119, -72, -71, 192, 266, -26, -106, 142, 44, 208, 50, -43, -77, -76, -63, -7, -162]
7145a62K02J1J78m2l98K75J52j26r6j33L76k41m6o3P8K1J31j84P8K69l56L38j83
7168G9m5j94R6Np6J07J83l23J14O3q5J93qj35M9m1P8q9j28K90K2q8q3k5j18J48
7194a1M4J14j47M3k68K31J51k5q4n3o3N8K54k21n5K8l0K87q6J29n22L48p4n1k1
7219b4Q7L0J60l09L79k60N7J5j39l1j57M12k48J78q3j96K5J38L2Q0q1k93J03J65
7243D0q2L28j51l10L64k53LJ03M5Q6j86l18N75l5l14J06J12r8O1j40J11L36l82
7266AJ60j11l0n7k8P6p7J85j57K82k05j78R0K73n86L53J26J61l35P1j24n5M57
7289B92l03J06l3O8m5k97j2M57l73J45L90m06L44l96O2J23N6Q8l24j19K65j96
7311a08J91L21l67k57L2J20K17j60m1K22k7m42J98J6j70J46LJ26O8L7l03J79L56
$$ y = [-162, 40, 51, 229, 187, -211, 64, 216, 90, -6, -139, 237, -4, -50, -113, -35, -14, 117, -67, 11, 280, -76, 262, 79, 34, -160, -64, -59, -135, -28, 155, -168, -54, 9, -76, 117, 109, -26, 23, -18, 60, -29, -157, 133, 155, 67, -16, -41, -159, -11, 33, 147, 0, 43, -225, 6, 157, 132, 48, -5, -68, -10, 244, 23, -32, -4, -34, 253, 167, 296, -226, 122, 48, -3, -24, 63, 93, 253, -56, 323, 63, 120, 135, -4, -35, -192, 220, -28, 150, 67, -129, -104, 34, 66, 146, 65, -228, -125, 40, -42, 286, 135, -175, 189, -64, -61, 42, 87, 173, -13, -331, 244, 209, -105, 1, 113, 15, 76, -64, 47, 383, 1, 161, 50, 20, -37, -65, 11, -66, 119, -38, 244, 39, -139, -49, 224, -362, -9, 117, 278, -57, 14, -110, -165, 292, -11, 95, 62, 130, 85, -212, -224, 233, -140, 5, 395, -11, 333, -63, -1, 122, 178, 266, -58, -177, 88, -108, 83, 404, 37, -220, -188, -68, 149, -11, -52, 170, 143, -299, -101, -85, -255, -109, -106, 20, 88, 125, -178, 1, 357]
7334C57j19m57N2K11n7M1O5Q1j39j35J13j05Q3j47J69j32L06m75L03R6J08j23
7356I6q5l4j63pJ99k26J2K22j01Q1k9M8k40M20l22J79Q2k44r4J69K89K16n39o
7380g7l7R3p8J29n7K90k99j82L98l68K43O3O4J7k65j75J17Jo9M45n34K82n2j40
7404a91L26k37J59qn9M1q6K21Mk37j27K94j31m0J53n6k2m6K41k98J27J8J15L7
7428A98l54K28k15J84m0J28N1m25k6P1L05J2n3J4n6J97j40l3j34j68L05o6Q8j9
7452E2j43J77q1j01j6m1M42l61J14Q3j33J14k16J80K2j17O2J17j5j1j73m3KJ21
7476C5j38n5M09j38j9o3P2r8O5P4j05L11k80m0L0j17J10j09J07J24n7l71M02k38
7500h9pK39j13K0k09K29r0K77j04j70J04j50M3PK01j06J19J39m61L09k63J74q0
$$ y = [357, 238, -219, -167, 44, -13, 28, 93, 174, 35, -100, 13, -92, -9, -156, 13, -119, 187, -288, 15, 111, 219, 96, 11, -23, -186, -193, 6, -220, -208, 14, -87, -6, -35, 13, -227, 193, -129, 50, 132, -112, -206, -37, 252, 468, -71, -77, -114, -21, -99, 30, -27, 263, -36, -218, 180, -188, 55, 118, 182, 199, -66, -241, -124, -123, -192, 253, -281, 1, -51, -191, 135, -102, 57, 49, -10, 31, -55, 166, 170, -67, -194, 100, -31, -71, 82, 26, 4, -42, 199, -99, 28, 46, 161, 198, -156, 72, -143, 41, 1, 129, 180, -245, -271, -200, 105, 117, 64, 78, 22, 219, 79, 46, -88, -256, 49, -17, 71, 52, -91, 86, 5, -96, -112, -153, 289, -72, 42, 125, -8, 106, -110, 70, 92, -25, 37, 154, 139, 128, -45, -88, -86, 35, -103, -158, 251, 113, 94, 31, 103, 5, 70, 144, 39, 350, 70, 30, 60, -57, 53, -56, 51, 175, 118, -253, 149, -89, -96, 143, 30, 50, -159, 70, -20, 257, 153, -17, 87, -63, -20, -13, 188, 82, 201, 340, -121, 188, -75, 99, 19]
7523A9m5p8pK68l53J21J89k70J71J27k52j54L3K03K5J8ol3K16j93J17j05k62J15
7547a36J50np5L86j82k99j2M19m76Om2L18J77k09k29K33o9q0O1j5K33k49L01m35
7571b29J87N7r9N6NM6j84J39J5L8J19k26rJ2j7P5J16r6q9l5J38j60j63K31J03
7596C0J12k95L93n1n9j54J0k7L15n6j89N6L5k07R8n4k4K22j59j72K07K79k66r9
7620e5K34k33K79k50J34j80J63j20k7J28L6j8m10M88j40J41N0j51k42L04j18J19
7642A32Q1j03L5j68P2L4k51n5J93j55L2J34k16o9M99l16J19J9l04J45K88j18O1
7665H9n7l9K84Qj98O2l35j12k14O65l24J7J55n46P46l76l21k66O89J14r0M5J14
7688A10j9j43j49K20K90n39J48L2PK07l10k4J08L37m00J73m8j7k19J94J1J25j85
$$ y = [19, -26, -104, -111, 157, -196, -75, 114, -156, 15, 142, -110, -264, -231, -28, -3, 15, 9, -24, 192, -1, 116, 11, -251, -136, 14, 9, -66, 320, 138, -161, -173, 246, -230, -224, -266, 52, 229, 20, -209, 24, -45, -125, -64, -79, 154, -95, 206, -229, -42, 15, -84, -28, -23, 23, -161, -22, -7, 31, 150, -76, -85, -73, -90, -15, 101, 5, -84, -119, 19, -141, -304, -73, 30, 142, -153, 240, 189, 130, -24, -14, -41, 274, 218, 29, 85, 120, -87, 11, -43, -67, 155, -4, -176, 31, 310, 44, -55, 179, -54, 225, -25, 109, -71, 92, -28, -55, 73, 109, 91, -319, 169, 29, 170, 220, 69, -173, 131, 13, 132, 213, 110, 145, -23, 49, 83, -168, -223, -30, -185, -153, -19, -235, -304, 195, -121, -2, 17, -287, -142, 146, 28, 89, 32, -7, 277, 285, 87, 149, -186, -298, -512, 153, -171, -154, 1, -545, 201, -175, -496, -762, -73, 41, -49, -4, 110, 91, -52, -201, 19, 309, -230, -82, -50, -43, 164, -146, -170, -62, 275, -125, 48, 0, -17, -236, -42, -31, 94, -91]
7711i1J01lR2j74J1J30N5J28k68K76o38L56J6j43K51N9L0k06n2J50k60M35k23
7734C2K0n1J44Pk60m9M1M20l25j22K35K08k68j02k7J95j46j26K44j31J76O5l49
7757a69J59R8j31j20O6j5J24k97K9K91J60j69O5j41O6R9m09L99J9m5j58R2R4L3
7781A40k01J46p1k29K22J65k01j40K78M2j03J51l21J13j64L12j08o3L05l69m0
7802a36K67l67O08k45j55k95L16O8J28j58Jl3K4L0j28M9J24k96J83K1j03J4K84
7825B01K3m9q5m03L65j5j7Q3L29m35j01r5J41j52L0jO1o2L30r6J62j32q0P0k62
7850a90L85l7o7j0k11p2M49l04J18n9j4O1P1l2j46L32l27L38k34N8r0M6j88K75
7874A52k56K47n2o4J19l1o0j3j22J66j33K5J36o9l26K57j20J60K36k37K21j15
$$ y = [-91, 10, 7, 99, -75, -64, 66, 121, 249, -19, 257, -381, -25, -9, -152, 99, 158, 188, -18, -70, 80, -180, 255, 32, 52, 1, 145, 152, -108, -157, -116, 304, -21, -143, 92, 300, 32, -70, -97, 98, -48, -174, 70, -61, 115, 180, -169, -10, 88, -43, -163, -97, -112, 12, -285, -256, 35, 195, 26, 91, -50, 16, 115, -294, 105, 124, 79, -79, 13, 107, 140, -61, 85, 14, -215, 7, 172, -29, -169, 109, 151, 48, 199, -122, -9, -173, 139, 31, -32, 273, -96, -136, 131, -236, 372, 127, -28, -323, -7, 61, 189, 31, 32, -1, 23, 53, -75, -26, 98, -198, -15, 6, -97, -83, 201, 224, 175, 90, -313, 52, 37, 20, 103, 432, -3, -104, -199, -58, -210, -180, -181, -120, -182, 148, 52, 214, 82, 2, 72, -190, 195, 158, 91, 81, -130, -202, 247, -57, 61, 2, -12, 49, 120, 88, -58, 274, -53, 285, 51, 109, 19, 65, -123, 152, -104, 143, 91, 27, 146, 115, 55, 42, -80, 86, -47, -22, 114, 45, -281, -24, -144, 16, 252, 15, 236, 121]
7896A21j33j51J44O4j43L78k11M0k74KJ05Q2J24k45N2P5k76J80L0L8q7l13L18
7919h0O9k85K46K08k15J4K88k49O4j52M9P8j90L14l15K05R0m0r8J41m3k57K63
7942A05j72l2o7K80p7k59n4O33k09j61j16j68L74Kj31N3j76L1J9j20M41O7l24
7965f1K4Q8J03j29j40R5P5j51q2J60K46j81qk14R1L13k76Q1J72j70n8Q2M9p3k60
7990b24K89l13K44Q8oK2%rm1k56J78Q3QK65n26K14k67R7J13k11M89k97K71k79
8014f8%M3l2K28k79P0J86k20J35j45o0L38j17R4k66R0J19l65M58l04N0L2R1k03
8038a25J04R5P4k2k96K82j37K15j55N4j48K00J04m65M10N4j90j54j15O6J73J36
8060A60q1M7j29J11k26Q3J80l00L08j4j95N6M3j96J80%o5K94k50L8j10K0k93K90
$$ y = [121, -12, -163, -19, 45, -98, 280, 69, 109, -165, -163, -58, 24, 148, -97, -45, 30, -246, -66, -36, 2, -85, -398, -80, -11, -296, -50, 158, -57, -43, 245, -4, 60, -92, -43, 35, -155, 159, -156, 49, 139, 99, 1, 142, 99, -158, 105, -67, -99, -166, 114, 37, -222, -276, 357, 148, -13, -129, -297, 77, 79, -52, 1, -175, -144, -125, -245, 196, 263, -61, -37, 51, 154, 25, -115, -20, 55, -96, -178, -18, 228, 47, 39, -175, -84, 229, -47, 34, 206, 36, -22, 60, 109, 36, -224, 65, -248, -4, 84, 78, 100, 100, 91, 50, -206, -28, 55, 63, 328, -198, 16, -251, -154, -41, -252, 237, -60, 211, -68, -68, -25, -57, 171, -108, -38, 148, -72, 63, -82, -142, 196, 79, 173, -93, -3, 116, -249, 209, -95, -45, -13, 78, -125, -21, 74, 148, 126, -170, 112, -25, 190, 35, 89, -59, 141, 245, -220, 190, 244, 54, -100, -215, -149, 24, 160, 79, 126, -3, 108, -118, -35, 145, -155, 153, 139, -56, 0, 43, -153, 27, 27, -38, 256, 6, 44, -66, -46, -339, -49]
8084d9r9N3p5KKK40l08M07j42j50j64K89o4m3K00k11M2P7j85o9J31J13Q4k41K12
8109E2p6j09R3L3J33j18o0j72J97J52J15j16k35O1q9K16m60L04K81m30K54j73
8131a47j04K13R2J29k74J20n4J13J0K8j08m3J23j19j25L70j06k01J88l02L95l49
8153a51P3N6q4K5J43j79P0J21l5k35L76j86j55L44l50M62l46P2KK2Rr8M4j23J01
8178b2K34l74m4J44J60L4m8j27J41k11J52J47k36
$$ y = [-49, -148, -95, -170, -168, -166, 74, -234, 173, 31, -119, -283, 6, -58, -101, 99, -112, -70, 7, -178, -247, -116, -3, 81, -160, 52, -24, -133, -40, -7, 126, 8, -52, -224, -27, 125, 240, 124, -111, -50, -139, 77, -383, -79, 202, -228, 26, -147, -251, -38, 54, 183, -91, 29, -25, 88, 98, 126, 18, -25, 98, -21, -146, 224, 118, -83, 105, -197, 198, -151, -78, -22, -106, -81, 62, -117, -47, 74, 39, -196, 180, -6, -161, 183, -167, 295, -51, 21, 23, 45, 54, -44, 0, -123, -22, 212, -162, -206, -62, 98, 132, 84, -43, 98, -113, 39, 186, -50]
8191e0
$$ Imaginary data points
##PAGE= N=2
##DATA TABLE= (X++(I..I)), XYDATA
0@%%%%%%%%%%%Qj6J6j6J6k4L2m0M8n6O4p2Q8j04J23j47J69j93K24k56K93l34L78
34B01m28M83n43O09o80P59q47R41j045J157j279J415j562J723j898K091k305K538
52A330k798L088l411L774m185M657n204N843o605P535q696J0197j2220J5103j9582
67a1174K7543m5940J68474O2455k65233L3543M083o8397L4625J33616l9716p1094
79c7215J5620k1967q6133R5452J36968m4209o5637M3628l3937o4509N4248P0497
91F2806l4856j2082M0718m1536q4872M2154N9049m4335j2624M1060l9550m1059
103f5127M7416K6786l1560K4493N5998l2761n2858M3865K6169m9494R748M3703
115D6378l8919l6060K8729J304l2681J4755K9229k3782j9357L0855k756l1468
$$ y = [0, 0, 0, 0, 0, 0, 0, 0, 0, 0, 0, 0, 8, -8, 8, -8, 8, -16, 16, -24, 24, -32, 32, -40, 48, -56, 67, -80, 89, -104, 120, -136, 157, -177, 201, -227, 256, -287, 322, -358, 401, -446, 495, -550, 607, -672, 743, -819, 904, -994, 1097, -1208, 1330, -1468, 1620, -1791, 1983, -2202, 2455, -2749, 3094, -3511, 4024, -4672, 5525, -6695, 8408, -11174, 16369, -29571, 138903, 201358, -63875, -30332, -26249, -94646, -60021, 73595, 33879, -37215, -21595, -43562, -129695, -34243, 102725, 58516, -7121, 36507, 2570, -61939, -7691, 62806, 27950, 15868, 56586, 15050, -69822, -27668, 31381, -12954, -25578, 15482, -24068, -65127, -17711, 9075, -22485, 2008, 58006, 25245, -27613, 16252, 42421, -7073, 2675, 46378, 7459, -28601, 128, 1432, -31249, -16494, 12735, -11047, -30404, 451, -2305, -33773]
127c3773L2584L4278k9166r631K6550m720j8973J1085J1845j6845p110J3326j7226
140g776k3716K4192J5735k3226l86J8127n190q093J0599R085o689K370J2434j1538
154E928j2337J8531M549j8247K447N546j1088m752N986k952p224N818R111q696
168g380k528J7909L22q967P009J398p240L052K671m433l934K510J705o514N08
183c912P793n739n595N610j531l045L828J572J828J908j14J471K98K158J769p479
199H20k448M390l386l830J743j94J210r9j646J449R90K312R17n028N89N268r78
216B079j482J052j79J799q75l237O23L42M61j387m188J330L136j455J428N54j691
233a690K863J202j906J270Q17N56p17l309J036J875k195R43o03k635J579L08o15
$$ y = [-33773, -1189, 33089, 3923, -5708, 20842, 16122, -2851, 8234, 20079, 3234, -3876, 9450, -7776, -31492, -7300, 8435, -14791, -15177, 2950, -2240, -10333, 266, 9351, 2662, 5032, 17466, 5928, -6409, 12122, 16671, -1576, 871, 6417, -4671, -9423, -3437, -6389, -13613, -7795, 1316, -7380, -9908, 8001, 8323, -644, 6365, 7763, 523, 3575, 6246, 1813, -2121, 389, 2094, -4420, -3912, 3881, -1858, -7453, -1843, -3374, -6419, -2591, -1019, 809, 2717, 2603, 4074, 4372, 6530, 8299, 820, -1628, 2762, -624, -4454, -2711, -2905, -1695, -1794, -3440, -1991, -1001, 1311, 2228, -2800, -2211, 3057, 2079, 597, 1649, 1470, 3269, 2394, -843, -220, 122, 583, -804, -4992, -3662, -526, -1981, -553, 1, -1690, 1173, 2375, 469, 1739, 2556, 3112, 2395, -914, 122, 1997, -198, 745, 142, -2493, -914, -606, -1221]
250a221R18l69m12M76j382J891R22p29K056n08j542J565r23j078J596j485k241
267b466K33J68K116n71j021K347k83r29J160j194mK581j872j676R43J758J496
284B786j092j733J947j061j066K78k121Q27J753k017n94J819J009J412j144j190
300a87J022p32m08N34j229K65J606j033m6O26r2Q87j166j187Q9p67J068P48q89
319h91O05J087o39N56K88n16L63j142m79R38p66J93J187o76O8K9r62P96J32o93
339e22m58m36P17J126o40L17R83l05j91m75p14J512l44r33m61J78Q00K09j091
358g28M03J085r01J68l77m3R65k46o96J99k37P13P37q55K16J9n81Q59n33o51N35
379E1k70l8m16n54Q64R28o22J78J63l08O45n15n12P08j44m06J61j27O74k02l87
$$ y = [-1221, -303, -672, -1084, -608, -1990, -99, 823, 94, 2150, 1642, 100, 1665, 742, -336, 1260, -225, -2466, -2233, -2065, 51, -520, -1541, 806, 523, -406, 754, -440, -444, 2137, 265, -1411, -468, 1290, 2786, 1694, -39, 1908, 847, -219, 59, -2062, -1235, 518, -1499, -2093, -274, 735, 2147, 1003, -187, 835, 103, -305, 229, -1000, -735, 871, -162, -208, 418, 326, 1213, 47, -1140, -1051, -1818, -750, -2, -891, -286, 801, 162, 718, 1006, 490, 853, -289, -768, 170, -596, -403, 784, 108, 176, 205, -757, 39, 171, -522, -980, -1416, -699, 427, -213, 104, 1087, 782, 591, 116, -598, 914, 570, -363, -824, -646, 154, 363, -728, -325, 760, -141, 27, -350, -393, 572, 326, -370, -171, -408, 305, 1042, 187, 403, 422, -159, 700, 167, -484, 51, -219, -257, -673, -1227, -363, 565, -57, 121, 284, -24, 621, 106, -406, 302, 158, -248, -87, -214, 460, 258, -129]
400a29K78J58q82O35j77p8J5l60L91N42j36M05l03l0J89n53n97Q69K06p37P4o42
422h62N70P07k37j10l38n5J74j98l13R54j86K1J10j88M6L55l31K2m91l30Q73n51
444c58qN16l83L08K23l12j96J69J25j13j83N5Q05q46k5N99k88j69L89m01l6Q3
466d6R0m14l80L35L75m67N82O94j202M1Q03k16k3k00M5m56L4L64j0k25M37J60
488C21q79O20K55l37k94L88o7r0j68P90l47l62Q64j00p05q0M86k78L3j22r1m28
510e91M54L70j19n19N81J86n00K58J70n21L73P6k53m29N20N93m91n40P04l83l13
531c74O70k29k92L4L80j52l25J96M73k2o60M54j7m90L86L46n01k15P33l80o1j59
553b05L57k36l79P12o07O4N35J45n32M45K0j55j02p9J48m92L23K87k69o3J77J75
$$ y = [-129, 149, 307, -575, 60, -117, -195, -180, -540, -149, 393, 257, 662, 359, 329, 518, -35, -632, 237, 443, -294, -220, -862, -292, 415, 178, 68, -270, -325, -151, -349, -662, 292, 106, 127, 237, 49, 95, 450, 119, 141, -350, -680, 193, -358, -366, 150, -233, 75, 298, -14, -210, -41, 84, -29, -212, -157, 648, -198, -223, 376, 88, -81, 308, -93, -129, -46, 44, -370, -750, -415, -40, -507, 75, 769, -433, -392, 411, 195, 172, -28, 17, -439, -405, -41, -51, -276, 161, 321, -558, 62, 317, -20, -314, 74, 7, -83, -251, 539, 192, -170, 694, 594, -111, -191, 295, 17, 50, -72, -163, -591, -137, 233, 114, -405, 176, 362, -138, 120, 290, -231, 142, 218, -35, -464, 56, 649, 158, -382, 322, -61, -374, 296, 67, -225, -191, 189, 37, -288, -92, 381, 359, -301, 153, 136, -354, 32, 378, -123, -338, 395, 15, -46, -205, 152, -84, -463, 249, -358, -294, 241, 386, -146, 299, 319, 164, 62, -17, 131, -361, -38, 249, -20, -83, 94, 269]
575B69o34Q1K40J32J10j90K81m77L31K22l45L5L48j92j01J4j97l3L42qk40l28
597c40L08J45r1k74L66M40m73j97J82j59Q2J82j85q1QM62k97k21L02K5l90L4L19
620A47k71J32o6J34j10j98O50m00r3J94j56J88M4j95n9j31R4J14K6k65L20j91
642i2j54K25j37L8r6J74K6k47J54J40k59K64J87k30k08M88k70m2J14r7J46m32
664c08j56O99j4l7j66K33j03R3L2m22L45k64o4J40k14L80j08j87L05k82L34j48
686H8J9N0j88j58L24j47nj5mJ77l0j90j53O7K64j45L9N6L3Q9j03j81P9j36L62
711A92k44K28k3j06J42j97p9n0K30j24n9J32j52M8K14l09J8P5l3J39p5J50l19
734b02K36q6J94k11qj8K04k0k55J31p4j24J19j46L69j50j86K34L0k94K82K93j56
$$ y = [269, -365, -284, -44, 88, 198, 8, 289, -188, 143, 365, 20, 55, 403, 211, 110, 124, -73, -106, 236, 228, -12, -340, -32, 113, 22, -252, 114, 554, 81, -116, 66, -93, -11, 171, -14, -95, -87, 375, 78, -143, 159, 184, -206, -172, 147, -124, 8, -58, 76, -34, -232, 418, 18, -75, 119, -37, 151, 195, 0, -59, -190, -96, 18, 44, -221, 99, -92, -246, -21, -158, -120, -216, -42, -16, -263, -109, 31, -228, 36, 223, -7, -215, 273, 3, -39, 75, -22, 124, -308, -464, 235, 221, 184, 18, 251, 148, 241, 273, -149, 196, -68, -132, 8, -206, 174, 66, -121, 184, -98, 236, 88, 107, 157, -31, -189, 135, -12, -17, -32, -36, 141, 111, -79, -232, -165, 99, -46, -7, 49, 82, 171, 68, -113, -34, -170, 192, -52, 176, 153, 47, 189, -8, -87, -137, 93, -31, -90, 42, -110, -62, 152, -157, -139, -64, -97, 42, -33, 117, -202, 34, -52, 142, -69, -77, -95, 109, 89, -166, -35, -109, -233, -114, -260, 109, -41, -227, 7, 37, -257, 25, 318, 162]
757A62j36r9j46K15L97n90J38J77j78K69j66k22K23j58J29j41L35j17j88m7J93
778E0K15k43J93p3j97O3l1n2L20L6m45R3O7n9J98j33M5r3r0M0K40p9m7p1R3J31
804A71Lq5k9k02L20ml6k14Q7kJ69R9l9qm01J24J00j22Qor8q6K74p3j29K29k59
831b09J87J04Q5l35K90j93J4J13O5k76M9K24j6O1j90K59k14j09j43K96J11k09
853c6j6K43l03J86l06j14Q2J18J75M8l55N32k91J26k07Q8mR0ml2l05K80p1O3r4
878a07L3K8J31q8m25O68k84P6j69J26K3J61l18L49K3j0M3k27j16J41l6k13K29
901C8j22n2L5J87j79K56j48m2l85k9O57l90M42l21J24l1N5L4pk33rQ5k37L33r6
926c5K7r1K29L5j81K9J22k50P0r6K09k04P9j8K73j70J7j2l6j40K50l8p8l7j66
$$ y = [162, 26, -73, -219, -4, 393, -197, -59, 118, -60, 209, 43, -179, 44, -114, 15, -126, 209, 92, -96, -143, 50, 265, 22, 215, 142, -55, 8, -23, -75, 245, 281, -164, -71, -4, -63, 135, 2, 47, -46, -136, -96, 144, 65, 18, -53, 40, 171, 174, 89, 60, -142, 178, 174, 138, -76, 11, 9, 178, 277, 238, 230, -171, -47, 53, -69, -61, -67, -165, -251, 23, -50, -179, 50, -209, -22, 82, 167, -168, 122, -71, -57, 56, 121, -155, -106, 118, 102, 163, -27, 232, 18, -91, -234, 62, 173, -36, -52, 191, -112, 74, -232, -346, -264, -146, 29, 77, -278, 254, -37, 89, -118, -30, -34, 56, 52, 20, -285, -5, -76, -13, -107, -74, -46, 85, -3, -428, 240, -44, 32, -137, -11, 12, 173, -145, 204, 227, 217, 260, 33, -83, 58, 22, -191, 38, -84, -136, -101, 86, -93, 163, 15, -27, -412, -441, 216, -174, 268, -53, 71, 40, 95, 129, 122, -111, -120, -35, -272, 61, -35, -8, -99, 130, 165, -16, 13, 135, -115, -45, -141, 68, -136, -57, -75, 198, 28, 45, 33, -3, -143, 107, 69, -9, -46, -212]
951b12M01l04K03k31Q3k07J93J80j03J46J32l26J55j00K4n9P8l9j63L55l72K40
973G4m2k10L67k95M4K45r6j85K64M8k93K0J15q6ML8K20J85o17J81J02k05j57K16
997f3J80j23K30n03K11L5J47J90n21K7L05K5j68J20l8j54J1K38J53l3k65k52R3
1020a55n2p3J97K13k2N9k74J73k94P6J73j02N2M4J00k83K17N2j51j75J81k9j51
1043b24K97L6j39J67j9J32l11J43j9k19M44m45J85r1n1M06m84J06J07J4m4K8L57
1066C76m33L5O2m7J56m29L31j54K09j8k1m5m3K14k10j4K75j24p9j28L3M5KJ20
1090A13k39k53R2L28o0m0k5M33j68j09k7k01K39P6l33J56J2j15J72M0p0R7j61
1113d3J20q9j9K29j55q3L0J37j38R4m2j18O3j38K32j78M4j7n1K18q6q2j11K82
$$ y = [-212, 189, -115, 88, -143, -60, -267, -74, 106, 3, 149, 281, -45, 110, 10, 34, -25, 53, 14, -149, 206, -166, 74, 32, -178, 189, -106, -62, 183, 87, -98, 166, 214, -79, -59, 56, -30, -26, 12, 232, 417, -200, -19, 83, -122, -279, -63, 117, -6, 224, -279, -68, -33, 114, 304, -217, -190, 115, 140, -28, 92, 54, -100, -89, 149, 302, 269, 4, -248, -155, -207, -280, -83, 130, 108, 167, -107, 66, -228, -152, 21, -81, -29, 15, 115, -168, 49, 101, -50, -225, -44, -73, -224, 73, 109, -30, 137, 118, 250, -61, 82, 63, -156, 288, -157, 28, -63, -114, 292, -192, -86, 21, 35, -9, 19, 376, -57, -22, 40, -7, 149, -280, 51, -103, 106, 88, 67, 22, -21, 193, -17, -31, 244, 120, 41, -87, -54, -9, -7, 113, -126, -379, -287, 41, -19, -59, -84, 349, 181, 72, 45, -156, 83, 159, -174, -18, -6, -121, 51, 91, 21, 118, -43, 77, -12, -31, 198, 43, -40, -10, 127, -11, 83, 41, -77, -14, -152, 80, -98, -54, -71, -122, 96, 10, -72, -183, 99]
1137I9j46o6K1L6m7L3j16QJ24N34n69%J21K0j15L12o9k31k67M62n6J1o2J15j13
1162C9J8j72J29J55M5j96J55j95k45N12k00k52P3J98p2k71L53m53N45m7j50j8
1184d9O4j8j24J9J1K01M5p6k98K35j59J11K16k43J81j62R3l7o6L0j20M54n99K37
1208e4J03J29K37m65J07j44Q6J53m9J36l99R3l18K79M4K67o2r4q5P0M4k74M64
1231B68k95o8J8L0J29j80n9K00k56K67q4Q4p8m1J22q9J7J16R3l5o7Q6j25q4K70
1256B39k94N3K96m47J55K22l26M24k26j33Q7j0J1Nn2j01K60k79L09k3O3O1k81
1279A3oj31R4qn4L55k03M5J9k93J00J16R1J57l72J35o0p3J18K5l80L34j08J13
1303B7L92k12l22R1j51R8L25k49o7k77K65L0nK00r1j50J83J51k1k60M2Q8J15k01
$$ y = [99, -47, -113, -92, -56, -103, -70, -186, -178, -54, 480, -89, -89, 32, 52, -63, 249, 180, -51, -318, 144, 88, 99, 37, 152, 39, 57, -115, 14, 169, 214, 18, 173, -22, -267, 245, 45, -207, -134, 64, -8, -279, 74, -379, 166, 119, -31, -49, 15, -3, -127, -108, -97, 104, 149, 73, -225, 10, -149, -38, 178, -65, 116, -46, 47, 10, -56, -26, -146, 308, -291, -54, 49, 178, 415, -50, 57, -87, -1, 152, 103, 239, -160, -67, -385, -106, -62, 205, 143, 49, -36, 34, 78, -196, 268, -27, -95, -77, -47, 82, -98, -157, 43, -213, 54, -30, 54, -24, -65, 57, -32, -15, 101, 194, 159, 92, 178, 53, -31, 239, -55, -2, 294, -153, 2, 224, -102, 322, 96, -37, 50, 40, 51, 56, 4, -97, 163, -116, 193, 170, 233, 294, 13, 7, -124, -30, -38, -92, 263, 60, 105, 124, -169, -69, 47, 138, 295, -77, 58, -2, -75, 43, 68, -312, 22, -86, 27, 419, 207, -115, -24, -175, -77, 248, -1, -68, -345, -80, -50, -55, 145, 54, -96, 87, 238, 217, -43, -1, 87, 202, 1]
1327AM0J8j25k0M33l42K91k70m27O21l46J67K8J38k47j5R1j91M32j33k75n3R3
1350i1O7J62n1j5l84N05j79p9K29k04K66j6l72J07Mnj37J93L6l47L11R6P5k02
1374c1k97O11k86k1J66k64K44r2J54l0O6l06J18l36J41M31j88k40J19l0j08M36
1396B57j69k5J09l44K94o3l9P0j18K36k84J69L22l41k53M0j50q8L11o3J2J9K57
1419A59K9k2j38K84k68N4l12J45J69p0ql80L28R4k83M59j37k62L02j81K20l3J
1442A50j15j10J15j20N9L31l81J70k04L2K06j37j76o7M53j05j37K2J90k22j14
1463a60K22N2Q2j93k50K20j5J63p8j97J37Q6N6nj93j8J71k23J32R1k39N7L08o5
1487A41j09j13R8j08l4Q7J59o0m3r4K49n3k38J58j20J33k04K97l86P3R2r1K09
$$ y = [1, 41, 59, -66, -86, 347, 5, 296, 26, -401, 220, -126, 41, 69, 207, -40, -55, 36, -155, 277, 144, -131, -184, -91, -24, 138, 87, 72, -312, 193, 14, -65, 164, -40, 226, 210, -162, -55, -51, -56, -193, 0, 36, -311, 0, 96, 171, -31, -328, 283, -3, -24, 142, -122, 122, 30, 184, 154, 220, -86, 32, -304, -163, 268, 80, -160, -41, -71, -179, 257, 88, 63, 172, -172, 122, 59, 20, 90, -28, 208, -76, 93, 415, 74, -179, -139, -289, -377, -66, -129, -117, -98, 159, 188, 166, 28, 312, 44, 98, -214, -69, 100, 30, 22, -358, -30, 64, -219, 240, 103, -159, 143, -38, 182, 149, 150, 35, -75, 40, -80, -21, 310, -71, 99, -105, -73, 133, -4, -180, -247, 206, 101, -36, -14, 176, -46, -160, 62, 114, 196, 3, -247, -27, -42, 121, 43, -154, -17, 69, 125, 120, -73, -91, 80, -143, -11, 80, -159, -102, 206, 141, 32, -81, 17, -91, -125, -38, 121, 61, 18, -76, 173, 120, -118, 40, -80, 53, -151, 146, -240, -167, -75, -166, 43]
1510D3O8n6J07m8l34K77K60n51K01pJ04o2k34J96JO9K4J48k79N4J86r4k57L03
1534A19p2n8L1J15k30J52L4j33K2l4L17p9j56pj95J86N6J83j59p7Rj53J17On6
1559f2K07j86J4j67J98j03J42K92l94k4K71l66J1J47J67j86R0J8K53q5r9j62K55
1582B31j81l9Q8k50n6K87m9m1N4j13J5KO0n5J03k9K15l99K40m5N9j31M5L3r2R2
1608D4r2K7q6J01O9j85p2k4J42QJ86j8m30L07J2m1J36p9R8k20m7J11L2O5k1j48
1634a25L85J38m08K9M2j98J74N7p8n8J56j11J08l39L55oj13L5N7j88J27k36K07
1657A0J69q1j29k9K9K2KN2J52J76l53j8J69j04m35M29J96r2j45J88J02k83J47
1680A74n4k71R7j29J03R2P0q8j75K6K89k94J35O1k07J15j49J31M8j69L61k02K07
$$ y = [43, 111, 55, 162, 114, -220, 57, 317, -234, -33, -40, 64, 2, -232, -36, -35, 34, 58, 206, -73, -19, 167, 73, -184, 119, 47, -11, 20, 135, -95, 57, 91, -42, -20, -54, 263, 184, 28, 21, -174, 12, 68, 251, 92, 15, 24, -129, -12, -6, -62, 145, -41, -27, -194, 4, -99, 43, 335, -59, -83, 188, -178, -167, -20, 147, -39, 51, 69, 322, 237, 138, -24, 231, 50, 11, 99, -151, -207, 80, 31, -10, 44, -69, -54, -52, 8, -47, 56, 27, 242, -157, 83, 38, 97, -34, 11, 44, -48, 44, -48, -21, -107, -6, 63, -122, -194, -218, -76, -68, 118, 100, -330, -23, -11, -52, 84, 5, 103, -117, -164, -53, -21, 44, 23, -125, 260, 398, -10, 19, 61, -137, 37, 94, 16, -42, 114, 3, 111, -228, 127, 121, 8, 43, 100, -88, 39, -197, 10, 179, 98, -31, -60, -31, -9, -7, 45, 197, 373, 20, 2, 171, 67, -368, 61, 257, 165, 20, 208, 310, 27, 174, 120, -151, -54, -183, -80, 12, 82, -6, -181, -155, 134, -160, -25, 36, -171, -56, -205, -74, -26, -195, 166, -36, 171]
1703A71j77L1K1kq8k2K37J60k37q0P1M1k98K73k25Q5j31K17pJ55k08j01l9qJ39
1728b2j11NO9J13n9Q5J04k70J5K12j62N4k0k1k60K85j25J19k3J4p0K77m42L28
1752I5L16p87J31K89k01j2M28l28k28L97J47k54K36m17M60m46j01Kj33L72j12
1773a46J76j00o9K55r8l09J15J74pl0K47j98J20N2Lk44R8j12J55j41K2L9J3N6
1797G1Q9Rk63J79Ll2J1k24J72R4k93J05L3j76M03k77O7J23j1K4O0p2j41K3M31
1822D08m11J09Pj98J10P7O0k38M54k92l9o5r9K80J5o2L8j69j83L27j79p8P2k08
1846b64L82M1p6K5j10R9j43P8j04J67k49J50J8M9l9j10J11J29k90J06R5j79J24
1869A0J41k01N1j04N8o3J34J01m08l8L42J40N3K1j18K87k25j87j04M12l19J57
$$ y = [171, -6, 25, 46, 44, -44, -66, 171, 331, 94, 14, 85, 126, -172, 101, -124, -39, -170, 47, 40, 195, -13, -114, -153, -161, -22, -133, -128, -59, 54, -5, 80, 184, -86, -71, 141, -21, 33, 13, -8, -268, 17, -108, 11, -12, 2, -68, 209, -233, 95, 411, -376, -245, 44, -157, -169, 259, -69, -297, 100, 247, -7, 229, -188, 272, -174, -275, -273, -406, -34, -146, 30, -70, -139, 116, 18, -291, -176, -2, -9, -39, 208, 10, 130, 182, 185, -59, 39, -73, 82, -59, -37, 2, 15, 71, 160, 169, -94, 85, 88, 56, 67, -157, 15, 109, -184, -79, -46, -222, 181, -96, -29, 94, 83, 107, 167, 95, -46, -23, 408, -3, 106, 113, -85, 25, 102, 162, -76, 378, 86, 47, -18, -117, 163, 178, 116, 154, -15, -198, 129, -50, -128, -56, -264, 118, 159, 83, 108, -2, 97, -46, 32, -72, 95, -154, -4, 14, 63, 24, -86, 25, 154, -136, -30, 65, -114, 10, 151, -50, 1, -103, -45, -108, 26, 127, -281, -319, 23, 163, 216, 237, 119, 406, 181, -6, -110, 302, -17, 140]
1891A40K3k88J01n4L0r1L34k45J82l5n0J06j01l55K60j37L42L7l40M5K68l10J31
1914gJ24j30L5j87J82j2L6n4J87k57J62j68K5R2l53N43k26r9K75j65q0r3K39l6
1938C3j04%K53k37J89j84K9J71k64P3n0K9K2R1j83j04P3J88n9l2L32n83J47J22
1962d8j63K76k47K78j18M4K0k00K21k3k30K42j42M14m54j9k1o1N0%M7M7p9n2K35
1987A7j8n4j76K11nJ77k49l71N75k47j48M26k12k8R9M7Q0l92N74q0k67J68m27
2010c00K37K53o2n0j42r6J20J04j12j25J8K57j45J28n10M73K5r1j56J60P6r4J65
2033A33j10K5j20j10O4LJ28J63l17L5J70o4J32j35J67j36j22K03p9k76L15K6l55
2056b60K2J94L9r7K21Om12M67M1Jj5r8m7L04k98k02K54k22P3R1l95M35k57M30
$$ y = [140, 163, -125, -24, -78, -48, -139, 195, -50, 132, 97, 47, 153, 52, -303, -43, -180, 162, 199, -141, -96, 172, -138, -7, 117, -13, 22, -165, 17, 5, 41, -13, 174, -83, 79, -89, -64, 28, -325, 218, -8, -107, 168, 3, -77, -170, 69, 33, -71, -71, 182, -55, 134, -50, -21, 150, -114, -41, -91, -62, -40, 51, -132, -236, -163, 25, -34, -66, 266, -317, -170, -48, -211, 65, -182, 96, -22, 22, 42, -158, 63, 40, -190, 52, -90, 324, -130, -149, -170, -231, -181, -181, -134, -87, -166, -218, 17, -1, -55, -231, -20, -25, 152, -97, -468, 107, -140, -288, 138, -74, -102, -3, 44, 124, -268, 306, 226, -41, 127, -300, -63, 190, 128, 78, -64, -160, -40, 64, -48, -173, -155, 102, -43, 85, -425, 48, 73, -18, -174, -14, 62, -32, 133, 23, 48, -72, -182, -118, -115, 13, 176, -141, -106, 64, 0, 132, -3, 164, 28, -94, 109, 30, -246, 69, 95, -260, -238, -44, -5, -102, 119, 125, -287, 180, 221, 222, 207, 109, 62, 366, 68, -134, 120, -102, -29, 62, -333, 102, -155, 275]
2080B75k63p7j29N6l8J87p0m1K33m6k16J41r2K38N5j80j13k16K03k04L10J54p0
2103I7k3k84J77j3n9o0J54K62o2l69M07l82J63n2NN3J70N2k98j86j5Q7R5j42K5
2128a98K9K45J92m99J31J21o3o5Q3j31J29L99n7m75M66k03l23K77j5R8k74K66
2150A33J87j03n55N34n2j68j97K45q9O5M3M1J32k07P2R2j76jj75J41J16k53K44
2173F9QR4l16M8J52l14J99l3J26j81K8M4L07l27j25J26k87L45L5j29J10j09M1
2196h9J10Kj18J19Q5N9l07O9Q2k1J8j76L08l67L35j99N1K77l41R3j84K72q4j46
2220a52Q3J56k55J66R1l86K04K20k01k22J11j46M24Q4k88K65k97J05M5%J50j33
2242B4J28k58j04J59J80l8l75M45k61O0J37j67M4J32k63J69J32J05k41k26K86
$$ y = [275, 12, -65, -194, -138, -176, 11, -59, -100, 133, 87, -129, 12, -80, 158, 213, 33, -80, -296, -93, -297, 13, 167, 97, 74, -210, -33, -46, -105, -165, -11, 251, 189, -180, 227, -155, 8, -44, -39, 14, 184, 236, -62, -248, -263, -176, -81, -223, -198, -169, 76, 268, -231, -100, 21, -42, -107, -24, -155, -26, 373, 316, -159, 307, 104, -219, 58, 43, 141, -133, 133, 320, 217, -338, 196, 144, -24, -221, 24, -65, 0, 43, 84, 216, 9, 81, 173, -3, -4, -179, -38, 78, -175, 69, 77, 171, -145, -97, 55, -259, -60, -93, 33, -148, -120, -76, 231, -96, -221, -95, -382, -37, -2, -131, -21, -130, -89, 21, 23, -95, 24, 109, 168, -139, -70, 12, -9, 9, -167, 141, -226, 109, -90, -39, 238, -103, -10, -194, 78, -6, -152, -69, 87, -168, -2, 89, -297, -93, 127, -74, -296, -185, -331, 93, 177, -111, 154, -143, -38, 7, 7, 157, 24, 152, -106, -210, -51, 129, 91, -284, 161, -100, -40, 97, -70, -26, 106, -157, 12, 144, 249, 8, -218, 68]
2263F8j64L26k03J73j95M0k6J27j56Q4l06M66l35Q9M3j01j48K76q4O8N1J22j74
2286D1J24m47K59j51K22j54J3K15j24M68n83r5K23j02J0L41l78p2J70L4K06m35
2308b15o3M69k42j31K39R1l99K82l18J79J99m5k21R6K06k62J21J33J32j72j85
2329a06R1O4L07j97j07J06M3k82J26j34J64j57n3M50j58k57M1J19j74P7K46k09
2351@K52Ol34k50L27J37p2j44J82R1m39L16r5J00j27j85M35m29L39R8j69p7J59
2374A21J39j7q5j06K21n81N63n30N3jL28n1o9lJ27L1j84J49j94M6k87M56J03n8
2398A71N6k56J42o9N0p0P9r7l2J62J5l6j93J5J01J55k51jK17j39Q0j47K64K0j06
2423A30k69J70M1j88M20j54j03L6R1j92q5K45k41K82k69pJ46P8j48K13j70j4J60
$$ y = [68, -96, 230, 27, 200, 5, 45, 19, 146, -10, 74, -232, 234, -101, -12, 31, -70, -218, 58, -26, 42, 93, 215, 41, 165, -282, -23, -174, 48, -106, -93, 122, -2, 466, -117, -212, 11, -91, -81, 260, -118, -190, -20, 14, 220, -215, -278, 191, -51, -182, 57, 148, -251, 31, -287, -108, 91, 46, -175, -79, 127, -135, -14, 119, 251, 79, -106, -15, 49, 356, 159, 52, 158, 201, -81, 45, -89, 75, -82, -135, 315, 157, -100, -59, 60, -114, -37, 209, 0, 252, 258, -76, -326, 1, 138, 66, -78, 104, 195, -244, 72, -23, 77, -50, -235, 200, -229, 110, 208, 39, -38, 121, 260, 243, 158, 52, 273, -308, 255, -275, -222, -223, 105, 54, -15, -18, 109, 140, -44, 105, -89, -43, -330, 126, 229, 171, 227, -29, 113, 44, 94, 24, 103, 6, -26, 136, 151, 115, -78, -63, 38, 193, -58, -59, 158, 19, 99, -48, 216, 236, 130, -139, 31, 72, -116, 304, 150, 47, 83, 174, -18, -103, 142, -99, 183, -86, -93, 53, 131, -17, 196, 26, 12, 172]
2446A72j07rPK11l30j82L73j35q0J5P8J91j45j38J43M6j11q7K13p3j29J28L8k5
2470F4J54j10j0o3J79l37L07j34j73J25k68K58Q6M5j37j3j33K84K43l57R6j23
2492a7J33k78K30j74Q3Q8k75J72Q0j69J04J15o5J42j68O3j16J41j72L32n0q6j83
2515g0l3k5J61k03K01j81K26J21j03n4j56N6q5J75j09J91j25M6J27j7j83o0r4
2538a94R8j48n8K99o0Q0J55j31j09O7N0j69j22K59l2j14J17P9j29n0O6o0J92j18
2562c2p0J20q0j74J52J30J19j9r6p9j7J57j22Q1L0j36l7n4J0J17j0J9j11J82l
2587G7l07k7K52J53k00J04J53j32o0%J58j34J10k0k6O9l89P5J86K02j88k9J35
2610A62l10J39j64K01m6N9j01j04L45j73K40k57N7L8k28L27l46M33k30j43J35
$$ y = [172, 65, 56, 63, 274, -56, -238, 135, 0, -80, -65, 13, 204, 59, -79, 64, 110, -1, -88, 125, 52, -77, 51, 89, 64, 218, 108, 98, 35, 214, -123, 184, 50, -123, 2, -266, -8, 78, 123, -14, -27, -160, 124, 367, 10, 106, -17, 116, -162, 68, -106, -23, 65, -210, -38, 42, -127, -23, 92, 27, 169, 1, 64, -52, 89, -83, 249, 199, 113, -70, -103, -128, 33, -170, 31, -150, 76, 197, 94, 40, -116, -60, -145, 30, -79, 112, -13, 33, 160, 143, -40, -100, -194, -96, -244, -302, -3, -63, 17, 172, 41, -68, -1, 49, -120, -242, 17, -15, -129, -12, 67, -62, -112, -46, -106, 86, -32, -102, 18, -62, -236, -84, 46, 165, 146, 50, -29, -46, 111, -11, 70, 100, -36, -73, -127, -117, 0, -10, 9, -102, 80, 77, -230, -257, -5, 148, -52, 52, 205, 73, 13, 13, 171, 37, 147, 127, 101, 170, -219, -144, 42, 244, 56, 27, 162, -148, -9, -173, 28, -18, 41, -60, -164, 181, 8, 248, -9, 48, 86, -142, 185, -161, 272, 42, -101, 34]
2631C4N7p6n0K01J32l14nK4P0k1n8j62k5K90j69m8M95l84J2n9J06l09J96K2P6
2656C5L0j49Rj6Q9j0O7j9JN2k44K42k64K35j62K02p8J47r3k19J56j57K21j43K03
2681A35r8K22j28q0j4m2n1l5J93o8j32q2J09L01k74n6J05O5j87J26M6j42n8QJ89
2706E2J22l0j19j17K65p7j25j66m5K07l05L61j69J08j1M8k03Q9R0K43m8j24L3
2729G9r4Q3R4k41J75k79L92m7l77K90j8JQ5k13R0J29j06Q4o1J78r4m36L81J01
2753A96l82p5M70j99p0Qr1P1j90PO07q3l06j06J54q9K14J68m32J04k3J97K10l23
2777C7O9m24M83M9r6j17o9L37k84N0Lk62M35l84K02Ol04L69k58K96k41K86M4l52
2801a25K28k60O9J44k8k79L35k85K50j52P7J63k0l3k04J62p4k6N8N5m8J13l10
$$ y = [34, 91, 15, -35, 166, 298, -16, -21, 3, 73, 52, -6, -168, -193, 97, -72, -120, 375, -9, 3, -56, 50, -259, -63, -41, 35, 65, -84, -75, -91, -2, -12, 55, 36, 37, 89, -155, 87, -177, 58, -104, 98, 20, 167, 74, -145, 11, -146, 75, -68, 135, 37, 259, 131, 51, 37, -5, -56, -91, 102, 34, -98, -180, -71, 230, -44, -100, 5, 70, -117, 9, 55, -87, -145, -137, 52, 174, 144, 25, -92, 173, 96, -29, -195, -240, -33, -338, 23, -146, -38, -49, -1, -204, -115, -25, 218, 170, 46, 79, -15, 68, 162, -79, 96, -183, 209, 162, -215, 75, 57, 58, 143, -70, 20, 149, 43, 127, 66, 244, 150, -286, 95, 196, -186, -261, 209, 10, -60, -52, -143, -72, -262, -255, 352, 269, -37, -143, 11, -78, 136, 304, -128, -24, -47, 150, 360, 37, 106, -318, 165, 214, 118, 1, -68, 269, -15, 35, 38, -224, 211, -173, 29, 35, -269, 100, -158, 138, -103, 183, 227, -125, 103, -157, -88, 56, 28, -251, 84, -201, 49, -103, -26, 137, 117, 84, -120, 42, -32, -58, 0, 55, 7, 120, -190]
2824a90J87K01Ml77K33p9J64l15J76k24L52j15QJ2oJ0%k05K76j74k02K99o0j3
2848c8J51k52k8K24j77M8K24j96J69j77K25l77K43n7J11j56j2j4l9J48Q8k39J45
2871A4j30J62l07K49K69j78l8J2o2K8k33L45L2j78O4k59J07J19J13r3J20l09K52
2894I9j68k41L80K5l4j59J22J65j82k57N3J36J58j49J45r3K1j15K96Kq7R1j74
2917C4R9k31j14L96m04K04J62k08J12j69K42J43l19M8j84J17LO4k18R2p9K12L1
2940C3J34q4J89l22J14j98J08L25k89j10K02J0M6P2j1j04q6kK8k27J01J66O2j10
2964D7q8K96k23O8l79L11p4J06j39q0P7P9j87L03j23J50j66p1K01j83K14l2m6
2987F1P2k06j47M87k80m6n4J25j29R6k91K29K54j20N5j65L28m31K54j74J37L74
$$ y = [-190, -3, 198, 202, -175, 58, -21, 143, -172, 4, -220, 132, 17, 25, 37, 31, 41, 41, -164, 112, -62, -264, 35, -25, -38, 113, -139, -167, 57, -120, -72, 152, -44, 125, -52, 173, -204, 39, -18, 93, -63, -75, -89, -128, 20, 108, -131, 14, -116, 46, -261, -12, 257, 79, 41, 53, -9, 19, -214, 131, 163, -15, 49, -210, -103, 16, 129, 36, 156, -153, 99, -69, -310, 70, 95, 61, -98, 24, 189, 7, -250, -197, -61, 97, -52, 93, 0, 21, -94, 202, 204, 117, 208, 34, 133, -98, -212, 184, -220, -16, 146, -62, 50, -119, 123, 266, -53, -5, -189, -72, -69, -5, -223, -131, -210, 2, 33, 167, 83, 272, -50, 64, -134, -26, 299, 10, -100, 102, 112, 158, 230, 219, 115, 29, 27, 55, -172, -71, 95, 157, 47, -41, 255, 32, 100, -279, 32, -42, 64, -75, -155, -78, 1, -186, 117, -6, 144, -22, -93, 108, -75, 139, 107, 61, 133, -73, -220, 267, -13, -59, -113, 12, -117, -21, -312, -83, 171, 51, 106, -59, 269, -162, 92, -82, 55, 429]
3009D29l52r7R5J00m1k58j59K41K52k92K52l93m7K31J39K6j17o1J07k50K74q0
3031aK11J07k66j42J60m0o6J38j25J70j42J56j33k22L70j55J05k0k16O6O1rL01
3054C08m91L63k27q9l0R0M3j39J38L92n32n2R0K00nq5l4l2J17j72J10j73K97j44
3078e7N7k0J95l11L24k50J00q1p5J66k7L5k91K91m5LN0j11Q8j27J47K33o02J87
3102a21J79k37J62K39k65J89j39j9j39K56j20n8J66j44J47j52k0k28J60O7J25
3123D8J02j9o4o0p7P7p4K2o8K62M8l65L15l47J26J34qP4j61o1L13l03Q2K25l19
3148i8r4K11J29l85M66k20J01o8m57L28j26L63j33k3q7J0K42K5j38mMj91Q4J0
3172e1j1J17n7K3j1m5O2K34k70r3m2N7L02j44l2N2j35j0K17ol67k9M17K7k68J18
$$ y = [429, 77, -20, 75, 175, 134, -124, -283, -42, 210, -82, 170, -223, -270, -39, 100, 126, 9, -52, 55, -195, 79, -1, 210, 317, 51, -91, 69, 29, -37, 101, -24, 146, 4, 160, 27, -195, 175, 20, 125, 105, -111, -45, 16, 7, 308, -183, 180, -47, -136, -166, -76, -33, -172, -34, 358, -174, -226, -136, 64, 59, -26, -60, -92, 25, -147, -37, -210, 87, -57, 0, -20, 175, -136, 188, -62, 38, -43, -118, 48, 21, 56, -235, 56, 11, 14, 64, -47, 41, -86, 61, 294, -308, -121, 58, -179, -17, 222, -43, 146, 7, -12, -151, 105, -15, -73, 93, -51, 96, -56, -76, -304, -144, -77, 48, 150, 131, 67, 7, -70, 7, -67, -45, -113, 149, 197, -168, 147, -200, -74, 60, 52, 126, -35, -96, 217, -86, -4, 221, -98, -192, 19, 148, -237, 229, 9, 110, 42, -415, -87, -213, 150, 17, -6, -93, -83, 159, 184, 46, 42, 46, -145, -61, -51, -62, 55, -2, 21, 10, -35, 27, 261, -9, -102, -144, -87, 215, 71, 39, 91, -44, -54, 163, 157, -210, -239, 178, 205, -63, 55]
3198E5j38n3K47K3l04J69J80K7k25k19K39j34N5n5L34m27L18p1O7j76K11l74K92
3221D1j28J39rj47L36j77r0J3K10m16K87k05P7O5L7l61L64j28J76j93P8J6Q0R0
3245A55k55j28K70N3p5L6J92m13J04M9K00k47J56J57r9N5l55J11K63l59J39j92
3267a83j17K42jk4j16K22J37k40K1K10L5r4J2N5k12K15Ql0j31j85J64r9J50k55
3291b16J75o2p3j09L98j66j20K41j62J27%j08j09K07o0oL4M51n35l55M21J27j34
3314c4k24J87K84kl92Q4Pk05M53j87R8k12K23k30J37J5J42l73M4M0J79J65k49
3337e0L6O0N2j9L2l46M9Q2R1N0J81m85L47k49J20j9j26M50k67J45j67k1o1L9J92
3362A16k98J61k14J17L1J16j07K53l30L04j57J41n2J70j27j46J35j51J12N4M1
$$ y = [55, -83, -136, 111, 134, -170, -1, 179, 206, -19, -238, 1, -133, -78, -133, 201, -226, 92, 21, 88, -88, 123, -251, 41, -87, 52, 43, -104, 232, 55, -35, -22, 188, -228, 59, -146, -69, -4, 33, -328, 36, -92, 84, -109, -31, -15, 65, 155, -100, -228, 42, 95, 20, 56, 248, -165, -61, -12, 188, -59, 97, 254, 155, 210, -145, -34, 229, -130, 9, -183, -300, -58, -59, -83, -199, 23, 160, -80, -59, 151, 186, 92, 104, 159, -53, 162, 170, 140, 9, -176, -12, -111, 39, -216, -41, -103, -176, -285, 113, -53, -173, 68, -94, 33, 33, -75, -184, 23, -37, -43, -9, 442, -93, -448, -27, 100, -34, -258, -71, 213, 211, -181, -97, -90, -295, 158, -29, 69, -143, 80, -150, -13, 2, 144, -229, -185, -145, 34, 199, -50, -14, 46, 98, 79, 111, -235, -186, -104, -13, 37, 218, -267, 80, -169, -49, -68, -194, 256, -11, 134, -33, -54, -115, -76, 116, -182, -21, -235, -118, -87, 29, -78, 175, -155, 149, -8, 133, 81, 251, 124, -22, 113, -38, 74, 128, 169]
3383A69k96J10M8p5K55j33J58j03J45m99L49j02k76L06l46K00R7l81N30r7q6O2
3405C5L6l73M98j40K45r3j83r6K31j28j54rK29j93j9K27n49N40k20K07l27J35
3427a01J81K5q0o3k08M45o5j72l9j8p5L26k07L35n18o37l9R66k26Q9J21j00n3
3450a13J32l0K17l02K5j71P9N1m4j2R8L2L11l29l29K21K04p0J33j87K3K29N4j70
3474E2p4J06M1l34L57j69L81l05L3k55J20r0J56K22k40O6O1j86R2j99P9K04n7
3497F1k43M30j87M5k56J53O5j15j31K26k6k6k00K54rk2l2l2K19J35N8k05k84L30
3521B08l74K61J34j49l1j70R0J95R5m33N0j50J61j19K53k2J51k82K77k89Q1J17
3543E4n7j04j57L20o2K5j10N6o6J59j2j38J86J7r2L9J54l74K18k22K1p1K33R1
$$ y = [169, -127, -17, 31, -44, 211, 78, 236, 133, 278, -221, 128, 26, -250, 56, -290, -90, 7, -374, 156, 59, -27, 35, 71, -302, 196, 56, 301, 208, 25, -71, 160, 32, -122, -131, 98, -95, -114, 113, -436, 104, -116, 91, -236, -101, 80, 105, 25, -38, -246, 199, 134, -38, -77, -95, -170, 156, -51, 284, -234, -871, -910, 56, -170, -81, 40, -60, -113, 19, -11, 206, -96, -71, -242, -163, -112, -156, -168, -70, -38, 273, -56, -385, -164, 40, -30, 103, -84, -61, 168, 222, 52, -22, 84, 125, -209, 148, -21, 360, 55, 88, -167, -47, -137, 19, 241, 1, 67, 128, -58, 34, -165, -86, 118, 61, -182, 248, 61, 106, -150, 3, 68, -47, -178, 48, 22, -4, -204, 50, 41, 19, -13, -45, 174, 309, 367, 162, -122, 208, -166, 95, 229, 80, 49, -121, -31, 164, 259, -174, -124, -274, -113, -232, 21, -1, 150, -132, 145, -144, -63, 54, -3, -107, -264, 56, -6, 19, -91, -35, -101, 58, 46, -92, 94, 111, 19, 58, 212, -162, 56, -166, -145, -216, 17, 108]
3567A08mj27O8L6k69L58l40K04k41L20p9o1Q8J94k05jJ9jk4Mj59M7J9k6k9K3K94
3594B16m16J97j77K02j05j09K2J32L3j40K17k76L00k5k6l48N71m83J06M1m4J31
3616A9n2L9K02J16k98K21k86o3LJ42N0J8l14J36J31j7l26K69RKK1N0j46L72k80
3641A8J96j99m0R8J10k64K0KK5K68l13j8J65N0k14K35j90j7J26J19Mr0J78j49
3665A20j69k3L9K7J35J0k22o0j62M12l62N05n01L17R1j80r2K31M2l08J05J98J93
3688C46j98j54J43p3J19j69j92L37m21K64L28l73q6o4K71j10O6p0j12n1L1J26
3710d2L49k96K31j34J00l05j77L64q5Q2j82J68l13N16l15P1p3p0J52K45k05m10
3732c29K94L53l63L7m2l9K23m6q2L71m56n6o2M9K18j74R0L7R4j22K31j57k63L14
$$ y = [108, 104, -23, 45, 81, -188, 170, -170, 34, -207, 113, 34, -27, 61, 255, 50, 49, 68, 67, 43, 47, -112, -65, -46, -72, -101, -78, 216, -200, -3, -180, 22, -83, -192, -170, -38, -5, -145, 72, -204, 96, 71, 45, -303, 268, -215, -109, -68, -112, 19, -33, 6, 208, 324, 26, 247, -39, -102, -99, 43, 93, 111, -203, -67, 64, 47, -279, -10, -1, 1, 22, 72, -74, 298, 18, 214, 15, -25, 73, 183, -81, -61, -59, -34, 234, -79, -97, 68, 118, -96, 139, -51, -68, 58, 177, 181, 91, 269, 120, -49, -72, -33, -6, 129, 139, -83, -143, -305, 107, -255, 250, -251, 66, 157, -23, -115, 116, 158, -150, -45, 153, 346, 148, -6, 137, 64, 183, 14, -178, 159, -262, 2, 330, -43, -129, -193, 78, -32, 34, -36, -148, -199, -168, -42, 307, 11, 242, 108, 208, -97, -274, 90, 5, 87, -95, 73, -240, 276, -39, 32, -41, -111, 41, 286, 81, -329, -35, 318, -45, -8, -50, -89, 134, 88, 6, 377, -79, -135, -197, -148, 70, -104, -14, 23, 117, -5, 226, 69, -194, 120]
3756A20k41J7J13q1L5J33N4m71K88O9k50L53j39l00L67Q6n03L95j02N3K18k13
3778APR4j17j32K90l47j75M30O6l47L04o6o6J85k40n0L04k76J1J18j0K1R3k9j8
3803E1J96k33p1K8R5Q9j04j17k1J47j51n9K01K54l46Q8j10l9K15j61J57j08Q1
3826H2j16L08q7j33k56j6L25k08L6j74p2L85j5o0l92K81L15m3k04J43j90r9K69
3849G9k97O4L58k71M3K2j8J34Q3k84P3K9q9L10l70K60l79L86l58J4LM73k87j02
3873a24N1L9j13J22j25R7L14k40m0o8J64k02j3J11l6J14O6m67M64j35q5J42R8
3896A34m89K33J45j10R5M5J34j69M2nk0J35o7n0r3j10M58l37M63n36Rj81N9M43
3920B28j69l2q0J20L19m33M02m92K86j94j09L7KK33p2l75K45j16K17k00J97j00
$$ y = [120, -121, -104, 9, -72, -37, 96, 150, -321, -33, 36, -214, 139, 0, -300, 67, 153, -350, 45, -57, -4, 214, 1, 8, 102, -15, -147, 143, -204, -379, 51, 117, -230, 74, 8, -58, 127, -113, -163, 141, -135, -124, -6, -16, 5, 98, 69, 51, 247, 14, -57, -29, 66, 155, 51, -66, -87, 60, -91, -150, 51, 305, -41, 47, -63, -102, 113, -48, 109, 1, 82, -34, 274, 187, 54, -202, -218, 107, -101, -65, -239, -311, 74, 59, -1, -393, -112, 203, 160, -44, 99, -91, -190, 79, -218, -154, 204, -67, -24, -2, -20, 114, 197, -87, -14, 15, -74, 236, -134, 126, -253, 133, -225, -211, -208, 265, -22, -124, -73, -34, -147, -25, -150, -53, 261, 21, -19, -87, 77, -125, -138, -27, -63, 51, 117, -350, 114, -21, -106, 36, 134, -355, -122, 23, -87, 8, 53, 187, 18, 60, 55, 35, 170, 103, 53, -40, -150, 308, -29, 434, -102, -93, -274, -215, 228, 59, 27, -53, 67, 386, -47, 355, -137, 149, -45, -154, -117, -115, 118, 46, -329, -84, -200, 17, -183, 14, -86]
3942h6K08k39M0J40k06OK24o2J29k18Rk7K56j62j67M05k68m0Qr4M9p4L49N2m05
3967a73J33J70o5j33l2K04k65N9R4O8r2O0l8j7j01K61L2o2L5k33L5l0j1K11N1
3992A61J3n3k37J44N6J3j93K62P6k78R7j7j7om2k42L16j55N7J48j03K34j71kj09
4017d8j03M3l9L45k8k98KJ72J9j54k12O9j22L05ko3o9K21J73k78J03j27o6K93
4041A36q9j5J74j94l39L28p2J21R1k47LL09l80L58l86J62o3J58K27j63l0O3j30
4064B2O1J71o23K17J15p0M5n6p1K66k74L81l39M35k02j51l3j44o3K94K62k2j13
4087A08j71m9O7J99r9j94N9M0nj19L3L04l78K47j8K98k56j28Q7M7L9k05K24J76
4111C06l67L02j60j59Q9Km0l3Qq3K16n4RN8Q3r6j3j0N2k9n8Oq4r9K36k23L66n65
$$ y = [-86, 122, -117, -77, 63, -143, -137, 87, 25, 154, -64, -55, -82, 174, 12, -155, 250, -18, -58, -50, -144, -95, -169, 180, 232, -173, -40, 130, 65, -68, -100, 104, -161, -102, -8, 60, -32, 28, -10, -27, -128, 133, 165, 103, 138, -95, -60, -90, -101, 110, 161, 174, 121, -116, 28, 84, 97, -96, 166, 242, -36, 61, 44, 27, 21, -21, -263, 53, -102, -45, 103, 0, 234, 63, 61, -48, -151, -108, -147, 198, 170, -128, -126, 46, 65, -89, -301, -232, -354, -49, -51, -114, -183, 38, 211, -67, 36, -91, -157, 136, 47, 32, 206, 12, -327, 1, -71, 50, 141, -106, -103, 206, -174, 184, -202, -40, -103, 55, 282, 119, 89, 152, 22, 83, 254, -369, -152, -37, -107, -62, -118, -189, 77, -197, 184, -155, 280, 78, -73, -106, -250, -313, -19, 243, 221, 108, -63, -112, -45, 154, 55, -139, -80, -40, -45, -164, -131, 173, -205, 42, 24, 322, 66, -62, 25, 72, 111, -94, 130, 306, -61, 241, 81, -78, 11, 13, -27, -60, -52, -135, 81, 27, 36, 94, 177, 81, 68, 58, 110, 81, 23, 29, -55, -154, 82, -141, 225, -340]
4139c40L31k37K32l5k8K64k82J95M0O1m03J72J11m1j70K37l66K78J75r9K4j2l1
4162G6l6L4J2j40J14j49K24l89P5O4n9J29O2k4l8N4k51K70Qj42J73J46K8j47R4
4187A88k2j94K90Q2l09j08Kq0j6L91k33J29q9j08N9r5M7QK45L6l9k82M1j17N4
4212a20K31j26m6J25J50R1o9n00K83L6l49L90j05l36L20k25K27j4K0J18J48j04
4234A45j22KQ4K7Q9n16M07mK2l5l68j54K72K26l8J46P9m5j95j59j10K85M8O4j54
4259dmK2o3j8R4K19p9k58N3q8qK94l06K08J41n41L26L2j36K67j00q3J11O2k69
4284a28n3N8R9J35j75K9L11l37j58J50M10k88j18J23o3O6L2j23j44K10j03L8j69
4307a98L49j26J2N0N5m9q5j00J48k49J64Q8J31l00K15k9J59J8j14j08kK9j22K8
$$ y = [-340, -9, -246, -14, -49, -77, 187, -95, 100, 140, 201, -202, -30, 81, 40, -130, 107, -259, 19, 194, 95, 119, 107, 76, 40, 74, 86, -54, 60, -89, 135, -254, -179, -115, -174, -45, 17, -7, -45, 9, -242, 28, 36, -106, 67, 213, 241, 94, 188, 166, -28, 262, 344, 35, -73, -71, -151, -167, 224, -9, 120, 31, -77, -18, -113, -66, -58, 187, 223, 184, -98, -57, -174, -120, 111, -15, -61, 64, 214, 305, 236, -264, 19, 55, -294, 96, -9, -345, -25, -250, -23, -37, -17, 101, 249, 145, 23, 25, 109, 136, 225, -291, 116, 112, 134, 99, -269, -423, -151, 75, 37, 183, 262, 217, 22, -137, -247, 38, 86, 150, -4, -8, 14, -49, -67, 27, 246, 167, -91, -38, -126, -134, 160, -146, 62, 203, -338, -12, 20, -116, 151, 51, -32, 79, 141, -128, -181, -123, -24, 111, -64, -35, 276, -61, -219, -69, 341, 53, -65, 58, -5, 61, 93, -30, -174, 36, -67, -29, -198, 151, 25, 37, 87, 142, 93, 8, -92, 56, -193, -29, 59, 190, -110, 105, 76, 235, 253, 139, 31, 29, 58, -64, -36]
4331c6J95j6J82l75j66K45j7O0M1l21lK4K89r7Q9j75O2j40L7K21J0J01k10j28
4355a28J55j56O0J32j70R1J49J05k93N9m0J32n4o9R0p3j55L45k58J84j91O9R7
4378H1O3j58n9L55l52P0o3M7j37J53K25j05j40K01o0J9k29J66k35R4k27l7M09
4401H1N2m2m01M76l41Q5M3J14J28k20K72J01l47J71j40Q8j06Nj10m8J18P9J74
4424B32m16L96j06k87O2L47j09p6j00j19J12J1J80j61p3L19lm11J01J93k3J93
4446B62m27P5k2J27N4j34J12j91J29P7L0j67L6j92J83J24k2j76K68j2N5l16K45
4469A18l07J36o0K76j09j02K96m47RM08m26L52M5k19p3l0K79n4M2k08J65j37J54
4492A08k35M50n97K77o5J6j86J57l5P0R2k71K62q2n8k01N62m35N16j94jj47J13
$$ y = [-36, 159, 143, 325, -50, -216, 29, 12, 72, 113, -208, -211, -187, 102, 5, 94, -81, -19, -159, -122, 99, 109, 210, 0, -128, 27, -129, -69, 63, -107, -16, 133, 238, -55, 4, -36, 96, 42, -27, 63, -10, -165, 180, -78, 106, -85, -16, 81, 144, -14, -73, 282, -70, 0, -63, -16, -153, 0, 225, 120, -20, 181, 121, 140, -89, 77, -158, -64, -291, -328, 81, 133, 91, -310, 166, -175, -90, -47, 67, 195, -25, 247, 348, 1, 172, 32, 120, 14, 19, -91, -139, -21, 58, 232, -184, 212, 106, -181, -119, 228, 119, 43, -57, -176, -64, -53, 127, -34, -107, 212, 209, -202, -101, 92, 69, 262, -165, -90, -112, 15, 69, -65, 47, -144, -15, 62, 92, -75, -39, -231, -48, 76, 54, -122, 146, 134, 189, -127, 118, -189, -53, -113, 163, 54, -48, 248, -199, -190, 218, -208, 144, 189, -30, -103, -133, 146, 92, 134, -74, 91, -46, 108, -127, 323, -274, 3, -62, -46, -232, -75, -110, -40, 52, -219, 43, -39, -97, -298, 264, -171, 345, 151, 150, 3, 116]
4515A16j71j45L32N8j31k05K55j72Q0jK55P8l60J81j09k15o4L3J62l9K17o4k36
4538a45K21j7j88J33j8R2k33O4K32j87o5k8k7M9J93k42K86Nk72r0J55J74j35Q3
4562D0Q2J15l20K12j01J46k81j37L74O8j13Qq5q8L44p9j53J37k29K51J32k01j38
$$ y = [116, -55, -200, 132, 190, 59, -146, 109, -63, 17, 16, 271, 349, -11, 170, 61, -154, -218, -185, -23, -62, 155, 91, -145, 76, 59, -129, 4, -14, 78, -155, -91, 141, -46, -111, -139, -166, -117, 76, -166, 120, 125, -147, -237, -82, 92, -43, 40, 122, 237, -83, 129, 28, 174, -107, -244, 130, 198, 85, 93, 8, -80, 264, 185, 32, 169, -60, 191, 323, 122, -16]
$$ [...]
8191A5
##END NTUPLES=NMR FID
##END=
