##TITLE=1H_DE-161k_TFA
 200.13Hz, DMSO-d6+CCl4.
 8 sc
 15.7.2026
##JCAMPDX= 6.0         $$ Bruker NMR JCAMP-DX V2.0
##DATA TYPE= NMR FID
##DATA CLASS= NTUPLES
##ORIGIN= UXNMR, Bruker Analytische Messtechnik GmbH
##OWNER= pz
$$ XWIN-NMR		Version 3.5
$$ Wed Jul 15 15:04:39 2026 Russian Standard Time (UT+4h)  she@DPX200
##.OBSERVE FREQUENCY= 200.1313
##.OBSERVE NUCLEUS= ^1H
##.DELAY= (6, 6)
##.ACQUISITION MODE= SIMULTANEOUS
##.ACQUISITION SCHEME= undefined
##.AVERAGES= 8
##.DIGITISER RES= 18
##SPECTROMETER/DATA SYSTEM= spect
##.PULSE SEQUENCE= zg30
##.SOLVENT NAME= DMSO
##.SHIFT REFERENCE= (INTERNAL, DMSO, 0, 14.3821)
##AUDIT TRAIL= $$ (NUMBER, WHEN, WHO, WHERE, WHAT)
$$ ##TITLE= Audit trail, XWIN-NMR		Version 3.5
$$ ##JCAMPDX= 5.01
$$ ##ORIGIN= Bruker BioSpin GmbH
$$ ##OWNER= she
$$ F:/spectra/data/she/nmr/H-C/1/audita.txt
$$ ##AUDIT TRAIL=  $$ (NUMBER, WHEN, WHO, WHERE, WHAT)
(   1,<2026-07-15 15:03:36.25 +0400>,<she>,<DPX200>,
      <created by zg, POWCHK disabled, PULCHK disabled
       configuration hash MD5:
       00 E9 B6 7A A2 85 ED C7 34 08 36 98 17 FE 4E 26
       data hash MD5: 16K
       80 9F F5 AF 5B 45 C4 09 CD 3B 2C 59 85 5D 7F 51>)
$$ ##END=
$$ 
$$ hash MD5
$$ ED C7 4E BF 59 1C 60 7C 3E B3 5D 1C 46 65 E0 88
##$RELAX= 
##$RELAX= 
##$RELAX= 
##$RELAX= 
##$RELAX= 
##$RELAX= 
$$ Bruker specific parameters
$$ --------------------------
##$DU= <F:/spectra>
##$EXPNO= 1
##$NAME= <H-C>
##$PROCNO= 1
##$TYPE= <nmr>
##$USER= <she>
##$AMP= (0..31)
100 100 100 100 100 100 100 100 100 100 100 100 100 100 100 100 100 100 
100 100 100 100 100 100 100 100 100 100 100 100 100 100 
##$AQSEQ= 0
##$AQ_mod= 1
##$AUNM= <au_zg>
##$AUTOPOS= <>
##$BF1= 200.13
##$BF2= 200.13
##$BF3= 200.13
##$BF4= 200.13
##$BF5= 200.13
##$BF6= 200.13
##$BF7= 200.13
##$BF8= 200.13
##$BYTORDA= 1
##$CFDGTYP= 0
##$CFRGTYP= 5
##$CHEMSTR= <none>
##$CNST= (0..31)
1 1 145 1 1 1 1 1 1 1 1 1 1 1 1 1 1 1 1 1 1 1 1 1 1 1 1 1 1 1 1 1 
##$CPDPRG= <>
##$CPDPRG1= <>
##$CPDPRG2= <>
##$CPDPRG3= <>
##$CPDPRG4= <mlev>
##$CPDPRG5= <mlev>
##$CPDPRG6= <mlev>
##$CPDPRG7= <mlev>
##$CPDPRG8= <mlev>
##$CPDPRGB= <>
##$CPDPRGT= <>
##$D= (0..31)
0 0.7 0 0 0 0 0 0 0 0 0 0.03 0 0 0 0 0 0 0 0 0 0 0 0 0 0 0 0 0 0 0 0 
##$DATE= 1784113415
##$DBL= (0..7)
120 120 120 120 120 120 120 120 
##$DBP= (0..7)
150 150 150 150 150 150 150 150 
##$DBP07= 0
##$DBPNAM0= <>
##$DBPNAM1= <>
##$DBPNAM2= <>
##$DBPNAM3= <>
##$DBPNAM4= <>
##$DBPNAM5= <>
##$DBPNAM6= <>
##$DBPNAM7= <>
##$DBPOAL= (0..7)
0.5 0.5 0.5 0.5 0.5 0.5 0.5 0.5 
##$DBPOFFS= (0..7)
0 0 0 0 0 0 0 0 
##$DE= 6
##$DECBNUC= <off>
##$DECIM= 32
##$DECNUC= <off>
##$DECSTAT= 4
##$DIGMOD= 1
##$DIGTYP= 9
##$DL= (0..7)
0 120 120 120 120 120 120 120 
##$DP= (0..7)
150 150 150 150 150 150 150 150 
##$DP07= 0
##$DPNAME0= <>
##$DPNAME1= <>
##$DPNAME2= <>
##$DPNAME3= <>
##$DPNAME4= <>
##$DPNAME5= <>
##$DPNAME6= <>
##$DPNAME7= <>
##$DPOAL= (0..7)
0.5 0.5 0.5 0.5 0.5 0.5 0.5 0.5 
##$DPOFFS= (0..7)
0 0 0 0 0 0 0 0 
##$DQDMODE= 0
##$DR= 18
##$DS= 0
##$DSLIST= <SSSSSSSSSSSSSSS>
$$ [...]
##$SUBNAM0= <"">
##$SUBNAM1= <"">
##$SUBNAM2= <"">
##$SUBNAM3= <"">
##$SUBNAM4= <"">
##$SUBNAM5= <"">
##$SUBNAM6= <"">
##$SUBNAM7= <"">
##$SUBNAM8= <"">
##$SUBNAM9= <"">
##$SW= 18.0517328524113
##$SWIBOX= (0..15)
0 0 2 0 0 0 0 0 0 0 0 0 0 0 0 0 
##$SW_h= 3612.71676300578
##$TD= 16384
##$TD0= 1
##$TE= 0
##$TE2= 300
##$TE3= 300
##$TEG= 300
##$TL= (0..7)
0 120 120 120 120 120 120 120 
##$TP= (0..7)
150 150 150 150 150 150 150 150 
##$TP07= 0
##$TPNAME0= <>
##$TPNAME1= <>
##$TPNAME2= <>
##$TPNAME3= <>
##$TPNAME4= <>
##$TPNAME5= <>
##$TPNAME6= <>
##$TPNAME7= <>
##$TPOAL= (0..7)
0.5 0.5 0.5 0.5 0.5 0.5 0.5 0.5 
##$TPOFFS= (0..7)
0 0 0 0 0 0 0 0 
##$TUNHIN= 0
##$TUNHOUT= 0
##$TUNXOUT= 0
##$USERA1= <user>
##$USERA2= <user>
##$USERA3= <user>
##$USERA4= <user>
##$USERA5= <user>
##$V9= 5
##$VALIST= <valist>
##$VCLIST= <CCCCCCCCCCCCCCC>
##$VD= 0
##$VDLIST= <DDDDDDDDDDDDDDD>
##$VPLIST= <PPPPPPPPPPPPPPP>
##$VTLIST= <TTTTTTTTTTTTTTT>
##$WBST= 1024
##$WBSW= 4
##$XGAIN= (0..3)
0 0 0 0 
##$XL= 0
##$YL= 0
##$YMAX_a= 286610
##$YMIN_a= -316334
##$ZGOPTNS= <>
##$ZL1= 120
##$ZL2= 120
##$ZL3= 120
##$ZL4= 120
##$ABSF1= 10
##$ABSF2= 0
##$ABSG= 5
##$ABSL= 3
##$ALPHA= 0
##$AQORDER= 0
##$ASSFAC= 0
##$ASSFACI= 0
##$ASSFACX= 0
##$ASSWID= 0
##$AUNMP= <proc_1d>
##$AZFE= 0.1
##$AZFW= 0.1
##$BCFW= 1
##$BC_mod= 2
##$BYTORDP= 1
##$COROFFS= 0
##$CY= -3
##$DATMOD= 1
##$DC= 2
##$DFILT= <>
##$DTYPP= 0
##$F1P= 0
##$F2P= 0
##$FCOR= 0.5
##$FTSIZE= 0
##$FT_mod= 4
##$GAMMA= 1
##$GB= 0.15
##$INTBC= 1
##$INTSCL= 1
##$ISEN= 128
##$LB= 0.25
##$LEV0= 0
##$LPBIN= 0
##$MAXI= 10000
##$MC2= 0
##$MEAN= 0
##$ME_mod= 0
##$MI= 1.114404
##$NCOEF= 0
##$NC_proc= 0
##$NLEV= 6
##$NOISF1= 3.799351
##$NOISF2= 2.8
##$NSP= 1
##$NTH_PI= 0
##$NZP= 0
##$OFFSET= 14.38212
##$PC= 1
##$PHC0= -4220.915
##$PHC1= 11.5923
##$PH_mod= 1
##$PKNL= yes
##$PPARMOD= 0
##$PSCAL= 0
##$PSIGN= 0
##$REVERSE= no
##$SF= 200.129724274929
##$SI= 16384
##$SIGF1= 3
##$SIGF2= 2
##$SINO= 400
##$SIOLD= 16384
##$SREGLST= <1H.CDCl3>
##$SSB= 0
##$STSI= 0
##$STSR= 0
##$SW_p= 3205.1282051282
##$SYMM= 0
##$S_DEV= 0
##$TDeff= 0
##$TDoff= 0
##$TI= <>
##$TILT= no
##$TM1= 0
##$TM2= 0
##$TOPLEV= 0
##$USERP1= <user>
##$USERP2= <user>
##$USERP3= <user>
##$USERP4= <user>
##$USERP5= <user>
##$WDW= 1
##$XDIM= 8192
##$YMAX_p= 0
##$YMIN_p= 0
$$ End of Bruker specific parameters
$$ ---------------------------------
##NTUPLES= NMR FID
##VAR_NAME=  TIME,          FID/REAL,        FID/IMAG
##SYMBOL=    X,             R,               I
##VAR_TYPE=  INDEPENDENT,   DEPENDENT,       DEPENDENT
##VAR_FORM=  AFFN,          ASDF,            ASDF
##VAR_DIM=   8192,          8192,            8192
##UNITS=     SECONDS,       ARBITRARY UNITS, ARBITRARY UNITS
##FACTOR=    0.0002768,     1,               1
##FIRST=     0,             0,               0
##LAST=      2.2672688,     0,               0
##MIN=       0,             -316334,         0
##MAX=       2.2672688,     286610,          0
$$ Real data points
##PAGE= N=1
##DATA TABLE= (X++(R..R)), XYDATA
0@%%%%%%%%%%%%%%%qJ6j6J6j6K3l1L2m0M8n6O6p4Q8j00J13j30J48j70J91k15K45
37A30k75L08l43L81m25M73n24N79o42P10p83Q63r49J047j155J271j400J544j707
56h97J892k100K340k619K948l345L829m441N249o366Q028j0818J6810n5044k4763
71f9297j59752q7285K47176R9752R523J24122J2373j83076o6956k2403j31490
82b27313K0150K33872Q2679K5470J47415k2604j90294n4528p8341j68271m33J15341
94a16857O3191J07507J22576k3848r3570l6999r7696j43960L4354J30133M7881
105g288Q9859J14485p2l0448o4747j50339p9152M808j4697M9818J29799N8261
117A00287k1443j1383n5061j29144m3764L9549r976P0856J64930K7950j0638O9373
$$ plain form
0 0 0 0 0 0 0 0 0 0 0 0 0 0 0 0 0 -8 8 -8 8 -8 15 -16 16 -24 24 -32 34 -40 48 -52 61 -69 79 -91 100 -115 130
37 130 -145 163 -180 201 -224 249 -275 304 -338 372 -411 452 -497 550 -605 666 -734 810 -897
56 -897 995 -1105 1235 -1384 1564 -1781 2048 -2393 2856 -3510 4518 -6300 10510 -44534 -69297
71 -69297 -229049 -316334 -69158 30594 40117 164239 176612 -6464 -73420 -95823 -227313
82 -227313 -207163 26709 109388 134858 282273 259669 69375 14847 -63494 -231765 -232198 -116857
94 -116857 -53666 53841 176417 152569 58999 22000 -75696 -219656 -185302 -55169 -7288
105 -7288 82571 197056 196984 166536 101789 -48550 -127702 -122894 -137591 -87773 42026 100287
117 100287 78844 67461 12400 -116744 -160508 -120959 -130935 -60079 104851 132801 122163 191536
129A91536p5890j73345k7057J1527m2444O0207J33877K9761j1414L2189q0013
140D8934j60064j9441L162o6653Q2382J57100K9402M1175O8614p9664j23600k4744
152d3397l0155o1539N0317J19940L2190K3055N6474p0549j18789j7458m6699o9640
164a76250O1160R9844M5443N4009M0409l2354o4155m2350m4752m0656M1896Q0167
176B2411L3335M0537K9876n0636o2156n5925p5245j6516M0388M2146O3481O2592
188G4288K1879j5884m5785n8522n6042j9019L1135L7544O3819P9370M325k8024
200H9084k0316q1568q0102o999r98J4721P3258O8940J8369j704r186n6583p7531
213g0615r357J4735L633P1264P3761l999P637J171p7312o8315j3315r439L597
$$ plain form
129 191536 115646 -57699 -84756 -73229 -115673 -55466 78411 108172 96758 128947 48934
140 48934 -111130 -130571 -127409 -194062 -111680 45420 74822 115997 184611 104947 -18653 -43397
152 -43397 -73552 -135091 -84774 35166 67356 90411 146885 76336 -42453 -59911 -106610 -176250
164 -176250 -115090 -15246 30197 84206 124615 92261 28106 -14244 -58996 -99652 -57756 22411
176 22411 55746 96283 126159 75523 13367 -42558 -117803 -134319 -93931 -51785 11696 74288
188 74288 96167 80283 34498 -24024 -80066 -99085 -67950 -30406 33413 112783 117108 89084
200 89084 68768 -12800 -92902 -99901 -100899 -86178 -12920 56020 74389 72685 63499 6916 -70615
213 -70615 -79972 -65237 -61604 9660 83421 79422 87059 88230 10918 -57397 -70712 -80151 -76554
226g6554N1817O2677J7370M871N305o3768p1936N525j136m424O7603O2944J9393
239G9687J8886j4520n9279n3459k7560j9276p860M5589O7689K2744J4500L430
251G0571n5730m8924k2013l2096Q155N1615M5787M1313K4116l985k5708m6649
263F452m1129k8916q896L4550M0166K7233L1179n734l2478k6183m5773k8685J8254
276e9960K1773L1218M6408K5882K835k0319l5992l4999l2661j479K5028K5298
288f968M5131L0476j7440j6269k6073n4474k6050K496J3663L7988M1577L1815
300E5872J4071j1774k5107m5558m0809M82Q679J9235M8211K6953N066Q47l2593
313B3575m2086k7066j7397O807K0404K8128M0633J9557k849j5802l9040k4468
$$ plain form
226 -76554 -24737 37940 55310 60181 65486 1718 -70218 -64693 -65829 -70253 -2650 60294 79687
239 79687 98573 84053 24774 -28685 -56245 -75521 -83381 -37792 29897 52641 67141 70571
251 70571 14841 -34083 -56096 -88192 -80037 -28422 17365 58678 82794 78809 53101 6452
263 6452 -34677 -63593 -72489 -37939 2227 29460 60639 54905 22427 -3756 -49529 -78214 -59960
276 -59960 -38187 -6969 39439 65321 68156 47837 11845 -23154 -55815 -57294 -32266 -6968
288 -6968 38163 68639 51199 34930 8857 -45617 -71667 -69171 -55508 -17520 24057 55872
300 55872 69943 58169 33062 -12496 -53305 -52823 -44144 -24909 23302 50255 55321 56168 23575
313 23575 -18511 -45577 -62974 -56167 -35763 -7635 32998 52555 49706 33904 -5136 -29604
325b9604m842o908J9606L4523K2970J8755r019k8923k0792k8504k2042K025J3714
338c9041L5030L3368J0767N135j6658l4043k0351k0829m788K7118K8087K9820
350C3615K2464k695j1403k7158l7872j9765j2915P283L5349K4300K1430J8998
362E1631j3112k4152k3538k7738p297Q096K0761L0743J6951J2311K240k7533k2256
375b893j6745k5936M901K3279J4657K1900J3195n330j4074k5532j8091p071N95
388c7145K5974K3967R175J9968J865k2123j9874k4765j4349O847R496K2563K4617
401B6216R212M396j7204l3223j6107j2307m834J5800J9189K5379K1285J713m948
414C4567k3150k7830o231j2504l064L1376K1749R599J2614q589k1851j6690j2374
$$ plain form
325 -29604 -34446 -41354 -21748 12775 35745 54500 45481 16558 -4234 -32738 -54780 -52755 -39041
338 -39041 -4011 29357 40124 45259 28601 -5442 -25793 -46622 -51410 -24292 3795 33615
350 33615 56079 53384 41981 14823 -23049 -42814 -55729 -48446 -13097 11203 32633 51631
362 51631 38519 14367 -9171 -36909 -44206 -36110 -15349 15394 32345 44656 46896 19363 -2893
375 -2893 -19638 -45574 -40673 -17394 -2737 19163 32358 27028 12954 -12578 -30669 -37740 -37145
388 -37145 -11171 12796 21971 41939 43804 21681 1807 -22958 -37307 -30460 -20964 1599 26216
401 26216 35428 39824 22620 -10603 -26710 -39017 -43851 -28051 -8862 16517 37802 39515 34567
414 34567 11417 -16413 -22644 -35148 -38212 -6836 14913 24512 37126 28537 6686 -10004 -22378
427b2378q647m068J9328K9065M333Q508J0517k3591j8604l496j8774J302K4801
440a704J3660R153P288k275j6139k2977p175p870r296K2258K2016K504J5901L594
454B8938k0175j3499j5722j3106N533J2741K1046J7728L814M911q959k1876j3766
467a2392j4552m377J2813J0536J8756J5883k388l28j3760k7403m741j86q58J9312
481c685J5970N346Q109K2j3774k1843r717N708p995M057K8636M440j581J0377
495B4070j8680k3025J441k589l717J2471J9335J0426j397L875o180k4306l867
508a2143J339j5081J2624K5787K181O426L842j7460j5107p371o136m561N086K2389
522A815J1000j036R879l798j8818n638j0719p095J3849R360R910J2826k454n578
$$ plain form
427 -22378 -31025 -35093 -15765 13300 17633 26141 36658 13067 -5537 -9033 -27807 -26505 -1704
440 -1704 11956 21109 28397 26122 9983 -12994 -20169 -28039 -37335 -15077 6939 9443 25344 28938
454 28938 8763 -4736 -20458 -33564 -28031 -15290 5756 23484 27298 32209 23250 1374 -12392
467 -12392 -26944 -31321 -18508 -7972 10784 26667 24279 23951 10191 -17212 -21953 -22139 -22997 -3685
481 -3685 12285 17631 25740 25762 11988 -9855 -19572 -13864 -21859 -17802 10834 15274 13693 24070
495 24070 5390 -17635 -16194 -18783 -22500 -10029 9306 19732 18335 22210 16030 -8276 -12143
508 -12143 -10804 -25885 -13261 12526 14707 21133 24975 7515 -7592 -14963 -21099 -25660 -20574 1815
522 1815 12815 11779 21658 17860 -958 -6596 -17315 -24410 -10561 -1201 8709 21535 19081 13503
536A3503q843j4755n594m287K742J4716P448P290N733n809k910j0875j8152M209
550a5584P404J933J7182R050l535J02p845j4092j0149k094O073r14Q568K0139
564A6238l232n101O994j8756j8361Q777J813M5J4328J1860K320k684m55j0255
578C531j8646L996N704j3318J2597K1534p422N00N509j6940j1673K301oq18J0688
593b463J6507o0n256P332j1116j6262Q225m537j1687J8310J3387l562M159m74
607A2503j2091j0369k852M0k770J0178J5478j948K613O683j2899o274k70j3663
621a5641K725J2845J242P059O863n361n847o185o592p164J035J2519J882P32J3585
636A3697l422q728N736j1452j2116J1626K002j361J3962M611o896l486j264j0824
$$ plain form
536 13503 4660 -10095 -15689 -19976 -17234 -2518 4930 12220 17953 12144 9234 -1641 -19793 -15584
550 -15584 -8180 -6247 10935 19985 16450 16552 8707 -5385 -15534 -17628 -11555 -12469 -3901 16238
564 16238 13006 7905 14899 -3857 -22218 -13441 -11628 -11583 2745 14605 16925 14241 13786 3531
578 3531 -15115 -11119 -5415 -18733 -6136 15398 7976 8476 13985 -2955 -14628 -12327 -12333 -13151 -2463
593 -2463 14044 13984 8728 16060 4944 -11318 -3093 -7630 -19317 -1007 12380 8818 12977 12503
607 12503 412 -9957 -12809 -12769 -15539 -5361 10117 8169 10782 17465 4566 -1708 -1978 -15641
621 -15641 -12916 -71 1171 8230 15093 9732 3885 -2300 -8892 -16056 -15021 -2502 -620 112 13697
636 13697 10275 1547 7283 -4169 -16285 -4659 -2657 -4018 9944 14555 7659 4173 2909 -7915
650g915j0403J1341O202j0778J3551J4525j2736J266M805j9205l730J0351m487
663g213J995J4451N753o627j436J858j5149p669J2801o008o476K0572L014q431
677A435R851l986j4494J154J441n259L928J2490N372n917J235J09j3234J050K185
692b640j1664P459J1989n299N390O452j0120n102k76m906j492N894Q972J608j94
707F071M545p022n381M158j1430n061J3332r60p17J1645j662n955J064n889p070
722a0332J752P234K824j384Q862K100r795M447j230j5202M581O384o775P036Q238
737H740l953j132r42n754o181J694P245k659R87J2229l157l883N283r414p207
752h104O492m007j838R298K843q0j09k561m400n831K944J908n018Q294P338m501
$$ plain form
650 -7915 -18318 -6977 -775 -11553 1998 16523 3787 5053 9858 -9347 -13077 -2726 -7213
663 -7213 -5218 9233 14986 8359 6923 8781 -6368 -14037 -1236 -7244 -13720 6852 9866 1435
677 1435 11286 7300 -7194 -6040 -4599 -9858 -5930 6560 11932 6015 7250 7359 -5875 -4825 -2640
692 -2640 -14304 -6845 5144 -155 5235 11687 1567 -3535 -3811 -8717 -10209 -4315 4657 6265 6071
707 6071 10616 3594 -1787 2371 -9059 -14120 -788 -1748 -2465 9180 7518 1563 2627 -3262 -10332
722 -10332 -8580 -1346 1478 94 8956 11056 1261 5708 4478 -10724 -6143 241 -6534 502 8740
737 8740 4787 3655 2713 -3041 -9222 -7528 -283 -2942 -1955 10274 7117 3234 8517 -897 -8104
752 -8104 -1612 -5619 -7457 1841 4684 4604 4495 1934 -2466 -8297 -5353 -3445 -8463 -169 7169 2668
768B668M253O86q928J172j005n550L364L589L083K523k016j696l710l733K174
783c126m838L26R951j459L25P099m442k976J546o051j868K866K798M743Pp5P23
800E549o493m35j463o860N269M155k733N629K980k179J740m150m753J49M4M201
816F50J816j172M995k235m656J576n001k630M333k131P05M940l06K697q76n254
832b549j90j660J173N171j180K349M453l732q40j536n156J340q21k241M042K103
848G26K890K522n109j428q17m241K546R38n38O698M93j291K269l470j733J07n521
865d959R30J394N20N694q79l088K179l015k088J972k704L132L422j713J892n2
881B637j535J968l998k957K830j058K682K973l117J009q08m487P55q77l07M490
$$ plain form
768 2668 6921 7607 -1321 -149 -1154 -6704 -3340 249 3332 5855 3839 2143 -1567 -5300 -3126
783 -3126 -7964 -7638 2313 854 1179 8278 3836 860 2406 -3645 -5513 -2647 151 4894 4901 4826 5549
800 5549 -944 -1379 -2842 -9702 -4433 -278 -3011 2618 5598 3419 5159 1009 -3744 -3595 -3551 650
816 650 2466 1294 6289 4054 -602 974 -4027 -6657 -2324 -4455 -3750 1190 884 3581 2705 -2549
832 -2549 -2739 -4399 -3226 1945 765 3114 7567 3835 2995 1459 -3697 -2357 -3178 -5419 -1377 726
848 726 3616 6138 1029 -399 -1216 -5457 -2911 -1973 -2511 4187 4680 3389 5658 2188 455 562 -4959
865 -4959 -4029 -2635 -2115 3579 2700 -388 1791 -1224 -3312 -1340 -4044 -912 2510 797 2689 2637
881 2637 1102 3070 -928 -3885 -1055 -2113 569 3542 425 1434 626 -3861 -3106 -3983 -4290 200
897B00j54J457K252k410K290j142n876P94k4m92N415o38L7L505k994k676j046
914a502k811K054N48j546M195M43J081L330m806j244J305m335J989K064j812L206
930B159R65k318J1k542J72J502k790J489Q03l41M803j946m046L241k037k945L815
947ep69R97L192j624j020j163j116J176k847o07L479j752L000L939m911R72J100
964B041n018M95P56p69L429J560o21K45j012J425j780m171K314l74j290M905j076
981A059j339M628l286k961J902j976J204J886q02R43j024N83J986m031m99J840
997A13k993K594J805l149L444J202m913M06O1p90K254l97O94N49K03K352k397
1014A038l104K760k235j679L323j673J208M206l066j345R30k471R84Q31j125P08
$$ plain form
897 200 46 1503 3755 1345 3635 2493 -3383 -2589 -2613 -3105 2310 1672 1709 5214 2220 -456 -1502
914 -1502 -4313 -2259 -1711 -3257 938 1381 2462 5792 986 -258 1047 -3288 -1299 765 -1047 2159
930 2159 3124 806 817 -1725 -1553 -51 -2841 -1352 -549 -890 3913 1967 -2079 1162 -875 -3820 -5
947 -5 -774 223 3415 1791 771 -392 -1508 -332 -3179 -3786 -307 -2059 941 4880 -31 941 2041
964 2041 -2977 -2482 -1726 -2495 934 2494 1873 2118 1106 2531 751 -3420 -1106 -1480 -2770 2135 1059
981 1059 -280 4348 1062 -1899 3 -1973 -769 1117 315 1258 234 817 2803 -1228 -1727 113
997 113 -2880 -286 1519 -1630 1814 3016 -1897 -1491 -1430 -2220 34 -363 331 880 1083 3435 1038
1014 1038 -2066 694 -1541 -3220 103 -1570 -362 3844 778 -567 363 -2108 -1124 -293 -1418 -710
1030g10J6K193J148l706K626Q61n243K010N54j540M513n0l584K152j367q94J433
1047D12j241K98L75J79K851k476m43L422m545j418K822k717J688M029k648k38
1063C50Q28j229N72j943m29J055j101K339L70k184M118K08m946J833m90k237L785
1080H99n3j479J443q44Q41l81j437J431j300r53K747k016J016L275l341m62J169
1097E55k609K397J476k458J320M54l57P66k693O30J040k024J143L09p46L763j231
1114A735k584K306k477j269K972j543j80J902p66J036n82j084J580j658r56P58
1130h10k230K675L180l528R46P64k509J572K9j411J233K2N16L25j680K719m71
1147A342l236J934k87j901L830m61j997J614j130k70M59j210R21N86k01J830k498
$$ plain form
1030 -710 -694 1499 2647 -1059 1567 2428 -2815 -805 -251 -1791 2722 2672 -912 1240 -127 -1021 412
1047 412 -829 -531 -156 23 2874 398 -45 3377 -1168 -2586 236 -2481 -793 3236 588 350
1063 350 1178 -51 521 -1422 -1851 -796 -1897 442 812 -1372 2746 2954 -1992 -159 -649 -2886 899
1080 899 846 -633 810 -34 807 426 -1011 420 -880 -1833 914 -1102 -86 3189 -152 -614 555
1097 555 -2054 343 1819 -639 681 1135 778 1544 -1149 -519 521 -1503 -360 -51 -797 2966 1735
1114 1735 -849 1457 -1020 -2289 683 -860 -1040 862 96 1132 550 -534 1046 -612 -1568 -810
1130 -810 -3040 -365 2815 -713 233 997 -1512 60 89 -1322 -89 -67 449 774 -906 1813 1342
1147 1342 -1894 40 -247 -2148 1682 1221 -776 838 -292 -562 -103 -1313 -392 194 -7 1823 -675
1164f75M21L832l403j157J556k033Q05K235j563P86K70q26M84j803L83J330k272
1181a630J176N47k145L667O00k942J094o20j424K156p54K7O17p40J185j096j376
1198a658K675o36j462J385j490N12K869k597k73J268j897R45P70j032J791l43
1214H27k5j08k319J447J451k679J227l7j561L106j07j669J664j048r81N68j050
1231a294J256L97j83J003j314l12K832j904j540J524j632K46J701j615P97R59
1247I21j465Q61j050k00J822p53q3M02k064J980Q87k419J405n71r81K475r88n94
1265d15J857j622j13l64j188J684N81j001J252r67N19J793k411L53Q42k193J045
1282c48P75j359J737M26q73N82j338J15R92j332O28m80j043K908q28j260K362
$$ plain form
1164 -675 -254 3578 175 -982 574 -1459 -654 1581 18 804 1074 248 732 -1071 -688 642 -1630
1181 -1630 -454 93 -2052 1615 2215 -727 367 -253 -1677 479 -275 -248 369 -371 814 -282 -1658
1198 -1658 1017 381 -1081 304 -1186 -674 2195 -402 -675 593 -1304 -359 411 -621 1170 827
1214 827 802 694 -1625 -178 1273 -1406 -179 -216 -1777 1329 1222 -447 1217 169 -812 -244 -1294
1231 -1294 -38 359 176 1179 -135 -447 2385 481 -1059 465 -1167 -921 780 -835 -38 921
1247 921 -544 317 -733 -933 889 136 53 455 -1609 371 1258 -1161 244 -327 -1308 1167 179 -415
1265 -415 1442 -180 -293 -657 -1845 -161 420 -581 671 -296 223 2016 -395 -42 800 -1393 -348
1282 -348 427 -932 805 1231 358 940 -398 -283 709 -623 5 -475 -1518 1390 562 -698 1664
1299A664j162j041J438j210j01J499o22m63n67m60J838j107LJ178k002R38J181
1316A004k164J184Q00j902J267o21r33J943M0j40j46j240J260K53j840J326k73
1333a82r68J888o30n67J532j036k94M34j163P65M98l27O52q50o4J287r28j73P90
1352F64j365R24J83j746J902K7o64M94j268L35J086m58k0K32r93J566m40j252
1370g93J389n68o88J080j179L60J304q81L27m27j212J600m42n60J026q33K26R11
1388F40j306O70N80j005O96p62n94J820m08l56K18p00K85P59j057O96K35r20R73
1407D64p52j45J063m85k85M94j356J042R03q75O47n07r89J743j127k70R56p65
1425b44N69K07j159R89M78r57M90j095j98J443j007K52J016j420Q06J81j171J392
$$ plain form
1299 1664 502 -539 899 -311 -412 1087 465 2 -565 -1025 813 -294 -291 887 -1115 -177 1004
1316 1004 -1160 24 824 -1078 189 -432 -1365 578 618 478 332 -908 352 605 -1235 91 -182
1333 -182 -1150 738 108 -459 1073 37 -257 177 -986 -221 277 -50 602 -248 -312 975 47 -126 664
1352 664 -701 223 406 -1340 562 589 -75 419 -849 -514 572 114 94 326 -667 899 459 -793
1370 -793 596 28 -660 420 -759 -399 905 24 351 -76 -1288 312 -130 -690 336 -497 -271 640
1388 640 -666 4 584 -421 275 -487 -1081 739 331 -25 193 -507 -222 537 -520 176 411 -509 464
1407 464 -288 -433 630 145 -140 354 -1002 40 943 68 715 208 -781 962 -165 -435 521 -244
1425 -244 325 532 -627 362 840 -117 373 -722 -920 523 -484 -232 784 -636 170 351 -820 572
1443E72l6p57N08q20l06J627r34O45m45j146J605m9j321J244m70l95J190j160
1461d48J02N81l2J95m68p03J328R1p38O00r56k4J042j001N49L88n72N48l97m98
1481d13J003m85j77O37j379M69J257p88K25k1n18N69q34m47J255o35L77M11j384
1500h78P02M09m67J39j66l24R58m02j57M54n74N97J34j159P77M26n74N51q07k75
1520f36P30Q9j51j6j142J326L22j142J439k27r66J057r20m47J406o39k15K89r26
1539g69J244p0n45N99j140K91R60j051L26P31q65O66K4j047R82L6k18L64j066
1558e48L11J033j168L72O9m89M90j96o78J432n30l93R63j448K85Q57l7Q0j75o97
1578d67Q04r4j86K46p34O38N6j182R06M64q49N61k33m33Q84l3l86J66k52N67q6
$$ plain form
1443 572 536 -221 287 -533 -839 788 -146 499 54 -1092 513 464 -857 387 -83 -478 712 -448
1461 -448 -346 235 203 398 -70 -773 555 646 -92 508 -448 -472 570 -431 118 506 -66 482 85 -413
1481 -413 590 105 -72 565 -814 -345 912 124 349 328 -190 379 -455 -902 353 -282 95 506 -878
1500 -878 -176 233 -234 -95 -261 -585 373 -29 -186 268 -306 291 425 -734 43 469 -105 446 -361 -636
1520 -636 94 183 32 16 -1126 200 522 -620 819 592 -374 683 -237 -684 722 83 -132 157 -769
1539 -769 475 405 -140 459 -681 -390 570 -481 -155 576 -289 377 401 -646 336 372 154 518 -548
1558 -548 -237 796 -372 0 69 -420 70 -126 -804 628 98 -295 668 -780 -495 362 325 405 230 -467
1578 -467 337 243 57 303 -431 207 263 -919 -13 451 -398 163 -70 -503 381 348 -38 128 -124 443 357
1599C57r01J026l64l64P21n46k96Q87o48l4L82j171Q25O3J98J16k99N7N95p76
1619a72j84R58n20K53j88p85R62n0q65P76j72n81P16l27K57k63J9K45k2l97O16
1640B76k31J0O29r53j08O27n96L35M74r89J91O99o03J6J9M89k22n46R16m9p08
1661c24J016q8j186R30O5n71O26m18J05J59l12J17m60J36Q16j265q8J164m88q5
1681a51Q15r17J46K49j07j84J53K46K21o09k64P08p93N12L60r75N80Qp8K40l82
1702b22n0M87n8k75K20l88O28o9p22P03j20k09L01m62q6L42q0J00K66o56M70J25
1724B45r2k1m2J11M7p37M63J22m02N01P0q96O33j24k46O08l19l70O53j93m07L16
1746h0k30N62k64K9K55k47r9M69p05J41N83q37L05J90k38M96m56j05L72j76r1
$$ plain form
1599 357 -544 482 118 -246 475 -71 -367 520 -128 -162 220 -951 -126 -63 135 251 -48 9 604 -172
1619 -172 -356 602 82 335 147 -638 324 274 -591 185 13 -568 148 -179 78 -185 -166 79 57 -340 276
1640 276 45 55 684 -269 -377 250 -346 -11 463 -526 -335 364 -239 -223 -204 285 63 -483 433 384 -324
1661 -324 692 604 -582 348 413 -158 468 50 155 314 2 119 -341 -205 611 -654 -742 422 -66 -151
1681 -151 664 -253 -107 142 35 -149 4 250 471 -138 -402 306 -487 25 385 -590 -10 -2 -80 160 -222
1702 -222 -272 215 157 -118 102 -286 342 273 -449 254 134 -75 226 -236 -322 20 -60 40 306 -350 120 245
1724 245 153 132 90 201 248 -489 -26 96 -306 195 265 -631 2 -122 -368 240 -79 -449 204 11 -396 -80
1746 -80 -310 252 -12 17 272 25 -74 395 -310 -169 414 -423 -118 72 -166 330 -126 -231 141 -35 -126
1767a26N56n29J49L90l61K37o49N15k84J19L16l94j65N15o6p11K90J87J19J87
1787B95k42m45N11m61K14L64k56J67R2n44K79j2p1J69l58J60K27n9J67J62n63
1808b04J9K41j99R6J47r3J23j08J13K4m49L89O3l04K96l11J9M22l03k29L22j16
1830d2j39J66j58M38K8l15K8j95L94L5j18l9q4k62L84j78k72K00K61j95M4j11
1852a30L55Q6n56%j19M72K94k03k59J89k73P3O9j49J56J78k68P5Mk14N71n13j17
1875b79M51l53J74Lq0N2J74j66K9J47k25K97l99r5O9M44k73M36m15Q5J10j73P9
1898I2kn1K39j58j69K10k69L4K13l19N2J8J0M06o01N63k20p6j8j02Oq3L62k23
1922h6R8m7j56N67l61l03K35j06L11n3l68K95j18Q3J75m20J20K45M2k55K97j60
$$ plain form
1767 -126 430 -99 50 440 79 316 -333 182 -102 17 333 -61 -226 289 223 -488 -198 -11 108 295
1787 295 53 -392 119 -342 -128 236 -20 147 239 -305 -26 -38 -109 60 -298 -138 89 30 197 359 -204
1808 -204 -185 56 -143 -47 100 7 130 22 135 159 -290 99 162 -142 154 -157 -138 284 -19 -248 74 -42
1830 -42 -181 -15 -173 265 293 -22 6 -189 205 240 122 83 -1 -263 121 -57 -329 -129 132 -63 -19 -130
1852 -130 225 311 -245 -245 -364 108 402 199 -60 129 -144 -71 -2 -151 5 183 -85 -10 -6 -220 351 -162 -279
1875 -279 172 -181 -7 -4 -84 -32 142 -24 5 152 -73 224 -175 -270 -201 243 -30 406 -9 76 186 13 92
1898 92 90 39 278 120 -49 161 -108 -74 139 -180 -128 -110 -100 306 -295 268 48 -28 -46 -148 -142 -225 137 -86
1922 -86 12 -35 -191 376 15 -288 -53 -159 152 99 -269 26 -92 -9 166 -254 -134 111 153 -102 195 35
1944C5K42n17J66M7M8j55N37n32K3J29l74K80j28P2K81k26j14J25o8N62l33j20
1966b0J04j00j47L59k11k68O96j74p37N97m39L08K08o5l88L26J9J47Q3m19K09
1987H8j30J17o8O4k8J14j65J78M2k19J95j63K2j10k20K21J87j1N7j13k31K41l2
2010C6k00J44j01J44K68m55k7N05k73o6j97R1K26j12J62P2m89M20k22j09L59J5
2032A91j93l7K2M0j46J50r8K34j67j41J18j60L00R9j01Nq1Q6j5j45L10j21J94
2055C44j89q6P3l7l73J66J64j8j44K78l21K08J6O7j94O3j40K58r4k75K49j71Q7
2078f9R1m3j12k69L94J61N6j64J26k82M3J26k78K40J42n83O38j16l50L28m2l15
2100b78O6k12L51L17m47N8N38k76j81K6l6L40l17J65o6pj66K10J6m3M2l58M37
$$ plain form
1944 35 277 -240 -74 -27 21 -134 403 -129 -106 23 -351 -71 -199 -127 154 -72 -186 -61 -129 433 100 -20
1966 -20 84 -16 -163 196 -15 -283 413 239 -498 99 -340 -32 176 111 -277 49 68 215 298 -121 88
1987 88 -42 75 7 71 43 157 -8 170 212 -7 188 25 47 -63 -283 -62 125 114 171 58 -173 68 36
2010 36 -164 -20 -121 23 291 -164 -191 314 41 -25 -222 -131 95 -17 145 217 -272 148 -74 -183 176 191
2032 191 -2 -39 -17 23 -123 27 -71 163 -4 -145 -27 -187 113 212 111 116 35 121 106 -39 271 150 344
2055 344 155 69 142 105 -268 -102 62 44 -100 178 -143 65 81 148 -46 17 -123 135 41 -234 15 -156 -69
2078 -69 22 -21 -133 -402 -8 153 209 45 171 -111 -68 58 -220 20 162 -421 217 101 -249 79 37 -278
2100 -278 -212 -424 -73 244 -203 -145 393 117 -64 -38 -74 266 -51 114 48 41 -125 85 101 58 100 -258 179
2123A79k49K58j64q4O8n1K2Q3j83M1j29K71j15r5M42m66m3K62j78L31k63O8Rl56
2147c42L70l7k1J3p2j2L78m76J80J47l73L00on1O9j62j26L26j60K10j71l0J72
2170A26q4r7J92j23j15n6L95j85l1M01o19J42K14j11mL4K0m40N69j90J38j03m2
2193C1k16K12J40j92p0K00k06K07j35M4m9J0o2p9j02L06N6q2N8j54N0n6j48K83
2217D6J17l07K65k22q2J74J20J70k3m89J12L58j75l73L37j01j07K95j15KJ66k83
2239a15K97k37J06k3r2L22j70l73L60K20m07J04j46J29K16k73l6j4L02Q5l68l4
2261a47P6J99K5k20k58K54J88j62j78N93n59J01K30l48N9n6K05L03o64K15M24
2282B80l04K58l65j21K21p2q0J34M0o6J72l23J90o7k16L73J0k95J77J31N1P0k77
$$ plain form
2123 179 -70 188 24 -60 8 -43 -21 62 -121 -80 -209 62 -53 -148 294 -172 -215 47 -131 200 -63 5 14 -342
2147 -342 28 -9 -30 -17 -89 -101 277 -199 -19 128 -245 55 49 -2 67 -95 -221 105 -55 155 -16 -46 126
2170 126 42 -55 137 14 -101 -157 238 53 22 423 -196 -54 160 49 45 79 99 -341 228 38 176 73 31
2193 31 -185 27 167 -25 -95 105 -101 106 -29 15 -34 -24 -86 -165 -267 39 95 13 71 -83 -33 -89 -237 46
2217 46 163 -144 121 -101 -183 -9 111 281 258 -231 -119 239 64 -309 28 -73 -180 115 0 2 168 -115
2239 -115 182 -55 51 28 -64 258 88 -285 75 295 -112 -8 -154 -25 191 -82 -118 -132 170 255 -113 -147
2261 -147 -71 128 153 -67 -325 -71 117 -45 -223 370 -189 -88 142 -206 -147 -203 2 305 -359 -144 280
2282 280 -24 234 -131 -252 -31 -103 -183 -49 -9 -75 97 -226 -36 -103 -319 54 64 -231 -54 77 128 198 -79
2305g9J30m5q6K03p5j62K89j89k76M61k21P7J57n6J24j72k46K54p8k41L56j26
2327al6J09j48K34j41j99J53J25k94L40j09m25M01m4k64L41P1m4N3r1q8o3J63
2350D3n4j01J6q2m3J75P2j16O9n3j40K21L91l72K1N4k28J51K66q9j97j84J83K15
2374B18l17L25k09l7J88k50K76K4j23l1K5m07M45K64j99Qk45k91M00j88K09m0
2396D5j57N03l59p4j41K0L21k33m8j30L97l78K07J27j76K10J5j49l0m5K82j60
2418D7j41j57J41q0J87J6K29j63nj87K81j62M6J7l08K54O4p7K07j25k06J64k7
2441A5J20j42j81L31J50l39J33j77M7K35l34R2p4J10K41k54Q8j65Q4J06Q2l31
2463a63n9N61m45mL16m05L57o9l00J28N4m4J57j02o8j03L31j2k31k3L03j80L0
$$ plain form
2305 -79 51 6 -80 123 48 -114 175 -14 -290 171 -50 27 184 128 252 80 -166 88 10 -231 125 -1
2327 -1 -37 72 -76 158 17 -182 -29 96 -198 142 33 -392 9 -35 -299 42 113 69 122 31 -57 -120 43
2350 43 -11 -112 -96 -178 -221 -46 26 -90 -21 -74 -214 7 398 26 47 101 -127 24 290 201 4 -180 3 218
2374 218 -99 226 17 -20 168 -82 194 218 95 64 89 -318 127 391 192 200 -45 -336 64 -124 85 45
2396 45 -112 391 32 -42 -183 -163 158 -75 -123 -253 144 -234 -27 100 -76 134 149 0 -30 -75 207 47
2418 47 -94 -251 -110 -190 -3 13 242 79 74 -113 168 6 52 69 -239 15 79 2 209 84 -122 42 15
2441 15 135 -7 -188 143 293 -46 87 -90 -43 192 -142 -50 -124 -14 227 -27 61 -104 -20 86 168 -163
2463 -163 -222 339 -106 -110 206 -199 158 89 -211 -83 -29 -73 84 -18 -86 -189 142 130 -101 -124 179 -1 29
2486B9Q3j56K6K29j61j35p7J01K85k20M3K21j71k08J57n4q5J53k99L02J58k11
2508A0j11L58n33L62L1l75M69o56J37L11j40K51k%J91m12N5KK25j6k0m31J83J62
2532E1j20M24m56j25L31k14n1J39k13J89P4m37M50r0j54M27n04J02K17j97K12
2553E5M8l16J93K78k05k81K38j64K46K1j97L43o79M77%P5J59j15q1j04n04L05
2575b08K87r9K22j76m77N59l9l64P11m02q9J50q1j21K74j26J3R8k50K57l48P0
2597a39J41J10n4mk89L80j10j84K83q7q1J53o6J9j6k59J72R0l19M12j06n6j22
2620a32J76J07J72q4j07p1l99N44k57J54r4m6j5K31k12r9J42r9k0j0j45K83Qp4
2644d7N2n7k35L31N2k16p3K1M74l71j11K27N8j13K1J44j85%o9L33l52K36L11m88
$$ plain form
2486 29 112 -44 -18 211 50 -85 -162 -61 224 4 47 268 97 -111 46 -8 -93 60 -239 63 221 10
2508 10 -101 257 -276 86 117 -258 211 -445 -308 3 -137 114 112 112 303 -109 -54 -52 173 157 137 -294 -111 51
2532 51 -69 355 -101 -226 105 -109 -160 -21 -234 -45 29 -408 42 -48 -202 225 -279 -177 40 -157 55
2553 55 103 -213 -20 258 53 -228 10 -154 92 113 -84 259 -420 57 57 132 291 176 95 -9 -513 -208
2575 -208 79 -20 202 26 -451 108 69 -295 416 14 -75 75 -6 -127 147 21 34 132 -118 139 -209 -139
2597 -139 2 112 58 54 -235 145 35 -149 134 47 -34 119 53 72 56 -203 -31 59 -260 152 46 -10 -132
2620 -132 44 151 323 239 132 61 -338 206 -51 103 9 -37 -52 179 -33 -132 10 -89 -109 -119 -264 19 27 -47
2644 -47 5 -52 -287 44 96 -120 -193 -172 302 -69 -180 47 105 -8 13 157 -28 -28 -97 236 -116 120 431 -57
2668e7l63L87J50NO9m35M55lq1Ol30N6m7M66k69J33j56Q4K1N6k15j58J80J42j33
2693c7m24Q85o08L7N22l79j14M16k20J9q6o1J82k57j17N29k45l41R7P0K01Q2j31
2716B0J41k25J90K2n68P0J85K22J79J03m38j00K42j94J35l8J74K30l62Q9J90n04
2738b37M76j58r8k5J30o7L52m04j35L70j97jp0j4J42r9J18j90K63k31J2R4k18
2761a87J71k14K95k64K92j52J77M8k9l87J76l3m0p4M02j41p2R1l39M28l97j56
2783d05N69q7o4M9j53L6j32JM19k49j10Q8l04N65r1l99K73o6j92M56m06P5J42
2806A5p7L3k8r9M12l60J08j20K46jn0r0oK76m60j78L92r7K53j81j69K76q7k51
2830b43L44j01j57L49k94JJ15M7R0l37K5r0J70l1L0J15j7R6k51J47Q7j81O5O8
$$ plain form
2668 -57 -420 -33 117 122 191 -244 211 208 127 133 -197 -141 -188 278 9 142 -14 70 91 147 -68 -226 -46 96 -37
2693 -37 -461 424 -184 -147 375 -4 -118 298 78 97 11 -50 132 -125 -242 287 42 -299 -202 -132 69 151 20
2716 20 161 -64 126 148 -420 -350 -165 57 236 339 -99 -199 43 -151 -16 -54 120 350 -12 77 267 -237
2738 -237 239 81 -17 -42 88 21 373 -31 -166 204 7 6 -64 -78 64 -35 83 -107 156 -75 -63 31 -187
2761 -187 -16 -230 65 -199 93 -59 118 166 137 -250 -74 -107 -147 -221 181 40 -32 59 -280 148 -249 -405
2783 -405 164 77 13 62 -91 -55 -187 -186 233 -16 -126 -38 -342 223 132 -267 6 -60 -252 204 -202 -127 15
2806 15 -62 -29 -57 -156 256 -104 4 -116 130 129 79 -11 -17 259 -201 -379 13 -84 169 -12 -181 95 8 -243
2830 -243 101 0 -157 192 -102 -101 14 61 151 -186 -161 -251 -81 -112 -82 33 16 112 -139 8 95 -86 -21 47
2854D7l3Q3m80O80k83l6O3j33J13N4J46k52K0J78j05K61k10n6K94o60M17k42j92
2877c26M55J55m93J64K74j68R3q3k21o8J82J52J27k43Q6l79K53j75L2L80p4l29
2899b06o6L04Q5j4M3l44M90m85J48J54k59R0L35l77L91k93j88K72J27k77J38R8
2921A66k02J53j93J56J0k63K63j86J49K85l24p7j34j13M58K7l55M37k44k06N74
2942C81l21P3j64j01J65j09m2O6K61l99K47j35r9K19n5m9K20l47J54L69n18L98
2964B14j41l98L33P9kJ03l30J08j88K59p5J21l84M17K7j90J09k71J52K73k31L
2986a2K16m50P07n50M2J36k60J29K1o3M5J87j67j07J82j25L90o27P6M10m11K86
3008E5K55o02O37j86k03O48m18k76L72J4k49k22P8K78j8j90J97k90K98k58j62
$$ plain form
2854 47 14 97 -383 297 14 -22 41 -92 21 75 221 -31 -11 167 62 323 113 57 351 -309 108 -134 -326
2877 -326 129 284 -209 -45 229 61 154 71 -150 -218 -36 116 243 0 86 -293 -40 -215 -183 197 123 -206
2899 -206 -272 32 117 103 146 -198 292 -193 -45 109 -150 -60 275 -102 289 -4 -192 80 207 -70 68 166
2921 166 -36 117 -76 80 90 -173 90 -96 53 338 14 -63 -197 -310 148 175 -180 257 13 -193 381
2942 381 60 133 -31 -132 33 -76 -118 -52 209 -190 57 -78 -177 42 -13 -62 158 -189 -35 334 -184 214
2964 214 73 -325 8 87 85 188 -142 -34 -222 37 -38 83 -301 116 143 -47 62 -209 -57 216 -15 -12
2986 -12 204 -246 461 -89 -47 89 -171 -42 -21 -84 -39 148 -19 -126 56 -69 321 -306 -230 180 -231 55
3008 55 310 -292 345 159 -44 604 186 -90 282 296 47 -175 -97 181 163 -27 170 -120 178 -80 -242
3029b42M85j81l41M56k07J89k71J76p7M9j31K5K36k03lJ24l34M65k22j48L36k47
3051f6L35r5n55L37q7J23J84j11m20M05n0n00O05l53J78R7k06J01J52q8J90n73
3073c97K66L54o03L26J34n1j93O1J61k13Mj57O49l03j46K04k3M5j41k03N57k5
3095C06r2q1J62l77nJ57k01L10k10R8r5k77L38K74r9J02n05J53J94k03K45k57
3117f3L9j26M7o9O3j1J72k22j31K78J27k73K56j65j09K50j1k14J30pO9k00J67
3140ck51L08k3l1J67l49M13l76J0K75j16J83n0k46o2J33j20L9J03m56O19L5l10
3163a08J57r4K91k33j01m2n3J68K20k96m4m0J68K8K45n14K18J00k32L95n22P5
3185b14M28k69L27j84j65q0L09k16P4l0K69j52l43J44K38k13j50J86L9J52l13
$$ plain form
3029 -242 243 62 -279 177 -30 159 -112 64 -13 36 -95 -70 166 -37 -40 84 -250 215 -7 -155 181 -66
3051 -66 269 174 -381 -44 -131 -8 176 65 -355 50 0 -500 105 -248 -70 27 -179 -78 74 -14 176 -397
3073 -397 -131 223 -380 -54 80 29 -164 -103 58 -155 -151 -308 341 38 -108 96 73 118 -23 -226 331 306
3095 306 214 133 295 -82 -87 70 -131 179 -31 67 -28 -305 33 307 208 310 -195 -42 152 -51 194 -63
3117 -63 -24 -150 -103 -172 -109 -120 52 -170 -301 -23 104 -169 87 -78 -187 63 52 -162 -32 -39 30 -170 -3
3140 -3 -254 54 31 0 167 -182 231 -145 -135 140 24 207 157 -89 -151 -18 -138 -99 4 -452 167 202 -108
3163 -108 49 -45 246 13 -88 -130 -183 -15 205 -91 -135 -175 -7 21 266 -248 -30 70 -162 233 -289 -214
3185 -214 214 -55 272 88 -77 -157 152 -64 10 -20 249 97 -246 -102 136 -77 -227 -41 -2 150 -163
3206a63L48l91P4j37L92p1l19M80k0j59k34J76pK53j09j13K4q6J71l08L24N0m48
3229b73K93O9m13P11l91m4N4r2K53N0q3l8m73M28J2m09L43L74m50K05j73R8j47
3252i6M06qm70M7J16O97l55p49K44J29k01N9J70J02j20r3P9j75K24J07k30R3P5
3275E1m8J80P5k99M02m09o11R97n15j87N27j04j5Q7k68L78j84j90J9j79MK96q1
3298g4j18M79j73j76k00R0J96J79l48P08r11M69J81k85k45M78m15M37l52l10O95
3319C05m0j14k56K08j16R2N1L1l36k76M95L3n14L01n1J95L82n11J09O4k45R7J03
3342Gk85O26n9m80L06k17J87k1k36M08n0k58J85pj82J7l1%J51q2J39J1j81J40
3366H8Q5l35M59l83m7rJ29l1L31n25k02J05K80J44N2m94L03J42mL8k58K44j63
$$ plain form
3206 -163 185 -206 -132 -269 123 52 -267 213 193 34 -200 -24 -31 222 113 0 24 -62 109 -199 125 175 -273
3229 -273 20 89 -324 387 -4 -48 6 -86 167 217 134 96 -377 51 63 -346 -3 371 -79 126 -47 51 -96
3252 -96 310 302 -168 -121 -5 692 337 -412 -168 -39 -240 -181 -11 91 -29 -122 -43 -218 6 113 -117 -24 51
3275 51 3 183 258 -41 361 -48 -659 338 -177 -364 163 59 44 131 -137 241 57 -133 -114 -293 -289 7 -74
3298 -74 -192 287 114 -62 -262 -172 24 203 -145 563 -348 121 302 17 -228 250 -165 272 -80 -390 305
3319 305 265 151 -105 103 -13 79 130 161 -175 -451 44 77 -437 -136 -187 8 390 -121 -12 52 -193 -96 7
3342 7 -278 348 289 -191 115 -102 85 64 -172 236 186 -72 113 106 -76 -59 -90 -90 61 -21 118 129 -52 88
3366 88 173 -162 297 -86 -133 -142 -13 -44 287 -238 -440 -335 -55 89 141 -353 -50 92 88 126 -132 112 -51
3389e1j69N06j04k10J37k19k4NK90k31Q8j12RJ03J18l09J90p0M0M7nJ08k7N3j70
3414gJ47l78J63K5p4K9J38m2n2J75J9J10o3l35J8K37o1j14J16j4J1M09n65L29
3438B21l7m29J76L00k75R6k18J3J51j62p8L19m6J27o6n5m7o5j86L00O0o8K2l85
3462c32M58K05l82n2k24J52J9N4L6J03q5K05N5m32K45J30P5k74R9l2Jk87M08l19
3486a74p1L92j07j47J31j57k06L53j21k7K43j83K44K24m46J17l56N50j75l04Q6
3507a34M85n29K18k3j88L18l50Q2P6RL48k35k11J4J43j43J44m9j83L10j43k58
3529b99J70j09L81J72n94N35L3j96M1j04k27M16j93K3J23L4J6l51M6M8J25k56
3551a66o7R4j38L64k01L44l61L5P0K57k25J04j17k05N46k70k93L86j24L3R5j65
$$ plain form
3389 -51 -220 286 182 -28 109 -110 -134 -129 161 -70 18 -94 -85 18 136 -173 17 -53 -13 34 29 137 110 163 -7
3414 -7 140 -238 -75 -50 -124 -95 43 1 -51 124 143 253 190 -145 -127 110 49 -65 51 37 48 457 -108 221
3438 221 184 -245 -69 231 -44 52 -166 -153 -2 -164 -242 77 31 158 92 37 -10 -75 -261 39 99 31 53 -332
3462 -332 126 331 -51 -103 -327 -175 -156 -102 -66 37 -48 157 212 -220 25 155 230 -44 55 23 24 -263 145 -174
3486 -174 -245 147 40 -107 24 -133 -339 14 -107 -134 109 -74 170 394 -52 65 -291 259 84 -220 -134
3507 -134 351 -178 40 17 -171 147 -203 -121 -45 -36 312 77 -134 -120 23 -120 24 -25 -208 102 -41 -299
3529 -299 -129 -238 143 315 -279 256 289 93 134 30 -197 219 26 49 172 206 222 -129 -83 -35 90 -166
3551 -166 -233 -139 -277 87 -114 230 -131 -96 -26 231 6 110 -7 -212 334 64 -229 157 33 66 161 -4
3573dJ0J8k97M90n21o2N81k13K76j70J08p1j68l27K93q2J17J47j05p2j18P1k93
3596c92L94J7J40j01n09O55J4m21M12ll42o7M95q0n28J45R2K02j44J50k42K32
3618A19j49q0J86L4J7K01l04k02J10R0LJ36j03j11N9j82Q8L00l84K02p8j69J24
3641i3N7n5J75k23K31R6k87K23k16k1K4J24k58J73m1J31l80K37L47k9j12n9J4
3664E8K1J3jj96K02m4K38k18l0L5j1j95j76J89L09j94J65P2j66K4Q2k85J93j18
3688c3k42K57m8l73M94j2J57k32J80k29o7M9lK48m7j10J24Q7j80M4l24M33l20
3711a47m1L68l54L64k41K04k77J97l2m1j81J4J24n4N2J39j9j79O15q00M76m4k42
3734i9Q2j6Q2j62J64No7j36O7K42j48J72k5l96M92m71J4R3Q8n0M5K6n3J57k93
$$ plain form
3573 -4 6 24 -273 217 -304 -366 215 2 278 108 216 145 -23 -350 -57 -139 -22 125 20 -52 -170 -99 -392
3596 -392 2 19 159 58 -451 204 218 -203 209 206 -136 -203 292 212 -316 -171 -79 123 -21 129 -113 119
3618 119 -30 -110 76 110 127 328 24 -178 -68 22 25 161 58 -53 6 -176 -88 212 -172 30 -48 -217 -93
3641 -93 -36 -91 84 -139 92 188 -99 124 -92 -113 -89 35 -223 -50 -91 40 -340 -103 244 215 103 44 58
3664 58 79 92 91 -105 97 53 291 73 43 78 67 -128 -304 -115 194 0 165 237 71 95 177 -108 85 -33
3688 -33 -275 -18 -66 -439 55 43 200 -32 148 -81 -148 -99 -102 146 99 -11 113 200 20 64 -260 173 -147
3711 -147 -188 180 -174 190 -51 153 -124 73 41 0 -181 -167 -43 -97 -45 94 75 -104 511 -289 187 143 -99
3734 -99 -17 -33 49 -113 51 56 -11 -147 -80 162 14 186 161 -235 257 -214 -200 -107 -19 -69 -24 2 -51 106 -187
3759a87J80N3K74l12J40j68KO0N4P7m72J88J78p5J80n8j37K89k30R3k28n2K96
3782A45j22k4o2J69k24P2k3O0r2M06j46q1j62l9L9J19j26J6K49Nk76J06N9k99
3806b31K26J06m7K3O6k00j02K77lO8oj79n9K91k84K31j35k2l14K00K84k69R0o2
3830e1L0J54l49K04K89l12K57j10j69J23q5j73L78l03NM01m23K16J9j75K63j95
3852fPj6J27j62L6p4m7K69Rj04K06j65l4j64n1J30p1J35J77l77J82J43k54J07
3876CK7r4Q2j45R8J13l75M15M2k36J26R8k20j42K90j61J32k85q0L65J11K64m14
3899A4k28J10K04k86K01j36j67L37L8K2J00l60J50j70P9K47j89l8j09K83j72J21
3921E1J39l93J93j50K06o6j66L72j7j15K34l41J05M7m3J08j64k22L45q5k35K60
$$ plain form
3759 -187 -7 46 320 8 148 -20 -18 42 96 173 -299 -111 67 -8 172 114 -23 266 36 129 -99 -151 145
3782 145 23 -1 -63 106 -118 -46 -69 -9 -101 305 159 78 -84 -123 -84 35 -91 -75 174 179 -97 9 68 -231
3806 -231 -5 101 54 77 143 -57 -159 118 115 183 177 -2 -61 230 -54 177 42 20 -294 -94 190 -79 11 -51
3830 -51 -21 133 -216 -12 277 -35 222 112 -57 66 -19 -192 186 -117 -112 289 -134 82 101 -74 189 -6
3852 -6 1 -15 112 -50 -14 -88 -135 134 143 39 245 80 46 -118 -169 -39 -110 25 202 -175 7 150 -104 3
3876 3 30 -64 18 -127 -29 84 -291 124 166 -70 56 154 -66 -208 82 -79 53 -232 -312 53 164 428 14
3899 14 -214 -104 100 -186 15 -121 -288 49 87 109 209 -151 -1 -171 -92 155 -34 -72 -181 102 -70 51
3921 51 190 -203 -10 -160 46 -20 -186 186 169 54 288 -53 52 99 56 164 0 -222 123 38 -197 63
3943F3M5r6L9q2M0J95k00J06r7p2o3j56K62q8J64m3m3J17on0m07M38k2k0qJ67
3969A83m42L78j91L7L97k66j34J59k33Q3J10np9r2K06l3J5K32k92j91K26l05J31
3992a06R3m8r7mK12n4k43L24J04j49k12J64j58J59P1j74J73k82J64P4j72J09j52
4015b04J7J37j7j04R9J18j21J14k90J57M49l50j05j20o2M00j73k37P4M7j25M04
4037A08k40R3J77j53k20L17k70K72M0j08l4K21n67L92P6j76om8j66K70l0j23L01
4060A26l24J19K47l6l42L17k70K06m00K77K09j92L3N9j71Q9j16J1M50j89k32J40
4082A1j50N6J92j22J79j78n5K42j97K36j80r3j05j94L11M7l8J8r5J89m7J55n10
4105c28O49l36j19L23m8j42L3n4M0Jl09K13k14K51L1QJ13l24P6K52K17m25j76
$$ plain form
3943 63 108 12 51 -31 9 204 4 110 13 -59 -122 -278 -16 -104 60 17 -26 91 85 35 -372 66 44 24 16 183
3969 183 -259 119 -72 -35 362 96 -38 121 -112 -29 81 76 -3 -95 111 78 93 325 33 -158 68 -237 -106
3992 -106 -13 -61 -158 -162 50 -4 -247 77 181 32 -180 -16 -174 -15 56 -118 55 -227 -63 11 -161 -52 -204
4015 -204 -187 -50 -67 -171 -72 46 -75 39 -251 -94 355 5 -100 -220 -282 118 -55 -292 -218 -171 -296 108
4037 108 -132 -39 138 -15 -235 82 -188 84 124 16 -18 203 -364 28 104 -72 -78 -126 -292 -22 -52 -175 126
4060 126 -198 -79 168 132 -210 107 -163 43 -357 -80 129 -63 -30 29 -142 -53 -169 -158 292 103 -129 11
4082 11 -139 -83 109 -13 166 -12 -67 175 -22 214 34 -59 -164 -358 -47 0 -38 -20 -115 74 27 182 -328
4105 -328 321 -15 -134 189 141 -1 32 -22 18 19 -290 -77 -291 -40 -9 -1 112 -212 -136 116 333 -92 -268
4128b68L31j95k8L08j99J40J92j08k21rk0j35K40J1k3KJ09n9M1j69J44O4n1k80
4152a83K09j09K36J4k29J75J65k2j46o7Q4j15J89J64l62L4o8J61J11j87J5J30
4174A99K6j31l3j54p4j25J10K91k24L25M3l1l00J97k36J31k40J12O8m84O26k70
4196a74L5P3Q4k83K12j59j06K96lj8K73l06L02p3o4J02k00mL32m13J60m2l9K69
4220B54n7k55M4J88l93M77k76J18R0j48k25L1J07k6K53K6j46j17r8L44j69M1J28
4243A91l05R9qJ50K8l26J16N6m5K8j3j2r9M22m05r4j66N09p0M06l80M5r9q4k7
4268h3j04L68k07k36L30j29j58L82k6m35O7k0L02O8m7J75J39m86J69j72PO4j99
4291b31L16Q4j12K23j82o2m8p5k19K94J91k19J65l29L56l25K51j37J77m50M04
$$ plain form
4128 -268 63 -132 -160 148 -51 89 281 173 -48 -57 -77 -212 28 39 16 18 127 68 109 -60 84 148 97 -183
4152 -183 26 -83 153 167 -62 113 278 256 110 43 127 12 201 365 3 37 -31 130 241 54 69 199
4174 199 225 94 61 -93 -167 -292 -182 109 -115 210 253 222 -78 119 -117 14 -226 -114 -46 -530 96 -174
4196 -174 -139 -66 18 -265 -53 -212 -318 -22 -25 -43 230 -76 226 153 89 191 -9 -13 319 -94 66 24 -15 254
4220 254 197 -58 -14 174 -219 258 -18 100 190 42 -183 -152 -45 -71 182 208 62 -55 -153 191 22 63 191
4243 191 -114 -15 -23 127 155 -171 -55 1 -44 -16 -29 -41 -140 282 -123 -217 -383 126 56 462 82 127 28 -56 -83
4268 -83 -187 181 -26 -262 68 -61 -219 163 137 -298 -231 -251 51 119 72 247 386 -100 69 -103 -96 -32 -231
4291 -231 85 169 57 280 98 36 -12 -87 -306 -12 179 -40 125 -204 152 -173 78 -59 118 -332 72
4312G2k13j43M78k74j04J94m1L1J89k74J54j70n5k3J01k05O23m87j35L55j08k3
4334e8k9R8M05j74j74K60l80K21r3r4j1J45k18M80k59n3k01q9M99j21J1k37K02
4357A30q0L3m32K94K59m06L07k0r0Rj8m2r1J94q2J31n3j30J22j81J84J33m54N00
4381B17k60J47K02n66L68k2J62k69J5k32M81k21q9M1J00q1J64j07j10L00l33K3
4403g0QJ63p0o2mkQ7M1l53K90j56J24J21k7%m26M43j76J9K27j93Jk7R4J08q8j27
4430e5J7p4K28m9n4J31k4j18m2o3m07N39k16K36K83n04J04RJ03QO2k78J92O9j40
4455d3j0r9J7K22L4k50L59l38J96j86j52L39j83K23N5k01k76M74n3l8m4k93L98
4478A51j15K40k76k9M3L6m65N93l81K25L47m77nL8k0j29J89l2J77m3k88L97k10
$$ plain form
4312 72 -141 -284 194 -80 -184 10 -31 0 189 -85 69 -101 -156 -179 -78 -283 340 -147 -282 73 -35 -58
4334 -58 -87 11 416 242 68 328 -52 169 76 -18 -29 116 -102 378 119 66 -135 -224 275 154 165 -72 130
4357 130 50 83 -349 -55 204 -202 105 85 -5 4 -14 -56 -147 47 -35 96 43 -87 35 -146 38 171 -283 217
4381 217 -43 104 306 -260 108 86 248 -21 -6 -238 243 22 -67 -26 74 -7 157 50 -60 240 -93 -70
4403 -70 -62 101 31 -31 -35 -37 50 91 -262 28 -128 -4 117 90 90 -336 107 -69 -50 177 -16 -15 -42 52 160 72 -55
4430 -55 -38 -112 116 67 13 144 120 2 -40 -103 -510 29 -187 49 332 -172 -68 -59 44 52 114 -164 28 97 -43
4455 -43 -53 -152 -135 87 121 -129 230 -108 88 -98 -250 89 -94 129 184 -17 -293 181 128 90 46 -247 151
4478 151 36 276 0 -29 14 50 -415 178 -203 22 369 -108 -113 -75 -95 -224 -35 -67 110 67 -221 176 -34
4501c4j5M3m0r3K47l48K21pJ1J41n2j71J72J91m53N67m65j03K73k13J53p3k15
4524b63K98k0N6L33l22P9n9k53K25j45J33k39K17l13L61J6j17P9l07L45J19j79
4546D4j91K62l15J83O9j24M0K58j83J52k21M7j4K23l30J80k3L8j43J18j75k2P
4569a20J56L5K00k81j53L92k55QPL20l41l5K45p3r6%K8j58K21q4j09K96l01J50
4593E2L4q7j47J05K0O3R9NK28k22j42j79J21J78J35l57j65J53K88L9j41k86J50
4616e6R6ql2J29J02m19j7j9J81J4l02J87k1K02j96j8p6K91N1k91L20p1j0k28L82
4641A91J16o12J03K03RK10m26J28M5k0K26j8k63Q0K15Qr3O2j07j1m6l37P1m0M23
4666A17J38o89N93j62J28k42K3K94j61O4l65L63j54K25j54r1J36po7J48j90j21
$$ plain form
4501 -34 -49 -6 -46 -139 108 -240 -19 -26 -15 126 74 -97 75 266 -187 380 -85 -188 85 -128 25 -48 -263
4524 -263 35 15 71 404 82 161 102 -151 74 -71 62 -177 40 -273 88 104 -13 66 -241 104 223 44
4546 44 -147 115 -200 -17 52 -72 -32 226 43 195 -26 21 7 230 -100 80 57 95 -48 70 -105 -127 -120
4569 -120 36 71 271 -10 -163 229 -26 -18 -11 309 -32 -67 178 105 9 9 37 -121 100 16 -93 203 -98 52
4593 52 86 -1 -148 -43 -23 40 139 144 372 150 8 -171 -50 128 263 -94 -259 -106 182 221 80 -206 -56
4616 -56 40 32 0 129 231 -188 -205 -224 -43 -29 -331 -144 -165 37 -159 -177 -253 38 89 -202 118 47 37 -191 191
4641 191 307 -305 -202 1 10 220 -206 -78 -33 -53 173 155 -108 -28 187 195 102 164 57 46 0 -337 -266 -306 117
4666 117 255 -434 159 -3 125 -117 -94 200 39 103 -262 101 -53 172 18 -73 63 56 -11 137 -53 -174
4688a74K60j30N8L44j72j07q7k53L31k44K30k63J15J03j12K5L32k05l08K44j10
4709a23K63j8j20r4r1M2O3J98k94K01K15l13J90J39k56K26k18j92L64K2p9j59
4731c4P1j99O1M9J17j93j53K61mn6Q8M2k27K71J63k33K4k12K18Q0N2k74R4m4K56
4756B18k41j29K26P7O0J18l11j07p5L06j43k07L71k47J47j46r8Q2j09K19J15k3
4778A03k28K44J35p4m13L33j58M25n64n0M97k15M7j63K00k07Q0o4J4K9j4J15j5
4801E7m3J06p0k3K40n06J05Q1n3J89j40M3o9Q8k78M9J75Q8R5r9j24K36m33M04
4825A18P2m27J46J01j82K19l4J56j3j68r7k96O92n68P9K27k4P0p9j02J66J22k32
4848e4Q4J9Qk73K08j85M0j0L57Q9l79P5J50j01O4k05K8p9J53n0K71n8j33n3k02
$$ plain form
4688 -174 86 -44 14 358 186 79 -8 -261 70 -174 56 -207 -92 11 -101 -76 256 51 -257 -13 -123
4709 -123 140 122 2 -92 -183 -141 -78 120 -174 27 242 -71 119 258 2 228 10 -182 182 204 125 -34
4731 -34 37 -162 -101 -52 65 -128 -281 -20 -24 -80 8 50 -177 94 257 24 48 -164 54 134 186 -88 6 -38 218
4756 218 -23 -152 74 151 211 329 18 -89 -164 142 -1 -208 163 -84 63 -83 -181 -99 -208 11 126 103
4778 103 -125 119 254 180 -233 100 -58 367 -197 -247 250 35 82 -81 119 -88 -8 -72 -58 -29 -43 72 57
4801 57 14 120 50 27 267 -239 -134 -53 -106 83 -57 -14 -83 5 -273 -224 -49 39 134 35 -89 147 -286 118
4825 118 190 -237 -91 10 -172 47 13 169 156 -12 -109 -405 287 -281 -202 25 1 71 -8 -110 56 178 -54
4848 -54 30 49 57 -216 -8 -193 -153 -163 194 283 -96 -21 129 28 92 -113 -85 -164 -11 -61 210 152 19 -34 -236
4873b36K79l77M24p4l5j44L26j2Lo5J07k76K55n7K9K2j89ll16K89K21p3k10K02
4897I0l6m7J80n15K55J08KJ78j19j81l4J47J58n9k65M8K17k03J11l73J41J23o0
4920a34L41j93J77j20L5l51J1J43R2O3k39K09J95j52L57m28j05l43Q30j55o79
4941d46O18l59N19m89J20j39K34j79K65J0k56J59j7j90M0m7Q0MQ3j46j45K66K37
4964B22m66M22l06J9K72l73K70k30K1L91k61j20r1Q7J16q4J94Ml2k92PL7K86J
4988I4l10K41p1Q6R7j50j6K18j77J27j96l5m6K20q6j97J69r7K08l4j58j01L94
5011A80L5j45m9NQ8n5k07J11J21o3j48J23K65n36K19R5J0L9J49m26N0k03M63J6
5035A37k78R6qJ65j31J00l10J33K37j64j8J84q4L2P9j75P3j7n2K00j15p1l8R6
$$ plain form
4873 -236 43 -334 90 16 -19 -163 163 151 154 89 196 -80 175 118 147 169 -20 -23 -339 -50 171 98 -112 90
4897 90 54 7 187 -328 -73 35 37 215 96 -85 -119 28 186 127 -138 -90 127 -76 35 -338 -197 -74 -134
4920 -134 207 14 191 71 106 -245 -234 -91 1 64 -175 34 229 77 434 6 -99 -442 388 233 -446
4941 -446 172 -187 332 -157 -37 -176 58 -121 144 154 -102 57 40 -150 -110 -157 -77 -73 10 -136 -281 -15 222
4964 222 -244 178 -128 -109 163 -210 60 -170 -149 242 -19 -139 -230 -143 -27 -111 83 87 55 -237 -230 -193 93 94
4988 94 -216 25 -46 40 137 -13 -29 189 12 139 -57 -92 -138 82 -4 -201 -32 -129 79 45 -113 -214 180
5011 180 215 70 21 26 114 59 -148 -37 84 21 -127 -4 261 -275 -56 39 49 88 237 -189 -139 -342 121 137
5035 137 -141 -45 -53 112 -19 81 -229 -96 141 -23 -41 143 59 91 170 -5 68 51 -1 199 84 13 -25 71
5059G1O0l9j98K61M6j28Pl03K14l4K4K77l77qk0J69P8k61k35M50jq5q7K38j22
5084cP9R1j77P4k74K08l1K0R4j47n7J66RK02k11K6k09k3M02l16jK49m07O8j11
5109b79M2L75l78L04J01j86N0j30L79k13j60J37j60K97q7r0P5q2K93m06%pR1J29
5133I5K7j11Q1m3j46J53j25L2j08K8L7L1r5KP9K34j73j19R5j16L57k65o6J71L8
5158I3j51J95k25%J59k68K15k5R1k01K91J17k87K10l96N9K67k53oQK10p2Q1k30
5182a18OK71L0j65j61J48q1j59K83Pl00K44j9L80k11p0k19L7L84m62K24k65J8
5205a98N1J32j95M23qj96N7Q6l19L35k40P7J85q1j28k40J16N3K71R1o18L80%M2
5229G6J87m47K45K13l41l4Q6Q3P0p2J59l60J30l23K96K0Q7M4J12j79j68o8J23
$$ plain form
5059 71 131 92 -106 155 201 73 80 -223 -9 -43 -19 258 -119 -127 -147 22 100 -161 -396 54 53 -32 -119 119 -3
5084 -3 76 167 -10 64 -210 -2 -33 -13 81 -66 -123 43 52 254 43 69 -140 -163 239 -77 -78 171 -236 -168 -279
5109 -279 -237 138 -240 64 165 -21 29 -101 278 65 -95 42 -118 179 92 2 77 -5 288 -118 -118 -125 -34 95
5133 95 122 11 92 49 -97 56 -69 -37 -145 -117 -80 -49 -144 -142 -63 171 -2 -121 -26 -142 215 -50 -116 55 93
5158 93 -58 137 -88 -88 71 -197 18 -7 84 -117 174 291 4 214 -182 -123 144 -109 -115 -107 103 31 112 -118
5182 -118 -112 159 189 24 -137 11 -70 -229 54 61 -239 5 -14 366 155 85 -134 -97 287 -175 49 -216 -198
5205 -198 -147 -15 -210 213 205 9 66 152 -167 168 -72 5 190 109 -19 -259 -143 -90 181 272 -346 34 34 76
5229 76 263 -184 61 274 -67 -101 -15 68 138 66 225 -135 -5 -328 -32 -12 75 119 231 52 -116 -184 -61
5252f1J7j86J89r0J4J42K06j24j45j7M6J93l94K11O1m0p1L00k75J2n7K43j81k52
5276b59J38J53j19ll5Q0O8j72K35j18j07N6J86j25J64j55k70K69m5J96Jk13K56
5299A81ln9k14M5l9n7M90l62j66L70jj70r9j87J69J07M4J57k36m0j09K38K7m74
5323c88K10j30nL19J07L0j7r5p0K7K23N4l90M9J13k33P7JJ82J9n1O1k17J03m5
5348f6L23k52M4L7j8Mj75K69k95R5k00L35k11q5J05J03r3j47J60k00L51O5j17
5371C2r8q9L1J03J82l04K78k04M19j27j5j79K8K05l06J55m09K85k00K26J66k44
5393f5J90q8m5j70J22L94l09M1l08j57K81J69M7j82p1J83j30J36k42J80K08k86
5415a02k0J77J15r1j86j28J36K58j85PK26j6l12j31N10m47J86K5j5m07M78j40
$$ plain form
5252 -61 -44 -230 -41 -131 -117 25 231 107 -38 -55 -9 184 -210 1 62 22 -49 251 -24 -12 -69 174 -7 -259
5276 -259 -121 32 -87 -90 -125 -45 23 -149 86 -32 -139 -83 103 -22 142 -13 -283 -14 -59 137 138 -75 181
5299 181 178 119 -95 -50 -89 -146 344 -18 -184 186 185 15 -84 -271 -102 5 49 206 -30 -70 -179 59 86 -388
5323 -388 -178 -308 -313 6 113 143 126 31 -39 -12 211 265 -125 -76 37 -196 -119 -118 64 83 32 93 -124 -21 -66
5348 -66 257 5 49 86 68 72 -103 166 -129 -34 -234 101 -110 -195 -90 13 -80 -227 -67 -267 84 149 32
5371 32 -66 -155 -124 -21 161 -143 135 -69 350 223 208 29 57 262 -44 111 -298 -13 -213 13 179 -65
5393 -65 125 37 -8 -178 -56 338 29 70 -238 -395 -114 55 102 -80 -151 32 -98 38 -204 -24 184 -102
5415 -102 -122 55 170 79 -107 -235 -99 159 -26 -19 207 191 -121 -252 258 -189 -3 22 7 -400 78 -62
5437f2J67J12j96K20l90N65l41q1J41j11pq3OP5j12p7r2K80j77K57l22K92l2K3
5461E5k10L94q1k31J49o4K9J27m1r4M7j91J99j81K16j84p5K04Ql01M15k7l88M09
5485A84k11n6k7K51j76K32k14p1m8k3M75m27%J9j51L99K8j78K39k69J3J22m08
5508b97K10K00k13oK14m15K95Q9L2j18j46lM1K35k50j06K7J32P9j10L75j07l0
5531A28l19N1L03j92K5lj41K94j90Q4k26J71J20O0k22p3J72q6J71j50o8K42r1
5554F0j10J08k17K0J79K08l00N3J13M6j29K4M7J16j67j57K40j84J8j25J23k50
5576b84N27m44k6J64o8N2K9L95j95j78j09J48j31L04j89O5l68L67P5j72J9o1Q8
5599HK29j13J2k29K65j47k19L28m22L99pk17R0l39M29M3k3k65J09J07j68K37l66
$$ plain form
5437 -62 105 217 21 241 -149 416 75 -6 135 24 17 -66 -60 15 -97 -174 -266 14 -163 94 -228 64 32 55
5461 55 -155 239 158 -73 76 12 41 168 127 33 80 -111 88 -93 123 -61 -136 68 76 -225 190 163 -225 184
5485 184 -27 -83 -110 141 -35 197 -17 -88 -136 -159 316 -111 -111 -92 -243 156 184 6 245 -24 -11 111 -297
5508 -297 -87 113 -100 -106 108 -307 -12 77 109 -9 -155 -158 -117 118 -132 -238 -211 -79 0 -110 265 158 128
5531 128 -191 -140 163 -29 -4 -7 -148 146 -44 40 -186 -15 105 165 -57 -130 42 -44 127 -23 -91 151 60
5554 60 -50 58 -159 -139 40 248 -52 1 114 160 31 55 102 218 51 -106 134 -50 -32 -157 -34 -284
5576 -284 243 -201 -227 -63 -131 -79 -50 345 150 -28 -137 11 -120 184 -5 60 -308 59 134 -38 -19 -80 8
5599 8 237 124 136 -93 172 25 -194 134 -288 111 104 -113 -23 -362 67 110 87 -178 -69 38 -130 107 -259
5622b59J92k38M06o0l34J27O7m4J77k8L7J6j46J60n3j47Q4K52k95K07j43j35R2
5645f5O2p8M1j41J92k3l1J16k6l66K59K16j64K9L51k96nL3K57l32n2R5m8O1j54
5670f9J73L3j64k9J33l7J35l65K33J21j26k69L83k41N3K89l49L1J2o3R6kP1n9
5694a0K6k38K80J36j78J26r4j6o5K14j89j2L29l89K93k33j1m2j10N6J40p9k69
5717c35K70J17J04j64k60L77o1J35l8r0p2n9k2p6L81j48j31L9PK15l3n0o4M6P9
5742A67m02L59j44j36p0L33p2j84K47j80K26p6j31J36j69j50L86l7l42N56k86
5763C1k34K46j92k6R7p6K27k1k03J36N0j46j6J52lj54N7J39qk14j3q3K33m4k66
5788c31K36LJ21j05J32K5q0K98l96J62o2n0L27k03J37j73m7J27Q6k00k08P6Q7
$$ plain form
5622 -259 -67 -305 101 41 -293 -166 -99 -143 34 6 43 59 -87 73 20 -127 -43 209 -86 121 -22 -157 -65
5645 -65 -3 -81 -40 -181 11 -12 -43 73 47 -319 -60 156 -8 21 372 76 71 104 361 29 -23 72 24 85 -69
5670 -69 104 137 -27 -56 77 40 175 -190 43 164 38 -231 152 -89 -36 253 -96 -65 -53 -116 -20 -22 49 -10
5694 -10 16 -222 58 194 16 142 48 32 -33 181 -8 -20 309 -80 213 -20 -31 -73 -183 -127 13 -66 -335
5717 -335 -65 52 156 -8 -268 109 48 183 145 55 -17 -76 -98 -174 207 59 -72 -33 -26 189 156 106 42 88 167
5742 167 -235 124 -20 -156 -226 107 35 -149 98 -82 144 68 -63 73 -96 -246 140 103 -239 317 31
5763 31 -203 43 -149 -175 -78 -154 73 52 -151 -15 35 -111 -127 25 22 -132 -75 64 56 -158 -171 -254 -21 -65 -331
5788 -331 -95 -92 29 -76 56 81 1 299 -97 65 3 -47 280 77 214 41 -6 121 207 7 -201 -125 -38
5811c8J54j22K27k24j03K27l04M5L88m23J64J26j75k5L33l41J19j43Q1n5o5K03
5833D9jk19J28L2J18j03pJ03K0j17j22J62l2J14LJ79k10k99J53O0r8m6M96l84
5857b1l99L19J17j08J85M2j03p9J92j75m2M28l19J71j30l59J66L72j90p4J73p8
5879H8j03l7K33l20Q5M09k59k09L0K92j98r2j26N2K90j11J9J09j45l36q7L37L01
5902B22l10J40JJ80k91K72j65n1l50K45J64k0n4l56L47J48j95o9qK44l8j27P9
5925Hj6O8j96M38k30j43r3p6J63J97l36J13J26L4q3k37K92KN8j07J72J20p34M59
5949aJ65j54J43o61l61J110M71m79l15N45m41l6j41k09L68K36l03M2n8K81k37
5970c5L7J53m5N4L8q7O1j42k88K35Q9m5j26k18L9L61j05j47K21l87K35J98k90
$$ plain form
5811 -38 116 -6 221 -3 -106 121 -183 -138 250 -173 -9 117 -58 -83 250 -91 28 -115 -34 -89 -154 49
5833 49 48 -171 -43 -11 107 4 -3 100 120 3 -119 43 11 125 128 307 97 -202 -49 11 -87 -133 363 -21
5857 -21 -420 -101 16 -92 93 135 32 -47 145 -30 -72 356 37 208 78 -281 -115 257 67 -7 166 88
5879 88 -15 -52 181 -139 -54 355 96 -113 -83 209 11 -81 -207 -155 135 24 43 152 7 -329 -416 -79 222
5902 222 -88 52 53 233 -58 214 49 -2 -352 -107 57 37 -17 -373 -26 122 -73 -142 -150 94 56 -71 8
5925 8 -8 60 -136 302 72 -71 -164 -240 -77 120 -216 -103 23 57 -26 -263 29 31 89 -18 154 274 -460 -1
5949 -1 164 10 153 -508 -869 241 712 233 -82 463 22 -14 -155 -364 4 240 -63 -21 -79 202 -35
5970 -35 2 155 110 164 202 115 176 34 -254 -19 70 25 -101 -319 -280 81 -24 -171 50 -337 -102 96 -194
5993a94P0M6K6o7P1o5J8j5r6R3N8Q6ppP9j32p3Q5L28k41j25j3j01K70k41J11L02
6020B66l71J77q0J91J21l24j32K97m8j23j63J28J40j51J89k56R1J68j41K71j66
6041H4k7j13L21l31K71j67J00j40k20J0J4K23K09k33o2n4J97K50n37J80p7j41
6063b43mpJ25m1K91j4K8n0N5o9k11J00q1K30k13Q2J32J31j94Ok04J90K0k33J85
6088A1P7nl43J77J29j66J07L6R4r9Q6j45K8j85L40j99j21K49Q0j24j98J50j28
6111a49J0K63r9J63j26j20j90J44P9q4%L04l10J0K33k30J4J28J71L4r2j56j04
6134a07o5J76j02k21J76M9J69J29j12nl53K95j72J94m58N80j93L2n1k10L92m0
6156A03J15l70R7J19j90J08P5q5K09j9J11k40j06l6Q7Q9j69K90n3j22K19ll02
$$ plain form
5993 -194 -124 -78 -52 -119 -48 -113 -95 -110 -206 -113 -55 31 24 17 96 -36 -109 -24 304 63 -62 -75 -176 94 -147 -36 266
6020 266 -105 72 -8 183 304 -20 -152 145 97 -26 -189 -61 79 -72 117 -139 -48 120 -21 250 84
6041 84 57 -56 265 -66 205 38 138 -2 -222 -212 -198 25 234 1 -61 -115 82 332 -205 -25 -102 -243
6063 -243 -247 -254 -129 -170 121 107 135 85 140 71 -140 -40 -121 109 -104 -22 110 241 47 53 -151 39 59 -174 11
6088 11 88 83 -260 -83 46 -120 -13 23 117 18 104 -41 -13 -198 142 -57 -178 71 151 27 -171 -21 -149
6111 -149 -139 124 25 188 62 -58 -248 -104 -25 -109 -109 195 -115 -105 128 -102 -88 40 211 245 153 -3 -107
6134 -107 -172 4 -98 -319 -143 -94 75 204 92 87 -266 29 -143 51 -407 173 -20 12 -39 -249 143 103
6156 103 218 -152 -55 64 -126 -18 57 -28 181 162 273 33 -73 -109 -22 67 -102 188 135 13 232 229 -73
6179g3q4K20r4J23N2k08J23p8L7m1n0K71k37K14k18nj8K77j50Q0j09j76J79j57
6203a22J29J81l03K47j27j02K04k05L20k73K85Nk18l36J53K61PL3j67q1L78j12
6225A57j60n9OK00j11j48k1K06k48J70jJ6J2J49j36n8j55K15k22K73m4m8L8j9
6249A2l6j22J04KJ55q6L3j35j92J51K38N4j57J42J2j43M1k17J57K03m29J55J24
6272F6j30k83L73J25j08o7o8%J60r9j21J54J22K0k24J11j63J91O9j9K11j35k06
6295b1R8p7Q8j13k25J80K97l07N4m3J35k86J50p3O3J30k8j10M03j86m15P14l63
6318F5k96L97k44M9L6J99j82k08J15J20j68K59k04L24j49o2o2k01j99M85K95l26
6340D3j68j42L14J59m45J45j15L13KN8l47J47Mo8k9j44K16K76l20J40R9m71L22
$$ plain form
6179 -73 -157 63 -31 92 144 -64 59 -19 18 -23 -73 198 -39 175 -43 -48 -66 211 61 141 32 -144 35 -122
6203 -122 7 188 -115 132 5 -97 107 -98 222 -51 234 239 21 -315 -162 99 106 139 -28 -109 269 157
6225 157 -3 -62 -56 144 33 -115 -136 70 -178 -8 -9 7 19 168 32 -26 -181 34 -188 85 41 -7 31 12
6249 12 -24 -146 -42 -40 115 29 62 -73 -265 -114 124 178 21 163 175 32 73 -144 13 216 -213 -58 66
6272 66 -64 -347 26 151 43 -24 -92 -92 68 -31 -152 2 124 144 -80 31 -132 59 128 109 320 185 -21
6295 -21 77 0 88 -25 -250 -70 227 -80 -26 -69 66 -220 -70 -143 -80 50 22 -88 315 129 -286 428 65
6318 65 -231 166 -78 -29 7 206 24 -184 -69 51 -117 142 -62 262 113 51 -11 -212 -411 74 369 43
6340 43 -125 -267 47 206 -239 -94 -209 104 106 164 -183 -36 -32 -100 -129 -273 -57 219 -101 39 138 -333 -11
6363a1J12j59O5O1J02k47L11m90L13m2K03k83j08K30k25K0R2K4J34j18J77p0N5
6386A46n7L0k73K07j98J25K17m43L33l11J52J28M1rL6j47j89N75j98j08r1l42
6408c76M26j29K41j52P2pJ38K96p29K93j40J07J09jl38M97o3l94L11k97L19k33
6430e0j59j4J38J07O1q7J04k61R4J28o9Nj60J43j47J28o0L8N9j76Q1m4O3q3M12
6455B51l49J22K2l50M76j16k4K60m49R9K8%J0Q7J75k49J54n2q1L1q7P7p5j66J89
6480a7p5J61j7K6k21O4Q0Q0k39K78M3k82J77J8K19l35j5k92K59l4J06j85K77o
6504G0l46L47m0k42M68l00j11M58k95J04Q8j74n1j2N3Kl7J4j8l9J04R2o1j32K37
6529A79m9l30L52l23J40K7j48P1n3J93j29L09r8j3j73j79L75l52L08Q0m74J71
$$ plain form
6363 -11 101 -58 7 68 170 -77 234 -256 57 15 218 -65 -173 57 -168 -148 -56 -32 102 -16 161 91 146
6386 146 89 119 -154 53 -145 -20 197 -246 87 -224 -72 56 97 88 124 -23 -212 363 165 57 -34 -376
6408 -376 50 -79 162 10 82 75 213 509 -220 73 -67 40 149 148 -190 307 244 -150 161 -136 183 -50
6430 -50 -209 -223 -85 22 83 -4 100 -161 -67 61 -8 -3 -163 -20 -167 -39 -99 -61 -2 -178 -97 -141 -78 -161 251
6455 251 -98 24 46 -304 172 56 32 292 -157 -58 -30 -30 -20 67 242 -7 147 95 14 45 -42 35 -40 -206 -17
6480 -17 -92 69 52 78 -143 -79 1 81 -158 120 163 -119 58 76 295 -40 -55 -347 -88 -122 -16 -201 76 70
6504 70 -276 71 31 -211 257 -43 -154 304 9 113 201 27 -24 -36 17 19 -18 -4 -22 -61 43 135 74 -58 179
6529 179 130 -200 152 -171 -31 -4 -152 -81 -134 59 -70 239 141 128 -45 -224 151 -201 107 187 -287 -116
6551a16O8K13j59J71l55J63J50l3J02m56J83Oj21J97k1j46J22J8Pq1j7J34J91
6574B20k39n9o2J32J8O4j6j08Q6j1j2j84J44K16l1k15O7J27l65J89k6R7Rj99k2
6599a80K6p0J54J45K6k48L59l51O2J11n1l5J19j13r4J3n8J68j79J74j55L24k20
6622g3j00L13r0k02J95k24R6K04j85J49j06l3l40M22k35J98J57Q2O0L7k09j85
6644f9K1m5J88n6Pr4j16J33n4K39N3J17l59n3J17j58jM0K60j48K5n7J87j99J23
6669A01l59L24p6l30M43J7k4k14N1N0r4J02k90K30M1J77K69l69l0J65k36J60M7
6692A55n5J1k9j38P0M5j04J83j84J56K17l07j74J85N9J7j1J80l34j47mK04J6J61
6716A72k01j25L5O4pj16P9K0j5q5K42j5j14J78k98K35J5k25J13m7K39q53J43P28
$$ plain form
6551 -116 -48 165 6 177 -178 -15 135 102 204 -252 -69 -63 -184 13 -8 -154 -32 -14 -7 -88 -105 29 220
6574 220 -19 -78 -140 -8 10 74 58 -50 36 25 13 -171 -27 189 158 -57 10 137 -228 -39 -65 32 41 -158 -180
6599 -180 -154 -224 -70 75 101 -147 212 -139 -77 34 -17 -52 67 -46 -140 -127 -185 -17 -196 -22 -177 147 -73
6622 -73 -173 140 50 -152 43 -181 -85 119 -66 83 -23 -56 -396 26 -209 -11 146 228 288 325 116 -69
6644 -69 -48 -93 95 39 46 -48 -164 -31 -85 154 207 324 -35 -88 29 -129 -130 -90 170 22 47 -10 177 -22 101
6669 101 -258 66 -10 -340 103 120 96 -118 -67 -17 -111 -9 -299 -69 -28 149 418 49 19 184 -52 108 155
6692 155 100 111 82 -56 14 59 -45 138 -46 110 327 20 -154 31 90 107 96 276 -58 -205 -209 -5 11 172
6716 172 -29 -154 -119 -55 -62 -178 -99 -79 -94 -179 63 48 -66 112 -186 49 64 -161 -48 -95 144 -709 -566 162
6740A62k09J08k75J48K13k52J94M2o9l48K85O9J13N6j89k77K96K23m95j95M69
6761F9P7k29n4p4Q2O5J82j04J33q6q9k41L05K17k39k7J31k3M5J46l41Oj4m6Q4
6786b5M5Jj42J70k21L90l30N0J54k19K04n2N0o3k83M59l41J10J28Q2J17j08k80
6809a04K14k42P6J5N4J07j42l4R6P1k27K47N7k14q0q1J40n0J27n1r5r6L18j93
6833h7k9J50J14k56P4Q6j29l19M88J87j46Rj96j27J23J26k85m6K15J29R4j10J82
6856B47r1j59l72L78Q6r5n5L97l41l20K99m98O86k34j53M64l79k00N09k35M8N2
6878C4k70L83o3j36k6o3L57l19L28k52j97K32p2J26p1J96n7j52L6n9j54O0O0J37
6902E8n8R7j11N5q3k46K62j82pK72K26k90Q4j66L37m50J68O2q8J64j63J04M9k24
$$ plain form
6740 162 -47 61 -214 -66 147 -105 89 131 62 -286 -1 68 181 237 48 -229 67 290 -205 -400 69
6761 69 146 -83 -137 -211 -129 -64 118 14 147 61 -28 -269 36 253 14 -13 118 95 140 286 -55 -49 -63 -109 -25
6786 -25 20 21 -121 49 -172 218 -112 -62 92 -127 77 25 75 12 -271 188 -153 -43 85 167 284 176 -104
6809 -104 110 -132 -56 -41 13 120 -22 -56 40 111 -116 131 188 -26 -106 -187 -47 -97 30 -21 -116 -212 106 -87
6833 -87 -116 34 148 -108 -34 52 -77 -396 92 279 133 142 -54 -181 -58 68 -217 -263 -48 81 175 65 247
6856 247 156 -3 -375 3 89 -6 -61 336 -5 -325 -26 -524 162 -72 -225 239 -140 -340 169 -66 -18 34
6878 34 -236 147 84 -52 -78 -141 216 -103 225 -27 -224 8 -64 62 -9 187 130 -22 14 -45 -199 -139 -79 58
6902 58 0 97 -14 41 -42 -288 -26 -208 -215 57 283 -7 77 -89 248 -202 -34 28 -60 104 -59 45 94 -130
6926a30K5J19O5r4K00n1m3k39K19J22k00J67n76M42j83J78N1j79K51o0j40J45
6948H9j73k3NJ08j07p0K35k37K05K12k02j05K22l78j5O79l57m8oK92o10K2L09
6971D7j20J35j08O4K35k30J20k79kJ32k0j68l3L68j44j23m7J82J68j05q4j81R5
6994i8K31j90j60L36l64J61J28p9LK01m49J20k9o7L37N2k94j44L70j14L17l51
7016h3L67l23K61m19K09KQ0k8O0O2l16K46ok01K20l28K12K64k49J51K3l88K86
7039A02O8j70M9K05k83J43Ol74K35J12j09o5q8l8J28R4o7J59j66O6k6M2o6j3n2
7064a08R0j90M10m7l62N39j76P3j95k73M00j96j9j12Q3k38K34J86M2j39p7L38
7086B63j82j61O6N4N5O5j50p2R5o9m9o0K39p5k00L99l09J94K0q5M7K2n45L69k8
$$ plain form
6926 -130 -105 14 79 -15 185 134 91 -148 71 193 -7 160 -416 26 -157 21 72 -107 144 84 -56 89
6948 89 -84 -107 -102 6 -101 -171 64 -173 32 244 42 -63 159 -219 -234 445 88 40 34 326 -284 -262 47
6971 47 -73 62 -46 18 253 23 143 -136 -138 -6 -26 -194 -227 141 -3 -126 -173 9 177 72 -12 -193 -98
6994 -98 133 -57 -217 119 -245 -84 44 -35 -32 169 -280 -160 -189 -256 81 133 -161 -305 65 -49 268 -83
7016 -83 284 -39 222 -197 12 14 94 66 126 188 -128 118 112 -89 131 -197 15 279 30 181 204 -184 102
7039 102 170 0 49 254 -29 114 120 -254 -19 93 -16 -81 -169 -207 -79 15 -52 107 -59 7 -19 23 -43 -56 -108
7064 -108 -18 -208 202 155 -207 332 156 229 34 -239 161 -35 -54 -166 -83 -321 -87 99 141 2 -75 263
7086 263 81 -80 -14 40 95 160 10 -62 33 -36 -85 -145 94 19 -181 218 -91 103 123 38 85 107 -438 -69 -97
7111i7M8K54r0m3l38L20m5j44J15o0J11J19K3j63K35m8l44K27m8J11l74K96Qk77
7135b04N05k24j83O9k6R2p3j21J72j66j77L74q6P5J44J63l06j56K08r3R9r1J36
7158A31K89n46K14J01l05R8n7J71k3K01r8j31n1K09l47o6M39k65J5K79j09qk14
7181g3Q0j3Q0j77j20L63j64p9q4O0M1J67P0k92P5Q8o3q9j38L05M2n1J6o9J07r6
7207a4Q1M3m6Q4r3K64K5k01L2m74K22o2K98m22J00M23k58j42j57J14J08P6J39
7230A40Lk21r2J2P8J96j59l9K30k90J00K1Q4J35m49L87o1j3o2l1J87j92N0J27
7254A41l81N1P9j54L60j09N2m19L72j19K21ll9j88J23Q4L6j71j55K80k1J20l23
7277a63K16pj66k5J6N43k21k26J70l38k3K66m34M39l3M0l70N18k87l2K53j77J0
$$ plain form
7111 -97 -49 205 115 72 -266 54 9 -135 -20 -80 31 150 173 10 245 197 -147 80 32 143 -231 65 73 -204
7135 -204 301 77 -106 -37 -63 29 -44 -165 7 -159 -336 38 -48 27 171 334 28 -128 80 -13 86 -5 131
7158 131 420 -126 88 189 -116 -18 -75 96 73 274 176 45 -6 203 -144 -210 229 -36 -21 258 149 141 -73
7181 -73 7 -6 74 -103 -223 140 -24 -103 -187 -127 -86 81 151 -141 -66 22 -41 -130 -268 37 79 28 44 -25 82 -14
7207 -14 67 110 64 148 55 319 344 143 175 -299 -77 -139 159 -263 -163 260 2 -140 -297 -183 -75 1 140
7230 140 143 -78 -170 -158 -80 116 -43 -82 148 -142 -42 -21 63 198 -251 136 75 62 0 -31 156 -36 14 141
7254 141 -240 -189 -110 -264 96 -13 39 -380 -8 -127 94 91 52 -136 -13 71 107 -64 -219 61 40 160 -163
7277 -163 53 46 -120 -145 -129 414 193 -33 137 -201 -224 42 -392 47 14 54 -316 202 -85 -117 136 -41 -31
7300c1K55l92J22J55l13J48k08K60l58L15R8j24k7M7J78j53K15j16j46K68l31
7321a38K4J58j83L03j33o9JJ85k47M61m09Q8q9j82J31j93J97J3L92m45J74j56
7343a17K26m16K70J28j08j1k39K87j3o6R1k05J41l5K17k89J94q6O1J43k83J44
7365C4q3J8M7j5OO5j37K40j45j38R9J87j49L0j19K51j44k61J36J48R4k52R0k4
7389b2j55K23o6K42l85kN8J17n6N0k23L2M23k42m4K43j64j52J96l9J2r8J44P7
7413A69l42L74ql13k2K35n2j44Q4N6j42j08L05j37M3J07m1p0j80J93k15O0M9j04
7437b03K07J5R7m8nJ37k85rJ11k03J98j58Q3j6J07j2k2O5L1Q8Q8j7l47KK1J03
7463B8j5J10m8j9q0J10k69N00l10L3K30n85M28j49l3j80J08j1j24J84J79J3r3
$$ plain form
7300 -31 224 -168 -46 109 -204 -56 -264 -4 -362 -47 51 -73 -100 -53 125 -28 187 71 -75 193 -138
7321 -138 -114 44 -139 164 31 -38 -37 148 -99 362 -47 41 -48 -230 -99 -292 -95 -82 310 -135 39 -117
7343 -117 109 -307 -37 91 -17 -28 -267 20 7 -59 32 -173 -32 -67 150 -139 55 -31 30 173 -110 34
7365 34 -49 -31 16 1 7 72 -65 175 30 -108 -9 178 29 59 -60 191 47 -214 -78 70 164 -88 2 -22
7389 -22 -177 46 -20 222 -163 -165 -107 10 -46 4 -219 -187 236 -6 -50 193 29 -123 73 34 46 -52 92 169
7413 169 -173 201 193 -120 -142 93 41 -103 -19 37 -105 -213 92 -45 -2 105 64 -6 -186 7 -208 -148 -99 -203
7437 -203 4 19 116 68 63 200 -85 -94 17 -186 12 -146 -63 -79 28 16 -6 59 90 178 266 249 -98 -96 -75 28
7463 28 13 123 75 56 -24 86 -183 317 7 40 270 -315 113 -36 -69 -249 -141 -152 -276 -92 87 100 7
7486Gk51J34J06j89K5J42J31j01l53L30J40j87K50j27k81M55k38k68M30k27J34
7507F2j24L28j32J67m20J32m5k3j23J12J97M6r9Q6j84r7L26m63r2M72l36M67l24
7530f7j3K58n7k10J37k5j80J88J86k55l5n7o9J16q1lq2K05J88o7k66K16j46J97
7554G8k02L5P2j07J85j01N6K13m42J33k3lJ84k16P9J45j5j99J60j34L04m45M49
7577B06k50K52j07j66k14J81J52P1J66k26j16P1o0J18J47j38K6K3j9p1k09J0o4
7600b17P0J3K36J3k43J39J8L9j57K63n8j94O7K41j57K0L5N6j75j96K26J38m00
7623b23Q5L35j26J24j62R5o8p7n1K5J35k18M36l21j04L56j76Rk05J70k0k8nQ8
7647G4M4j65O7k37K69L6j57J0j06K90k88J19JR5o6r3j71J91K55l26m9o1M00m12
$$ plain form
7486 7 -244 -110 -4 -193 -168 -26 105 4 -349 -19 121 -66 184 57 -224 231 -7 -275 155 -72 62
7507 62 -62 266 134 301 -119 13 -32 -55 -178 -66 131 177 78 164 -20 -117 209 -254 -346 126 -210 257 -67
7530 -67 -80 178 121 -89 48 23 -157 31 217 -38 -73 -130 -199 -83 -164 -167 -249 -44 144 77 -189 27 -119 78
7554 78 -124 -89 -17 -124 61 -40 16 229 -213 -80 -103 -106 78 -138 -59 86 71 -128 32 -102 202 -243 206
7577 206 -44 208 101 -65 -279 -98 54 125 291 65 -51 20 -40 78 225 87 113 136 117 46 -163 -153 -217
7600 -217 -147 -134 102 115 -128 11 29 68 -89 174 116 -78 -11 230 73 93 128 184 9 -187 39 177 -223
7623 -223 -138 197 71 195 33 128 60 -17 -68 -43 92 -126 310 -11 -115 241 65 74 -131 39 19 -9 -14 74
7647 74 118 -47 20 -217 52 88 -69 -59 -165 125 -163 -44 -43 52 -14 -107 -278 -87 168 -158 -207 -268 132 -280
7671b80O33l89K05j27K7R7j78K76m07J81oJ37j49j47p0N46n92K55K8O4J8j72J50
7694A00K7j72j43J82M56m64k28K61j52M9L57o3Jm34r6L18m0o0j78K39j56M69m98
7717b25J71J72rj19q7J54J78p0m2K30j98j88OM1j55K66j16K16m42J17Q6oJ04j9
7741F5k34P4o1J70J31K4k06r3P7J73k60J50J7J8r5P9n6O0J32o1k29J31K8R2p5
7766E1j57K14nj59o4J07J92J24n51J81O5m2L4k34M30m2k91J52j05J03L62k35k22
7789i2P6K03j08j25J40J81j83q0J49r0k15L2m8n5K32n0K22r1K33m14J14p2j0j12
7813a63K81j02j74K26J2L4m14L59r5N6l11K14j00K4J64J86n6n6Q9k80J75k22J18
7836c5j56P0J50J03K01k3k87k0p6l39K38J39J45J06j22ok45O5J07k01K30L2M6
$$ plain form
7671 -280 353 -36 169 42 69 166 -12 264 -143 38 32 169 20 -127 -197 349 -243 12 40 104 122 -50 100
7694 100 127 -45 -188 -6 450 -14 -242 19 -133 -84 273 210 211 -223 -319 -1 -41 -101 -279 -40 -196 273 -225
7717 -225 -54 118 109 -10 -97 57 235 165 123 353 155 -33 -27 14 -141 125 9 225 -217 -100 -14 -20 84 65
7741 65 -169 -95 -156 14 145 169 -37 -130 -53 120 -140 10 27 45 -50 29 -27 33 165 104 -125 6 34 126 51
7766 51 -106 108 103 -56 -120 -13 179 303 -248 -67 -2 -44 -10 -244 186 144 -147 5 -100 3 365 130 -92
7789 -92 -16 187 79 -46 94 275 92 12 161 71 -144 -112 -160 -215 17 -33 189 98 331 -83 31 -41 -51 -163
7813 -163 118 16 -158 68 80 114 -300 59 -36 20 -291 -77 -177 -153 11 197 141 85 174 -106 69 -153 -35
7836 -35 -191 -121 29 132 333 310 23 3 -73 -412 -174 -35 110 216 94 88 -157 -92 15 -186 44 76 122
7859A22m5k49K43j4p0k93L71J2j11j07j60K35Q3o4J37K4l26K17J90j85o1PK27
7882A83l45L62k64N6Jq1L3nJ30j72J65N4k38n9L3j2m5j01M02j79K28j78m4p1J71
7907B4m3J82L6k83J26J39j50l09L53M4p5J45j53j80pJ05J91k07P0k06J34K17j08
7930D5l43L19j26J52M2m04N49k81J54p3Q1m63O54l33j86J53o3K19k01rM1J19J09
7953A55j94J26J28k16j47M2k7J48j25M16l04j02K58r2k06L27k3L7l37K12Q4k24
7975f4j35L07r9K45o83M43J88k59K20m20O71n44J40m82N02k20L24j15o7J49j56
7996e5j0N0j73M08k07K68n03K25j5J65j91j10o5J81O9k78M43j46q2J49k1m3k9
8019C0j25K09j84J47k17J25q7J89N5P1k99M3j40L89k83l3M24j97k06M66l63j59
$$ plain form
7859 122 77 -172 71 57 -13 -306 65 77 -34 -141 -301 -66 17 -47 90 114 -212 5 195 10 -51 -44 183
7882 183 -162 200 -64 -8 -7 -88 -55 -60 70 -102 63 117 -121 -180 -147 -159 -204 -305 97 -82 146 -32 -76 -147 24
7907 24 -19 163 199 -84 42 181 31 -278 75 119 44 189 36 -144 -151 -46 145 -62 8 -198 -64 153 45
7930 45 -298 21 -105 47 89 -315 234 -47 107 34 115 -348 306 -27 -213 -60 -123 96 -105 -114 -73 46 155
7953 155 -39 87 215 -1 -148 -106 -133 15 -110 306 2 -100 158 66 -140 187 164 201 -136 76 160 -64
7975 -64 -199 108 9 254 -429 14 202 -57 163 -257 414 -130 10 -472 30 -190 134 19 -48 101 -55
7996 -55 -65 -15 -188 220 13 281 -222 3 -12 153 -38 -148 -213 -32 37 -241 202 56 -26 123 102 59 30
8019 30 -95 114 -70 77 -140 -15 -102 87 142 213 -86 -43 -183 206 -77 -110 314 117 -89 377 14 -145
8041a45J8N7K38J76l27k74N37m36r3N38k98K44k56j62M94k51Pl28M00j76k23L82
8063A22r6n1J92o7m0k3k9m1j57K68J00l01j9M49k93L0J00k69L02k45K0k17J75
8086i0L6j08K94l40J10J72n1K4j8R9n9p5Q8j86K27j54J25K0PK48l06K48k47o6
8110bk81M74q6k78K45r9R9m72K36n7L5Q6Q9Q1ML1m9j98L87j31k67K37j65N0M06
8135C75n15M0j4K81j62Q7J17l73J37P3K54j11L5N5k07j98K8p0K48m2J09J13J32
8158C92k13r8l41K14n6L0N0O4q9n9J80j49K12n5o0q5p9K55j45k0L15k71jk6j05
8183a40N1K60k08k7P3j81K76L3
$$ plain form
8041 -145 -127 -70 168 344 17 -257 280 -156 -249 289 -9 235 -21 -183 311 60 67 -261 139 -37 -260 122
8063 122 26 -25 167 100 60 37 8 -33 -190 78 178 -123 -142 307 14 44 144 -125 177 -68 -48 -265 -90
8086 -90 -54 -162 132 -208 -98 74 23 47 29 128 69 -6 82 -104 123 -31 94 114 121 369 63 311 64 -2
8110 -2 -283 191 105 -173 72 -27 72 -400 -164 -221 -186 -100 -11 70 74 105 56 -142 245 114 -153 84 -81 -31 375
8135 375 -140 -100 -114 167 5 92 209 -164 -27 46 300 189 224 279 72 -126 -98 -168 80 38 147 260 392
8158 392 179 81 -260 -46 -102 -72 -22 42 -47 -106 74 -75 137 82 22 -63 -142 113 -32 -52 263 -8 -9 -35 -140
8183 -140 -89 171 -37 -64 9 -172 104 137
8191A37
$$ Imaginary data points
##PAGE= N=2
##DATA TABLE= (X++(I..I)), XYDATA
0@%%%%%%%%%%%Qj6J6k4L2m0M8n6P2q3R9j20J36j60J92k24K56k96L42l90M43n02
33b67N70o45P27q17R15j023J143j273J416j572J740j925K128k352K595k858L149
50A651l470L823m212M645n131N677o296P004p823Q785r930J1326j3070J5315j8338
65a0044K2644k9318M1148o8366K48358Q2188l60229M1861r3372j40389P7447J79553
77h519N931R8532R9574j10555j50605K1384r8394j29641J22055J57466J6195J43905
89A67328J09478j20921j08615k9816j20109o1454P1141N7227M2338J18208M2242
100A67047j11123o8366k3119j33425p3143R0427R1634J05058J29719J7281k8006
111A63984k7434j24969j22519m647J4612J6766J02968J12956P593j8793j8998
$$ plain form
0 0 0 0 0 0 0 0 0 0 0 0 0 8 -8 8 -16 16 -24 24 -32 40 -43 56 -64 72 -88 104 -120 136 -160 182 -208 235 -267
33 -267 303 -342 385 -432 483 -540 603 -670 746 -826 914 -1011 1117 -1235 1360 -1498 1651
50 1651 -1819 2004 -2208 2437 -2694 2983 -3313 3691 -4132 4653 -5277 6049 -7021 8294 -10044
65 -10044 12600 -16718 24430 -43936 204422 286610 -73619 -31758 -125130 -265519 -188072 -8519
77 -8519 -2588 95944 195518 84963 -65642 -44258 -142652 -272293 -150238 7228 23423 167328
89 167328 276806 155885 47270 17454 -102655 -164109 -92968 -35741 6597 124805 167047
100 167047 55924 -12442 -35561 -168986 -242129 -151702 -60068 44990 174709 191990 163984
111 163984 136550 11581 -110938 -115585 -100973 -84207 18761 131717 139310 120517 101519
122A01519j38726j37466M123j8665k060J74557J21198k1540N1549L4139j27041
133D1587j01570K601l2099j3472J17806R2766j5881M1517J8034j53183r8880J4988
145h5786o3103j1625J33450O5542L170P0442J2486j11202p2488L556l9133r419
157a04110J13860P1946K134O4116k295j32162p1722k3726o4967j653Q1338P0010
169B769N2653N1867m11p1253o0671k9476n4073l730P9431O2517N6607N8967j7230
182A27967n1832m8842q1563n9109K118K9906N3701O2358M1510K978l1441m2074
194E677o1328m5088J8670K4520L6663Q9874M2918j7448l517m7339q9455l5786
206h1639J052L692L9868P3367M0529j4442r729k5196q3488m0830J6165p062M4328
$$ plain form
122 101519 -37207 -174673 -170550 -189215 -191275 -16718 104480 82940 134489 168628 41587
133 41587 -59983 -57382 -89481 -102953 14853 107619 91738 133255 151289 -1894 -100774 -85786
145 -85786 -148889 -160514 -27064 38478 41648 112090 124576 13374 -59114 -55558 -94691 -104110
157 -104110 9750 81696 83830 147946 145651 13489 -58233 -81959 -146926 -148579 -67241 2769
169 2769 55422 107289 106878 35625 -25046 -54522 -108595 -112325 -32894 29623 86230 145197 127967
182 127967 76135 27293 -54270 -113379 -111261 -81355 -27654 34704 76214 79192 47751 5677
194 5677 -55651 -100739 -82069 -57549 -20886 68988 111906 94458 90941 43602 -45853 -81639
206 -81639 -80587 -76895 -37027 36340 76869 62427 52698 27502 -55986 -96816 -80651 -87713 -43385
219d3385J00021L3399k28J3197l9823q0860m7535r898m321K6299P4111L7274o316
232E1935K2926k2050q8787l6742m062j6499L6202O6175L9104L0049J6716k7953
244F7014o2748m1986p948j6279J1140N8873L1388J5425J9918l4591n5289k8562
256d3645l1325j1645K9393M4835N0732L2774O448j8350m5143l6960k5491k0678
268f9055K2501M1687L1900M1153R101k9602k5899m6736n2390r007J5672L2158
280c8517M7688L9209K2577r278k9478l0855m1864j7701J5248J0695L6164N1801
292E5689O689r430j4391m3842l9114j9388j435K5378L4962L5432J8741r125p836
305C2330k5220m3482r813N626J0084M2182L3856J0574N247k0710l8573l7158k9770
$$ plain form
219 -43385 56636 90035 89807 103004 63181 -17679 -65214 -75112 -79433 -53134 20977 58251 51935
232 51935 74861 52811 -35976 -72718 -76780 -93279 -57077 9098 48202 78251 94967 67014
244 67014 4266 -37720 -45668 -61947 -50807 8066 39454 54879 74797 40206 -15083 -43645
256 -43645 -74970 -86615 -57222 -12387 38345 71119 77567 59217 14074 -22886 -48377 -69055
268 -69055 -46554 -4867 27033 68186 77287 47685 21786 -24950 -77340 -86347 -70675 -38517
280 -38517 9171 48380 70957 61679 32201 1346 -40518 -58219 -42971 -32276 3888 55689
292 55689 62378 52948 38557 -5285 -44399 -63787 -65222 -39844 -4882 30550 49291 40166 32330
305 32330 7110 -36372 -46185 -40559 -30475 11707 45563 56137 61384 40674 2101 -35057 -64827
318f4827L456K2115K6156L7506K0434M511k788l7364m0147j5273r320J4780L1310
331i451K8532L7359J5426j9852k7549l6518k8557q952k653K1679L4455K0324J7909
344D2152k565k7337j9911k3014j8469Q005J7121K9992L1438P578q50j7229l2340
357e429j6225j5222n927K5313K3157J6121J8637n770j8470k2131k7572j1173j02
370d4793J6630L7116K2165J5362J0611k5549k8465j6345k5774o691J8160K0439
382g134K6330J7877L377p904k7899k4000j7974j9042J3745L1532J7968K3075J2440
395D2391r132j1532k4317k3105l386J301J6970K2619Q849J3514J939k3024k0751
408g664j9981j0686Q931J2534K0605J9138L011N409j4006l2248n962k863q329
$$ plain form
318 -64827 -61371 -39256 -13100 24406 44840 49351 46563 9199 -30948 -46221 -55541 -40761 -9451
331 -9451 19081 56440 71866 52014 24465 -12053 -40610 -49562 -52215 -30536 3919 24243 42152
344 42152 39587 12250 -7661 -30675 -49144 -41139 -24018 5974 37412 44990 44140 26911 -5429
357 -5429 -21654 -36876 -42803 -17490 5667 21788 40425 34655 16185 -5946 -33518 -44691 -44793
370 -44793 -28163 8953 31118 46480 57091 31542 3077 -13268 -39042 -45733 -27573 -7134
382 -7134 19196 37073 40450 32546 4647 -19353 -37327 -56369 -42624 -11092 6876 29951 42391
395 42391 33259 21727 -2590 -25695 -29081 -27780 -10810 11809 20658 34172 36111 13087 -7664
408 -7664 -27645 -38331 -29400 -16866 3739 22877 25888 31297 17291 -14957 -20919 -23782 -32111
421c2111J8924K2353J1919J4030J012j7414k8063j9130j798p901O927L5978J4769
434A9495M936J4663j7053k5757o103j4355j0734J2694K1764J9747J1347R428m938
447C5134k9249j5917o496j9696O766K4544Q559J3385J0133j0093j0448j4354j4478
460b2210m679j574J5682K2382Q477Q416k135j6011j1059j5484p798Q880O947J5909
474E743J6728m535K66k825k4093j1917k625m402J4421K1869J2185L549l77r28
488B3059k2527k4840N806M48l472K6666J3228m257J1916k884k5939j4740m838
501b2374l365Q84J6875K2056K134M553O023k4797j5341O944j1325j806J9722P686
515G869O942J0192l147j5618j6269l819l139p646J5358J8728Q09O831k71j6469
$$ plain form
421 -32111 -13187 9166 21085 35115 36127 18713 -9350 -28480 -30278 -38179 -31252 4726 19495
434 19495 24431 39094 22041 -3716 -9819 -24174 -34908 -22214 -450 19297 30644 40072 35134
447 35134 5885 -10032 -16528 -36224 -29458 -4914 3645 17030 27163 17070 6622 -7732 -22210
460 -22210 -26889 -28463 -12781 9601 18078 26494 24359 8348 -2711 -18195 -25993 -17113 -10166 5743
474 5743 22471 17936 18202 15377 -8716 -20633 -23258 -27660 -13239 8630 20815 24364 23987 23059
488 23059 532 -24308 -18502 -18054 -21526 5140 18368 14111 26027 23143 -2796 -17536 -22374
501 -22374 -25739 -24855 -7980 14076 16210 20763 26786 1989 -13352 -6408 -17733 -19539 183 7869
515 7869 14811 25003 21856 6238 -10031 -13850 -16989 -24635 -9277 9451 10260 17091 16820 351
529C51n222p328r391O983P779R698J4336L322j394p977j5767p399p893k890J2535
544a0257R805J2129Q251j0000k835k659j8838m045M666m56J2975J5231M176P87
558A8930l318p135j5910j1596Q679J796J53K1122L619j2286P824m267k0304m083
572a6776K866O09O706J4300R567m885J516J186k5516q803J4587o620M67K1587
586A0791K088m725O033o666j5951p287K075j515j134J8782J1652o047R055j761
600A5390k4830N22O613j0816M526J3918K679K160K891k818j2213q586K111o404
614a4857m02J7599M383M43Q885j1070r270L695r013k926R793M014N435P749M82
629A4940o671p326k542q779r872J1312Q241j078J4895J535j4247M472l923j5439
$$ plain form
529 351 -4871 -12199 -21590 -14607 -6828 2870 17206 20528 19134 11157 -4610 -12009 -19902 -22792 -10257
544 -10257 -452 11677 19928 9928 7093 4434 -14404 -18449 -13783 -14239 -1264 13967 18143 18930
558 18930 15612 8477 -7433 -19029 -10350 -8554 -8401 12721 16340 4054 11878 7611 -12693 -16776
572 -16776 -13910 -13301 -6595 7705 17272 12387 13903 15089 -10427 -19230 -4643 -11263 -10796 10791
586 10791 12879 8154 14187 7521 -8430 -15717 -13642 -15157 -16291 2491 14143 8096 17151 15390
600 15390 -9440 -8918 -2305 -13121 -8595 5323 8002 10162 13053 10235 -1978 -10564 -8453 -14857
614 -14857 -15259 2340 6723 7166 16051 4981 -4289 -594 -9607 -12533 -2740 1274 6709 14458 14940
629 14940 8269 943 -1599 -10378 -20250 -8938 -697 -1775 13120 14655 408 4880 957 -14482
643a4482L827O676j973P268J1688J57p320K595j825k1700j753J5394o849L053
657e244J8429p458n619R391j0642j2600O137L856l747N936J3630j483o298Q702
671A2990q314k0638R183M622j0397J3275J0113p674L601K724j2191o331L085Q93
685e059m577O088J2925j446J924M756j5220o195O490r670K81J3427j725N58O972
700I529l895o604k314q72l921k449Q671N265R42Q823m673j1753N589m712j0618
715a2992R082M291k504P793K310n564j709l42n226p708L683P698k081Q529R108
730A4368j1233j013N357j3086l475Q077k371J711P122M83k169k85Q00q461q474
745a2649P980J852k764J1943J632n960O381m225j0266L492P63k318L813L453K118
$$ plain form
643 -14482 -10655 -3979 -5952 1316 13004 13161 5841 8436 6611 -15089 -16842 -1448 -8297 -5244
657 -5244 13185 5727 108 9499 -1143 -13743 -7606 -3750 -7497 -1561 12069 10586 4288 12990
671 12990 4676 -15962 -6779 -2157 -12554 721 10834 3160 6761 9485 -2706 -9037 -5952 -5059
685 -5059 -9636 -3548 9377 7931 9855 14611 -609 -6804 -314 -9984 -9703 3724 1999 2557 9529
700 9529 5634 -970 -3284 -4156 -8077 -10526 -1855 3410 4352 13175 8502 -3251 2338 -2374 -12992
715 -12992 -3910 381 -2123 5670 7980 2416 707 365 -4861 -12569 -8886 -1188 -3269 5260 14368
730 14368 3135 2122 7479 -5607 -9082 -1005 -3376 -1665 5457 5940 3771 3486 4286 -4175 -12649
745 -12649 -4669 -2817 -5581 6362 7994 2034 8415 4190 -6076 -2584 -1821 -4139 -326 3127 5245
760E245r51N99o37j0935k208N348m909L505R518k625K877L324q137k120O29k493
776c970J240J081L090L863J89J819m639p344L095m016n157Q482K527r65O548k265
792C578m533R24j895o92n62M93M882J326J894K999p231j657J392q206L17N570
808a401m71M188K170l361P48j130j974j356k977L704M099p53N855K03m540J298
824D302n024n812K868K33J082M121j478J179R34k731M02m422k798M848p5J586
840g85N565r31J150J87o706o10K57j156L268j115R3M280k329o49l75n244J930
857c170R98j720M812K553j91K850m378l220R79k338K140J485k658M722J408k600
873A672J032l672l161J487l043J005M646J481M156o95m007J499k224k699K149
$$ plain form
760 5245 4294 4893 4256 -6679 -8887 -3539 -8448 -4943 4575 1950 4827 8151 14 -2106 -1477 -3970
776 -3970 -2730 -1649 1441 5304 5493 7312 2673 -4671 -1576 -5592 -10749 -2267 260 -705 5843 3578
792 3578 -955 -31 -1926 -2618 -3180 -2687 2195 3521 5415 8414 1183 -474 918 -7288 -6971 -1401
808 -1401 -1872 2316 4486 1125 1873 743 -1231 -2587 -5564 -1860 2239 1486 7341 7544 3004 4302
824 4302 -722 -6534 -3666 -3433 -2351 1770 292 1471 2405 -326 76 -4346 -7144 -2296 -2371 -785
840 -785 4780 3849 4999 5186 -1520 -2130 -1873 -3029 239 -876 -783 3497 1168 519 144 -5100 -3170
857 -3170 -2172 -3892 920 3473 3282 6132 1754 -1466 -487 -2825 -685 800 -1858 2864 4272 1672
873 1672 2704 -968 -4129 -2642 -5685 -4680 -34 1447 5603 4908 901 2400 176 -2523 -374
888c74k653R28M755q50J222J044l606J02k748l111K069l91L013L978l721R08K106
905B671l547J014o34k775L970K26r73K517j372j93l71m512J087J037J39M658j694
922A248j326L511l341k004J874l120Q40L308q77K460J590p40O70m169l104R96
938b184j874L307J636k875M638J526m143J818j393l185K192j701j98L013J091
953A668K068j629k748J638k693j145L746l049j17N145l277j72K055l037N36Q08
969b03k268J389J520K318J029m136M47R47m452K604L41k421N211ml343L279o68
986A590k512O41k081k76J187J298L864j526j469K915l850r65J995m005J830L691
1002B327l782J135L308k004P14j549k654P29R5K389N69k188L440k9m667K683j001
$$ plain form
888 -374 -3027 -2099 2656 1806 3028 4072 466 568 -2180 -5291 -3222 -3613 -600 3378 -343 565 2671
905 2671 -876 138 -496 -3271 699 925 -48 2469 1097 904 533 -3979 -2892 -1855 -1716 2942 1248
922 1248 -78 3433 92 -1912 -38 -3158 -2318 990 113 2573 4163 3423 4093 -76 -3180 -2184
938 -2184 -4058 -751 885 -1990 2648 4174 31 1849 456 -2729 -537 -2238 -2436 577 1668
953 1668 3736 2107 -641 997 -1696 -2841 905 -2144 -2261 2884 -393 -565 1490 -1547 -1011 -203
969 -203 -2471 -1082 438 2756 3785 -351 96 1043 -3409 -805 -464 -2885 2326 2322 -1021 2258 1590
986 1590 -922 -281 -2362 -2638 -1451 -153 3711 2185 716 3631 -219 -1184 811 -3194 -1364 2327
1002 2327 -1455 -320 2988 984 1698 149 -2505 -1776 -1681 708 1277 -911 2529 2500 -2167 516 -485
1019d85k090L986j384j830L550q01j59Q18l201o38j24P91K305j874J576L438m342
1036d64k18J613l033J694J382m211K486K513j017J737j435j524k51j199J660n93
1052h60j034M833j626k642L935k163j896L664k859j943L342k73R18K37j567N72
1068F38j610k51J094j961K672K377m473J271K182l281J725Q7l350J765Q68O99
1084D52J175j060P42o81k881J478k74r33L866k075j167L236j716L04J312l673
1100a895j05J658n45J491j51p0K391k467q28K99j350K039K93k801K812L31k334
1117a232L247o45k801J819o16K3P94k91J578m36k098J361j923M05K952k896o83
1134a442L120j914M93J424k639o3L35o98O83n60J985J942l695J274J102l348J846
$$ plain form
1019 -485 -2575 1411 27 -1803 1747 946 787 1605 -1596 -2234 -2358 -1567 738 -1136 440 3878 -464
1036 -464 -682 931 -2102 -408 974 -3237 -751 1762 745 2482 1047 -477 -728 -1927 -267 -860
1052 -860 -1894 2939 1313 -1329 2606 443 -1453 2211 -648 -2591 751 478 1396 1633 66 638
1068 638 -972 -1223 -129 -2090 582 2959 -1514 -243 1939 -1342 383 470 -2880 -1115 -247 452
1084 452 1627 567 1309 628 -2253 -775 -1049 -1982 1884 -191 -1358 1878 162 466 1778 -1895
1100 -1895 -2000 -342 -887 604 453 383 2774 307 -521 -222 -1572 467 760 -2041 771 1102 -1232
1117 -1232 2015 1370 -1431 388 -228 -205 589 298 1876 1440 -658 703 -1220 -815 2137 -759 -1442
1134 -1442 1678 -236 257 1681 -958 -1021 -686 -1384 -701 -1261 724 2666 -1029 245 1347 -2001 -155
1151a55P23l099K274Q29o56J625j362l1M35j544N36r60o77M380j602k516K921
1168A121p07q12J859j378q94J370j119J187l85p8J715k283r91J618j852K044J783
1185B198l392J240J248k131J268k78j495J376m88P09N14j005K336Nl316J052m96
1202f55j387K624j139j117K577p74l64J019j603R82n54j005J186j013J307K138
1218B222k738J2J387k160J484J238k542J011M65j334J459r72o1J230j590O70k
1235b21p31L387j061k555J891j118o51J964j539J13J769j038N71k80r30J291o08
1252B54j671Q16q13J431J907k170R72P75k145J457j84j738J488m12q16R30n56
1269d75R34Q70k116K33k81m44K157j196j120K538j885R9J459j786R12J364j599
$$ plain form
1151 -155 568 -2531 -257 572 -84 1541 179 148 583 -961 -425 -1385 -2062 2318 716 -1800 1121
1168 1121 414 -398 1461 83 -811 559 -560 627 242 164 1879 -404 -1395 223 -1629 415 2198
1185 2198 -1194 46 1294 -837 431 153 -1342 34 -454 255 769 -236 2100 2105 -1211 -159 -655
1202 -655 -2042 582 -557 -1674 903 129 -235 784 -819 163 -391 -1396 -210 -1223 84 2222
1218 2222 -516 -504 883 -1277 207 1445 -1097 -86 379 -955 504 -468 -529 701 -889 -219 -221
1235 -221 -952 2435 1374 -1181 710 -408 -1059 905 -634 -521 1248 210 781 501 -429 862 254
1252 254 -1417 -601 -1414 17 1924 -246 726 1501 -644 813 629 -1109 379 -33 -849 81 -475
1269 -475 459 1329 -787 -554 -835 -1279 878 -318 -1438 1100 -785 -686 773 -1013 -101 1263 -336
1286c36K89L66l58J152j186m29K63j011J768M20j917J868L29j969J201l03j067
1303i20J471l80l85K9J42J509k82j289N78q51k87J731j854J49J811j611J53P60
1321D74j337J047L75j102K22n45Q98J289j864N90N72j795J583l00j241K208o72
1338D02j306J058o50M7J357j200j24Q6m37J886n87r14J446j322l19J266j586P45
1356a52J563j542R1l9m06J549n21j281O97q97Q21P84j153J265K77j476O95k61
1374A4m99J561q23o86O52q32Q20R34j878N44j44o14J575q26l88J610j331L5J73
1393a03j184J701K27j269O23J7l40J318r35k24O37j267M45L53r88J366L32j038
1411c29L77p60J83J692j369r7M14p21J494j69j059J257n63r74R88r37P69O99q02
$$ plain form
1286 -336 -47 319 -39 1113 -73 -502 -239 -1250 518 938 -979 889 1218 -751 450 147 -920
1303 -920 551 171 -214 -185 -43 1466 1184 -105 473 -378 -665 1066 -788 -639 1172 -439 -286 474
1321 474 -863 184 559 -543 -321 -866 32 1321 -543 47 619 -1176 407 107 -1134 1074 402
1338 402 -904 154 -496 -449 908 -292 -416 -330 -767 1119 532 -382 1064 -258 -577 689 -897 -152
1356 -152 1411 -131 -40 -79 -485 1064 543 -738 -41 -938 -117 667 -486 779 1056 -420 275 14
1374 14 -485 1076 253 -433 219 -613 207 1141 -737 -193 -337 -951 624 -202 -590 1020 -311 -276 -103
1393 -103 -1287 414 641 -628 -5 12 -328 990 55 -169 468 -799 -354 -1 -989 377 709 -329
1411 -329 48 -712 -529 1163 -206 -303 111 -610 884 715 -344 913 350 -624 364 -573 196 895 93
1430I3l84K55k91J359r91n03R81o84k35J351j589Q75P72j707P02m09r6J183k59
1449D23n43N41r35Q31K39j302L36N61p40N36R7m92Q24j77j68j40n91J021M10j704
1469i73Q52L4k52J100q46j22N66o47L58R5j085J487N2r41M03m79j54J372o44k52
1489g6J82l96N11O5n87R23l03o64Q58r93K13J069n63m14K87n78N78j14n38N74
1509C4m17K87N19r95M91J057j113j36J46n36R71J31p74j4j39J08P92r92N56K42
1529B18q58P66M2m23Q93l92m48N40o71J99Q93p29K42k09n88R91p57l81J339j054
1549c87L17N17r36O46N88p42L41l24n30J003m9m58K81k30r2J56m15Q49n2j119
1569f36N85j43l26R42m06R9l61l67Q39L29q32Q13l92l92P25j138J92J158j004
$$ plain form
1430 93 -291 -36 -327 1032 41 -462 519 -165 -400 951 -638 237 1009 -698 4 -405 -501 682 423
1449 423 -120 421 -514 317 556 -746 -410 151 -589 -53 44 -448 376 199 31 -109 -700 321 731 -973
1469 -973 -121 -87 -339 761 -85 -207 359 -288 70 165 -920 567 619 -322 81 -398 -552 820 176 -76
1489 -76 106 -290 221 286 -301 622 319 -345 513 -480 -267 802 239 -175 112 -466 112 -2 -540 34
1509 34 -383 -96 423 -572 -81 976 -137 -273 -127 -663 308 439 -335 -349 -488 -380 412 -580 -24 218
1529 218 -640 126 168 -255 638 246 -202 338 -333 -134 759 30 272 63 -525 466 -291 -672 667 -387
1549 -387 -70 447 -489 157 745 3 344 20 -510 493 444 -14 267 37 -55 101 -314 535 483 -636
1569 -636 -51 -194 -520 422 16 115 -246 -613 226 555 -277 536 144 -248 477 -661 -469 689 -315
1588c15K74K86r82M57Q52q87M13l89j46Q52p78M73J46n98O59N7q10J114l29o32
1608b83N83p82J74N90l69j7J09k04M79o34RP15k62j31M13n92J92M72m80M2j7m37
1630d30P97j12p04P29k94l58J17k23Q52k66n05P90r07l0Q59k58p29J133o77k20
1650d36P96j75m38M04k81J04p22M53O46o56J08R14j479P14M60o76J91L79n12J85
1670b1J66k31M85m64O05p51n68J130k39n74O32l09l75O69j37m17N44l94N61n39
1690b27p0O22k22%Q0m27q7O39m65O6K28m59M48j73l34M21k48K95o6l11R5M82r7
1713A90J05n42J08L98m77nN26j79n41Q16o15R2k5K68j64j7l44O11k89kK10n09
1735c85L54L31n67L11R6o28N68o7R9J27j44P7p7n99M90L73n87N0J13j75O04m08
$$ plain form
1588 -315 -41 245 -737 -280 572 -315 98 -291 -437 415 -363 110 256 -342 317 374 -436 678 349 -283
1608 -283 300 -482 -308 282 -87 -104 5 -199 280 -354 -345 370 108 -23 390 -202 -10 462 -18 24 7 -430
1630 -430 367 255 -449 280 -14 -372 -255 -478 374 108 -397 393 -514 -544 315 57 -672 461 -216 -436
1650 -436 360 185 -253 151 -130 -26 -748 -295 351 -305 -197 717 -762 -48 412 -264 -73 306 -206 -21
1670 -21 145 -86 399 -65 540 -211 -779 351 112 -462 170 -139 -514 155 18 -399 145 -249 312 -227
1690 -227 -297 325 103 103 183 -244 -331 308 -157 -91 137 -322 126 -47 -381 40 -208 87 21 -290 -195 287 190
1713 190 295 -247 -139 259 -218 -223 303 124 -417 399 -216 -124 -149 119 -45 -62 -406 205 -84 -86 124 -385
1735 -385 -31 300 -267 44 140 -488 80 13 112 239 95 172 95 -504 -14 359 -228 -178 -65 -240 364 -44
1757d4k37N35n91K96J62l71M70k9k56L7k73k28P57l90K95rk87J43J43k08K99m1
1779A73k65M48o18K50K88l48K6J6k24K06K0k08K21k22K96J54j53l9L54k74n1k40
1801a90j42L28j23K75n3k89J14K61l85r0L97m71N99l89J51L54m80J66j25j15O8
1822a39M14m37L99m42J06J05j67m9L98l60m1K76j24m5J3J17J61j91m01N33p6K58
1844C08k17l29L18L6j99J2J66k6M9k29K4j76N37k82M8l24L64J79m45J32K27k85
1866a12j09j25j46P56m08L35m71l1J32L67k9R0m96L44K11n86O1O93m56K58k08
1887G0k00n1J73j2K27m56K03K02k43J22L09m81Q2Q7k19J50k07M16j74k59K58q8
1909i1J19M4M7r0M1Mj33Q5j40J82J41m68m4M31k13O6q0q7K53N4j50J04j01K2j83
$$ plain form
1757 -44 -281 254 -337 -41 121 -250 220 191 -65 -28 -301 -529 228 -162 133 124 -163 -20 123 -85 214 173
1779 173 -92 356 -262 -12 276 -72 -46 -30 -254 -48 -28 -236 -15 -237 59 213 60 21 375 101 50 -190
1801 -190 -332 -4 -127 148 95 -194 -80 181 -204 -294 103 -368 231 -158 -7 347 -133 33 -92 -207 -139
1822 -139 275 -162 237 -205 -99 6 -161 -210 188 -172 -213 63 -61 -106 -93 24 185 -6 -407 126 50 308
1844 308 91 -238 80 116 -83 -71 95 69 118 -111 -87 -263 274 -8 40 -284 80 259 -186 -54 173 -112
1866 -112 -221 -346 -492 264 -144 191 -280 -311 -179 188 159 249 -247 97 308 -278 -217 476 20 278 70
1887 70 -130 -181 -8 -20 207 -249 -46 156 -87 35 344 -137 -55 32 -187 -37 -244 172 -2 -261 -3 -91
1909 -91 28 72 119 29 70 74 -59 26 -114 68 209 -259 -303 128 -85 -19 -99 -186 67 121 -29 75 -26 -4 -187
1934a87L07n4k60M8M31j86k95o5N01j42L5j79j97L93j1l12L92L6n7r4k48J84j36
1957i6K62J6m26K03P8k28P0mJ18j93K52q0M2l27J41J87j59J62k05L32j39k0o2
1980g6K23p4p2J14k84K15j4n7M3K69l37m7J6p6L66l30J43l2j71L93k25j2j4O9
2004C0j3J30O7m26J48j15K68n3j59O6L7O6J71N2m61K03j75M5K97k98K44K23m71
2027a24K21o3j35N9r4J61p8J59J27k03K81l20j08jJ73k26n7N07m64P6K39l68J56
2050h2O7j7M02m60J48L61n47PJ65K5j71P2j38J5N1o6L47l24J96PJ0k60K8j8K10
2075B8P7j11j54L36l97K10j51K88Qk14K72k78r2K99Kj54J97k76J16O6j71K05j12
2098fp6K89k17K7L18l82m4J82j01j27J06j02p3L93m31L18k07K30J22l33n1K24
$$ plain form
1934 -187 120 66 -194 -146 285 99 -196 -261 240 98 133 -46 -243 150 139 -173 219 255 198 104 -144 40 -96
1957 -96 166 182 -244 -41 37 -191 -121 -125 -7 -200 52 -28 14 -313 -172 15 -144 18 -187 145 6 -14 -76
1980 -76 147 73 1 115 -169 46 32 -25 18 287 -50 -97 -81 -157 209 -121 22 -10 -181 212 -13 -25 -39 30
2004 30 17 147 214 -212 -64 -179 89 36 -123 -57 -20 46 217 269 -192 11 -164 -119 178 -120 124 347 -124
2027 -124 97 34 -101 -42 -136 25 -53 106 233 30 311 -9 -117 -118 55 -171 -228 279 -185 -109 130 -238 -82
2050 -82 -15 -32 370 -90 58 419 -128 -121 44 69 -102 -30 -168 -153 -102 -168 179 -145 51 58 68 -192 -164 -182 28
2075 28 105 -6 -160 176 -221 -11 -162 126 134 -80 192 -86 -178 121 123 -31 166 -110 6 72 -99 106 -6
2098 -6 -82 207 -10 17 335 -47 -91 91 -10 -137 -31 -133 -206 187 -244 74 -133 97 219 -114 -165 59
2120E9l17K89k7j24J42j46J18j65J56j01J51J6r6Q2K00k48J11j29j38J48J75o9
2142H7j43l09L41K3J65N2k77K07j64M3j68Q6o5J1L23k56j61K28Qo8j12L47l81
2165a83M88k60K5j7j51J54k5L2k80L6O8k22J91L31k02K37j83j14L88m33LJ86j59
2188i0j69L12K10n3m08K6M62l5l28J06l3K8j24n3L89k55r1l2K21NK10j86p3J34
2212A73j34J54k64k29K96Km4J69j6l36J64J50j2P3m97M90K40m61q4L8O2j6J85
2235A03j12r3K91j37J16l17K35j75L9J23j8j4J78k02j6P1k11J8J46J33j99K97
2257B56j46M9k31K82j60k53K57O9p0Q1o1O6Q8k47k6K96k14J76j34N3L94n90K30
2280A65l2j24j19R1j20L04k89K5P8Q3j61Lj69J82J02P9P9j99p1q9L56k42J00O7
$$ plain form
2120 59 -258 31 4 -120 22 -124 -6 -171 -15 -116 35 51 -45 37 237 -11 100 -29 -167 -19 156 87
2142 87 -56 -365 -24 -1 164 216 -61 146 -18 25 -143 -57 -122 -111 212 -44 -205 23 31 -37 -149 198 -183
2165 -183 305 45 70 53 -98 56 31 63 -217 -181 -113 -335 -144 187 -15 222 39 -75 313 -120 -117 69 -90
2188 -90 -259 53 263 210 -198 -172 290 255 -73 33 0 28 -96 -149 240 -15 -106 -138 83 88 298 112 39 173
2212 173 39 193 -71 -300 -4 -2 -46 123 107 -229 -65 85 73 146 -351 139 379 -82 -166 -128 -66 -82 103
2235 103 -9 -102 189 52 168 -149 86 -89 -50 73 55 41 219 17 1 72 -139 -121 25 158 -41 256
2257 256 110 159 -72 210 50 -203 54 123 53 134 73 139 227 -20 -46 250 36 212 78 131 525 -65 165
2280 165 133 9 -110 -19 -139 165 -124 -99 -21 62 -99 -96 -265 -83 19 98 177 -22 -93 -182 174 -68 32 99
2304I9k41J49L9J06j1m39K94K18n10J47Q2R8J60k41J61l3Oj45J2J04j93Q2r3P2
2328g7J8J04j59J79j16L7J46k09k91J43K30J24k76J64K30l38K13l5j47J18r4L21
2350B85n33p3K63J31j82L97l07k42J32J54o4J24j13M49o52K19J42q0n5M8J25N9
2372B27n7k15K71q8n01N19m06Q6K22n3j99J91j08J73J03M0j44K7k83L39o4j74
2394i4o5K00k7O1j95K66J10l42J50k8j43K89j66K1K3j64p0K76j91O4j99J33K14
2417A23j16m18Q28m73K67j88J07o8j67Q6J82l15N7K21k36j11M24n65M06o8J4L8
2439B8L35k39j13J28q4m1L5m9p2j47K79Kk72M77k70l11N02o01K86L70j19Qn3j71
2463i2K59l10N9O4j9O0K5k08K4N00k89r9k32K82Q3j55j61M95m21J29J27l94M07
$$ plain form
2304 99 -142 7 46 152 141 -298 -4 214 -296 -149 -67 31 191 -50 111 78 84 -61 -49 55 -138 -56 -149 -77
2328 -77 -59 45 -114 65 -51 -14 132 -77 -368 -225 5 129 -147 17 247 -91 122 87 -60 58 -36 285
2350 285 -248 -321 -58 73 -109 288 -19 -261 -129 25 -39 85 -28 421 -231 -12 130 50 -5 43 168 227
2372 227 170 -45 226 138 -363 156 -250 -164 58 5 -194 -3 -111 62 165 205 61 88 -195 144 80 -94
2394 -94 -159 41 14 75 -120 146 256 -86 64 36 -107 182 16 37 60 -104 -174 102 -89 -25 -224 -91 123
2417 123 7 -411 417 -56 211 23 130 62 -105 -19 163 -152 -95 126 -110 -221 203 -362 44 -24 -10 28
2439 28 363 124 11 139 55 14 49 0 -72 -219 60 62 -210 267 -3 -314 188 -413 -127 243 124 132 79 -92
2463 -92 167 -143 -84 -20 -39 21 46 -162 -138 362 73 -26 -258 24 107 -48 -209 286 -135 -6 121 -273 134
2486A34n1J03L5l69k02L44qq5J36j91K03J09o4o8K7j07j8L0k07M56l77L30n0k57
2510a47N6J09p9J42Q8k97J57j40K28K1q9n0K66l94L63j35N0j76k50L5J62KJ80
2533A02k7m35P79l28m62M53l75K78n2M3k64N30o09M36o8k31K54lk12M19l21J22
2555B9J25n60M58oJ47k80l5n0L86l23K0L61l10n1L95n29K87j9n8O8r7o1L70j99
2579F8M4om26J89K14j34k4K45N9k77j95J79R3J60l25J16Q0K2J85j34k0l49K0L84
2603A68k3k53J24k69j22K97o4pN43l46K21m29KJ55K3j71L6J08L31k66j44K07k39
2626a18Q5M16o15K04L12k58K89k33j94K93j87J96P7k41J8N3M1p8J16m28L66K58
2648C72m49J32n2j50K11j2o1Nj12P6K38j39n0q6Q8O2k50N4K73l89J78L20m08K98
$$ plain form
2486 134 83 186 221 -148 -350 -6 -14 -99 37 -154 49 158 94 26 53 -54 -72 -42 -249 207 -170 160 110 -147
2510 -147 -91 18 -61 81 169 -128 29 -111 117 138 49 -1 265 -129 234 99 149 -27 -277 -242 -80 -78 102
2533 102 75 -360 419 91 -371 82 -293 -15 -67 -24 -288 242 -367 69 1 -230 24 21 -191 228 -93 29
2555 29 154 -406 52 46 193 -87 -122 -172 214 -109 -89 272 -38 -89 306 -223 64 45 -13 55 -42 -103 267 68
2579 68 112 106 -320 -131 83 -51 -75 170 229 -48 -243 -64 29 189 -136 -20 60 82 267 133 113 -236 -216 168
2603 168 145 -108 16 -253 -375 -78 -142 -149 394 48 269 -160 -158 -3 20 -151 -115 -7 324 58 -86 121 -118
2626 -118 -33 383 -232 -28 284 26 315 82 -112 181 -6 190 267 26 44 97 138 60 176 -252 114 372
2648 372 -77 55 3 -147 64 52 -9 -4 -116 -40 198 59 9 -77 11 73 -177 -123 150 -239 -61 259 -149 149
2672A49l08J35J65l48J34N7j04j23K63r1L19j74J8J11k05j03J72l23K91j6j97
2693a78J41J94k32j20K67k08J96p5J75j03K73j17j59QJ84k9k11j98K0K40j61k09
2715c02L24K34l58K44k5j51J89n0j91K27p7j9K26k19p9L1j0K07r2l52N86k69J99
2738B73j62j36m8J45p3lP4j13K51m16Q0q7K98p4n0O8L6K1j7M5n5P5p4pk38K69
2764H2j03j16L61l72j07L88R6k50l3m40O15P9j27Q5l24K23j35k62L60j1j79L13
2786A43l14lJ39K07R4o1m77j26L55J79J55n33J62K65k18j97P0N3L60n3m81M88
2808B07M4r6q9j5j18J79p2J45O6m23K37m6k04M34Q9k67k7j02M6j14r2L88p7l08
2832b15J93k5J61j49J4M8L6m17K66J38J17j54k0j93J46L29k36K68l18P9j69j85
$$ plain form
2672 149 -159 -24 141 -207 -73 -16 -120 -243 20 -71 248 74 92 203 -2 -105 67 -256 35 19 -178
2693 -178 -37 157 -75 -195 72 -136 60 -15 160 57 330 213 54 62 246 217 6 -192 -172 68 -93 -302
2715 -302 22 256 -102 142 117 -34 155 105 -86 141 64 45 271 52 -27 4 -6 201 109 -243 343 74 273
2738 273 111 -25 -73 72 -1 -4 70 -43 208 -208 -128 -215 83 9 -41 27 63 84 67 112 57 132 58 51 -187 82
2764 82 -21 -137 224 -148 -255 133 229 -21 -54 -494 121 200 73 158 -166 57 -78 -340 20 9 -170 143
2786 143 -171 -174 -35 172 266 205 -272 -398 -43 136 291 -242 -80 185 -33 -230 -160 -107 253 200 -281 207
2808 207 251 155 66 51 -67 112 40 185 251 -172 65 19 -185 249 338 71 44 -58 -12 -126 -218 170 93 -215
2832 -215 -22 -47 114 -35 -21 27 63 -354 -88 50 167 13 -7 -200 -54 275 39 307 -11 68 -101 -286
2854b86K09O0j54L79m1l59K60Q0j47J79l02J15J54k66J51j59k3M56l34j04N50
2875D18n47K17J60n64L47J44k78K90k75K06j40m2J04j81J41J85q1o16N91K27m51
2896a45N65l53k32M1O4M05l41l01M56O9q9j23j28K25j28m0K3L02k80J51j18O3
2918H6j16J08j26j25mO3L0j73M73k05l03M48r7j98L52p82P52l26J56k43O44k43
2940A71J63k59m72K53MK71k13NJ75m9l29J94K05O2o0l36J99j57N7J76K65o65M70
2963A30J31k03J10k43m73P35l49J44J44l08M56j77j64K04j9m08L39k39L54K5J32
2984C21n39K55j1L4J34l86K65j47k47N50m07K07K10m81K45J35k74K09j69k8k9
3005a53M19l88L68k35J39m2j95J14J86k07K34k72RK31l24J11J34k88J85J1j6N02
$$ plain form
2854 -286 -77 -17 -171 208 167 -192 68 148 1 180 -122 -7 147 -119 32 -127 -150 306 -28 -132 418
2875 418 -129 88 248 -316 31 175 -103 187 -88 118 -22 -64 40 -141 0 185 104 -512 79 306 -145
2896 -145 420 67 -165 -124 -60 345 4 -297 159 228 139 16 -112 113 -15 -55 -32 270 -10 141 23 86
2918 86 -30 78 -48 -173 -177 -114 -84 -257 216 11 -292 156 59 -139 213 -569 183 -143 13 -230 414 171
2940 171 334 75 -397 -144 -140 131 -82 -77 98 49 -280 -86 119 181 121 -215 -16 -173 -116 60 325 -340 130
2963 130 261 58 168 -75 -548 187 -162 -18 126 -182 274 97 -67 137 118 -290 49 -190 164 189 321
2984 321 -218 37 26 60 194 -192 73 -74 -321 229 -178 29 239 -242 3 138 -136 73 -96 -124 -153
3005 -153 266 -122 246 11 150 108 -87 27 213 6 240 -32 -23 208 -116 -5 129 -159 26 37 21 523
3027E23o50L5L50j67k36L23k01j67K01p3j6J71k23MK34k35M22l32K44J88p39L97
3049E3R7j53j56O2j10lJ18m5Ml7L08k02r4M0j66K11J15k45J70R0n3l0j07qK39
3074I8j56r4K20m71L52jK90l98K09l25K14k09o4N46r1l42J75k43J58L52m10N2
3096a38K11k42M90k87po6p3K56k09R1K20J02o09l7J35j03M52K4j73n8j38J35K36
3119B12k99J04o7J76o1q2o4l7K73l6K28l12J41Q1l39M3J75k20L9o7J20K63k98
3142b7N1Rk38K70j44jl9J73j35J11k6l63L60j17K91k33l89O48k16k92K16j24L43
3165A28K5l12J87n7J50J16p4l29K09J0o4n4j20K74J75m41M6L00l61K37J30l65
3187a90J53L0K2p4J67R4j17j82N8k28J45J42J23j67K09J6k45j04J43K03l36j6
$$ plain form
3027 523 -127 -92 258 91 -145 178 -23 -190 11 -62 -78 93 -130 -126 108 -127 295 -37 207 395 -344 53
3049 53 150 -3 -159 -97 -207 -210 -92 -137 -133 -170 138 -64 -158 -118 -284 -73 42 -203 -33 57 4 -26 -133 -141 98
3074 98 -58 -152 68 -403 -51 -52 238 -160 49 -276 -62 -271 -335 211 120 -222 -47 -290 -132 220 -190 -138
3096 -138 73 -169 321 34 27 -39 -112 144 -65 26 246 348 -261 -298 -163 -266 186 210 37 -21 -159 -24 212
3119 212 -87 17 -50 126 65 -17 -81 -118 155 119 347 35 176 257 -82 -39 136 -84 -45 -112 8 271 -27
3142 -27 24 33 -205 65 -79 -80 -119 54 -81 30 4 -359 1 -116 175 -58 -447 201 -15 -307 -91 -215 128
3165 128 153 -159 28 -29 121 237 163 -166 43 53 -11 -65 -185 89 264 -177 -131 169 -192 45 175 -190
3187 -190 -37 -7 15 -59 108 202 85 -97 -39 -267 -122 20 143 -24 185 201 -44 -148 -5 198 -138 -154
3209a54J49P0j39L61l47j75N10l79J73L09l41j84qL6K34k19l59O33n70N5M79r4
$$ plain form
3209 -154 -5 65 -74 287 -60 -235 275 -104 69 378 37 -147 -155 -119 115 -104 -463 170 -400 -345 134 40
$$ [...]
8191e1
##END NTUPLES=NMR FID
##END=
