##TITLE=1H_DE-161_oil
 200.13Hz, DMSO-d6+CCl4.
 8 sc
 7.7.2026
##JCAMPDX= 6.0         $$ Bruker NMR JCAMP-DX V2.0
##DATA TYPE= NMR FID
##DATA CLASS= NTUPLES
##ORIGIN= UXNMR, Bruker Analytische Messtechnik GmbH
##OWNER= pz
$$ XWIN-NMR		Version 3.5
$$ Tue Jul  7 13:00:12 2026 Russian Standard Time (UT+4h)  she@DPX200
##.OBSERVE FREQUENCY= 200.1313
##.OBSERVE NUCLEUS= ^1H
##.DELAY= (6, 6)
##.ACQUISITION MODE= SIMULTANEOUS
##.ACQUISITION SCHEME= undefined
##.AVERAGES= 8
##.DIGITISER RES= 18
##SPECTROMETER/DATA SYSTEM= spect
##.PULSE SEQUENCE= zg30
##.SOLVENT NAME= DMSO
##.SHIFT REFERENCE= (INTERNAL, DMSO, 0, 14.3821)
##AUDIT TRAIL= $$ (NUMBER, WHEN, WHO, WHERE, WHAT)
$$ ##TITLE= Audit trail, XWIN-NMR		Version 3.5
$$ ##JCAMPDX= 5.01
$$ ##ORIGIN= Bruker BioSpin GmbH
$$ ##OWNER= she
$$ F:/spectra/data/she/nmr/H-C/1/audita.txt
$$ ##AUDIT TRAIL=  $$ (NUMBER, WHEN, WHO, WHERE, WHAT)
(   1,<2026-07-07 12:58:49.71 +0400>,<she>,<DPX200>,
      <created by zg, POWCHK disabled, PULCHK disabled
       configuration hash MD5:
       00 E9 B6 7A A2 85 ED C7 34 08 36 98 17 FE 4E 26
       data hash MD5: 16K
       3F 3D B2 7C 76 22 37 03 AD 3B E6 0F 41 91 D2 83>)
$$ ##END=
$$ 
$$ hash MD5
$$ 93 6A 40 1B 56 19 B6 E2 25 06 59 68 48 DA D2 FE
##$RELAX= 
##$RELAX= 
##$RELAX= 
##$RELAX= 
##$RELAX= 
##$RELAX= 
$$ Bruker specific parameters
$$ --------------------------
##$DU= <F:/spectra>
##$EXPNO= 1
##$NAME= <H-C>
##$PROCNO= 1
##$TYPE= <nmr>
##$USER= <she>
##$AMP= (0..31)
100 100 100 100 100 100 100 100 100 100 100 100 100 100 100 100 100 100 
100 100 100 100 100 100 100 100 100 100 100 100 100 100 
##$AQSEQ= 0
##$AQ_mod= 1
##$AUNM= <au_zg>
##$AUTOPOS= <>
##$BF1= 200.13
##$BF2= 200.13
##$BF3= 200.13
##$BF4= 200.13
##$BF5= 200.13
##$BF6= 200.13
##$BF7= 200.13
##$BF8= 200.13
##$BYTORDA= 1
##$CFDGTYP= 0
##$CFRGTYP= 5
##$CHEMSTR= <none>
##$CNST= (0..31)
1 1 145 1 1 1 1 1 1 1 1 1 1 1 1 1 1 1 1 1 1 1 1 1 1 1 1 1 1 1 1 1 
##$CPDPRG= <>
##$CPDPRG1= <>
##$CPDPRG2= <>
##$CPDPRG3= <>
##$CPDPRG4= <mlev>
##$CPDPRG5= <mlev>
##$CPDPRG6= <mlev>
##$CPDPRG7= <mlev>
##$CPDPRG8= <mlev>
##$CPDPRGB= <>
##$CPDPRGT= <>
##$D= (0..31)
0 0.7 0 0 0 0 0 0 0 0 0 0.03 0 0 0 0 0 0 0 0 0 0 0 0 0 0 0 0 0 0 0 0 
##$DATE= 1783414729
##$DBL= (0..7)
120 120 120 120 120 120 120 120 
##$DBP= (0..7)
150 150 150 150 150 150 150 150 
##$DBP07= 0
##$DBPNAM0= <>
##$DBPNAM1= <>
##$DBPNAM2= <>
##$DBPNAM3= <>
##$DBPNAM4= <>
##$DBPNAM5= <>
##$DBPNAM6= <>
##$DBPNAM7= <>
##$DBPOAL= (0..7)
0.5 0.5 0.5 0.5 0.5 0.5 0.5 0.5 
##$DBPOFFS= (0..7)
0 0 0 0 0 0 0 0 
##$DE= 6
##$DECBNUC= <off>
##$DECIM= 32
##$DECNUC= <off>
##$DECSTAT= 4
##$DIGMOD= 1
##$DIGTYP= 9
##$DL= (0..7)
0 120 120 120 120 120 120 120 
##$DP= (0..7)
150 150 150 150 150 150 150 150 
##$DP07= 0
##$DPNAME0= <>
##$DPNAME1= <>
##$DPNAME2= <>
##$DPNAME3= <>
##$DPNAME4= <>
##$DPNAME5= <>
##$DPNAME6= <>
##$DPNAME7= <>
##$DPOAL= (0..7)
0.5 0.5 0.5 0.5 0.5 0.5 0.5 0.5 
##$DPOFFS= (0..7)
0 0 0 0 0 0 0 0 
##$DQDMODE= 0
##$DR= 18
##$DS= 0
##$DSLIST= <SSSSSSSSSSSSSSS>
$$ [...]
##$SUBNAM0= <"">
##$SUBNAM1= <"">
##$SUBNAM2= <"">
##$SUBNAM3= <"">
##$SUBNAM4= <"">
##$SUBNAM5= <"">
##$SUBNAM6= <"">
##$SUBNAM7= <"">
##$SUBNAM8= <"">
##$SUBNAM9= <"">
##$SW= 18.0517328524113
##$SWIBOX= (0..15)
0 0 2 0 0 0 0 0 0 0 0 0 0 0 0 0 
##$SW_h= 3612.71676300578
##$TD= 16384
##$TD0= 1
##$TE= 0
##$TE2= 300
##$TE3= 300
##$TEG= 300
##$TL= (0..7)
0 120 120 120 120 120 120 120 
##$TP= (0..7)
150 150 150 150 150 150 150 150 
##$TP07= 0
##$TPNAME0= <>
##$TPNAME1= <>
##$TPNAME2= <>
##$TPNAME3= <>
##$TPNAME4= <>
##$TPNAME5= <>
##$TPNAME6= <>
##$TPNAME7= <>
##$TPOAL= (0..7)
0.5 0.5 0.5 0.5 0.5 0.5 0.5 0.5 
##$TPOFFS= (0..7)
0 0 0 0 0 0 0 0 
##$TUNHIN= 0
##$TUNHOUT= 0
##$TUNXOUT= 0
##$USERA1= <user>
##$USERA2= <user>
##$USERA3= <user>
##$USERA4= <user>
##$USERA5= <user>
##$V9= 5
##$VALIST= <valist>
##$VCLIST= <CCCCCCCCCCCCCCC>
##$VD= 0
##$VDLIST= <DDDDDDDDDDDDDDD>
##$VPLIST= <PPPPPPPPPPPPPPP>
##$VTLIST= <TTTTTTTTTTTTTTT>
##$WBST= 1024
##$WBSW= 4
##$XGAIN= (0..3)
0 0 0 0 
##$XL= 0
##$YL= 0
##$YMAX_a= 159399
##$YMIN_a= -81065
##$ZGOPTNS= <>
##$ZL1= 120
##$ZL2= 120
##$ZL3= 120
##$ZL4= 120
##$ABSF1= 10
##$ABSF2= 0
##$ABSG= 5
##$ABSL= 3
##$ALPHA= 0
##$AQORDER= 0
##$ASSFAC= 0
##$ASSFACI= 0
##$ASSFACX= 0
##$ASSWID= 0
##$AUNMP= <proc_1d>
##$AZFE= 0.1
##$AZFW= 0.1
##$BCFW= 1
##$BC_mod= 2
##$BYTORDP= 1
##$COROFFS= 0
##$CY= -3
##$DATMOD= 1
##$DC= 2
##$DFILT= <>
##$DTYPP= 0
##$F1P= 0
##$F2P= 0
##$FCOR= 0.5
##$FTSIZE= 0
##$FT_mod= 4
##$GAMMA= 1
##$GB= 0.15
##$INTBC= 1
##$INTSCL= 1
##$ISEN= 128
##$LB= 0.25
##$LEV0= 0
##$LPBIN= 0
##$MAXI= 10000
##$MC2= 0
##$MEAN= 0
##$ME_mod= 0
##$MI= 1.114404
##$NCOEF= 0
##$NC_proc= 0
##$NLEV= 6
##$NOISF1= 3.799351
##$NOISF2= 2.8
##$NSP= 1
##$NTH_PI= 0
##$NZP= 0
##$OFFSET= 14.38212
##$PC= 1
##$PHC0= -4217.503
##$PHC1= 6.5923
##$PH_mod= 1
##$PKNL= yes
##$PPARMOD= 0
##$PSCAL= 0
##$PSIGN= 0
##$REVERSE= no
##$SF= 200.129724274929
##$SI= 16384
##$SIGF1= 3
##$SIGF2= 2
##$SINO= 400
##$SIOLD= 16384
##$SREGLST= <1H.CDCl3>
##$SSB= 0
##$STSI= 0
##$STSR= 0
##$SW_p= 3205.1282051282
##$SYMM= 0
##$S_DEV= 0
##$TDeff= 0
##$TDoff= 0
##$TI= <>
##$TILT= no
##$TM1= 0
##$TM2= 0
##$TOPLEV= 0
##$USERP1= <user>
##$USERP2= <user>
##$USERP3= <user>
##$USERP4= <user>
##$USERP5= <user>
##$WDW= 1
##$XDIM= 8192
##$YMAX_p= 0
##$YMIN_p= 0
$$ End of Bruker specific parameters
$$ ---------------------------------
##NTUPLES= NMR FID
##VAR_NAME=  TIME,          FID/REAL,        FID/IMAG
##SYMBOL=    X,             R,               I
##VAR_TYPE=  INDEPENDENT,   DEPENDENT,       DEPENDENT
##VAR_FORM=  AFFN,          ASDF,            ASDF
##VAR_DIM=   8192,          8192,            8192
##UNITS=     SECONDS,       ARBITRARY UNITS, ARBITRARY UNITS
##FACTOR=    0.0002768,     1,               1
##FIRST=     0,             0,               0
##LAST=      2.2672688,     0,               0
##MIN=       0,             -81065,          0
##MAX=       2.2672688,     159399,          0
$$ Real data points
##PAGE= N=1
##DATA TABLE= (X++(R..R)), XYDATA
$$ [...]
$$ plain form
1825 161 -32 -118 102 36 -148 67 95 -266 -159 78 44 -152 85 210 129 161 -60 -161 -172 -85 182 19 67
1848 67 104 -143 215 55 57 -50 90 47 -106 235 -86 -40 -178 89 54 145 -4 -185 26 159 156 99 47 94
1872 94 -42 4 -43 183 228 -206 -42 -296 124 61 93 -232 51 -3 -49 175 144 107 112 -42 -74 -45 56 53 -24 -165
1898 -165 -10 -142 23 47 -173 3 212 51 35 -163 274 155 36 43 74 178 382 69 -88 353 -217 -55
1920 -55 32 -93 -80 218 13 -109 154 -222 4 -69 -121 -289 69 -8 64 230 -137 61 -12 79 -58 91 4
1943 4 -288 -9 123 387 -33 16 -82 297 100 17 -4 -92 -8 12 -111 104 70 -27 344 -100 -145 -157 -5 -222
1967 -222 -456 -415 -61 13 426 204 -56 -39 43 86 -41 -79 -68 19 -159 -33 34 114 -10 229 175 210 180 -92
1991 -92 24 31 -158 -286 153 -92 -119 -125 47 -129 -31 157 89 188 146 169 -111 -206 149 -99 -258 -69 -31 -29 52
$$ packed form
1825A61j93q6K20o6j84K15K8l61J07K37l4j96K37J25q1L2k21j01j1Q7K67j63M8
1848F7L7k47L58j60Kj07J40m3j53L41l21M6j38K67l5R1j49j81K11J33ln7n2M7
1872I4j36M6m7K26M5m34J64k54M20o3L2l25K83n4m6K24l1l7Nj54l2K9J01lp7j41
1898a65J55j32J65K4k20J76K09j61j6j98M37j19j19PL1J04K04l13j57M41n70J62
1920e5Q7j25J3K98k05j22K63l76K26p3n2j68L58p7P2J66l67J98p3R1j37J49q7
1943Dk92K79J32K64m20M9r8L79j97q3k1q8Q4K0j23K15l4r7L71m44m5j2J52k17
1967b22k34M1L54P4M13k22k60J7Q2M3j27l8J1Q7j78J26O7Q0j24K39n4L5l0k72
1991i2J16Pj89j28M39k45k7oJ72j76R8J88o8R9m2K3k80r5L55k48j59J89L8KQ1
$$ plain form
2016 52 -318 -151 48 -59 23 -46 8 -156 -11 85 200 -217 -36 72 -47 35 186 -98 59 108 -148 -22
2038 -22 -57 125 130 -115 -148 156 16 206 46 -285 130 61 -111 -32 100 -59 -218 197 125 -53 -24 91 -49
2061 -49 -61 70 -153 -149 -146 -30 -160 -51 46 -144 -36 -3 -93 -101 -16 -82 -214 -29 94 -208 -87 -165 110 -250 -109
2086 -109 -63 -230 139 -236 89 -22 123 -39 -131 -103 -143 -227 -31 -52 192 -15 -125 -123 81 -290 81 137 43
2109 43 12 -194 5 -73 80 137 -183 110 225 -44 -245 264 111 -142 23 72 88 -48 -145 -10 -190 -10
2131 -10 -196 30 -24 5 -57 10 127 -88 -76 -37 -71 113 157 -90 -343 -27 -116 116 -164 282 129 13 241
2154 241 -113 -95 51 73 -182 37 201 -103 -355 19 125 44 -113 364 52 -119 95 108 -41 -116 -58 179
2176 179 148 204 107 230 -57 -16 -9 -9 -55 -109 -130 -101 -103 107 78 96 42 176 -23 60 -33 157 -103 51 -50 -114 12
$$ packed form
2016E2l70J67J99j07Q2o9N4j64J45R6J15m17J81J08j19Q2J51k84J57M9k56J26
2038b2l5J82Nk45l3L04j40J90j60l31M15o9j72P9J32j59j59M15p2j78K9J15j40
2061d9j2J31k23MLJ16j30J09R7j90J08L3r0qQ5o6j32J85J23l02J21p8K75l60J41
2086a09M6j67L69l75L25j11J45j62r2K8m0q4J96k1K44k07j10KK04l71L71N6r4
2109D3l1k06J99p8J53N7l20K93J15k69k01N09j53k53J65M9J6j36r7J35j80J80
2131a0j86K26n4K9o2O7J17k15J2L9l4J84M4k47k53L16q9K32k80M46j53j16K28
2154B41l54J8J46K2k55K19J64l04k52L74J06q1j57M77l12j71K14J3j49p5N8K37
2176A79l1N6r7J23k87M1P%m6n4k1K9kK10k9J8n4J34j99Q3r3J90k60J54j01o4J26
$$ plain form
2203 12 -125 170 75 -105 -104 94 144 -120 -32 182 -20 258 -132 101 132 -128 -118 283 116 -96 194 -1 -217
2226 -217 -142 48 102 -128 50 -18 -275 259 69 -109 -42 -200 17 9 37 0 107 152 -299 -10 -81 -28 -136 -174
2250 -174 -133 35 -80 -55 -76 -104 -45 149 -159 -145 -32 -55 32 -48 242 168 17 27 64 -161 -133 -49 181 -68 277
2275 277 160 42 -27 93 -112 250 147 220 -43 68 135 -44 48 -4 -115 -22 -21 -113 -62 -59 -262 24 110 32 -178
2300 -178 156 69 -70 2 236 138 82 266 190 31 -65 76 -256 -2 131 -49 331 95 -155 -1 -34 -106 -46
2323 -46 -131 61 -406 -91 151 144 -10 58 126 183 -173 -290 -23 -11 221 -134 -53 -51 99 32 -50 -256 13 92 5
2348 5 -211 -151 4 272 -43 -98 124 62 -35 123 275 -125 -251 18 42 183 112 35 112 184 -86 179 -40 -94
2372 -94 0 -25 62 -50 -109 -119 -51 -138 15 -207 72 -5 62 100 196 158 92 -99 -33 -311 -148 8 -170 -63 90
$$ packed form
2203A2j37K95r5j80JJ98N0k64Q8K14k02K78l90K33L1k60J0M01j67k12K90j95k16
2226b17P5J90N4k30J78o8k57N34j90j78O7j58K17qK8l7J07M5m51K89p1N3j08l8
2250a74M1J68j15K5k1k8N9J94l08J4J13k3Q7q0K90p4j51J0L7k25K8Q4K30k49L45
2275B77j17j18o9J20k05L62j03P3k63J11O7j79R2n2j11R3Jr2N1Lk03K86Q6p8k10
2300a78L34q7j39P2K34r8n6J84p6j59r6J41l32K54J33j80L80k36k50J54l3p2O0
2323d6q5J92m67L15K42pj54O8O8N7l56j17K67J2K32l55Q1KJ50o7q2k06K69P9q7
2348Ek16O0J55K68l15n5K22o2r7J58J52m00j26K69K4J41p1p7P7P2k70K65k19n4
2372i4R4k5Q7j12n9j0O8q7J53k22K79p7O7L8R6l8o6j91O6k78J63J56j78J07J53
$$ plain form
2397 90 4 -6 -161 42 67 193 -100 -164 -11 1 -228 135 74 235 -149 -128 4 1 102 -27 -6 99 -30 228
2421 228 -208 12 -21 -174 -144 -23 -36 -146 -276 -116 -328 -251 115 -241 -101 270 226 -94 278 57 249 -162
2443 -162 153 178 35 241 -58 84 -70 -73 70 -194 -131 -30 145 175 30 -105 -25 69 251 33 215 -252
2465 -252 98 99 -146 35 -76 83 15 109 -139 22 -28 -242 -19 -182 104 41 78 124 -9 -88 -186 -359 -205
2488 -205 -254 152 103 189 134 38 117 -85 16 -214 84 -137 176 -85 -15 154 23 52 214 164 -132 -25 41
2511 41 -45 -191 -120 -25 -112 -402 -22 -166 33 -32 -23 253 169 -260 -9 68 35 52 120 -24 -4 -119 118 -257 -24
2536 -24 84 -31 -121 -60 -86 185 -297 68 -26 18 -111 142 84 -1 239 -88 20 127 18 -83 51 58 -278
2559 -278 -151 4 -82 76 89 -122 -215 22 94 111 319 -239 4 -46 -9 19 -71 69 -54 297 -258 -20 172
$$ packed form
2397I0q6j0j55K03K5J26k93o4J53J2k29L63o1J61l84K1J32lJ01j29K1J05j29K58
2421B28m36K20l3j53L0J21j3j10j30J60k12P7L66l56J40L71m4l20L72k21J92m11
2443a62L15K5j43K06k99J42j54lJ43k64O3J01J75L0j45j35Q0R4J82k18J82m67
2465b52L50Jk45J81j11J59o8R4k48J61n0k14K23j63K86o3L7M6j33p9r8j73J54
2488b05m9M06m9Q6n5r6P9k02J01k30K98k21L13k61P0J69j31K9J62n0k96J07O6
2511D1q6j46P1R5q7k90L80j44J99o5RK76q4m29K51P7l3J7O8j44K0j15K37l75K33
2536b4J08j15r0O1k6K71m82L65r4M4j29K53n8q5K40l27J08J07j09j01J34Pl36
2559b78J27J55q6J58J3k11r3K37P2J7K08n58K43n0L7K8r0J40j23L51n55K38J92
$$ plain form
2582 172 -66 27 86 -180 -171 -153 -38 199 -73 -340 -28 116 -55 -25 -533 13 -85 -51 57 113 -71 -351 7
2605 7 54 -140 165 -10 -90 -239 -99 -71 218 0 100 72 -89 38 213 -3 83 -51 -282 203 -191 -39
2627 -39 -208 -312 122 43 -26 115 274 -439 -147 199 -128 -162 -18 48 -22 48 68 -75 -91 97 -44 302 153
2650 153 143 -57 -4 -189 -2 -82 254 -95 -225 270 -227 88 -61 26 -137 -197 2 167 79 69 50 -13 -204
2673 -204 -229 73 -39 -179 -77 -203 -184 69 98 32 64 207 89 -4 141 -76 -169 -30 147 175 -19 94 63
2696 63 -27 70 -290 60 168 -5 -81 -93 59 -13 0 -109 -136 -49 31 227 -92 147 -255 69 177 20 -271
2719 -271 4 76 -205 153 -179 -64 -54 216 142 201 -16 -118 109 48 -9 160 44 -68 29 -86 -48 -34 -105
2742 -105 -187 4 284 205 82 -122 100 -24 -51 82 -22 150 86 -206 -218 150 112 198 29 -42 184 56 -162
$$ packed form
2582A72k38R3N9k66RJ8J15K37k72k67L12J44j71L0n08N46r8L4J08N6j84k80L58
2605GM7j94L05j75q0j49J40K8K89k18J00k8j61J27J75k16Q6j34k31M85l94J52
2627c9j69j04M34p9o9J41J59p13K92L46l27l4J44O6p0P0K0j43j6J88j41L46j49
2650A53j0k00N3j85J87q0L36l49j30M95m97L15j49Q7j63o0J99J65q8j0j9o3j91
2673b04k5L02j12j40J02j26J9K53K9o6L2J43j18r3J45k17r3J39J77K8j94J13l1
2696F3r0R7l60L50J08j73p6j2J52p2J3j09k7Q7Q0J96l19K39m02L24J08j57k91
2719b71K75P2k81L58l32J15J0K70p4N9k17j02K27o1n7J69j16j12R7j15L8J4p1
2742a05q2J91K80p9j23k04K22j24k7J33j04J72o4k92j2L68l8Q6j69p1K26j28k18
$$ plain form
2765 -162 -7 75 39 50 88 131 116 -87 -49 255 -28 88 -57 -4 -183 -196 -226 153 170 220 143 -34 118 128 83
2790 83 -89 -1 89 -137 -8 -32 62 304 -250 88 10 -8 -188 87 58 -166 -138 -58 -24 -87 62 163 -8 -131
2814 -131 8 -101 55 -237 -94 115 5 -12 141 -219 -26 -131 -312 -185 9 -50 -125 -234 28 20 41 221
2836 221 -243 -27 78 127 -32 85 97 -67 -50 174 -34 45 -137 -106 -74 112 69 -76 -194 -148 -135 -5 77
2859 77 100 98 -53 274 105 -246 -40 128 26 138 -93 62 73 -149 -109 -73 -97 -118 -116 10 -104 -69 -142 92
2883 92 132 -76 110 -48 -82 -83 -52 -137 -288 8 119 196 -16 -111 -88 -139 31 -153 -183 -195 -40 -257 151 -199
2907 -199 19 149 80 91 -107 -6 204 86 214 122 -5 164 -67 128 -86 179 46 -34 -50 157 99 -101
2929 -101 -45 -126 -350 -164 -10 -142 -75 241 -103 -1 100 77 -143 105 56 38 94 -130 54 160 26 -56 -75
$$ packed form
2765a62J55Q2l6J1L8M3j5k03L8L04k83J16j45N3j79j3l0L79J7N0p7j77J52J0m5
2790H3j72Q8R0k26J29k4R4K42n54L38p8j8j80K75k9k24K8Q0L4o3J49J01j71j23
2814a31J39j09J56k92J43K09j10j7J53l60J93j05j81J27J94n9p5j09K62qK1J80
2836B21m64K16J05M9j59J17J2j64J7K24k08P9j82L1L2J86m3j45j18M6J3J30Q2
2859G7K3kj51L27j69l51K06J68j02J12k31J55J1k22M0L6k4k1KJ26j14L5p3K34
2883I2M0k08J86j58l4jL1q5j51K96J11P7k12r5K3n1J70j84l0j2J55k17M08l50
2907a99K18J30o9J1j98J01K10j18J28r2j27J69k31J95k14K65j33q0j6K07n8k00
2929a01N6q1k24J86J54j32O7L16l44J02J01k3k20K48m9j8N6k24J84J06j34q2j9
$$ plain form
2952 -75 -204 -198 -229 -346 213 38 184 110 190 -6 49 35 289 -32 125 72 11 134 221 34 158 -104 -52 6
2976 6 -68 38 -113 144 -70 4 -98 -183 -67 -147 -17 -88 -162 -17 36 209 66 -133 -114 -153 -25 11 -93 -139
3000 -139 -92 -352 143 201 60 256 -186 316 92 283 -138 16 92 -74 118 75 -118 -63 64 235 -260 78
3022 78 -58 -229 47 -218 -26 110 117 71 -69 -192 -107 75 -20 183 -97 69 154 126 158 -32 -41 -45 -126 -66 193
3047 193 32 55 35 33 243 -44 83 85 76 310 134 100 38 163 -278 -38 -45 62 -209 -216 -26 193 291 282 151 19
3073 19 104 -108 -208 35 -178 -175 -190 144 84 93 248 72 48 116 -89 -120 -240 -221 -203 94 19 -7 -64 97 -132
3098 -132 -15 -207 -12 210 -126 -120 56 -215 154 149 151 97 -104 -72 -56 3 -25 -115 -9 134 264 152 299 221
3122 221 212 -225 -93 186 -78 68 17 173 -86 -94 50 48 0 100 147 -145 -45 130 98 31 67 249 166 -51
$$ packed form
2952g5j29Ol1j17N59j75J46p4Q0j96N5j4K54l21J57n3o1J23Q7j87J24k62N2N8
2976Fp4J06j51K57k14P4j02q5J16q0J30p1p4J45N3J73j43j99J9l9J28L6j04m6
3000a39M7k60M95N8j41J96m42N02k24J91m21J54P6j66J92m3j93N5J27J71m95L38
3022G8j36j71K76k65J92J36Pm6j40j23Q5J82r5K03k80J66Q5k8L2j90rmq1O0K59
3047A93j61K3k0kK10k87J27KrK34j76l4o2J25m41K40pJ07k71pJ90K19R8rj31j32
3073A9Q5k12j00K43k13Lj5L34o0RJ55j76k4O8k05l1j20J9J8K97p5k6n7J61k29
3098a32J17j92J95K22l36OJ76k71L69nKn4k01L2J6N9k8r0J06J43J30j12J47p8
3122B21rm37J32K79k64J46n1J56k59qJ44km8J00M7k92J00J75l2o7L6J82q3k17
$$ plain form
3146 -51 -76 -189 -79 -224 -5 2 186 -98 1 -67 101 40 105 -172 -230 -200 -177 -254 216 -51 103 -104 -22 137
3170 137 -197 -69 90 54 84 137 -143 -129 154 275 252 -33 250 -95 -59 -64 82 200 -69 -131 -35 14 -288 -462
3194 -462 -221 -69 56 -185 -18 180 -90 72 209 -61 -70 183 84 89 34 201 173 135 -226 -183 -148 -54 -167 32
3218 32 -116 0 202 -92 79 -45 -167 -60 -110 -29 -80 -11 -94 -79 81 -168 92 -194 -40 -135 -101 -249 -29
3241 -29 -10 13 -62 -258 -25 -140 97 -112 95 -46 -22 58 17 -223 -62 -227 30 54 99 132 -40 439 202
3264 202 320 -38 -207 4 80 -106 190 -94 -55 2 -189 204 -53 51 -92 -37 248 108 -331 -43 -126 -147
3286 -147 243 121 -64 -219 -181 103 37 11 -60 62 331 -243 212 -83 -130 -100 -249 120 -155 233 40 166
3308 166 183 200 -88 218 175 240 -70 3 3 200 61 -215 108 -12 -103 231 70 -202 -145 -28 -130 -47 -74 -145
$$ packed form
3146e1k5j13J10j45K19PJ84k84R9o8J68o1O5k77n8L0K3p7M70k67J54k07Q2J59
3170A37l34J28J59l6L0N3k80J4K83J21k3k85K83l45L6nJ46J18k69o2R6M9l02j74
3194d62K41J52J25k41J67J98k70J62J37k70rK53r9Nn5J67k8l8l61M3L5R4j13J99
3218C2j48J16K02k94J71j24j22J07n0Q1n1O9q3J5J60k49K60k86J54r5L4j48K20
3241b9J9K3p5j96K33j15K37k09K07j41K4Q0m1k40J61j65K57K4M5L3j72M79k37
3264B02J18l58j69K11P6j86K96k84L9N7j91L93k57J04j43N5K85j40m39K88q3k1
3286a47L90j22j85j55L8K84o6k6p1J22K69n74M55k95m7L0j49L69k75L88j93J26
3308A66J7J7k88L06m3O5l10P3%J97j39k76L23j20r1L34j61k72N7J17j02Q3k7p1
$$ plain form
3332 -145 -7 66 10 -61 -56 67 -76 -171 202 -153 30 -57 -53 -187 -97 -140 80 36 73 147 35 178 374 150 -23
3357 -23 -104 179 171 -100 -157 9 -70 9 20 -2 -24 -317 -310 124 20 86 -337 73 -189 -54 173 -75 4 32 214
3382 214 45 -186 -57 331 38 114 30 -73 -2 -34 -22 205 2 -82 64 -155 -99 -104 6 -182 -32 -28 162 -221
3406 -221 235 134 31 -29 147 98 106 -69 -58 -62 203 -49 -159 -136 -175 -62 144 266 35 103 -188 58 -57
3429 -57 161 -115 -33 -115 122 -133 180 -128 124 -67 -55 64 -94 -94 186 -74 -19 342 -38 78 245 -217
3451 -217 -134 1 -66 43 18 11 -216 -104 -22 45 58 97 28 146 29 82 -146 69 3 -3 -58 151 373 67 186
3476 186 -112 44 -97 201 160 103 -57 -58 -16 117 48 -56 -154 -162 -83 -82 16 100 -42 263 -3 -102 -10 -107 66 135
3502 135 180 28 -23 -283 219 176 134 163 182 -43 -337 297 318 290 15 165 45 -5 -85 -21 61 -27 -146 176
$$ packed form
3332a45J38P3n6p1NJ23j43r5L73l55J83q7Mj34R0m3K20m4L7P4j12J43J96k24j73
3357b3q1K83qk71n7J66p9P9J1k2k2k93PM34j04O6m23M10k62J35K27k48P9K8J82
3382B14j69k31J29L88k93P6q4j03P1l2J2K27k03q4J46k19N6nJ10j88J50MJ90l83
3406b21M56j01j03o0J76m9Qj75J1mK65k52j10K3l9J13K06J22k31O8k91K46j15
3429e7K18k76Q2q2K37k55L13l08K52j91J2J19j58%K80k60N5L61l80J16J67m62
3451b17Q3J35o7J09k5pk27J12Q2O7J3L9o9J18j17N3k28K15o6on5K09K22l06J19
3476A86k98J56j41K98m1n7j60jM2J33o9j04r8qP9JR8Q4j42L05k66r9R2r7J73O9
3502A35M5j52n1k60N02m3m2K9J9k25k94O34K1k8k75J50j20n0q0O4Q2q8j19L22
$$ plain form
3526 176 91 -281 87 -29 70 95 86 59 -337 -135 -129 -130 -3 -122 -86 284 -65 53 -204 -38 -113 -85 -27 24 239
3551 239 32 12 -134 -54 66 -147 10 178 165 16 -101 -160 67 -221 24 39 -150 -52 -197 -139 149 161 167
3574 167 -197 22 219 -14 94 -135 -94 0 3 -111 220 18 -240 -25 -331 8 247 5 94 89 181 -114 91
3597 91 -73 171 48 -170 298 -157 64 12 -43 30 -143 -220 -230 -334 -224 -66 108 27 -131 265 -242 -59
3619 -59 215 35 -1 -81 -132 14 55 -168 -233 -116 -82 -136 -41 59 -27 143 -235 134 190 130 -145 -206 106 -127
3643 -127 103 118 154 240 44 164 7 65 37 83 -190 197 -312 -55 -4 -55 124 103 -10 104 149 156 138 267
3667 267 102 -57 -1 2 -94 -75 182 -14 74 151 -277 0 -115 403 -79 48 55 -86 119 180 223 -265 116 141
3691 141 56 285 120 74 117 -187 378 -112 79 41 183 129 -24 57 177 160 -127 49 126 133 -35 -196 -124 86
$$ packed form
3526A76q5l72L68j16R9K5rk7l96K02OjJ27j19L6L70l49J18k57J66p5K8N8N1K15
3551B39k07k0j46Q0J20k13J57J68j3j49j17n9K27k88K45J5j89R8j45N8K88J2O
3574A67l64K19J97k33J08k29M1R4Lj14L31k02k58K15l06L39K39k42Q9nR2k95K05
3597I1j64K44j23k18M68m55K21n2n5P3j73p7j0j04J10J58J74q1j58L96n07J83
3619e9K74j80l6q0n1J46M1k23o5J17L4n4R5J00q6J70l78L69N6o0k75o1L12k33
3643a27K30J5L6Q6j96J20j57N8k8M6k73L87n09K57N1n1J79k1j13J14M5Pj8J29
3667B67j65j59N6Lr6J9K57j96Q8P7m28K77j15N18m82J27Pj41K05O1M3m88L81K5
3691A41q5K29j65m6M3l04N65m90J91l8J42n4j53Q1J20j7k87J76P7Pj68j61P2K10
$$ plain form
3715 86 176 -35 -227 78 -77 130 -108 117 -171 -27 63 -152 183 -15 -117 281 -325 182 -27 1 -148
3736 -148 -27 -11 -21 212 91 -205 219 -84 27 -113 -59 124 63 -173 -99 193 -16 70 -18 -104 -44 195 72
3759 72 -21 -70 -378 189 -86 -64 -49 4 -83 63 194 138 65 -127 -162 -63 21 236 141 -93 -117 25 -108 -168 -142
3784 -142 -70 230 37 -67 161 -155 29 -51 -107 260 14 -56 128 10 77 -161 -116 350 289 -53 -129 -19 -187
3807 -187 246 32 26 -9 105 -100 166 108 144 109 -3 44 -81 38 32 105 69 92 -138 -92 -114 126 -120 -67 -31
3832 -31 -260 141 2 -9 -120 -17 -56 40 -159 -177 -3 116 78 92 197 116 38 -34 -113 -121 77 -4 -60 -173 -4
3857 -4 -160 57 21 -75 58 -101 -69 -58 -18 -3 42 -109 -48 -46 178 218 -58 -181 -109 2 -428 25 22 60 -395 85
3883 85 -29 -21 -18 121 148 176 294 183 68 118 9 8 -70 83 -226 -64 -86 -20 44 158 260 165 41 205 48
$$ packed form
3715H6R0k11j92L05j55K07k38K25k88J44R0k15L35j98j02L98o06N07k09K8j49
3736a48J21J6j0K33j21k96M24l03J11j40N4J83o1k36P4K92k09Q6q8q6O0K39j23
3759G2r3m9l08N67k75K2J5N3q7J46J31n6p3j92l5R9Q4K15r5k34k4J42j33o0K6
3784a42P2L00j93j04K28l16J84q0n6L67k46p0J84j18O7k38M5M66o1l42p6J10j68
3807a87M33k14ol5J14k05K66n8L6l5j12M7j25J19oP3l6K3k30M6k2K40k46N3L6
3832c1k29M01j39j1j11J03l9R6j99j8J74J19l8J4J05q1p8p2p9qJ98q1n6j13J69
3857dj56K17l6r6J33j59L2J1M0J5M5j51O1KK24M0k76j23P2J11m30M53lL8m55M80
3883H5j14QLJ39K7K8J18j11j15N0j09jp8J53l09J62k2O6O4J14J02r5j24J64j57
$$ plain form
3908 48 -91 -36 -149 -138 79 53 -226 -211 39 27 254 24 -23 49 101 39 -219 -105 -6 -323 99 -109 222 -34
3932 -34 99 -192 67 300 176 -84 -189 -122 -213 -223 -209 -181 -20 -112 -11 -113 -74 12 -102 -83 -47 -76 -39 90
3956 90 -3 -96 -135 -172 253 88 125 -60 -8 -10 -17 163 178 -231 77 0 -170 -99 52 -84 71 -10 140 125 121 9
3982 9 -220 -107 -13 -161 103 27 58 -27 24 -145 -101 66 292 -225 -20 9 10 168 -169 99 226 -87 32 283
4006 283 -122 4 -69 115 184 62 31 -38 64 68 60 -87 144 -14 -172 9 -106 139 196 -168 -10 -15 -16 22 -80
4031 -80 11 -182 -44 54 81 231 15 -216 128 68 -39 1 260 176 16 65 16 65 28 128 65 -60 -27 -32 34
4056 34 -89 80 50 -121 -141 162 234 11 52 -260 164 124 -122 -104 -21 159 53 168 4 -208 -144 202 -116
4079 -116 69 -50 -126 -19 36 165 -1 -191 -20 -32 -224 -39 -149 90 130 196 21 88 125 -180 -54 233
$$ packed form
3908D8j39N5j13J1K17k6k79J5K50j2K27k30m7P2N2o2k58J14R9l17M22k08L31k56
3932c4J33k91K59K33j24k60j05O7r1j0J4K8J61r2J01j02L9Q6j14J9L6k9L7J29
3956I0r3r3l9l7M25j65L7j85N2kpJ80J5m09L08p7j70P1J51j36J55q1J50j5mj12
3982Ik29J13R4j48K64p6L1q5N1j69M4J67K26n17K05K9JJ58l37K68J27l13J19K51
4006B83m05J26p3J84O9j22l1o9J02Mqj47K31j58j58J81j15K45N7l64J58njL8j02
4031h0R1j93J38R8K7J50k16k31L44o0j07M0K59q4j60M9m9M9l7J00o3j25L3nO6
4056C4j23J69l0j71k0L03P2k23M1l12M24m0k46J8Q3J80j06J15j64k12O4L46l18
4079a16J85j19p6J07N5J29j66j90J71j2j92J85j10K39M0O6j75O7L7l05J26K87
$$ plain form
4101 233 -258 -236 99 -138 -62 80 202 222 261 173 -250 -92 -52 80 -208 2 77 -152 -215 153 155 149 -177 -31
4125 -31 -35 60 44 -199 53 95 -205 104 140 -239 -236 -44 -289 -127 -50 -107 -165 -144 -274 -232 -8 165 213 41 -181
4150 -181 114 -113 70 -37 98 -104 -14 -103 -4 183 -5 166 95 -165 -43 -266 -61 142 -143 100 -188
4171 -188 176 -17 -250 -117 -52 5 -47 -42 170 99 139 -43 -127 -98 -195 -279 61 -265 -263 -35 -41 -85 115 -39 -45 246
4197 246 203 -41 -27 74 -103 -62 -224 -20 -26 12 3 6 -16 -8 251 -9 -123 -204 75 -121 -80 51 -57 -258 -61
4222 -61 15 -9 -76 108 38 -162 54 -164 -150 -228 -101 138 33 -145 102 94 -208 -138 118 218 159 -128 -265 23
4246 23 131 -285 46 144 84 92 -82 -108 -28 -52 -243 55 -7 -321 -133 164 173 102 63 -66 -35 81 -73 46 1
4271 1 -265 195 -136 96 123 36 -27 -28 86 -1 -115 68 70 -161 -305 19 17 84 -143 -65 -195 -235 -264 108 192 -83
$$ packed form
4101B33m91K2L35k37P6J42J22K0L9q8m23J58M0J32k88K10P5k29o3L68Kol26J46
4125c1mR5j6k43K52M2l00L09L6l79LJ92k45J62P7n7n8K1j30M2K24J73M8j72k22
4150a81K95k27J83j07J35k02R0q9R9J87j88J71p1k60J22k23K05K03k85K43k88
4171a88L64j93k33J33O5N7n2NK12p1M0j82q4K9r7q4L40l26KK28om4K00j54oK91
4197B46m3k44J4J01j77M1j62K04oL8rLk2QK59k60j14q1K79j96M1J31j08k01J97
4222f1P6k4o7J84p0k00K16k18J4p8J27K39j05j78K47ql02P0K56J00n9k87j37K88
4246B3J08m16L31R8o0Qj74k6Q0k4j91K98o2l14J88K97Rp1l9j29L1J16j54J19m5
4271Ak66M60l31K32K7q7o3jJ14q7j14J83Kk31j44L24kO7k27P8j30m0k9L72Q4k75
$$ plain form
4297 -83 -297 -31 121 -136 -66 -17 -112 -301 97 164 186 66 -274 4 -29 246 95 234 -175 -59 115 -187
4319 -187 2 -86 -151 -22 4 -58 24 -367 -155 -109 -42 -109 -9 -38 276 31 22 -84 -112 208 -6 185 -19 61
4343 61 -5 336 10 -174 120 -188 -127 -17 166 -84 -248 47 -123 -174 -253 -261 -99 -216 -200 -105 -132 -88 194 -123
4367 -123 -11 -116 -55 78 -113 157 -164 252 -74 171 172 46 -1 69 105 -75 -115 -74 -141 -45 -160 314 -143
4390 -143 -62 -106 167 -137 86 6 184 25 -330 -16 -13 228 -291 -70 -65 -25 -90 -50 26 -20 116 159 74 -372 -154
4415 -154 521 -119 216 7 -171 285 -50 279 -99 -45 19 -133 -78 90 -82 -226 116 -176 110 9 -41
4436 -41 -64 166 -21 345 94 92 -102 48 70 140 -61 -156 -14 29 294 -118 -306 114 -73 259 -9 15 165
4459 165 -59 59 148 103 -122 96 -161 -269 -14 -202 298 61 72 -34 294 288 -214 78 154 192 50 200
$$ packed form
4297h3k14K66J52k57P0M9r5j89L98O7K2j20l40K78l3K75j51J39m09J16J74l02
4319a87J89q8o5J29K6o2Q2l91K12M6O7o7J00k9L14k45rj06k8L20k14J91k04Q0
4343F1o6L41l26j84K94l08O1J10J83k50j64K95j70n1p9qJ62j17J6R5k7M4K82l17
4367a23J12j05O1J33j91K70l21M16l26K45Jj26m7P0L6j80m0M1o7R6j15M74m57
4390a43Q1m4K73l04K23q0J78j59l55L14LK41n19K21NM0o5M0P6m6J36M3q5m46K18
4415a54O75o40L35k09j78M56l35L29l78N4O4j52N5J68j72j44L42k92K86j01n0
4436d1k3K30j87L66k51kj94J50K2P0k01r5J42M3K65m12j88M20j87L32k68K4J50
4459A65k24J18Q9m5k25K18k57j08K55j88N00k37J1j06L28on02K92P6L8j42J50
$$ plain form
4481 200 236 46 48 -214 30 -32 -127 126 -60 2 -103 -10 22 72 -129 210 -152 -92 30 -50 13 112 -107 -206 -63
4506 -63 82 -26 -113 -59 -193 -37 -93 333 -100 -195 -125 -112 124 -102 -270 39 -156 -84 146 57 89 -30 180
4529 180 114 -174 -55 154 -199 81 -23 13 -2 42 62 69 31 -26 94 -32 -8 88 209 30 -256 -222 53 -190
4553 -190 21 110 34 8 240 208 -8 57 -149 158 -201 -117 115 54 -34 -52 14 110 70 -5 229 173 191 116 -26
4578 -26 10 -158 339 -201 266 -74 170 -59 85 -286 -29 107 -162 81 -127 -74 117 35 49 193 31 -87
4600 -87 79 204 39 91 115 315 9 32 51 -31 42 31 143 -264 62 -49 -9 17 4 -126 -25 -56 -64 -4 208
4625 208 -19 -62 181 -9 -6 -113 -162 -23 13 76 -9 10 79 62 271 -110 -13 -8 -97 161 143 85 -162 185 373
4650 373 10 204 75 184 -38 35 -136 -14 135 -211 -23 1 -100 61 20 -269 202 298 -54 16 115 -36
$$ packed form
4481B00L6j90Kk62K44o2r5K53j86O2j05R3L2N0k01L39l62O0J22q0O3R9k19r9J43
4506f3J45j08q7N4j34J56n6M26m33r5P0J3K36k26j68L09j95P2K30q9L2j19K10
4529A80o6k88J19K09l53K80j04L6j5M4K0Pl8n7J20j26K4R6J21j79k86L4K75k43
4553a90K11Q9p6k6K32l2k16O5k06L07l59Q4K32o1q8j8O6R6m0p5K34n6J8p5j42
4578b6L6j68M97n40M67l40K44k29J44l71K57J36k69K43k08N3J91q2J4J44j62j18
4600h7J66J25j65N2K4K00l06K3J9q2P3j1J12m07L26j11M0K6j3j30J01l1qO0K12
4625B08k27m3K43j90Lj07m9J39L6O3q5J9O9j7K09l81R7Nq9K58j8n8k47L47J88
4650C73l63J94j29J09k22P3j71J22J49l46J88K4j01J61m1k89M71R6l52P0R9j51
$$ plain form
4672 -36 327 -48 55 -75 -148 -54 61 -4 -79 -140 -174 51 105 -207 104 113 -313 155 7 74 -115 184 12 -148
4696 -148 78 77 -84 -121 -171 -306 -15 99 -22 -310 -156 116 -173 17 -45 64 384 -11 154 -38 125 97
4718 97 117 185 164 315 8 374 -49 -81 249 -12 156 -207 97 16 93 67 141 240 -260 161 182 78 -131 19
4742 19 157 -134 82 388 243 61 -243 163 -172 -25 93 31 -111 -260 26 -260 40 147 58 -26 189
4763 189 -185 -159 -237 46 -83 98 155 -84 195 -15 44 141 147 -31 88 -192 -58 45 -146 -21 113 64 89
4786 89 59 -34 -3 84 220 119 74 -192 118 -123 121 81 154 -93 78 -148 66 31 -106 -231 -60 116 61
4809 61 174 -232 182 -5 -227 100 -158 144 -88 276 1 19 -78 13 -119 94 -85 47 -83 28 -296
4830 -296 -85 -157 75 158 -120 -34 -10 -30 -182 -175 -293 187 1 226 -99 -176 -75 446 80 138 10 70 172
$$ packed form
4672c6L63l75J03j30p3R4J15o5p5o1l4K25N4l12L11Rm26M68j48O7j89K99j72j60
4696a48K26jj61l7n0j35K91J14j21k88J54K72k89J90o2J09L20l95J65j92J63k8
4718I7K0O8k1J51l07L66m23l2L30k61J68l63L04q1P7k6P4R9n00M21K1j04k09J50
4742A9J38k91K16L06j45j82l04M06l35J47J18o2j42j49K86k86L00J07q9q4K15
4763A89l74K6p8K83j29J81N7k39K79k10N9R7Oj78J19k80J34J03j91J25J34m9K5
4786H9l0r3L1Q7J36j01m5k66L10k41K44m0P3k47J71k26K14l5j37j25J71J76n5
4809F1J13m06M14j87k22L27k58L02k32L64k75J8r7R1j32K13j79J32j30J11l24
4830b96K11p2K32Q3k78Q6K4k0j52Pj18M80j86K25l25p7J01N21l66N8j28O0J02
$$ plain form
4853 172 100 28 2 29 -32 67 -71 23 -52 34 -166 -138 -240 -14 3 282 122 -233 204 264 -162 -200 1 -86 -188
4878 -188 -82 -65 257 119 104 4 78 85 -239 98 219 -217 122 74 -275 365 165 -32 -39 4 204 -115 30
4901 30 124 101 69 84 -115 -83 108 312 26 -37 56 -147 -41 294 -69 245 56 126 -2 12 352 -260 -153
4924 -153 -48 136 -225 14 75 116 83 265 5 70 81 81 17 19 -19 120 227 -191 -50 -68 239 28 -130 -397
4948 -397 -22 104 127 152 -37 -146 -33 -219 11 -40 -64 -211 86 102 109 81 -95 -205 -62 32 -9 13 207 -77
4972 -77 -20 54 -41 189 -101 99 85 38 105 -55 54 -171 10 -152 236 -45 129 54 -66 -95 188 70 -154
4995 -154 -93 -120 -89 -34 -141 22 189 66 0 -82 192 -24 147 64 197 98 -269 -190 -16 267 -233 -2 100
5018 100 -128 142 14 -194 8 83 -110 -97 -206 -43 6 -58 9 -116 60 85 342 -2 -243 92 189 -38
$$ packed form
4853A72p2p2k6K7o1R9j38R4p5Q6k00K8j02K26J7K79j60l55M37O0m26l8K01q7j02
4878a88J06J7L22j38j5j00P4Pl24L37J21m36L39m8l49O40k00j97pM3K00l19J45
4901C0R4k3l2J5j99L2J91K04k86o3R3k03J06L35l63L14j89P0j28J4L40o12J07
4924a53J05J84l61K39O1M1l3J82k60O5J1%o4Kl8J39J07m18J41j8L07k11j58k67
4948c97L75J26K3K5j89j09J13j86K30n1k4j47K97J6Pk8j76j10J43R4m1K2J94k84
4972g7N7P4r5K30k90K00j4m7O7j60J09k25J81j62L88k81J74p5j20k9K83j18k24
4995a54O1k7L1N5j07J63J67j23o6q2K74k16J71q3J33r9l67P9J74K83n00K31J02
5018A00k28K70j28k08K02P5j93J3j09J63M9o4O7j25J76K5K57l44k41L35R7k27
$$ plain form
5040 -38 164 125 7 202 -65 -15 -257 68 68 -129 6 -44 -69 -77 90 -192 69 -201 170 111 -42 202 121 -6
5064 -6 192 57 96 298 -16 -77 -25 -44 28 91 -186 142 -80 -6 81 -266 355 -60 126 176 -21 12 -169 -56
5088 -56 -57 163 -34 34 80 -32 73 22 1 -1 173 82 20 -217 71 -159 103 -51 40 -259 32 42 260 250 74
5113 74 95 38 -8 -294 177 -156 -272 -183 -60 35 146 -15 -147 62 78 86 41 -198 -18 78 -185 383 236 211
5137 211 -311 87 -173 -150 24 -90 -12 25 -85 -127 -43 66 69 -63 108 -336 -2 272 -99 20 231 7
5159 7 -22 -5 8 15 -226 -33 46 269 -36 -15 104 246 -66 -71 -130 -13 123 -128 -6 -170 125 -403 142 -131
5183 -131 22 123 130 -228 -91 78 101 206 -97 187 6 196 -148 145 -158 31 6 -189 -34 184 35
5204 35 -76 222 57 14 -178 -138 -130 73 112 12 89 129 -268 138 183 -49 -111 245 88 -75 37 17 -110 53
$$ packed form
5040c8K02l9j18J95k67N0k42L25%j97J35n0k5qJ67k82K61k70L71n9j53K44q1j27
5064fJ98j35L9K02l14o1N2j9P2O3k77L28k22P4Q7l47O21m15J86N0j97L3j81J13
5088e6jK20j97O8M6j12J05n1k1kJ74r1o2k37K88k30K62j54R1k99K91J0K18j0j76
5113G4K1n7m6k86M71l33j16Q9J23R5J11j61j32K09J6Qm5k39J80R6k63N68j47k5
5137B11n22L98k60K3J74j14P8L7j10m2Q4J09Lj32J71m44L34K74l71J19K11k24
5159Gk9J7J3Pk41J93P9K23l05K1J19J42l12nn9J17J36k51J22j64K95n28N45k73
5183a31J53J01Pl58J37J69K3J05l03K84j81J90l44K93l03J89k5j95J55K18j49
5204C5j11K98j65m3j92M0QK03L9j00P7M0l97M06M5k32o2L56j57j63J12k0j27J63
$$ plain form
5228 53 331 -284 166 -117 -240 196 -90 -91 237 -231 -159 92 -249 11 96 -141 57 -55 17 170 -167 -56
5250 -56 51 241 -70 -139 -4 -182 -192 7 49 -80 58 -72 80 -65 -143 -105 71 -46 -27 105 -49 -84 -29
5273 -29 -106 -200 281 55 -176 -284 109 51 56 11 -167 -318 90 85 144 -123 -129 153 276 -217 -167 -236 -131 70 101
5298 101 113 -166 329 -80 -21 177 0 132 36 194 -28 84 -42 59 138 17 1 26 -92 165 13 199
5320 199 -3 52 -120 -72 4 -61 88 -141 101 -92 117 -48 46 -102 123 153 196 17 -242 -32 -91 -98 -14 -106
5344 -106 -86 82 -145 -184 21 56 51 76 -241 -96 176 -1 160 17 -55 135 13 -142 179 -16 -6 246 -413
5367 -413 42 -39 -35 -174 104 235 -42 -175 -111 -120 170 54 -91 -158 18 -18 199 -109 -100 -137 -181 -92 -7 46 -187
5392 -187 103 -102 28 -251 -67 131 -94 103 -206 94 134 -108 117 -18 76 80 -174 -119 74 43 -45 -19 -8
$$ packed form
5228E3K78o15M50k83j23M36k86jL28m68P2K51l41K60Q5k37J98j12P2J53l37J11
5250e6J07J90l11o9J35j78j0J99M2j29J38j30J52j45p8L8J76j17J9J32j54l5N5
5273b9p7r4M81k26k31j08L93n8Nm5j78j51M08nN9k67oK82J23m93N0o9J05K01L1
5298A01J2k79M95m09N9J98j77J32r6J58k22J12j26J01P9j21j6K5j18K57j52J86
5320A99k02N5j72M8P6o5J49k29K42j93K09j65R4j48K25L0M3j79k59K10n9pQ4r2
5344a06K0J68k27l9K05L5nK5l17J45K72j77J61j43p2J90j22j55L21j95J0K52o59
5367d13M55q1Mj39K78J31k77j33O4rK90j16j45o7J76l6K17l08Rl7m4Q9Q5N3k33
5392a87K90k05J30k79J84J98k25J97l09L00M0k42K25j35R4Mk54N5J93l1q8K6J1
$$ plain form
5415 -8 -169 62 23 64 -3 -128 41 53 43 -24 15 -94 39 323 74 93 185 -165 -2 32 113 62 -137 224 169
5440 169 -93 -213 46 177 -178 78 51 -1 -168 -95 113 15 120 -56 -181 -263 -81 62 -274 79 -76 -253
5462 -253 -105 208 54 171 110 -85 192 -173 217 146 -26 -8 -145 224 -175 143 167 112 58 94 241 -416
5484 -416 93 141 37 265 468 -75 -185 227 -127 85 -20 69 -192 -66 202 -10 -22 10 -160 6 80 182
5506 182 175 268 -7 132 -52 -280 -256 -153 -45 252 -1 -5 -24 110 -190 229 53 -65 -148 113 40 -76 -47
5529 -47 -299 175 -111 -74 115 39 159 167 33 66 -106 161 77 -123 45 -115 -11 -56 -163 -20 46 -158 -112
5552 -112 -92 -42 -14 -34 68 89 87 -26 -105 285 -205 30 58 -141 -119 -43 -94 41 174 -60 98 -118 75 5
5576 5 105 -134 20 189 13 -32 -350 -95 307 72 71 -34 -135 155 -102 -481 -79 -131 356 -85 -154 -76 -51
$$ packed form
5415hj61K31l9M1o7j25J69J2j0o7L9j09J33K84k49J9R2l50J63L4Q1n1j99L61n5
5440A69k62j20K59J31l55K56k7n2j67P3K08r8J05j76j25q2J82J43l36L53j55j77
5462b53J48L13j54J17o1j95K77l65L90p1j72J8j37L69l99L18K4n5n4L6J47o57
5484d16N09M8j04K28K03n43j10M12l54K12j05Q9k61J26K68k12j2L2j70J66P4J02
5506A82pR3k75J39j84k28K4J03J08K97k53mj9J34l00M19j76j18q3K61p3j16K9
5529d7k52M74k86L7J89p6J20Qj34L3j72K67q4k00J68j60J04m5j07J43O6k04M6
5552a12K0N0K8k0J02K1kj13p9L90m90K35K8j99K2P6n1J35J33k34J58k16J93p0
5576EJ00k39J54J69j76m5l18K55M02k35jj05j01K90k57l79M02n2M87m41o9P8K5
$$ plain form
5599 -51 22 52 35 38 -203 283 -151 -49 4 -32 208 -374 18 -104 -197 136 -301 173 146 115 -50 334 -534 -36
5623 -36 269 -207 -93 122 -34 -52 135 174 53 -92 146 -54 -66 94 199 32 73 -59 166 -334 28 -70
5645 -70 -252 112 16 267 144 76 173 -85 40 -36 -90 232 233 100 -87 -148 51 35 111 32 -21 -156 -117 36 16
5670 16 -154 19 -49 -92 -131 -33 149 -15 -238 290 -95 -40 47 45 16 253 204 -296 16 5 -54 -31 -152 -97 -138
5695 -138 117 80 16 -434 -95 -165 -2 63 10 -273 184 11 20 165 343 -90 223 -10 81 93 84 204 -5 -37
5719 -37 -13 171 -128 254 55 -137 95 68 31 180 17 202 88 132 -299 320 -102 -163 -32 -142 -102 10
5741 10 -42 212 -116 -54 132 106 -41 -57 -8 -93 158 125 110 -8 -379 -124 -238 168 102 -64 203 43 52 -224
5765 -224 47 8 172 129 -34 27 -176 -373 -146 -162 0 105 304 -38 -176 -1 -23 282 -175 -68 166 262
$$ packed form
5599e1P3L0j7Lk41M86m34J02N3l6K40n82L92j22r3L33m37M74k7l1j65L84q68M98
5623c6L05m76J14K15j56j8J87L9j21j45K38k00j2J60J05j67M1j32K25n00L62r8
5645g0j82L64r6K51j23o8R7k58J25p6n4L22Jj33j87o1J99j6P6p9n3j35L9J53k0
5670A6j70J73o8m3l9R8J82j64k23N28l85N5Q7kk9K37m9n00L12j1n9K3j21N5m1
5695a38K55l7o4m50L39p0J63O5n3k83M57j73RJ45J78m33L13k33R1J2rJ20k09l2
5719c7K4J84k99L82j99j92K32k7l7J49j63J85j14M4m31O19m22o1J31j10M0J12
5741A0n2K54l28O2J86k6j47j6M9q5K51l3j5j18l71K55j14M06o6j66K67j60Rk76
5765b24K71l9J64m3j63O1k03j97K27j6J62J05J99l42j38J75k2L05m57J07K34R6
$$ plain form
5787 262 -20 124 -160 39 -31 36 49 3 7 -53 95 6 141 -92 -110 -163 39 102 90 -193 69 -43 56 99 -9
5812 -9 164 228 -89 245 272 -453 8 -283 -166 126 60 -6 -106 29 69 93 42 35 252 -2 -99 -234 -126 159
5836 159 135 -203 -63 -20 39 -148 -53 -311 7 -4 71 19 -245 134 -148 -3 -145 232 -62 190 149 119 -283
5859 -283 76 -136 129 189 -26 -95 -133 206 41 245 -343 85 -79 -17 -87 -165 212 98 -213 96 259 -58
5881 -58 -175 -211 213 -19 96 186 -69 125 104 50 -97 -86 -12 -304 0 -214 8 91 -242 -188 110 70 270
5904 270 175 -167 34 -84 177 -155 257 -49 -157 367 -81 -97 20 191 -20 137 -49 -60 27 115 -3 96
5926 96 -43 -31 7 -177 -146 -172 -17 -12 126 -5 -7 153 1 -57 256 36 17 -86 61 -65 103 -181 -69 94
5950 94 122 145 51 -98 138 180 -111 -123 232 -114 -188 57 -46 83 -52 228 76 -90 -130 -154 -104 -51 -83 -231
$$ packed form
5787B62k82J44k84J99p0O7J3m6Mo0J48q9J35k33j8n3K02O3j2k83K62j12R9M3j08
5812iJ73O4l17L34K7p25M61k91J17K92o6o6j00J35M0K4n1pK17k54r7j35J08K85
5836A59k4l38J40M3N9j87R5k58L18j1P5n2k64L79k82J45j42L77k94K52m1l0m02
5859b83L59k12K65O0k15o9l8L39j65K04n88M28j64O2p0p8L77j14l11L09J63l17
5881e8j17l6M24k32J15R0k55J94k1n4j47J1P4k92L04k14K22Q3l33N4K98m0K00
5904B70r5l42K01j18K61l32M12l06j08N24m48j6J17J71k11J57j86j1Q7Q8j18R9
5926I6j39J2L8j84L1k6J55NJ38j31kJ60j52n8L13k20j9j03J47j26J68k84J12J63
5950I4K8K3r4j49K36M2k91j2L55l46p4K45j03J29j35K80j52j66m0k4N0N3l2j48
$$ plain form
5974 -231 12 -74 -5 324 -81 -57 -140 -239 206 191 75 36 -62 256 -261 123 -198 -49 -125 229 34 -84 -269
5997 -269 56 92 -7 -140 -81 80 161 92 -176 224 114 40 -166 51 82 -89 -70 -63 -97 132 -94 -281 -218 313
6021 313 -57 100 -155 -104 61 136 159 -3 158 -82 -121 0 -44 74 -197 92 93 6 189 47 -10 -257 74
6044 74 -75 -70 102 152 -76 -159 -34 -216 -203 -124 -228 296 -252 -28 74 -83 -102 -36 86 26 207 12 122
6067 122 -256 -8 -245 -111 44 -214 -260 -32 -46 1 -205 72 249 110 -32 50 -43 -39 101 109 163 -19 -89 23
6091 23 -297 -95 -145 64 142 -106 -1 170 52 19 -339 47 22 70 11 79 -132 -151 -191 -207 -165 12 -63 -223
6115 -223 6 -3 -58 10 -71 -192 110 38 2 38 50 14 54 -9 211 -231 -106 64 -67 19 176 -303 -75 17 38
6140 38 213 -32 137 -73 -253 22 178 40 223 138 92 -143 177 -122 66 15 -59 82 102 134 -136 -234 11
$$ packed form
5974b31K43q6O9L29m05K4q3r9M45j5j16l9r8L18n17L84l21J49p6L54j95j18j85
5997b69L25L6r9j33N9J61Q1o9k68M00j10p4k06K17L1j71J9Pl4K29k26j87O3N31
6021C13l70J57k55N1J65P5K3j62J61k40l9J21m4J18k71K89Jq7J83j42n7k47L31
6044G4j49NJ72N0k28q3J25j82J3P9j04N24n48K24J02j57j9O6J22o0J81j95J10
6067A22l78K48k37J34J55k58m6K28j4M7k06K77J77j39j42Q2r3MJ40QN4j82p0J12
6091B3l20K02n0K09P8k48J05J71j18l3l58L86k5M8n9O8k11j9m0j6M2J77p5j60
6115b23K29rn5O8q1j21L02p2l6L6J2l6M0o3K20m42J25J70j31Q6J57m79K28R2K1
6140C8J75k45J69k10j80K75J56j38J83q5m6k35L20k99J88n1p4J41K0L2k70r8K45
$$ plain form
6163 11 -92 -48 33 -103 -43 386 -165 -107 -171 -318 77 30 45 -33 -138 52 -17 18 -74 261 -163 -96 52 179
6187 179 -113 -82 -158 58 -187 -30 96 134 -39 81 -366 91 -52 8 -56 202 -136 110 5 -11 -69 16 167
6210 167 -170 -350 -161 -125 -65 -106 9 189 -16 -78 55 85 -280 -221 -196 -20 314 -72 42 79 -155 199 105
6233 105 -63 -52 -79 258 -121 -252 193 263 122 52 -146 -167 -116 -125 -40 102 -31 -294 167 14 140 62 259
6256 259 64 -181 55 -158 233 -129 68 126 3 -227 -307 21 25 107 -34 -65 77 3 92 57 172 -147 124
6279 124 113 -87 -62 -84 -17 -30 93 66 -97 122 81 285 240 75 137 5 179 30 -236 187 20 -29 -116 83
6303 83 105 -16 146 -2 85 41 317 -166 -82 25 -104 -29 51 10 149 26 193 44 55 -36 53 -90 -37 440
6327 440 250 178 -128 224 106 115 133 9 -75 -215 101 -230 -69 -90 -108 -74 214 168 189 162 132 57 -17 13 -105
$$ packed form
6163A1j03M4Q1j36O0M29n51N8o4j47L95m7J5p8j05J90o9L5r2L35m24O7J48J27
6187A79k92L1p6K16k45J57J26L8j73J20m47M57j43O0o4K58l38K46j05j6n8Q5J51
6210A67l37j80J89L6O0m1J15J80k05o2J33L0l65N9K5J76L34l86J14L7k34L54r4
6233A05j68J1k7L37l79j31M45P0j41p0j98k1N1rQ5J42j33k63M61j53J26p8J97
6256B59j95k45K36k13L91l62J97N8j23k30q0L28MQ2j41l1J42p4Q9l5J15l19K71
6279A24j1k00K5k2O7j3J23k7j63K19m1K04m5j65O2j32J74j49k66M23j67m9q7J99
6303H3K2j21J62j48Q7m4K76m83Q4J07j29P5Q0m1J39j23J67j49J1r1Q9j43N3M77
6327D40j90p2l06L52j18RJ8j24q4j40L16l31J61k1j8L4K88m6K1k7l0p5p4L0j18
$$ plain form
6352 -105 -204 146 105 -217 14 220 -44 -240 10 -210 159 -44 -61 96 45 51 -37 87 65 221 -138 -124 -74
6375 -74 100 -28 -119 -201 92 -11 132 212 16 -93 41 169 -78 -5 -45 -19 -142 -145 -6 3 -252 108 145 -29
6399 -29 -155 90 -93 24 81 -329 -242 -22 124 71 -113 -10 129 154 177 -303 -195 31 -82 -43 143 34
6421 34 44 18 -54 91 -42 -33 -225 -79 16 -4 -295 -133 -4 -265 126 69 -40 -306 -202 -57 3 92 182 -11
6445 -11 104 10 -33 85 76 127 -3 -59 -185 16 -224 1 64 221 -28 74 -225 -271 95 87 -232 -48 -172 35
6469 35 71 28 7 -11 -188 -324 178 30 -105 206 0 176 -55 -70 199 -271 31 -64 -54 98 -274 -150 110
6492 110 10 246 -52 -167 286 -211 -246 68 -28 223 169 35 -299 269 84 102 -164 53 -61 -273 -229 -150
6514 -150 192 11 -311 -7 -108 -94 -68 -193 108 68 -152 262 -292 88 7 76 -20 -43 -11 -66 -130 -129 34 -154
$$ packed form
6352a05r9L50m1l22K31K06k64j96K50k20L69k03j7J57n1Oq8J24k2J56l59J4N0
6375g4J74j28r1q2K93j03J43Q0j96j09J34J28k47P3m0K6j23lJ39Rk55L60L7j74
6399b9j26K45j83J17N7m10Q7K20J46n3j84J03J39K5K3m80J08K26j13L9J86j09
6421C4J0k6p2J45j33Rj92J46R5k0k91J62J29k61L91n7j09k66J04J45O0Q9R0j93
6445a1J15r4m3J18rN1j30n6j26K01k40K25O3J57k49J02k99m6L66ql19J84j24K07
6469C5L6m3k1j8j77j36N02j48j35L11k06J76k31j5K69m70L02r5J0J52l72J24K60
6492A10j00K36k98j15M53m97l5L14r6K51n4j34l34N68j85J8k66K17j14k12M4P9
6514a50L42j81l22L04j01J4K6j25L01m0k20M14n54L80q1O9r6k3L2n5o4JJ63j88
$$ plain form
6538 -154 68 24 -23 -176 -226 120 -129 -69 117 153 -87 -174 -120 -72 232 -159 99 2 -49 -32 -29 235 124 -58
6562 -58 -130 -42 -65 43 -83 -4 195 322 214 -51 -111 -46 -31 -135 -77 195 -53 153 187 -14 -121 27 -120
6585 -120 -128 78 183 91 333 -128 -46 121 -286 42 63 67 -29 212 -119 195 63 14 -28 -69 6 -29 -262 -130
6609 -130 212 -19 115 257 18 50 248 -22 151 -16 -228 -29 172 -213 122 61 70 -59 -36 426 -70 -158
6631 -158 135 -63 3 82 163 202 -92 112 -377 123 21 -66 70 -260 11 -37 -266 -18 -43 -7 142 66 62 23
6655 23 -17 189 -87 136 -327 -194 -115 -157 140 -127 -227 5 116 -180 131 22 192 -15 -29 -257 -85 185
6677 185 122 -92 24 76 11 53 -105 293 -141 131 176 23 -248 -92 25 -53 245 427 1 264 -11 -258
6699 -258 -268 -59 3 51 -28 26 79 -102 32 116 135 -2 161 155 -185 -67 176 -149 -175 -266 178 -8 -27 215
$$ packed form
6538a54K22m4m7j53n0L46k49O0J86L6k40q7N4M8L04l91K58r7n1J7LK64j11j82
6562e8p2Q8k3J08j26P9J99J27j08k65o0O5J5j04N8K72k48K06L4k01j07J48j47
6585a20qK06J05r2K42m61Q2J67m07L28K1Mr6K41l31L14j32m9m2m1P5l5k33J32
6609a30L42k31J34J42k39L2J98k70J73j67k12J99K01l85L35o1Rj29K3M62m96q8
6631a58K93j98O6P9Q1L9k94K04m89N00j02q7J36l30K71m8k29K48k5L6J49p6ml9
6655B3m0K06k76K23m63J33P9m2K97k67j00K32J11k96L11j09J70k07j4k28J72K70
6677A85o3k14J16N2o5M2j58L98m34K72M5j53k71J56J17p8K98J82m26K63k75k47
6699b58j0K09O2M8p9N4N3j81J34Q4J9j37J63ol40J18K43l25k6r1M44j86j9K42
$$ plain form
6723 215 -84 77 -73 -6 176 -155 -127 376 -114 -34 12 20 45 15 -258 148 -170 -3 85 -135 59 -54 -52 -153
6747 -153 166 27 225 97 -113 -11 -143 -131 167 -248 49 -7 -165 36 -104 101 -422 132 62 21 36 -30
6769 -30 324 8 -176 182 213 -119 -101 204 -105 82 329 -89 -86 50 -13 -50 -184 85 -153 106 -130 -151 -85
6792 -85 121 83 93 206 54 -142 -12 14 -124 -146 212 -64 30 145 -47 -16 157 47 55 32 199 214 34 71
6816 71 -45 -123 -6 -66 31 -60 -376 152 -21 161 -136 21 -37 75 39 -37 -100 108 -117 -105 101 -79 85
6839 85 -220 63 -164 -46 102 12 18 -156 106 125 98 -197 10 94 59 -48 -119 -151 -176 133 -91 -168 -297 -24
6863 -24 187 -162 -117 122 82 179 17 -23 -204 -135 37 168 99 299 -209 -47 15 -275 197 -89 -56 51 -236
6886 -236 -116 44 -102 -53 -235 -69 -218 -89 -11 148 -139 373 163 198 49 47 126 191 193 155 101 72 5 -286
$$ packed form
6723B15k99J61j50O7J82l31K8N03m90Q0M6QK5l0k73M06l18J67Q8k20J94j13Kj01
6747a53L19j39J98j28k10J02j32J2K98m15K97n6j58K01j40K05n23N54p0m1J5o6
6769c0L54l16j84L58L1l32J8L05l09J87K47m18LJ36o3l7j34K69k38K59k36k1O6
6792h5K06l8J0J13j52j96J30K6j38k2L58k76R4J15j92L1J73j10Qk3J67J5j80L7
6816G1j16p8J17o0R7r1l16N28j73J82k97J57n8J12l6p6o3K08k25J2K06j80J64
6839H5l05K83k27J18J48r0Oj74K62J9k7k95K07Q4l5j07p1l2k5L09k24p7j29K73
6863b4K11l49M5K39m0R7j62m0j81O9J72J31o9K00n08J62O2k90M72k86L3J07k87
6886b36J20J60j46M9j82J66j49J29P8J59k87N12k10L5j49kP9O5Kl8n4k9o7k91
$$ plain form
6910 -286 -27 67 -198 293 -30 -210 -3 -206 138 27 -6 -113 221 -257 -180 -133 76 -18 -298 33 -37 91
6932 91 -286 -14 186 64 26 -137 -51 -99 -210 -84 127 213 -86 21 100 135 184 -60 211 4 -5 -373 -95
6955 -95 6 -254 -115 195 -90 -82 -201 109 -113 54 215 -100 51 -167 41 119 -340 82 -247 102 193 286
6977 286 95 -48 36 -8 26 207 -92 153 4 -41 -121 142 183 -127 35 -121 60 240 -93 129 -346 -180
6999 -180 17 129 -162 -205 91 97 -32 -201 -7 11 166 -184 -74 160 -449 -64 50 164 119 -101 -157 -69
7021 -69 120 -129 -82 3 -100 -79 -51 152 125 -230 216 -64 120 -147 -26 -64 86 53 -126 169 -81 -29 -218
7044 -218 -91 -22 -80 110 188 -26 170 261 -279 -101 -199 31 113 -130 21 94 102 122 -71 111 -2 83 162 140
7068 140 -332 191 -68 -140 41 69 204 -7 146 -115 -100 49 -13 79 164 -108 -226 218 -229 21 -168 -131
$$ packed form
6910b86K59R4k65M91l23j80K07k03L44j11l3j07L34m78P7M7K09r4k80L31p0J28
6932I1l77K72K00j22l8j63Q6m8j11J26K11Q6k99J07P9L5M9k44K71k07rl68K78
6955i5J01k60J39L10k85Qj19L10k22J67J61l15J51k18K08P8m59M22l29L49R1R3
6977B86j91j43Q4m4L4J81k99K45j49m5q0K63M1l10J62j56J81J80l33K22m75J66
6999a80J97J12k91m3K96Oj29j69J94J8J55l50J10K34o09L85J14J14m5k20n6Q8
7021f9J89k49M7Q5j03K1K8K03k7l55M46k80J84k67J21l8J50l3j79K95k50N2j89
7044b18J27O9n8J90P8k14J96R1n40J78r8K30Q2k43J51P3QK0j93J82j13Q5P9k2
7068A40m72N23k59p2J81K8J35k11J53k61J5J49o2R2Q5k72j18M44m47K50j89L7
$$ plain form
7090 -131 116 137 -84 -51 -79 -59 -253 189 -96 321 267 -283 63 160 709 -357 327 -132 14 -243 159 264
7112 264 -340 -211 -328 -428 72 543 -45 -338 370 269 -5 -3 -37 -206 55 -246 155 -164 -225 77 71 -181
7134 -181 165 -89 3 -101 178 51 39 74 -251 -4 156 169 -108 2 30 0 4 82 -161 58 56 -276 -122 37
7158 37 18 126 194 64 2 110 -168 -60 344 -182 195 21 5 -90 199 97 28 145 354 -7 -52 64 90
7181 90 -125 246 14 139 119 -175 -6 -164 131 -167 199 165 203 -52 -158 255 2 -16 46 14 -372 70
7203 70 -116 -208 23 -27 -50 41 -50 -146 -101 -12 -14 -41 68 82 -66 -23 -51 -126 22 -31 116 128 50 22 122 -62 -23
7230 -23 -55 -161 -41 246 245 70 -142 201 13 63 -210 -53 220 143 -32 220 14 158 258 178 69 -53
7252 -53 93 51 133 -79 37 -4 39 -20 -72 48 -31 83 -99 -53 52 -126 40 37 62 156 126 -45 -71 -59 -21 37
$$ packed form
7090a31K47K1k21L3k8K0j94M42k85M17n4n50L46R7N49j066O84m59J46k57M02J05
7112B64o04J29j17j00N00M71n88k93P08j01k74Kl4j69K61l01M01l19o1L02ok52
7134a81L46k54R2j04K79j27j2L5l25K47J60J3k77J10K8l0MP8k43K19kl32J54J59
7158C7j9J08O8j30o2J08k78J08M04n26L77j74j6r5K89j02o9J17K09l61m5J16K6
7181I0k15L71k32J25k0k94J69j58K95k98L66l4L8k55j06M13k53j8O2l2l86M42
7203G0j86r2K31n0k3R1r1r6M5Q9kk7J09J4j48M3k8p5J48n3J47J2p8k8J00j84L9
7230b3l2j06J20K87jj75k12L43j88N0k73J57K73p7j75K52k06J44J00q0j09j22
7252e3J46m2Q2k12J16m1M3n9n2J20p9J14j82M6J05j78J66lK5R4l0j71k6J2L8N8
$$ plain form
7278 37 25 161 -112 -15 240 76 -81 -217 -154 17 -15 91 73 93 -138 -305 -67 -44 41 -78 52 -219 5
7301 5 128 28 -87 -564 83 -240 -55 82 5 -76 -205 -169 -52 59 175 -80 -51 -115 192 -27 -106 -124 -106
7324 -106 159 52 -240 26 345 -148 -41 -58 -199 -39 79 -133 -59 328 -218 -18 193 -113 -37 -166 -214
7345 -214 65 106 -6 -166 63 -107 -94 -101 -13 204 -197 188 103 -16 -176 99 -2 -409 80 67 49 -94 -16
7368 -16 26 74 37 47 163 39 -3 57 -225 -9 -25 75 -136 -246 79 58 -7 99 -291 307 -41 347 148
7391 148 -33 -4 -6 -15 124 47 171 -181 78 -16 211 304 26 50 174 140 -159 -108 136 -226 -341 -114 -179 115
7415 115 -66 45 139 155 -22 102 115 5 60 -49 199 86 -143 -127 -146 -100 23 23 176 171 -180 -31 -110 232
7439 232 11 206 -19 -24 23 -179 22 162 58 -26 -8 2 -232 34 202 -3 209 -72 -121 237 -39 190
$$ packed form
7278C7j2J36k73R7K55j64j57j36O3J71l2J06j8K0k31j67K38K3Q5j19J30k71K24
7301EJ23j00j15m77O47l23J85J37p7q1j29L6J17J11J16k55K9o4L07k19p9j8J8
7324a06K65j07k92K66L19m93J07j7j41J60J18k12P4L87n46K00K11l06P6j29m8
7345b14K79M1j12j60K29j70J3pQ8K17m01L85q5j19j60K75j01m07M89j3j8j43P8
7368a6M2M8l7J0J16j24m2O0k82K16j6J00k11j10L25k1o5J06l90N98l48L88j99
7391A48j81K9krJ39p7J24l52K59r4K27R3k78K4J24l4k99N1K44l62j15K27o5K94
7415A15j81J11R4J6j77J24J3j10N5j09K48j13k29J6j9M6J23%J53nl51J49p9L42
7439B32k21J95k25nM7k02K01J40j04q4J8J0k34K66J68k05K12k81m9L58k76K29
$$ plain form
7461 190 102 24 -213 -202 3 -114 -47 -192 31 -31 56 84 -14 48 -111 -84 83 88 -124 -173 -306 96 170 -14 -22
7486 -22 83 -377 34 -113 -68 76 -84 -11 24 233 -46 -177 288 22 -71 -202 192 175 -234 -2 26 -89
7508 -89 -277 24 -104 -79 -78 88 96 -184 -37 68 119 96 284 -11 -187 90 -38 -59 -378 73 -135 17 64
7531 64 70 17 -16 -31 -182 149 39 -38 93 165 41 -46 23 7 -5 -280 134 202 31 77 40 -209 -169 23 -48 -146
7557 -146 59 72 45 -113 22 -254 -71 118 -88 -212 -3 -47 65 -128 -91 -354 14 98 -54 -80 -2 23 -58
7580 -58 49 453 112 -168 289 -62 20 -84 292 -326 58 -121 -124 181 118 -122 -243 3 159 -107 -125 92
7602 92 106 69 90 -85 -65 198 65 -260 55 99 11 11 -64 24 37 269 0 -141 242 -181 -189 35 -38 -12 167
7627 167 201 -63 156 32 -80 -173 10 -332 51 224 -81 -48 -288 -47 -70 216 -34 -132 -143 125 -140 -97
$$ packed form
7461A90q8p8k37J1K05j17O7j45K23o2Q7K8r8O2j59K7J67Nk12m9j33M02P4j84q
7486b2J05m60M11j47M5J44j60P3L5K09k79j31M65k66r3j31L94j7m09K32K8j15
7508h9j88L01j28K5JJ66Qk80J47J05N1k3J88k95j76K77j28k1l19M51k08J52M7
7531F4On3l3j5j51L31j10p7J31P2j24q7O9j6j2k75M14O8j71M6l7k49M0J92p1r8
7557a46K05J3k7j58J35k76J83J89k06j24K09m4J12j93L7k63L68Q4j52k6P8K5q1
7580e8J07M04l41k80M57l51Q2j04L76o18L84j79lL05o3k40j21K46J56k66j8K17
7602I2J4l7K1j75K0K63j33l25L15M4q8%p5Q8J3K32k69j41L83m23qK24p3K6J79
7627A67L4k64K19j24j12r3J83l42L83J73l05L3k40K41k3K86k50r8j1K68k65M3
$$ plain form
7649 -97 -91 -27 206 70 -22 -56 118 -20 14 -11 -192 -146 197 65 268 -95 -234 -94 -127 229 -65 -184 75
7672 75 101 -121 94 167 -71 130 -397 79 -161 170 -42 36 98 173 -12 114 -200 -54 131 55 128 128 118 -134
7696 -134 161 53 -5 -5 69 -33 10 224 -83 -53 -235 -183 -149 -119 43 210 -253 -202 -98 68 3 129 46 -8
7720 -8 391 86 -85 271 151 -148 -146 -56 236 84 -99 49 -35 64 -57 -45 206 6 105 -9 96 38 213
7743 213 -222 133 10 12 65 -51 295 134 -127 -121 -13 59 -172 30 -1 -11 -359 -73 189 -349 228 267 -319
7766 -319 194 -131 -148 18 58 -168 -189 20 18 -60 143 246 -57 224 10 112 -99 -35 -345 -77 61 39 -194
7789 -194 0 -33 -86 -294 -74 188 -114 46 6 79 -34 0 -298 -439 -26 -115 5 156 264 -28 -125 80
7811 80 -111 -21 -83 -88 -190 266 -192 -182 23 161 95 -3 -72 29 237 -132 -137 -59 132 -11 70 241 103 77 -27
$$ packed form
7649i7OO4K33j36r2l4J74j38L4k5j81M6L43j32K03l63j39J40l3L56k94j19K59
7672G5K6k22K15P3k38K01n27M76k40L31k12P8O2P5j85J26l14J46J85p6P3%j0k52
7696a34K95j08n8%P4j02M3K14l07L0j82N2L4L0J62J67m63N1J04J66o5J26q3n4
7720hL99l05j71L56j20k99KR0K92j52j83J48q4R9j21J2K51k00R9j14J05n8J75
7743B13m35L55j23KN3j16L46j61k61OJ08P2k31K02l1j0l48K86K62n38N77L9n86
7766c19N13l25j7J66M0k26k1K09kp8K03J03l03K81k14J02k11O4l10K68J38k2k33
7789a94J94l3n3k08K20K62l02J60m0P3j13L4k98j41M13q9J20J51J08k92r7K05
7811H0j91R0o2nj02M56m58J0K05J38o6r8o9J01K08l69nP8J91j43Q1J71j38k6j04
$$ plain form
7836 -27 -189 -88 100 -258 63 50 144 203 -108 98 13 36 -75 67 -113 -60 -258 7 113 -98 -14 -190 88
7859 88 315 -218 45 130 -64 35 199 143 -105 -79 -39 -42 112 -322 -84 154 224 -53 -91 -39 189 65 -9 -203
7883 -203 -173 9 -180 -157 -73 -121 -180 42 259 -26 -217 -11 -39 154 -167 -86 -18 -69 -15 66 100 -70 31 19
7907 19 -5 34 128 -98 82 -116 106 218 -158 99 -5 -82 -8 -244 227 -171 192 56 311 -101 -144 -183 -70
7930 -70 -34 70 77 -153 71 -26 190 -11 5 -94 -93 277 -109 -174 299 14 83 33 93 -139 267 131 -83 70
7954 70 146 7 268 -3 -170 -156 -142 80 -427 -19 171 -45 -186 95 9 224 176 -34 42 126 379 -125 -140
7977 -140 61 -67 292 178 -103 -91 -258 -148 -127 33 112 45 -61 9 318 97 231 -10 -84 -106 45 84 -5
8000 -5 -271 118 36 -17 10 37 24 -6 62 147 171 -32 -76 -48 130 45 -88 81 -77 -190 3 66 -85 -143 -152 192
$$ packed form
7836b7j62J01J88l58L21j3R4N9l11K06q5K3j11J42j80N3j98K65J06k11Q4j76K78
7859H8K27n33K63Q5j94R9J64n6k48K6M0lJ54m34K38K38P0k77l8N2K28j24p4j94
7883b03L0J82j89K3Q4m8n9K22K17k85j91K06k8J93l21Q1O8n1N4Q1L4j70J01j2
7907A9k4L9R4k26J80j98K22J12l76K57j04p7P4k36M71l98L63j36K55m12m3l9J13
7930g0L6J04Pk30K24r7K16k01J6r9JL70l86o5M73k85O9n0O0k32M06j36k14J53
7954G0P6j39K61k71j67J4J4K22n07M08J90k16j41K81q6K15m8k10P6Q4K53n04j5
7977a40K01j28L59j14k81J2j67J10K1J60P9o7j06P0L09k21J34k41p4k2J51L9q9
8000ek66L89q2n3K7K7j3l0O8Q5K4k03m4K8J78q5j33J69j58j13J93O3j51n8rL44
$$ plain form
8026 192 76 -217 -43 71 90 189 -127 -98 -135 -15 271 137 -235 44 -192 -178 -17 -192 -122 20 -99 273
8048 273 214 -60 -80 -157 95 240 82 -107 -158 -22 -160 -131 203 60 -56 33 -195 157 123 248 -285 2
8070 2 -88 0 228 -226 35 0 209 -193 -30 -62 -139 -181 66 63 76 -65 19 -34 -26 53 -238 122 -233 -114 14
8095 14 -225 47 143 -40 93 -72 -79 41 22 -119 -21 -312 -12 -228 -77 -112 214 24 -10 52 -196 -94 38
8118 38 137 -155 45 -162 92 -235 167 -220 108 -56 24 -200 58 -70 18 -255 140 2 198 -80 -102 -6
8140 -6 4 14 -119 200 -57 261 -359 77 -36 163 380 -17 35 18 351 73 -56 86 -198 -197 68 27 68
8163 68 -136 142 -74 -22 290 162 -38 -44 41 47 -157 59 110 -82 120 13 26 93 -82 -125 188 -72 102 -23
8187 -23 150 -184 156 -53
$$ packed form
8026A92j16k93J74J14J9R9l16K9l7J20K86j34l72K79k36J4J61j75P0J42j19L72
8048B73n9k74k0p7K52J45j58j89n1J36j38K9L34j43j16Q9k28L52l4J25n33K87
8070Br0Q8K28m54K61l5K09m02J63l2p7m2K47lJ3j41Q4n3QP9k91L60l55J19J28
8095A4k39K72R6j83J33j65pJ20j9j41R8k91L00k16J51l5L26j90l4O2k48J02J32
8118C8R9k92K00k07K54l27M02l87L28j64Q0k24K58j28Q8k73L95j38J96k78k2R6
8140fJ0J0j33L19k57L18o20M36j13J99K17l97N2j7L33k78j29J42k84JK65m1M1
8163F8k04K78k16N2L12j28k00oQ5Ok04K16N1j92K02j07J3O7j75m3L13k60J74j25
8187b3J73l34L40k09
8191e3
$$ Imaginary data points
##PAGE= N=2
##DATA TABLE= (X++(I..I)), XYDATA
$$ plain form
0 0 0 0 0 0 0 0 0 0 0 0 0 0 -8 8 -8 8 -9 16 -16 24 -24 32 -37 40 -48 56 -65 80 -89 104 -120 136 -153 175
34 175 -193 219 -249 275 -308 345 -384 426 -473 524 -578 639 -705 778 -858 944 -1039 1145
52 1145 -1263 1392 -1539 1706 -1893 2109 -2364 2661 -3019 3459 -4017 4746 -5749 7214 -9568
67 -9568 13984 -25129 118039 159399 -33153 48652 32099 -73740 -81065 -22782 -59917 -44910
79 -44910 12680 6886 -24589 28583 25419 -35771 -20345 14787 -22014 -2899 40572 19888 6446
92 6446 32485 20406 -115 2190 -2654 -22624 -16360 -5849 -22115 -24016 2693 -2970 -17018
105 -17018 522 7620 1957 12032 11815 7318 13847 11937 3222 6989 5895 -2087 -3839 955 -2425
120 -2425 -9276 -2900 -3485 -12776 -4370 -1495 -13631 -4186 7385 -2487 -2581 10402 8909 2532 5762
$$ packed form
0@%%%%%%%%%%%%qJ6j6J6j7K5l2M0m8N6o9P7q8J04j21J45j69J93k24K56k89L28
34A75l68M12m68N24n83O53p29Q10q99R97j102J217j344J483j636J802j983K184
52A145k408K655k931L245l599M002m473N025n680O478p476Q763j0495J2963j6782
67i568K3552l9113J43168M1360j92552Q1805j6553j05839p325N8283l7135J5007
79d4910N7590n794l1475N3172l164o1190J5426L5132l6801J9115M3471k0684j3442
92F446K6039j2079k0521K305m844j9970O264J0511j6266j901K6709n663j4048
105a7018J7540P098n663J0075k17m497O529j910q715L767j094p982j752M794l380
120b425o851O376n85r291Q406K875j2136R445J1571r872r4J2983j493o377L230
$$ plain form
135 5762 7168 790 652 3800 -3660 -6743 1920 -1157 -7450 -408 -199 -5338 -1172 1040 -2432 -642
151 -642 3295 1522 -661 2329 4789 1252 2053 3877 -464 -818 1860 -1189 -3039 -423 -1377 -3094
167 -3094 -2114 -1044 -715 -356 557 651 106 1630 1913 504 1041 911 -82 773 508 -165 362 113 -1011
186 -1011 -800 -835 -1045 -984 -922 -14 -483 -403 384 577 909 797 -127 573 1089 -230 -49 602 -352 -484 -157
207 -157 -282 -223 -181 -123 -186 -263 316 200 -124 463 6 -301 288 659 -150 136 328 -60 -123 -382 -65 -691
229 -691 -303 -151 -454 -418 598 129 87 307 285 -188 -195 80 -495 61 734 -338 591 95 -32 -845 621
250 621 185 -147 -401 70 -172 -166 139 -128 88 174 319 153 -19 -100 187 -91 -238 139 -165 9 -272 -94
272 -94 519 -55 -107 15 -37 -6 -26 194 -82 167 143 84 99 -114 -74 90 92 166 -98 -117 -45 207 -8 90 266
$$ packed form
135E762J406o378j38L148p460l083Q663l077o293P042K09n139M166K212l472J790
151f42L937j773k183K990K460l537Q01J824m341l54K678l049j850K616r54j717
167c094R80J070L29L59R13R4n45J524K83j409N37j30r93Q55k65o73N27k49j124
186a011K11l5k10O1O2R08m69Q0P87J93L32j12r24P00N16j319J81O51r54j32L27
207a57j25N9M2N8o3p7N79j16l24N87m57l07N89L71q09K86J92l88o3k59L17o26
229f91L88J52l03L6J016m69m2K20k2m73pK75n75N56O73j072R29m96j27q13J466
250F21m36l32k54M71k42OL05k67K16Q6J45j66j72q1K87k78j47L77l04J74k81J78
272i4O13n74n2J22n2L1k0K20k76K49k4n9J5k13M0J64KP4k64j9P2K52k15R8J76
$$ plain form
297 266 111 -32 -62 -26 -183 -121 -58 -75 -5 218 -68 -294 7 -160 7 13 6 167 -96 -84 -29 145 26 21 106
322 106 -73 -20 -221 320 204 -100 -98 46 -68 -140 157 183 260 -128 346 83 271 76 23 -56 -369 -28 226
345 226 -147 6 62 18 -95 169 -29 79 -81 351 146 -129 4 123 -8 256 -116 -9 -149 -56 85
366 85 -130 -67 -60 287 29 117 -117 -85 -100 24 -72 14 3 113 186 155 -7 -59 35 -250 -169 -84 -221 -14 -85 116
392 116 -142 47 11 -39 -32 -109 110 225 206 153 29 -420 130 -107 4 -6 35 124 31 -18 49 125 -103 25 -111
417 -111 -69 122 -184 -1 -130 -126 -205 -46 75 104 4 147 164 244 94 -85 41 -261 99 15 -150 91 70
440 70 -257 -122 268 -98 97 36 149 -209 -115 -178 21 -279 82 9 81 -181 -168 -19 2 -195 -88 -148 95
463 95 85 -124 7 182 148 -18 -253 -205 73 -139 219 -60 -5 -31 -104 96 -47 129 332 327 -31 -199 -126 -47
$$ packed form
297B66j55j43l0L6j57O2O3j7P0K23k86k26L01j67J67OpJ61k63J2N5J74j19nQ5
322A06j79N3k01N41j16l04KJ44j14p2K97K6P7l88M74k63J88j95n3p9l13L41K54
345B26l73J53N6m4j13K64j98J08j60M32k05k75J33J19j31K64l72J07j40R3J41
366H5k15O3PL47k58Q8k34L2j5J24r6Q6j1J10P3l1j62n2R4k85Q1Q5j37K07p1K01
392A16k58J89l6n0Pp7K19J15j9n3j24m49N50k37J11j0M1Q9r3m9O7P6k28J28j36
417a11M2J91l06J83j29Mp9J59J21K9j00J43J7Q0j50j79J26l02L60q4j65K41k1
440G0l27J35L90l66J95o1J13l58R4o3J99l00L61p3P2k62J3J49K1j97J07o0K43
463I5j0k09J31J75l4j66k35M8K78k12L58k79N5k6p3K00j43J76K03nl58j68P3P9
$$ plain form
487 -47 -2 48 196 66 65 269 5 -95 106 10 -158 -127 -115 105 42 -17 -153 21 109 26 -137 -50 -160 137 -167
512 -167 -191 -161 -150 121 88 101 -253 -329 360 297 -102 59 -433 41 197 -30 52 32 199 -172 -109 -54 85 29
536 29 15 56 165 43 -179 70 48 87 145 142 -72 -17 35 89 3 234 -206 -208 -4 81 -167 217 -113 -161 166 -101
562 -101 -84 -41 -132 6 33 215 -39 -74 -216 114 177 -66 398 -119 -69 -85 151 2 82 -44 -198 235 -47
585 -47 57 229 45 78 -125 149 78 4 42 35 76 32 -81 -152 -34 110 -55 -197 -48 -25 20 93 29 47 -268
610 -268 -117 -236 118 -126 -309 -8 -99 303 32 69 -276 64 83 27 -184 -111 -76 117 80 -140 23 -155 70
633 70 -29 119 -169 -267 70 -13 -21 192 -218 92 -97 64 -9 11 226 -35 -3 1 -54 228 7 -21 -61 335 -20
658 -20 38 -207 -344 -194 -104 -24 145 243 113 -152 -98 -155 71 42 94 101 -62 143 -69 -12 39 -142 55 -219 20
$$ packed form
487d7M5N0J48j30jK04k64j00K01r6j68L1J2K20o3n9j36J74Q8q3j63Q7j10K97l04
512a67k4L0J1K71l3J3l54p6O89o3l99J61m92M74J56k27Q2k0J67l71O3N5J39n6
536B9j4M1J09j22k22K49k2L9N8lk14N5N2N4q6K31m40kK04Q5k48L84l30m8L27k67
562a01J7M3r1J38K7J82k54l5j42L30O3k43M64n17N0j6K36j49Q0j26j54M33k82
585d7J04J72j84L3k03K74p1p4L8pM1m4j13p1J18J44j65j42J49K3M5P3o4J8l15
610b68J51j19L54k44j83L01r1M02k71L7l45L40J9n6k11P3L5J93l7k20J63j78K25
633G0r9J48k88r8L37q3qK13m10L10j89J61p3K0K15k61L2Mn5K82k21k8m0L96l55
658b0N8k45j37J50R0Q0J69R8j30k65N4n7K26k9N2Pj63K05k12N7N1j81J97k74K39
$$ plain form
683 20 -15 -306 -81 -68 117 48 -296 -21 74 271 -93 77 -264 -325 254 177 -74 -39 95 -109 22 42 -62
706 -62 119 -74 -300 38 -52 -205 391 74 -61 26 -15 108 96 -144 -73 -223 10 85 -186 100 8 204 193
729 193 77 -83 50 93 -110 80 203 -96 -55 110 -81 40 -82 -153 38 114 105 -63 -75 -159 25 -202 95
752 95 -201 -20 -265 88 194 -145 -119 -58 411 -131 -289 -231 -90 -214 110 81 130 -181 154 -109 138 15
774 15 246 99 -179 1 27 -188 141 -149 -176 -88 37 71 -301 180 107 263 106 169 208 -180 153 41 15
797 15 -200 180 -6 -30 -148 120 100 -218 118 -74 -2 -147 6 -27 16 -75 -268 2 1 302 166 108 3 0
821 0 178 225 74 73 95 -186 -134 345 -98 -315 -91 -135 384 -187 64 -4 36 -3 77 -56 321 -23 -93 -24 63
846 63 -37 -106 355 134 -77 176 -303 32 57 160 62 -64 25 64 64 61 -12 -12 103 7 -83 -59 57 -75 -154 131
$$ packed form
683B0l5k91K25J3J85o9l44K75R5J97l64J70l41o1N79p7k51L5J34k04J31K0j04
706f2J81j93k26L38r0j53N96l17j35Q7m1J23j2k40P1j50K33P5k71K86r2J96j1
729A93j16j60J33M3k03J90J23k99M1J65j91J21j22p1J91P6rj68j2q4J84k27K97
752I5k96J81k45L53J06l39K6O1M69n42j58N8J41j24L24k9M9l11L35k63K47j23
774A5K31j47k78J80K6k15L29k90k7Q8J25L4l72M81p3J56j57O3L9l88L33j12k6
797A5k15L80j86k4j18K68k0l18L36j92P2j45J53l3M3r1j93K70jL01j36n8j05l
821@J78M7j51jK2k81N2M79m43k17K24m4N19n71K51o8M0l9Q0j33L77l44p0O9Q7
846F3j00o9M61k21k11K53m79L35K5J03r8j26Q9L9%lp3%J15r6r0K4J16j32p9K85
$$ plain form
872 131 309 76 -89 -96 61 -43 32 127 27 -16 348 38 -57 90 -66 -250 -79 302 32 19 -146 26 52
895 52 221 -184 -47 123 -82 -193 -93 233 9 186 -29 141 -66 57 -10 248 -47 -117 142 54 39 290
917 290 -34 -75 -208 -139 110 -75 150 -50 5 -91 50 -28 -83 -21 39 -60 331 126 43 86 318 324 227 -44 -36 -144
943 -144 11 -29 -131 15 61 171 352 133 111 80 455 -44 28 -142 -79 70 -12 71 -37 -97 104 -159 -28
966 -28 11 -242 -424 148 21 75 52 -5 -51 -385 -294 224 -278 -88 -243 119 166 -148 8 -187 136 -162 19
989 19 280 -71 -71 -31 -29 -3 12 53 25 31 -243 -64 -156 -244 -118 97 -8 -36 -112 140 -13 -68 -217 164 -14 -203
1015 -203 -16 8 76 -46 120 -139 85 -69 167 -61 179 313 105 89 46 24 -4 -81 -100 108 134 -64 218
1038 218 -100 7 126 -142 28 -222 -26 -125 33 88 -109 -23 311 -180 -115 -241 -68 -160 -85 -204 -114 19
$$ packed form
872A31J78k33j65pJ57j04P5R5j00m3L64l10r5J47j56j84J71L81k70j3j65J72K6
895E2J69m05J37J70k05j11J00L26k24J77k15J70k07J23o7K58k95p0K59q8j5K51
917B90l24m1j33O9K49j85K25k00N5r6J41p8n5O2O0r9L91k05q3M3K32Or7k71Qj08
943a44J55m0j02J46M6J10J81k19k2l1L75m99P2j70O3J49q2Q3j08o0K01k63J31
966b8L9k53j82N72j27N4k3n7m6l34R1N18n02J90j55L62M7l14J56j95L23k98J81
989A9K61l51%M0KK6J5M1k8Ok74J79r2q8J26K15j05k8p6K52j53n5j49L81j78j89
1015b03J87K4O8j22J66k59K24j54K36k28K40J34k08j6m3k2k8p7j9K08K6j98K82
1038B18l18J07J19k68J70k50J96r9J58N5j97Q6L34m91O5j26J73r2P5j19R0J33
$$ plain form
1060 19 -95 107 48 89 -9 73 78 9 -75 -206 12 168 81 -58 6 100 1 84 159 -128 251 -182 -138 -33 -173
1085 -173 61 110 0 -28 -77 244 130 157 -53 -125 -220 -51 582 503 12 -278 -177 595 -438 145 -486 271
1107 271 373 -276 67 -241 -207 -40 -194 109 -372 158 -115 -116 122 -155 288 -95 -290 -77 160 -98 -124
1128 -124 17 62 -257 -112 -194 -56 -189 197 -172 0 75 12 84 -209 -121 -261 178 -174 -187 -130 143 8 -151
1151 -151 40 88 118 187 -332 70 -177 -62 -2 -21 -70 37 -111 -149 151 -62 44 8 103 287 46 206 -96
1174 -96 43 -75 7 -7 195 280 -116 -49 131 -9 15 240 -24 -226 96 -175 30 33 -72 210 -122 -176 -146
1197 -146 -141 130 44 -23 -156 -261 267 49 38 -21 -2 36 -42 9 165 -289 101 -160 -319 -49 -166 -63 252
1220 252 148 -114 -145 -140 -3 -194 -9 -146 -180 89 25 -68 -114 77 92 -42 -74 -109 -103 124 41 -179 -94 23 60
$$ packed form
1060A9j14K02n9M1r8Q2No9q4j31K18J56q7j39O4R4r9Q3P5k87L79m33M4J05j40
1085a73K34M9j10k8m9L21j14K7k10p2r5J69O33p9m91k90J01P72j033N83o31P57
1107B71J02o49L43l08L4J67j54L03m81N30k73jK38k77M43l83j95K13K37k58k6
1128a24J41M5l19J45q2J38j33L86l69J72P5o3P2k93Q8j40M39l52j3N7K73j35j59
1151a51J91M8L0O9n19M02k47J15O0j9m9J07j48l8L00k13J06l6R5J84k41J60l02
1174i6J39j18Q2j4K02Q5l96O7J80j40K4K25k64k02L22k71K05Lj05K82l32n4L0
1197a46NK71q6o7j33j05N28k18j1n9J9L8p8N1J56m54L90k61j59K70j17J03L15
1220B52j04k62l1NJ37j91J85j37l4K69o4r3m6J91J5j34l2l5OK27q3k20Q5J17L7
$$ plain form
1245 60 -182 -115 -96 -227 21 -18 -30 -151 0 22 -50 49 76 -82 -51 -120 -126 -192 57 -120 15 27 27 199 17 -163
1271 -163 208 -67 -70 -228 209 136 -8 68 180 93 -199 185 60 102 229 166 66 78 153 -33 -113 66 124 -137
1295 -137 35 179 -320 190 48 122 134 -314 10 190 -15 87 57 -103 72 -1 -39 225 125 -54 -72 -4
1317 -4 -234 -211 141 88 -248 -101 -166 72 60 291 90 -47 30 260 -7 217 -104 4 -53 -219 30 135 139
1340 139 244 121 -199 248 111 -215 232 -48 -191 37 56 365 33 180 -83 182 -157 258 -69 -192
1360 -192 -129 -234 82 -138 234 9 58 25 -21 -15 -25 -43 -56 132 -2 27 16 44 -36 -14 -57 63 57 137 -1 75
1386 75 78 16 -71 5 79 -27 0 313 -221 5 -310 43 -295 -90 -326 -588 146 -443 -296 -131 -302 -715 -407
1409 -407 208 392 -304 16 -428 19 553 130 80 33 12 -47 -76 290 -174 181 89 -32 153 -226 -54 -82
$$ packed form
1245F0k42O7J9j31K48l9j2j21J51K2p2R9K7j58L1o9oo6K49j77J35J2%J72j82j80
1271a63L71k75lj58M37p3j44P6J12q7k92L84j25M2J27o3j00J2P5j86q0J79N8k61
1295a37J72J44m99N10j42P4J2m48L24J80k05J02l0j60J75p3l8K64j00j79j8O8
1317dk30K3L52n3l36J47o5K38j2K31k01j37P7K30k67K24l21J08n7j66K49J05M
1340A39J05j23l20M47j37l26M47k80j43K28J9L09l32J47k63K65l39M15l27j23
1360a92O3j05L16k20L72k25M9l3m6Oj0j8j3J88j34K9j1K8q0K2m3J20oQ0j38P6
1386G5Lo2q7P6P4j06K7L13n34K26l15L53l38K05k36k62P34n89J47J65j71m13L08
1409d07O15J84o96L20m44M47N34m23n0m7k1n9k9L66m64L55r2j21J85l79J72k8
$$ plain form
1431 -82 108 79 -12 -58 70 88 -33 -154 107 27 186 94 69 -136 -143 -44 107 -13 234 -118 -102 94 -44 -248
1455 -248 4 33 -21 -52 18 -118 -246 -15 196 -138 -168 245 -113 -221 -98 164 -141 -218 -235 68 162 91 103
1478 103 -231 -94 90 -191 105 -14 104 -194 -203 7 -111 -75 -163 97 -160 -31 -72 -124 8 -75 52 9 17
1501 17 124 -82 111 -51 146 -60 -99 295 26 194 66 -141 -265 49 53 68 267 -70 -181 97 -313 -53
1523 -53 101 -273 86 -152 -53 -130 54 131 95 -5 5 242 -92 30 -48 -42 107 130 -279 45 -292 -214 61 -287
1547 -287 59 -33 93 -162 -54 418 -130 38 -193 -49 -16 -62 155 -82 -106 109 -72 15 -58 164 -202 -227
1569 -227 19 180 92 71 -46 119 -87 162 249 -207 29 -77 20 48 10 22 119 378 -156 66 121 -67 -172
1592 -172 6 -97 84 105 414 70 194 32 -14 74 191 160 -53 -68 -227 40 -168 78 -50 183 50 -26
$$ packed form
1431h2J90k9r1m6J28J8j21j21K61q0J59r2k5k05pR9J51j20K47l52J6J96j38k04
1455b48K52K9n4l1P0j36j28K31K11l34l0M13l58j08J23K62l05p7j7L03R4p1J2
1478A03l34J37J84k81K96j19J18k98rK10j18L6q8K60k57J29m1n2J32q3J27m3Q
1501A7J07k06J93j62J97k06l9L94k69J68j28k07j24L14MJ5J99l37j11K78m10K60
1523e3J54l74L59k38R9p7J84P7l6j00J0K37l34J22p8OJ49K3m09L24l37P8K75l48
1547b87L46r2J26k55J08M72n48J68k31J44L3m6K17k37k4K15j81Q7p3K22l66k5
1569b27K46J61q8k1j17J65k06K49Q7m56K36j06R7K8l8J2R7K59n34K22N5j88j05
1592a72J78j03J81K1L09l44J24j62m6Q8J17l1k13j5j59K67k08K46j28K33j33p6
$$ plain form
1614 -26 212 -63 -38 175 -129 -130 138 3 -28 -92 252 24 186 -9 90 -73 28 -72 151 182 8 -136 -58
1637 -58 94 83 -467 -99 137 -20 37 -86 60 -88 -123 -65 -189 97 218 -43 70 -95 161 59 -242 -133
1659 -133 58 -159 172 -47 -2 -134 -231 -169 -72 -39 209 -83 246 -47 69 107 -6 -46 75 41 62 -96 -53
1682 -53 124 120 -227 -19 -31 -96 -5 -2 -52 88 -82 -49 -73 -13 20 159 -169 -43 311 212 166 -178 -20 96 -372
1707 -372 60 -30 -8 30 -110 -414 6 49 208 239 72 -90 95 109 -151 7 76 -138 -49 -159 121 68 -24
1730 -24 -177 -102 112 -24 -278 79 119 58 365 -54 168 -154 -183 49 -60 59 -103 -69 39 183 97 -9
1752 -9 -41 35 -162 79 204 178 -204 -158 17 21 77 -75 -18 -32 98 221 91 36 -49 -35 -68 120 -73 -248 195
1777 195 -176 20 28 -120 202 108 205 -230 213 70 228 214 79 -219 80 302 57 -37 -39 -25 -11 24 -157 94
$$ packed form
1614b6K38k75K5K13l04jK68j35l1o4L44k28J62j95R9j63J01j00K23L1j74j44P8
1637e8J52j1n50L68K36j57N7j23J46j48l5N8j24K86J21k61J13j65K56j02l01J09
1659a33J91k17L31k19M5j32r7O2R7L3K48k92L29k93J16L8j13m0J21l4K1j58M3
1682e3J77ml47K08j2o5R1Ln0J40j70L3k4O0L3J39l28J26L54r9m6l44J58J16m68
1707c72M32r0K2L8j40l04M20M3J59L1j67j62J85J4k60J58O9k14Q9j10K80n3r2
1730b4j53P5K14j36k54L57M0o1L07m19K22l22k9K32j09J19j62L4J08J44q6j06
1752il2P6j97K41J25k6l82M6J75MN6j52N7j4J30J23j30n5q5J4l3J88j93j75M43
1777A95l71J96Qj48L22r4R7m35M43j43J58j4j35k98K99K22k45r4kJ4J4L5j81K51
$$ plain form
1801 94 39 208 93 49 -45 -158 -15 212 134 -25 251 -218 48 43 -62 -94 -179 2 116 283 -162 -93 -49 -105
1825 -105 -138 -141 85 -117 46 104 301 161 256 141 -87 -2 -234 17 135 -47 -39 154 -185 -32 -200 -67 69
1848 69 -192 192 113 -58 -71 -199 -61 -128 -154 -9 21 -98 -103 -32 23 304 -102 176 -244 101 -109 -266 38
1871 38 -113 211 -66 -146 241 -58 104 215 -147 314 -111 16 -196 -92 -138 39 -39 56 -45 163 167 -73
1893 -73 126 67 59 38 -21 60 25 18 195 192 209 32 -77 8 -127 78 -6 101 -172 -178 159 21 139 -68 0 136
1919 136 -198 75 89 -145 66 194 -48 -131 57 -227 163 190 83 37 106 159 -218 72 -144 86 -47 14
1941 14 -34 6 -25 -114 -140 -13 -13 32 145 96 26 124 18 25 216 -77 29 -80 -77 126 -108 -142 -161 146 353 -121
1967 -121 -32 -168 133 -22 143 -3 59 -63 -168 -150 -100 125 93 -183 -14 65 -120 -101 52 98 240 61 209
$$ packed form
1801I4n5J69j15m4r4j13J43K27p8j59K76m69K66nj05l2q5J81J14J67m45O9M4n6
1825a05l3lK26k02J63N8J97j40R5j15k28Q5k32K51J18j82QJ93l39J53j68J33J36
1848F9k61L84p9j71j3j28J38o7k6J45L0j19nP1N5K81m06K78m20L45k10j57L04
1871C8j51L24k77q0L87k99J62J11l62M61m25J27k12J04m6J77p8R5j01K08Mk40
1893g3J99n9qk1n9Q1l5pJ77lJ7j77j09Q5j35K05q4J07k73oL37j38J18k07O8J36
1919A36l34K73J4k34K11J28k42q3J88k84L90K7j07m6O9N3l77K90k16K30j33O1
1941A4m8M0l1q9k6J27%M5J13m9p0R8j06PJ91k93J06j09LK03k34l4j9L07K07m74
1967a21Q9j36L01j55J65j46O2j22j05J8N0K25l2k76J69P9j85J9J53M6J42j79J48
$$ plain form
1990 209 263 91 98 -227 103 31 304 46 177 -182 -169 205 -72 -179 -139 -58 62 -133 -349 170 77 125 -106
2013 -106 -49 107 18 -106 164 -141 122 47 -63 313 -3 50 29 68 -132 -204 -93 142 -5 -39 -127 83 55
2036 55 298 254 17 18 -94 72 -138 106 165 6 -51 -63 71 9 148 -9 -239 31 -182 -109 72 162 127 280
2060 280 218 -10 -77 -137 15 -162 -264 -178 242 194 20 -15 -37 48 40 -4 -91 -202 -160 20 -234 -191 -3 116 18
2085 18 -229 53 17 -28 -8 349 -40 39 -256 -63 127 158 81 -113 41 174 365 64 -147 -32 -114 60 -230
2108 -230 -201 38 170 -97 -358 150 -206 -154 -140 246 114 -130 48 -125 -236 -42 -96 -12 93 -108 296 71
2130 71 74 -171 -10 -109 -306 55 101 -75 -104 129 26 157 -9 169 -44 -41 -19 15 111 -145 -5 -47 64 -89
2154 -89 107 106 -68 360 21 -32 -44 152 205 -186 -23 -161 -110 19 108 81 1 9 22 -178 44 -215 -92 90
$$ packed form
1990B09N4j72Pl25L30p2K73k58J31l59J3L74k77j07M0Q1J20j95k16N19r3M8k31
2013a06N7J56q9j24K70l05K63p5j10L76l16N3k1L9k00p2J11K35j47l4q8K10k8
2036E5K43m4k37Jj12J66k10K44N9j59n7j2J34o2J39j57k30K70k13P3J81R0l5J53
2060B80o2k28o7o0J52j77j02Q6M20m8j74l5k2Q5qm4q7j11M2J80k54M3J88J19r8
2085A8k47K82l6m5K0L57l89P9k95J93J90L1p7j94J54J33J91l01k11J15q2J74k90
2108b30K9K39J32k67k61N08l56N2J4L86j32k44J78j73j11J94n4Q4J05k01M04k25
2130G1Lk45J61r9j97L61M6j76k9K33j03J31j66J78k13LK2L4R6k56J40m2J11j53
2154h9J96jj74M28l39n3j2J96N3l91J63j38N1J29Q9k7q0QJ3k00K22k59J23J82
$$ plain form
2178 90 -200 50 -156 -38 213 -111 123 -92 61 90 -69 -83 -98 -54 -189 55 196 -96 -156 -111 -170 -160 -76
2201 -76 109 -359 -95 -212 129 -121 -18 -65 -28 106 -61 -257 47 69 -116 -130 -52 -18 10 206 10 -20 107
2224 107 -29 -191 -67 -61 -136 -84 23 28 -223 -32 -6 -90 89 -51 -156 -213 -57 -201 54 -223 192 -208 48
2247 48 -58 -54 103 -91 26 -160 1 85 -67 -176 -113 -106 63 50 -154 156 -244 -215 -110 -244 -65 -154 25
2270 25 193 17 -45 -182 -190 81 242 8 -137 -264 52 5 -141 81 -57 -101 88 -82 33 -311 -188 88
2292 88 -197 126 218 233 -141 195 86 134 15 -10 -117 -120 24 104 275 35 -55 -96 435 -50 -241 156 -265
2315 -265 76 39 -3 78 217 10 -79 301 165 -70 208 -102 7 76 -230 -74 -119 10 124 -42 115 26
2337 26 -7 144 -22 321 -1 79 -185 -144 -1 -240 -181 250 14 194 220 -112 111 114 -15 264 52 -109 -147
$$ packed form
2178I0k90K50k06J18K51l24K34k15J53K9j59j4j5M4j35K44J41k92o0M5n9J0Q4
2201g6J85m68K64j17L41k50J03m7L7J34j67j96L04K2j85j4P8L4K8J96j96l0J27
2224A07j36j62J24Op5N2J07Nk51J91K6q4J79j40j05n7J56j44K55k77M15m00K56
2247D8j06MJ57j94J17j86J61Q4j52j09O3PJ69j3k04L10m00K9J05j34J79q9J79
2270B5J68j76o2j37qK71J61k34j45j27L16m7j46K22j38m4J89j70J15l44J23K76
2292H8k85L23R2J5l74L36j09M8j19k5j07lJ44Q0J71k40r0m1N31m85j91L97m21
2315b65L41l7m2Q1J39k07q9L80j36k35K78l10J09O9l06J56m5J29J14j66J57q9
2337B6l3J51j66L43l22Q0k64M1J43k39N9M31k36J80K6l32K23Lj29K79k12j61l8
$$ plain form
2360 -147 -54 172 23 24 -76 -48 -65 4 69 134 -28 22 45 159 123 -107 -59 9 -109 19 74 203 -86 232 -86
2385 -86 59 115 53 14 -30 -90 83 -47 -65 -40 44 -52 -56 -120 196 -154 8 237 -189 -118 -108 -52 160 32 -329
2410 -329 90 -94 297 24 -12 89 231 66 -84 55 23 -32 402 113 123 -28 490 94 -17 -70 11 91
2432 91 8 85 -192 96 -205 20 -166 14 -110 -237 -98 -120 -88 31 299 59 105 -114 162 -26 -38 -73 -168
2455 -168 126 -65 -64 18 -67 -18 -119 -119 168 147 -11 -298 -26 -218 1 68 62 32 -157 166 83 -20 257 -149
2479 -149 -16 47 378 3 115 174 -92 304 47 -156 13 -16 -42 -40 147 -436 12 -357 23 -78 -46 14 263
2502 263 -100 -159 -82 209 -93 -44 46 -125 176 -9 -14 122 48 11 -86 -18 -270 -258 -159 117 91 14 -328 -61 265
2527 265 102 227 182 53 99 -150 -162 67 282 185 -165 240 46 131 -7 122 122 248 -59 -100 116 132 -79
$$ packed form
2360a47R3K26j49Jj00K8j7O9O5O5j62N0K3J14l6k30M8O8j18J28N5J29k89L18l18
2385h6J45N6o2l9m4o0J73j30j8K5Q4r6mo4L16l50J62K29m26P1J0N6K12j28l61
2410c29M19j84L91k73l6J01J42j65j50J39l2n5M34k89J0j51N18l96j11n3Q1Q0
2432I1q3P7k77K88l01K25j86J80j24j27J39k2L2J19K68k40M6k19K76j88j2l5r5
2455a68K94j91JQ2q5M9j01%K87k1j58k87K72j92K19O7ol0j89L23q3j03K77m06
2479a49J33O3L31l75J12N9k66L96k57k03J69k9k6KJ87n83M48l69L80j01L2O0K49
2502B63l63n9P7K91l02M9R0j71L01j85nJ36p4l7r7O8k52J2R9K76k6p7l42K67L26
2527B65j63J25m5j29M6k49j2K29K15r7l50M05j94Q5j38J29%J26l07m1K16J6k11
$$ plain form
2550 -79 95 47 320 57 245 -82 -62 -429 -164 -79 90 38 83 6 17 -80 59 -112 65 289 -223 74 -46
2573 -46 -89 -61 -180 136 196 113 -256 139 -94 178 -125 70 -217 46 100 79 3 163 156 46 64 54 67 127 -117
2598 -117 288 75 -405 -70 243 233 132 -140 -73 -83 -68 132 -53 182 -38 51 79 -59 129 120 131 246 -149
2621 -149 -255 -328 29 -89 -213 -42 51 -95 83 -176 316 109 87 -47 -13 -93 -66 -118 -242 297 112 174 -186
2644 -186 -181 -175 -6 -2 -4 -116 71 120 200 345 -337 86 290 216 125 -177 -288 -165 60 74 -52 -91 -69 -229 -140
2669 -140 73 162 -38 -331 -165 37 2 69 -31 -164 75 -130 -122 -301 -111 255 186 -101 -22 -87 320 -77 78
2692 78 194 -118 101 -411 172 133 93 -59 101 61 -295 -110 -76 78 29 -199 -84 71 279 -91 -109 -3
2714 -3 170 32 190 -17 67 -12 -81 -40 117 -25 -71 98 73 111 -1 168 -39 156 -164 -78 186 83 -283
$$ packed form
2550g9J74m8K73k63J88l27K0l67K65Q5J69n2M5p7J1r7J39j71J77K24n12K97j20
2573d6m3K8j19L16O0q3l69L95k33K72l03J95k87K63N4k1p6J60pj10J8j0J3O0k44
2598a17M05k13m80L35L13j0j01k72O7j0J5K00j85K35k20Q9K8j38J88rJ1J15l95
2621a49j06p3L57j18j24J71R3j46J78k59M92k07k2j34L4q0K7n2j24N39j85O2l60
2644a86NOJ69Mkj12J87M9Q0J45o82M23K04p4r1l02j11J23K25J4j26l9K2j60Q9
2669a40K13Q9k00k93J66K02l5O7j00j33K39k05Qj79J90L66o9k87P9o5M07l97J55
2692G8J16l12K19n12N83l9m0j52J60m0l56J85L4J54m9k28J15J55K08l70j8J06
2714cJ73j38J58k07Q4p9o9M1J57j42m6J69k5L8j12J69k07J95l20Q6K64j03l66
$$ plain form
2737 -283 -58 -140 159 -168 -37 246 208 144 -198 93 2 126 59 97 119 -7 11 -76 46 -13 -40 -129 -57 131
2761 131 32 6 -9 259 143 35 -60 -232 -99 -74 -184 225 127 6 96 -295 19 335 -16 59 -27 86 60
2784 60 229 -1 -19 253 20 247 -45 -202 -37 55 -12 -132 -204 -72 -44 -60 -321 146 -185 -210 -8 190 -24
2807 -24 -5 192 220 -20 -158 -236 -37 191 107 182 58 193 -316 80 211 -265 200 -66 273 -226 -21 31
2829 31 -138 -91 -215 -354 -112 -179 114 67 260 264 181 -48 -31 -8 -103 21 90 -11 202 70 -109 91 -87 194
2853 194 -103 57 -164 160 -195 189 -42 349 -45 27 130 28 192 -66 35 30 133 54 195 -42 -40 111
2875 111 -18 -186 -254 37 -58 -140 19 -151 132 378 247 166 -122 -68 308 -226 109 40 -218 182 -9 27
2897 27 -127 -14 -106 -15 187 102 -224 -171 52 -102 167 -81 -200 -108 117 -87 217 -210 31 -142 72 -89
$$ packed form
2737b83K25q2K99l27J31K83l8o4l42K91r1J24o7L8K2j26J8q7J22n9k7q9P2J88
2761A31r9k6j5K68j16j08r5j72J33K5j10M09r8j21R0l91L14L16l51P5q6J13k6
2784F0J69k30j8K72k33K27k92j57J65R2o7j20p2J32K8j6k61M67l31k5K02J98k14
2807b4J9J97K8k40j38p8J99K28q4P5j24J35n09L96J31m76M65k66L39m99K05N2
2829C1j69M7j24j39K42o7K93m7J93Mq3k29J7K3r5J24O9j01K13j32j79K00j78K81
2853A94k97J60k21L24l55L84k31L91l94P2J03j02J64k58J01nJ03p9J41k37KJ51
2875A11j29j68o8K91r5q2J59j70K83K46j31q1k88N4L76n34L35o9k58M00j91L6
2897B7j54J13r2R1K02q5l26N3K23j54K69k48j19R2K25k04L04m27K41j73K14j61
$$ plain form
2919 -89 -28 -253 -8 1 -31 -5 81 -65 31 -243 -143 -61 -107 -197 -76 85 35 -141 -16 -83 51 4 -77 -50 -81 259
2945 259 -171 -113 -300 119 -89 -117 -169 41 -18 -195 -227 100 -127 -142 136 15 -192 -202 -162 -73 75 -92 108
2968 108 75 307 144 -70 -130 -101 210 -161 -55 -9 272 -268 -190 32 190 -86 -266 156 80 -196 -252 -106
2990 -106 -158 222 9 41 20 -23 24 -18 103 29 94 198 -246 191 -126 -219 -25 313 135 -91 102 172 121 -121
3014 -121 248 -81 142 -56 -49 -52 121 -337 148 89 74 -106 4 -100 48 -182 95 -177 -39 163 -7 -77
3036 -77 -184 -72 186 381 354 115 -119 7 -9 29 194 -70 -18 -362 107 189 145 126 -101 -32 26 90 -50 49
3060 49 -171 85 -3 89 -74 -79 -151 -181 28 -127 -137 60 93 -89 160 -94 -87 64 26 166 83 128 312 -15 91
3085 91 134 186 76 35 -87 207 133 11 45 -430 -41 -66 -134 34 -3 98 229 216 13 223 -437 43 -297
$$ packed form
2919h9O1k25K45Rl2K6Q6j46R6k74J00Q2m6r0J21J61n0j76J25o7J34m7q1K7l1L40
2945B59m30N8j87M19k08k8n2K10n9j77l2L27k27j5K78j21k07j0M0Q9J48j67K00
2968A08l3K32j63k14o0K9L11l71J06M6K81n40P8K22J58k76j80M22p6k76n6J46
2990a06n2L80k13L2k1m3M7m2J21p4O5J04m44M37l17r3J94L38j78k26J93P0n1k42
3014a21L69l29K23j98PlJ73m58M85n9j5j80J10j04J48k30K77k72J38K02j70p0
3036g7j07J12K58J95k7k39k34J26j6L8J65k64N2l44M69Q2m4j9k27O9N8O4j40R9
3060D9k20K56q8R2j63np2l0K09j55j0J97L3j82K49k54PJ51l8J40q3M5J84l27J06
3085I1M3N2j10m1j22K94p4j22L4m75L89k5o8J68l7J01J31j3k03K10o60M80l40
$$ plain form
3108 -297 331 303 -168 138 -67 -67 -55 -222 -186 63 -195 130 -21 90 12 53 -205 -177 317 -39 117 -106 -196
3131 -196 -85 119 31 198 -283 201 369 17 131 -48 274 133 -138 41 101 248 316 -279 -50 -174 52
3152 52 -48 -175 -77 36 140 -24 122 -47 -41 83 18 -81 106 -274 16 54 270 -52 -240 -8 21 -200 13
3175 13 145 -37 -231 -336 -71 -6 -244 -17 44 203 31 -36 2 -84 -14 114 20 56 181 -97 -58 -121 84 -15
3199 -15 50 52 -29 -115 176 -95 -68 313 -190 5 67 32 70 -234 -165 -152 -229 388 -132 -183 -109 20 104 159 -176 55
3225 55 -133 -242 -18 -206 199 -79 232 -113 -92 86 -118 164 -174 -275 82 82 127 -32 -278 76 -158 -37
3247 -37 -147 -1 -131 131 -18 72 -194 -146 70 23 94 -47 -137 -16 123 -1 -41 -59 -71 -4 72 -125 317 9
3271 9 52 124 -9 38 -34 128 -43 55 98 76 -141 -80 271 134 -188 39 -319 339 352 -18 43 -15 65 -62 331
$$ packed form
3108b97O28k8m71L06k05%J2j67L6K49k58L25j51J11p8M1k58K8M94l56J56k23r0
3131a96J11K04q8J67m81M84J68l52J14j79L22j41k71J79O0J47O8n95K29j24K26
3152E2j00j27R8J13J04j64J46j69OJ24o5r9J87l80K90L8K16l22j88K32K9k21K13
3175A3J32j82j94j05K65O5k38K27O1J59j72o7L8q6P0J28r4L6J25k78L9o3K05r9
3199a5O5Kq1q6K91k71K7L81n03J95O2l5L8l04O9J3p7O17n20n1P4J29Q4N5l35K31
3225E5j88j09K24j88M05k78L11l45K1J78k04K82l38j01L57%M5j59k46L54k34J21
3247c7j10J46j30K62j49R0k66M8K16m7P1j41r0J21J39j24m0j8j2O7P6j97M42l08
3271IM3P2j33M7p2J62j71R8M3k2k17O1L51j37l22K27l58O58J3l70O1n8Q0j27L93
$$ plain form
3296 331 49 61 -128 -75 -134 -21 107 -167 91 207 124 -179 45 -81 146 -147 173 -28 -138 -52 33 -76
3318 -76 -132 -78 -62 64 133 -245 154 -99 315 -10 -138 175 -125 54 -27 -6 -169 -126 -76 -164 -215 -31 8 -125
3342 -125 195 -384 -5 120 18 -13 27 136 -139 -265 -306 135 -221 125 -129 211 -168 107 83 -91 179
3363 179 -162 -221 -117 -48 65 267 -46 0 70 -157 -11 62 272 69 -40 -308 -82 162 233 28 -1 -96 -142
3386 -142 37 -47 167 127 -110 48 -64 46 -52 -235 -97 -14 61 -99 120 170 109 -29 -79 -256 -286 3 -156
3409 -156 178 103 -173 -29 -235 132 77 5 57 311 154 133 -206 242 164 -80 -234 -19 -78 -186 -52 -39 -150
3432 -150 -244 -10 101 74 18 198 -52 -168 115 196 120 -187 44 68 72 121 -25 25 11 81 -167 -47 104 44
3456 44 103 -179 198 87 240 27 -59 -176 43 -277 -28 98 220 -67 -209 -116 -130 49 167 -82 -112 45
$$ packed form
3296C31k82J2j89N3n9J13J28k74K58J16q3l03K24j26K27k93L20k01j10Q6Q5j09
3318g6n6N4J6J26O9l78L99k53M14l25j28L13l00J79q1K1j63M3N0q8n1J84L9j33
3342a25L20n79L79J25j02l1M0J09k75j26m1M41l56L46k54L40l79K75k4j74K70
3363A79l41n9J04O9J13K02l13M6P0k27J46P3K10k03j09k68K26K44P1k05k9r5m6
3386a42J79q4K14m0k37J58j12J10r8j83J38Q3P5j60K19N0o1j38n0j77l0K89j59
3409a56L34p5k76J44k06L67n5p2N2K54j57k1l39M48p8k44j54K15n9j08J34J3j11
3432a50r4K34J11k7n6J80k50j16K83Q1p6l07K31K4MM9j46N0j4P0k48J20J51o0
3456D4N9k82L77j11J53k13q6j17K19l20K49J26J22k87j42R3j4J79J18k49l0J57
$$ plain form
3478 45 -7 91 -120 -124 3 -116 -36 12 -22 -204 -173 -47 198 -221 -59 141 323 221 -96 127 203 -414 73
3501 73 2 -279 -16 43 -148 0 -61 -8 -184 -137 -88 -38 -133 -217 308 -112 18 -87 -56 72 136 6 -208 175
3525 175 -127 117 -228 -103 -240 -47 -58 95 -221 34 11 164 130 12 -209 -145 58 60 -29 -7 134 217 -33
3548 -33 -15 38 -108 -143 104 32 89 35 -214 -113 -116 -229 -4 123 -55 -85 -155 90 -72 225 -72 -116 102 -156
3572 -156 -106 39 -31 -3 -92 -36 228 139 -223 119 327 149 -13 -130 97 27 420 162 -43 24 -26 111 280
3595 280 -22 -203 -48 -221 92 -54 146 -108 -283 -22 -158 234 -162 -12 -284 -89 -47 -22 23 -111 163
3616 163 46 -151 140 98 80 105 21 -60 -94 -47 -43 121 142 189 34 356 9 -17 -3 -42 134 10 67 -44 -190
3641 -190 138 115 -33 -100 55 44 65 -84 162 299 100 -150 5 -184 -79 -24 273 -162 111 -186 117 -72
$$ packed form
3478D5n2R8k11mJ27j19Q0M8l4j82L1J26K45m19J62K00J82j02l17K23P6o17M87
3501G3p1k81K63N9j91J48o1N3j76M7M9N0r5q4N25m20J30j05L1J28O4j30k14L83
3525A75l02K44l45J25j37J93j1J53l16K55k3J53l4j18k21O4K03Kq9K2J41Q3k50
3548c3J8N3j46l5K47p2N7n4k49J01lj13K25J27j78l0p0K45j62K97k97m4K18k58
3572a56N0J45p0K8q9N6K64q9l62L42K08j78j62j17K27p0L93k58k05O7n0J37J69
3595B80l02j81J55j73L13j46K00k54j75K61j36L92l96J50k72J95M2K5M5j34K74
3616A63j17j97K91m2j8K5q4q1l4M7MJ64K1M7j55L22l47k6J4l9J76j24N7j11j46
3641a90L28k3j48o7J55j1K1j49K46J37j99k50J55j89J05N5K97m35K73k97L03j89
$$ plain form
3663 -72 -58 45 11 45 26 151 -5 -28 -294 -71 178 47 274 164 -1 -35 154 -75 -117 102 -391 225 57
3686 57 64 -257 -37 123 186 87 192 53 -135 35 178 158 -127 177 -71 -33 198 -258 -19 233 -100 83
3708 83 -79 197 -157 -161 70 169 33 -75 175 -72 -320 111 -40 75 205 -169 -41 31 213 -6 -110 -76
3730 -76 26 -54 -25 87 106 6 101 56 -73 -79 14 84 -33 279 272 -54 -7 -5 106 109 139 -122 -59 296 51 -266
3756 -266 -130 163 8 -238 -161 25 -147 -75 88 160 -163 169 265 -197 -142 -8 -210 35 -85 -90 260 71
3778 71 -159 63 -15 67 1 60 48 -17 -23 -111 -112 214 -202 -353 30 -314 157 103 29 -18 163 79 194 -192 134
3803 134 35 21 -12 106 -137 -219 -72 -19 -92 261 173 -35 72 11 -76 115 181 -403 376 35 114 -51 240 197
3827 197 -25 -69 67 -209 -173 -123 -470 -129 29 46 17 0 -176 -152 144 18 85 -127 -118 119 175 233 -253 -172
$$ packed form
3663g2J4J03l4L4j9J25j56k3k66K23K49j31K27j10j65l4J89k29m2K19m93O16j68
3686E7Pl21K20J60O3r9J05j39j88J70J43k0k85L04k48L8K31m56K39K52l33J83
3708H3j62K76l54mK31R9j36j08K50k47k48M31j51J15J30l74J28P2J82k19j04L4
3730g6J02q0K9J12J9j00R5m5j29oR3P0j17L12pl26M7KJ11LL0k61O3L55k45l17
3756b66J36K93j55k46P7J86j72P2J63P2l23L32R6m62N5J34k02K45j20nL50j89
3778G1k30K22p8Q2o6N9j2o5oq8jL26m16j51L83l44M71n4p4m7J81q4J15l86L26
3803A34r9j4l3J18k43q2J47N3p3L53q8k08J07o1q7J91O6n84P79l41P9j65K91m3
3827A97k22m4J36k76L6N0l47L41J58J7k9j7j76K4K96j26O7k12RK37N6N8m86Q1
$$ plain form
3851 -172 -127 -152 -1 214 16 6 -205 141 91 -250 25 -285 139 156 -42 -151 90 30 89 12 6 304 25
3874 25 133 -66 -10 41 -94 35 -15 -47 -157 278 10 102 369 -152 -51 25 -204 99 -126 47 131 -76 -62
3897 -62 39 101 -78 -23 -37 -174 107 -186 -174 76 42 -49 248 -79 -298 226 -212 -4 -57 -235 156 82 18
3920 18 154 124 58 203 273 336 -96 37 146 242 -100 -74 55 25 102 145 99 72 9 170 -3 -230 93 -55
3944 -55 -160 -116 -112 39 29 339 73 1 90 114 2 116 27 380 191 208 -99 -68 -68 -52 99 -74 -96 -69 -49 67
3970 67 152 153 -45 -272 -192 282 -41 33 149 -358 109 227 82 42 -116 -60 -34 92 -40 -5 221 99 99 -31
3994 -31 133 117 -70 -72 131 140 81 -523 -80 -11 -148 237 129 326 20 145 145 -5 79 -161 68 -18 82 151
4018 151 16 -18 -200 -113 -67 -322 -71 169 -209 -192 -173 27 173 332 218 3 90 85 244 380 46 -29 296
$$ packed form
3851a72M5k5J51K15j98j0k11L46n0l41K75l10M24J7j98j09K41o0N9p7oK98k79
3874B5J08j99N6N1j35J29n0l2j10M35k68R2K67n21J01P6k29L03k25J73Q4k07J4
3897f2J01O2j79N5j4j37K81k93J2K50l4r1K97l27k19N24m38K08n3j78L91p4o4
3920A8J36l0o6J45P0O3m32J33J09R6l42K6J29l0P7M3m6k7o3J61j73k27L23j48
3944e5j05M4MJ51j0L10k66p2Q9K4j12J14q9L53j89J7l07L1%J6J51j73k2K7K0J16
3970F7Q5Jj98k27Q0M74l23P4J16n07M67J18j45m0j58N6K6J26j32L5K26j22%j30
3994c1J64j6j87kK03Rn9o04M43O9j37L85j08J97l06J25%j50Q4k40K29q6J00O9
4018A51j35l4j82Q7M6k55K51K40l78J7J9K00J46J59j14k15Q7nJ59J36l34p5L25
$$ plain form
4041 296 134 82 90 -175 -184 12 -80 -94 218 -378 146 14 51 -58 189 -70 -84 -225 95 323 -341 175 244
4064 244 -56 32 95 -39 75 -62 -56 12 -38 -24 129 -65 -157 67 61 -134 71 -159 42 135 -76 -113 34 72
4088 72 -160 5 85 234 -20 199 134 -285 -97 36 55 -269 -275 -97 23 239 -253 12 -99 245 -16 -24 -80
4111 -80 209 -287 -5 117 245 38 138 160 7 119 -395 69 -108 -153 118 -100 -144 -124 -283 -40 312 -70
4133 -70 -147 -32 -214 182 -226 27 143 -127 -59 5 -105 94 -12 84 39 -112 -203 45 185 167 29 -22 -31 254
4157 254 188 44 -36 166 -105 84 49 -370 165 254 116 -174 -103 32 -293 76 233 -79 87 -7 -92 -85 36
4180 36 136 -132 99 57 25 -69 34 -183 -41 39 208 153 46 -37 -221 -75 -20 142 -73 -34 81 290 90
4203 90 -184 -283 213 130 -391 -90 -210 -9 -53 156 -18 141 23 300 -221 -92 58 13 -272 -84 -19 -51
$$ packed form
4041B96j62n2Qk65rJ96r2j4L12n96N24j32L7j09K47k59j4j41L20K28o64N16O9
4064B44l00Q8O3j34J14j37OO8n0J4J53j94r2K24oj95K05k30K01R3k11l7J47L8
4088G2k32J65Q0J49k54K19o5m19J88J33J9l24oJ78J20K16m92K65j11L44k61qn6
4111h0K89m96K82J22J28k07J00K2j53J12n14M64j77m5K71k18m4K0j59K43L52l82
4133g0p7J15j82L96m08K53J16k70O8O4j10J99j06R6m5j51r1K48J40j8j38n1rK85
4157B54o6j44q0K02k71J89l5m19N35Q9j38k90P1J35l25L69J57l12J66r4q5PJ21
4180C6J00k68K31m2l2r4J03k17J42Q0J69n5j07q3j84J46N5J62k15L9J15K09k00
4203I0k74r9M96q3n21L01j20K01m4K09j74J59j18K77n21J29J50m5k85J88O5l2
$$ plain form
4225 -51 -7 -98 2 -218 -1 47 192 -65 132 161 -353 -116 -1 32 -87 -357 19 11 -59 45 12 228 32
4248 32 159 40 143 -249 -41 235 107 30 -200 -24 111 163 -209 -13 -216 -68 -37 -332 -76 26 181
4269 181 159 48 -107 87 -75 200 75 72 3 -232 -57 -181 167 -153 79 35 -119 -158 -177 -347 150 135 -104
4292 -104 171 37 11 27 -74 53 60 28 -130 -132 190 155 -294 -159 -138 -100 -168 169 188 -133 -51 59 117 -1 106
4317 106 77 -66 -63 146 -6 -270 -108 -119 -8 -76 -103 -103 -149 245 -357 -212 -222 -8 -24 320 -111 35 -20 -35
4341 -35 -72 -246 -33 -9 -192 -193 4 -77 83 -71 -253 127 51 30 -76 -40 -4 211 -174 -86 83 -212 -94 62
4365 62 -87 -176 -101 64 -84 -90 16 -75 270 -41 -131 -142 59 -86 -71 -106 129 67 208 65 -192 99 172 95
4389 95 83 139 -156 -119 -107 83 -89 -50 -220 -97 154 221 -88 -47 212 -71 -88 -152 47 90 116 198 49 69 -5
$$ packed form
4225e1M4r1J00k20K17M8J45k57J97K9n14K37J15L3j19k70L76qp0J04l3K16j96
4248C2J27j19J03l92K08K76j28p7k30J76J35N2l72J96k03J48L1k95K56J02J55
4269A81k2j11j55J94j62K75j25lo9k35J75j24L48l20K32m4j54l9j9j70M97j5k39
4292a04K75j34k6J6j01J27Pl2j58kL22l5m49J35K1L8o8L37J9l21Q2J10N8j18J07
4317A06k9j43LK09j52k64J62j1J11o8k7%m6L94o02J45j0K14j6L44m31J46n5j5
4341c5l7j74K13K4j83jJ97q1J60j54j82L80p6k1j06L6L6K15l85Q8J69k95J18J56
4365F2j49q9P5J65j48oJ06r1L45l11r0j1K01j45J5l5K35o2J41j43k57K91P3p7
4389I5j2N6k95L7J2J90j72L9j70J23K51O7l09M1K59k83j7o4J99M3K6Q2j49K0p4
$$ plain form
4414 -5 160 6 -18 -43 -156 267 118 86 -158 268 -144 200 263 127 137 -46 44 12 180 190 186 -4 203 -186
4438 -186 1 -213 252 15 175 23 -112 216 -113 -103 -141 143 48 152 93 -126 -56 11 -45 -149 -66 113 -34
4461 -34 151 210 25 64 114 118 217 -17 -54 -22 -108 -248 67 -142 326 -100 118 -198 -32 26 -201 -27 -1 -82
4485 -82 -192 198 83 10 -51 69 -325 -48 -12 237 314 -43 140 -145 -213 -17 -285 -154 -91 -130 59 25 296
4508 296 26 -167 -2 -39 -91 -63 -66 112 58 17 16 127 132 93 17 -80 -7 -146 24 -152 37 99 36 28 -142 117
4534 117 38 -253 -280 -115 64 125 -181 -200 89 -34 7 143 9 -20 -32 19 -114 254 141 37 -12 228 22
4557 22 -62 -218 38 -58 94 -194 178 116 135 17 -133 42 -86 212 -347 -37 -15 313 -106 130 55 -94
4579 -94 -119 29 67 -175 28 -214 45 28 61 115 -40 -302 163 236 -47 242 -90 127 137 228 -31 -12 -12 -51
$$ packed form
4414eJ65j54k4k5j13M23j49l2k44M26m12L44O3j36J0j83R0l2J68J0mj90K07l89
4438a86J87k14M65k37J60j52j35L28l29J0l8K84r5J04n9k19P0O7n6j04Q3J79j47
4461c4J85N9j85L9N0MR9k34l7L2q6j40L15k09M68m26K18l16J66N8k27J74K6q1
4485h2j10L90j15p3o1J20l94K77L6K49P7l57J83k85o8J96k68J31O3l9J89l4K71
4508B96k70j93J65l7n2K8lJ78n4m1jJ11Nl9p6r7P3j39J70j76J89O2o3qj70K59
4534A17p9k91k7J65J79O1l06j9K89j23M1J36j34k9j2N1j33L68j13j04m9K40k06
4557B2q4j56K56r6J52k88L72o2J9j18j50J75j28K98n59L10K2L28m19K36p5j49
4579i4k5J48L8k42K03k42K59j7L3N4j55k62M65P3k83K89l32K17J0R1k59J9%l9
$$ plain form
4603 -51 47 -100 144 140 362 42 -135 -215 -141 -92 -50 -120 179 13 -52 -261 -316 73 141 106 -188 -90 -29 71 127
4628 127 -103 239 360 -71 -211 2 -39 25 366 -122 188 304 57 99 -86 20 20 105 -70 -72 -66 368 8
4651 8 -107 19 80 -254 93 196 -25 0 -2 -93 174 -22 83 -64 35 40 -178 52 199 129 -46 76 178 165
4675 165 20 0 -34 -45 133 49 -137 -183 155 81 181 142 40 -68 4 -200 106 -71 -149 -21 216 -38 86
4698 86 -161 -242 18 -114 166 157 167 9 -76 -122 -96 -190 -200 -79 149 -179 128 -20 148 -1 143 -118 98
4721 98 169 75 22 -141 -99 20 -122 212 -34 -9 -49 6 202 9 30 17 345 -54 21 60 -102 -40 304 -200
4745 -200 101 58 -14 324 148 300 -118 -107 -105 182 164 -43 -8 -141 78 -92 -45 8 -20 -113 82 106 -20 83
4769 83 39 130 -190 -58 129 63 25 -207 214 -144 -3 14 366 -217 -2 168 72 -124 -182 16 -154 -34 79
$$ packed form
4603e1R8j47K44mK22l20j77q0P4M9M2p0K99j66o5k09n5L89O8l5k94R8O1J00N6
4628A27k30L42J21m31j40K13m1O4L41m88L10J16k47M2j85J06%Q5j75kOM34l60
4651Hj15J26O1l34L47J03k21K5kr1K67j96J05j47R9Nk18K30J47p0j75J22J02j3
4675A65j45k0l4j1J78q4j86m6L38p4J00l9j02j08P2k04L06j77p8J28K37k54J24
4698H6k47q1K60j32K80rJ0j58q5m6K6r4j0J21K28l28L07j48J68j49J44k61K16
4721I8P1r4n3j63M2J19j42L34k46K5m0N5J96j93K1j3L28l99P5L9j62O2L44n04
4745b00L01m3p2L38j76J52m18J1KK87j8k07L5j33K19j70M7N3k8r3J95K4j26J03
4769H3m4R1l20J32J87o6l8k32M21l58J41J7L52n83K15J70r6j96n8J98j70J20J13
$$ plain form
4792 79 -160 -27 80 51 -291 101 50 -10 -122 204 -190 -171 105 48 139 -206 -131 -134 -6 45 -75 29 -49 32
4816 32 55 164 109 -77 -197 92 -221 266 -183 -139 -279 -43 -76 -348 -177 -126 -122 347 57 -32 170 0 15
4839 15 64 244 -8 6 -95 -5 -81 73 -33 337 139 81 21 56 -154 -64 68 -42 -147 141 118 -49 319
4862 319 -77 67 -35 189 28 -65 209 -45 -45 206 34 -517 -82 9 -102 -147 -266 82 -36 -79 -81 90 -305
4885 -305 -24 -31 102 428 -55 46 -205 112 92 243 -160 28 105 99 236 -184 175 -152 -67 29 -222 -3 155
4908 155 113 76 32 -62 -218 -3 76 132 36 -170 -33 -6 179 -52 -202 2 -114 44 -40 82 -182 -46 -29
4931 -29 286 -16 -104 -89 108 15 224 -2 -39 -195 -304 169 166 104 99 -23 24 124 -102 46 -143 11 21 71
4955 71 -73 202 -186 250 -57 -111 -155 -299 135 75 -33 -153 -21 79 -91 -113 196 8 140 89 152 -72
$$ packed form
4792G9k39J33J07k9l42L92n1o0j12L26l94J9K76n7R1l45P5lJ28N1j20J04p8Q1
4816C2K3J09n5j86j20K89l13M87m49M4j40K36l3k72J71N1MM69k90q9K02j70J5
4839A5M9J80k52J4j01R0p6J54j06L70j98n8o0L5k10R0J32j10j05K88k3j67L68
4862C19l96J44j02K24j61r3K74k54%K51j72n51M35R1j11m5j19L48j18m3kJ71l95
4885c05K81pJ33L26m83J01k51L17k0J51m03J88P7oJ37m20L59l27Q5R6k51K19J58
4908A55m2l7m4r4j56K15P9N6r6k06J37K7J85k31j50K04j16J58q4J22k64J36J7
4931b9L15l02q8J5J97r3K09k26l7j56j09M73lo2nj22M7J00k26J48j89J54J0N0
4955G1j44K75l88M36l07n4m4j44M34o0j08j20J32J00j70k2L09j88J32n1O3k24
$$ plain form
4977 -72 96 107 -155 120 71 -105 -167 -290 204 105 15 170 -93 -58 211 33 23 265 -213 -195 -76 53 125
5000 125 9 -174 24 -40 163 -45 -18 233 -22 1 -81 94 291 24 -114 76 -182 -345 -53 -78 -22 -163
5022 -163 -194 68 -198 -47 -29 72 -101 256 -267 -29 175 102 -88 114 -163 -232 -156 -68 173 -74 -185 56
5044 56 -37 -199 -47 -90 -7 137 -86 313 -73 19 -130 24 141 -179 135 -195 92 124 74 74 -26 49 85 -126
5068 -126 -63 -168 -190 -19 -133 284 146 -164 29 -252 118 -165 9 156 90 -79 -235 -214 -245 -21 -203 -94
5090 -94 99 -279 72 124 -66 -284 33 -73 37 -84 -25 25 50 57 20 361 -100 -210 -43 130 86 -231 -55
5113 -55 -70 21 -66 -52 338 -73 -95 37 -9 14 44 318 -172 51 -163 -176 131 80 -41 98 -102 80 43 -313
5137 -313 183 -16 28 106 -6 -21 16 -167 -88 -233 -85 -73 98 155 -172 -96 -219 -197 -22 233 -97 64 -149
$$ packed form
4977g2J68J1k62K75m9j76o2j23M94r9r0J55k63L5K69j78j0K42m78J8J19J29P2
5000A25j16j83J98o4K03k08K7K51k55K3q2J75J97k67j38J90k58j63K92k5N6j41
5022a63l1K62k66J51J8J01j73L57n23K38K04p3j90K02k77o9P6Q8K41k47j11K41
5044E6r3j62J52m3Q3J44k23L99l86R2j49J54J17l20L14l30K87L2n0%j00P5L6k11
5068a26O3j05k2J71j14M17j38l10J93k81L70k83J74J47o6j69j56K1l1K24j82J09
5090i4J93l78L51N2j90k18L17j06J10j21N9N0K5Pl7L41m61j10J67J73m4l17J76
5113e5j5R1q7J4L90m11k2J32m6K3L0K74m90K23k14j3L07n1j21J39k00J82l7l56
5137c13M96j99M4P8j12j5L7j83P9j45J48J2J71N7l27P6j23K2J75K55l30J61k13
$$ plain form
5160 -149 -64 15 300 27 -50 31 -171 -52 1 39 62 187 201 -69 247 -81 -71 26 -155 -60 -5 87 89 134 -175
5185 -175 109 -73 299 131 88 -134 2 159 -115 -36 -213 -22 26 -194 181 152 22 93 -123 -214 90 47
5207 47 15 -351 -140 -101 -120 147 56 -202 98 -221 -124 -45 -271 207 23 -78 72 133 -74 -145 64 214 108
5230 108 59 -156 89 -167 31 -223 -51 76 -80 -36 -135 -106 -95 -159 183 199 192 -37 65 117 -204 -26 112
5253 112 76 3 -112 11 170 140 -197 -82 238 100 143 225 -21 -48 120 218 -166 -146 49 278 206 16 64
5276 64 -106 57 85 46 116 -32 176 59 67 -29 138 137 -63 83 8 22 5 157 -18 -84 102 83 -273 86 77
5301 77 50 -144 112 -19 16 172 -267 -304 18 219 36 160 35 111 32 90 27 1 -67 94 106 53 -7 -64 17
5326 17 -10 -40 131 50 31 140 -27 -230 -112 2 9 102 -13 -107 21 -36 168 239 -35 71 -250 205 1 136
$$ packed form
5160a49Q5P9K85k73p7Q1k02J19N3L8K3J25J4k70L16l28J0R7j81R5N5R2KM5l09
5185a75K84j82L72j68m3k22J36J57k74P9j77J91M8k20L75k9j30P1k16r1L04m3
5207D7l2l66K11L9j9K67r1k58L00l19R7P9k26M78j84j01J50O1k07p1K09J50j06
5230A08m9k15K45k56J98k54J72J27j56M4r9K9J1o4L42J6pk29J02N2l21J78J38
5253A12l6p3j15J23J59l0l37J15L20j38M3Q2k46k7J68R8l84K0J95K29p2j90M8
5276F4j70J63K8l9P0j48K08j17Qr6J67jk00J46p5J4j7J52j75o6J86j9l56L59r
5301G7k7j94K56j31L5J56m39l7L22K01j83J24j25P6p9N8o3k6o8J61J2n3o0n7Q1
5326A7k7l0J71q1j9J09j67k03J18J14PR3j15r4J28n7K04P1k74J06l21M55k04J35
$$ plain form
5350 136 -89 82 -50 -160 45 401 20 188 98 371 -66 6 -398 8 -51 -173 -33 -101 -23 38 -45 90
5372 90 -220 -41 243 248 3 -52 76 -268 -66 -193 35 -69 132 -26 82 -173 -102 -222 19 54 75 -166
5394 -166 -131 27 -105 -83 -139 160 -40 -142 163 107 206 -7 -168 -33 8 -56 -13 16 -87 44 -140 -163 -235 -20
5418 -20 -52 73 257 117 -153 -81 -38 -69 269 163 108 -142 244 -79 367 83 89 13 247 -9 125 -170 -106
5441 -106 8 170 -19 -21 317 -273 123 -282 -247 -31 -209 126 21 181 35 -18 -148 -261 190 3 -133
5462 -133 14 140 26 -289 67 147 -30 -42 -37 57 181 207 189 -90 8 133 6 -116 -47 -112 202 -177 -131 12
5486 12 -45 -211 182 -254 50 -174 26 -42 154 -141 -29 93 -51 130 118 -162 -358 194 -151 -83 -9 93
5508 93 54 -95 -214 75 263 -56 17 97 -43 36 -107 14 -89 -438 187 -33 137 -167 -120 -190 116 31 88
$$ packed form
5350A36k25J71j32j10K05L56l81J68r0K73m37P2m04M06n9j22J40o8P8O1q3J35
5372I0l10J79K84Nk45n5J28l44K02j27K28j04K01j58J08k55P1j20K41L5K1k41
5394a66L5J58j32K2n6K99k00j02L05n6R9k13j61J35M1o4M3K9j03J31j84k3p2K15
5418b0l2J25J84j40k70P2M3l1L38j06n5k50L86l23M46k84Op6K34k56J34k95O4
5441a06J14J62j89kL38n90L96m05L5K16j78L35j05J60j46n3j30j13M51j87j36
5462a33J47J26j14l15L56Q0j77j2NR4J24K6j8k79R8J25j27j22O9o5L14l79M6J43
5486A2n7j66L93m36L04k24K00o8J96k95J12J22j44J81j2k80j96N52l45O8P4J02
5508I3l9j49j19K89J88l19P3Q0j40P9j43J21j03l49O25k20J70l04M7p0L06q5N7
$$ plain form
5531 88 137 202 -58 -124 121 125 -419 -84 -385 74 126 26 148 -174 161 -88 56 -124 -94 -34 152 52 -230
5554 -230 61 26 -101 132 105 105 -40 -45 31 -86 -123 93 63 12 -150 -13 -93 157 -77 -254 244 -151 -272 -164
5578 -164 68 -12 -51 96 162 -207 47 -226 60 -6 284 -79 -181 86 104 81 -44 -123 40 -33 -77 -186 315
5601 315 -12 -172 116 -11 10 -108 18 59 -74 -149 245 -67 306 -88 -14 -252 -255 -193 103 37 101 221 -419
5624 -419 -120 -105 168 205 -166 -23 89 204 70 -239 -7 -188 -28 209 44 213 107 75 -296 -55 5
5645 5 4 28 166 110 -235 1 -1 113 25 82 80 -26 -116 227 -92 -69 -25 -229 176 -14 47 52 10 339 141 111 -96
5672 -96 26 79 -162 -12 -45 100 50 6 14 124 -64 -250 -155 -95 -78 123 100 59 227 148 -145 136 -330 -217
5696 -217 89 -40 54 67 204 -156 -72 17 136 115 109 -129 121 176 165 -219 210 11 -116 273 -129 -85 -63 -112
$$ packed form
5531H8M9O5k60o6K45Mn44L35l01M59N2j00J22l22L35k49J44j80L0O0J86j00k82
5554b30K91l5j27K33k7%j45nP6j17l7K16l0n1j62J37q0K50k34j77M98l95j21J08
5578a64K32q0l9J47O6l69K54k73K86o6K90l63j02K67J8k3j25p9J63p3m4j09N01
5601C15l27j60K88j27K1j18J26M1j33p5L94l12L73l94P4k38lO2K96o6O4J20o40
5624d19K99J5K73L7l71J43J12J15j34l09K32j81J60K37j65J69j06l2l71K41O0
5645EjK4J38n6l45K36kJ14q8N7kj06r0L43l19K3M4k04M05j90O1Nm2L29j98l0k07
5672i6J22N3k41J50l3J45n0m4QJ10j88j86R5O0J7K01k3m1J68p9k93K81m66J13
5696b17L06j29R4J3J37l60Q4Q9J19k1ok38K50N5j1l84M29j99j27L89m02M4K2m9
$$ plain form
5720 -112 -28 -31 -30 -194 92 -182 -353 30 -21 -171 196 108 -288 26 -84 -123 237 -51 -240 260 59 278 181
5743 181 177 -195 -144 -104 -291 183 -190 208 -127 282 276 23 25 -62 -88 -396 -42 346 261 54 -171 -45 88 -154
5767 -154 -166 -11 -250 78 82 -70 132 31 -366 -54 179 8 -141 38 -36 -247 -43 82 134 22 -5 -29
5789 -29 -307 -205 276 -6 93 67 128 220 -201 130 -27 291 -211 -113 -34 -93 141 -138 -16 122 40 -71 175
5812 175 122 -149 -42 213 114 -54 -187 -57 -72 6 -84 268 385 169 -131 201 133 -97 92 -80 30 10
5834 10 -251 135 -90 163 311 -80 147 -99 -26 -114 189 177 68 -224 189 146 -81 -84 -39 -232 -194 -190 -312 47
5858 47 243 43 -227 165 54 -145 114 -96 106 146 -18 77 14 18 255 -129 -3 -74 -137 41 -210 151 4
5881 4 38 -144 -51 -188 -34 -181 -33 23 -146 -142 123 105 -184 -21 -51 -399 -21 -95 -39 -237 68 337 -43 213
$$ packed form
5720a12Q4lJj64K86k74j71L83n1j50L67q8l96L14j10l9L60k88j89N00k01K19r7
5743A81ml72N1M0j87M74l73L98l35M09ok53Kq7k6l08L54L88q5k07k25J26J33k42
5767a54j2J55k39L28Mj52K02j01l97L12K33j71j49J79p4k11K04J25N2j12k7k4
5789b9k78J02M81k82R9k6O1R2m21L31j57L18n02R8P9n9K34k79J22J38q2j11K46
5812A75n3k71J07K55r9j68j33J30j5P8r0L52J17k16l00L32o8k30J89j72J10k0
5834A0k61L86k25K53J48l91K27k46P3q8L03j2j09k92M13m3k27lM5j93L8Mj22L59
5858D7J96k00k70L92j11j99K59k10K02M0j64R5o3MK37l84J26p1o3J78k51L61j47
5881DL4j82R3j37J54j47J48N6j69MK65j8k89J63l0l48L78p4N6j98L05K69l80K56
$$ plain form
5905 213 -66 30 73 -134 -120 26 -38 136 -239 -262 -144 49 -54 191 -47 289 98 38 30 -285 -80 196 39
5928 39 -161 -66 51 29 -59 64 43 92 -439 -97 21 240 -313 17 271 213 -126 -32 83 122 134 180 -9 63
5952 63 -106 56 217 -95 -31 2 -104 23 167 -204 -147 -24 -26 -49 68 148 -49 140 -149 10 52 212 439
5975 439 -68 -110 102 48 -135 -64 -99 129 -198 -122 -34 -251 139 88 164 -19 -7 -54 -89 -23 -75 -143 138 -142 85
6000 85 169 159 83 -44 6 -24 31 -64 -28 150 228 -198 -54 109 -57 -177 44 -12 -32 139 -28 -63 -44 -167 -282
6025 -282 15 140 -182 -15 -55 53 88 60 234 280 188 -128 182 -85 -102 -193 -24 79 -395 -197 -88 17
6047 17 -27 -120 48 167 -130 280 15 56 -307 51 33 143 211 213 31 -63 90 40 -143 14 102 165 -149 -86
6071 -86 -301 -57 -38 -478 -4 244 116 -69 63 72 31 -119 -90 177 244 -96 116 231 106 326 -16 171
$$ packed form
5905B13k79R6M3k07J4J46o4J74l75k3J18J93j03K45k38L36j91o0ql15K05K76j57
5928C9k00R5J17k2q8J23k1M9n31L42J18K19n53L30K54n8l39R4J15L9J2M6j89P2
5952F3j69J62J61l12O4L3j06J27J44l71N7J23kk3J17Q0j97J89k89J59M2J60K27
5975D39n07m2K12n4j83P1l5K28l27P6Q8k17L90n1P6j83J2m7l5O6n2o8K81k80K27
6000H5Q4j0p6j27N0l0N5r5L6J78P8m26J44J63j66j20K21n6k0J71j67l5J9j23j15
6025b82K97J25l22J67m0J08L5k8J74M6r2l16L10k67j7r1J69J03m74J98J09J05
6047A7m4r3J68J19k97M10k65M1l63L58j8J10O8Kj82r4J53n0j83J57Q8O3l14O3
6071h6k15K44J9m40M74K48j28j85J32Rm1j50K9K67O7l40K12J15j25K20l42J87
$$ plain form
6093 171 -126 -195 -13 -66 17 -103 -130 -51 187 215 -134 -180 -255 -142 -156 -36 -16 -62 -58 -77 -287 171 423 -25 -54
6118 -54 48 -251 83 -36 73 118 -293 142 227 66 -130 60 3 7 -173 93 173 44 -12 -22 80 149 72 -37
6142 -37 18 -138 105 166 -1 -83 72 -5 -325 -68 186 6 78 -108 -17 -49 281 214 -43 113 182 170 -50 283
6166 283 -26 -403 193 -156 -117 -40 311 15 -109 -32 -196 -6 -237 -23 -45 -308 96 35 78 138 -173 -6
6188 -6 67 166 85 228 -311 -1 -27 -138 -145 -52 -221 -24 51 -7 -115 65 53 8 150 -9 -236 79 266 103
6212 103 -163 -147 33 -82 33 -184 106 86 -81 99 296 -242 -48 -65 -293 75 -11 -152 -82 175 -168 -31
6234 -31 9 -255 262 -35 -49 -18 119 -256 -351 -101 -150 -132 108 6 -24 -85 -59 171 -64 115 -154 -1 69 242
6258 242 -9 238 -40 37 21 272 54 -130 -11 2 -218 -175 7 14 -118 91 -181 43 1 -198 -39 -121 137
$$ packed form
6093A71k97o9J82n3Q3j20k7P9K38K8l49m6p5J13j4J20K0m6Mj9k10M58K52m48k9
6118e4J02k99L34j19J09M5m11M35Q5j61j96J90n7Mj80K66Q0j29n6j0J02O9p7j09
6142c7N5j56K43O1j67q2J55p7l20K57K54j80P2j86R1l2L30o7k57J56O9j2k20L33
6166B83l09l77N96l49L9P7L51k96j24P7j64J90k31K14k2k63M04o1M3O0l11J67
6188fP3R9q1J43n39L10k6j11pR3j69J97P5n8j08J80j2m5J42j59k27L15J87j63
6212A03k66J6J80j15J15k17K90k0j67J80J97n38J94j7k28L68q6j41P0K57l43J37
6234c1M0k64N17k97j4L1J37l75r5K50m9J8K40j02l0o1K6K30k35J79k69J53P0J73
6258B42k51K47k78P7j6K51k18j84J19J3k20M3J82Pj32K09k72K24m2j99J59q2K58
$$ plain form
6281 137 45 133 102 55 18 7 131 54 84 -179 -273 -43 165 -270 -159 -249 -60 347 -154 161 77 -84 -40 -7
6305 -7 -154 43 248 -158 48 -126 131 69 -38 129 -110 -10 1 53 265 -60 74 52 128 -3 -3 86 190
6328 190 226 -123 -252 -50 -83 329 -108 -41 101 -70 -233 33 -77 78 156 -85 82 -187 -27 36 71 52
6350 52 -122 15 132 -21 -221 -111 100 156 66 -87 19 -141 152 372 -79 -104 -69 -292 -30 29 62 -128
6372 -128 -141 -213 258 -300 -36 -206 -17 159 244 51 97 102 -109 16 72 -14 188 164 -196 22 55 -383 -57
6395 -57 -59 -144 135 -8 99 -73 -261 -90 251 -150 -5 -183 177 -234 -95 -112 -187 -74 -293 -179 -15 87
6417 87 -22 260 38 64 3 159 -12 31 263 45 93 -23 45 -37 -74 125 205 12 -141 -134 -148 -67 174 -58
6441 -58 258 -405 223 -59 116 277 54 -155 -87 71 24 118 -2 240 109 285 -270 119 150 241 65 91
$$ packed form
6281A37r2Q8l1m7l7j1J24p7L0k63r4K30K08m35J11r0J89M07n01L15q4j61M4L3
6305gj47J97K05m06K06j74K57o2j07J67k39J00J1N2K12l25J34k2P6j31%Q9J04
6328A90L6l49j29K02l3M12m37O7J42j71j63K66j10J55P8k41J67k69J60O3L5j9
6350E2j74J37J17j53k00J10K11N6r0j53J06j60K93K20m51k5L5k23K62N9L3j90
6372a28j3p2M71n58K64j70J89J76Q5j93M6Nk11J25N6q6K02k4l60K18L3m38L26
6395e7kq5K79j43J07j72j88J71L41m01J45j78L60m11J39j7p5J13k19J14J64J02
6417H7j09K82k22K6o1J56j71M3K32k18M8j16O8q2l7J99Q0j93j53Pj4Q1K41k32
6441e8L16o63O28k82J75J61k23k09O8J58m7R4j20K42j31J76n55L89L1R1j76K6
$$ plain form
6463 91 116 151 -16 -153 -106 -270 -59 44 -462 146 -124 -157 -121 -35 132 38 21 -65 153 -42 54 -91 -122 93
6487 93 -215 -39 95 123 51 -72 112 -11 -88 -79 -147 141 -117 -111 124 -73 155 236 50 -55 30 -104 -126 -10
6511 -10 95 40 153 -457 63 -63 -163 181 -109 14 -30 184 -135 30 169 -195 126 46 -264 61 -6 -57
6533 -57 105 -108 162 -94 190 -53 -105 35 -106 208 76 -315 1 120 4 -1 -248 -63 -37 163 -98 17
6555 17 153 -131 79 45 27 -91 -263 111 -52 139 -48 -99 167 -42 -261 -152 34 -96 99 -262 -7
6576 -7 -192 76 -87 67 -36 256 60 -141 151 184 -255 -96 69 -254 -131 -150 171 45 238 50 111 -263
$$ packed form
6463I1K5L5j67j37M7j64K11J03n06O08k70l3L6Q6J67r4j7q6K18j95R6j45l1K15
6487I3l08J76J34K8p2j23J84j23p7Ro8K88k58OK35j97K28Q1j86j05Q5j34k2J16
6511a0J05n5J13o10N20j26j00L44k90J23m4K14l19J65J39l64L21q0l10L25o7n1
6533e7J62k13K70k56K84k43n2J40j41L14j32l91L16J19j16nk47J85K6K00k61J15
6555A7J36k84K10l4j8j18j72L74j63J91j87n1K66k09k19J09J86j30J95l61K55
6576gj85K68j63J54j03K92j96k01K92L3m39J59J65l23J23j9L21j26J93j88O1l74
$$ [...]
8191e2
##END NTUPLES=NMR FID
##END=
