##TITLE=1H_DE-159_TFA
 200.13Hz, DMSO-d6.
 8 sc
 26.6.2026
##JCAMPDX= 6.0         $$ Bruker NMR JCAMP-DX V2.0
##DATA TYPE= NMR FID
##DATA CLASS= NTUPLES
##ORIGIN= UXNMR, Bruker Analytische Messtechnik GmbH
##OWNER= pz
$$ XWIN-NMR		Version 3.5
$$ Fri Jun 26 14:05:09 2026 Russian Standard Time (UT+4h)  she@DPX200
##.OBSERVE FREQUENCY= 200.1313
##.OBSERVE NUCLEUS= ^1H
##.DELAY= (6, 6)
##.ACQUISITION MODE= SIMULTANEOUS
##.ACQUISITION SCHEME= undefined
##.AVERAGES= 8
##.DIGITISER RES= 18
##SPECTROMETER/DATA SYSTEM= spect
##.PULSE SEQUENCE= zg30
##.SOLVENT NAME= D2O
##.SHIFT REFERENCE= (INTERNAL, D2O, 0, 14.3821)
##AUDIT TRAIL= $$ (NUMBER, WHEN, WHO, WHERE, WHAT)
$$ ##TITLE= Audit trail, XWIN-NMR		Version 3.5
$$ ##JCAMPDX= 5.01
$$ ##ORIGIN= Bruker BioSpin GmbH
$$ ##OWNER= she
$$ F:/spectra/data/she/nmr/H-C/1/audita.txt
$$ ##AUDIT TRAIL=  $$ (NUMBER, WHEN, WHO, WHERE, WHAT)
(   1,<2026-06-26 14:03:59.25 +0400>,<she>,<DPX200>,
      <created by zg, POWCHK disabled, PULCHK disabled
       configuration hash MD5:
       00 E9 B6 7A A2 85 ED C7 34 08 36 98 17 FE 4E 26
       data hash MD5: 16K
       AA C9 6E AF 5D 07 A0 B7 29 BB 92 A0 99 09 21 9F>)
$$ ##END=
$$ 
$$ hash MD5
$$ 59 A0 02 F3 12 22 A2 B0 25 C1 51 3D 69 F7 98 D4
##$RELAX= 
##$RELAX= 
##$RELAX= 
##$RELAX= 
##$RELAX= 
##$RELAX= 
$$ Bruker specific parameters
$$ --------------------------
##$DU= <F:/spectra>
##$EXPNO= 1
##$NAME= <H-C>
##$PROCNO= 1
##$TYPE= <nmr>
##$USER= <she>
##$AMP= (0..31)
100 100 100 100 100 100 100 100 100 100 100 100 100 100 100 100 100 100 
100 100 100 100 100 100 100 100 100 100 100 100 100 100 
##$AQSEQ= 0
##$AQ_mod= 1
##$AUNM= <au_zg>
##$AUTOPOS= <>
##$BF1= 200.13
##$BF2= 200.13
##$BF3= 200.13
##$BF4= 200.13
##$BF5= 200.13
##$BF6= 200.13
##$BF7= 200.13
##$BF8= 200.13
##$BYTORDA= 1
##$CFDGTYP= 0
##$CFRGTYP= 5
##$CHEMSTR= <none>
##$CNST= (0..31)
1 1 145 1 1 1 1 1 1 1 1 1 1 1 1 1 1 1 1 1 1 1 1 1 1 1 1 1 1 1 1 1 
##$CPDPRG= <>
##$CPDPRG1= <>
##$CPDPRG2= <>
##$CPDPRG3= <>
##$CPDPRG4= <mlev>
##$CPDPRG5= <mlev>
##$CPDPRG6= <mlev>
##$CPDPRG7= <mlev>
##$CPDPRG8= <mlev>
##$CPDPRGB= <>
##$CPDPRGT= <>
##$D= (0..31)
0 0.7 0 0 0 0 0 0 0 0 0 0.03 0 0 0 0 0 0 0 0 0 0 0 0 0 0 0 0 0 0 0 0 
##$DATE= 1782468238
##$DBL= (0..7)
120 120 120 120 120 120 120 120 
##$DBP= (0..7)
150 150 150 150 150 150 150 150 
##$DBP07= 0
##$DBPNAM0= <>
##$DBPNAM1= <>
##$DBPNAM2= <>
##$DBPNAM3= <>
##$DBPNAM4= <>
##$DBPNAM5= <>
##$DBPNAM6= <>
##$DBPNAM7= <>
##$DBPOAL= (0..7)
0.5 0.5 0.5 0.5 0.5 0.5 0.5 0.5 
##$DBPOFFS= (0..7)
0 0 0 0 0 0 0 0 
##$DE= 6
##$DECBNUC= <off>
##$DECIM= 32
##$DECNUC= <off>
##$DECSTAT= 4
##$DIGMOD= 1
##$DIGTYP= 9
##$DL= (0..7)
0 120 120 120 120 120 120 120 
##$DP= (0..7)
150 150 150 150 150 150 150 150 
##$DP07= 0
##$DPNAME0= <>
##$DPNAME1= <>
##$DPNAME2= <>
##$DPNAME3= <>
##$DPNAME4= <>
##$DPNAME5= <>
##$DPNAME6= <>
##$DPNAME7= <>
##$DPOAL= (0..7)
0.5 0.5 0.5 0.5 0.5 0.5 0.5 0.5 
##$DPOFFS= (0..7)
0 0 0 0 0 0 0 0 
##$DQDMODE= 0
##$DR= 18
##$DS= 0
##$DSLIST= <SSSSSSSSSSSSSSS>
$$ [...]
##$SUBNAM0= <"">
##$SUBNAM1= <"">
##$SUBNAM2= <"">
##$SUBNAM3= <"">
##$SUBNAM4= <"">
##$SUBNAM5= <"">
##$SUBNAM6= <"">
##$SUBNAM7= <"">
##$SUBNAM8= <"">
##$SUBNAM9= <"">
##$SW= 18.0517328524113
##$SWIBOX= (0..15)
0 0 2 0 0 0 0 0 0 0 0 0 0 0 0 0 
##$SW_h= 3612.71676300578
##$TD= 16384
##$TD0= 1
##$TE= 0
##$TE2= 300
##$TE3= 300
##$TEG= 300
##$TL= (0..7)
0 120 120 120 120 120 120 120 
##$TP= (0..7)
150 150 150 150 150 150 150 150 
##$TP07= 0
##$TPNAME0= <>
##$TPNAME1= <>
##$TPNAME2= <>
##$TPNAME3= <>
##$TPNAME4= <>
##$TPNAME5= <>
##$TPNAME6= <>
##$TPNAME7= <>
##$TPOAL= (0..7)
0.5 0.5 0.5 0.5 0.5 0.5 0.5 0.5 
##$TPOFFS= (0..7)
0 0 0 0 0 0 0 0 
##$TUNHIN= 0
##$TUNHOUT= 0
##$TUNXOUT= 0
##$USERA1= <user>
##$USERA2= <user>
##$USERA3= <user>
##$USERA4= <user>
##$USERA5= <user>
##$V9= 5
##$VALIST= <valist>
##$VCLIST= <CCCCCCCCCCCCCCC>
##$VD= 0
##$VDLIST= <DDDDDDDDDDDDDDD>
##$VPLIST= <PPPPPPPPPPPPPPP>
##$VTLIST= <TTTTTTTTTTTTTTT>
##$WBST= 1024
##$WBSW= 4
##$XGAIN= (0..3)
0 0 0 0 
##$XL= 0
##$YL= 0
##$YMAX_a= 243679
##$YMIN_a= -189866
##$ZGOPTNS= <>
##$ZL1= 120
##$ZL2= 120
##$ZL3= 120
##$ZL4= 120
##$ABSF1= 10
##$ABSF2= 0
##$ABSG= 5
##$ABSL= 3
##$ALPHA= 0
##$AQORDER= 0
##$ASSFAC= 0
##$ASSFACI= 0
##$ASSFACX= 0
##$ASSWID= 0
##$AUNMP= <proc_1d>
##$AZFE= 0.1
##$AZFW= 0.1
##$BCFW= 1
##$BC_mod= 2
##$BYTORDP= 1
##$COROFFS= 0
##$CY= -3
##$DATMOD= 1
##$DC= 2
##$DFILT= <>
##$DTYPP= 0
##$F1P= 0
##$F2P= 0
##$FCOR= 0.5
##$FTSIZE= 0
##$FT_mod= 4
##$GAMMA= 1
##$GB= 0.15
##$INTBC= 1
##$INTSCL= 1
##$ISEN= 128
##$LB= 0.25
##$LEV0= 0
##$LPBIN= 0
##$MAXI= 10000
##$MC2= 0
##$MEAN= 0
##$ME_mod= 0
##$MI= 1.114404
##$NCOEF= 0
##$NC_proc= 0
##$NLEV= 6
##$NOISF1= 3.799351
##$NOISF2= 2.8
##$NSP= 1
##$NTH_PI= 0
##$NZP= 0
##$OFFSET= 14.38212
##$PC= 1
##$PHC0= -4221.897
##$PHC1= 13.5923
##$PH_mod= 1
##$PKNL= yes
##$PPARMOD= 0
##$PSCAL= 0
##$PSIGN= 0
##$REVERSE= no
##$SF= 200.129724274929
##$SI= 16384
##$SIGF1= 3
##$SIGF2= 2
##$SINO= 400
##$SIOLD= 16384
##$SREGLST= <1H.CDCl3>
##$SSB= 0
##$STSI= 0
##$STSR= 0
##$SW_p= 3205.1282051282
##$SYMM= 0
##$S_DEV= 0
##$TDeff= 0
##$TDoff= 0
##$TI= <>
##$TILT= no
##$TM1= 0
##$TM2= 0
##$TOPLEV= 0
##$USERP1= <user>
##$USERP2= <user>
##$USERP3= <user>
##$USERP4= <user>
##$USERP5= <user>
##$WDW= 1
##$XDIM= 8192
##$YMAX_p= 0
##$YMIN_p= 0
$$ End of Bruker specific parameters
$$ ---------------------------------
##NTUPLES= NMR FID
##VAR_NAME=  TIME,          FID/REAL,        FID/IMAG
##SYMBOL=    X,             R,               I
##VAR_TYPE=  INDEPENDENT,   DEPENDENT,       DEPENDENT
##VAR_FORM=  AFFN,          ASDF,            ASDF
##VAR_DIM=   8192,          8192,            8192
##UNITS=     SECONDS,       ARBITRARY UNITS, ARBITRARY UNITS
##FACTOR=    0.0002768,     1,               1
##FIRST=     0,             0,               0
##LAST=      2.2672688,     0,               0
##MIN=       0,             -189866,         0
##MAX=       2.2672688,     243679,          0
$$ Real data points
##PAGE= N=1
##DATA TABLE= (X++(R..R)), XYDATA
$$ [...]
$$ plain form
1789 296 -139 86 48 69 -95 -150 106 -81 28 -158 -357 1 124 53 1 -103 -45 147 -75 122 190 -155
1811 -155 89 12 45 -36 77 -68 -72 -1 -217 -149 271 92 -143 -236 -192 -98 -276 175 26 -62 8 -278 -223 72
1835 72 246 173 -48 -29 -11 -93 309 -96 -60 -209 -152 345 290 -170 -51 -173 108 -66 63 -115 -213 32 -244
1858 -244 77 -246 -8 -25 -77 89 -16 -175 -23 88 -9 5 49 152 -181 -285 -164 -251 -59 -84 -218 -18
1880 -18 -302 92 90 -116 36 95 267 211 -181 -37 293 -159 171 -141 67 -6 84 120 -34 98 38 52 110 -11
1904 -11 65 -4 -170 95 -47 73 243 195 -130 -151 -99 97 -56 -39 -176 66 -209 22 46 -118 -17 -15 58 107
1928 107 -72 66 -132 86 -31 141 65 -71 -52 -21 -42 191 -122 -166 129 91 11 58 -129 87 -153 43 50
1951 50 -59 -181 38 -304 -20 -188 -60 -37 -121 120 -157 161 -53 -27 49 -241 9 449 -148 -73 118 130
$$ packed form
1789B96m35K25l8K1j64n5K56j87J09j86j99L58J23p1n2j04N8J92k22J97O8l45
1811a55K44p7L3q1J13j45mP1k16O8M20j79k35r3M4R4j78M51j49q8P0k86N5K95
1835G2J74p3k21J9J8q2M02m05L6j49N7M97n5m60J19j22K81j74J29j78r8K45k76
1858b44L21l23K38j7n2J66j05j59J52J11r7J4M4J03l33j04J21q7J92k5j34K00
1880a8k84L94kk06J52N9J72n6l92J44L30m52L30l12K08p3R0L6j54J32o0J4N8j21
1904a1P6o9j66K65j42J20J70m8l25k1N2J96j53J7j37K42k75K31K4j64J01KP3M9
1928A07j79J38j98K18j17J72p6j36J9L1k1K33l13m4K95l8q0M7j87K16k40J96P
1951E0j09j22K19l42K84j68J28K3q4K41k77L18k14K6P6k90K50M40n97P5J91J2
$$ plain form
1973 130 -15 89 -67 64 165 30 -78 7 -129 -132 132 300 96 81 139 22 -64 71 -328 -134 -181 -25
1995 -25 -164 -116 -18 -15 -267 119 31 16 -62 -124 -83 140 63 -102 -12 -184 27 0 -260 207 37 37 44 104 128 -141
2021 -141 106 113 -40 -226 -38 -240 -50 126 -105 248 115 -61 -208 7 -55 -147 -19 -339 24 -65 81 223
2043 223 -106 -228 26 29 60 216 94 6 56 -1 -171 122 -289 -34 -53 40 259 136 116 -108 29 122 193 -16
2067 -16 3 -63 321 -226 136 95 -109 44 18 41 -90 -109 157 67 68 -42 51 -117 -196 -111 -97 98 200 -37 246
2092 246 159 -75 3 -57 -255 -5 -61 -17 52 287 20 276 -172 -51 52 2 -37 -183 90 1 8 77 -44 -57
2116 -57 -129 -74 70 120 -34 -183 -11 -33 189 -166 105 -49 -140 -338 26 -5 131 -31 163 -22 -40 -211 -91
2139 -91 -65 237 -39 106 61 -4 -71 83 100 9 91 104 -53 257 222 16 126 282 42 149 134 122 -93 -58
$$ packed form
1973A30j45J04j56J31J01j35j08Q5j36lK64J68k04j5N8j17q6J35l99J94m7J56
1995b5j39M8R8Lk52L86q8j5p8o2M1K23p7j65R0j72K11k7k60M67j70%PO0K4k69
2021a41K47Pj53j86J88k02J90J76k31L53j33j76j47K15o2r2J28l20L63q9J46J42
2043B23l29j22K54LL1J56j22q8N0n7j70K93m11K55j9R3K19j23k0k24J37R3P1k09
2067a6J9o6L84n47L62m1k04J53k6K3j31j9K66r0Jj10R3j68p9Q5J4J95J02k37K83
2092B46q7k34P8o0j98K50n6M4O9K35k67K56m48J21J03n0l9j46K73q9PO9j21j3
2116e7p2N5J44N0j54j49J72k2K22l55K71j54r1j98L64l1J36j62J94j85j8j71J20
2139i1K6L02k76J45m5o5o7J54J7r1Q2J3j57L10l5k06J10J56k40J07j5j2k15L5
$$ plain form
2163 -58 110 16 -119 -29 161 9 -389 -35 174 -25 -99 -24 252 55 140 257 71 215 118 -32 -76 -160 -16
2186 -16 -150 149 71 52 -344 42 2 29 182 -259 -252 110 50 -16 118 -127 78 -64 13 111 99 2 -161 131
2210 131 -127 350 41 46 56 -261 -185 31 165 256 -46 -267 -1 91 -231 -262 -94 -67 188 118 -59 -12 66 125
2234 125 36 -111 312 103 -117 -90 189 148 50 214 -119 -31 86 10 54 -178 294 72 200 -211 -120 -150 -183
2257 -183 -8 40 175 -153 -15 -113 -186 124 -70 -77 -10 -554 137 17 -73 -43 130 30 74 100 -63 9 76 -121
2281 -121 -19 -148 248 -104 94 63 20 90 193 -55 -33 -135 -187 -105 -34 -28 -43 -233 -44 -134 -119 -201 261 114
2305 114 -5 109 -171 -96 -52 -181 142 -206 -88 232 -63 -68 -8 290 -24 -53 -45 146 -118 -192 15 163 -82
2328 -82 -247 -67 -170 -203 31 -128 -136 -149 204 148 -4 114 168 -66 -58 -26 -60 -281 -64 287 -374 104 -73 -125
$$ packed form
2163e8J68r4j35R0J90j52l98L54K09j99p4P5K76j97Q5J17j86J44r7j50m4q4J44
2186a6j34K99p8j9l96L86m0K7J53m41PL62o0o6J34k45K05j42P7R8j2r7j63K92
2210A31k58M77l09NJ0l17P6K16J34R1l02k21K66R2l22l1J68K7K55p0j77M7P8N9
2234A25q9j47M23k09k20K7K79m1r8J64l33Q8J17p6M4k32M72k22J28m11R1l0l3
2257a83J75M8J35l28J38r8p3L10j94pO7n44O91j20r0L0J73j00M4K6j63P2O7j97
2281a21J02j29L96l52J98l1m3P0J03k48K2j02n2Q2P1Oj5j90J89r0J5q2M62j47
2305A14j19J14k80P5M4j29L23l48J18L20k95nO0K98l14k9QJ91k64p4K07J48k45
2328h2j65J80j03l3K34j59qj3L53n6j52J18N4k34QL2l4k21K17L51o61M78j77n2
$$ plain form
2352 -125 -180 26 -85 -120 -29 -39 31 -152 8 285 -89 -197 213 236 -83 -78 8 12 74 42 -23 108 -191 53 244
2377 244 166 51 -47 128 225 -236 -174 129 100 -34 188 -176 147 -143 279 222 33 -171 279 149 -220 185
2399 185 168 -41 -44 -112 -195 106 -28 62 -65 -84 182 83 174 -5 57 -1 -3 84 -10 -105 -35 46 -50 -192 201 210 -7
2426 -7 -54 17 -263 -1 -216 -41 -216 -29 -177 176 41 -207 244 128 135 -177 335 -120 21 -217 8 -8
2448 -8 -73 0 -461 -14 -295 -167 82 -216 -83 -93 130 -173 -128 -221 3 101 28 -27 -36 96 -32 -181 23 84
2472 84 -124 154 -49 71 -47 124 149 42 -73 340 -39 -60 9 124 176 155 104 117 390 -180 -81 -43 171
2495 171 -120 151 56 257 7 -49 -144 -28 159 83 211 -153 -56 -104 -116 -15 410 -6 183 -164 -32 -138
2517 -138 29 90 40 31 115 294 128 -157 -291 31 -77 2 34 80 -225 -50 208 -23 70 28 24 88 -321 -32
$$ packed form
2352a25n5K06j11l5R1j0P0j83J60K77l74j08M10K3l19NQ6MO2l2o5J31k99K44J91
2377B44p8j15r8J75R7m61O2L03k9j34K22l64L23k90M22n7j89k04M50j30l69M05
2399A85j7k09lo8q3L01j34R0j27j9K66r9R1j79O2n8kQ7r4r5P0Q1r6j42L93Rk17
2426gm7P1k80K62k15J75j75J87j48L53j35k48M51j16Pl12N12m55J41k38K25j6
2448ho5P3m61M47k81J28K49k98J33j0K23l03M5r3K24R8p3n5rJ32j28j49K04O1
2472H4k08K78k03J20j18J71K5j07j15M13l79k1O9J15N2k1n1J3K73n70R9L8K14
2495A71k91K71r5K01k50n6r5J16J87p6J28l64R7m8j2J01M25m16J89l47J32j06
2517a38J67O1n0rQ4J79j66k85j34L22j08P9L2M6l05J75K58k31R3m2mO4m09K89
$$ plain form
2541 -32 105 -86 -42 -243 -102 -212 -68 -110 -239 3 96 13 -44 -75 240 29 94 27 -156 -80 -142 -42 -250 -105
2565 -105 81 138 125 -101 -37 168 25 -44 -103 12 115 102 -80 119 146 -36 -55 54 -62 60 48 -31 -64 64
2589 64 79 -19 -5 -173 118 127 -46 86 12 -108 136 -76 -43 -29 -258 15 -113 -293 -43 151 133 315 -69
2612 -69 -96 -138 89 -23 93 -40 -106 74 82 81 -137 -93 125 74 -27 8 41 20 -58 -159 36 39 -50 -159 21 -89
2638 -89 -12 -165 151 -177 244 74 -151 -75 -65 63 -40 110 16 -58 -34 -45 163 -35 50 159 45 -57 199
2661 199 -57 -31 -52 -366 -92 -166 -249 8 148 151 -52 -220 11 -39 -39 -69 10 -55 202 -257 117 3 -244 127
2685 127 54 78 -42 137 -14 99 -53 -79 148 -51 -208 45 236 -15 -99 -180 -212 132 61 50 -11 -63 -77 68
2709 68 2 -65 112 185 30 -280 -110 45 -103 89 -85 -92 -250 -150 89 81 125 236 -112 -146 127 -46 154
$$ packed form
2541c2J37j91M4k01J41j10J44m2j29K42R3q3n7l1L15k11O5o7j83P6o2J00k08J45
2565a05J86N7j3k26O4K05j43o9n9J15J03j3j82J99K7j82j9J09j16J22j2p9l3J28
2589F4J5r8J4j68K91Rj73J32p4j20K44k12L3J4k29K73j28j80K50J94j8J82l84
2612f9k7m2K27j12J16j33o6J80Qjk18M4K18n1j01L5L3k1p8j01J95Lq9j09J80j10
2638h9P7j53L16l28M21j70k25P6J0J28j03J50r4p4K4j1K08j98Q5J09j14j02K56
2661A99k56K6k1l14K74p4q3K57J40Lk03j68K31n0%l0P9o5K57m59L74j14k47L71
2685A27p3K4j20J79j51J13j52k6K27j99j57K53J91k51q4q1l2L44p1j1o1n2j4J45
2709F8o6o7J77P3j55l10J70J55j48J92j74pj58J00K39qM4J11l48l4K73j73K00
$$ plain form
2732 154 -338 257 47 -1 90 249 -130 -158 -58 -63 -132 155 -254 168 147 -268 -116 -147 335 -99 -55 53 54 -346
2756 -346 29 -9 -87 50 76 164 -13 213 -3 100 80 174 -100 105 78 104 66 -36 79 -133 256 156 -75
2779 -75 116 113 -66 193 29 -22 37 84 -112 -135 -50 -119 52 -157 -136 206 187 -47 -87 398 -151 152 33 -10
2803 -10 -119 -351 -166 -142 163 116 157 -58 320 196 -76 206 -37 -124 -134 36 113 -122 142 -118 33 93 158
2826 158 170 25 -99 214 -63 53 -12 -18 -101 119 -36 -26 334 -74 15 30 -71 -15 -135 -32 -85 -123 234 83
2850 83 -122 -12 -87 -177 264 -35 -186 72 -38 -68 108 180 -29 -148 -14 265 86 -62 41 182 -3 6
2872 6 75 155 -19 79 308 -377 -165 -50 137 2 99 78 89 -188 39 223 -253 99 81 87 71 52 361 -126
2896 -126 -170 176 -59 -51 -2 32 27 -101 25 341 -194 -60 216 39 -63 -60 88 287 17 87 -149 -92 43 52
$$ packed form
2732A54m92N95k10m8R1J59l79k8J00no9K87m09M22k1m15J52l1M82m34M4J08Jm00
2756c46L75l8p8J37K6Q8j77K26k16J03k0R4k74K05k7K6l8j02J15k12L89j00k31
2779g5J91lj79K59j64n1N9M7j96k3Q5o9J71k09K1L42j9k34m0M85n49L03j19m3
2803a0j09k32J85K4L05m7M1k15L78j24k72K82k43q7j0J70P7k35K64k60J51O0O5
2826A58J2j45j24L13k77J16o5oq3K20j55J0L60m08Q9J5j01N6j20J03n3l8L57j51
2850H3k05J10p5r0M41k99j51K58j10l0J76P2k09j19J34K79j79j48J03J41j85R
2872FO9Q0j74R8K29o85K12J15J87j35R7k1J1k77K27J84m76L52j8Oj6j9L09m87
2896a26m4L46k35QM9L4nj28J26L16n35J34K76j77j02LJ48J99k70P0k36N7J35R
$$ plain form
2920 52 257 39 78 -114 129 23 -47 -80 -10 -73 154 254 -24 -147 -32 -343 63 238 -88 408 10 299
2942 299 33 4 190 -74 -132 -81 172 -3 -78 182 12 89 -44 -103 -202 -188 53 -49 -85 41 -1 -182 -74
2965 -74 -60 -84 176 -7 -170 -132 -165 -113 -50 31 39 66 -70 -83 11 165 -40 84 33 -70 104 177 -49 -66 49
2990 49 -65 49 85 -105 253 268 -138 -156 81 126 159 -244 -178 -295 -73 229 -33 -136 -230 366 82 -67 -270
3013 -270 186 -81 -39 11 203 -151 -65 -37 30 -98 -50 140 -106 155 31 69 -77 133 13 -21 2 171 -54
3036 -54 169 29 -116 -225 -63 -122 -93 -51 1 138 74 144 215 266 232 28 12 -59 -180 -125 -145 8 -19 58 4 -7
3062 -7 -175 -401 142 -161 -35 -35 -33 -138 161 -47 164 -20 -15 236 -142 -168 -93 -90 108 -179 164 57 154 139 113
3087 113 -127 -170 -151 89 -15 -228 197 -215 -144 -46 -357 25 -91 -173 -134 -82 100 -280 201 -89 50 -11 191
$$ packed form
2920E2K05k18L9j92K43j06p0l3P0o3K27J00k78j23J15l11M06J75l26M96l98K89
2942B99k66k9J86k64n8N1K53j75p5K60j70P7j33n9r9J4K41j02l6J26m2j81J08
2965g4J4k4K60j83j63L8l3N2O3Q1QK7j36j3R4J54k05J24n1j03J74P3k26j7J15
2990D9j14J14L6j90L58J5m06j8K37M5L3m03O6j17K22L02k62j03r4N96k84j49k03
3013b70M56k67M2N0J92l54Q6K8O7j28M8J90k46K61j24L8j46K10j20l4K3J69k25
3036e4K23j40j45j09J62n9K9M2N2J37o4P0P1N1l4k04j6p1j21N5k0J53k7P7n4j1
3062gj68k26N43l03J26%Kj05K99k08K11j84NK51l78k6P5LJ98k87L43j07R7j5k6
3087A13k40m3J9K40j04k13M25m12P1R8l11L82j16q2L9N2J82l80M81k90J39o1K02
$$ plain form
3110 191 155 -87 -75 -46 104 106 -53 32 -123 -113 -250 -94 109 276 -346 15 290 -20 -93 -59 -26 13 349 -1
3134 -1 -73 -25 638 -96 -80 -205 -223 330 471 -302 -300 -103 -178 -228 -309 313 -92 190 126 -152 -450 18 29 -46 21
3159 21 -116 -28 -89 -5 6 101 176 -18 217 99 -116 77 123 -102 -147 -84 62 -46 145 15 96 263 88 -105
3183 -105 -263 -70 148 79 -9 35 92 -94 -12 25 -266 -149 -15 -15 -40 29 -136 178 -79 -121 -64 -3 99 -127
3207 -127 -56 220 38 88 -104 -187 72 -301 48 -89 -52 -144 -18 145 -43 13 89 -165 -96 -229 -54 -138 -149
3230 -149 30 37 -5 59 -17 85 -333 -111 -193 11 -134 -195 -77 -18 192 64 70 -195 56 -72 -76 32 -138 -34
3254 -34 -61 -85 0 246 -28 12 31 312 -94 24 -6 -176 232 -74 -20 -147 -269 264 20 -43 -100 61 -211
3277 -211 284 261 10 233 36 -132 2 126 38 149 265 -138 -27 -71 -86 2 -95 -68 -121 -87 -150 126 12
$$ packed form
3110A91l6k42J2K9J50Kj59Q5j55J0j37J56K03J67o22L61K75l10p3L4L3L9L36l50
3134ap2M8O63p34J6j25j8N53J41p73KJ97p5n0q1O22m05K82o4k78k98M68J1p5O7
3159B1j37Q8o1Q4J1R5P5j94K35j18k15J93M6k25m5O3J46j08J91j30Q1J67j75j93
3183a05j58J93K18o9q8M4N7j86Q2L7k91J17J34%k5O9j65L14k57m2N7O1J02k26
3207a27P1K76j82N0j92q3K59l73L49j37L7r2J26J63j88N6P6k54O9j33J75q4j1
3230a49J79Pm2O4p6J02m18K22q2K04j45o1J18N9K10j28Ok65K51j28mJ08j70J04
3254c4k7k4Q5K46k74M0J9K81m06J18l0j70M08l06N4j27j22N33k44o3n7J61k72
3277b11M95k3k51K23j97j68J34J24q8J11J16m03J11m4j5Q8r7K7n3L4o3K76j14
$$ plain form
3300 12 30 -29 -83 131 51 137 106 21 -5 -10 179 -128 -355 -41 -44 -310 107 -157 -155 -55 -124 21 65 200 2 -142
3326 -142 87 -127 20 143 -69 -64 -63 158 59 64 -39 -184 -16 69 47 15 -106 -182 114 -77 -124 31 194 107
3350 107 30 -164 -79 -180 363 -81 97 -96 -211 55 124 158 285 316 -44 -154 -37 -188 175 8 40 112
3372 112 117 124 -253 -41 35 -35 -22 146 83 166 -250 167 -124 122 161 -40 -94 -250 34 144 149 97 -84 -151 7
3397 7 93 -119 -79 -29 -63 -102 135 -53 -183 23 -58 63 -30 0 -20 -94 127 2 54 171 217 -206 38 -1 -113
3422 -113 -115 111 44 -299 93 -105 -218 -8 134 151 15 -297 99 -6 3 -21 17 70 123 87 -78 -349 32 -191
3446 -191 118 46 -144 -48 -96 178 -17 -66 -56 42 41 62 16 -161 -117 148 7 41 129 -3 -189 185 -224 -81
3470 -81 -145 -6 -230 45 85 -132 139 9 144 8 -144 197 146 130 -363 -31 -49 126 -70 174 244 -71
$$ packed form
3300A2J8n9n4K14q0Q6l1q5k6nJ89l07k27L14lk66M17k64KJ00o9J45M4J35j98j44
3326a42K29k14J47J23k12NJK21r9Nj03j45J68Q5k2l2j21p6K96j91m7J55J63q7
3350A07p7j94Q5j01N43m44J78j93j15K66O9L4J27L1l60j10J17j51L63j67L2P2
3372A12NPl77K12P6p0J3J68o3Q3m16M17k91K46L9k01n4j56K84J10Nn2j81o7J58
3397GQ6k12M0N0l4l9K37j88j30K06q1J21r3L0k0p4K21j25N2J17M6m23K44l9j12
3422a13kK26o7l43L92j98j13K10J42J7j36l12L96j05Rk4L8N3N3l6j65k71L81k23
3446a91L09p2j90R6m8K74j95m9J0R8jK1m6j77M4K65j41L4Q8j32j86L74m09J43
3470h1o4J39k24K75M0k17K71j30J35j36j52L41n1j6m93L32j8J75j96K44P0l15
$$ plain form
3492 -71 124 -1 97 -189 -12 136 -27 208 -12 -106 0 214 69 175 10 -2 245 168 19 -12 64 107 -89
3515 -89 -84 7 -190 206 -184 132 29 147 -116 46 278 115 178 -2 -44 -14 -4 -66 143 -319 -173 263 -201
3538 -201 -60 -67 168 60 223 -67 -111 30 -163 141 -9 111 44 -140 -16 -172 231 -35 38 35 -159 123
3560 123 -159 -86 62 157 107 -64 -76 131 -11 -130 33 54 38 228 -240 121 211 -167 48 -200 83 42 -102
3583 -102 -108 260 18 -86 -107 -85 60 99 55 158 9 263 -3 50 -238 -29 33 -188 -158 198 145 27 -17 62
3607 62 24 -109 41 150 -75 -184 121 94 -42 -5 217 -42 220 -104 -26 234 71 -3 -59 -158 133 -303 -111
3630 -111 -291 249 -168 -177 225 90 47 151 -228 257 -117 -265 201 96 -24 -231 -225 2 -43 -265 160 26
3652 26 41 -177 162 -17 28 -95 -8 -65 -23 -27 -74 15 137 -197 -16 208 -185 84 17 18 -116 -224 -18 -30 -433
$$ packed form
3492g1J95j25R8k86J77J48j63K35k20r4J06K14j45J06j65j2K47p7j49l1P6M3j96
3515h9NR1j97L96l90L16j03J18k63J62K32j63O3j80m2L0J0o2K09m62J46M36m64
3538b01J41pK35j08J63k90m4J41j93L04j50J20o7j84J24j56M03k66P3lj94K82
3560A23k82P3J48R5n0j71j2K07j42j19J63K1j6J90m68L61R0l78K15k48K83m1j44
3583a02oL68k42j04k1K2J45L9m4J03j49K54k66N3k88K09O2k21L0L56n3j18m4P9
3607F2l8j33J50J09k25j09L05k7j36L7K22k59K62l24P8K60j63p4n6r9K91m36J92
3630a11j80N40m17rM02j35m3J04l79M85l74j48M66j05j20k07OK27m5k22M25j34
3652B6J5k18L39j79M5j23Q7n7M2mm7Q9J22l34J81K24l93K69o7Jj34j08K06j2m03
$$ plain form
3677 -433 139 30 -83 155 -163 121 -68 55 175 -10 -112 204 -122 245 -56 -114 -200 -11 109 116 19 -147
3699 -147 182 59 -67 12 4 -271 -164 -182 128 18 64 29 7 146 14 213 49 -215 -202 36 110 65 -35
3722 -35 263 -74 71 114 0 -27 54 190 188 -76 -66 -44 14 54 -16 -116 44 138 18 -7 -260 55 82 116 115 4
3748 4 -113 216 -109 128 152 -173 140 231 -49 -99 111 -85 -1 -16 98 120 27 -212 39 21 -39 -17 -192 -65
3772 -65 363 -145 -121 149 22 126 22 -1 238 87 0 -61 52 -64 -179 -30 -230 -67 -78 -54 205 -49
3794 -49 -45 -101 -5 -17 50 237 -223 -12 -269 -122 -140 44 269 49 7 -111 -134 -17 -126 -31 -24 59 288 -179 -24
3819 -24 -30 142 -163 37 107 5 -68 -64 48 -165 42 12 -53 -18 110 42 -46 69 130 -137 96 118 -181 152 -68
3844 -68 39 -30 6 -109 23 28 -61 -88 23 -96 104 -227 -139 106 133 -204 -118 -59 234 215 178 66 -87 178
$$ packed form
3677d33N72j09j13K38l18K84j89J23J20j85j02L16l26L67l01n8q6J89J20Pr7j66
3699a47L29j23j26P9qk75J07j8L10j10M6l5k2J39j32J99j64k64J3K38P4m5j00
3722c5K98l37J45M3j14k7Q1J36kk64J0K2N8M0p0j00J60R4j20k5k53L15K7L4jj11
3748Dj17L29l25K37K4l25L13R1k80n0K10j96Q4j5J14K2r3k39K51j8o0K2j75J27
3772f5M28n08K4K70j27J04j04k3K39j51q7o1J13j16j15J49k00J63j1K4K59k54
3794d9Mn6R6j2O7J87m60K11k57J47j8J84K25k20m2j18k3J17j09R5PQ3K29m67J55
3819b4oJ72l05K00P0j02p3MJ12k13K07l0o5L5J28o8q8J15O1k67K33K2k99L33k20
3844f8J07o9L6j15J32Nq9k7J11j19K00l31Q8K45K7l37Q6N9K93j9l7j12j53K65
$$ plain form
3868 178 -45 -45 16 39 -178 -19 -2 44 87 29 -17 -153 -273 -126 -89 0 -142 -134 111 139 51 -224 -10 147 -108
3893 -108 -241 37 128 -12 -170 -14 -117 -57 -20 -21 -219 79 -51 -99 61 -97 -27 164 44 -217 -43 -162
3915 -162 74 108 -252 -173 149 -176 -46 233 207 -84 26 -179 -61 33 122 93 241 75 -84 -201 -48 -124
3937 -124 -3 30 95 204 57 -44 -9 37 -29 114 65 82 -56 -1 -40 -297 88 -127 -142 8 285 -37 279
3960 279 260 34 -8 -208 -166 61 263 -139 -36 -130 -52 -31 166 -108 70 254 16 96 -148 -267 -172 42 158
3983 158 97 199 87 -219 96 -65 -201 -232 -447 -89 23 210 -74 38 -66 -105 -151 -53 92 25 199 -62
4005 -62 -204 -52 -89 308 -11 -71 -37 -216 -7 292 -308 152 -267 -141 -28 -136 60 148 52 196 199 90 -187
4028 -187 -7 108 171 -108 -22 22 -42 -109 68 105 -132 -85 41 119 175 -290 96 29 67 44 -176 -248 144 24
$$ packed form
3868A78k23%O1K3k17J59J7M6M3n8m6j36j20J47L7Q9j42QK45K8q8k75K14J57k55
3893a08j33K78R1j40j58J56j03O0L7jj98K98j30m8J60j58P0J91j20k61J74j19
3915a62K36L4l60P9L22l25J30K79k6k91J10k05J18R4Q9k9J48j66j59j17J53p6
3937a24J21L3O5J09j47j01L5M6o6J43m9J7j38N5l9k57L85k15j5J50K77l22L16
3960B79j9k26m2k00M2K27K02m02J03r4P8K1J97k74J78J84k38Q0k44j19R5K14J16
3983A58o1J02j12l06L15j61j36l1k15L58J12J87k84J12j04l9m6R8J45o7J74k61
4005f2j42J52l7L97l19o0L4j79K09K99o00M60m19J26J13j08J96Q8r6J44Lj09k77
4028a87J80J15O3k79Q6M4o4o7J77L7k37M7J26P8N6m65L86o7L8k3k20p2L92j20
$$ plain form
4052 24 36 -76 -90 246 96 237 136 -129 46 69 -58 -116 24 8 258 -183 48 173 -52 -9 -221 -51
4074 -51 42 -58 291 -196 35 -244 -45 -22 53 -20 135 -86 83 -88 -238 99 -47 163 -66 77 -38 -34
4096 -34 80 9 -230 -39 -80 72 49 93 -11 91 40 -14 -71 100 110 253 1 16 -100 198 -128 -64 6 -43
4120 -43 -31 -103 -299 155 -53 417 -108 -37 -239 -65 135 -74 90 203 71 34 -61 -259 29 100 -44 -77 134
4143 134 -70 95 -110 216 -21 23 102 18 -63 75 259 -6 -330 254 26 337 -29 -77 -66 107 67 74 -84
4166 -84 157 144 227 289 17 124 25 -73 134 -102 -240 -91 398 109 -535 31 243 77 5 43 26 126 136
4189 136 76 103 190 -63 103 -116 349 71 -67 -209 86 -45 105 -206 -315 -308 -28 163 -217 -110 30 12
4211 12 185 117 88 93 53 -79 9 161 64 -271 37 -5 5 -136 -192 -124 249 249 0 -227 154 157 167 -69 86 -65
$$ packed form
4052B4J2j12j4L36j50J41j01k65J75K3j27n8J40j6K50m41K31J25k25M3k12J70
4074e1R3j00L49m87K31k79J99K3P5p3J55k21J69j71j50L37j46K10k29J43j15M
4096c4J14p1k39J91m1J52k3M4j04J02n1n4n7J71J0J43k52J5j16K98l26O4P0m9
4120d3J2p2j96M54k08M70n25P1k02J74K00k09J64J13j32l7r5j98K88P1j44l3K11
4143A34k04J65k05L26k37M4P9q4q1J38J84k65l24N84k28L11l66m8J1J73m0Pj58
4166h4K41j3Q3O2k72J07r9r8K07k36j38J49M89k89o44N66K12j66p2L8j7J00J0
4189A36o0K7Q7k53J66k19M65k78j38j42K95j31J50l11j09PK80J91l80J07J40j8
4211A2J73o8k9Nm0j32Q8J52r7l35L08m2J0j41n6O8L73%k49k27L81LJ0k36J55j51
$$ plain form
4237 -65 -167 -57 -332 89 31 13 27 2 101 105 -46 -259 -205 15 -10 -145 -188 106 -235 3 220 -61 104 18
4261 18 -121 -113 48 -186 -324 190 94 0 -91 105 198 -294 -147 31 -17 -58 -165 132 83 15 81 61 82 -27 187
4286 187 -63 -97 53 147 -18 21 258 -18 -35 73 23 -38 -125 120 45 -263 -33 -15 120 54 5 -35 63 -6 -80
4311 -80 131 89 102 -137 -126 -9 42 48 -81 -40 -176 -368 -53 67 143 -38 -15 248 124 30 148 94 218 -156
4335 -156 144 67 158 138 -81 -22 -176 62 73 -84 232 -109 38 261 -2 -214 185 150 96 -202 14 -54 45
4358 45 -63 -272 123 264 289 -8 -113 -164 -115 -112 -108 -114 -29 104 -352 96 35 -173 -32 81 142 -53 132 145 -13
4383 -13 192 -19 -23 -259 72 228 198 97 100 297 -238 157 -20 -125 63 -250 -186 5 -241 -19 -99 111 -141
4406 -141 -263 27 233 -86 -155 -214 0 198 -96 -170 -2 -224 -161 77 -46 102 -22 6 -6 -177 -63 66
$$ packed form
4237f5j02J10k75M21n8j8J4k5R9Mj51k13N4K20k5j35m3K94l41K38K17k81J65q6
4261A8j39QJ61k34j38N14r6r4r1J96R3m92J47J78m8m1j07K97m9o8O6k0K1j09K14
4286A87k50l4J50R4j65L9K37k76j7J08n0o1q7K45p5l08K30J8J35o6m9m0R8o9p4
4311h0K11m2J3k39J1J17N1Oj29M1j36j92L15J20P6j81K3K63j24r4J18n4J24l74
4335a56L00p7R1k0k19N9j54K38J1j57L16l41J47K23k63k12L99l5n4k98K16o8R9
4358D5j08k09L95J41K5k97j05n1M9LMoQ5J33m56M48o1k08J41J13O1j95J85J3j58
4383a3K05k11mk36L31J56l0j01LJ97n35L95j77j05J88l13O4J91k46K22q0K10k52
4406a41j22K90K06l19o9n9K14J98k94p4J68k22O3K38j23J48j24K8j2j71J14J29
$$ plain form
4428 66 -38 -277 36 -61 314 40 -49 28 148 187 -97 128 -121 216 -114 101 30 74 63 236 202 53 122
4451 122 -146 37 36 -90 -366 -83 -105 -90 165 -52 179 -21 66 100 37 -172 -79 -100 140 53 55 96 -143 70
4475 70 -124 9 147 -28 -28 -180 66 -58 73 97 20 194 37 231 -100 -13 188 -45 144 -204 235 -134
4497 -134 -130 -318 -90 -31 -168 20 -194 220 -55 -273 -10 6 103 -46 -186 -195 -150 1 171 62 -99 26 35
4520 35 143 140 182 -119 124 -88 -191 27 178 239 65 36 161 49 34 -128 -144 142 6 -117 182 -46 -44
4543 -44 -25 -72 -37 15 -3 -136 56 286 -241 -157 68 -75 -100 -4 40 -113 -177 85 -34 381 171 5 148 159
4567 159 35 -162 -55 36 42 83 -50 146 10 -243 94 164 -201 -157 68 158 121 -61 123 184 225 18 40 -42
4591 -42 43 -210 114 27 -236 -75 -42 -67 -43 167 -23 139 -118 -249 34 -24 -74 -103 43 252 135 -54 -39
$$ packed form
4428F6j04k39L13r7L75k74q9P7J20L9k84K25k49L37l30K15p1M4j1J73l4j49O9
4451A22k68J83jj26k76K83k2J5K55k17K31k00Q7L4o3k09R3k1K40q7KM1k39K13
4475G0j94J33J38j75%j52K46j24J31K4p7J74j57J94l31Q7K01k33J89l48M39l69
4497a34Mj88K28N9j37J88k14M14k75k18K63J6R7j49j40rM5J51J70j09j61J25R
4520C5J08lM2l01K43k12j03K18J51O1j74k9J25j12j5j62j6K86j36j23K99k28K
4543d4J9m7L5N2j8j33J92K30n27Q4K25j43k5R6M4j53o4K62j19M15k10j66J43J1
4567A59j24j97J07R1OM1j33J96j36k53L37P0l65M4K25R0l7j82J84O1M1k07K2q2
4591d2Q5k53L24q7k63J61L3k5K4K10j90J62k57j31K83n8n0k9J46K09j17j89J5
$$ plain form
4614 -39 -96 -108 -231 -274 142 -102 -8 -83 3 -7 127 62 -211 177 -360 71 59 197 104 110 -103 19 92 84 147 117
4640 117 56 -73 33 128 71 230 192 -56 -120 -28 -13 -22 -104 136 49 -339 -110 -245 168 178 74 96 -31 -39 -31 -6
4666 -6 68 159 -79 -97 42 -154 66 31 -186 -255 11 103 -80 -150 -33 -55 61 -40 -2 -44 -20 -151 73 -80
4690 -80 -141 26 -97 -19 107 167 -44 -102 148 -371 -164 -115 126 14 -191 -97 -28 -44 124 91 269 203 -171 -305
4714 -305 49 265 151 133 -26 38 -105 83 52 48 43 -50 469 110 152 127 -56 -37 171 152 3 22 57 181 -37
4739 -37 -119 45 -98 -130 -9 136 136 16 54 174 258 84 124 -81 -266 -323 -108 234 176 -14 172 -17 -27 18
4763 18 87 -10 -165 352 -140 -6 27 -279 105 214 101 149 -148 -52 154 -130 46 202 -53 -117 327 161
4785 161 42 -65 141 167 -343 43 -29 181 -26 69 -63 30 81 -319 105 68 -99 -97 50 150 -152 -131 -58
$$ packed form
4614c9n7j2j23m3M16k44R4p5Q6j0J34o5k73L88n37M31j2J38r3Ok13J22P3qO3l0
4640A17o1j29J06R5n7J59l8k48o4R2J5rq2K40q7l88K29j35M13J0j04K2j27qQK5
4666fP4R1k38j8J39j96K20l5k17o9K66R2j83p0J17k2J16j01L8m2K4j31K24j53
4690h0o1J67j23P8J26O0k11n8K50n19K07M9K41j12k05R4O9j6J68l3J78o6l74j34
4714c05L54K16j14j8j59O4j43J88l1mnr3N19l59M2k5j83J9K08j9j49J9L5J24k18
4739c7q2J64j43l2J21J45%j20L8J20Q4j74M0k05j85n7K15L42n8j90J86j89j0M5
4763A8O9r7j55N17m92J34L3l06L84J09j13M8k97R6K06k84J76J56k55o4M44j66
4785A61j19j07K06K6n10L86p2K10k07R5j32R3N1m00M24l7j67KJ47J00l02K1P3
$$ plain form
4808 -58 30 6 58 34 -56 -139 -221 -127 19 -41 146 29 -192 -148 150 -80 -238 88 -16 -56 -224 224 -109 105
4832 105 71 -87 -25 165 7 -308 86 -209 -99 -111 58 103 212 22 180 42 -77 -4 -195 231 147 9
4854 9 -62 -120 -108 97 -86 55 -50 -29 56 165 57 225 -5 -25 40 90 -206 -113 -53 63 -234 -106 -88 168
4878 168 -268 264 28 90 247 -249 236 -47 8 -44 -142 41 325 -139 -167 -155 148 60 -78 24 218 -136
4900 -136 -112 309 205 83 182 82 102 68 258 -143 94 -251 -130 99 50 -31 -71 -54 -246 -212 159 119 -7
4923 -7 11 -115 -80 144 -20 -24 3 -291 330 149 32 -245 289 217 63 1 -195 -83 -46 -212 -10 161 62 39
4947 39 165 -328 84 121 183 129 109 73 206 81 -94 197 19 -114 4 133 -25 80 240 196 -93 -3 -140
4970 -140 -162 -9 -15 -119 -84 -30 -76 -47 225 128 -152 -188 -28 229 91 -46 -58 -170 -320 16 36 142 -250 -37
$$ packed form
4808e8Q8k4N2k4r0q3q2R4J46o0J87j17k21M4K98k30j58L26j04m0j68M48l33K14
4832A05l4j58O2J90j58l15L94k95J10j2J69M5J09j90J58j38j19P3j91M26q4j38
4854Ip1n8J2K05j83J41j05K1Q5J09j08J68k30k0O5N0k96R3O0J16k97J28J8K56
4878A68m36N32k36O2J57m96M85k83N5n2r8J83K84m64k8J2L03q8j38J02J94l54
4900a36K4M21j04j22R9j00K0l4J90m01K37l45J21K29m9q1m0J7j92L4L71m0j26
4923gJ8j26L5K24j64mK7k94O21j81j17k77N34p2j54o2j96J12L7j66K02J71r9k3
4947C9J26m93M12L7O2n4k0l6J33j25j75K91j78j33J18J29j58J05J60m4k89R0j37
4970a40k2J53oj04L5N4m6K9K72r7k80l6J60K57j38j37j2j12j50L36K0J06l92K13
$$ plain form
4994 -37 -62 -33 95 3 -284 -241 -63 -113 13 69 -159 -117 -5 -84 8 85 61 9 -143 37 102 125 205 -45 59
5019 59 243 178 -49 -44 131 -14 -15 -138 -248 2 136 -217 75 65 -10 -62 -28 40 144 -201 -95 -109 -80 19 74
5044 74 -62 -186 64 121 -162 29 159 100 -218 87 158 -97 119 -58 214 -171 -67 -324 -113 -48 30 101
5066 101 50 68 189 260 -137 435 -109 -35 -77 -214 -358 156 -128 178 -203 -158 -42 0 155 102 232 -5 -53
5089 -53 50 -233 -21 -31 -202 -35 63 195 -112 -67 -261 -5 -145 -10 -86 -121 39 1 135 -80 -60 120 298
5112 298 -24 -56 23 -51 354 -88 99 -122 -46 -139 -47 59 -191 51 -200 240 126 204 -208 -12 185 -113
5134 -113 -125 -105 149 7 89 86 194 6 -121 -45 -128 449 58 -25 -143 170 135 90 256 -10 -25 4 32 -85
5158 -85 -4 -150 99 134 -52 -69 -206 -97 -22 -43 -67 -110 81 309 -249 141 142 154 227 -145 -142 116 -145 66 -41
$$ packed form
4994c7k5K9J28r2k87M3J78n0J26N6k28M2J12p9R2P7k4n2j52J80O5K3Q0k50J04
5019E9J84o5k27NJ75j45jj23j10K50J34l53K92j0p5n2L4O8J04l45J06j4K9R9N5
5044G4j36j24K50N7k83J91J30n9l18L05P1k55K16j77K72l85J04k57K11O5P8P1
5066A01n1J8J21P1l97N72n44P4m2j37j44N14k84L06l81M5J16M2J55n3J30k37m8
5089e3J03k83K12j0j71J67R8J32l07M5j94K56j40J35p6l5J60l8J34k15K0J80J78
5112B98l22l2P9p4M05m42J87k21P6r3R2J06k50K42k51M40j14P8m12J96J97k98
5134a13j2K0K54j42Q2lJ08j88j27P6q3N77l91q3j18L13l5m5J66k66j5K9K8j17
5158h5Q1j46K49L5j86j7j37J09P5k1k4m3J91K28n58L90JJ2P3l72LK58k61K11j07
$$ plain form
5183 -41 -27 -76 -16 -17 139 142 37 190 -43 368 -244 -120 225 10 135 -122 16 140 198 22 -37 -137 -30
5206 -30 -139 -131 62 -104 168 -331 19 -54 16 242 -148 89 -88 208 -123 177 369 258 24 -101 23 23
5228 23 -152 29 -68 20 180 -159 192 -119 -163 20 -360 173 312 -212 45 -79 -12 197 -392 0 -188 1
5250 1 136 -43 -75 -172 -130 -37 -211 47 -32 -23 -73 18 189 -83 -86 110 -132 330 43 232 301 -167 53 44 -35 -45
5276 -45 105 -68 38 42 47 167 15 -172 -77 212 -117 -65 20 -97 -91 20 79 127 -177 143 57 53 137 196 95 -344
5302 -344 -75 -100 111 185 -65 187 -81 28 -226 143 179 -75 -291 8 55 209 -65 -130 53 -150 94 75
5324 75 -64 203 142 -72 55 -172 220 326 -8 97 237 -286 -83 154 39 -47 48 -77 -8 -61 -96 148
5346 148 -4 118 -147 -151 239 -87 -239 178 88 115 69 -287 339 134 28 -54 155 133 232 -153 11 45 -86
$$ packed form
5183d1J4m9O0jJ56Lj05J53k33M11o12J24L45k15J25k57J38J24N8j76n9j00J07
5206c0j09QJ93j66K72m99L50p3P0K26l90K37j77K96l31L00J92j11k34j25J24%
5228B3j75J81r7Q8J60l39L51l11m4J83l80N33J39n24K57j24O7K09n89L92j88J89
5250AJ35j79l2r7M2R3j74K58p9Rn0R1J71k72lJ96k42M62k87J89O9m68K20rp9j0
5276d5J50j73J06MNJ20j52j87R5K89l29N2Q5j17OJ11N9M8l04L20q6mQ4N9j01m39
5302c44K69k5K11P4k50K52k68J09k54L69L6k54k16K99M7J54k74o5J83k03K44j9
5324G5j39K67o1k14J27k27L92J06l34J05J40n23K03K37j15q6R5j25O9n3l5K44
5346A48j52J22k65mL90l26j52M17r0K7m6l56O26k05j06q2K09k2R9l85J64L4j31
$$ plain form
5369 -86 150 -51 82 -101 -88 -93 -26 132 -87 11 5 7 -100 -29 132 103 -81 -94 125 -253 -65 219 -84 -2 -164
5394 -164 -36 -35 38 128 -232 199 29 -58 241 254 -102 111 86 313 104 -149 209 92 123 -199 24 101 273
5417 273 -217 124 170 164 152 62 -280 -492 176 15 -72 107 63 -41 38 -77 107 7 51 383 -151 58 192
5440 192 -99 -24 85 156 81 48 140 -134 -94 89 -148 -149 75 72 -355 -106 -171 10 -34 16 75 -45 -257 -296 -144
5465 -144 -163 7 -165 105 -165 80 126 -245 -316 -137 -36 86 47 -201 -20 78 -144 -56 -56 -59 202 131 -121 46
5489 46 61 -41 -7 19 -277 68 15 -72 -79 230 -161 -144 106 -389 -88 -194 139 55 -65 -185 29 109 -307 36
5513 36 178 -143 265 154 68 -60 58 137 -255 198 41 174 -169 -14 -62 -102 25 -131 -178 -170 -79 -257 62
5536 62 36 206 24 -199 -197 -120 172 133 -125 -82 367 -188 -95 56 98 -146 -214 1 41 146 -47 14 -33 -56 201
$$ packed form
5369h6K36k01J33j83J3nO7J58k19R8oKj07P1J61k9j84j3K19l78J88K84l03Q2j62
5394a64J28JP3R0l60M31j70q7K99J3l56K13k5K27k09k53L58j17L1l22K23P7J72
5417B73m90L41M6oj2r0l42k12O68j61q7J79m4j04P9j15J84j00M4L32n34K09J34
5440A92k91P5J09P1p5l3R2k74M0J83k37jK24lm27K49o5J81m4N0N9j20k12l9J52
5465a44j9J70j72K70k70K45M6l71p1J79J01J22l9k48J81R8k22Q8%lK61p1k52J67
5489D6J5j02L4K6k96L45n3q7pL09l91J7K50m95L01j06L33q4j20j20K14Q0m16L43
5513C6J42l21M08j11q6j28J18P9l92M53j57J33l43J55m8m0J27j56m7QR1j78L19
5536F2k6J70j82k23KP7K92l9k58M3M49n55R3J51M2k44o8K15M0J05j93O1m7k3K57
$$ plain form
5561 201 -136 39 85 19 99 62 5 189 103 57 -215 30 -130 70 -149 -138 174 27 -59 268 -60 -71 235
5584 235 118 -315 129 -219 -41 -90 -31 -47 -208 -78 -129 56 -2 40 -163 237 190 162 -92 74 -36 -42 -41 41
5608 41 -47 -4 -201 45 76 213 -83 119 185 165 136 -31 158 -26 46 230 3 182 19 -50 -126 -171 61 105
5632 105 -50 241 68 28 -238 -106 -13 -61 52 -200 -301 85 -16 -79 -214 126 -131 129 0 213 140 79
5654 79 26 3 99 106 -87 -136 -243 109 274 -52 69 180 -23 11 -51 -53 119 -184 260 132 -64 93 -287 -179
5678 -179 -45 -139 -249 -254 -115 95 37 -396 -78 65 162 0 42 307 191 63 -217 101 156 -117 230 -60
5700 -60 160 -138 -145 -142 -1 25 -171 -80 171 -118 6 -25 -276 -22 -28 -3 31 73 -153 -140 133 -52 126 -143 -16
5725 -16 -131 -115 72 97 -156 1 -146 269 31 123 221 117 118 69 192 -157 178 65 81 -4 -249 -25 16 -68
$$ packed form
5561B01l37J75M6o6Q0l7n7J84q6m6k72K45j60K00k19J1L12j47q6L27l28j1L06
5584B35j17m33M44l48J78m9N9j6j61J30n1J85n8M2k03M00m7k8k54J66j10oJQ2
5608D1q8M3j97K46L1J37k96K02O6k0k9j67J89j84P2J84k27J79j63o9p6m5K32M4
5632A05j55K91j73m0k66J32R3m8J13k52j01L86j01o3j35L40k57K60j29K13p3o1
5654G9n3k3R6Pj93m9j07L52J65l26J21J11k03L4o2kJ72l03M44j28j96J57l80J08
5678a79J34r4j10nJ39K10n8m33L18J43R7j62M2K65j16j28k80L18N5k73L47k90
5700f0K20k98pLJ41K6j96R1K51k89J24l1k51K54oK5L4M2k26J3K73j85J78k69J27
5725a6j15J6J87K5k53J57j47M15k38R2R8j04Jm9J23l49L35j13J6q5k45K24M1q4
$$ plain form
5749 -68 49 -185 -438 175 115 88 -225 -3 101 9 -198 178 -27 -223 -34 230 -146 -50 127 24 6 137
5771 137 55 297 198 85 180 -47 -5 -133 -19 53 -238 55 198 -209 193 -114 -142 -366 -43 86 -197 69
5793 69 -23 -8 29 3 234 -183 -53 -176 -269 26 -49 13 108 -160 -96 -187 -164 -116 71 98 137 127 50 178 -170 -163
5819 -163 -34 54 291 81 -201 238 -17 -13 -141 63 -87 10 -108 181 -188 91 -214 -97 302 -45 72
5840 72 -66 192 202 -48 189 172 -193 -109 -437 30 -67 -7 -86 -18 -49 -78 100 -40 -131 -133 162 9 177 -146
5864 -146 284 -48 122 -137 55 -42 65 -42 76 -47 -318 -47 -46 70 -193 -189 38 -261 -43 -116 135 -123
5886 -123 -7 118 -122 174 -50 -104 36 -136 -63 58 -4 98 -98 -89 -136 -150 -16 137 205 95 252 -203 163
5909 163 -96 53 -35 3 -133 25 -106 -157 89 -261 -7 -2 70 -162 -134 166 103 -91 -158 134 -264 -68 -150
$$ packed form
5749f8J17k34k53O13o0k7l13K22J04r2k07L76k05j96J89K64l76R6J77j03j8J31
5771A37q2K42r9j13R5k27M2j28J14P2k91K93J43m07M02l07k8k24L23J29k83K66
5793F9r2J5L7k6K31m17J30j23r3K95p5O2R5k68O4r1K3M8J87K7L9j0p7J28l48P
5819a63J29Q8K37k10k82M39k55Mj28K04j50R7j18K89l69K79l05J17L99l47J17
5840G2j38K58J0k50K37j7l65Q4l28M67r7O0p9O8l1k9J78j40r1kK95j53J68l23
5864a46M30l32J70k59J92r7J07j07J18j23k71K71JJ16k63MK27k99K18p3K51k58
5886a23J16J25k40K96k24n4J40j72P3J21o2J02j96Rm7j4J34J53O8j10J57m55L66
5909A63k59J49q8L8j36J58j31n1K46l50K54NP2k32K8L00o3j94o7K92l98J96q2
$$ plain form
5932 -150 91 184 -61 -71 24 -141 -165 -139 -140 -28 -134 82 -145 201 -199 -123 154 185 -167 -112 78 -128 -262
5955 -262 109 -119 -179 209 17 -62 9 46 -162 -94 163 -1 128 44 -207 0 -154 -153 -146 -111 -349 32 43 30
5979 30 -81 -196 17 -392 84 -211 9 34 -185 78 -184 -98 3 -16 -358 8 90 21 49 202 -144 151
6001 151 36 -41 13 -29 55 91 -116 145 -98 -110 235 -38 94 -63 -54 -1 -67 -137 -226 304 20 187 234 103
6025 103 -71 -38 98 -69 131 -211 133 135 -166 21 201 44 -33 47 -28 -57 107 202 -146 14 31 29 183 194
6049 194 -13 182 14 -41 -8 -250 -33 77 -29 -148 -85 -107 222 340 35 317 34 -25 -355 166 -7 44
6071 44 -82 189 -196 195 -23 -277 189 25 -213 204 -48 -39 170 -89 -21 -174 84 102 54 -78 10 -25 165
6094 165 51 -130 -61 -23 -40 65 -27 -30 -6 -170 177 63 225 -180 -121 216 144 -78 46 -122 -72 -123 -283 40
$$ packed form
5932a50K41R3k45j0R5j65k4K6jJ12j06K16k27L46m00P6K77L1l52N5J90k06j34
5955b62L71k28o0L88j92p9P1L7k08O8K57j64J29q4k51K07j54JPL5k38L81J1j3
5979C0j11j15K13m09M76k95K20K5k19K63k62Q6J01j9l42L66Q2o9K8J53l46K95
6001A51j15p7N4m2Q4L6k07K61k43j2L45k73J32j57RN3o6p0q9N30k84J67M7j31
6025A03j74L3J36j67K00l42L44Kl01J87J80j57p7Q0p5k9J64R5l48J60J7kJ54J1
6049A94k07J95j68n5L3k42K17J10j06j19O3k2L29J18l05K82k83n9l30N21j73N1
6071D4j26K71l85L91k18k54M66j64k38M17k52RK09k59O8j53K58J8m8j32Q8l5J90
6094A65j14j81O9L8j7J05r2lK4j64L47j14J62m05N9L37p2k22J24j68N0n1j60L23
$$ plain form
6118 40 237 91 -254 137 137 -78 -172 -96 -33 -105 -39 116 -18 -36 -1 72 -140 110 338 -120 398 -132 139 47
6142 47 77 14 184 143 169 -41 -86 158 132 119 -293 -62 -79 244 -163 168 237 120 -135 6 315 -210 40
6165 40 57 -148 -74 -59 138 39 104 -75 -81 63 205 -18 -340 -26 47 -24 99 89 -3 132 56 142 -112 -47 205
6190 205 37 -61 26 211 -40 198 115 243 -45 69 -66 124 206 153 -52 36 144 363 231 185 -47 -327
6212 -327 88 15 -96 -32 -177 -55 -231 -115 -85 222 133 115 243 0 221 -22 111 -10 92 -235 32 39
6234 39 109 -200 -177 34 109 -160 -61 -194 69 -112 -77 182 81 -13 -76 95 49 -132 -83 -9 74 -30 -89 -51 -234
6259 -234 -6 -13 -89 271 127 245 -12 28 -22 68 -48 -24 -132 69 -107 1 38 -12 -269 -11 115 -300 190
6282 190 -2 227 277 -92 -104 96 81 -169 156 208 183 -187 -150 -150 -122 -151 -28 -38 87 145 -56 36 -180 124
$$ packed form
6118D0J97j46l45L91%k15r4P6O3p2O6J55j34j8L5P3k12K50K28m58N18n30K71r2
6142D7L0o3J70m1K6k10m5K44k6j3m12K31j7L23m07L31O9j17k55J41L09n25K50
6165D0J7k05P4J5J97r9O5j79oJ44J42k23l22L14P3p1J23j0r2J35p6Q6k54O5K52
6190B05j68r8Q7J85k51K38q3J28k88J14j35J90Q2n3k05Q8J08K19j32m6k32k80
6212c27M15p3j11O4j45J22j76J16L0L07q9j8J28k43K21k43J33j21J02l27K67P
6234C9P0l09K3K11P5k69R9j33K63j81L5K59j01r4o3J71m6j81M9P4Q3j04n9L8j83
6259b34K28pp6L60j44J18k57M0n0R0j16K4j08K01j76J08L7n0k57K58J26m15M90
6282A90j92K29N0l69j2K00j5k50L25N2k5l70L7%K8k9J23j0J25N8k01R2k16L04
$$ plain form
6306 124 -90 109 41 116 123 62 -3 -227 -170 -63 -208 -98 102 179 -27 128 -19 77 100 -155 -135 -27 -121 211
6330 211 -184 -100 -42 355 110 -135 51 9 144 148 27 -286 144 71 -23 -36 -56 -99 25 50 154 62 281 -99
6354 -99 188 -89 75 238 -136 -3 92 43 145 -37 -351 -50 -97 -113 -370 78 19 -43 7 6 -52 148 233 -64
6378 -64 -161 -168 -73 -39 -84 192 -67 139 24 -36 50 -73 -7 -16 -17 83 -106 -74 -150 48 161 -14 40 -32 16 -128
6404 -128 -21 25 222 -128 138 99 22 -454 176 -170 -120 74 -138 323 -26 68 53 -111 202 -108 -10 121
6426 121 228 -70 245 115 -6 -82 -26 16 -92 -311 120 -220 129 194 -16 -26 -70 -138 99 -47 14 184 -115
6449 -115 -102 227 -8 92 266 132 -54 -123 249 -141 -181 125 -12 137 218 122 -165 -8 281 106 -72 -16
6471 -16 -239 -138 -35 -26 -187 -48 -133 -89 -7 18 -37 93 189 -109 68 -45 -63 3 156 44 252 -96 -321 -216
$$ packed form
6306A24k14J99o8P5Po1o5k24N7J07j45J10K00P7k06J55j47R6K3k55K0J08r4L32
6330B11l95Q4N8L97k45k45J86m2J35Mj21l13M30p3r4j3k0m3J24K5J04r2K19l80
6354i9K87k77J64J63l74J33R5m9J02j82l14L01m7j6k57M48n9o2N0jn8K00Q5k97
6378f4r7pR5L4m5K76k59K06j15o0Q6j23O6rjJ00j89L2p6J98J13j75N4p2M8j44
6404a28J07M6J97l50K66l9p7m76O30l46N0J94k12M61l49R4j5j64L13l10R8J31
6426A21J07k98L15j30j21p6N6M2j08k19M31l40L49O5k10j0m4o8K37j46O1J70k99
6449a15J3L29k35J00J74j34j86o9L72l90m0L06j37J49Q1r6k87J57K89j75j78N6
6471a6k23J01J03Rj61J39q5M4Q2K5n5J30R6k98J77j13j8O6J53j12K08l48k25J05
$$ plain form
6495 -216 131 16 82 83 124 46 -126 -133 189 -160 -237 -25 72 39 -168 -281 298 -26 5 259 -21 157 59 185
6519 185 0 -3 35 -105 3 363 175 -62 24 -3 172 108 -137 -30 -234 189 -48 186 135 39 -192 247 89
6542 89 -250 20 39 50 160 -50 -75 12 176 -193 21 102 386 -442 61 172 -55 261 107 -92 32 126
6564 126 97 50 150 -216 -62 -91 38 -49 262 72 -159 -42 102 -133 69 -124 -53 -12 -260 52 -102 -272
6586 -272 -89 119 -19 25 -133 -38 81 -34 -122 -11 16 178 -129 -10 170 8 -270 182 67 196 -119
6607 -119 201 107 52 62 18 10 68 167 -69 -49 -26 5 -135 71 166 -110 306 -213 115 8 -4 18 234 137 -95
6632 -95 21 -262 -71 -109 47 109 41 -152 161 151 -106 70 31 -97 119 206 -220 -36 131 -260 -117 -204 7
6655 7 -164 60 139 106 211 -34 138 26 -90 -144 -35 -15 149 138 257 13 76 73 150 -64 31 224 -201 23
$$ packed form
6495b16L47j15O6JM1p8j72pL22l49p7K12R7l3k07j13N79l24L1K54k80J78r8J26
6519A85j85lL8j40J08L60j88k37Q6k7J75o4k45J07k04M23k37K34n1r6k31M39j58
6542H9l39K70J9J1J10k10k5Q7J64l69K14Q1K84q28N03J11k27L16j54j99J24R4
6564A26k9m7J00l66J54k9J29q7L11j90k31J17J44k35K02j93P1M1k48L12j54j70
6586b72J83K08j38M4j58R5J19j15q8J11K7J62l07J19J80j62k78M52j15J29l15
6607a19L20r4n5J0m4qN8R9k36K0K3L1j40K06R5k76M16n19L28j07j2K2K16r7k32
6632i5J16k83J91l8J56O2o8j93L13j0k57J76l9j28K16Q7m26J84J67l91J43q7K11
6655Gj71K24P9l3J05k45J72j12j16n4J09K0J64j1J19k44O3lP7k14R5J93m25K24
$$ plain form
6679 23 -51 -171 -54 -115 -226 -423 162 3 -38 33 161 268 -146 -42 -180 129 107 -193 131 8 -113 -110 -55
6702 -55 86 -161 -25 -281 251 134 -122 -20 214 -86 28 126 -22 59 -581 -38 -71 -273 -199 144 202 240
6724 240 -194 -65 -8 -74 63 -58 94 87 58 76 -56 -188 -22 92 98 5 0 -173 -172 31 20 21 -217 -274 133 110
6750 110 42 -63 -152 296 93 -107 -142 -2 -155 -37 -207 -131 257 -45 34 -360 34 25 272 85 -156 25
6772 25 4 -24 120 -52 -77 133 162 -152 -41 -143 32 -278 29 150 -40 -56 -144 31 -83 -178 20 52 48 -124
6796 -124 1 -110 -106 -115 6 -217 158 -134 141 110 94 -113 68 -118 130 -21 5 131 -165 79 -57 5 -121
6819 -121 -94 -164 -113 -296 -133 163 7 -66 -139 1 -178 0 179 -273 101 -119 -71 -19 -104 69 177 39 -110
6842 -110 -197 70 -42 -38 59 -109 -21 2 37 -15 -18 -108 6 -130 -159 -98 94 -68 -195 77 -220 -53 177 72
$$ packed form
6679B3p4j20J17o1j11j97N85j59m1P1J28J07m14J04j38L09k2l00L24j23j21LN5
6702e5J41k47J36k56N32j17k56J02K34l00J14R8j48Q1o40N43l3k02P4L43N8L8
6724B40m34J29N7o6J37j21J52pk9J8j32j32J66J14Or3nj73JK03j1Jk38n7M07k3
6750A10o8j05q9M48k03k00l5J40j53J18j70P6L88l02P9l94L94rK47j87k41J81
6772B5k1k8J44j72k5K10K9l14J11j02J75l10L07J21j90j6q8J75j14r5J98L2mj72
6796a24J25j11MrJ21k23L75k92K75l1j6k07J81j86K48j51K6J26k96K44j36O2j26
6819a21K7p0N1j83J63K96j56p3p3J40j79J78J79m52L74k20M8N2q5J73J08j38j49
6842a10q7K67j12MR7j68Q8K3L5n2lr0J14j36k9O1J92j62j27K72k97J67K30j05
$$ plain form
6866 72 -82 113 82 -93 157 -81 164 -186 57 -4 148 -72 64 -121 -41 -120 -82 129 178 61 -123 36
6888 36 -104 -159 77 -202 1 -136 120 8 184 -117 -90 78 -167 53 27 64 -94 24 32 -128 -44 11 266
6911 266 22 72 -22 97 -282 255 -158 2 111 63 -35 240 252 -131 133 -16 63 32 37 -105 -46 162 -26
6934 -26 41 -30 131 34 -38 -74 69 58 -19 -178 -139 -148 -3 -20 -263 -249 -243 92 -88 141 223 -163 72 -235 160
6959 160 -113 107 -177 -248 -21 -244 -2 -65 -126 -93 109 138 -143 82 -46 351 81 -322 -63 64 -22 84
6981 84 99 237 225 -255 208 -132 107 -306 97 217 -227 -68 -165 179 161 -19 -83 2 -23 -154 51 -112 260
7004 260 127 -33 64 60 -30 -246 2 74 -49 -192 54 -374 -286 241 -11 -7 -15 -118 -115 -190 46 -137 -165 69 -103
7029 -103 -7 55 -64 -78 18 45 9 6 -22 0 106 93 79 93 -206 -153 -61 -179 197 233 -215 -133 -175 9 96 121 50
$$ packed form
6866G2j54J95l1j75K50k38K45l50K43o1J52k20J36j85Q0p9L8K11M9j17j84J59
6888C6j40n5K36k79K03j37K56j12J76l01K7J68k45K20k6L7j58J18Qj60Q4N5K55
6911B66k44N0r4J19l79N37m13J60J09m8r8K75J2l83K64j49P9l1Nj42N9K08j88
6934b6O7p1J61r7p2l6J43j1p7j59L9rJ45j7k43J4OL35j80K29Q2l86K35l07L95
6959A60k73K20k84p1K27k23K42o3o1L3K02K9k81K25j28L97k70m03K59J27q6J06
6981H4J5J38j2m80M63l40K39m13M03J20m44J59r7L44j8j80o4Q5k5j31K05j63L72
7004B60j33j60R7mr0k16K48P2j23j43K46m28Q8N27k52Mqj03Lp5K36j83k8K34j72
7029a03R6O2j19j4R6K7l6lk8K2J06j3j4J4k99N3R2j18L76L6m48Q2m2J84Q7K5p1
$$ plain form
7056 50 59 -113 -19 78 -164 79 -109 42 37 138 132 -11 -202 -253 -284 1 1 -169 69 -100 -196 -140 -45 -40 -188 94
7082 94 -31 -93 -198 -286 -29 326 -48 56 -166 36 134 61 -13 -4 61 14 -93 -123 -92 -87 -286 59 -51 -177 186
7107 186 -142 304 -11 -1 -175 81 -94 -19 149 -198 -175 -46 -34 67 121 52 -120 -237 -153 -262 353 -77
7129 -77 -60 224 20 -338 -153 -394 -46 113 -190 89 -113 44 -67 28 -114 -285 -189 -172 3 188 35 -4
7151 -4 104 -18 296 51 207 -98 99 8 -207 113 329 45 -23 41 8 -217 -58 129 169 -55 -213 -65
7173 -65 -29 54 -53 -154 -210 111 20 -152 -47 207 9 -180 127 -14 -229 140 65 -37 176 -153 153 139
7195 139 -93 -72 69 61 -271 250 -87 34 -65 -119 139 81 111 -57 -271 -175 -61 80 -183 -97 4 -260 -120
7218 -120 49 -87 297 271 -65 92 5 -245 -73 318 36 -294 32 282 -139 216 207 -42 148 -320 37
$$ packed form
7056E0Rj72R4R7k42K43j88J51nJ01oj43j91n1l1K85%j70K38j69r6N6R5Nj48K82
7082I4j25o2j05q8K57L55l74J04k22K02R8p3p4RO5m7j07l0L1Nj99L45j10j26L63
7107A86l28M46l15J0j74K56j75P5J68l47K3J29J2J01N4o9j72j17Q4j09O15m30
7129g7J7K84k04l58J85k41L48J59l03K79k02J57j11R5j42j71R6J7J75J85j53l9
7151dJ08j22L14k45J56l05J97r1k15L20K16k84o8O4l3k25J59J87M0k24j58J48
7173f5L6Q3j07j01n6L21r1j72J05K54j98j89L07j41k15L69p5j02K13l29L06j4
7195A39k32K1J41ql32N21l37J21r9n4K58n8L0j68k14R6J14J41k63Q6J01k64J40
7218a20J69j36L84k6l36J57q7k50J72L91k82l30L26K50m21L55rk49J90m68L57
$$ plain form
7239 37 -25 -60 68 186 -77 -126 -32 215 -26 -84 -166 -46 96 -73 -232 -116 35 18 149 -216 -245 -179 44
7262 44 63 201 -385 102 -104 60 134 136 -25 -182 22 -75 35 25 37 -98 163 -107 285 4 74 124 -107
7285 -107 126 -17 192 -38 8 -249 -71 176 -213 166 -88 49 -112 -137 219 7 12 -180 157 100 -238 27
7307 27 -140 -321 -113 187 130 266 -199 -71 -53 -274 284 -145 -61 -91 -189 -44 -209 74 95 85 -134 61 298
7330 298 -122 -35 106 102 2 97 445 -76 -61 -132 -4 -18 187 -182 -54 88 -233 -147 -104 40 -168 -183 -139 124
7354 124 -121 -125 31 -173 0 -79 -54 115 20 45 -191 -47 -229 -127 -208 -12 -14 46 -106 -212 -143 -65 -32 -24 148
7379 148 151 -19 -108 -2 143 160 -113 16 -191 212 36 10 195 -125 -40 -41 -23 -85 -123 57 66 47 -88 16 -198
7404 -198 -11 -95 -119 -74 -25 159 -132 -23 195 132 -36 56 -152 23 137 -61 29 -43 -30 166 -174 -53 -47 25
$$ packed form
7239C7o2l5J28J18k63m9R4K47k41n8q2J20J42j69j59J16J51j7J31l65k9O6K23
7262D4J9J38n86M87k06J64P4Kj61j57K04r7J10j0J2j35K61k70L92k81P0N0k31
7285a07K33j43K09k30M6k57J78K47l89L79k54J37j61k5L56k12Nj92L37n7l38K65
7307B7j67j81K08L00n7J36m65J28J8k21N58m29Q4l0r8J45j65K83K1j0k19J95K37
7330B98m20Q7J41mj00R5L48n21J5p1J28j4K05l69J28J42l21Q6M3J44k08j5M4K63
7354A24k45mJ56k04J73p9K5J69r5K5k36J44j82J02q1J96kO0j52j06O9P8L3QJ72
7379A48Lj70q9J06J45J7k73J29k07M03j76k6J85l20Q5jJ8o2l8J80Rj9j35J04k14
7404a98J87q4k4M5M9J84k91J09K18o3j68R2k08J75J14j98R0p2J3J96l40J21OP2
$$ plain form
7428 25 33 104 39 -107 187 -215 -12 -89 -126 -113 -150 42 -98 148 115 70 138 -364 -162 24 -193 -70 21 -209
7452 -209 -126 84 -55 -55 13 145 -240 -388 38 140 163 -130 -107 302 83 -68 71 137 -290 -113 -104 269 93
7475 93 -259 -145 94 -9 -142 -223 145 -78 73 77 32 133 -168 -70 -90 -293 92 -10 -215 -89 58 79 235
7498 235 -155 -274 215 -18 212 48 -187 -179 38 -30 230 168 -16 -34 73 7 32 166 113 -128 -234 236 -82
7521 -82 -118 41 111 -46 254 37 -89 70 19 -170 38 -93 -153 62 -15 -32 -243 -94 252 -44 -125 -125 104
7544 104 -40 25 187 76 69 -122 101 -20 -168 33 16 75 -231 23 4 -62 -48 41 -112 -14 35 42 97 65 106
7569 106 47 205 -192 -47 -106 11 69 -116 -101 -28 -187 57 -17 204 -95 -63 -5 -34 -14 0 -37 -58 274 -66
7593 -66 64 -176 -64 -261 -175 155 124 116 122 5 -85 -79 7 -181 43 -153 -4 -82 243 -102 -180 -17 64 175 -18
$$ packed form
7428B5QP1o5j46K94m02K03p7l7J3l7J92j40K46l3m5O8n02K02J86k17J23R1k30
7452b09Q3K10j39%O8J32l85j48M26J02K3k93K3M09k19j51J39O6m27J77RL73j76
7475I3l52J14K39j03j33q1L68k23J51Mm5J01l01R8k0k03L85j02k05J26J47K1J56
7498B35l90j19M89k33K30j64k35QK17o8K60o2j84j8J07o6K5J34n3k41j06M70l18
7521h2l6J59P0j57L00k17j26J59n1j89K08j31o0K15p7j7k11J49L46k96q1%K29
7544A04j44O5J62j11pj91K23j21j48K01j7N9l06K54j9o6J4Q9j53R8M9PN5l2M1
7569A06n9J58l97J45n9J17N8j85J5P3j59K44p4K21k99L2N8k9K0J4l7k1L32l40
7593f6J30k40J12j97Q6L30l1qOj17r0OQ6j88K24j96J49p8L25l45p8J63Q1J11j93
$$ plain form
7618 -18 158 196 72 92 -99 121 110 -188 7 -391 184 -183 32 53 267 77 -54 166 85 72 223 111
7640 111 -38 35 126 28 55 -128 -133 -4 -161 38 254 237 -15 14 -227 -172 162 27 -147 -42 -39 107 -38 125
7664 125 -152 146 69 151 -80 117 185 123 110 300 -11 -75 -280 -120 -130 13 41 83 -245 123 234 -87 205
7687 205 -118 -47 120 -151 194 -98 -99 -64 -126 -34 -44 85 -289 39 225 269 13 -151 -154 -135 -92 -215 192 102
7711 102 113 14 37 277 -86 -17 -191 -227 -95 71 145 -62 -155 30 101 137 -163 108 -246 -66 -97 -115 74 -38
7735 -38 -76 93 -34 -80 -12 127 -15 67 -44 -149 -140 29 -17 -105 186 -82 -20 157 39 -114 79 185 83
7758 83 -13 136 -154 -88 -12 111 -15 -44 -352 -41 270 186 -46 194 72 156 90 256 -34 -74 39 121 16
7781 16 -11 -61 -206 -42 117 -98 -306 -161 142 286 -13 110 20 -144 119 -14 44 -115 104 -184 52 -24
$$ packed form
7618a8J76L8j24K0j91K20j1k98J95l98N75l67K15K1K14j90j31K20q1j3J51j12
7640A11j49P3R1r8K7j83nJ29j57J99K16j7k52K9k41N5L34j35j74J05LJ46j45J63
7664A25k77K98p7Q2k31J97O8o2j3J90l11o4k05J60j0J43K8M2l28L68J11l21K92
7687B05l23P1J67k71L45k92jL5o2R2j0J29l74L28J86M4k56j64lJ9M3j23M07r0
7711A02J1r9K3K40l63O9j74l6J32J66P4k07r3J85P1L6l00K71l54J80l1j8J89j12
7735c8l8J69j27m6O8J39j42Q2j11j05RJ69m6q8K91k68O2J77j18j53J93J06j02
7758H3r6J49k90O6P6J23j26k9l08L11L11q4k32K40j22Q4o6J66k90m0J13Q2j05
7781A6k7n0j45J64J59k15k08J45L03J44k99J23r0j64K63j33N8j59K19k88K36p6
$$ plain form
7803 -24 -241 -282 195 43 240 -44 105 235 -109 -64 166 146 -80 -99 -172 81 45 -11 -181 -59 3 219 -172
7826 -172 52 -2 -89 24 -273 272 -51 -131 48 20 -114 19 110 -10 -35 -4 140 -11 -5 159 -60 -65 -47 33
7850 33 -65 130 -99 59 54 -105 -113 -170 272 -55 -101 47 -103 124 -104 -131 -387 -152 -29 -227 20 -243 210
7873 210 -44 -204 -198 -183 -29 -97 -96 -32 141 -32 -14 -104 112 -256 34 -31 24 208 -131 -22 -47 46 -18 21 121
7898 121 115 -29 -95 18 65 203 -17 28 9 113 -218 -16 -473 23 57 -71 -60 73 26 97 -234 -275 -41 -46
7922 -46 184 -138 -3 45 -57 -89 113 118 -22 -234 -71 112 137 -242 -429 -94 22 -292 15 118 27 -46 124
7945 124 -94 324 -240 -63 78 -131 -82 -304 98 -184 -177 114 -88 -13 -34 -235 59 104 -251 -77 224 6
7967 6 -376 89 -37 -29 -49 -213 35 -241 -174 -38 135 -82 90 -230 -170 -146 50 23 -46 90 302 -11 -310
$$ packed form
7803b4k17m1M77j52J97k84J49J30l44M5K30k0k26j9p3K53l6n6j70J22O2K16l91
7826a72K24n4q7J13k97N45l23q0J79k8j34J33R1j20k5L1J44j51OJ64k19nJ8Q0
7850C3r8J95k29J58nj59qn7M42l27m6J48j50K27k28k7k56K35J23j98K47k63M53
7873B10k54j60OJ5J54o8JO4J73j73J8r0K16l68K90o5N5J84l39J09k5R3o4L9J00
7898A21oj44o6J13M7J38k20M5j9J04l31K02m57M96L4j28J1J33m7P1l31m1K34n
7922d6K30l22J35M8j02l2K02Nj40k12J63J83K5l79j87L35J16l14L07J03r1p3J70
7945A24k18M18n64J77J41k09M9k22M02k82PK91k02P5k1k01K94M5l55J74L01k18
7967Fl82M65j26Qk0j64K48k76O7J36J73k17J72l20O0K4J96k7o9J36K12l13k99
$$ plain form
7990 -310 -34 290 73 38 -100 25 11 -177 -68 4 -44 36 -21 -70 134 11 -168 -228 -109 0 -9 -11 19 130
8014 130 9 -60 -236 344 -212 94 125 131 21 -6 24 -8 48 -32 -65 171 -342 31 -39 -69 -128 -177 -181 -132 149 129
8040 129 -102 26 252 174 159 59 -12 134 -3 312 79 2 46 -119 55 -164 202 231 -77 116 -11 34
8062 34 94 72 74 75 -180 78 -88 70 57 -161 -20 14 -239 -52 -80 127 0 -102 10 197 61 55 -26 59 -43
8087 -43 -53 -37 77 96 57 -161 99 100 32 162 38 151 -211 211 12 9 -73 -44 97 -224 388 17 49 53 -116
8112 -116 -51 151 -108 -128 -117 -26 -80 65 233 -49 44 -258 112 -23 -25 -191 7 44 -380 -145 74 -73 -31
8135 -31 -33 -84 158 -213 -84 -137 -32 -55 -162 104 -63 -40 -129 -10 -33 -4 -85 -170 -265 12 -41 -63 234 -76 -12
8160 -12 -157 41 29 -69 -138 -68 -66 -89 41 -121 -83 -479 -142 -91 113 -142 -109 87 191 -116 179 20 -69 -73 67
$$ packed form
7990c10K76L24k17l5j38J25j4j88J09P2m8Q0n7m9K04j23j79o0J19J09rkL0J11
8014A30j21o9j76N80n56L06L1Oj10k7L0l2N6q0l3K36n13L73p0l0n9m9mM9K81k0
8040A29k31J28K26p8j5j00p1J46j37L15k33p7M4j65J74k19L66K9l08J93j27M5
8062C4O0k2KJk55K58j66J58j3k18J41L4k53J87k8K07j27j02J12J87j36oq1Q5j02
8087d3j0J6J14J9l9k18K60Jo8J30j24J13l62M22j99lq2K9J41l21O12l71L2Mj69
8112a16O5K02k59k0J1R1n4J45J68k82R3l02L70j35kj66J98L7m24K35K19j47M2
8135c1kn1K42l71J29n3J05k3j07K66j67K3q9J19k3K9q1q5r5K77n3k2K97l10O4
8160a2j45J98j2r8o9P0Kk3J30j62L8l96L37N1K04k55L3J96J04l07K95j59q9mJ40
$$ plain form
8185 67 -17 -195 34 126 198 7
$$ packed form
8185F7q4j78K29R2P2j91
8191G
$$ Imaginary data points
##PAGE= N=2
##DATA TABLE= (X++(I..I)), XYDATA
$$ plain form
0 0 0 0 0 0 0 0 0 0 0 0 -8 8 -8 8 -8 16 -16 24 -24 32 -40 48 -56 64 -80 91 -105 123 -144 163 -187 216 -243
33 -243 275 -312 351 -394 442 -491 549 -611 683 -756 836 -925 1021 -1128 1244 -1372 1510
50 1510 -1663 1833 -2020 2229 -2462 2724 -3022 3367 -3764 4234 -4793 5479 -6341 7459 -8979
65 -8979 11169 -14625 20918 -36192 157187 127378 -74482 -48010 -189866 65610 180952
76 180952 -20299 -25708 -45356 -137745 97158 100896 -66987 -5378 -48849 -79949 110470 29247
88 29247 -63775 33504 -36405 -31467 96055 -10343 -14802 52988 -71818 -35799 67747 -17549
100 -17549 19990 34234 -77797 -2790 40548 -32222 41587 13432 -87555 5730 30520 -6501
112 -6501 46977 -28097 -72379 38485 21832 -2263 42826 -36575 -44579 37599 1091 11194
$$ packed form
0@%%%%%%%%%%qJ6j6J6j6K4l2M0m8N6p2Q8j04J20j44J71j96K28k67L07l50M03m59
33b43N18n87O63p45Q36r33J040j160J294j439J592j761J946k149K372k616K882
50A510l173L496l853M249m691N186n746O389p131P998r027J0272j1820J3800j6438
65h979K0148k5794L5543n7110J93379k9809k01860K6472j41856K55476J15342
76A80952k01251n409j9648r2389K34903L738j67883O1609m3471l1100J90419q1223
88B9247r3022R7279o9909M938J27522j06398m459O7790j24806L6019J03546q5296
100a7549L7539J4244j12031P5007M3338p2770P3809k8155j00987R3285K4790l7021
112f501N3478p5074m4282J10864j6653k4095M5089p9401q004Q2178l6508J0103
$$ plain form
124 11194 36584 -46749 -21648 35130 -12753 10368 18938 -40022 5661 20692 -26930 16465
136 16465 13078 -31609 13214 8495 -14246 30756 164 -28973 16685 -4864 -12281 29593 -5131
149 -5131 -15873 12734 -16696 61 28950 -17774 -12876 12438 -13208 7703 15493 -22059 1501
162 1501 10268 -13342 15470 9829 -21646 3503 1604 -8984 18795 -692 -16017 12873 -1051
175 -1051 -7679 12759 -8183 -7683 11684 -9378 -1975 13398 -11055 -3195 9523 -8256 4306
188 4306 6988 -12903 4327 5910 -11046 7674 5801 -8790 6006 -1051 -6736 11541 -1357
201 -1357 -9522 7250 -2752 -3477 9914 -4919 -4293 6172 -7227 490 9845 -7189 -2207 3497
215 3497 -6475 5175 5249 -8374 3256 3088 -6932 5765 1557 -6642 4901 -1427 -4057 8946
$$ packed form
124A1194K5390q3333K5101N6778m7883K3121Q570n8960M5683J5031m7622M3395
136A6465l387m4687M4823m719k2741M5002l0592k9137M5658k1549p417M1874l4724
149e131j0742K8607k9430J6757K8889m6724M898K5314k5646K0911P790l7552K3560
162A501Q767k3610K8812n641l1475K5149j899j0588K7779j9487j5325K8890j3924
175a051o628K0438k0942N00J9367k1062P403J5373k4453P860J2718j7779J2562
188D306K682j9891J7230J583j6956J8720j873j4591J4796p057n685J8277j2898
201a357q165J6772j0002p25J3391j4833O26J0465j3399P717R355j7034M982N704
215C497r972J1650P4j3623J1630j68j0020J2697m208q199J1543o328k630J3003
$$ plain form
229 8946 -1884 -6174 5164 -2379 -603 7096 -4985 -1815 4004 -6720 609 6825 -4575 466
243 466 1651 -6122 4600 3076 -6488 2830 257 -5428 5481 1495 -3087 4712 -3655 -3671 7993
258 7993 -913 -2784 3476 -4555 -582 5839 -3855 580 3359 -6259 497 4091 -4302 1314 -52
273 -52 -6192 4451 2586 -4265 3246 -782 -4589 4598 172 -1739 4546 -4024 -3260 6398 -394 -250
289 -250 3230 -5111 -447 4203 -3451 1634 2918 -6124 356 2631 -2339 3427 -1007 -5983 3361
304 3361 1369 -2591 4013 -1439 -3590 3391 -829 -250 5339 -3273 -2991 3764 -1483 705 3128 -4541
320 -4541 282 3430 -2704 2230 2755 -5134 111 1105 -2127 3860 -306 -5184 2392 137 -1737 3771
336 3771 -1081 -2515 2350 -2141 -336 4692 -2890 -2176 2443 -1279 2266 3265 -3923 225 1856 -3641
$$ packed form
229H946j0830m290J1338p543J776P699j2081L170N819j0724P329O216j1400N041
243D66J185p773J0722j524r564R318k573n685J0909l986m582P799q367j6J1664
258G993q906j871O260q031L973O421r694M435K779r618O756L594q393N616j366
273e2o140J0643j865o851P511m028l807R187m426j911O285q570P64R658o792J44
289b50L480q341M664M650p654N085J284r042O480K275m970N766m434m976R344
304C361j992l960O604n452k151O981m220N79N589q612K82O755n247K188K423p669
320d541M823L148o134M934N25p889N245R94l232N987m166m878P576k255j874N508
336C771m852j434M865m491J805N028p582P14M619l722L545R99p188M148J631n497
$$ plain form
352 -3641 1907 2576 -2971 1099 -285 -2406 4065 90 -3771 1676 -988 -1808 3138 -798 -1537 2604
368 2604 -2650 -235 4540 -1754 -1308 1143 -2695 1419 2787 -2847 851 1436 -2985 1820 1786 -2420
384 -2420 896 -1240 -2508 3493 -22 -2424 1872 -887 -1511 2693 -1259 -1102 2115 -2960 -764 3227
400 3227 -1548 -121 1128 -2701 1555 1622 -3021 1152 1047 -3204 1386 946 -1263 2329 -1008 -2239
416 -2239 3224 220 -2169 1620 -1540 -1325 2655 -1378 -209 2332 -2972 -888 3024 -1049 295
431 295 754 -2879 1669 1983 -2486 1263 767 -2240 1665 442 -1394 2016 -1326 -2796 2873 171
447 171 -1189 1826 -1199 -334 2604 -1631 -582 1855 -2508 -659 2250 -977 766 264 -3124 1520
463 1520 1838 -1998 1122 33 -2803 1522 438 -490 3014 -1273 -2578 2356 352 -475 1688 -1903
$$ packed form
352c641N548O69n547M070j384k121O471l975l861N447k664q20M946l936p39M141
368B604n254K415M775o294M46K451l838M114J368n634L698N85m421M805l4m206
384b420L316k136j268O001l515k402M296k759o24M204l952J57L217n075K196L991
400C227m775J427J249l829M256O7m643M173j05m251M590m40k209L592l337j231
416b239N463l004k389L789l160K15L980m033J169K541n304K084L912m073J344
431B95M59l633M548L14m469L749m96l007L905j223j836L410l342j470N669k702
447A71j360L015l025Q65K938m235J049K437m363J849K909l227J743n02l388M644
463A520L18l836L120j089k836M325j084r28L504m287j305M934k004q27K163l591
$$ plain form
479 -1903 -1008 2562 -1263 55 2247 -2531 -744 1580 -1008 825 244 -3179 1547 1502 -1220 1492
495 1492 346 -1906 1415 115 -838 2692 -822 -2136 2194 288 -163 1927 -1537 -517 1795 -1724
511 -1724 165 1937 -2197 -973 637 -1163 1495 691 -3087 520 731 -1342 1186 238 -1587 904
527 904 -427 -203 2831 -77 -2139 1258 -425 270 2017 -1457 -703 1351 -1672 41 1885 -1465
543 -1465 -523 -18 -1706 933 554 -2142 723 603 -1035 1552 520 -652 1122 -1261 -643 2490
559 2490 114 -954 872 -694 453 1578 -1218 -270 756 -1922 102 1168 -700 -40 31 -1226
575 -1226 1382 837 -1442 456 170 -853 894 182 -459 1179 -281 -572 2023 -52 -697 502 -443
592 -443 364 1141 -1220 -56 994 -1329 53 833 -528 34 -389 -1660 947 135 -897 606 288
$$ packed form
479a903Q95L570l825J318K192m778J787K324k588J833n81l423M726m5k722K712
495A492j146k252L321j300r53L530l514j314M330j906m51K090l464J020K312l519
511a724J889J772m134J224J610j800K658q04l778L607K11k073K528r48j825K491
527I04j331K24L034k908k062L397j683O95J747l474P54K054l023J713J844l350
543a465R42N05j688K639l79k696K865j20j638K587j032j172J774k383O18L133
559B490k376j068J826j566J147J125k796R48J026k678K024J066j868O60P1j257
575a226K608n45k279J898k86j023J747p12o41J638j460k91K595k075o45J199r45
592d43Q07P77k361J164J050k323J382P80j361N62m23j271K607q12j032J503l18
$$ plain form
609 288 -693 979 -168 -552 818 -658 -686 1508 183 -499 385 -514 580 1166 -998 -226 433 -1071
627 -1071 146 722 -394 460 -25 -851 1093 140 -1161 156 -159 -423 905 -64 -384 1019 -653
644 -653 -544 984 -24 110 337 -1009 21 535 -521 207 1013 -741 64 204 -486 803 -173 -1217
662 -1217 495 677 -361 276 -273 -354 564 -120 -183 461 -662 -788 888 340 272 496 -797 346 652
681 652 -540 17 397 -650 32 404 -389 901 -34 -914 554 -105 -175 407 -403 -254 285 -209 -245 735
701 735 -520 -1000 174 -542 283 315 -568 93 400 -344 195 271 -411 237 212 -635 568 -195 -892 74
721 74 310 205 414 -449 -327 746 -502 -273 549 -445 -313 311 -332 154 416 -421 59 400 -516 270
741 270 324 -203 277 -203 -257 739 424 -751 -80 58 134 399 -531 -300 511 -414 -27 697 -305 -549 -24
$$ packed form
609B88r81J672j147l84J370j476k8K194j325o82Q84q99J094N86k164P72O59j504
627a071J217N76j116Q54m85q26J944r53j301J317l15k64J328r69l20J403j672
644f53J09J528j008J34K27j346J030N14j056P28Q06j754Q05J40o90J289r76j044
662a217J712J82j038O37n49q1R18o84o3O44j123j26J676n48o8K24j293J143L06
681F52j192N57L80j047O82L72p93J290r35q80J468o59p0N82q10J49N39m94l6R80
701G35j255m80J174p16Q25L2q83O61L07p44N39P6o82O48k5q47J203p63o97R66
721G4K36j05K09q63J22J073j248K29Q22r94J32O24o43M86K62q37M80L41r16P86
741B70N4n27M80m80n4R96l15j175O71J38P6K65r30K31Q11r25L87P24j002k44N25
$$ plain form
762 -24 -315 405 370 -631 -128 222 -192 230 247 -255 358 -324 -744 256 323 -377 335 -121 26 498 -327
783 -327 -148 328 -619 -143 188 56 -141 96 -459 405 359 -271 253 209 -480 228 36 128 531 -337 -185
804 -185 547 222 -111 304 -137 15 391 -456 -297 477 -218 -315 326 -293 269 -182 -520 320 -290 175 -80
825 -80 215 -198 587 -35 605 187 -285 134 -323 -83 411 -28 -326 549 634 -20 -291 563 -268 92 -30
846 -30 -529 448 146 -575 224 -76 -188 -116 -41 -134 276 -226 15 262 -223 -224 297 -112 65 60 -482 62 259
869 259 -134 287 248 -299 190 -153 73 171 -205 -482 5 7 -163 46 -39 57 130 -140 101 161 112 -147 -165 117
893 117 365 142 -463 -89 87 -412 -6 306 -209 208 -32 -432 217 22 -370 -64 202 123 67 91 -142
914 -142 251 -292 -330 703 -26 -124 -260 1 231 132 -326 -1 37 -333 -144 342 -225 161 110 -349 -131 129
$$ packed form
762b4k91P20l5j001N03L50m14M22J7n02O13o82m20J000O7p00P12m56J47M72q25
783c27J79M76r47M76L31j32j97K37n55Q64m6o30N24m4o89P08j92R2M03q68J52
804a85P32l25l33M15m41J52L76q47J59P74o95r7O41o19N62m51l38Q40o10M65k55
825h0K95m13P85o22O40m18m72M19m57K40M94m39k98Q75Q5o54k71Q54q31L60j22
846c0m99R77l02p21P99l00j12P2P5r3M10n02K41K47m85jN21m09J77nn42N44J97
869B59l93M21l9n47M89l43K26R8l76k77M87Kj70K09q5R6P3k70K41O0m9k59j8K82
893A17K48k23o05L74J76m99M06L12n15M17k40m00O49j95l92L06K66p9n6K4k33
914a42L93n43l8J033p29r8j36K61K30r9m58L25L8l70J89M86n67L86n1m59K18K60
$$ plain form
936 129 -131 155 -180 191 -449 -41 -560 397 521 -89 216 63 -321 88 -489 466 210 111 359 -95 -244
957 -244 -380 -319 192 610 255 51 196 326 -175 240 -324 144 -89 -191 -237 290 -263 -223 25 104 -123 27
979 27 -104 -120 384 -403 -8 264 -341 168 -138 -192 192 108 -434 77 168 -60 -306 -195 7 -156 -55 -235
1001 -235 135 -197 -56 -181 110 99 21 -400 -107 73 -184 -63 36 -21 218 -44 -96 265 192 -325 58 153
1023 153 -29 32 -19 -156 56 -228 27 70 -196 -150 234 -64 128 -79 -419 75 229 -169 -114 282 -13 114
1045 114 -99 16 320 166 -256 118 157 -119 -125 -302 -96 70 -224 3 129 -313 -15 262 -120 54 162
1066 162 -396 -261 124 -316 327 -38 -208 228 47 100 244 129 9 271 145 44 81 -281 -368 -76 -164
1087 -164 -165 199 -45 -46 10 -82 303 -54 -242 -213 100 -81 9 211 140 -144 -174 -96 263 -348 -20 -90 47 166
$$ packed form
936A29k60K86l35L71o40M08n19R57J24o10L05j53l84M09n77R55k56r9K48m54j49
957b44j36O1N11M18l55k04J45J30n01M15n64M68k33j02m6N27n53M0K48P9k27J50
979B7j31j6N04p87L95K72o05N09l06n4L84q4n42N11R1k28k46J11K02j63J01j80
1001b35L70l32J41j25K91j1p8m21K93J80k57J21R9n7K39k62n2L61p3n17L83R5
1023A53j82O1n1j37K12k84K55M3k66M6L84k98J92k07l40M94J54l98N5L96k95J27
1045A14k13J15L04j54m22L74L9k76oj77K06J66k94K27J26m42K98K77l82J74J08
1066A62n58J35L85m40O43l65j70M36j81N3J44j15j20K62j26j01L7l62q7K92q8
1087a64jL64k44jN6r2L85l57j88K9L13j81R0K02p1k84l0P8L59o11L28p0J37J19
$$ plain form
1111 166 232 -143 64 -5 -262 -211 -75 -9 -29 11 -62 7 44 -256 -303 -202 -58 153 -187 -152 277 -40 -21 57
1135 57 182 -310 -271 88 -162 -7 -277 -91 217 -106 -118 -148 4 184 45 -94 -192 -10 -190 -129 40 35 143
1158 143 149 -40 335 301 -35 81 188 79 20 -73 86 150 -17 -78 34 11 -17 -63 -5 196 -129 -258 274 273
1182 273 -151 -124 -26 -21 101 -63 -31 -86 259 -104 92 130 -337 97 -171 -45 36 -107 176 151 -113 -72 93
1205 93 -21 206 42 -74 -182 161 -140 -26 -39 78 206 -89 -115 118 -126 -166 -36 68 72 200 -61 296
1227 296 40 -67 6 -83 -37 -401 -4 29 -33 -49 83 -42 69 206 77 -232 -207 82 95 -191 286 216 -51
1250 -51 127 104 7 80 -25 36 -19 -22 57 -84 -97 110 104 71 22 28 395 66 266 52 3 103 227 187 -31 -182
1276 -182 44 338 -166 -145 -139 120 7 85 20 226 -26 -178 54 -57 -52 -153 277 35 199 313 -200 -303
$$ packed form
1111A66O6l75K07o9k57N1J36O6k0M0p3O9L7l00m7J01J44K11l40L5M29l17J9P8
1135E7J25m92L9L59k50J55k70J86L08l23j2l0J52J80j39j39r8J82j80O1J69nJ08
1158A43Oj89L75l4l36J16J07j09n9r3J59O4j67o1J12k3k8m6N8K01l25j29N32j
1182B73m24K7R8NJ22j64L2n5L45l63J96L8m67M34k68J26Q1j43K83k5k64M1J65
1205I3j14K27j64j16j08L43l01J14j3J17J28k95k6K33k44m0J30J04MJ28k61L57
1227B96k56j07P3q9M6l64L97L3o2j6J32j25J11J37j29l09K5K89J3k86M77p0k67
1250e1J78k3r7P3j05O1n5lP9j41j3K07ol3m9OL67l29K00k14m9J00J24m0k18j51
1276a82K26K94n04K1OK59j13P8o5K06k52j52K32j11Nj01M30k42J64J14n13j03
$$ plain form
1298 -303 -104 81 -195 -266 -165 -18 -48 259 240 -14 94 23 78 117 -85 -162 -50 -181 -181 -63 175 293 207
1321 207 180 45 86 -179 -292 -290 -39 74 -60 285 -127 -17 120 -284 -9 -20 -11 31 -17 158 -109 -151 -22
1344 -22 -281 -121 -120 -94 20 233 -211 257 22 112 247 193 -61 72 36 -83 93 264 -76 178 194 -217 24
1367 24 -58 16 -83 -265 -76 261 -122 -108 -48 -38 105 -210 -169 -72 63 230 -168 109 177 73 -41 232 -99
1390 -99 298 -9 -120 -92 -106 57 217 -248 -72 -169 -98 4 -77 419 -148 -6 118 298 -355 195 126 77 248
1413 248 94 69 -167 128 -97 201 -25 -148 113 -37 120 12 -124 4 -13 -83 -151 -203 113 144 284 -364
1435 -364 68 35 -151 -115 14 256 -154 163 179 -230 -106 -46 230 -62 97 2 6 91 -29 -48 40 24 -11 160
1459 160 -143 79 -43 117 -221 141 104 -58 102 97 -189 89 5 -259 -163 140 4 -150 -68 -253 27 -65
$$ packed form
1298c03J99J85k76p1J01J47l0L07j9k54J08p1N5L9k02p7J12j31%J18K38J18q6
1321B07k7j35M1k65j13KK51J13j34L45m12J10J37m04K75j1RM2m8J75k67m2J29
1344b2k59J60JK6J14K13m44M68k35R0J35n4k54J33l6j19J76J71l40K54J6m11K41
1367B4q2P4r9j82J89L37l83J4O0J0J43l15M1R7J35J67l98K77O8j04j14K73l31
1390i9L97l07j11K8j4J63J60m65J76r7P1J02q1M96n67J42J24J80o53N50o9m9J71
1413B48j54k5k36K95k25K98k26j23K61j50J57j08j36J28j7p0o8n2L16L1J40o48
1435c64M32l3j86L6J29K42m10L17J6m09J24O0K76k92J59r5MQ5j20j9Q8j6l5J71
1459A60l03K22j22J60l38L62l7j62J60nk86K78q4k64R6L03j36j54Q2j85K80r2
$$ plain form
1481 -65 -157 244 329 323 -22 46 -114 -63 -47 31 186 244 -127 313 -44 -305 -162 19 104 -61 156 -209 -89 -277
1505 -277 -16 -34 -74 12 -23 105 153 -38 -59 70 57 -153 -314 38 31 -252 -90 57 179 11 252 -2 29
1528 29 -7 125 -71 192 82 112 -94 -135 79 165 -203 180 -70 -312 254 -190 78 -113 -108 -138 0 356 51
1551 51 -224 -335 23 94 -355 -12 107 249 130 295 148 37 -7 138 67 10 58 -31 104 119 95 84 -133
1574 -133 247 255 -302 -24 -4 -7 54 23 37 -163 -273 74 -124 -132 -113 -82 -187 -81 105 -47 -183 42 -97 196
1598 196 109 -4 85 -223 -187 16 64 40 -220 -90 -88 -315 10 173 106 -53 -93 222 145 -106 -171 207 225 -48
1622 -48 -263 -124 -168 11 -3 -327 -67 -60 196 221 121 -76 -4 19 38 -26 -90 -84 331 -184 -94 -88 -303 27 -106
1647 -106 169 23 -80 -20 -286 -125 34 -1 -190 39 107 170 -106 -95 93 -51 150 88 -68 -14 -77 135 159
$$ packed form
1481f5r2M01Q5ol45O8j60N1J6P8J55N8l71M40l57k61J43J81Q5j65K17l65J20j88
1505b77K61j8m0Q6l5J28M8j91k1J29j3k10j61L52pk83J62J47J22j68K41k54L1
1528B9l6J32j96K63j10L0k06m1K14Q6l68L83k50k42N66m44K68j91Nl0J38L56l05
1551E1k75j11L58P1m49L43J19J42j19J65j47j11m4J45p1n7M8q9J35J5k4j1k17
1574a33L80Qn57K78K0lO1l1J4k00j10L47j98qJ9L1j05J06J86j52j36K25j39K93
1598A96q7j13Q9l08L6K03M8k4k60J30Kk27L25J63o7j59m0L15p7k51o5L78J8k73
1622d8k15J39m4J79j4l24K60PK56K5j00j97P2K3J9o4o4OM15n15R0Ok15L30j33
1647a06K75j46j03O0k66J61J59l5j89K29O8O3k76J1J88j44K01o2j56N4o3K12K4
$$ plain form
1670 159 152 88 -131 303 122 194 165 -177 -58 172 -187 82 129 198 -38 -76 -73 -75 110 -49 140 65 -96 -46 152
1695 152 106 204 -280 -331 195 77 -10 -169 -53 -53 -11 -26 142 114 -53 202 -25 -394 72 28 138 -139 -90 67
1719 67 -36 -188 5 77 39 -12 12 45 -99 36 159 34 94 37 -42 19 -403 -271 -6 -19 40 57 11 90 -38
1744 -38 -86 153 -28 -205 -215 81 -115 -39 -17 -107 9 -138 56 -232 66 -83 -341 176 370 -39 -104 155
1766 155 -203 -82 3 -142 13 87 -69 -113 122 -161 124 103 136 163 -27 108 -10 208 85 48 15 -231 352
1789 352 -42 -240 -84 -67 100 -47 50 300 -102 237 -74 252 18 115 258 -290 105 -20 -54 194 -56
1810 -56 17 30 177 -172 -3 -49 19 60 102 -34 -39 -44 180 79 15 20 121 -21 320 59 -32 -30 -44 195 -59 -70
1836 -70 25 136 -41 174 118 163 52 321 148 186 44 116 -96 41 -50 31 -74 -139 263 54 -129 -74 187
$$ packed form
1670A59po4k19M34j81P2k9l42J19K30l59K69M7O9k36l8LkJ85j59J89p5j61N0J98
1695A52m6R8m84n1N26j18q7j59J16%M2j5J68k8j67K55k27l69M66m4J10k77M9J57
1719F7j03j52J93P2l8n1K4L3j44J35J23j25O0n7p9O1m22J32K65j3N9J7m6P9j28
1744c8m8K39j81j77j0K96j96P6K2r0J16j47J94k88K98j49k58N17J94m09o5K59
1766A55l58J21Q5j45J55P4j56m4K35k83K85k1L3K7j90J35j18K18j23l7l3k46N83
1789C52l94j98J56J7J67j47R7K50m02L39l11L26k34R7J43n48L95j25l4K48k50
1810e6P3J3J47l49J69m6O8M1M2j36nnK24j01o4NJ01j42L41k61r1Kj4K39k54j1
1836g0R5J11j77K15n6M5j11K69j73L8j42P2k12J37r1Q1j05o5M02k09j83N5K61
$$ plain form
1859 187 -139 103 71 116 -80 -68 43 -206 102 -26 -274 -148 -74 -20 107 -237 277 -184 93 -209 -13 6
1881 6 -88 325 163 -109 -203 -45 -129 -80 -258 185 -28 112 -352 29 196 -79 9 61 67 -131 102 -112 48
1904 48 -186 110 -176 -248 105 -79 166 -80 -50 67 -30 -127 -226 241 140 -149 53 -62 169 49 42 96 29
1927 29 38 76 192 288 -50 -77 74 -196 123 -94 57 -147 43 -231 18 -84 -40 84 -49 -64 -177 57 -107
1950 -107 -34 78 22 -87 -149 -140 12 34 -93 -30 -240 -63 -132 -68 -166 19 -48 -45 -295 138 36 -398 -133 -91 -24
1975 -24 40 -46 -54 -298 -93 126 17 71 167 76 -301 -95 -121 141 -53 2 -239 -154 -389 -64 41 -37 51 -104
1999 -104 187 140 153 -89 -31 23 290 -204 2 89 -120 258 -145 118 -182 -11 -248 -116 -89 -145 2 -303
2021 -303 8 376 33 25 -144 10 -8 -9 -23 57 -79 26 161 94 24 -120 -251 8 -3 39 -33 -257 202 -444
$$ packed form
1859A87l26K42l2M5j96J2J11k49L08j28k48J26P4N4J27l44N14m61K77l02J96J9
1881Fr4M13j62k72r4J58q4M9j78M43k13J40m64L81J67k75Q8N2Oj98K33k14J60
1904D8k34K96k86p2L53j84K45k46L0J17r7r7r9M67j01k89K02j15K31j20pN4o7
1927B9RL8J16R6l38k7J51k70L19k17J51k04J90k74K49j02M4J24j33j5j13K34j64
1950a07P3J12n6j09o2RJ52K2j27O3k10J77o9O4r8J85o7Lk50M33j02m34K65M2O7
1975b4O4q6qk44K05K19j09N4R6r1l77K06k6K62j94N5k41Q5k35L25J05p8Q8j55
1999a04K91m7J3k42N8N4K67m94K06Q7k09L78m03K63l00J71k37J32K7n6J47l05
2021c03L11L68l43qj69J54j8jj4Q0j36J05J35o7p0j44j31K59j1M2p2k24M59o46
$$ plain form
2045 -444 8 47 53 -16 -73 -207 20 105 -202 92 110 -50 -74 80 -21 -14 -67 -10 -111 -56 -63 199 -58 -19 -127
2070 -127 -8 -42 124 -264 -23 -31 100 94 -17 81 16 32 33 -137 -45 -38 -162 54 -29 -76 -205 -113 -15 210 -343 -270
2096 -270 -94 162 -29 286 243 -54 91 -87 -37 -206 -137 82 -138 -111 115 -130 -46 -10 68 -51 34 -164 400
2119 400 17 56 250 -141 39 -167 170 76 -58 -26 108 -190 -202 164 -66 -65 244 -150 -46 -170 136 24
2141 24 -37 5 -84 336 -252 -219 91 -167 -34 48 -136 114 -146 114 128 108 100 80 -120 148 9 90 -83 41
2165 41 -72 47 29 122 -33 76 -156 -63 9 -98 241 -59 -140 57 -61 -78 24 -8 126 -171 25 -42 -84
2188 -84 82 271 -219 57 24 242 342 -267 -188 -7 48 -11 -179 186 161 -109 -24 46 -226 -211 -140 64 17 56
2212 56 -36 137 -112 -57 289 -66 -191 -115 -64 159 -85 316 163 -183 -53 81 53 9 91 63 51 35 -187 30
$$ packed form
2045d44M52L9Oo9n7j34K27Q5l07K94J8j60k4J54j01Pn3N7j01N5pK62k57L9j08
2070a27J19l4J66l88K41qJ31oj11R8o5J6Jj70R2Pj24K16q3m7j29R2R8K25n53P3
2096b70J76K56j91L15m3k97J45j78N0j69O9K19k20K7K26k45Q4L6P8j19Q5j98N64
2119D00l83L9J94l91J80k06L37r4j34L2J34k98j2L66k30JL09l94J04j24L06j12
2141B4o1M2q9M20n88L3L10k58J33Q2j84K50k60K60J4k0qk0k00K68j39Q1j73J24
2165D1j13J19j8R3j55J09k32R3P2j07L39l00q1J97j18j7J02l2J34k97J96o7m2
2188h4J66J89m90K76l3K18J00o09P9J81N5n9j68L65k5k70Q5P0k72J5P1K04m7L9
2212E6r2J73k49N5L46l55j25P6N1K23k44M01j53l46J30J34k8m4Q2k8j2j6k22K17
$$ plain form
2236 30 214 -364 -77 156 -109 138 98 -190 127 87 386 -91 62 -80 125 -20 8 34 -197 166 -30 27
2258 27 69 24 -108 66 45 -120 13 93 -42 54 -35 -207 -133 -156 147 -40 98 194 7 170 219 144 126 -98
2282 -98 -53 -175 122 -197 60 -290 -183 3 26 -106 54 -154 230 -15 -81 148 -130 -87 23 -57 -103 15
2304 15 108 118 -251 113 242 -162 122 -43 -247 108 82 -221 87 117 28 -38 -41 -314 128 133 -94 -61 92 78
2328 78 -49 -173 16 57 24 103 -78 176 -222 -6 -25 139 -80 -216 -197 -150 101 -83 152 123 116 -143 -56 56
2352 56 192 36 32 -22 -38 -99 -150 98 115 -60 136 114 -163 175 44 168 81 -31 -48 -157 -100 -297 256 287
2376 287 -242 -276 -291 50 93 -6 64 107 -226 48 49 -274 238 35 13 14 -9 -98 -85 -15 -18 215 -76 157 -76 -134
2402 -134 -177 7 6 -54 218 134 34 -78 -65 -3 -75 -208 115 7 -35 168 -35 -232 -263 61 99 174 -45 418
$$ packed form
2236C0J84n78K87K33k65K47m0k88L17m0K99m77J53j42K05j45K8K6k31L63j96N7
2258B7M2m5j32J74k1j65J33Q0j35R6q9j72P4k3L03j87J38R6j87J63M9p5j8k24
2282i8M5j22K97l19K57l50J07J86K3j32J60k08L84k45o6K29k78M3J10q0m6J18
2304A5R3J0l69L64J29m04K84j65k04L55k6l03L08L0q9o6lk73M42Nk27L3J53j4
2328G8j27j24J89M1l3P9j81K54l98K16j9J64k19j36J9M7K51j84K35k9pk59Q7J12
2352E6J36j56mn4j6o1n1K48J7j75J96k2k77L38j31J24q7j12j7j09N7j97N53L1
2376B87n29l4j5L41M3r9P0M3l33K74Jl23N12k03k2Jk3q9J3P0lK33k91K33k33n8
2402a34m3J84jo0K72q4j00j12J3O2p2j33L23j08m2K03k03j97l1L24L8P5k19M63
$$ plain form
2426 418 158 22 -84 -202 330 201 59 46 -134 -19 -94 10 -99 -54 79 -191 446 -20 -8 -72 -51 39
2448 39 -79 -53 -227 49 182 5 12 -244 297 23 51 -59 -67 -89 189 -142 -194 36 -60 -151 114 -157 234 -23
2472 -23 100 -322 -232 -35 -193 161 -99 62 67 29 149 227 30 225 85 -120 119 -49 -152 -129 182 89 175
2495 175 -23 -13 -8 54 42 -236 172 238 164 -51 -31 -22 -210 46 -93 -255 158 -82 -110 45 -2 -221 49 -34
2519 -34 32 -51 -25 221 -98 -141 -84 -269 -62 -142 -1 -206 75 89 121 -143 45 174 -139 98 -80 221 -47
2542 -47 -170 36 200 -19 -5 -61 12 -46 44 -417 163 -84 1 -44 -35 36 225 -176 -65 -91 121 -172 67 178
2566 178 92 -192 -27 143 43 194 -4 -255 -141 -22 -86 161 108 194 -11 86 -16 -89 137 44 30 3 -7
2589 -7 7 -107 20 -24 38 -91 290 249 -420 -247 43 -98 29 50 43 157 -140 -9 226 108 -6 -126 -101
$$ packed form
2426D18k60j36j06j18N32j29j42j3j80J15p5J04j09M5J33k70O37m66J2o4K1R0
2448C9j18K6j74K76J33j77Pk56N41k74K8j10qk2K78l31n2K30r6r1K65k71L91k57
2472b3J23m22R0J97j58L54k60J61Nl8J20P8j97J95j40k05K39j68j03K3L11r3Q6
2495A75j98J0NO2j2k78M08O6p4k15K0Rj88K56j39j62M13k40k8J55m7k19K70q3
2519c4O6q3K6K46l19m3N7j85K07q0J41k05K81J4L2k64J88J29l13K37j78L01k68
2542d7j23K06J64k19J4n6P3n8R0m61N80k47Q5m5RP1J89m01J11k6K12k93K39J11
2566A78q6k84J65J70j00J51j98k51J14J19o4K47n3Q6k05R7j02p3K26r3j4k7j0
2589gJ4j14J27m4O2j29L81m1o69J73K90j41J27K1pJ14k97J31K35j18j14j20K5
$$ plain form
2612 -101 -102 -40 -42 54 -10 -87 283 -55 -60 -14 -60 102 78 99 -266 -21 290 -110 -184 -82 133 -33 198 -87 160
2637 160 19 76 -19 98 145 -89 55 -122 -109 -33 -55 135 72 -82 96 -8 116 -151 0 -215 208 97
2659 97 17 141 171 198 137 -148 -106 202 51 19 128 221 141 -264 -103 -183 92 -44 -65 126 -9 161 85 -41
2683 -41 -140 -11 -86 -79 145 79 38 64 14 -369 50 -59 87 45 -1 -4 75 42 -89 -34 67 -102 -55 -66 -121 133
2709 133 -290 -16 241 -377 -249 153 -10 -200 34 -157 138 25 -102 -55 -12 -17 -27 40 0 136 77 140 9
2732 9 -43 -113 -159 7 -149 173 339 -161 -141 -13 170 -179 -97 -54 167 -49 -66 -209 -52 -60 -40 -124 -154 -87 -38
2757 -38 -207 -86 175 -187 116 -37 -132 193 -132 0 -54 -136 174 -137 -272 -154 106 -130 139 90 86 97 371
2780 371 -176 73 -264 -267 252 -185 200 76 352 292 -84 86 59 307 16 91 -141 -76 -45 -352 -74 -125 -169
$$ packed form
2612a01jO2kR6o4p7L70l38nM6m6J62k4K1l65K45L11m00p4J02K15j66K31k85K47
2637A60j41N7r5J17M7k34J44j77J3P6k2J90o3j54J78j04J24k67J51k15M23j11
2659I7q0J24L0K7o1k85M2L08j51l2J09R3q0m05J61q0K75j36k1J91j35J70p6j26
2683d1r9J29p5PK24o6m1K6n0l83M19j09J46m2m6lP9l3j31N5J01j69M7j1n5K54
2709A33m23K74K57o18J28M02j63j90K34j91K95j13j27M7M3nj0O7m0J36n9O3j31
2732In2p0m6J66j56L22J66n00K0J28J83l49Q2M3K21k16j7j43J57qK0q4l0O7M9
2757c8j69J21K61l62L03j53r5L25l25J32n4q2L10l11j35J18K60k36K69m9mJ1K74
2780C71n47K49l37lN19m37L85j24K76o0l76J70k7K48k91P5k32O5L1l07K78n1m4
$$ plain form
2803 -169 -277 225 -5 38 -75 169 43 51 113 52 -61 276 -100 249 -185 -95 -304 -140 -188 135 -5 -59 14
2826 14 35 59 -127 -63 97 95 -218 157 165 -7 -98 -225 -306 -51 83 -19 144 -13 294 226 150 197 -32 -3 13
2851 13 -59 191 -123 203 22 65 -139 128 -160 -246 -89 88 -17 -116 97 -99 13 56 168 217 1 -202
2873 -202 145 -119 16 147 -89 63 -158 16 106 4 142 77 216 0 277 128 -91 77 -152 63 144
2894 144 -96 65 38 -181 -21 -38 30 -171 -263 -48 74 131 -119 11 -220 -238 180 162 136 -128 11 187 -249
2917 -249 -105 -184 42 133 28 -70 71 109 -124 -21 44 -231 -146 53 -137 28 172 192 -60 -201 -65 -30 -3
2940 -3 -119 70 218 -33 -58 -45 208 -153 -108 -55 74 -117 0 -54 4 -31 126 41 59 -168 186 -173 -149 30
2964 30 -20 -89 71 -87 -168 -199 -155 366 -39 55 16 -11 -352 -16 -85 3 -144 60 97 -59 207 -41 -154 -2
$$ packed form
2803a69j08N02k30M3j13K44j26QO2o1j13L37l76L49m34R0k09J64m8L23j40n4P3
2826A4K1K4j86O4J60kl13L75Qj72r1j27q1K55J34j02J63j57L07o8p6M7k29K9J6
2851A3p2K50l14L26j81M3k04K67k88q6J57J77j05r9K13j96J12M3J12M9k16k03
2873b02L47k64J35J31k36J52k21J74R0j02J38o5J39k16K77j49k19J68k29K15Q1
2894A44k40J61k7k19J60j7O8k01r2K15J22N7k50J30k31j8M18j8k6k64J39J76m36
2917b49J44p9K26R1j05r8J41L8k33J03O5k75Q5J99j90J65J44K0k52j41J36L5K7
2940cj16J89J48k51k5J3K53l61M5N3J29j91J17n4N8l5J57q5J8k27L54l59K4J79
2964C0n0o9J60j58q1l1M4N21m05R4l9k7l41L36o9Q8j47K04L7j56K66k48j13J52
$$ plain form
2988 -2 -82 -187 309 57 -28 74 -301 15 85 -20 130 95 338 -47 -129 -263 -55 -7 -207 2 70 -15 47 -120
3012 -120 98 -358 -166 -89 -137 204 249 -71 78 -195 194 -13 -201 -239 -86 -36 64 17 295 58 -13 -34 -237
3035 -237 107 -78 -79 118 209 -41 18 43 18 110 -73 211 -31 202 -57 3 -57 -77 -24 52 -30 113 71 -68 -129
3060 -129 -93 79 -99 89 18 58 216 2 -142 -378 -166 137 -194 20 -33 -6 117 107 -43 203 8 -273
3082 -273 4 -18 81 91 48 146 -27 194 -258 -74 -108 -125 315 -44 107 7 147 56 -3 121 -394 -118 -7
3105 -7 -99 42 -30 47 -3 262 28 149 161 -148 152 127 90 -21 96 -43 164 -182 -270 46 -102 -18 -267 -177
3129 -177 3 -136 147 -132 371 -154 1049 61 -482 291 -313 -552 770 8 -642 87 756 -365 125
3148 125 223 -346 4 121 -136 -180 3 88 189 198 49 -36 21 -46 96 223 -115 -19 31 33 1 245 63 3 -82
$$ packed form
2988bq0j05M96k52q5J02l75L16P0j05J50l5K43l85q2j34K08M8k00K09O8q5O2j67
3012a20K18m56J92P7m8L41M5l20J49k73L89k07j88l8J53N0J00m7K78k37p1k1k03
3035b37L44j85jJ97R1k50N9K5k5R2j83K84k42K33k59O0o0k0N3P6q2J43m2j39o1
3060a29L6J72j78J88p1M0J58k14j44k36K12L03l31K14n3K7J23j0j50K46j95k81
3082b73K77k2R9J0m3R8j73K21m52J84l4j7M40l59J51j00J40r1n9J24n15K76J11
3105gr2J41p2P7n0K65k34J21J2l09L00k5l7j11J17j39K07l46q8L16j48Q4k49R0
3129a77J80j39K83k79N03n25J203r88n43P73o04k39J322p62o50P29O69j121M90
3148A25R8n69L50J17k57m4J83Q5J01Rj49q5N7o7J42J27l38R6N0Kl2K44j82o0q5
$$ plain form
3173 -82 -56 -4 33 150 -294 -141 -49 -215 48 168 -39 -152 -111 172 -138 -89 43 15 98 -156 51 -138 -161
3196 -161 40 190 80 239 -140 -74 -48 74 29 16 69 -29 -79 -96 -314 -4 -168 395 10 137 101 -158 -46
3219 -46 -7 -86 161 152 -141 104 156 143 107 -224 183 72 -222 -148 -189 -139 -34 -12 -121 -130 20 93 61 185 167 49
3245 49 18 -190 149 -49 -184 -200 335 65 -134 109 -142 144 -43 -4 27 -39 -38 59 -114 -10 73 -60 -133 -167
3269 -167 -100 123 5 -212 -129 -120 106 -37 -165 -29 19 -65 -61 54 112 -146 120 -47 -20 0 31 -179 145 190
3293 190 138 113 60 153 -47 -143 188 -363 -171 90 130 -179 -231 56 119 297 136 -22 -62 -238 -38 17 -119
3316 -119 12 94 151 -133 113 110 -225 -125 -10 299 -70 -24 -320 -17 10 -224 433 -56 -25 14 160 19 -27
3339 -27 -222 -55 -50 -168 453 -256 207 -176 -101 54 4 5 197 60 135 -6 146 121 -1 -272 -44 112 225
$$ packed form
3173h2K6N2L7J17m44J53R2j66K63J20k07j13M1K83l10M9J32k8Q3k54K07j89k3
3196a61K01J50j10J59l79O6K6J22m5j3N3r8n0j7k18L10j64N63l85J27l6k59J12
3219d6L9p9K47rk93K45N2j3l6l31M07j11k94P4m1N0J05K2j09rJ50P3l2J24j8j18
3245D9l1k08L39j98j35j6N35k70j99K43k51K86j87L9L1o6JR7j73J04Q3j33p3l4
3269a67O7K23j18k17Q3RK26j43j28J36M8q4MJ15N8k58K66j67K7K0L1k10L24M5
3293A90n2k5n3R3k00r6L31n51J92K61M0l09n2K87O3J78j61j58m0j76K00N5j36
3316a19J31Q2N7k84K46ll35J00J15L09l69M6k96L03K7k34O57m89L1L9J46j41m6
3339b7j95J67Nj18O21p09M63l83P5J55n0JJ92j37P5j41J52k5j22k71K28J56J13
$$ plain form
3362 225 151 105 -107 -281 -20 -136 281 34 -128 -146 -87 2 -71 10 86 -66 102 136 140 -127 -36 -35 153 137 -176
3387 -176 169 37 96 47 -109 67 -176 -257 -478 121 -27 -323 -75 -203 -126 147 69 91 15 57 -126 123 80
3410 80 57 -2 -132 -131 -189 112 -98 209 19 125 -26 203 -39 -134 138 -75 -133 93 -17 40 -25 -63 -9 -200
3434 -200 56 -17 331 31 157 251 382 -61 89 -258 -151 -31 -17 -269 318 209 67 119 47 9 48 234
3456 234 -15 -204 -8 -84 138 -29 -101 210 128 119 -111 -43 -50 -38 93 -139 150 -31 -461 123 -194 -53 27
3479 27 76 -146 -234 -103 51 94 54 -143 221 -131 -99 -49 20 193 -49 17 -38 -22 -17 -50 -39 306 61 28 -193
3504 -193 140 -66 -111 -232 68 -29 -158 -138 -81 66 -92 95 -20 37 82 -238 -176 138 13 -79 240 179 110
3527 110 112 -52 -1 -46 191 249 -91 -42 36 -9 -89 -192 134 6 88 -143 -285 -108 21 105 231 51 -22 -139
$$ packed form
3362B25p4m6k12j74K61j16M17k47j62j8N9Q9p3Q1P6j52J68L4Mk67R1JJ88j6l13
3387a76L45j32N9m9j56J76k43q1k21N99j48k96K48j28P7K73p8K2p6M2j83K49m3
3410H0k3n9j30Jn8L01k10L07j90J06j51K29k42r5K72k13n8K26j10N7o5l8N4j91
3434b00K56p3L48l00J26R4J31m43J50l47J07J20J4k52N87j09j42N2p2l8L9J86
3456B34k49j89J96p6K22j67p2L11q2rk30O8pJ2J31k32K89j81m30N84l17J41Q0
3479B7M9k22q8J31J54M3m0j97L64l52L2N0O9J73k42O6n5J6Nl3J1L45k45l3k21
3504a93L33k06m5j21L00r7j29K0N7J47j58J87j15N7M5l20O2L14j25r2L19o1o9
3527A10Kj64N1m5K37N8l40M9P8m5q0j03L26j28Q2k31j42J77J29Q4J26j80p3j17
$$ plain form
3551 -139 -240 117 179 132 -36 -212 149 -186 95 186 -173 114 10 -193 106 -54 -11 8 -62 -36 -297 85
3573 85 -3 -180 75 117 15 -272 -36 -51 -47 58 -153 9 -68 -56 -233 469 -134 143 102 -97 78 134 -126
3596 -126 175 -53 -116 82 -22 -187 -67 -24 15 -222 -75 58 -256 -102 -70 65 153 -136 -261 175 141 -237
3618 -237 211 -86 -188 122 91 183 -204 58 -338 155 -61 9 22 -131 132 -238 -80 268 156 -141 -89 -35
3640 -35 12 -154 -63 104 -141 165 -37 -58 204 -180 50 -11 -18 -98 -65 62 -18 112 -73 -234 -294 128 -64 -136
3664 -136 -159 -143 -74 -81 273 -50 -105 -58 62 7 -238 29 6 -100 94 -128 117 -141 109 15 45 104 3 -166
3688 -166 39 -106 52 -74 -42 -151 25 -14 40 38 126 -108 78 -242 -63 -106 30 28 -218 130 157 -6 -16 417
3712 417 246 -79 7 -114 -215 -51 -90 142 -30 -132 189 95 4 209 -32 77 31 129 -11 -289 -196 32
$$ packed form
3551a39j01L57O2m7j68j76L61l35K81R1l59K87j04k03K99j60M3J9p0K6k61L82
3573H5q8j77K55M2j02k87K36j5MJ05k11J62p7J2j77P02o03K77m1j99J75N6k60
3596a26L01k28o3J98j04j65J20M3L9k37J47J33l14J54L2J35Q8k89j25M36l4l78
3618b37M48k97j02L10l1R2l87K62l96M93k16P0J3j53K63l70J58L48j12k97N2N4
3640c5M7j66R1J67k45L06k02k1K62l84K30o1pq0L3J27q0J30j85j61o0M22j92p2
3664a36k3J6O9pL54l23n5M7J20n5k45K67k3j06J94k22K45k58K50r4L0N9j01j69
3688a66K05j45J58j26L2j09J76l9N4kQ8k34J86l20J79m3J36kk46L48K7j63j0M33
3712D17j71l25Q6j21j01J64l9K32j72j02L21r4r1K05k41J09m6R8j40k78R3K28
$$ plain form
3734 32 28 -37 -145 -94 192 -112 98 43 -14 89 250 -30 -118 -99 -259 0 -179 34 -229 64 -400 4 -232
3757 -232 -90 -33 30 -83 18 -79 16 -32 -248 -70 343 95 -18 151 -372 -134 111 57 70 -81 72 -35
3779 -35 -237 -70 -162 -23 -123 199 64 15 21 202 -26 -197 -102 92 -188 211 207 -177 -92 101 -227 223 148
3802 148 201 -86 -131 141 -206 133 32 147 50 91 301 -165 -146 108 154 -296 63 -31 33 -125 -140 -8 -118
3825 -118 -78 -161 -12 193 -212 -128 -241 52 -6 -148 201 -49 283 -44 300 -120 -244 -166 58 1 101 11
3847 11 178 -63 35 118 270 326 96 -63 59 -156 103 187 -342 50 -32 115 17 -262 -48 -70 -355 -158 -60
3870 -60 77 218 4 47 -50 87 -185 -139 -125 -200 -5 225 -105 235 46 -49 110 214 214 -67 193 1 -118
3893 -118 -22 -71 -112 -78 -316 -120 -83 50 223 75 72 -1 -269 -120 -105 -115 -15 -22 -130 -230 106 -260 129 110
$$ packed form
3734C2mo5j08N1K86l04K10n5n7J03J61k80q8J9j60K59j79K13k63K93m64M04k36
3757b32J42N7O3j13J01r7R5m8k16J78M13k48j13J69n23K38K45n4J3j51J53j07
3779c5k02J67r2J39j00L22j35m9OJ81k28j71R5J94k80L99ml84Q5J93l28M50p5
3802A48N3k87m5K72l47L39j01J15r7M1K10m66J9K54M6m50L59r4O4j58j5J32j10
3825a18M0q3J49K05m05Q4j13K93n8j42L49k50L32l27L44m20j24P8K24n7J00r0
3847A1J67k41R8Q3J52N6k30j59J22k15K59Q4n29L92q2J47r8k79K14k2k85J97R8
3870f0J37J41k14M3r7J37k72M6J4p5J95K30l30L40j89r5J59J04%k81K60j92j19
3893a18R6m9m1L4k38J96L7J33J73j48lp3k68J49J5j0J00pj08j00L36l66L89j9
$$ plain form
3917 110 -48 -213 173 7 -380 253 78 236 23 136 -47 -9 -14 -50 294 -70 -35 37 250 5 -27 218
3939 218 -53 222 -191 -213 -4 -36 129 257 -140 27 -205 -183 124 -108 -119 -69 -78 -9 -81 54 -125 64 -182
3962 -182 46 -11 39 100 39 -13 -215 92 -277 36 231 -132 19 -279 147 7 64 -28 -25 -61 -84 95 -129 198
3986 198 110 131 -34 -44 156 154 76 -74 -1 123 -41 -252 47 -71 28 -21 253 149 -3 243 45 104 124 -31
4010 -31 -35 168 -143 218 52 130 80 35 -165 -212 227 -37 69 -47 -19 -48 226 77 317 -173 15 190 161
4033 161 189 -81 -89 -78 119 86 -53 185 -173 98 74 -60 -200 160 237 138 -46 80 109 133 27 57 -10 -181
4057 -181 424 -120 35 -127 63 260 9 41 0 -79 258 -4 18 -167 -66 32 134 -259 -137 287 -114 -77
4079 -77 101 -8 39 271 -233 48 228 -115 145 175 -149 258 -226 105 156 234 -91 62 -77 -34 181 72
$$ packed form
3917A10j58j65L86j66l87O33j75J58k13J13j83L8nl6L44l64L5P2K13k45l2K45
3939B18k71K75m13k2K09l2J65J28l97J67k32K2L07k32j1N0rO9p2J35j79J89k46
3962a82K28n7N0O1o1n2k02L07l69L13J95l63J51k98M26j40N7r2Ll6k3J79k24L27
3986A98q8K1j65j0K00kp8j50P3J24j64k11K99j18R9m9K74j04j52K46j98N9K0j55
4010c1mK03l11L61j66P8n0m5k00m7M39k64J06j16K8k9K74j49K40m90J88J75k9
4033A61K8k70qJ1J97l3j39K38l58K71k4j34j40L60P7r9j84J26K9K4j06L0o7j71
4057a81O05n44J55j62J90J97k51L2m1p9L37k62K2j85J01R8J02l93J22M24m01L7
4079g7J78j09M7K32n04K81J80l43K60L0l24M07m84L31N1P8l25J53j39M3K15j09
$$ plain form
4101 72 -26 -65 -63 -169 -102 -161 29 208 85 203 -18 225 119 126 204 -17 6 25 -99 -16 -132 -166 -121 50 -29
4126 -29 -53 -124 -138 -408 -186 67 -37 76 200 67 -83 -50 28 -19 -30 99 -155 -76 -2 72 86 -50 115 78
4150 78 103 41 -23 50 99 -39 -60 233 -97 -85 -146 57 118 200 191 70 -423 9 230 -10 160 -149 70 138 19
4175 19 -16 -121 -275 116 -3 -72 -31 -190 -223 -170 -104 94 -20 -130 68 -151 -51 22 52 180 111 -68 117
4198 117 -107 23 -32 -118 202 -1 -215 -38 131 -117 57 24 -170 152 124 392 -111 -167 -7 -21 -124 142
4220 142 127 88 239 -78 38 115 -111 -65 -99 86 51 -44 23 70 -8 -122 65 109 91 146 -210 -97 147 -146
4244 -146 35 -105 82 -7 134 5 -72 -178 66 -42 -71 96 211 -31 -406 36 125 -31 -77 -81 -149 -23 141
4267 141 174 108 7 4 -174 -13 44 -130 -11 -20 178 -15 -18 106 -301 -208 41 122 60 -56 178 89 -454 243
$$ packed form
4101G2r8l9Kj06O7n9J90J79j23J18k21K43j06PP8k21K3J9j24Q3j16l4M5J71p9
4126b9k4p1j4k70K22K53j04J13J24j33j50L3P8m7j1J29k54P9P4P4J4j36J65l7
4150G8K5o2o4P3M9j38k1K93l30J2o1K03O1Q2rj21m93M32K21k40J70l09K19O8j19
4175A9l5j05j54L91j19o9M1j59l3N3O6J98j14j10J98k19J00P3L0J28o9j79J85
4198A17k24J30n5q6L20k03k14J77J69k48J74l3j94L22k8K68n03n6J60j4j03K66
4220A42j5l9J51l17J16P7k26M6l4J85l5r5O7M7p8j14J87M4j8N5l56J13K44k93
4244a46J81j40J87q9J41j29p7j06K44j08k9J67J15k42l75M42Q9j56m6mo8J26J64
4267A41L3o6j01lj78J61N7j74J19rJ98j93lJ24m07R3K49Q1o2j16K34q9n43O97
$$ plain form
4291 243 133 181 162 -287 -323 -142 190 -43 -28 -64 -5 -54 47 4 -163 114 20 210 52 -122 194 13 -15
4314 -15 -102 82 162 49 -144 139 140 4 -45 -141 -200 -212 -130 95 -18 -51 132 -71 79 105 86 -110 -191 32 -182
4339 -182 39 -55 -289 -190 166 -71 -127 186 -3 -210 -96 223 85 37 145 -42 127 65 -48 236 -108 4
4361 4 -265 172 190 -151 111 53 -137 -197 -15 -284 -528 56 -130 53 25 -34 229 -142 -52 -285 -81 127 110
4384 110 -153 -62 -61 6 209 -152 -71 -200 200 -61 201 24 -185 23 -83 -62 154 20 -234 -187 -58 -95 9
4407 9 124 -6 -58 -243 12 68 -66 -81 114 146 -125 -286 -122 109 -195 119 -42 -39 -120 -50 271 -54 -53 23
4431 23 77 -27 -134 -211 52 131 36 -71 38 172 113 24 330 211 62 173 -81 135 -61 -56 85 -82 -161
4454 -161 -23 -5 110 235 -140 126 9 -105 -122 -49 -243 258 162 -158 -39 27 43 50 -112 50 70 -180 -5
$$ packed form
4291B43j10M8j9m49l6J81L32k33J5l6N9m9J01m3j67K77r4J90j58j74L16j81k8
4314a5q7J84Q0j13j93K83Jj36m9r6n9j2Q2K25j13l3J83k03J50K6j9j96q1K23k14
4339a82K21r4k34R9L56k37n6L13j89k07J14L19j38m8J08j87J69o2j13K84l44J12
4361Dk69M37J8l41K62n8j90o0J82k69k44N84j86J83k8n9K63l71R0k33K04K08j7
4384A10k63R1JO7K03l61Q1j29M00k61K62j77k09K08j06K1K16j34k54M7J29l7J04
4407IJ15j30n2j85K55N6j34j5J95L2k71j61J64K31l04L14j61Lq1P0L21l25JP6
4431B3N4j04j07p7K63P9r5j07J09J34n9q9L06j19j49J11k54K16j96NJ41j67p9
4454a61J38J8J15J25l75K66j17j14j7P3j94N01r6l20J19O6J6Pj62J62K0k50J75
$$ plain form
4477 -5 -4 139 -139 28 228 309 246 -111 2 -10 -181 -50 -195 -16 -6 -337 -140 -107 -173 22 -25 14 -139 -1
4501 -1 -205 -19 -3 -48 -139 -39 -22 -248 -184 -70 -65 33 100 -48 -137 287 214 37 -188 594 -14 -4 108 -200 -216
4526 -216 42 48 160 -231 -168 -166 85 187 104 -93 128 164 -24 -10 -122 172 -132 50 -19 191 74 33 151
4549 151 -14 -183 -260 -59 -23 221 -3 -135 -34 64 182 99 -2 -65 121 -56 205 185 10 -215 21 -116
4571 -116 276 -10 64 101 -145 -324 -113 70 40 -344 -83 26 -112 19 6 29 5 167 -119 74 83 116 126
4594 126 -17 237 375 -36 165 -157 -116 -81 -108 -188 -331 -56 -180 -331 60 113 82 -57 124 163 32 -38 106
4617 106 62 -7 132 -45 242 41 -120 -69 75 74 12 -176 -103 84 198 -227 -144 -55 65 62 49 -155 68 -19
4641 -19 276 70 -67 149 14 -68 -149 -24 235 33 33 101 27 -129 254 42 -109 59 167 -130 390 32
$$ packed form
4477eJJ43k78J67K00Q1o3l57J13j2j71J31j45J79J0l31J97L3o6J95m7L9j53J38
4501ak04J86J6m5r1J00J7k26O4J14NR8O7j48q9M24p3j77k25P82o08J0J12l08j6
4526b16K58OJ12l91O3KK51J02q3j97K21L6j88J4j12K94l04J82o9K10j17m1J18
4549A51j65j69p7K01L6K44k24j32J01R8J18q3j01o3J86j77K61k0j75k25K36j37
4571a16L92k86P4L7k46j79K11J83l0l84K61J09j38J31j3K3k4J62k86J93RL3J0
4594A26j43K54J38m11K01l22M1L5k7q0j43K75j24j51L91N3l1j39J81L9j31p0J44
4617A06m4o9J39j77K87k01j61N1J44jo2j88P3J87J14m25Q3Q9J20lj3k04K23q7
4641a9K95k06j37K16j35q2q1J25K59k02%O8p4j56L83k12j51J68J08k97N20l58
$$ plain form
4663 32 93 -174 -158 31 115 -65 127 -289 -6 -62 -155 -54 167 -242 45 81 -260 140 -42 -147 -47 -151
4685 -151 94 62 -49 -181 -85 194 121 32 -3 21 -249 219 -380 -45 -74 78 -96 -94 86 134 -95 -111 -131 61
4709 61 221 -233 139 -12 139 -92 112 -188 -253 146 226 219 23 118 -9 -40 247 228 253 -102 187 194 -66 34
4733 34 18 76 -21 -81 -16 32 214 -96 61 -184 -39 -31 92 -166 -59 -178 -4 38 -10 134 -148 -215 -217 -161 -87
4758 -87 32 -13 268 -88 -75 -166 6 74 -7 -86 34 -94 54 -26 14 109 19 75 28 -46 97 -64 -7 5 -36 -54
4784 -54 -223 169 -63 234 -74 -31 67 172 168 -74 -86 -12 197 -65 -28 29 129 -68 51 -63 176 -162 50
4807 50 155 -79 -151 357 -198 162 116 -26 2 -91 -51 161 36 -107 255 -89 -148 -189 -37 5 -168 -26 -173
4830 -173 79 65 18 213 -233 24 106 76 -119 54 29 206 -10 118 74 -136 69 -87 177 44 -48 58
$$ packed form
4663C2O1k67J6J89Q4j80J92m16K83n6r3J01K21m09K87L6l41M00j82j05J00j04
4685a51K45l2j11j32R6K79p3q9l5K4k70M68n99L35k9J52j74KJ80M8k29j6k0J92
4709F1J60m54L72j51J51k31K04l00o5L99Q0pj96R5j27l1K87j9K5l55K89Pk60J00
4733C4j6N8r7o0O5M8J82l10J57k45J45QJ23k58J07j19J74M2m8J44k82o7kN6P4
4758h7J19m5K81l56J3r1J72O8q1p9J20j28J48q0M0R5r0N6m7p4J43j61N7J2m1j8
4784e4j69L92k32K97l08M3R8J05mk42j2P4K09k62L7N7J00j97J19j14K39l38K12
4807E0J05k34p2N08n55L60m6j42K8r3M0K12j25j43L62l44n9m1J52M2j73J42j47
4830a73K52j4m7J95m46K57Q2l0j95J73k5J77k16J28m4k10K05j56K64j33r2J06
$$ plain form
4852 58 -78 59 -246 20 -143 26 -13 187 52 154 -26 -56 126 -16 -92 148 112 -32 -155 -107 102 2
4874 2 -21 -64 26 -133 16 -65 -108 -9 355 -58 0 -16 90 3 3 -2 -70 196 -89 151 78 -102 43 -77 4 32
4900 32 -441 -123 115 192 -87 -83 -120 -129 -61 135 -6 -114 -107 71 -99 -222 -75 55 48 159 110 -17 -16 9 -31 -154
4926 -154 116 -117 -20 37 109 -10 205 -150 -215 2 185 -263 226 122 185 44 -125 -3 -98 73 129 237
4948 237 37 79 120 -9 137 -403 212 4 -161 52 -148 -109 -60 16 -201 1 55 140 -250 -236 -171 15 15 -313
4972 -313 118 2 -27 25 -339 190 -145 -251 62 -58 53 -109 318 -149 -52 -202 -168 14 -80 -209 241 125
4994 125 19 169 -65 7 45 -125 -7 -131 85 164 -8 -92 -392 -303 64 -190 -232 149 216 133 -180 73 126
5017 126 -170 -149 148 17 5 30 29 73 43 -16 -307 -182 -73 181 -23 -131 -349 -146 -5 -88 -373 70 -73
$$ packed form
4852E8j36J37l05K66j63J69l9K00j35J02j80l0J82j42p6K40l6j44j23M8K09j00
4874Bk3m3R0j59J49q1m3R9L64m13N8j6J06q7%no8K66k85K40p3j80J45j20Q1K8
4900C2m73L18K38P7k79Ml7rO8J96j41j08PJ78j70j23J47J30pJ11m9j27JK5m0j23
4926a54K70k33R7N7P2j19K15l55o5K17J83m48M89j04O3j41j69J22r5J71N6J08
4948B37k00M2M1j29J46n40O15k08j65K13k00L9M9P6k17K02N4Q5l90J4O5J86%l28
4972c13M31j16k9N2l64N29l35j06L13j20J11j62M27m67R7j50L4J82r4j29M50j16
4994A25j06J50k34P2L8j70J18j24K16P9j72q4l00Q9L67k54m2L81O7q3l13K53N3
5017A26k96K1K97j31j2K5jM4l0n9k91J25J09K54k04j08k18K03J41q3k85M43j43
$$ plain form
5040 -73 -46 76 -150 78 -49 14 -73 -76 -22 85 -163 -141 -113 97 44 253 156 142 92 -26 69 44 145 78 -95
5065 -95 -72 176 -84 -44 101 93 56 -11 272 -31 219 12 98 -204 -3 -193 -125 -354 -118 -98 129 -169 117
5088 117 90 -80 -215 11 95 -1 59 -221 73 57 -97 50 -94 63 134 -414 -137 167 92 60 -104 1 -79
5111 -79 -156 124 236 40 -164 -187 239 -184 -83 -39 90 160 -68 -12 -6 79 53 72 274 178 -27 -38 -158 -179 -13
5136 -13 -98 40 226 -100 -24 -63 -10 -211 -225 -147 -74 52 -50 -144 69 21 155 16 -93 47 -310 -54 144
5159 144 -192 -181 -291 38 -188 -163 -34 189 75 255 -118 108 39 -288 -49 4 -46 -46 -1 74 61 24 -30 -110
5183 -110 30 -103 102 -144 -41 -200 10 -148 -22 -170 227 -88 121 61 -155 -32 34 264 87 -122 128
5204 128 -28 -149 107 16 18 -70 -177 -172 159 -51 -333 -77 -27 162 5 -66 -174 137 138 -62 63 -81 75
$$ packed form
5040g3K7J22k26K28j27O3q7lN4J07k48K2K8K10n3K09r7j4n0j18R5k5J01o7j73
5065i5K3K48k60M0J45ql7o7K83l03K50k07Q6l02K01j90O8k29K36K0K27k98K86
5088A17k7j70j35K26Q4r6O0k80K94j6j54J47j44J57P1n48K77L04p5l2j64J05q0
5111g9p7K80J12j96k04k3M26m23J01M4J29P0k28N6OQ5k6J9K02r6k05j1j20k1J66
5136a3q5J38J86l26P6l9N3k01j4P8P3J26j02r4K13m8J34j39j09J40l57K56J98
5159A44l36J1j10L29k26K5J29K23j14J80l73K26o9l27K39N3n0%M5P5j3l7n4q0
5183a10J40j33K05k46J03j59K10j58J26j48L97l15K09o0k16J23O6K30j77k09K50
5204A28j56j21K56r1Kq8j07NL31k10k82K56N0J89j57p1j08L11Jk00J25j44J56
$$ plain form
5227 75 -33 -76 -128 91 -8 -209 16 164 134 124 61 -107 170 120 252 85 61 195 163 118 55 -72 18 -367
5251 -367 237 23 -172 53 91 -35 -139 -136 -30 2 -183 152 -206 165 15 -148 -130 245 -139 190 93 9
5273 9 48 61 -258 -81 -49 -107 -95 -55 125 2 46 -62 114 -39 -175 -124 -179 70 184 -211 63 -99 147 127
5297 127 -173 113 146 -27 111 189 61 -299 -268 -104 -37 -163 33 -19 -230 -76 -197 -3 -194 -5 -154 52
5319 52 112 110 228 -104 253 -37 -107 178 -67 70 -4 -47 188 188 -15 -69 -72 -233 40 -181 -153 -87 98 211 -195
5344 -195 155 25 153 205 -188 59 -11 136 -83 197 -53 106 171 -11 173 26 51 37 103 63 -52 16 111
5367 111 169 157 -112 -190 256 9 1 210 89 -2 142 62 -121 -43 -38 -191 -162 -117 -186 -70 159 -33 -305 149
5391 149 204 -102 -86 89 337 15 -99 -30 112 85 -45 55 -320 -136 -47 156 -160 132 190 -149 235 104
$$ packed form
5227G5j08m3n2K19r9k01K25J48l0j0o3j68K77n0J32j67k4J34l2m5o3j27R0l85
5251c67O04k14j95K25L8j26j04LJ06L2j85L35l58L71j50j63J8L75l84L29r7q4
5273IL9J3l19J77L2n8J2M0J80j23M4j08J76j53j36N1n5K49J14l95K74j62K46k0
5297A27l00K86L3j73J38P8j28l60L1J64O7j26J96n2k11J54j21J94j91J89j49K06
5319E2O0kJ18l32L57k90p0K85k45J37p4m3K35%k03n4lj61K73k21K8O6J85J13m06
5344a95L50j30J28N2l93K47p0J47k19K80k50J59O5j82J84j47K5j4O6m0j15O8R5
5367A11N8j2k69p8M46k47qK09j21r1J44q0j83P8Nj53K9M5o9J16K29j92k72M54
5391A49N5l06J6J75K48l22j14O9J42k7j30J00l75J84Q9K03l16K92N8l39L84j31
$$ plain form
5413 104 56 -219 4 394 55 71 291 22 19 -28 0 -75 -29 -114 -195 300 -91 117 5 118 -56 0 -223 207
5437 207 24 119 213 -34 -176 210 -108 161 -90 43 -122 52 -275 119 -188 -409 191 -101 -98 -174 -66 -124
5459 -124 -12 -20 -130 158 88 -192 -141 203 11 -274 69 -169 -8 48 -122 204 -196 95 154 -188 54 128
5481 128 -175 -251 158 55 -247 -177 31 -94 -153 -159 266 85 -117 -135 129 -155 -90 -43 129 -105 148 92 -68
5504 -68 -61 83 12 58 122 -51 -178 111 -125 -89 -39 -149 -102 -129 39 234 -56 -47 -50 -123 -65 -152 207 -5 -143 53
5530 53 -57 180 136 89 -3 -49 12 131 67 -11 -44 187 20 104 236 327 -177 21 -157 -100 219 -64 31 -30 30
5555 30 86 40 31 18 128 14 134 -64 -119 -63 -106 9 2 80 268 47 -28 165 12 -113 -184 -23 258 -94 -129
5580 -129 42 107 16 -25 23 -69 14 -6 -426 -213 -175 107 -106 173 70 -199 66 -110 -141 -93 34 24 57 37
$$ packed form
5413A04m8k75K23L90l39J6K20k69lm7K8p5M6q5q1M95l91K08j12J13j74N6k23M30
5437B07j83R5R4k47j42L86l18K69k51J33j65J74l27L94l07k21O00k92Lp6J08n8
5459a24J12qj10K88p0k80N1L44j92k85L43k38J61N6j70L26m00K91N9l42K42P4
5481A28l03p6M09j03l02P0K08j25n9oM25j81k02j8K64k84O5M7J72k34K53n6j60
5504f8PJ44p1M6O4j73j27K89k36L6N0j10M7k7J68J95k90Rlp3N8q7L59k12j38J96
5530E3j10K37m4m7r2m6O1J19o4p8l3K31j67Q4J32R1n04J98j78N7L19k83R5o1O0
5555C0N6m6rj3J10j14J20j98n5N6m3J15pP8J88k21p5J93j53j25p1J61K81l52l5
5580a29J71O5r1m1M8r2Q3k0m20K13L8K82k13K79j03k69K65j76l1M8J27j0L3k0
$$ plain form
5604 37 -104 -72 87 -45 47 -326 -50 -63 -126 29 -95 74 -190 -256 -55 -160 117 152 -166 157 295 3
5626 3 115 -134 119 141 180 -132 -361 132 69 -119 -96 -72 -187 0 -53 103 -79 -73 -196 -114 -220 -73 67 85
5650 85 -184 -120 -45 169 -99 -33 -6 162 -43 123 130 178 57 -89 79 -10 -71 188 -177 177 122 -72 -46 105
5674 105 -86 97 9 -111 -151 -276 -345 -63 19 147 -166 26 313 -10 -63 -48 20 -211 107 -94 20 -39 -14
5697 -14 52 -129 -2 -46 -41 -80 5 174 20 -24 137 281 -119 46 53 84 -2 -160 -266 -293 -191 -54 -123 -49 -72
5722 -72 95 278 -164 105 -17 -210 234 -89 96 -135 -13 -39 85 188 -12 59 -368 -197 -100 257 -206
5743 -206 55 97 -16 249 12 51 77 162 131 -103 123 279 -104 140 -178 -177 126 134 -102 -144 46 207 48
5766 48 97 -181 19 152 -10 142 -134 133 -32 -182 -148 -123 -163 -302 -114 8 -32 -319 -18 54 -129 16
$$ packed form
5604C7j41L2J59j32R2l73K76j3o3J55j24J69k64o6K01j05K77L5l18L23J38k92
5626CJ12k49K53K2L9l12k29M93o3j88K3K4j15J87n3J56j82Oj23Q2j06J47J40J8
5650H5k69O4P5K14k68O6K7J68k05J66PM8j21j46J68q9o1K59l65L54n5j94K6J51
5674A05j91J83q8j20m0j25o9K82Q2J28l13J92K87l23n3J5O8k31L18k01J14n9K5
5697a4O6j81J27m4Nl9Q5J69j54m4J61J44m00J65PL1q6j58j06k7J02J37o9P4k3
5722g2J67J83m42K69j22j93M44l23J85k31J22k6J24J03k00P1m27J71R7L57m63
5743b06K61M2j13K65k37L9K6Q5l1k34K26J56l83K44l18JL03Qk36m2J90J61j59
5766D8M9k78K00J33j62J52k76K67j65j50L4K5m0j39J88J22m0k87L01P2j83J45
$$ plain form
5788 16 -62 -229 142 7 -55 40 -43 -33 -144 400 -175 -70 -96 -75 -83 133 90 -125 -75 -91 -48 -89 165 58 -94
5813 -94 250 76 -29 -202 -28 239 -201 -148 74 73 40 -165 9 -93 -140 259 88 -34 -176 -90 195 50
5835 50 -31 140 21 3 -34 -4 -2 25 88 103 -125 191 72 226 210 187 -91 69 -104 -427 15 -39 -67 142 -29
5860 -29 -60 -27 -182 -159 75 198 0 -11 61 137 5 -121 108 -6 -31 -34 31 105 -20 -34 87 -203 38 -209
5884 -209 194 133 110 127 -267 -36 32 119 -74 204 85 -180 -218 39 107 21 212 -270 417 82 22 -103 76
5907 76 -3 153 18 -143 61 -266 95 127 -9 104 142 -42 -66 82 -189 -164 -254 -115 274 -140 -15 -114 -39
5930 -39 33 41 -43 185 211 120 49 -131 -81 57 -11 66 4 116 55 275 -353 115 46 277 8 -59 84 100 -234
5955 -234 -141 152 168 66 -252 44 40 -27 199 -140 -141 -213 43 -207 -194 -94 118 122 -96 -118 -28 -168 -270 21
$$ packed form
5788A6p8j67L71j35o2R5q3J0j11N44n75J05k6K1qK16m3k15N0j6M3m1K54j07j52
5813i4L44j74j05j73J74K67m40N3K22jl3k05J74j02m7L99j71j22j42Q6K85j45
5835E0q1J71j19j8l7L0KK7O3J5k28L16j19J54j6k3k78J60j73l23M42n4k8K09j71
5860b9l1L3j55K3K34J23j98j1P2P6j32j26K29j14k5lO5P4j25j4J21k90K41k47
5884b09M03o1k3J7l94K31O8Q7j93K78j19k65l8K57O8q6J91m82O87l35o0j25J79
5907G6p9J56j35j61K04l27L61L2j36J13L8j84k4J48k71K5r0J39L89m14J25r9P5
5930c9P2Qq4K28K6r1p1j80N0J38o8P7o2J12o1K20o28M68o9K31k69o7J43J6l34
5955b34R3K93J6j02l18K96mo7K26l39jp2K56k50J3J00K12Mk18k2R0j40j02K91
$$ plain form
5979 21 -170 -45 38 -170 196 -95 -181 190 -149 -122 -109 193 -98 -203 173 11 -125 90 -211 -86 -13 34
6001 34 -173 -38 169 -100 10 2 -60 -49 -124 -39 99 -70 83 -176 -107 -76 -282 -74 -134 -72 -189 -186 27 225
6025 225 -38 14 98 -294 -143 -182 -143 -205 8 160 -143 57 32 327 66 148 8 -16 -19 -153 109 -202 -397
6048 -397 -97 -160 -58 62 -104 -199 -69 -57 -9 62 121 -43 52 255 -116 -98 88 -9 -42 -417 88 82 50 123 166
6073 166 -51 -116 134 54 -147 335 -13 -15 268 -106 212 -50 134 -1 -61 -18 -2 86 89 -83 83 -65 89
6096 89 -90 94 116 79 -63 -321 -65 -68 -57 111 -105 -136 -103 -131 62 -87 -288 -209 -39 -332 0 -37 -56 199
6120 199 70 53 25 27 385 -2 363 202 -55 -251 55 63 66 66 22 141 -20 -150 367 204 93 32 252 -65
6144 -65 -182 132 -142 164 -183 -99 113 135 34 56 -170 83 -66 120 24 2 -134 -117 9 -83 16 -129 50
$$ packed form
5979B1j91J25Q3k08L66k91q6L71l39K7J3L02k91j05L76j62j36K15l01J25P3M7
6001C4k07J35K07k69J10qo2J1p5Q5J38j69J53k59O9L1k06K08o0O2j17LK13J98
6025B25k63N2Q4l92J51l9L9o2K13J52l03K00k5K95k61Q2j40k4lj34K62l11j95
6048c97L00o3J02J20j66r5J30J2M8P1N9j64R5K03l71J8J86r7l3l75N05ol2P3M3
6073A66k17o5K50q0k01M82l48kK83l74L18k62J84j35o0M3J6Q8Lj72J66j48J54
6096H9j79J84K2l7j42k58K56lJ1J68k16l1L3k8J93j49k01P9J70k93L32l7j9K55
6120A99j29j7k8KL58l87L65j61k57j96L06QL%m4J19j61j30N17j63j11o1K20l17
6144f5j17L14k74L06l47Q4K12K2j01K2k26K53j49J86r6k2j36J7J26r2R9j45J79
$$ plain form
6167 50 13 146 126 106 -42 -65 251 190 -35 106 -288 31 -417 -171 132 309 -35 -146 -64 -95 23 -35 -96
6190 -96 218 116 207 71 60 -46 -382 161 -28 128 253 -413 28 201 -8 60 26 -155 -60 226 -145 110
6212 110 -152 397 143 -73 -81 -8 -100 384 123 -16 -128 69 -21 -1 59 -206 4 106 271 0 -108 -74 201
6235 201 -312 94 336 -167 256 177 428 -124 -96 -125 -79 -156 109 -37 159 -5 -187 -61 21 -59 135 201 -177
6258 -177 240 51 -31 -7 102 -59 263 -12 -67 65 -166 -250 -100 -119 -76 -140 45 -214 -148 135 -9 -129 -106
6281 -106 321 -115 211 -118 -64 45 120 30 250 -17 99 151 299 181 146 -32 73 177 -36 69 -24 90
$$ packed form
6167E0l7J33k0k0j48k3L16o1k25J41l94L19m48K46L03J77l44j11Q2l1J18n8o1
6190i6L14j02R1j36j1j06l36N43j89J56J25o66M41J73k09O8l4j81R5K86l71K55
6212A10k62N49k54k16qP3r2M84k61j39j12J97r0K0O0k65K10J02J65k71j08L4K75
6235B01n13M06K42n03M23p9K51n52K8k9M6p7K65j46J96j64j82J26Q2q0J94O6l78
6258a77M17j89q2K4J09j61L22k75n5J32k31q4J50j9M3o4J85k59O6K83j44j20K3
6281a06M27m36L26l29N4J09P5r0K20k67J16N2J48j18l5j78J05J04k13J05r3J14
$$ [...]
8191B83
##END NTUPLES=NMR FID
##END=
