##TITLE=1H_DE-158rms
 200.13Hz, CDCl3.
 8 sc
 30.6.2026
##JCAMPDX= 6.0         $$ Bruker NMR JCAMP-DX V2.0
##DATA TYPE= NMR FID
##DATA CLASS= NTUPLES
##ORIGIN= UXNMR, Bruker Analytische Messtechnik GmbH
##OWNER= pz
$$ XWIN-NMR		Version 3.5
$$ Tue Jun 30 13:40:58 2026 Russian Standard Time (UT+4h)  she@DPX200
##.OBSERVE FREQUENCY= 200.1313
##.OBSERVE NUCLEUS= ^1H
##.DELAY= (6, 6)
##.ACQUISITION MODE= SIMULTANEOUS
##.ACQUISITION SCHEME= undefined
##.AVERAGES= 8
##.DIGITISER RES= 18
##SPECTROMETER/DATA SYSTEM= spect
##.PULSE SEQUENCE= zg30
##.SOLVENT NAME= CDCl3
##.SHIFT REFERENCE= (INTERNAL, CDCl3, 0, 14.3821)
##AUDIT TRAIL= $$ (NUMBER, WHEN, WHO, WHERE, WHAT)
$$ ##TITLE= Audit trail, XWIN-NMR		Version 3.5
$$ ##JCAMPDX= 5.01
$$ ##ORIGIN= Bruker BioSpin GmbH
$$ ##OWNER= she
$$ F:/spectra/data/she/nmr/H-C/1/audita.txt
$$ ##AUDIT TRAIL=  $$ (NUMBER, WHEN, WHO, WHERE, WHAT)
(   1,<2026-06-30 13:39:18.43 +0400>,<she>,<DPX200>,
      <created by zg, POWCHK disabled, PULCHK disabled
       configuration hash MD5:
       00 E9 B6 7A A2 85 ED C7 34 08 36 98 17 FE 4E 26
       data hash MD5: 16K
       C7 29 53 11 4D B2 E7 EC 7B C0 AE 42 38 9D 7C B8>)
$$ ##END=
$$ 
$$ hash MD5
$$ C8 2E 9E 2C 98 BB FE C0 17 A1 A8 2F 96 16 D9 BC
##$RELAX= 
##$RELAX= 
##$RELAX= 
##$RELAX= 
##$RELAX= 
##$RELAX= 
$$ Bruker specific parameters
$$ --------------------------
##$DU= <F:/spectra>
##$EXPNO= 1
##$NAME= <H-C>
##$PROCNO= 1
##$TYPE= <nmr>
##$USER= <she>
##$AMP= (0..31)
100 100 100 100 100 100 100 100 100 100 100 100 100 100 100 100 100 100 
100 100 100 100 100 100 100 100 100 100 100 100 100 100 
##$AQSEQ= 0
##$AQ_mod= 1
##$AUNM= <au_zg>
##$AUTOPOS= <>
##$BF1= 200.13
##$BF2= 200.13
##$BF3= 200.13
##$BF4= 200.13
##$BF5= 200.13
##$BF6= 200.13
##$BF7= 200.13
##$BF8= 200.13
##$BYTORDA= 1
##$CFDGTYP= 0
##$CFRGTYP= 5
##$CHEMSTR= <none>
##$CNST= (0..31)
1 1 145 1 1 1 1 1 1 1 1 1 1 1 1 1 1 1 1 1 1 1 1 1 1 1 1 1 1 1 1 1 
##$CPDPRG= <>
##$CPDPRG1= <>
##$CPDPRG2= <>
##$CPDPRG3= <>
##$CPDPRG4= <mlev>
##$CPDPRG5= <mlev>
##$CPDPRG6= <mlev>
##$CPDPRG7= <mlev>
##$CPDPRG8= <mlev>
##$CPDPRGB= <>
##$CPDPRGT= <>
##$D= (0..31)
0 0.7 0 0 0 0 0 0 0 0 0 0.03 0 0 0 0 0 0 0 0 0 0 0 0 0 0 0 0 0 0 0 0 
##$DATE= 1782812357
##$DBL= (0..7)
120 120 120 120 120 120 120 120 
##$DBP= (0..7)
150 150 150 150 150 150 150 150 
##$DBP07= 0
##$DBPNAM0= <>
##$DBPNAM1= <>
##$DBPNAM2= <>
##$DBPNAM3= <>
##$DBPNAM4= <>
##$DBPNAM5= <>
##$DBPNAM6= <>
##$DBPNAM7= <>
##$DBPOAL= (0..7)
0.5 0.5 0.5 0.5 0.5 0.5 0.5 0.5 
##$DBPOFFS= (0..7)
0 0 0 0 0 0 0 0 
##$DE= 6
##$DECBNUC= <off>
##$DECIM= 32
##$DECNUC= <off>
##$DECSTAT= 4
##$DIGMOD= 1
##$DIGTYP= 9
##$DL= (0..7)
0 120 120 120 120 120 120 120 
##$DP= (0..7)
150 150 150 150 150 150 150 150 
##$DP07= 0
##$DPNAME0= <>
##$DPNAME1= <>
##$DPNAME2= <>
##$DPNAME3= <>
##$DPNAME4= <>
##$DPNAME5= <>
##$DPNAME6= <>
##$DPNAME7= <>
##$DPOAL= (0..7)
0.5 0.5 0.5 0.5 0.5 0.5 0.5 0.5 
##$DPOFFS= (0..7)
0 0 0 0 0 0 0 0 
##$DQDMODE= 0
##$DR= 18
##$DS= 0
##$DSLIST= <SSSSSSSSSSSSSSS>
$$ [...]
##$SUBNAM0= <"">
##$SUBNAM1= <"">
##$SUBNAM2= <"">
##$SUBNAM3= <"">
##$SUBNAM4= <"">
##$SUBNAM5= <"">
##$SUBNAM6= <"">
##$SUBNAM7= <"">
##$SUBNAM8= <"">
##$SUBNAM9= <"">
##$SW= 18.0517328524113
##$SWIBOX= (0..15)
0 0 2 0 0 0 0 0 0 0 0 0 0 0 0 0 
##$SW_h= 3612.71676300578
##$TD= 16384
##$TD0= 1
##$TE= 0
##$TE2= 300
##$TE3= 300
##$TEG= 300
##$TL= (0..7)
0 120 120 120 120 120 120 120 
##$TP= (0..7)
150 150 150 150 150 150 150 150 
##$TP07= 0
##$TPNAME0= <>
##$TPNAME1= <>
##$TPNAME2= <>
##$TPNAME3= <>
##$TPNAME4= <>
##$TPNAME5= <>
##$TPNAME6= <>
##$TPNAME7= <>
##$TPOAL= (0..7)
0.5 0.5 0.5 0.5 0.5 0.5 0.5 0.5 
##$TPOFFS= (0..7)
0 0 0 0 0 0 0 0 
##$TUNHIN= 0
##$TUNHOUT= 0
##$TUNXOUT= 0
##$USERA1= <user>
##$USERA2= <user>
##$USERA3= <user>
##$USERA4= <user>
##$USERA5= <user>
##$V9= 5
##$VALIST= <valist>
##$VCLIST= <CCCCCCCCCCCCCCC>
##$VD= 0
##$VDLIST= <DDDDDDDDDDDDDDD>
##$VPLIST= <PPPPPPPPPPPPPPP>
##$VTLIST= <TTTTTTTTTTTTTTT>
##$WBST= 1024
##$WBSW= 4
##$XGAIN= (0..3)
0 0 0 0 
##$XL= 0
##$YL= 0
##$YMAX_a= 301896
##$YMIN_a= -377618
##$ZGOPTNS= <>
##$ZL1= 120
##$ZL2= 120
##$ZL3= 120
##$ZL4= 120
##$ABSF1= 10
##$ABSF2= 0
##$ABSG= 5
##$ABSL= 3
##$ALPHA= 0
##$AQORDER= 0
##$ASSFAC= 0
##$ASSFACI= 0
##$ASSFACX= 0
##$ASSWID= 0
##$AUNMP= <proc_1d>
##$AZFE= 0.1
##$AZFW= 0.1
##$BCFW= 1
##$BC_mod= 2
##$BYTORDP= 1
##$COROFFS= 0
##$CY= -3
##$DATMOD= 1
##$DC= 2
##$DFILT= <>
##$DTYPP= 0
##$F1P= 0
##$F2P= 0
##$FCOR= 0.5
##$FTSIZE= 0
##$FT_mod= 4
##$GAMMA= 1
##$GB= 0.15
##$INTBC= 1
##$INTSCL= 1
##$ISEN= 128
##$LB= 0.25
##$LEV0= 0
##$LPBIN= 0
##$MAXI= 10000
##$MC2= 0
##$MEAN= 0
##$ME_mod= 0
##$MI= 1.114404
##$NCOEF= 0
##$NC_proc= 0
##$NLEV= 6
##$NOISF1= 3.799351
##$NOISF2= 2.8
##$NSP= 1
##$NTH_PI= 0
##$NZP= 0
##$OFFSET= 14.38212
##$PC= 1
##$PHC0= -4377.593
##$PHC1= 9.192301
##$PH_mod= 1
##$PKNL= yes
##$PPARMOD= 0
##$PSCAL= 0
##$PSIGN= 0
##$REVERSE= no
##$SF= 200.129724274929
##$SI= 16384
##$SIGF1= 3
##$SIGF2= 2
##$SINO= 400
##$SIOLD= 16384
##$SREGLST= <1H.CDCl3>
##$SSB= 0
##$STSI= 0
##$STSR= 0
##$SW_p= 3205.1282051282
##$SYMM= 0
##$S_DEV= 0
##$TDeff= 0
##$TDoff= 0
##$TI= <>
##$TILT= no
##$TM1= 0
##$TM2= 0
##$TOPLEV= 0
##$USERP1= <user>
##$USERP2= <user>
##$USERP3= <user>
##$USERP4= <user>
##$USERP5= <user>
##$WDW= 1
##$XDIM= 8192
##$YMAX_p= 0
##$YMIN_p= 0
$$ End of Bruker specific parameters
$$ ---------------------------------
##NTUPLES= NMR FID
##VAR_NAME=  TIME,          FID/REAL,        FID/IMAG
##SYMBOL=    X,             R,               I
##VAR_TYPE=  INDEPENDENT,   DEPENDENT,       DEPENDENT
##VAR_FORM=  AFFN,          ASDF,            ASDF
##VAR_DIM=   8192,          8192,            8192
##UNITS=     SECONDS,       ARBITRARY UNITS, ARBITRARY UNITS
##FACTOR=    0.0002768,     1,               1
##FIRST=     0,             0,               0
##LAST=      2.2672688,     0,               0
##MIN=       0,             -377618,         0
##MAX=       2.2672688,     301896,          0
$$ Real data points
##PAGE= N=1
##DATA TABLE= (X++(R..R)), XYDATA
0@%%%%%%%%%%%%qJ6j6J9k7L2m0N2o0P2q8J04j20J44j71J95k27K63l00L44l94M46
34B36n04N68o40P21q07R02j006J120j244J379j526J688j865K060k272K500k755
51a445L035l342L685m068M497m979N527o160O899p771Q819j0110J1744j3894J6863
66I300k1259K8535m3448J27832k29217k5176L47663j70534m493K82693j20812
77A81084l53323J57398J44150k40440m9154K07073r2098q0915J67834n9624k43477
88b61492R2794J83307n311M7686P1423j49881q5670J59101O8633p9691O4385N5117
100A60401j30920m3825P6792p4874q4000J08845Q1528q7264p0684q291o0026k0886
112a53204J31452R0919p1166m8714K9533j5241p785P6032M5914l5383M274M0657
$$ plain form
0 0 0 0 0 0 0 0 0 0 0 0 0 0 -8 8 -8 11 -16 16 -24 28 -32 40 -48 56 -64 80 -91 104 -123 140 -160 184 -210 236
34 236 -268 300 -340 381 -426 476 -530 590 -654 725 -801 887 -978 1082 -1190 1310 -1445
51 -1445 1590 -1752 1933 -2135 2362 -2617 2910 -3250 3649 -4122 4697 -5413 6331 -7563 9300
66 9300 -11959 16576 -26872 100960 -128257 -153433 194230 23696 19203 301896 181084
77 181084 -172239 -14841 129309 -111131 -160285 46788 -45310 -126225 41609 -18015 -261492
88 -261492 -168698 14609 9298 56984 128407 -21474 -107144 51957 120590 40899 105284 160401
100 160401 29481 -14344 62448 -12426 -96426 12419 93947 6683 -64001 -72292 -132318 -153204
112 -153204 -21752 69167 -1999 -50713 -21180 -36421 -44206 31826 77740 42357 46631 87288
124H7288n0751o1454M7077J8961m1417M7484L0397j02785m2049N2821l5726k9116
136g9270J06903K4493j22576j162P2929p4630p824J68471K125j41759L7100O4947
148D9747q1094J7559J17070n0002q6215Q0901K8097j07831K071O2443m9723j633
160a8610P8208m7123q9983K0991K2229m227N1104J2114o9674j628N9615j2773
172B43j5797M2454j0858k1243O2058P420p6396j74L9543j0119J6547K2820o7124
185a0626n8795M5624L7029k1938L242p964n0290K3687O3645k8166l5850L1427
197h975J0909J285M0856l070o0607k147N4459R204j5484O794k6908l6162L2774
210B928K6913l7036k1929Q275j657Q006J6546j1552k4337R042K9902L917r570
$$ plain form
124 87288 36537 -24917 22160 41121 -296 47188 77585 -25200 -67249 -14428 -50154 -79270
136 -79270 27633 52126 -70450 -71612 1317 -73313 -81137 87334 89459 -52300 -15200 49747
148 49747 -31347 -13788 103282 53280 -32935 47966 76063 -31768 -29697 32746 -16977 -18610
160 -18610 59598 12475 -77508 -56517 -34288 -38515 12589 24703 -44971 -46599 13016 243
172 243 -15554 26900 16042 -5201 56857 64277 -12119 -12293 27250 17131 33678 56498 -10626
185 -10626 -69421 -23797 13232 -8706 -5464 -13428 -63718 -40031 23614 -4552 -40402 -8975
197 -8975 1934 3219 44075 41005 -19602 -21749 32710 41914 26430 33224 6316 -29846 2928
210 2928 29841 -7195 -29124 -20849 -22506 -14500 2046 -9506 -33843 -24801 5101 9018 -552
223e52J769l756M556K5309N701k0199j5374J085J3264N183n786n959j5676n598
237a6033J8765j91k1974l011R539L447N887J0280n269j7758R854K1543j0860m385
251a66J5152j1602p406K2301n80k0553K556Q031j1475n500J5190j877j7198J1166
265a961O761k1329N143J6925j3023k224J6742k393q051P130L405j2295k179J5442
279H093q02p966J0681k544j3130J0036M478j2613j031L804j282J513K655k079
293a87r242r49J0092o69j848M472n925J35J0938j132n659k513j760O719O887M70
309I829l198q539j59P143j390k700m536p041N868P890j251l692q449k213R468
324b970N349K027k570p900L480Q909K180j245p183m573O434O711M180n019j3962
$$ plain form
223 -552 1217 -2539 2017 27326 33027 12828 -2546 -1461 11803 16986 11200 5241 -10435 -16033
237 -16033 2732 2541 -19433 -22444 -12905 -9458 -3571 6709 1440 -16318 -6464 15079 4219 -166
251 -166 14986 3384 -4022 18279 17699 -2854 -298 7733 -3742 -9242 5948 4071 -13127 -1961
265 -1961 4800 -16529 -11386 5539 -7484 -9708 7034 4641 -3410 3720 7125 -5170 -7349 8093
279 8093 7291 -675 10006 7462 -5668 4368 8846 -3767 -4798 -994 -2276 -763 1892 -187
293 -187 -9429 -10378 -286 -955 -2803 1669 -4256 -4121 6817 5685 26 -2487 -4247 2472 9359 9829
309 9829 6631 -1908 -2067 5076 3686 986 -3550 -10591 -4723 3167 1916 -1776 -10225 -12438 -2970
324 -2970 2379 4406 1836 -6064 -2584 6325 8505 7260 77 -4496 1938 8649 12829 7810 -6152
339f152j780O055K040K811n928j0220M768J0269L542m448q881j914M568R507R318
354A3555r148j2469O516P624K530K052j0009j0659O915J3737K141j2039r527p10
368i491J513J0459O151j5680q561J1752Q629L814q32j3185j0534Q380J8088L870
382A4373j2027n429N6R59J0853J745j5185l597R227M953M72m771q569m421P071
397d290J2481l169j2226q7L286L820Q168l638j0642R41O997J900m365k424M156
412I08L664N985K116j5278j1187P203O781O356O472p788j3447j883O168J348j015
427c597O608J620p112L835q66j3456P100J5117n992k390Q607n892j0480P266N574
442E942j0099N486J7096j5853j9166J2151k375q120L0844J2917l6011j5077J5219
$$ plain form
339 -6152 -7932 -1877 163 2974 -2954 -13174 -8406 1863 5405 957 -7924 -9838 -5270 4237 13555
354 13555 4407 -8062 -1546 6078 8608 10660 651 -10008 -3093 10644 12785 746 -8781 -9491
368 -9491 -7978 2481 8632 -7048 -15609 -3857 4772 8586 7754 -5431 -15965 -7585 10503 14373
382 14373 2346 -3083 -3027 -2068 8785 10530 -4655 -8252 975 5928 6400 1629 -6940 -11361 -4290
397 -4290 8191 5022 -7204 -7291 -4005 -185 7983 4345 -6297 -5356 1641 3541 -824 -3248 908
412 908 4572 10557 12673 -2605 -13792 -6589 192 6548 13020 5232 -8215 -10098 -3930 -2582 -3597
427 -3597 3011 4631 -2481 1354 488 -12968 -5868 9249 3257 867 9474 3582 -6898 368 5942
442 5942 -4157 1329 18425 2572 -16594 -4443 -6818 -14938 15906 28823 -7188 -22265 -7046
455g046k806K898K9587m472l5961J1687K3164k8476n085L3909j2068j4676L4601
468B5256m617m9790O028L3946j1696q72L1477k4612m3792L3691K5148l8907P859
481a0881L9115k5740j8613L1764j4938m0496L6199M6328k9894k1055J8619k9208
493a8800k3108O0926K5998n1590n524K3953k8089p784M3904n881m1101K8801L7797
506C9502m2224k6198L0608j1599j5055N4841J6081o0751j2461L2615j6191j0208
518b1040M8776L879n3618J2128L5327m2257j7122N5207P49l5218K6719P158n6537
531c5849N149O1715j3954l6717L4898J635n5913K3237M8315m1424j6728N4914
543B9278r554m6870K7261J5887m7754J6077O3373k9513m4971L7390q62m8335L6459
$$ plain form
455 -7046 -9852 -6954 22633 18161 -17800 -6113 17051 -11425 -16510 17399 5331 -9345 25256
468 25256 20639 -29151 -23123 10823 -873 -1745 29732 5120 -38672 -4981 20167 -18740 -10881
481 -10881 28234 2494 -16119 15645 707 -39789 -3590 42738 12844 -8211 10408 -18800
493 -18800 -41908 19018 45016 -6574 -12098 11855 -16234 -24018 19886 14005 -27096 1705 39502
506 39502 -2722 -28920 1688 -9911 -24966 29875 45956 -14795 -27256 5359 -10832 -21040
518 -21040 27736 31615 -22003 -9875 25452 -16805 -33927 21280 22029 -13189 13530 20688 -35849
531 -35849 -30700 31015 17061 -19656 15242 16877 -39036 -15799 32516 -8908 -25636 29278
543 29278 19724 -27146 115 16002 -31752 -15675 47698 18185 -26786 10604 9742 -38593 -2134
556b134M3823m6472j4721M2704k3808l9096M3304K2879m3983R655L6521m2048
568a3376k2760N4370K225m0071K4724J7882m0648L762M1506k1118k9558L4022
580A0960J2714l4859O980J7981l2963m269M3863k833l1690Q282O763j9842R870
593i043K8719j3457k1572J7668P942j8238O186J3514j2489k59J8152q257k2302
606a3436O054J6622l704l503M906j4185j3557J7751J2568j1861l186M639n741
619f633Q66J1982l930j5022Q554J8757l623o507O51j2466l151K2044P058j4774
633C806n537r35p268M894J3632o906j3653P995M998j0274M187O139r400N630J5224
648A2532r076j1740P623L803k765J0980N923j7189o763J2216m661p235J2900j068
$$ plain form
556 -2134 41689 -4783 -19504 23200 -608 -39704 3600 26479 -17504 -7849 28672 -13376
568 -13376 -36136 18234 20459 -19612 5112 22994 -17654 -13892 27614 6496 -23062 10960
580 10960 23674 -11185 -4205 13776 -19187 -23456 20407 17574 -14116 -5834 929 -18913 -9043
593 -9043 19676 6219 -15353 2315 10257 -7981 -1795 11719 -770 -1029 17123 8866 -13436
606 -13436 -7382 9240 5536 2033 6939 -7246 -20803 -3052 9516 -2345 -5531 -892 -6633
619 -6633 -5767 6215 2285 -12737 -4183 14574 10951 4444 5095 -7371 -10522 11522 18580 3806
633 3806 -1731 -2666 -9934 -5040 8592 1686 -11967 -3972 1026 -9248 -5061 1078 -8322 -2692 12532
648 12532 3456 -8284 -661 3142 377 11357 17280 91 -6672 5544 883 -6352 6548 5480
662E480j3361P852M017j7115j826J4581l68l274J1205k507j8152N791J4921p584
676c40J624J4842r682j2475J0738J957j0715O544J0044j1263q636Q954l162j1198
690a2768J1039P492j3379J195J0123r231n926J1207L956m509O273N919j2172p377
704h158J1448L377m731P533M12j3463q33P302l799n528M562L552n270J77M551
719A132q483n283J2333N258n692J619J251n431J838R365L3q558J504N586n470
734A002o65N997o935n696Q734J568q731j419K516k237J275Q414j101j0036K780
749d534O546l856K617O243n935l003P482J241n597o66K168k738r7N635l239q306
765f039K736K708l352K251J419n163k81N022J984j404k3R10j550J537M625j748
$$ plain form
662 5480 -7881 -29 3988 -13127 -14953 -372 -740 -4014 7191 4684 -13468 -7677 7244 -340
676 -340 1284 16126 6444 -6031 4707 6664 -4051 2493 12537 1274 -7362 1592 -1570 -12768
690 -12768 -1729 5763 -7616 -6421 3702 -5529 -11455 -248 3708 -801 5472 11391 -781 -8158
704 -8158 3290 6667 1936 9469 9881 -3582 -4415 2887 -912 -6440 -1878 1674 -3596 -3419 1132
719 1132 -7351 -12634 -301 4957 -735 884 2135 -3296 -1458 7907 7940 -618 886 6472 1002
734 1002 337 6334 -601 -6297 2437 4005 -4726 -6145 -3629 -5866 -4591 3823 2722 -7314 -4534
749 -4534 2012 -1844 773 7016 1081 -1922 5560 6801 1204 538 2706 -32 -129 5506 2267 -6039
765 -6039 -3303 -595 -3947 -1696 -277 -5440 -5721 -699 1285 -119 -142 768 -782 755 5380 3632
781C632k994K136K3o10J578j929l402n58J125J385p62j873j288j359J809K640
797d47j050o61K61M64L100J733j719q38m21J179K806j31j874j911p73J695M21
814A834j780j787k229N14K868k46j316q19j161J874K696J15m70l98P38K204O32
831C269m09j297j333J642J124r53l23j819j397J454l60j734n32o49P94J553L09
848f61n56j295P14K296K13N20O51j438J174K148j053q95m39j303J32P24N15r23
866E24j745j11p53r69K101K79j948Q11L85k47K346R35j264j077K01J756J167P71
884C162R1l171p96K903k39j285l97k417m44K648J066j473k359m50J042K46K045
901A72R44k751Q03K750j204n65P00m17O64J585M50k659k324K936J524k600j3r99
$$ plain form
781 3632 638 2774 2797 2187 3765 1836 -1566 -2124 -999 386 -376 -2249 -3537 -4896 -3087 -447
797 -447 -1497 -2158 -1897 -1433 1667 3400 1681 843 422 1601 4407 4276 2402 491 -282 1413 1834
814 1834 54 -1733 -3962 -3448 -580 -826 -2142 -2961 -4122 -2248 448 563 93 -305 433 2637 3269
831 3269 2860 1563 230 1872 2996 2043 1720 -99 -1496 -42 -402 -2136 -2668 -3317 -2523 -970 -661
848 -661 -1217 -2512 -1798 498 711 1231 1882 444 1618 3766 2713 1818 1379 76 208 932 1447 524
866 524 -1221 -1332 -2085 -3054 -953 -674 -2622 -1811 -1426 -1673 673 1608 344 -733 -532 1224 2391 3162
884 3162 3253 82 -714 2189 1950 665 268 -2149 -2593 55 1121 -352 -2711 -3161 -2119 -1873 172
901 172 1116 -1635 -832 1918 714 149 849 432 1096 2681 3131 472 -1852 1084 2608 8 -5 -1004
919a004l175K919M165k492l582J10J520N45K216J636n095k659O851K515l186Q90
935B174j679m681L831O401k288n323Q56P70l116L177M234o564k837O762j187m420
951c890M441J147n300K102N308l880l972O325J612o287K981M133p052oP714l917
967A459n912N315K287n468J351M354o275l890R014J878p019K864K360p494J607
982c569Q673k504n275M121J295o166J831O901m360l987O270j235o855M452M453
997D045n734j082N150k052m545M630K743o903M63P511k483l577M399k266o293
1012e994N206O958l643l652K793k536m683O043M839o621q00N370l861l654N200
1027I65L66m770L588N122n298m010M851k75l584N540K239p130qM912l186k631
$$ plain form
919 -1004 -4179 -1260 2905 413 -3169 -3059 -1539 -994 1222 2858 -2237 -4896 1955 4470 1284 2174
935 2174 495 -4186 -355 6046 3758 -1565 -709 61 -3055 122 4356 -2208 -5045 1717 530 -3890
951 -3890 551 1698 -3602 -1500 3808 -72 -4044 2281 3893 -2394 587 4720 -2332 -2338 5376 1459
967 1459 -4453 862 3149 -2319 -968 3386 -2889 -6779 2235 4113 -2906 -42 2318 -5176 -3569
982 -3569 5104 2600 -2675 1446 2741 -3425 -1594 5307 947 -3040 3230 1995 -4860 -408 4045
997 4045 -1689 -2771 2379 327 -4218 412 3155 -3748 -3285 4226 1743 -1834 2565 299 -5994
1012 -5994 -788 6170 2527 -1125 1668 -868 -5551 492 5331 -1290 -2090 3280 -581 -4235 965
1027 965 1331 -3439 149 5271 -27 -4037 814 539 -3045 2495 4734 -2396 -2404 2508 -678 -3309
1043c309M733P86l623K500K211o400k330O322J286j557L164k079o602J650N119
1058A871n29r37J862j671l344K316J826l688K68M082j032j107J478k380k509K577
1074i17L059m99o81K59k164j792K707J485j352J427M90l081q56R46l36R76K191
1091A862l9k358j196N90n88R65L033m33j825P83p96j764J019J513K09K06N58j202
1109E37k579L46J808p09P63K168j970k158Q80j60m66K032K052j176k145M58l63
1126f82j452K903K467k872q01J446j885j068K352O18j518R33J779k667k424K346
1142e25L30j469L437J243m305p23K233j057m47K955M76l054L03K188k521j283
1158b219L733j91k228K378N4l652K76K907m19j255J629p8l227Q32K894j914p68
$$ plain form
1043 -3309 1424 2210 -1413 1087 3298 -3102 -5432 890 2176 619 3783 1704 -4898 -3248 1871
1058 1871 1342 405 2267 596 -2748 -432 1394 -2294 -2026 2056 1024 -83 1395 -985 -3494 -917
1074 -917 2142 1643 962 1221 -943 -2735 -28 1457 105 1532 2022 -1059 -1915 -969 -1305 -329 1862
1091 1862 1823 -535 -1731 -1141 -1729 -764 2269 1836 11 794 -2 -1766 -747 766 975 1181 1739 537
1109 537 -2042 -1696 112 -597 166 2334 364 -1794 -914 -1074 -1540 492 2544 1368 -777 -319 -682
1126 -682 -2134 769 3236 364 -437 1009 -876 -1944 408 1026 -492 441 2220 -447 -2871 -525
1142 -525 -195 -1664 1773 3016 -1289 -2012 221 -836 -1283 1672 2148 -906 -603 1585 -936 -2219
1158 -2219 1514 1323 -905 1473 1527 -2125 -1849 1058 639 -616 1013 935 -2292 -1460 1434 -480 -1248
1175a248K871r43k127J515O25j871M76K594l47k086Q84N06k453R94K594j586j182
1192g84J412p57j557J130J347j208o75J751j32j944J305J116j816N41J901r85
1208F45j141Q69K04r94O29J528j397j790J460R9j358J279Q44j793j26J380l43
1225ej116J001P12r85M52J527j234j369J431K58p80Q72J68j299l31J069p0j025
1243g24L28M20j006M62J183j085o10J077J45k40L60N4o28J18R71J12q78K03K9
1262B91o02M76M07q10k36L20M6q2q0L7k72k8O96J64m45K98K8k00K83Kj30l7j4
1285A12K14l8k48J19k57k62L00m4n3J59j91k3N3k6J97q7j80M03p9P7K89k90l70
1308b25J46P2L36O7l35j61j43L19L53l97l22q1o4O15L37n27l38j15J25N96Lk80
$$ plain form
1175 -1248 1623 680 -1447 68 693 -1178 -702 1892 1545 -541 343 849 -1604 -610 1984 398 -784
1192 -784 628 -129 -1686 -556 791 -417 -1092 659 527 -1417 -112 1004 -812 -271 1630 645
1208 645 -496 373 577 -417 212 1740 343 -1447 13 112 -1246 33 877 -916 -1042 338 -5
1225 -5 -1121 -120 592 -393 59 1586 352 -1017 414 672 -108 764 932 -367 -698 371 301 -724
1243 -724 -396 24 -982 -520 663 -422 -1032 45 190 -50 310 364 -264 -146 825 937 59 262 291
1262 291 -311 165 572 -238 -474 -154 -108 -190 -270 -233 -505 -533 163 327 -118 180 208 8 291 293 163 126 112
1285 112 326 288 40 159 -98 -360 -60 -104 -157 2 -189 -212 -159 -185 12 -75 -255 148 69 146 435 145 -225
1308 -225 -79 -7 329 396 61 -100 -243 76 429 32 -290 -371 -435 180 517 -10 -348 -463 -338 258 261 -19
1330a9l17o9O73K82l72j60l30o7Q62L2l30j82k88L39L10l30k50k80Q8P26j22l40
1352a44q2l26L75O32l54l26k1J23O67K19l81n12m17O22O56k92l14l70m49P01M86
1373D93m88n95j98K48N84K66J06o16n37Q14L76j84J04k28m99O00M30k73m10j43
1393a50Q6k73L6N96n09l71Q01k89o45M45K56k97L31N76k94n61N17L98r33K10P79
1414G09o70l33J066m66j109N41L75p11P3J137n35j098Q72N77j119P29J278j408
1432i2p37J281m0o76J119N14j960o37J756k64j084J262J52j912R74J599j655j146
1450a546J552K76p84J441P22k534q36K342Pr17J613k57k369O90J731j410r89J886
1468F18J44j734P74Q89k249J48K908m51j756J005j52j748J306K331j295j560J653
$$ plain form
1330 -19 -336 -405 268 550 178 18 -312 -379 483 515 185 3 -285 54 364 34 -216 -496 -408 318 196 -144
1352 -144 -226 -552 -177 455 101 -225 -246 -123 544 763 382 -130 -547 75 731 439 125 -245 -694 7 493
1373 493 5 -590 -788 -540 44 310 416 -200 -737 77 453 269 373 145 -354 246 676 403 -7 -150
1393 -150 -64 -337 -301 295 -214 -585 216 -73 -718 -273 -17 -314 17 593 299 -262 255 653 -280 -70 709
1414 709 39 -294 772 306 -803 -262 113 -598 -525 612 77 -1021 -149 428 -691 38 1316 -92
1432 -92 -829 452 412 -264 855 1369 -591 -1228 528 264 -820 442 594 -1318 -344 1255 -400 -1546
1450 -1546 6 282 -502 939 1661 -873 -1709 633 640 -277 1336 1079 -1290 -600 1131 -279 -1268 618
1468 618 762 -972 -198 691 -1558 -1410 1498 1047 -709 296 144 -1604 -298 2033 738 -822 831
1485H31K9k002Q45J022j774N60K564j053k470L88K67q38J767K375j680k326J069
1502d26K14j075J688J435j827j84J542j099j753J266R63q87P09J107k203j650
1518b180J688M90n12J451L35k234m07J203l32j13J759M90j426n4N1j578L22K251
1536A204O4n23K71j209j836O60J462J05L72N54j345j460R91M49n59J414R35j438
1554A11k08N24j051l39J800N60q59K11j65k195k32K488K50q07R78j034k442J052
1572a358J977o64J18J508j050k015J218P44j962J196K962j371j855J142j051j898
1588b359K367K428k088j109J555j432j961K881J325k906Q69K545k551j684K683
1603E63j55k024K568K140l689j515L118q52j786L639P69m669L67L148k288j371
$$ plain form
1485 831 860 -1142 -297 725 -1049 -489 2075 1022 -1448 -1060 -793 -1631 136 2511 831 -1495 -426
1502 -426 -212 -1287 401 1836 9 -175 1367 268 -1485 -219 744 -143 566 1673 -530 -2180
1518 -2180 -492 -2 -514 937 1272 -962 -1369 -166 -498 -611 1148 1638 212 158 209 -1369 -1047 1204
1536 1204 1268 745 1016 -193 -2029 -1369 93 198 570 1124 -221 -1681 -690 -241 -800 614 1549 111
1554 111 -97 427 -624 -963 837 1397 538 749 584 -1611 -1843 645 895 88 1066 32 -2410 -1358
1572 -1358 619 -45 73 1581 531 -1484 -266 478 -1484 -288 2674 1303 -552 590 -461 -2359
1588 -2359 8 2436 348 -761 794 -638 -2599 282 1607 -1299 -430 2115 -436 -2120 563
1603 563 408 -1616 952 3092 -597 -2112 1006 154 -1632 2007 2776 -1893 -1526 1622 -666 -2037
1619b037L588q3l472J895K468l976j147M315p80k507L366O22m828Q29M131j997
1635C87j907L465m03m324K331L480l904j210M060j681l051L596J234m346Q50M011
1651B588k478k544L637j15l871K909L377m010j390L581j498k527L644J311m276
1666a662J74L618k291k293L572Q5l651K358K650l556j071L542p48k380K715R71
1682B033l933K06L754j386j964K790l59l473J668K482k475p92K814n83k293J879
1698C68R56l113M42L301j178j660J963n01k476J647K127j777j041J803o52j765
1714a556J900J020k458J69K010j342r12J716N8j556J061J388j619q51J438l72
1730I4r38J733M64j959l4Q82p36j15J236j43j192N49P81r66k98R84n31l36J321
$$ plain form
1619 -2037 1551 1468 -2004 -109 2359 -1617 -2764 1551 771 -1736 1630 2252 -2576 -1747 2384 387
1635 387 -1520 1945 1542 -2782 -451 3029 -875 -2085 1975 294 -2757 839 2073 -2273 -1423 2588
1651 2588 110 -2434 1203 1088 -2783 126 3503 -507 -1897 1684 186 -2341 1303 2614 -1662
1666 -1662 -1488 2130 -161 -2454 1118 1203 -2448 -90 2560 -996 -2067 1475 727 -1653 1062 2033
1682 2033 -1900 -1694 2060 674 -1290 1500 1141 -2332 -664 1818 -657 -1449 1365 782 -1511 368
1698 368 1324 -1789 -1347 1954 776 -884 1079 578 -1898 -251 1876 99 -942 861 209 -1556
1714 -1556 344 1364 -1094 -925 1085 -257 -1169 547 605 -951 110 1498 -121 -972 466 94
1730 94 -844 889 1353 -606 -640 242 -494 -609 627 484 -708 -159 622 -344 -642 342 -189 -525 796
1749G96m3j262J97L88j31L29M61n60j043N05P63k84J30K4r51J45Q96k08l43J7
1769a74J13J63L63O0q25o16P97O61p7P5o59p70O14P71k47l40l00J69M58L24j16
1790D44j014k80R16M35lj23p87k97Q34N91l22o74m19K99M77M73K7j013k47O30
1810e3J93J44o1n36P1N16K90j30o03j71K60K2L59N2o97R3L26p4j42k00q7L14K54
1833A40K16k41n06L32L46k18K36k16m12L96L23p5j99l78j64O7K89M79l35m17J39
1854a98j75O9N49j36l74J14L7K84L42J2l96n83J17O49q8K56j39q77L8P82K3k29
1876G7l50k58P7M10O74k54r66J19M48j10M97J06p85L3P32J39n81k41J18j20K66
1897C1P28o10q51O60L61m75J50M1n87K18J090Rj299j76Q64q2K21O24j185j014
$$ plain form
1749 796 753 -509 -312 76 -55 274 735 175 -868 -363 400 116 246 270 -681 -536 360 152 -191 -174
1769 -174 -61 102 465 525 -300 -916 -119 542 465 540 -119 -889 -275 496 249 -91 -391 -222 236 560 444
1790 444 -570 -850 66 501 498 375 -412 -709 125 716 394 -280 -699 -400 77 550 577 -436 -683 -53
1810 -53 140 284 223 -313 -242 274 564 434 -169 -340 -80 -58 301 353 -344 -251 75 1 -141 -341 -428 -114 140
1833 140 356 115 -391 -59 287 69 305 89 -323 73 396 321 122 -256 -420 -353 -64 415 80 -337 -198
1854 -198 -373 -304 245 109 -265 -151 -114 170 512 524 128 -455 -338 311 223 479 340 -537 -499 283 306 77
1876 77 -273 -531 -454 -44 630 376 -590 -471 -23 -133 364 470 -315 -282 450 589 8 -233 -115 -235 31
1897 31 759 149 -702 -42 319 -156 -6 35 -552 -334 756 765 -534 -710 154 72 293 917 -268 -1282
1917a282J247J024n55l42j93p47nJ663L30j672k8Q31o31L60R38j230r58J269R66
1936I85o82m28L30q84l74J905J99j580M53O06j117K82R64n71q00Q91N34j138j74
1955e99R73n32k30J307m62j500P04P16m76Q9P66o09q38O77N72r88M7J055p26k52
1975c06R14o08j017N78N37q8L27M57q02r12N94O13l85O30K12j200o5Q85j67j57
1995D0K03k71m86L60N77n17m50N59j95j34Q30m40j014P29N98j91L32N1q60m84
2015g63J037N64r02J36N35j134J31J271j122r66J315K59q67M96N21j241k58J942
2033I54j40j795Q59P79j420J040J742k028j411J844J61j409J055J148k221m60
2049a302K697j043k444K058Q93k227J367J951k616j465K838N02k104J472J388
$$ plain form
1917 -1282 -35 989 434 92 -101 -848 -853 810 1140 -532 -560 271 -360 0 938 -292 -1250 19 985
1936 985 303 -125 205 -679 -1053 852 1051 -529 -76 530 -587 -305 659 88 -712 179 713 -425 -599
1955 -599 374 -158 -388 919 457 -1043 -339 377 -99 -10 756 147 -691 -14 558 -430 -383 672 -54 -306
1975 -306 608 0 -1017 -439 98 10 337 794 -8 -920 -326 287 -98 532 744 -456 -521 364 197 40
1995 40 243 -28 -514 -154 423 -94 -544 15 -180 -314 516 76 -938 -209 389 198 530 581 -279 -763
2015 -763 274 838 -64 72 607 -527 -396 875 -247 -1213 102 361 -506 -10 511 -730 -988 954
2033 954 814 -981 -122 657 -763 277 2019 -9 -1420 424 585 -824 231 1379 -842 -1302
2049 -1302 1395 352 -2092 -34 859 -1368 -1 1950 -666 -2131 707 1209 -895 577 1965
2064A965l357l50L759j098k454K531M34l371J059K644k446j407L522K43l501J463
2080c64J766l545J88M648j251l053K428L49l680J415L824k172k114L462n18m284
2096b901K249K685l326M0M177k240l707K770J325l149J612L906l181l066L711
2111I05o1l483L141K853l923q43L494j923l257L483K144l536P45L119l921k747
2127c810M301P19k798K633J835m480j219L911n66k427L269J381m221L26L246k789
2143f89j618L981L01l134J385J394l568n74M092l85k569K233M22l782R82L418
2159A889j724j102K588n88k911J294J922k077l6L087j212k648J596L09k242J480
2175c75K400j691j505J372k97j702J605J675j898k76J981j098j500J504L21j185
$$ plain form
2064 1965 -1392 -1742 2017 919 -1535 996 1430 -1941 -882 1762 -684 -2091 1431 1674 -1827 -364
2080 -364 1402 -2143 -1955 2693 1442 -1611 817 1166 -2514 -1099 2725 553 -1561 1901 1383 -2901
2096 -2901 -652 2033 -1293 -1253 2924 684 -3023 -253 1072 -2077 -465 3441 260 -2806 905
2111 905 844 -2639 502 3355 -568 -1411 2083 160 -3097 386 2530 -1006 -261 2858 -1063 -3810
2127 -3810 491 1210 -1588 1045 2880 -1600 -2819 1092 526 -1901 1368 2749 -1472 -1146 2100 -689
2143 -689 -2307 1674 1975 -1159 226 1620 -1948 -2522 1570 1185 -1384 849 1271 -2511 -1529 1889
2159 1889 165 -937 1651 1063 -1848 -554 1368 -709 -745 2342 1130 -1518 78 387 -1855 -375
2175 -375 2025 334 -1171 201 -96 -1798 -193 1482 -416 -692 1289 191 -1309 195 516 -669
2191f69J098J185j461j264R19L90o26J250M99k216l39J399m17j98J079l65q73
2208f09L83P17q46l91J064L7k54Q52l99j554M59Q87j60L05J55p37n79N16M55n31
2228b30j02M83m32L0Q21p42p20Q10L45k12K93j56o73L0R22K26o51R2O3p73M81
2249i5P66p49k41N34j94k90L08r9n10J49Q78j51o76M76l4o63P79L52o74O3M06
2270C35j62j82J60Q1o05RQ17k84m81M73k60m17O82J32m67j83K86J14k5L49J07
2291D79q81j10Q04j35p9M33n35m05L93K99p7l81rl3K9M66L19q29j55L18m7L25
2313A89K22m40k86J29M64O3n04M7l4j70O11Q9n80O4J80L4M3j48j31j0J75M87j78
2336C16o01J07L4J38M40l18m46M8L38L67r7n38j30j78M82O32k70n02q2k1L73M11
$$ plain form
2191 -669 429 1614 153 -1111 -192 198 -428 822 1321 -895 -1234 165 -252 -450 629 264 -609
2208 -609 -226 491 -355 -746 318 355 101 953 554 -1000 -541 346 186 491 646 -91 -670 -154 301 -230
2228 -230 -332 151 -281 -251 570 -172 -892 -82 263 51 344 188 -485 -455 467 693 42 134 197 -576 -95
2249 -95 671 -78 -319 215 21 -269 39 -60 -570 -421 457 306 -370 106 72 -591 188 540 -134 -71 335
2270 335 173 -9 151 232 -373 -364 453 169 -312 161 -99 -516 166 298 -169 -352 -66 48 23 372 479
2291 479 -402 -512 292 157 78 511 -24 -429 -36 263 186 -195 -204 -237 -208 258 577 -252 -407 -89 -136 189
2313 189 411 -29 -315 -186 278 341 -163 -116 -150 -320 291 380 -200 -136 44 78 121 -27 -158 -168 7 494 316
2336 316 -285 -178 -144 -6 434 116 -330 -282 56 423 326 -212 -342 -520 -38 594 324 -178 -260 -281 92 503
2358E03l24m10j59K49N48n4j47l84m81N22N29k61j76Jj88L51L8l3j80k35L23J08
2380A40j57K06j61k63K59J06j98k6J11Q6K0n0N7l67m1N07j78k34K73p5k56M42
2402B01J15l47k83J03K16j27L47K23p06q1N60k42jL12k65l39L47L02r8l15N3j26
2424a51k71O59L58q25J7K68l59K79L27l58l41K08M36N3k10Q7m07l20Q73J24n49
2445a02K03n1k20K56O0k02k31J92L79j76j21L7m11K20O70l62l10J27j55J53M39
2466C95n9l71k28K51J48l12K73j8n28O63L69q05k21K24k46M11P36j34r35j52N97
2487E8k29K9Q83n73p46Q89K07j106L87M09j51j4O19k59j390O02Q55o22K04J096
2507A148j373j038J358M02r54O93P57j244o13J355k77j380J402J137j807J48J216
$$ plain form
2358 503 179 -231 -390 -141 407 353 206 -178 -659 -137 392 131 -45 -44 -232 119 157 124 -56 -291 32 140
2380 140 -17 189 28 -235 24 130 -68 -94 17 103 123 73 130 -237 -278 229 51 -183 90 15 -241 201
2402 201 316 -31 -314 -211 5 -122 225 448 -258 -339 221 -21 -22 290 25 -314 33 335 237 -78 -25 -151
2424 -151 -422 237 595 -230 -213 55 -304 -25 302 -56 -397 -189 247 300 90 177 -230 -550 323 447 -102
2445 -102 101 50 -170 86 146 -56 -287 -95 284 108 -13 24 -387 -167 503 141 -169 -42 -197 -44 395
2466 395 336 -35 -263 -12 136 -176 97 79 -449 214 583 -222 -443 -219 -465 -54 682 548 -387 -539 58
2487 58 -171 -142 741 168 -578 311 518 -588 -201 208 57 43 662 403 -987 -385 470 -152 52 1148
2507 1148 -225 -1263 95 497 -457 236 993 -251 -864 491 214 -1166 236 1373 -434 -286 930
2524I30j631q16K046N32j518N89R41j832p18K380k37j811J800P59k506K15J838
2541I61j275q73K407K64k544L99J629j890k07L099q53k653J552P30k260Q57K487
2558A830j548j656K179K16k799J122K166k124k40K941j292k839J752J194j954
2573a052Q72K588k030k479K308N28k387J647K205k668q77K523q84k158K038J493
2589A667k293R6K292j951k048K840Q83k531J176J689k691q45K593l33j939J797
2605D02J309k617j92K226j596j352K919N02k426P22J064k014l30K756k65k099
2621i91J172Q69k238M08K192j492j195K063L9j814P13J080j502k04K150m24j911
2638a085J085O64j674Q04J718j416r67J171m2j145Q93R32j196l41J335n50j215
$$ plain form
2524 930 -701 -1517 529 1061 -457 132 1073 -759 -1477 903 666 -1145 655 1414 -1092 -877 961
2541 961 -314 -1187 1220 1484 -1060 -661 968 -922 -1129 1970 1117 -1536 16 746 -1514 -657 1830
2558 1830 282 -1374 805 1021 -1778 -656 1510 -614 -854 2087 795 -2044 -292 902 -1052
2573 -1052 -180 2408 378 -2101 207 735 -1652 -5 2200 -468 -1345 1178 294 -1864 174 1667
2589 1667 -626 -530 1762 -189 -2237 603 1486 -1045 131 1820 -871 -1716 877 544 -1395 402
2605 402 1711 -906 -1098 1128 -468 -1820 1099 1601 -825 -103 961 -1053 -1383 1373 1108 -991
2621 -991 181 1050 -1188 -780 1412 -80 -1275 788 827 -987 -274 806 -696 -900 1250 826 -1085
2638 -1085 0 664 -1010 -206 1512 96 -871 300 258 -887 6 938 -258 -599 736 186 -1029
2655a029J074L28r25P31O66j027m81Q55L1n80N39M48r83N4R59o63o11Q22j68m17
2675c77O61J10o79j61N37nk01L90r6p77N25N76o76J84K95o11R0N54j57m38J67
2696h9K49k34k0N98n71n48P45J19m86M80J76p84J83M43k50m05M01K53n70L48N63
2717F01q89k47Q21k51k80O62r5p71K60O08k95n19N35L9o67N69N27r63r8P24l01
2738c0k60N72n5p53L04P03k81l89N80k32o68O58M51q07pN48l31l31M17J7n75J46
2760c23Q15m03m23M99k18m06O65K30o33PN02j14k97K49K0n99L27O45m78l50L03
2781A8k61r2N33J11m92k28L91J53r5K24o0n55J66N57k82n2J29j64j10K11K03l51
2803d6k97K87J04j63L00j34m03K03J94j05JN1L2m0%K49k30j83L53q3r1Q3n3j63
$$ plain form
2655 -1029 45 373 -552 179 845 -182 -663 192 223 -357 182 630 -353 -299 660 -3 -614 208 40 -377
2675 -377 284 394 -285 -446 91 86 -115 275 179 -598 -73 503 -173 11 306 -305 -215 339 182 -256 -89
2696 -89 160 -74 -94 504 -67 -615 130 249 -237 243 419 -365 -182 261 11 -394 7 260 -310 38 601
2717 601 -288 -535 286 35 -245 417 322 -449 -189 419 124 -395 140 179 -488 81 608 -355 -453 271 -30
2738 -30 -290 282 227 -526 -222 481 200 -189 391 159 -509 149 600 -207 -214 334 3 -328 89 106 -469 -323
2760 -323 492 89 -334 165 -53 -459 206 436 -197 -190 312 198 -99 150 170 -429 -102 543 65 -285 18
2781 18 -243 -335 198 309 -183 -411 -20 133 38 262 202 -353 -187 370 88 36 165 1 -109 102 305 -46
2803 -46 -343 -56 48 -115 185 51 -352 -149 45 -60 -59 -8 24 -16 -16 233 3 -180 173 90 -1 82 29 -134
2827a34K07K9j2k19m2K08r0O6K02l59r8K22j1M3J41k13j4L8J16J83k07j91Q0n0
2851a05K10J77k01j33n4l1J96P5j90j7j14J93J56j82K3j05j54K59J59j77P1q5
2873b9J1J40j5j3l3k14K42M9j10Q8k25m2J74n1n3M1m7J62pn5Q8l26J14K68j31
2898B6L2L0k46J52J81l7m7j78l8J69ON8k1l12J18J63k2K8n0k18K06J08M8n5k69
2923a68K6J46R1J95k08k74K27n5j6K72j44k09M9J26n1Mq9M3j52K06J87l51K2J94
2947G1k02R8K64j57k29J03J29k4r6K45q4k84K60O2l94K32K56l17M2J39j59k77
2969c22K52L46l39p0L86k99k58N40k2n15L22K33l16J9K63j15n65M41L98n17m1
2990a79M62n45k97Q63J02o33J93K47m31n5P61j55q02N26L74p43J63O21o18l53
$$ plain form
2827 -134 73 102 90 -129 -171 37 -53 13 215 -144 -242 -20 -31 12 153 -60 -74 -36 80 263 56 -135 -55 -105
2851 -105 105 282 81 -52 -106 -137 59 134 -56 -73 -187 6 162 -20 3 -102 -256 3 162 -15 56 -29
2873 -29 -18 122 107 94 61 -153 89 138 28 116 -109 -151 23 -28 -81 -40 -87 75 68 13 101 -225 -111 157 26
2898 26 58 88 -158 -6 175 138 91 -87 -125 44 50 108 87 -225 -107 56 34 62 12 -206 0 108 156 101 -168
2923 -168 -142 4 95 290 82 -192 35 -20 -36 236 92 -117 -68 58 7 11 -78 -35 -187 19 206 -145 -123 71
2947 71 -131 -33 231 74 -155 -52 77 53 -43 202 118 -166 94 156 -238 -6 250 -67 -25 114 -45 -322
2969 -322 -70 276 -63 -133 253 -46 -304 236 214 -301 21 254 -62 -43 220 105 -460 -19 379 -138 -179
2990 -179 283 -262 -559 304 406 -227 -34 213 -218 -273 488 333 -469 57 431 -312 -149 472 -146 -499
3010d99P60J04o47J92M10o41k21J003j84q48P13K65q35J78P92n75l64P31R9q89
3030d56K63P52p67j98R65m08q23P82L59q04J34N89m45m65Q40J58j032L57P51p70
3050b18l6R05n31q00O89M27o57J78N55o05o69R87J87q83M15N57q98J04Q10m24
3070I3n13M75L04o56J96O16n60n12Q32Op09N24L44o67j13N95j94m30M98L15p57
3091c13Q2O36m73k62P44j36o86M72J08m26J06M33k20l59L77J96n41J33L41m11
3111a99l2N71j51l86J95jj85J69L73j93l83K71j3l14M01J73m71J18K28k68L3J44
3133H0m5j19R3K32k56j46L46k29r0L10n1k84J91j2j58P3J21j4j17J69O4l97R9
3156a40L50k85QL33k85j90K54K6j20P6J50k38j10K94J1l35J84J80k94J02K28k62
$$ plain form
3010 -499 261 365 -282 -90 320 -321 -542 461 277 -571 142 407 -428 -250 542 -33 -397 334 433 -456
3030 -456 -193 559 -208 -406 559 151 -672 110 469 -335 -201 388 -57 -522 318 476 -556 -199 552 -218
3050 -218 -254 651 120 -680 9 436 -221 -43 512 -93 -762 225 412 -471 -56 501 -397 -293 517 93
3070 93 -420 55 359 -297 -101 515 -45 -557 275 281 -428 96 440 -227 -340 255 61 -369 129 444 -313
3091 -313 -231 405 -68 -330 414 278 -408 64 172 -254 -148 285 65 -294 83 279 -262 -129 212 -199
3111 -199 -231 340 189 -197 -2 -3 -188 -19 354 161 -222 49 36 -278 123 296 -175 -57 171 -97 -64 80
3133 80 35 -84 9 241 -15 -161 185 -44 -134 176 125 -159 32 20 -138 -65 56 42 -75 94 158 -239 -140
3156 -140 210 -75 -67 266 -19 -209 45 71 -49 27 177 -61 -171 123 134 -201 -17 163 -131 -29 199 -63
3178f3j27K01K8j05J06J47k53j15K91n6k28K94J1l06J65J92j86j29J45P7k24R0
3200d5K41l12l6L30j07j81K11p0j60P6K12j05k30J97J19k27J39J93l75J2K59l4
3222A07j92J14L3j54J1K31n0k45J99m5k19K88P1k60R3P5p5k8MJ12j37n1K39r5
3246B6j22K18m8j82J63L9j15J3R4n7r4N9J40j95j8J93j72p2K51j56N2qm1R8j31
3271f5M2J47k03N1R6j47O8P4j07J0J3j9R9p1J8L9j07O3N4p2K9O2j14P4Rn6Q5j02
3299c0Q1m0o5J28m8q4J07n4k5J14p5M0p3l9J14l4KQ1j29oJ23j18K5M9j52J05M3
3326D0q4J15n4n8L9j8o0J26q3N7O3j20R0l1o6P6L1j38J05l8k8R1j34P6N7j02P1
3353B3Qk0O9j07L3R1q9l9Q4j16P0j2rQ5o7kJ8m5k4L3Rk7O1o3J06l2q1R5n5K7L0
$$ plain form
3178 -63 -190 11 39 -66 40 187 -66 -181 110 54 -174 120 131 -175 -10 182 -4 -133 12 89 -135 -45
3200 -45 196 -116 -152 178 71 -110 101 31 -129 -53 159 54 -176 21 140 -87 52 245 -130 -118 141 107
3222 107 -85 29 62 -92 -81 150 100 -145 54 9 -210 78 149 -111 -18 57 -18 -46 -42 70 -67 -118 121 26
3246 26 -96 122 74 -108 55 94 -21 -8 86 29 -65 -6 134 -61 -79 114 -58 -130 121 -35 17 9 -32 66 -65
3271 -65 -23 124 -79 -28 68 -79 -11 63 -44 -34 -21 -40 59 -12 6 45 -62 1 55 -17 12 74 -40 34 43 -13 72 -30
3299 -30 51 11 -54 74 26 -58 49 -5 -30 84 9 49 -24 -63 51 17 19 100 -29 -35 88 -30 -5 44 -108 -3 40
3326 40 -44 71 17 -41 -2 -20 -80 46 -37 20 83 -37 53 22 -44 32 63 -75 30 -8 -36 55 -79 -3 54 -48 23
3353 23 31 11 80 -27 6 97 8 -31 53 -63 7 -5 -14 71 4 2 20 -25 -49 -16 -7 -34 27 -36 70 38 -43 52 -3 24 54
3384E4o5j8Q9j17J50l8q2O1j33J2J27q0L8lp0O4K6O5n5M4q3K9j5J4n3k6J18n4
3412ao0R8o8l2J05n5k0L8LQ5l6j21R0Kl4J14q8J4n6N8j0j9J9Oj34L7J60j53K0
3441c8P7m7p0J25k1k6j6M2q6K3R2P4k07NP0l8O1O9q1p2K6J09m1j01K25j64p7J79
3469I2N5j84M6J19j65J5J06o4j13N4J36j71oK07n1k11J53N2j74O7K17j55j17J09
3493A7K8k04J42K23k49q6K72k03j11K37qj54k5K24m6j42J81L7l49K12K34k22j14
3516a06J82j30j26K67J42l06J1J29j03j11K41P6l76J96J84k55jK21j37j44J72
3537B6J93k89l3K46j31j47K47O9k95J84J3j57l3J71J2r7J04R7l41j8L03j33l7
3560d6J85p1j68M0J45q0p3J22m4j66J73Q4k50M3J88q6P4M8j34j56O2J96p6J8N1
$$ plain form
3384 54 -11 -29 60 -57 93 55 -27 34 -99 -87 40 -40 -2 -5 -75 -11 15 80 25 69 -14 15 0 14 -39 -65 53 -1
3412 -1 -61 37 -31 -63 42 -13 -33 5 8 93 57 -64 26 28 -6 108 20 34 -22 36 26 7 26 32 -102 -65 95 -58 -38
3441 -38 39 -8 -78 47 26 0 -16 26 -60 -37 55 129 -78 -73 -3 -41 20 89 8 -64 -38 71 30 -71 154 -10 -87 92
3469 92 147 -37 9 128 -37 -22 84 20 -93 -39 97 -74 -80 127 76 -135 18 70 -104 -37 180 25 -92 17
3493 17 45 -159 -17 206 -43 -129 143 -60 -171 66 58 -96 -121 103 57 -85 96 133 -216 -4 230 8 -106
3516 -106 76 -54 -180 87 229 -77 -66 63 -40 -151 90 166 -210 -14 170 -85 -86 135 -2 -146 26
3537 26 219 -70 -103 143 12 -135 112 181 -114 70 83 -74 -107 64 76 -21 83 180 -161 -179 124 -9 -46
3560 -46 139 68 -100 -60 85 5 -68 54 10 -156 17 101 -149 -106 82 -4 70 118 -16 -172 -110 86 10 28 79
3585G9j20k3J32k7mQ2k5j50J11j6j82Q2Q3P6k7J3k0k32M5J96r0L0J13j85j01K16
3611E6o1j16P7J60j45k1J16p1k69K92J98k86Q1J37l42J2L65k2k92J20J47l01M6
3634a19K88j35k39L95L8l54M0K10l39m4N35p3l79R1J94l23O4N13l00l60M32N6
3656A91m66K02L32l33j59M34o5m54K56K57l85O1M69l10m24M54J24l44J44L60l57
3677a3k87N29k3n23K56L50m13K3M79l76m17M32K48m31J31L41l89k92N82L7n63
3698c19L76K67m84OM24k19l79L30K75m91O9M66m03k42N99J4n09J90K81l63j05
3719b17M53j17m39L08L43n15Q2L31l13j70M09O4m47J72K12k73p1M36r7m77L12
3740a4K61l95J4L46l46j38M50Pl09J23O2j50n8L60j23k72K02J07k48J03J64j84
$$ plain form
3585 79 -41 -64 68 41 37 119 94 -56 55 39 -143 -61 22 98 71 84 64 -168 -123 73 -17 13 126 -59 -160 56
3611 56 -5 -121 -44 116 -29 -50 66 -5 -274 18 216 -70 11 148 -194 -182 183 161 -131 -11 136 -165 -119
3634 -119 169 34 -205 190 228 -126 -86 124 -215 -259 276 203 -176 -85 109 -214 -150 363 63 -297 135 191
3656 191 -275 -73 259 -74 -233 201 136 -318 -62 195 -190 -129 340 30 -394 60 184 -160 -16 344 -13
3677 -13 -300 229 206 -317 -61 289 -124 -101 378 2 -415 17 265 -166 -35 306 -83 -375 207 244 -319
3698 -319 57 324 -160 -154 270 51 -328 2 277 -214 -145 321 -82 -324 275 289 -220 -30 251 -112 -217
3719 -217 236 119 -320 -12 331 -184 -102 229 -84 -254 155 219 -228 -56 156 -117 -188 248 151 -326 -14
3740 -14 247 -148 -134 212 -134 -272 178 185 -124 -1 61 -89 -147 213 90 -182 20 127 -121 -18 146 -38
3762c8j24K01J07k49J0J95j51%K01j13k62K21Q7j58R2N5j56m6J74k0o4oJ19r8
3786b3LJ52j41j56J26Q9jl9L1j02q2J62Q9r7o3j6rP6J03p4p1P1k1K1LM2j31M2
3814a6J10Pj04l8Lo7J21O3p0l5m7O8k9J13j3j26P0O2l4J3p0n3M9J8J79j95Lm4
3842f2M6J4RM4k06J54M4J2k3M9j28O4L2L7o3n9K7N1j8M2oj95M0J33p2J29n3j18
3870g6M1M7O5q7k3N9k8j9K00j05j10o2J11oO8o4j3r1J44O5j66OR6j03M2J15m9
3897E7r2PJ8KL5K5j10%J41o9j63J28K9j12J23J04j41j25J37P9j13J2J15j66p0
3922a49K57K7k35J06k6j44J56J52k42o2J54Q7j89J80Q2k93j9K82l4j75J69J2k45
3945a49Q1K54k47n2J72lk27J78J83k94r2L20j46j49K89Lk71R5K93l06j12K83M7
$$ plain form
3762 -38 -162 39 146 -103 -93 102 -49 -49 152 39 -223 -2 85 -73 19 74 -82 -128 46 26 -38 -44 75 -23
3786 -23 -20 132 -9 -165 -39 50 49 10 41 -61 -143 19 108 11 -52 -68 -77 -1 102 28 -43 28 7 28 31 73 -58 -16
3814 -16 94 101 -3 -41 -38 -105 16 79 9 -26 -73 -5 -34 79 66 -60 10 72 38 51 -19 -72 -23 -5 174 -21 -18 -62
3842 -62 -16 -2 7 51 -155 -1 43 55 32 81 -47 17 49 86 23 -36 -9 42 24 66 60 -135 -95 38 -34 95 42 -76
3870 -76 -35 12 77 -10 -33 26 -2 -21 179 74 -36 -98 13 7 75 11 -2 -93 51 116 -50 -44 52 -51 -9 106 57
3897 57 -35 -28 -10 -8 27 52 -58 -58 83 14 -149 -21 8 -104 19 123 -18 -143 -6 73 -40 -28 87 -79 -149
3922 -149 108 135 -100 6 -20 -164 -8 144 -98 -160 -6 81 -108 72 154 -139 -158 124 90 -85 84 96 -149
3945 -149 -68 186 -61 -113 59 56 -171 7 190 -104 -196 124 -22 -171 118 121 -150 -55 238 -68 -180 103 150
3968A50l18K49J03l45j4L46r2k33K63J2l17J53L13l27j21K81o4k30L01O8m03O6
3990a59M05j63j91J38l7k10J51L07j69k57K66j51j87L48J11k74j7K12r0k29L18
4011A22j3k70J44K57l41j8K30j58l9J41J37k67o2K29j27m0K60p9k24J23J03j93
4033h5m4J74jk5J39j22k62M5K40K7NP7j98j87K54m7n3J33Oj43R1J36k17p5J49
4058A7M0r4J81K7l28M3K22j21M5J24j24k61J47J41j03m4L17j78j89J69rl68K91
4081e5K81k61L9J72k55l42M19K15k99J07K41m06j62M97p4l45L48K00m20o5L70
4102B05k46l38N37J85n24N6M11m51k25P68j62n46L90J84m96RN19k22l57N03K16
4123D16p21O7N25m67j13O80j46o31K12L97n33O8P25l79m99O14Q9o97J94N39l78
$$ plain form
3968 150 -168 81 184 -161 -175 171 79 -154 109 121 -196 -43 270 -57 -178 103 39 -191 110 178 -225 -159
3990 -159 246 83 -108 30 -7 -217 -66 241 72 -185 81 -70 -257 91 202 -72 -89 123 33 -196 122
4011 122 109 -161 -17 240 -101 -119 111 -47 -86 55 192 -75 -137 92 -35 -75 185 106 -118 5 108 -85
4033 -85 -129 45 44 19 158 36 -226 -181 59 86 91 168 -30 -217 37 -10 -63 70 76 -67 24 160 -57 -132 17
4058 17 57 -37 144 171 -157 -114 108 -13 32 156 32 -229 -82 59 -44 -88 229 51 -138 31 22 -346 -55
4081 -55 226 -35 4 176 -79 -421 -2 213 -86 21 262 -144 -306 191 117 -228 120 320 -100 -165 205
4102 205 -41 -379 158 343 -181 -125 286 -165 -390 378 216 -330 60 244 -252 -243 276 54 -303 200 416
4123 416 -305 -238 287 -180 -293 387 241 -390 -178 219 -314 -246 479 100 -399 215 304 -393 -199 340 -38
4144c8k17O19j24p30K87N56m89RN91l45o21N15L00o38K44M71l76l59N74k3o10
4165d04L46N10m84k00N75l18n04N00L46n29K9M93m27l97O36Q1n38K47M55m98j85
4186b66N33k92l52M56L34n40j9L97k73l64O14Q1o05K12L48m27q7M38j57l15L77
4207I3K34m65j4L24k14j63N18r4m75J44K18k32L8L11q4l51J87J82l54L7L49k30
4229d1p4K83o2k87J6L14j40k3J88r7l21K30J41j69K5J59k26m8K36q0j32J3J33
4252C8k3q5J83j38j49K15K6o6j3O9j66M5Q1J1Ml7L6k9j0R9j30m0J53J0p3p1l9
4279i9J7K7R7qn3J7j6n4J06J0j00J0J00q6P2L1j12m1R0J01q6n7PJ1n5J61pj06
4307b3K0jp6R4Q4m1r5O0L2r0K2O9j06lJ81j19o3M0J4Lk4M9n8j8N2J04j80N2J0
$$ plain form
4144 -38 -255 364 240 -490 -203 353 -136 -127 464 119 -502 13 313 -325 -81 390 14 -345 229 206 -404
4165 -404 -58 452 -32 -232 343 25 -479 21 367 -162 -133 360 -67 -464 172 253 -285 -38 417 -81 -266
4186 -266 267 -25 -377 79 413 -127 -146 251 -22 -386 228 309 -296 -84 264 -163 -250 188 31 -284 93
4207 93 327 -138 -152 172 -42 -205 313 219 -256 -112 106 -126 -88 223 139 -212 -25 157 -197 -160 189 -41
4229 -41 -115 168 106 -181 -165 149 9 -14 174 77 -244 -14 127 -42 -17 142 -84 -132 104 24 -108 -95 38
4252 38 15 -70 113 -25 -174 41 67 1 -12 57 -109 -64 17 28 32 -5 31 2 -8 91 -39 -79 74 84 11 -60 -99
4279 -99 -82 -55 42 34 -19 -2 -18 -72 34 44 -56 -46 54 -32 40 71 -41 -82 8 109 23 -34 -27 -16 -71 90 83 -23
4307 -23 -3 -4 -80 14 98 57 -38 22 54 -36 -14 55 -51 -54 127 8 -55 -15 -1 2 -22 27 -31 -49 3 107 -73 -21 -11
4336a1o1J04Q0n5j32O4L7Rk8N7k1j66J76K8j15O9nj16M7J41m1p4o5O6L4j1L1m
4364C8j26R9pq3J19jl5m5P2Jn1om%K1P1m1m3Q1j01l4O4O7j0r0N0N0j06R5Kp8N0
4396A9Q5j31k3O7j9K9o7Q0n3k2J32j6j02j8Q3r3R6K6j68L3J12k9P1n1L0j43p9
4423a51J80Mq0J24o0j16Q6R1n7p3P8L1q1L2J47k03K6Q3p2OQ7q5p0R2J2%o6Q6Q
4452E9j87J57M8j51J08N9p8m2N3l2PN0L6j49r6J67L1q1O2J6j44J16Q4j19OL2L
4479A5m0J22O3k11l0P7J6JO8k9r3N2k9l1J21k1o6l3QQ3n7N4k2k1k3Q3k7m0K5J5
4509C0n1Q2N5j53j3M5n3m6J81l3j17Q7j1q6Q1RL4k6qK3j49J13J44j30JJ23j76
4536d4k8J14L7j99Q6R1k9j16J98r9j82J95J15j94M8J14k70M9J77L6j94Q7J25j66
$$ plain form
4336 -11 -72 32 112 57 -75 -11 26 35 7 64 43 -123 53 81 -34 35 30 -86 -39 102 61 -13 -78 -12 22 11 42 38
4364 38 -88 11 4 -79 40 39 4 -41 31 32 -19 -25 -29 -29 -8 63 22 -21 60 -41 -75 -11 56 46 -44 6 56 -50 45 47 -31 19
4396 19 104 -27 -50 17 -2 27 -40 40 -13 -35 97 81 -21 -39 44 -49 47 73 -95 -62 50 21 92 41 71 -72 -151
4423 -151 29 33 -47 77 17 -99 -13 78 21 -52 26 57 -24 8 155 -48 -22 61 -11 -5 82 -3 -73 19 31 31 -35 51 59
4452 59 -128 29 77 -74 34 93 15 -27 26 -6 1 51 87 -62 -158 9 40 -41 21 37 -107 9 93 -26 -20 12 15
4479 15 -25 97 160 -51 -81 -4 12 13 81 52 -41 11 -18 -49 72 51 -15 -48 -40 43 -14 40 18 -3 -26 57 30 -10 15 30
4509 30 -21 61 116 -37 -50 -5 -58 -104 77 44 -73 14 3 -83 -2 7 41 15 7 30 -119 -6 138 8 9 132 -44
4536 -44 -72 42 79 -120 -34 57 28 -88 110 11 -171 24 139 -55 -7 107 -163 -114 63 99 -95 -8 117 -49
4560d9j13K87p3k19K45J28l66J74O6j44o9K92K0l14J22J37k04m3L03n2k82K24
4582G0J12l19O2K49j84j04K86m5l40K01J55k32NK51j51k57L18O3k21m8L07r7k43
4605a62L14pl06Q1K60k38qK93j54k62J64K00k00p9L17k05k33L29Ll33K72J57k42
4628c9q9K66n4k82J71K21k45m4K93k77j13L19N4k91J65P1j75j22K64l6k52K44
4650D9J78l27k4L24j89j30K81J1k69K0J98j31q6J83L5l33J91J76k76KK40j43j33
4673a53J71L0j67M6K34j60j03J85Nk85J76J02j38NJ35j10m7J03R0k01M3J54p7
4696C8r4J08k0r6J00P2j56j8R4%mJ3P7j93j8J48j06jJ90j93j7R6Kn9L5L4p0k5
4724f3J03M4j10L2J1p3R2L7j18%N2nqJ5M6r7M4L0j9l0J01o0j1N4l7l4K5M8j6j22
$$ plain form
4560 -49 -162 125 52 -167 78 206 -160 14 80 -64 -133 159 179 -135 -13 124 -80 -123 180 128 -154 70
4582 70 182 -137 -75 174 -10 -114 172 127 -213 -12 143 -89 -84 167 16 -241 77 140 -81 -129 178 81 -162
4605 -162 152 145 -161 -80 180 -58 -66 227 73 -189 -25 175 -25 -104 213 8 -225 104 107 -226 46 203 -39
4628 -39 -128 138 84 -198 -27 194 -51 -95 198 -79 -192 127 181 -110 55 126 -49 -171 93 57 -195 49
4650 49 227 -100 -124 200 11 -119 162 173 -96 -76 122 -9 -95 88 123 -210 -19 157 -119 -117 123 -20 -153
4673 -153 18 48 -119 -73 161 1 -102 83 88 -197 -21 81 -57 -52 83 -27 -74 29 119 -82 -39 115 38
4696 38 -56 52 32 -64 36 108 -48 -66 28 28 24 37 114 -79 -97 51 -55 -56 134 -59 -76 20 22 -37 -2 32 -38 -63
4724 -63 40 84 -26 6 17 -56 36 73 -45 -45 7 2 -6 9 55 -42 2 32 13 -17 84 24 13 67 30 -4 21 69 53 -69
4754f9N0K6m3P0Rn3j5O6p8J5M3q4N0LK4k1l4P1l4%mlL5M0n3n5Q5J1l5r6K2O7l7
4787b7j3R2m3r9J33kp2M2qk6m1L5O5n1m4Q3o7MR5m6j5Mj6J6O1l2K1p0rN5n8L5
4819BN8m0l8M5l7K0N0k1n3Pk1M8j5N1n8m1L0Q4p5j0J07j66L8N1M5n8q1J16o9O7
4849C6po1M6p5M9k4K5M3j6Mo6qN1kQ9q3kL7k9Jmj5j3l0N4k4K9m7J7j2P2m3j9k
4883b9O3n3J8L9l1rJ6rl0m0J01m7N0K5r8K9L7Qk7K2p5R2q5N0L5p4k9K7J6qP3p4
4915a7k5M9r6J21l5K4Rj5j5Q4l7r9M6jpjk0O0n7P5j8qm1K2n1K1J6L1LJ3Oo1M7
4948B3Kl8j4L4Qp7L0OkN7l5l4J5L9j7J8j3klPQ8q3j7N8q1J8J1k2N9o2%K1lM9K5
4983F5n7M2k7j4Mkm6O3k6J7J9l3N5l2o9N9l1lK1J0m2K5m0L9j4J2m8Q4l4oOk9O8
$$ plain form
4754 -69 -19 7 -36 34 43 -10 -25 41 -37 -22 21 -63 -13 -10 14 -7 -41 30 -4 -4 -8 -11 24 64 11 -44 41 52 17 -79 -57 10 -27
4787 -27 -40 52 9 -90 43 41 -31 11 3 -23 -64 -29 36 -15 -59 24 -43 -39 56 10 -5 -1 -17 -1 60 28 49 -21 -30 25 -33 2
4819 2 60 20 -18 27 -10 10 60 39 -14 -7 -28 20 5 56 -2 -43 -13 71 -4 -14 93 -73 -35 16 61 3 -78 38 -31 36
4849 36 29 -32 14 -61 -12 -36 -11 32 16 20 -46 -54 -3 -5 84 1 -1 36 7 8 4 -11 -24 -54 0 -24 5 -42 -25 -37 35 -8 -27 -29
4883 -29 34 -19 -1 38 7 -2 14 5 -25 -65 36 -11 39 64 -34 -5 32 40 13 35 -40 52 -33 17 52 -22 -51 -24 -8 -16 57 -17
4915 -17 -42 7 -89 32 -3 21 30 15 0 84 47 -52 -6 -7 -14 -15 -35 25 -32 43 25 17 -24 -2 -53 -32 -16 15 18 31 37 -24 23
4948 23 25 -13 -27 7 15 -62 -32 -26 -28 29 -6 -40 -25 14 -3 15 2 0 -3 4 92 9 -8 50 -31 -13 -2 -24 35 -27 -27 -6 -9 40 65
4983 65 8 50 23 9 13 11 -35 28 2 19 38 5 60 28 -41 18 -13 -16 5 15 -27 -2 -42 -3 -17 -5 -53 31 -3 -9 -3 -32 36
5016C6m0Q1l9qk2M5k4q8J04k3n3LM3J8k7j2N8o1L1K4j29J08M0p9K6mK0%m0N4m6
5047dj9L3K4r7N7rRJ1m6Q4p8j3N2lm4J11j10J3J3LJ1NM6l6k8L3n5rJ7N2l9N3l2
5080Ek8L4J%l6pN4m8rP0p1n0M9M5m1NP4o5K0J9O0n9k5K3q1K3R2l9nK4o1L4nl7
5114c5J1JO1j6m9K8ll4mJ0K5m6N0o0m%N2J7k1M9on9P2k2j19J28L2l3n3LM8kmJ3
5148C0m3qL9K5o5L7K6m3N0k4l1jK4N1q1j2P8l1j9K3k8L7j0o4J0N5p2Q3k7j1L1
5179B9r4O2Qn2N9m0L1o4J08p0J7N3q1M3nm0PJ9L3rk2m4R3n4L4k9k9J04o5pK9r
5211A5o4JK6RK2J0J9j8K4r3N7l0n7Q5O5j31O2p0N3qM5k1jl4qL4j1L3k1N4k6k6
5243eoL4k2J6M0k1n9Q9p2Lj5n3M2O7n8L8k9m8Q3l5qM4o2j0L9j7jL8k9On2M9K6
$$ plain form
5016 36 -4 77 38 30 8 53 29 -59 45 22 -31 -28 15 33 6 -6 52 -9 22 46 -83 25 65 -14 12 8 28 28 -12 42 -4
5047 -4 -23 10 34 -63 -6 -15 -6 5 -41 43 -35 -48 4 1 -43 68 -42 -29 -16 -13 -2 3 49 13 -15 18 -37 -46 -29 23 -16 37 5
5080 5 -23 11 12 12 -24 -31 23 -25 -34 36 -35 -85 -36 9 -32 -27 47 -18 2 21 81 22 -3 20 -61 -38 54 15 10 34 -27 7 2 -35
5114 -35 -24 -23 38 22 -27 1 -2 -36 -40 -30 -5 -51 -1 -61 -65 -65 -13 4 -17 32 26 -33 39 17 -102 26 58 25 -28 -25 23 21 17 30
5148 30 -13 -21 18 43 -22 15 41 -2 48 24 -7 -8 16 67 -14 -26 52 21 2 25 -3 34 24 -40 -30 25 -47 36 9 -2 29
5179 29 -65 -3 5 -47 12 -28 3 -61 47 -23 -6 47 -34 9 4 -36 -29 -10 23 14 -8 -52 41 -13 21 -8 -37 67 2 -5 24 15
5211 15 -49 -48 -22 -13 9 19 38 20 44 -49 8 -22 -79 6 71 -60 2 -68 -15 -23 22 1 0 -34 -42 -8 -19 14 -7 47 21 -5
5243 -5 -11 23 1 17 57 36 -23 66 -6 -3 -18 -71 -29 38 -20 18 -11 -59 24 -11 -19 25 -37 -47 -8 -25 -26 12 -17 -11 -63 -14 12
5276A2n6K3Q6o7pM0n4N1k9K8Mp4N8%Pk4Ol0K9m4M6m7N0n7J2M1%%PJ0m2KQ3p3p2
5311h1J07jj6j7Q8j12n6R7J0jJ1L0n6KPK5j5J3J5m0J7L8n1nr0R2m0L6J9mm7M8
5343B3J7m0O1m7o1j2L6J2O9m1J5k4K1m1L2k5k8K1k2L3K5lm8RM8q9O2m7K7J5L4
5374C2Lo4L7k2lK8J0o3%J7Ll2R7l4J8o5M5j6Oj6K7RNk9k9KL0m7J12n1OM0r3M2
5408ERn0K0K9k9L0Qk9JM1J1N8j06J1l9oO2m1N0k6M0k7m4jMOJ3l9M4k7J0JJ3kk6
5443b6l8J51q7PM1p9N2J2kml6Lm1M6K5r2Q5l6k0N3M5m8n9P2k3L7o2K3n0N7llm8
5476d8K2L0l5L2l6Q2q0L3j4K8k5m4J08m4M2k7o7PO1o5J1Q3n4j4K9lk2k5P2l5J0
5507A2P2p2noRQo3J00l6kk3R3o3l7O6o0mM7n1rM3M8q1l2O0k1l8O3N2o0k0L1o8
$$ plain form
5276 12 -44 -21 65 -2 -9 31 -23 28 -1 27 31 -43 15 15 22 -2 4 -26 3 -41 5 -42 8 -49 -37 4 4 4 11 21 -21 -19 64 -9 -81
5311 -81 26 25 9 -8 80 -32 -88 9 19 18 29 59 3 5 12 37 22 35 50 10 27 65 14 9 -81 11 -29 7 26 22 -25 23
5343 23 40 0 61 14 -47 -59 -23 -11 58 17 32 8 29 -12 20 -5 -33 -12 -34 -1 24 21 -27 -18 30 -59 3 -44 -17 -2 32
5374 32 35 -29 8 -14 -17 11 21 -42 -42 -25 -22 -54 43 9 27 -38 7 -9 -3 -19 8 17 22 -7 -36 -34 -4 -51 61 10 16 56 -37 5
5408 5 14 -36 -16 13 -16 14 22 -7 -6 35 46 104 -2 9 -30 -36 26 -15 35 9 49 22 -22 -23 -19 -13 0 -39 5 -22 -12 -11 2 0 -26
5443 -26 -64 87 0 7 48 -31 21 33 31 27 -9 -6 -47 -1 24 -68 17 -19 -39 14 59 11 -48 24 1 38 -24 -1 -51 6 3 0 -48
5476 -48 -26 4 -31 1 -35 47 -33 0 -14 14 -11 -55 53 9 51 24 -43 -36 25 -40 -29 54 0 -14 15 12 -10 -35 37 2 12
5507 12 84 12 7 1 10 18 -45 55 19 17 -6 87 24 -13 53 -7 -11 36 -15 -24 19 67 -14 -46 14 -7 -45 18 70 10 -10 21 -47
5540d7l2J24%p3M3K0m8nJ14p1p6J16op7L0J4p3L9j5M1j7rK9m5mkO7o2O7rn3J2
5572hM3k3q4O9J3m9qjM7J0P9j29O5qk6n3L0Q5j9o5N4j5m1L4K4rn8M3Kk2J8Qk4
5605a8K7%m2kM6n0lQJ07o0L3j2m1J8l6N3n9K8L9k7qO5k7m8M4k6p2N5l9N4J2l4
5637a5L2m8N7qj6k0O3r7O9lo8pL6N4K6p9lj8N1j4oJ3k8N1p2P5Rp1M6P8r8m4M2
5670a3K0j5k3P4q9M6K9p1M5oJ7p1O6J1q7L3O3m1kK0M9r2kP1q9jJ12k3k0k4jJ4
5702@J0J9j2l3L0j4k0J6M4mm3kM9p1rM7n0M6K4o2j7L1L0o1j9J2M7R%N5o8k0Q3
5735D7l8n7L7L1rk4k2K5k8O5m5l9R2l1JQol3NL2M6q5M2L1p2J8J1j1p3O5M2m0j7
5768c2L2j2J3j3J9k3JL8m6l3R2r8M1K1J8l3j2M3Jn3rO7j2k7K1J2KL1o9K7n5J3
$$ plain form
5540 -47 -79 45 45 -28 15 35 -13 -18 96 25 -51 65 59 -18 12 26 -47 -8 -23 18 1 -8 21 -24 -28 -30 37 -25 42 33 -20 -8
5572 -8 35 12 -72 -3 10 -39 -47 -48 -1 9 88 -41 24 16 -10 -63 -33 52 33 -32 22 7 -34 0 24 15 -43 0 2 -20 -2 6 -18
5605 -18 9 9 -33 -35 11 -39 -42 -34 73 13 46 34 -7 11 -25 28 -31 -3 36 9 1 66 39 -9 35 9 -63 -8 -47 7 19 -15
5637 -15 17 -31 26 18 2 -18 45 -52 17 14 -54 -61 -25 29 55 -24 -27 -45 6 -8 -14 -1 -29 22 -50 25 34 -37 9 87 -11 -55 -13
5670 -13 7 -8 -31 43 -46 0 29 -42 3 -3 14 -57 9 20 -67 -34 29 -12 -14 6 55 -37 -39 32 -57 -58 54 31 11 -13 -14 0
5702 0 10 29 17 -16 14 0 -20 -4 40 36 -7 -9 40 -31 -40 7 -43 3 27 -35 -52 -21 9 -52 -71 -59 -12 -3 -3 52 -16 -36 47
5735 47 9 -48 -11 20 11 -13 -35 -10 -38 27 -18 -57 35 4 5 13 7 -26 -21 11 57 -28 14 45 -27 -9 2 -9 -82 -17 25 -15 -32
5768 -32 0 -12 1 -12 7 -16 -15 23 -23 -56 36 -62 -21 0 18 -15 -27 16 17 -36 -45 22 10 -17 4 16 18 49 -20 7 -48 -35
5800c5M1%k2J3m8Q0m0jk1N5n2m1J2L7lM2Mo3M1%On0J09o9N0j7m6K3o7O1L6n9J8
5833fj3J3nJ8n4L5L9k0L0j5j7M0m4l4K3J6L0j0p1K3QM1mJ8j4o3R5q8L5k8npk1
5866e5O9o3L3k7j1O4M5m7J9oJ7o6Q5q1M0Q2l7n4j0L4k6J6J4m8L5m8K7l1N1m1j
5897b1K5nj3l9MnN2K9m2L4n8J3K7K6J1o1K7ml2MK8MJ3k2j2N1p4P9j5l3PKk2%L1
5932IrJ6m7L2oJ1j4K4p9M4J2j6K3L5m7k0J4K3nLrj0L0m1J9K2q7O2L5k3K0m6J06
5965H1j07N0pJJl2J5K0l6O1j3q3M2J9K6K0p9L6m4K2L6rn5J3L4m1K1J3ql4Q0p2
5997b9j4N9n0P7j4k7k2mk9J7PN6K0j14P8J0k0l4N4j0l5%P0p6M5L2n2j7n6O1m2
6028e9N2k3O7J5p2K5l5M4n4RrN7k4m7P2n9J4JN6qj5J7l6l7R2l3m7L3j3o0P6M1
$$ plain form
5800 -35 6 6 -16 -3 -51 29 -11 -12 -33 22 -30 -71 -59 -22 -25 17 21 -42 -1 -1 5 -45 64 -5 45 28 -18 5 -62 -1 35 -24 -6
5833 -6 -19 -6 -11 7 -47 -12 27 7 37 22 5 45 1 -33 -10 6 36 26 -45 -22 -14 27 23 41 27 -36 59 -29 6 -22 -27 -34 -55
5866 -55 14 -49 -16 -43 -54 10 55 8 27 21 38 -28 57 -24 16 98 61 7 -3 31 5 21 35 -13 22 -26 1 -30 21 -20 -21
5897 -21 4 -1 -14 -53 -49 -54 -2 27 -15 19 -39 -26 1 27 38 -23 4 0 -32 -28 0 4 17 -5 -17 34 -40 39 24 -9 -2 0 -22 -22 9
5932 9 0 16 -31 1 -5 6 -8 16 -63 -19 -7 -23 0 35 -12 -32 -18 5 0 3 -6 -16 14 -27 -8 14 -73 -11 24 1 21 -25 81
5965 81 -26 24 17 18 19 -13 2 22 -14 47 34 -49 -7 12 38 58 -21 15 -29 -7 29 20 -35 -22 12 -29 -8 5 -3 -37 43 -29
5997 -29 -43 16 -34 43 29 2 -20 -24 -53 -36 -29 27 47 -67 11 21 1 -33 21 11 -24 -24 46 -30 15 47 -5 -22 -78 -17 -59
6028 -59 -7 -30 37 52 -20 5 -30 14 -40 -31 -40 17 -7 -54 18 -41 -27 -26 30 22 7 24 -12 -49 43 10 -37 -4 -17 -77 -1 40
6060D0j3r4M9K9n3l7N0L0L5l0k7j2K0l9N6nn1O3J1Pp4M7k2JnP3l7k2l8P6p2l5
6092g9R9l1KJ3l1j5QK8K6K3k8q9O4j4M2o6O3K5k5l3l3N0kL6q1RM7m9M1JRK6j7
6125A9m0N0n3KN9J9r3P1k7k9M9k5N2p3K2k4k8N0N2o0L7mj6j1j8PK2J9m0K1r4Q4
6157@K2m5k7P6jm1Rl9Q7m5K5n0K3N3km1m6P0j6RL3l6k4M3p1pL6mL7m7N7l7k6Q2
6191E7Kj19O7pk2j1L8kqjK1j21J28Oj05Q5l9j7P7l9O6l9j9l4J7L6k8L3K3l9pL6
6223C5m7m3Q8l5m9M4Mk4k6MoP5j3p7Q0j0k6O4l7p3N9k2O3l7J4k3RK8m3L1j2k5
6255c0k5K8ML9K8r%o1m8O9J1ql0N6k8m4J00o7J4j7M3l0K4l3%l1R6q4LK8o3M6J5
6288dMj2JL9p1Q6o0kl6L9L0Ll1K2Qm3L5J8j7J3k6PJ5pj3k4M2k7J4mm7O4m0k6K2
$$ plain form
6060 40 27 -67 -18 11 -42 -79 -29 1 36 6 -21 -33 -13 -52 4 -1 -52 11 22 29 -45 2 -20 -19 -24 49 12 -10 -48 28 -44 -79
6092 -79 20 -11 -9 4 -27 -42 -34 -6 20 43 15 -74 -10 -24 18 -48 15 40 15 -18 -51 -1 -3 33 -48 -39 8 -41 0 1 10 36 19
6125 19 -21 29 -24 -22 37 56 -37 34 7 -22 27 2 54 -19 3 -21 -49 1 53 -7 30 26 10 -1 -19 -12 10 29 -11 10 -84 0
6157 0 22 -23 -50 26 25 -16 -7 -46 41 -4 21 -29 -6 47 45 4 -42 28 12 21 54 18 -6 37 -34 -41 -5 -9 28 -19 38 1 -25 57
6191 57 59 -60 7 0 -22 -33 5 3 -5 -6 15 -106 22 28 -77 8 -31 -48 29 -10 56 17 -2 -36 -19 17 -11 22 45 6 -1 35
6223 35 -12 -55 33 -2 -51 -7 -3 -27 -53 -49 -55 20 7 -70 10 0 -26 38 1 -72 -13 -35 28 -9 5 -18 -9 19 -24 7 -5 -30
6255 -30 -55 -27 -23 16 44 35 35 -26 -74 -5 6 -2 -32 24 -4 -48 52 -15 -1 -18 25 -5 19 -14 -14 -45 51 -33 -30 -2 -65 -19 -4
6288 -4 0 -12 -11 28 -43 43 -17 -19 -55 -16 14 17 -14 8 16 -27 8 26 9 22 -4 3 18 11 -2 -26 16 -11 3 -1 -48 16 -24 -50 -28
6323b8N6r1M6N4m4kNJ1mk3L8j6K1m2N3p1L8K6q4P0lOm8JM9k8l6J3O0J9n1L6j2
6356A9m0ll1P8k7Lm4M6pm4L3K6k4RJn5N2j1n1M5J9M4n9L3JqMj2%N3j06N4K8oj3
6391GmK0o9L7L6n1K1j6j1%M3Qj1lN3r0R4j4l7o4M3M0p6L9k6L9kk0Jl2M9M9m9L
6425Go7N4j6K1J2kk6J6J5k6J2J3n3O4p3L1OK5k8k0N7L6n2m0PKj8%K8L1l2PJ8j0
6459aL0jM6q2rj5K9M1n8L2k9k0M3PQk7rOo7L0L7k2O6o1O3j4j3j5qJ5K2o8Q1j6
6493B1k5LM2n1J0J1l8M2m0N4m2M0j8j9oP5m3Jk7QK8n8P3k7J6p0M2k7QP8p5l4M4
6526dJ4o6O8m3N8ln7j4J6M9Nq2M2J0n3l2N6P5J0n2rO0n0MJ4L4p0RJL0J5l7m6K3
6560b5P6j6q0O3n3O0Km0l8M5J9l8P2r4O0L7j16J5Q3o4NQM8k8J8nl1O2l9J2l6j2
$$ plain form
6323 -28 28 -63 -17 37 -7 -9 -4 7 3 -20 18 2 23 -19 34 -37 1 27 -57 13 10 16 -32 -31 18 -10 -46 -33 27 46 -5 31 19
6356 19 -21 -24 -55 23 -4 -1 -45 1 -6 -50 -17 9 -15 -6 -5 -60 -8 -19 -70 -25 -6 38 -21 12 13 5 9 -3 -3 50 -56 -2 26 20 7
6391 7 3 23 -46 -9 27 -24 -3 -19 -30 -30 13 21 10 7 60 -30 64 50 13 -51 -8 32 -44 -5 -31 8 6 -14 -13 -45 4 53 4 7
6425 7 -60 -6 -22 -1 11 9 -17 -1 14 -12 0 13 -40 24 -49 -18 -12 13 -15 -35 22 58 6 -34 -27 -25 -43 -43 -15 16 -16 -9 9 -1
6459 -1 29 28 74 -8 -17 -32 -3 38 -20 12 -17 -37 6 13 21 -6 -15 -9 -76 -46 -9 -31 35 -26 37 23 10 -5 -13 2 24 -44 37 21
6493 21 -4 -1 41 -10 0 11 -27 15 -25 29 -13 27 9 -10 -16 59 16 17 -10 -2 26 -32 41 14 30 -40 2 -25 -17 61 -14 -48 -4
6526 -4 10 -56 12 -31 27 24 -33 -47 -31 18 23 -59 -17 -7 -60 -92 -36 39 49 -3 -12 48 -2 2 16 50 -20 -11 -10 20 35 -2 -48 -25
6560 -25 51 35 -45 18 -35 25 27 -13 -51 -6 13 -25 47 -47 13 50 -66 -51 32 -32 -27 -19 29 1 19 14 -17 45 6 18 -18 -30
6592c0K2Q3m3l5Pm3N0M1p8m1R2O8j25K5K6l4K6J2Pl7Ok8N3j2M7o8OK9k0l0L5M4
6624E5o8K4LM3m9k7P0o4P8j3l4m5J6M3n5J7LQ2p9J1n8K9L3K4k2m6M9l7J3K4M8
6655F8m5LMr2M8Q6p2J9m1rlj6O3p8N1k9M0p0O4%J7J6m0M1p9J19k1n5k8Q5Rq2O9
6688D2mq6N2Rn8QJ12p6k9K7K3k6rL9k8l5K5%N2p1K9p0P2J2n4K6j4Q2J7p7M6j14
6720g8O1OOK2K1l3N7o1l3L4o4K7J9L6p1J28j02K4Jo3O4J1Pk9P6k0j7n4J3J0j3
6751a5LR4m7p4M6m8k6P2j1k8L9J3K4Km7lm2Q5j4l6l3L2j6O1j8jK1q2P3J6l6k0
6783a6k1K4L2o2L1L7o7J18k6q3J1J1l4P1l2l1k3L8N2l1l4QJ0J8J4l9L6Kl7L8L1
6814D6p8N3K1o9K7K8J5o4j8O5rj5KK7oM1o5K9Mm4j1L3K5n5oL2J9Oj8L1k6o0N4
$$ plain form
6592 -30 -8 75 32 -3 4 -39 11 52 -26 -67 25 93 -32 -7 19 -15 11 23 30 -7 -1 -29 24 12 59 -9 -3 26 6 -24 11 55
6624 55 -13 11 14 57 8 -19 51 -13 65 52 18 -27 -11 32 -23 -6 -3 79 0 11 -47 -18 15 39 17 -29 20 -17 -4 20 68
6655 68 23 26 30 -62 -14 72 0 19 -22 -31 -34 -50 13 -65 -14 -43 -3 -73 -9 -9 8 24 -16 25 -54 65 44 -11 -39 46 55 -27 42
6688 42 38 -48 4 13 -45 -37 75 -1 -30 -3 20 -6 -15 24 -4 -39 -14 -14 38 -33 -4 -74 -2 10 -44 -18 -32 50 67 -10 36 -78
6720 -78 -17 -11 -5 17 38 5 62 1 -32 2 -62 -35 -16 20 -51 77 -25 -1 0 -63 1 12 19 -10 66 46 29 -25 -12 -2 -15
6751 -15 -12 82 35 -39 7 -41 -67 5 -6 -34 5 18 42 44 -3 -6 -48 37 23 -13 -46 -14 -30 31 13 12 33 -49 24 40 4 -16
6783 -16 -37 -13 19 -43 -12 25 -42 76 50 -33 -22 -11 -45 26 -6 -37 -60 -22 30 -1 -35 -27 -17 1 15 -24 12 14 -23 15 46
6814 46 -32 21 42 -27 0 28 43 -21 -39 26 17 2 4 31 25 66 1 30 34 -10 -21 12 37 -18 -24 8 27 33 15 46 20 -40 14
6847A4MOl0j8O3l2k3N8q9K3O6j02J03l3qm0N3j7Jj7L5l4K5%Kor4Q4K6p2NK2M2
6880A7o0L8K0Lo7M7l4O1r%KK6j00P8N%nk3N9p1L5l1j7j0Q2o4O9q5NJ0K5J8o5P7
6914C6k8J4K2m4J1rj6M4K8j09LJ7J2pQ7o0K3l0J6j9OlK5k9O1l7LJJ8l5J9K4p2
6947b8Q0j3j1j0j9j1MMk0J9l1K6J1J5K3n2J9rK4k0PJ0N8p4j7N6On8M8o1K2l6R0
6980E2k2Qn6KL6k7j6qj6P3j6ml4oQ3p8mK3Jj6L3k9J9l9J00o0J9K1m0L9n0L3J4
7013C5j20Q4j5n0Q8n2R8n4l5N2l1L4n8L4p9N2Qj7N1M0l5r5O0J6n3N6j2J9j1p4
7043f4O9k6K0J6ql8N0qL1l8J5m1N6k2Qk2N5pq2L8J6l1oK3j1J5L6K0j09K7k8M5
7075al7Q5m1j6k0Q6q7K8K2l8K1j6kqO8%l5K9K5p3mL7J2o5KJ26n0r1K6L5m3N5K1
$$ plain form
6847 14 18 24 -6 -24 39 7 -16 42 -47 -24 42 -60 43 10 2 -38 15 -2 -1 -18 17 -17 8 8 10 4 -90 -6 20 -52 -47 -25 17
6880 17 -43 -5 15 18 -49 -2 -36 25 16 16 18 44 -56 22 27 27 22 -1 58 -13 22 -9 -26 -36 46 -18 51 -34 -29 -19 6 24 -41 36
6914 36 8 22 44 0 11 2 -14 30 58 -51 -48 -31 -19 -26 61 1 24 -6 10 -9 -3 -6 19 -10 51 14 17 18 36 1 20 44 -28
6947 -28 52 39 28 18 -1 -12 -8 -4 -24 -5 -36 -10 1 16 39 -13 6 -3 21 1 8 18 76 2 -15 41 47 -11 37 -24 -2 -38 52
6980 52 30 38 -18 -16 20 -7 -23 -31 -47 26 10 6 -28 -34 49 -29 -33 -10 -9 -25 8 -21 -2 -41 59 -1 18 39 -1 38 -12 21 35
7013 35 -85 -1 -16 -66 22 -30 68 14 -21 31 0 34 -24 10 -69 -17 -9 -26 25 65 30 -65 -5 11 -42 14 2 21 10 -64
7043 -64 5 -21 -1 15 7 -31 19 11 42 4 19 -22 34 12 20 -2 53 46 -36 2 18 -13 -19 4 -7 8 44 64 -45 -18 -46 -1
7075 -1 -38 47 6 -10 -30 56 -31 -3 19 -19 2 -14 -16 -24 44 44 9 38 63 -10 -14 23 35 -30 -28 98 48 -43 -17 18 -25 30 51
7108E1r4O1L3p1JJ01r0j4mO5l8k4P5o1l3NJ13j04K9M8m7k8K5K2m6L7L8q7K9KO2
7139E6j20P8L3r4M1M7l0m9P4j2p9P9nQp3Q5o3pK8K0m7NK9j4j1o8J05m2PJ8lo5
7171f9O4Pp4R6k9On1N5L4qk3j8N5m8jJ2kR5q1m9j0N1j0o6N7j2N1l2K7k7kK2j6
7204Dk4L6k3k2J0k6O3l8NJ8k2L0Ml7k2K8Mj0j2L3K7Ok9j6K4M0o6Pk5L5nk8N9o6
7238c8K9P5r5J0J1M4n0N9j0n6Q4o9qm1Q4j9J0Qj4l4K3Rp1N7L1l3RJj5roK9j9L3
7272A9j2J9k5L9l5K1jl9L1o4J3Oj9J5L9mlo9N6o1N2N7m0mN0m2k1%L9l7O3m8j3
7305a8RmK3k9J6rM3r2R2p8O1mj8jK2M2J3j11P9N3j00J4OK7q9Q2M3q7ojJ8m5nL0
7339b4j9pNRJ2pP4k8k4N0n4O0n3k2RO8j0k2l1MMML0m5nK2L2m6L8n6J6lP1k1j25
$$ plain form
7108 51 -43 18 51 -20 -19 82 -8 -22 -26 39 1 -23 52 -9 -42 -37 76 -28 1 49 2 -26 -1 21 -25 12 50 -37 -8 -6 56
7139 56 -64 14 47 -47 -6 41 11 -38 36 24 -55 24 19 27 -46 39 -24 -31 -3 17 -30 -25 4 -10 -21 -89 16 -26 -19 -1 -4 -69
7171 -69 -5 2 -72 24 -5 1 -50 5 39 31 8 -10 45 -3 -4 8 6 101 20 -29 -39 12 2 -64 -7 -19 32 0 27 0 -2 20 4
7204 4 -20 16 -7 -29 -19 -45 18 -20 -15 3 -19 11 15 -22 -44 -16 -12 -22 -34 -1 26 32 3 -13 11 51 -15 -8 -33 2 -3 -31 28 -38
7238 -38 -9 66 -29 -19 -8 36 -14 45 35 -21 63 -6 -14 -55 29 10 20 28 14 -20 3 12 -59 -2 29 -4 5 6 -9 -18 -24 5 -14 19
7272 19 7 26 1 40 5 26 25 -14 17 -47 -34 -28 -47 -32 7 3 0 -69 -13 -74 -22 35 -5 -9 41 -1 -22 -22 17 -20 43 -5 -18
7305 -18 -9 -13 10 -19 -3 -12 31 -61 31 -47 14 10 -8 -9 13 55 68 -43 36 89 -11 3 9 36 -53 29 72 -15 -21 -22 -4 -49 -54 -24
7339 -24 -43 -50 -45 -36 -24 -31 43 15 -9 41 -13 47 -6 -28 -19 49 39 17 -14 -10 -6 -2 28 -17 -22 0 32 -14 24 -32 -16 -19 52 31 -94
7374i4J10J5r1J5M2j7j5L1L1K5o6N9o5QL3LRk3nnP%J6l2O0q1JkJ4L0m8N4Jk4m
7409hkJ7L3L0q7OO1m5j1pN4m2LO7m2k1m5J14p6n3P9m6j9K5L0J1j3m0L2M4j07k3
7441h1R1K4j9m1K9K6k7l4L1MNn0J0KM6Pn4K1j7M5p7R8j9Rn1M8M5n5L2p4L6k3J6
7474CQj0k1N4J8p1P7o2K3o3Q1n8k4N7Nn1K2P3l6m3J4K5K2j0o2P7p8K8m7M6rJ2
7506@%j0J5o3N7Jl9O8p5N6Jk2l9Q4j4k1mM3n7j6J03o0l9K3M3m0%MK2l3n0Q1o2
7539d3PN1k1K1oJ4r4Q1k7%nK0L3j46J42j7l6O9j1m6K0LMo5O6k4k5O5n3M3p2O9
7571A7K5n5N3j2j4j8R9j01m5P1J3l1o6Q1Nk9K7k9L6olj3pK0k2K8k2k8RJ5J2Jj3
7604bM1l0o0N6L3j2j06N9K8mm4K3k0lJ7L7j9L3p8MjO6k9o5Q4Pl3L0K8j6r4M8M0
$$ plain form
7374 -94 16 31 -60 -45 -3 -20 -35 -4 27 52 -14 45 -20 -12 21 24 33 10 5 0 7 7 23 -9 51 -30 -29 -31 -17 13 -35 19 20 -4 -8
7409 -8 -10 7 40 70 -17 -11 50 5 -6 -13 41 -1 2 69 27 6 -39 75 -1 -54 25 -21 -40 -15 15 26 13 -27 5 49 -58 -81
7441 -81 10 34 15 -26 3 29 2 -32 -1 3 8 -42 -32 -30 16 23 -31 -10 -27 18 -59 39 20 29 -22 26 71 16 48 -26 10 -13 3
7474 3 11 1 -20 34 52 -19 58 -4 19 -44 37 -21 -45 12 17 -34 -12 61 25 -18 -4 21 43 33 -29 48 -30 -2 -49 -3 -12 0
7506 0 0 -10 5 -58 -1 0 -39 29 -46 10 11 -11 -50 34 20 -1 -5 38 -19 -35 68 8 -31 -8 35 -5 -5 -1 21 -12 -62 19 -43
7539 -43 -36 15 -6 15 9 23 -71 10 -17 -17 -22 -2 31 -115 27 10 -26 43 32 -14 6 9 13 -52 14 -10 -35 30 -23 20 -52 17
7571 17 42 -13 40 28 14 -4 95 -6 -51 20 33 2 -64 17 22 -7 20 -9 27 21 18 5 -2 18 -4 24 2 -26 -17 -2 10 11 -2
7604 -2 39 9 -51 5 38 26 -80 -21 7 3 -41 -18 -38 -41 -24 13 -6 27 -51 -47 -48 18 -11 -76 8 15 -18 12 40 24 -70 -22 18
7637A8j9M9m2k9l7Q2o1J2L4J5n6L8O0k9r3P6L4n5J1K1m0%P3l7m5j5O8n5L3o8L0
7668b7J1OK3ll1P3q0mL8j0Rk2RL3o5MJ2pL3K7l2k4L4j9j0j1jN7Nl6NK0p6L3M0
7703A4J0l8QK5l8O1%l3jj8lPJJ2RLn7O3m4oj6M3kl0l7L5J7N2k4mL5No4j7M5l8
7739b5J9JJ8n2P5j1j4J2j7l1OqK9pk8J3m1J13p7Mrj8Q1k6m4P2o5O4J1k4K0L6r6
7772a9LJ3K5Ko4Q6q9K8L4Mj6J0l8k1K6M1k1m5M0J8l4j6PJk2L0nk6J1L5K4o5J8
7805b5J3o8J05mo4K8J6n5j5M2O9p5J3K6L6o4K9k7m3O4K0k5L2Ol3L1l7L7k7r5M8
7836d2P4p4L2qk9L8L2k9j7L0Nm0J8O0n5K8q0K4j8P0M2j28M5L1J6%oo6l7N3N3m5
7868b3K4L1Ll0j%ok0N1q9J3L7M8l8jj3NJ0jK7kK7m0rj3Jm1J9M4Lk3p2J49p1O9
$$ plain form
7637 18 -1 48 6 -23 -60 22 -39 -27 7 22 -34 4 64 35 -58 18 52 -3 8 29 -11 -11 62 25 -20 -35 33 -22 11 -57 -27
7668 -27 -16 -10 13 10 -21 52 -28 -32 6 -4 5 -17 -8 25 -40 -36 -24 -31 2 29 -3 -27 7 -12 -22 -33 -34 23 28 -8 -3 17 -59 -26 14
7703 14 24 -14 -6 19 -19 42 42 9 8 -10 -13 -6 -5 7 16 19 -38 25 -19 -25 -41 2 0 -30 -67 -32 -15 37 13 9 44 49 -15 -32 13 -25
7739 -25 -6 -5 13 -39 36 25 11 23 6 -25 -19 -27 2 -5 -33 -20 -61 52 -25 -21 -30 -48 33 7 -37 35 -30 34 45 21 41 77 -19
7772 -19 -16 -3 22 24 -40 46 -43 -15 19 23 7 17 -21 -42 -16 25 4 -41 -1 17 -17 -33 -26 -25 -47 -17 -22 -48 -37 -2 22 -43 -25
7805 -25 -12 -80 25 21 -43 -15 1 -54 -69 -27 42 -33 -20 6 42 -22 7 -20 -63 1 21 -4 28 34 1 32 -5 32 5 -90 -42
7836 -42 32 -42 -10 -18 -47 -9 23 -6 -23 7 12 -28 -10 50 -5 23 -57 -33 -51 19 61 -67 -22 9 25 25 19 -47 -84 -31 22 -23
7868 -23 1 32 35 5 4 4 -2 -22 29 -60 -47 -10 38 0 -1 -14 -9 1 0 27 25 52 12 3 -10 -9 -50 -31 13 16 -7 -79 70 -1 68
7903F8j5r3N9K9q9M2j4L8K6o4J0J0o7Q8j5n2Q8oo3L2K0r0M5k0J9M3o3N2k7nM4
7934C0k4pL3l9L1p2L2K1J9mK5k6m2M5k1K1Lp3R4o8Jk8M5MJ03r0nol0K6ol3N2N3
7968F4q0QJ5M0p8O2p6L6l7L8j7oM4mJ4M4o5N9m7j1n4K7J0L7qj8m5O1m6N6m8j8
8000d3N9n4k9N0L5l0K1L6l6K2k3Rp9N2OJ6k6L0K6q8M2k3O3o0L0K5n6J4L3l1j7
8031b6QL1k0N7m1j0nK2J4n2k5N2m4R3n3j3MJ9K1j1l6j2LL6L4o2L8r1J06n3K1J8
8063B3l2MM8l7j3K0kl2Q1l8k9L8QJ4n9P6n8l1L3k1K5Qk6M2p5L6%N5n5K3K3l8j3
8096bQ2q6k4M5Nql6NK6j9RK7m8R5l3l8m2O6m9J5nL7l8N4k5k7Kj2K0m7M9llkN6
8131D6l2j3l7L2pN0k5k5L2l4l0L8KJ1K1J5o2O9Kk8m7K0j6Q5k5n3J7J0K0J9n0m
$$ plain form
7903 68 53 -40 19 48 -41 1 -13 25 51 -13 -3 7 -60 28 13 -39 49 43 -20 12 32 -58 -13 -33 -14 29 -34 18 -9 -14 30
7934 30 6 -1 32 -7 24 -48 -16 5 24 20 45 19 -23 22 1 22 25 -48 46 -22 -21 -49 -4 0 103 13 8 2 -28 -2 -8 -41 11 64
7968 64 -16 -8 7 47 -31 31 -45 -9 -46 -8 -25 -31 13 9 23 67 2 61 14 3 -51 -24 -14 23 15 -3 -48 13 -33 23 -25 -43
8000 -43 16 -38 -67 -17 18 -12 9 45 9 31 8 17 -62 -10 -4 12 -14 16 42 -46 -4 -27 36 -24 6 31 -25 -11 22 -9 -26
8031 -26 -18 13 -7 50 9 -1 -6 16 30 -22 -47 5 -39 54 1 -12 -8 11 32 21 -15 -27 -24 12 46 -16 22 -69 37 -16 5 23
8063 23 -9 -5 43 6 -7 13 11 -21 60 22 -7 31 39 53 -6 70 12 -19 14 -7 18 26 0 42 -33 3 3 58 3 26 49 11 -2
8096 -2 80 -6 -30 15 20 12 -24 -19 7 -12 -3 24 -24 71 38 0 -42 24 -25 -10 -15 22 -16 38 13 -14 -12 -24 -4 -51 -2 -5 -8 -10 46
8131 46 14 1 -36 -4 -11 39 14 -11 21 -13 -43 -5 -3 8 29 44 -18 51 53 25 -22 -2 -18 67 42 -11 6 16 36 55 5 1
8163AJ1n0K2L7L4j8l9Jk2K8NLq2N9k6K0j3L0J0o9J2L1j7K9O4o7oJ1
$$ plain form
8163 1 12 -38 -16 21 55 37 -2 -1 -23 5 10 13 -69 -10 -36 -16 -29 1 11 -58 -46 -15 -32 -3 61 -6 -12 -1
8191a
$$ Imaginary data points
##PAGE= N=2
##DATA TABLE= (X++(I..I)), XYDATA
0@%%%%%%%%%%Qj6J6j6K4l2M0m8N6p2Q2r7J19j36J60j87K14k50K87l28L76m29M88
33B59n52O24p03P91q87R91j105J230j368J519j683J861k056K270k503K757l039
50a594L350l689M065m484M954n483O083o774P574q515R644j1021J2747j4991J8034
65I900k2410K9277m1649P0686k59810j63612N17356p8031j01645K38411l3420
76A65053l39531J68470K55627j88742j03992K35576m9757j72534R6865k1768k47134
87b01867P4389K12303n7995q5652K5704j18303p4208J80711J12058r7929K0116
98a0673Q2653r0140l9194J26504K07o5063J04732P9838j19265j00526J7126o953
110b0754j0854R3222M3970j26459r5783L6171J2614j1235N9392L7495m9465j6275
$$ plain form
0 0 0 0 0 0 0 0 0 0 0 0 8 -8 8 -8 16 -16 24 -24 32 -40 42 -55 64 -72 88 -99 115 -135 152 -176 200 -229 259
33 259 -293 331 -372 419 -468 523 -582 648 -720 799 -884 977 -1079 1191 -1312 1445 -1594
50 -1594 1756 -1933 2132 -2352 2602 -2881 3202 -3572 4002 -4513 5131 -5890 6857 -8134 9900
65 9900 -12510 16767 -24882 45804 -214006 -377618 139738 61707 -39938 198473 165053
76 165053 -174478 -6008 249619 60877 -43115 192461 142704 -29830 67035 45267 -201867
87 -201867 -127478 84825 26830 -58822 -33118 -151421 -225629 -44918 67140 -30789 -10673
98 -10673 71980 -18160 -57354 69150 69357 4294 109026 188864 69599 -30927 -13801 -20754
110 -20754 -31608 61614 105584 -20875 -116658 -80487 -67873 -79108 -19716 17779 -31686 -47961
122d7961M4918j7981l9925O7522O0760l3537K0103L6845q4665m3859P9319L888
134D5427m4355O5811J4869j35227k9172R4734l7547m1444J25391M0j69453J4400
146i6526J09530n3459j2149J13039k8950j00158P2554O4272r2180n783R6726k2846
158D4070l2024O3840l4095r6857L2588N5881j6361J0550r72p4754j6057O3139
170a052p172l9718L1320O298l0679M2897K0260o7245N820P2054L423o238J8357
183D8325m5223m2129O0858N0962l8462k5115r77l6963R098N4572l3339n7630K8860
196b7163K2711j6253J6461j956m9597P847O9110J5162l0121K265k860j9571L4791
209B0826L5282l7749k7261K0477N637l947M086j7511k7059N937K4688m561k2435
$$ plain form
122 -47961 -3043 -21024 -60949 6573 67333 33796 53899 90744 6079 -37780 41539 45427
134 45427 1072 66883 81752 -53475 -82647 12087 -25460 -66904 58487 58527 -110926 -96526
146 -96526 13004 -40455 -52604 60435 31485 -68673 3881 68153 -24027 -29810 66916 44070
158 44070 12046 75886 41791 -55066 -22478 33403 17042 27592 26620 -48134 -64191 -1052
170 -1052 -8224 -47942 -16622 -10324 -41003 1894 22154 -45091 -39271 32783 36206 29968 48325
183 48325 3102 -39027 21831 72793 34331 9216 8239 -28724 -19626 34946 1607 -56023 -27163
196 -27163 -4452 -20705 -4244 -6200 -55797 -47950 21160 36322 6201 8466 5606 -13965 20826
209 20826 56108 18359 -8902 11575 17212 13265 17351 -160 -27219 -21282 3406 -1155 -23590
222b3590j320M559M354J9779L866k0854o220J5540K0216P491q272n597n267j496
236C189J6630O47k4917m401J3244Q40l988l30q919j6164O823K2013q946j2693
250a6972J6096j346r582K0962M984k1261L212J5408n859o110J3446J810j8426
263c638M519J1181j9116k238J9682j0938j0552J5178j587j3172M646N176r020
276i879j783J6061K938j1733O778L610j2581P713R878j2233j748Q961l53p73O76
291E532l243o746o64R903k75p665K145l073l325Q932j717r311N40K901O714O446
307G094k922m221l956K008R581l12n094r53k655N512P548n609p486n294r68R199
323A472L161n123m655o315L009R915m18m301l587o58R834P783n95n521r931J720
$$ plain form
222 -23590 -24910 -20351 -15997 3782 7648 -13206 -19426 -3886 16330 23821 15549 9952 4685 3189
236 3189 19819 20466 -4451 -8852 4392 5232 1244 914 -8005 -24169 -17346 4667 -4279 -16972
250 -16972 -876 -2222 -11804 9158 14142 -7119 -3907 11501 5642 -468 12978 14788 -3638
263 -3638 881 12062 -7054 -9292 10390 -548 -11100 4078 2491 -10681 -6035 -859 -9879
276 -9879 -11662 4399 7337 -4396 2382 5992 -6589 1124 11002 -1231 -2979 5982 5629 4856 5532
291 5532 2289 -4457 -5121 4782 4507 -3158 -1013 -4086 -7411 1521 -196 -9507 -8967 -6066 648 7094
307 7094 4172 -49 -4005 -1997 7584 7272 2178 1225 -1430 4082 11630 6021 -1465 -6759 -7727 1472
323 1472 4633 -490 -5145 -11460 -8451 1464 1046 -3255 -6842 -7500 2334 10117 9522 4001 -5930 -4210
339d210J1591J924j939m787q229N021R760k531r448q476L38P744O035K526r595
354d276j1689R572J2222j276j716n853n606J0826J3340k640j4160p458N859O129
368C274N333K174j4777q708J4444Q191n473o272j0563m760J2655J5950j209j5696
382e437n315O894L979O612J442j3649k307J3410M348m484n805n588M42Q264Q869
397A1675n414j4124Q09Q109J718K479m589j1115K225R286R95m763j777N180L800
412D494K91j205j1629o744J3922J1536P40k09r375j2114K577J0289K929l274J945
427D173O62q976o71K893r142M739J6291o558r255P354k283r195P951R871p312
442E42RJ3786j1640k0327J5196J0756r650J7302Q919l8330j6511K6839Q205m439
$$ plain form
339 -4210 7381 9305 7366 2579 -5650 -629 9131 6600 -2848 -11324 -10986 -3242 2793 5319 -4276
354 -4276 -15965 -6393 5829 4553 2837 -3016 -8622 2204 15544 12904 -1256 -8714 -2855 3274
368 3274 8607 10781 -3996 -12704 1740 9931 4458 -1814 -12377 -17137 -4482 11468 10259 -5437
382 -5437 -10752 -3858 121 6733 8175 -5474 -7781 5629 9977 5493 -312 -5900 -5458 2806 11675
397 11675 6261 -7863 -7054 1055 2773 5252 663 -10452 -8227 1059 2054 -2709 -4486 694 4494
412 4494 4785 3580 -8049 -14793 -871 10665 11405 11196 1821 -10293 -7716 2573 5502 2228 4173
427 4173 4835 -4141 -4812 -1919 -11061 -6322 9969 3411 -5844 1510 -773 -9968 -2017 7854 542
442 542 551 14337 2697 -17630 -2434 8322 -1328 15974 24893 -13437 -29948 -3109 5096 657
456F57J6541m966l6153O343L1390j9303j3263L5007k244k5689K3337L413m4752
469b9682P057M5963p053j8113K0337j4500m1095K9996L7592l6894q741M0347j9773
482E441l2024K9087K032l4968K9375M6009l5267l8031K3473k819j9109N0141K6718
495E0058o0678j8999L7499j1991j4390L9069J668m3909J6362L8845l8649l4565
507c9680L8973J0593k1031L5700J4248o3709j7059M8391R12j8733L4482O324n5423
520b6012J635M5928k6832k5302N3026R752m8338J1588K0093m3106J095O3682q366
533B8843n2150K2680J8487m7685J1946N5846l3142l4241M9247J660n4536J8610
545a4435L3340l6556K240N8643k4429n8787L3411K3914m2673K2320M9677m4099
$$ plain form
456 657 17198 12232 -23921 -17578 13812 -5491 -18754 16253 14009 -11680 11657 15070 -29682
469 -29682 -22625 23338 16285 -1828 18509 4009 -37086 -7090 30502 -6392 -15133 25214 5441
482 5441 -26583 2504 4536 -30432 -1057 44952 9685 -28346 -4873 -7692 -26801 23340 50058
495 50058 -10620 -29619 7880 -4111 -18501 20568 22236 -21673 -5311 33534 -5115 -39680
507 -39680 -707 9886 -11145 24555 38803 -24906 -41965 6426 7338 -11395 23087 29411 -26012
520 -26012 -24377 21551 -5281 -30583 22443 32195 -16143 -4555 15538 -27568 -26473 37209 28843
533 28843 -23307 -627 17860 -29825 -17879 37967 4825 -29416 19831 21491 -33045 -14435
545 -14435 18905 -17651 -15411 43232 18803 -39984 -6573 17341 -25332 -3012 46665 2566
557B566l1669M4931n848m1827L5930L2639m6033q952M0096k8034l1046N1322J3326
570B7401m9626J1546K9572l4012n926M3830j1959l5599K9524K2234l6099l289
582a2403K7797k0195j0236M0729p94m1407M038J8267j4458K427K4776j3050k7397
595b1906J5126J5118j8359L76J7927q979o203J6387m077j9767Q994K1424m060
608A2001j0967L350o264r976J7114J3655j6543r631O730k977k696Q446k837j3836
622a4431O840J8161o166j3502K667j905J88K0879O687j9246o863O931j81M139
636D198J1103o686j5703N898Q541j0905j598Q036q107j103J2120q726j4357R663
650g626R616l468M952M988j4105o212J6843L007r034J0353L399j4944L689P756
$$ plain form
557 2566 -29103 15828 9980 -31847 4083 36722 -9311 -18263 21833 -6201 -37247 14075 27401
570 27401 -22225 -10679 18893 -15119 -21045 22785 10826 -24773 4751 26985 -9114 -12403
582 -12403 15394 -4801 -15037 25692 24898 -16509 -12471 5796 -8662 -6235 18541 5491 -21906
595 -21906 -6780 8338 -10021 -9645 8282 -697 -6900 9487 5410 -14357 -5363 16061 12001
608 12001 1034 4384 -1880 -11856 5258 18913 2370 -7261 -531 -3508 -6204 2242 -595 -14431
622 -14431 -7591 10570 4404 -9098 -6431 -8336 -8148 12731 19418 172 -6691 240 59 4198
636 4198 15301 8615 -7088 -1190 7351 -3554 -5152 2884 -5223 -6326 5794 -2932 -17289 -7626
650 -7626 1990 -1478 3474 8462 -5643 -11855 4988 7995 -1039 9314 12713 -2231 1458 9214
664I214j4301l372J6208L5j0654L773j486j6593M104J8398n750o286J2282n744
678a72j3808J2260R028r181M156J1366r177j0069J0160L012j0704O876R053j4405
692a605m971J0678o934q909J0602M920q000P20M625r326o112J4129P883p048L278
707C930L136j1059MJ1417j135n905M055L936o079l606L583n497n950J0436N093
722F359j0348k391K981l601J332Q427j22q192J405Q452k451k508P013k808o032
737b484Q407L291r955j994M969q37j211M339k388j0926R55Q677l380j972N825
752A316m362m241P907K820n760RM741J62l59M552j613p833K849N587l880r08J534
769B521n097j353M595M29l777j680Q55m84O96L830q53l407L116K448q51J858l69
$$ plain form
664 9214 -5087 -8459 7749 7784 -2870 903 -583 -17176 -13072 5326 -424 -6710 5572 -172
678 -172 -13980 -1720 7308 -1873 2283 13649 4472 -5597 4563 7575 -3129 3747 12800 -1605
692 -1605 -6576 4102 -2832 -11741 -1139 3781 -4219 -3499 1126 -8200 -14312 -183 7700 652 3930
707 3930 7066 -3993 -3989 7428 6293 388 4443 8379 2300 -1306 2277 -3220 -9170 1266 6359
722 6359 -3989 -6380 -3399 -7000 -5668 2759 2637 -5555 -4150 4302 1851 -657 6356 3548 -2484
737 -2484 5923 9214 -741 -2735 2234 1397 186 4525 2137 -8789 -7834 843 -2537 -4509 1316
752 1316 -3046 -7287 620 3440 -2320 -2311 2430 2592 2233 6785 5172 -2661 188 5775 1895 987 2521
769 2521 -2576 -3929 666 1095 -2682 -4362 -3507 -3991 -3295 535 -318 -3725 -609 1839 988 2846 2477
786B477k238J272K428R10j219k613j141m88P35J653k408k579L06M8J411P40k671
803c377q66J405J732K855J80k033j46J237K355J044j964j207n05P47K412j195
819B674l253j111q11Q17J807j455j915k65N07J901L96r85j96K49K371K313q54
836B190l33j26o21J789K47k094m16K7J64M81j119j783j367J3J880k99r93O75p49
855b434O68K607p28j068R46L00J049J621K72o95j505j5K63r22J235K02k933j55
873a292P34j106Q81K41k182p97R74K054J172l08j76j624j10L818P56k071K31o12
891E83j1K633M02k636k369j76J537J10R6K64k873n10K854j117j523J390M38M89
909d19J486J03j758j109L159K441k899q43Q46j755K068L549l550m419Q95K353
$$ plain form
786 2477 239 1511 3939 4849 3630 1017 -124 -612 123 1776 -632 -3211 -2905 -2857 -1446 -706 -3377
803 -3377 -4243 -2838 -1106 1749 1929 -104 -250 987 3342 4386 2422 1215 710 1457 3869 2674
819 2674 -579 -1690 -2501 -1684 123 -1332 -3247 -3512 -3005 -1104 -708 -1693 -1889 -1640 731 3044 2190
836 2190 1857 1731 1110 2899 3146 1052 636 663 827 1308 189 -1594 -2961 -2948 -1068 -1367 -2360 -1685 -2434
855 -2434 -1766 841 113 -955 -9 291 1340 2961 3233 2538 1033 1018 1281 359 1594 1796 -1137 -1292
873 -1292 -558 -1664 -783 -542 -2724 -3521 -2547 -493 679 371 195 -1429 -1539 2279 3035 964 1195 583
891 583 572 3205 3607 971 -1398 -1574 -37 73 169 433 -2440 -2950 -96 -1213 -2736 -1346 -908 -419
909 -419 1067 1170 -588 -1697 1462 3903 1004 161 1007 -748 1320 4869 1319 -3100 -2205 148
925A48K85k2K16l889k415O529L095n396r71J095k405L629O242l042o115J512L373
942A869j708J152L901n357m167O832O31o210K822K494n309M73N240k963m765N240
958A75L286o411O81N812n087j908Q076k005o907M924M255n532o50M746l865m407
974d817P849L011q830J23M528n610q5Q667k199p269L228L326m947N50P097k825
990A797n742N541J499o832L271N922n455k890N340p50n097L229L631n938j218
1005c692P478j546o194L475P47n269M498P144m560n762K995O80l568M838N290
1020F554o718l267N902j881m699M863K110n133J729M786m770m810N189K367m204
1035a982L209L047o807j281O353j638l634M267J754m356L97K658m724k161P015
$$ plain form
925 148 433 411 627 -3262 -5677 852 3947 -1449 -2420 -1325 -3730 -101 6141 3099 -3016 -1504 1869
942 1869 161 1313 5214 -143 -4310 2522 3153 -3057 -235 2259 -3050 -2577 2663 -300 -5065 175
958 175 3461 -2950 -2269 3543 -1544 -3452 4624 2619 -4288 636 4891 -641 -1291 3455 -410 -4817
974 -4817 3032 6043 -2787 -2664 1864 -3746 -3831 4836 2637 -4632 -1404 1922 -3025 -2475 4622 1797
990 1797 -3945 1596 3095 -3737 -466 5456 1 -2889 2451 1701 -3396 -167 3464 -2474 -3692
1005 -3692 3786 2240 -3954 -479 268 -5001 -503 6641 2081 -3681 -686 -6 -3574 1264 6554
1020 6554 -164 -3431 2471 590 -4109 754 2864 -2269 -540 4246 -524 -5334 -145 2222 -1982
1035 -1982 1227 4274 -2533 -3814 2539 901 -2733 1534 3288 -1068 -671 1987 -2737 -4898 2117
1050B117K298m353P43p29n268K338O549q39k983J072p07k918J990K899k993n98
1066a382M084r22l009J032r08k019K958L012j537k041M0p99r03K961K060j943
1082F84o6P07k696o87K251M94L11J048p70k735r90J436O51M45J932p60k841M34
1100a152N10j206J446K011k87n45j6r76j642Q17K583k95o78J340j832k503J370
1117a055J090m70J309J322j961k500O35J190o60J960K251l174j912K309o52j134
1133a452K495J026k039K2J455j923k442K673J790j965J618J268m378j207L406
1148C47k0j000K064L26l140l47K725j324j723L519P23l131J171J117l240L57L489
1165A913l27k088Q86L96k596M23L298j375k013K463k63k748J328J353j680J64
$$ plain form
1050 2117 4415 62 805 76 -5192 -2854 3695 2856 -127 945 238 -2680 -690 2209 -784 -1382
1066 -1382 2702 1780 -1229 -197 -1105 -3124 -166 2846 1309 -732 -692 -1491 -2394 567 2627 684
1082 684 618 1325 -1371 -2058 193 687 998 2046 1276 -1459 -2449 -1013 -362 83 2015 1255 -1586 -1152
1100 -1152 -642 -1848 -402 1609 1322 777 761 -215 -1857 -1040 1543 1248 570 1910 78 -2425 -1055
1117 -1055 35 -435 874 2196 235 -2265 -1630 -440 -1100 860 3111 -63 -1975 334 -318 -1452
1133 -1452 1043 2069 30 52 1507 -416 -2858 -185 1605 -360 1258 2526 -1852 -3059 347
1148 347 327 -673 1391 1717 -1423 -1770 955 -369 -2092 1427 2150 -981 190 1307 -1933 -1576 1913
1165 1913 1586 -502 384 780 -1816 -1393 1905 530 -1483 980 717 -2031 -703 650 -1030 -866
1181h66K335m56k401O10J477j624N12K819j409j950J450O8j560J008J407j182
1197B38j210J329K00k032O62J582j677p2J926q01j510J101P81o83L27J368r80
1214E49j828J500J068j501O08J016j766o39J412k65j115M06Q87p95k79J354q15
1231b03j573J637J001j042N46N41j162j66J218J44j015N4O97p67k17J095r18j096
1249a226J065L02o67J73M0l48Q4R95J53r55J04N89l42K32O86p36l02N36M7k42
1269A88k67m2p7j08M53L5p01J09K27l19L85J60k15J00J45J46K9k07J23m3k42L57
1291B36J80l04Q9k04j55Q8m1J02r4k31L47pj35K09k72k84L83K22J15l1k41j14
1313a42J15K41K47m65l58L54l4M01K50o66m46K54K04L73j11n20j59J14N69K21
$$ plain form
1181 -866 1469 1013 -1388 -778 699 -925 -413 2406 997 -953 497 565 -995 13 1420 238
1197 238 -972 357 557 -1475 -813 769 -908 -980 946 145 -1365 -264 517 -166 161 1529 549
1214 549 -1279 221 1289 -212 396 1412 -354 -993 419 154 -961 -555 332 -463 -742 612 -203
1231 -203 -1776 -139 862 -180 366 907 -255 -421 797 941 -74 -20 677 -90 -307 788 -130 -1226
1249 -1226 -161 141 -526 -353 -313 -661 -577 418 571 -384 -280 309 -33 199 885 149 -153 383 430 188
1269 188 -79 -121 -198 -306 147 182 -519 -410 -183 -502 -117 43 -172 -72 73 219 248 41 164 121 -121 236
1291 236 416 112 201 -3 -158 -70 -111 -9 -103 -334 13 6 -129 80 -192 -476 -93 129 244 213 -28 -142
1313 -142 -27 214 461 -4 -362 -8 -42 359 609 -57 -503 -249 -45 328 217 -303 -462 -348 221 442
1333D42o39k68J29J22O15J77o23k34J66K84L05l49k49m7J60N23o0o51j01l7K11
1354a24M70l91n71J60L30M08O7o11k42mO86P78m29o34j0q4O20M37p00o27K06K02
1376f3N06k1m83m71m09O71P19o74Q9r4k50O47M48l87l39J29K32k8KL84l29n59
1398b80N08j5r04L86M42m33R8L69l52n28L67O04n83q6J050k81n42R05j47j084
1418e06M85P22p05j27P07l58j247N78R90j076%J290j120j085J516O01r07N07O76
1437I41j577n48J992L19j436P62O14j876L77J705j478j343J563P77j227N37O74
1454G76k097p60K662P03j655Q80K77k139N58K239j006j320J629N65j956J32J298
1471G86j571m10K759l85k532O08P50j381R78K261j333j990J449Q03j769M88J810
$$ plain form
1333 442 -197 -465 -336 -214 401 578 -45 -279 -113 171 476 127 -122 -169 -9 514 454 -197 -298 -335 -124
1354 -124 346 -45 -616 -456 -126 282 349 -262 -504 -508 178 956 527 -107 -117 -201 419 856 156 -471 -265 -63
1376 -63 443 422 -61 -532 -941 -270 449 -225 -136 -230 -480 167 615 228 -111 18 250 222 224 608 279 -280
1398 -280 228 213 -691 -305 137 -296 -198 171 -181 -709 -342 262 -321 -407 643 362 -180 725 578 -506
1418 -506 -21 701 -4 -131 576 218 -1029 -451 539 -537 -537 753 -367 -1452 64 665 -242 265 941
1437 941 -636 -1184 808 1127 -309 453 1067 -809 -432 1273 -205 -1548 15 792 -435 102 776
1454 776 -1321 -2081 581 1284 -371 509 786 -1353 -795 1444 438 -882 747 1312 -644 -512 786
1471 786 -785 -1195 1564 1179 -1353 -745 5 -1376 -398 1863 530 -1460 -11 792 -977 -489 1321
1488A321j239l03K213j007k896P57J486n01Q83J528k090k701J316J425j027R67
1504A32J497j872r12J730n74j411J348J522r32j72Q72j634j462K020J256j155
1520B53M32J64k160n16J717K37m68J090K52j841l69Q98o07M14K269n3j545r0n40
1539d63j026J140J833j38p09n3j196j210J184J097p20N72O91j588p24R95k89j49
1557g53J668N71j382k88K22j132J89K697J76j838J91l96j933J172K388q77r44
1574b69R72q59k018J254J547j432M51K648j498k574J247M30j320K054K444k452
1590F25k038J753l17j784K393J755l056l66K649j941k286K807R10k309J385K101
1606B281l303j981L550P02k349K285J349m419l06M063j269k165L067N82l815Q53
$$ plain form
1488 1321 82 -221 1992 985 -1911 -1154 332 -169 714 2242 152 -2549 -1233 192 -835 132
1504 132 1629 -243 -1155 575 1 -1410 -62 1460 528 356 1228 -406 -1868 152 1408 253
1520 253 685 849 -1311 -1827 -110 127 -341 749 1001 -840 -1209 -311 -918 -504 1765 1712 167 77 -463
1539 -463 -1489 -349 1484 1346 637 584 -612 -1822 -638 459 -261 311 1002 -586 -1310 -315 -604 -753
1557 -753 915 1486 104 -184 38 -1094 -905 1792 1968 130 321 -75 -2008 -836 1552 675 -269
1574 -269 703 -156 -2174 -920 627 -805 -354 2294 796 -1778 -531 -101 -1421 633 3077 625
1590 625 -1413 340 23 -1761 632 2387 -669 -1035 1614 -327 -2613 194 1104 -1205 180 2281
1606 2281 -1022 -3003 547 1249 -1100 1185 2534 -1885 -2191 1872 603 -1562 1505 2087 -1728 -875
1622h75K986l024j887M329L00l662K105J442m319K15M785j277l051K750P89m025
1638b419J504M120l198k453M125j90l785K726K121m142k38M263j782l476L130
1653C06J297l883J647L863l686k532M052m7l030K765K085m155o37M115j353l082
1669b275L073J166l835J143L210l114j912L641J37k951J630J795l342l34M028
1684B060o84k908K130O72l191J151L027k097j682K629R1k768J192J684k581k34
1700a509L488q89k681J659M92k198J235K474j719j715J827L08j884J294J461k281
1716f38m96K191q20j534J634M17j643M68J480j335j168J669L39j168J169P80k038
1733f93k99J472k97m26J081j55j345L02Q90p55n68J047j58o53R74N9j303J28Q91
$$ plain form
1622 -875 2111 -913 -2800 1529 1829 -1833 272 1714 -2605 -2390 2395 1118 -1933 817 1606 -2419
1638 -2419 -915 3205 7 -2446 1679 1489 -2296 430 2551 -1591 -1829 2434 652 -2824 306
1653 306 1603 -2280 -633 3230 -456 -2988 1064 1017 -2013 752 2837 -1318 -1955 2160 807 -2275
1669 -2275 798 1964 -1871 -728 2482 -632 -2544 1097 1234 -1717 -87 1708 -1634 -1968 2060
1684 2060 1376 -1532 598 1270 -1921 -770 2257 160 -1522 1107 1198 -1570 -378 1306 -1275 -1509
1700 -1509 1979 1090 -1591 68 560 -1638 -403 2071 352 -1363 464 772 -1112 182 1643 -638
1716 -638 -1134 1057 237 -1297 337 754 -889 -421 1059 -276 -1444 225 564 -604 565 1345 -693
1733 -693 -992 480 183 -243 838 683 -662 -360 530 -225 -793 254 96 -557 417 476 -827 -699 192
1752A92m3n4L99m83p79O18R88m07m96J70o23N7R81j93p10K54K40nL8q1n96k37
1774g70Q76P51m38l74l68m28P18Q46n18n95N7K08L82J2l37p31r0J052N16n17k48
1795Dm66p1Q60M86o42n95j64N34N66N0l24p90k80R34L24l99o3l80M2N73K50l66
1817H3m88n0N97J39P2N4o03m2N93j69l25n1LK46K10j98k37m56L13M79k59nJ11
1840A7l62M67M33l10k53k51O1L64J84K03k83n73J26J17j43L94j42m39J44K13R2
1861E9J35j48l06l38K21Q68K9l61m0m80N7Q45Nn24k98NK67M14K09m76r66J62P72
1884A11p4J01J12o81RP87Q4p19j71M19J64QN16l88r92O15P37o38j86K48l64J73
1906a29P45j46j217j38J131J34k74L63q61q28J402J088r79p39Q3j73J78J347J99
$$ plain form
1752 192 149 95 494 11 -768 -150 838 431 -65 105 -518 -461 520 327 -383 -129 111 106 144 63 -533 -770
1774 -770 106 857 419 45 -323 -751 -33 813 295 -300 -243 -35 347 359 22 -709 -799 253 769 252 4
1795 4 -462 -533 327 813 171 -424 -588 -54 512 562 238 -552 -832 102 426 27 -36 -416 -374 199 449 83
1817 83 -405 -455 142 281 353 407 -196 -238 355 186 -139 -190 -187 59 269 71 -166 -622 -309 170 -89 -94 17
1840 17 -345 122 555 245 -8 -259 -198 166 350 553 270 -303 -177 -60 -203 191 49 -390 -246 -33 59
1861 59 194 46 -260 -598 -377 491 520 159 119 -361 -304 541 546 22 -276 -271 -4 410 619 143 -823 -661 111
1884 111 37 138 250 -431 -422 365 449 -270 -441 -22 142 150 666 278 -714 -99 638 0 -186 62 -302 -129
1906 -129 616 470 -747 -885 246 380 106 469 -392 -1220 182 1270 291 -448 -365 -538 -360 987 1186
1925A186j828k96J306k73k56Q47q93r62J341J038j091o78L93k52k37J527K74j836
1943f90J41J069q82j16J200m88r08Q12O36j063m61J272k70o90R94j05j561O43
1961d67J219o68k12N71m45q06O76Q08q11j93J022m27p35Q65k79j018O20R11l55
1980B76j84K31n94q52O75J023m80O2L07r98j53J165o7m73K82j06l37L63M96m77
2000A59n86N01J58n69N81k06r89N50R54m50j73J40p19j75J071O66q87k61P60o32
2020a07l01J339o54j244J289N31j092M2N99r31m20J633R0k037M54J502j210K13
2038c04J757j686j576K073R13j521M24J332j739q73K466l32k700J585J711k294
2054g64K12K012k178j775K935J135k496M64J774k514p94L825k06l321J945J472
$$ plain form
1925 1186 -642 -938 368 95 -161 686 -207 -1169 172 1210 119 -559 -166 -418 -655 872 1146 -690
1943 -690 -549 520 -362 -478 722 234 -674 138 774 -289 -750 522 252 -438 556 451 -1110 -467
1961 -467 752 84 -128 443 -2 -808 -132 676 -135 -328 694 267 -468 397 118 -900 -280 631 276
1980 276 92 323 -271 -1123 -448 575 95 157 464 -534 -687 478 411 -62 220 114 -223 140 636 159
2000 159 -427 74 232 -337 244 38 -951 -401 553 103 -70 70 -649 -824 247 913 26 -235 525 -107
2020 -107 -408 931 277 -967 322 853 -239 -197 402 -529 -949 684 774 -1263 -809 693 -517 -304
2038 -304 1453 -233 -1809 264 1177 -344 80 1412 -327 -1200 1266 934 -1766 -181 1530 -764
2054 -764 -552 1460 -718 -2493 442 1577 -919 -455 1319 -1195 -1989 1836 1630 -1691 254 1726
2070A726l104M20L080j771k093L063P54l791M26K802k585p84M402r63m129J853
2086f94J745l052P53M104j800l092K818P61m026J520L764k733j442L813j392m199
2102c152K485K721k957J21L613k621l885L613J690l595J785L420l806k002L825
2117A255n17l335K968K928l565r35L296k553l140M487K034l704P69K161l891j660
2133c402M424N87l181K000J902m067n62L982j549k329L738R66l779N37K209k623
2149a147q52M135J00l552J093J386l221M36L890j389k403K135J51k925J085K682
2165A604j570r81K753n90l223J413J597j865R03K365j804k176J402O04j574J038
2181a04J813j943j036K034n32j877J481R23j237N41J110j357j238J348J013q31
$$ plain form
2070 1726 -1378 -958 2122 351 -1742 1321 2075 -1716 -1290 1512 -1073 -1857 2545 1582 -2547 -694
2086 -694 1051 -2001 -1248 2856 1056 -2036 782 1543 -2483 -963 2801 68 -1374 2439 1047 -3152
2102 -3152 -667 2054 -903 -782 2831 210 -3675 -62 1628 -1967 -182 3238 -568 -2570 1255
2117 1255 738 -2597 371 3299 -266 -1201 2095 -458 -3598 889 2923 -781 -12 2149 -1742 -3402
2133 -3402 1022 1609 -1572 428 2330 -1737 -2299 1683 134 -2195 1543 2509 -1270 -733 1476 -1147
2149 -1147 -1999 2136 2236 -1316 -223 1163 -2058 -1622 2268 879 -1524 611 762 -2163 -1078 1604
2165 1604 34 -947 1806 1216 -2007 -594 1003 -862 41 2406 602 -1574 -172 432 -1142 -104
2181 -104 1709 -234 -1270 764 232 -1645 -164 759 -478 63 1173 -184 -1422 -74 939 108
2197A08N30M63j907m68J874q5o53P46k48j060L08O96o39m36R76L87p17L01p2j305
2217a201N39J430j89k37P0o41l55O55N91n87l28N76j66l51N69m42p86P73O05n68
2237d3k4j25m56K26Q26K88q33j59M23m62L21Q51o34n79P29j4n66K38M6l53J00
2258b00O27p6r05K63L20o10N02O36p96j11N68j13k35K17J10m27jQ07k12p29N35
2279A70J1o08N48K91o86j38L93K05j41P6M4o06j89R99k3l30K46k76m33N30L70
2300D53l20l39l0K70k8K70K41q60k71O32Q1L0J08l49k28K53L51M6n22k8K24j00
2322a16L93J31n54j18L63r2K3q4j88J57J66L13k74n51J25L64O2K03k21m80K15
2343a63L38J94k48m77n6J83L69M78m18p47K01K49K19L37l57n22J73L31M80l03
$$ plain form
2197 108 638 1101 -806 -1274 600 515 -138 608 360 -700 -392 304 -335 -771 205 592 -125 176 104 -1201
2217 -1201 -662 768 579 342 412 -229 -584 71 662 75 -253 323 157 -194 375 -67 -853 -80 525 -43
2237 -43 -67 -192 -648 -422 404 692 -141 -300 123 -339 -18 833 199 -380 349 335 -231 7 53 -300 -200
2258 -200 427 351 -554 -291 29 -581 -79 557 -239 -350 218 105 -130 87 197 -230 -231 576 364 -365 170
2279 170 181 -427 121 412 -274 -412 -19 186 45 121 165 -441 -630 369 346 16 262 -14 -447 83 453
2300 453 133 -206 -236 34 6 276 517 -343 -614 18 99 129 237 -112 -340 -87 264 310 -212 -240 -16 -116
2322 -116 277 408 -146 -264 99 7 30 -54 -242 -85 81 394 120 -431 -306 58 120 323 102 -378 -163
2343 -163 175 369 121 -356 -412 -229 140 618 200 -547 -346 -97 122 459 102 -420 -247 84 564 261
2363B61l94j88n1M18M18k32l72P2j45L02J40j86k30j01L70J75l22J04j5l40L48
2384C2K64m57Q7K09n6O5k12R7j16j90N41Qm90K47L2k27L53R5m24j95K94K91j12
2407A36K7P8n04k49P52k8l82L88k37k96L86L11k51l63Q7K01k19M18K97p78j62
2428c88M62j03l4L84m06k97K26N23j31m43R8q7k45O56K95p08O2K17k03K10J98
2449B86k70j96K36L14j82l81J79k00k5O60k94n35K57P8O0L62j24m45j79L99K79
2470B79l27P6J37l62L56M65q84l54N64J7K43M74m12q90p3P83R2k35N02k96q54
2491f99P62M61r87Q5Q67m62k37R67m37j385M88J311m28n43R89r49j184J569O86
2510H74j109J86Q23j128o83J347J79j376J015J311j763o10J540r07r98J964Q12
$$ plain form
2363 261 -133 -321 -372 46 464 232 -140 -68 -213 89 229 43 -187 -288 82 257 -65 39 24 -316 32
2384 32 296 -161 -74 135 79 144 -68 29 -87 -277 264 272 -218 29 61 -166 187 282 -142 -337 -43 248 136
2407 136 163 241 -263 -512 240 212 -170 218 -19 -315 71 382 131 -232 -145 56 -163 255 552 -226 -388
2428 -388 74 -29 -63 321 -85 -382 -156 367 236 -207 -109 -196 -441 215 510 -198 -136 81 -122 88 286
2449 286 16 -180 56 370 188 -193 -14 -214 -239 421 127 -408 -151 -73 -13 349 225 -220 -399 0 279
2470 279 -48 28 165 -197 159 624 -260 -614 -50 -33 210 684 272 -618 -691 92 184 -51 451 155 -699
2491 -699 63 524 -463 -378 489 27 -210 757 320 -1065 -577 734 306 -237 752 -197 -1381 188 874
2510 874 -235 -49 774 -354 -1037 310 489 -887 128 1439 -324 -934 606 -301 -1299 665 1477
2527A477j880p6J196j259r02K247M03k138R84J244k297l13K313p33j298J918M63
2544A349k571RK220j147r20K689l21l177J279J665j890J61K514j206k333J790
2560A11R90k588N76K678j689j278K579n96l120J634K220j817p9K330j572k708
2576b329K148J686k376O50K374k351j757K674P5k524J652J996k350p30K312j084
2592F6k267K722J492k824L15J931k071j194K799L18k365J108J608k363q30K497
2608I42p13j834K502Q96k852K2J702j253n66K553J9k579O92J540j793j83K344
2625A439r74j797J847N40j990K95J509j136o16J935j79k156P36J336j317K06J612
2642A290j128j340J271M66j037M53J052j047p54J317k02j372R85Q24j098K35Q00
$$ plain form
2527 1477 -403 -479 717 -542 -1444 803 1206 -932 52 1296 -1001 -1314 999 266 -1032 886 1349
2544 1349 -1222 -1213 1007 -140 -1060 1629 1308 -1869 -590 1075 -815 -654 1860 654 -1679 111
2560 111 1101 -1487 -911 1767 78 -1200 1379 783 -2337 -703 1517 -300 -379 1951 379 -2329
2576 -2329 -181 1505 -871 -221 2153 -198 -1955 719 794 -1730 -78 1918 -432 -1162 1150 66
2592 66 -2201 521 2013 -811 -496 1435 -636 -1830 969 1287 -1078 30 1638 -725 -1555 942
2608 942 229 -1605 897 1793 -1059 -1037 665 -588 -1154 1399 1418 -1161 -469 1071 -722 -905 1439
2625 1439 465 -1332 515 1055 -935 -640 869 -267 -883 1052 873 -1283 -547 789 -528 -322 1290
2642 1290 162 -1178 93 559 -478 -25 1027 -20 -774 543 341 -1031 -46 778 -320 -85 715
2659G15j004o47J062K63o79K89N50p31k47R59l75p88Q31J66o18M34J83p33q6O71
2679B15O1l79J56N9o47K93Q53n56k97M79l57k07O22l8n32J32L71k14j47L99k77
2700a1n84O85L95o38J68K66o01N7O27k86m24L46K75l39k4M97o20n00R96N4o47
2721c08M87P4p08K00P14l09n38M84K95o96K65O81r16k81Q40p9n69N07J3n78J60
2742b62P33k59o16M18J51o54N00O86q23j59O91k43m69M01J55n15M0P97l88p57
2762e73O14J4n34N48L59p12j23O07k9l84J47K53m21J46P37m23o17M15O9k67M33
2783B59L3n58j22M04K33k95K2P5m55R7O87j73l73K41p7n8K04J11k06l04L21K02
2805B68k56J13M8m50J01L64k00j37J40k4k3%J38j71j92L91P7k63J22kj62J89J56
$$ plain form
2659 715 -289 -936 126 389 -290 -1 549 -182 -429 530 155 -633 198 364 -254 180 363 -370 -456 215
2679 215 276 -103 53 112 -535 -242 611 55 -242 237 -120 -327 295 257 -275 -143 228 14 -133 266 -11
2700 -11 -595 90 485 -153 15 281 -320 -263 364 78 -346 0 275 -64 -88 409 -211 -711 285 339 -308
2721 -308 179 253 -455 -255 459 150 -388 96 391 -305 -40 641 -275 -556 284 205 -364 143 156 -422 -262
2742 -262 471 212 -404 14 165 -489 11 697 -126 -285 406 163 -306 95 250 -265 -225 572 184 -573
2762 -573 41 55 -479 69 428 -284 -407 200 171 -213 -66 187 -234 -88 649 226 -391 24 93 -174 259
2783 259 292 -266 -388 16 249 -46 -24 51 -404 -307 380 207 -166 75 -2 -60 144 255 49 -255 66 268
2805 268 12 125 173 -277 -176 188 -12 -149 -9 -33 -56 -56 82 -89 -281 110 187 -76 46 44 -118 71 227
2828B27j95j32j1K16L0r4J78l17j82K76O2j4Qj70m7J22J13P9k88j00J93O1Q7K01
2852C03l50j51K19k2J58P6k73k0p4K45J08j76j63J45k48L05N6k07K3r3R8R9k3
2875C5o1Nj24K07J80k63R3k8j76L07j10j32O6n1N9R5j63ro9NL42j27j73N2p4L5
2901g9L24j95r2o1K3L04m4j22J0k48N8K56r2o6N2j75J18J90j23j08j67Q2K08K4
2925G7N7j21k37J96O8NJ43j02k12J62P5o3n7j1J3r1J55R9k97j18L30j06n8K08
2949A15j59j89J46J16P3j66J77Q1l25J31J94l57P4L98k40j61K47j97k04J90K99
2970B43k04k34K94j31l41M72J32n23J48M66k60k08L27p4m29K62N89m51l86N33
2990B25l12l90P91J21p45M6M38l39p8N61l6p34K75O71p19p6P15l62n22Q08J74
$$ plain form
2828 227 32 -100 -111 105 135 41 219 -98 -280 -4 58 44 52 -118 -165 -43 70 149 -139 -239 -46 15 102 303
2852 303 -47 -198 21 -1 157 233 -40 -60 -134 111 219 43 -120 25 -223 82 138 -69 -46 -139 -41 58 35
2875 35 -26 -21 -145 62 242 -21 72 44 -132 175 65 -67 -1 -52 7 102 -61 -70 -139 -134 208 81 -92 -40 -114 -79
2901 -79 245 50 -42 -103 -80 224 180 58 68 -180 -122 134 42 -24 28 -147 -29 161 38 -70 -237 -155 53 77
2925 77 134 13 -224 -28 40 45 188 86 -126 36 111 48 -9 -20 -7 -98 57 156 -141 -259 71 -35 -93 115
2949 115 -44 -233 -87 29 102 -64 113 194 -131 0 194 -163 -89 309 69 -92 155 -42 -246 -56 243
2970 243 39 -195 99 -32 -373 99 231 -292 -144 322 62 -146 181 107 -322 -60 529 78 -308 225
2990 225 -87 -477 314 435 -310 -264 174 -165 -243 318 282 -452 -177 494 -225 -301 414 52 -470 338 512
3011E12p92J6N51l53l62P65N3r29M03N58p91L5P80m06n27O45K12p70J09Q53n09
3032E3n03Q49n2j010O82N24p39k41Q04l25n65P27K68r47J06R54o08m52R18k48
3052A95q79O35O63o83j09N39l67o52Q18L81q41J13P17p19l22R76k90p40N16M39
3072C90n95n7P22m26o70P56L52q02K81N28o81j40O62j68m86L33L94n70j80O92
3092C35k98m40O69J8o83L37L33m49J2M37j49m35K97L63n51lN32m21k07O35j50
3113A82m56J70J73k06J37L24k58l78K09K80l43J78L16m72j0L36j80j97K83nj93
3134a10O5K22j69k62L60l4k55K64R4l53J26J70j64O9Q4k5j74O8R6k53k4M13j42
3157F6j90L38j99k91K59J90k35kJ40l4k17K93O4l57J39K11l39M7L27k27j41J61
$$ plain form
3011 512 -280 -264 287 -66 -428 337 390 -539 -136 422 -369 -334 446 40 -487 158 370 -400 -291 562 53
3032 53 -450 399 347 -663 19 543 -196 -437 367 42 -523 204 472 -475 -369 585 -23 -475 443 195
3052 195 -684 -49 614 -69 -178 361 -6 -658 160 541 -300 -187 530 -189 -511 465 175 -565 -49 390
3072 390 -205 -262 460 34 -636 120 472 -330 -49 479 -202 -342 320 152 -334 -1 393 -177 -357 335
3092 335 37 -403 266 284 -399 -62 271 -178 -166 271 122 -313 -16 347 -204 -207 325 -96 -303 332 182
3113 182 -274 -104 69 -137 0 324 66 -312 -103 177 -166 12 328 -144 -154 182 2 -195 88 83 -110
3134 -110 -45 177 8 -254 106 72 -183 81 175 -178 -52 118 -46 23 107 82 -92 -24 72 -181 -205 208 66
3157 66 -124 214 15 -276 -17 173 -62 -64 76 42 -175 118 182 -175 -36 175 -164 -117 210 -17 -158 3
3179CJ38k00K5J67j71j90L65N1l57K53M4l19J05K32j75j16J49J34k53%K30k12
3201i7p8L38r2k11J88K6k20J10J31l6j83J33K16l47N7K64l55p7L74k5j68J40q0
3224Ho0K0J72p8j83J02J00k16J25J71k50L4R4l5m9lJ19j10n6K04n3j66J63L4k01
3249a14J48O7q8o5K2O7j7l6R0q4j10J83l7j77K39q0m2P2p5nJ9M3R3j54l7J28q5
3276c5m2J75j52pQ9l3K2j0L8jj25K7J41j36J7N6j36O7R4l7J6p5P4Oj20Q6J02j13
3304a2J7k7n7J22Jn3L8o3K5R7r2l3P0j13J42Nj49J37p1k4K8Oj0M9m1N1o6p1J25
3333C1k9o7J43p7K4J8mM5l4q1M3J5n8R4j00K3Q7p3L0mp5K7MON6o6kJ1n0M8Q3p2
3365dN2Kr5P8%jk1n3K0M5o2R1k8q6N0O6j16R7o1N8%r6J16Rp8j3lk1J44j52M4J8
$$ plain form
3179 3 141 -59 -34 133 -38 -228 137 188 -169 84 128 -191 -86 146 -29 -145 4 138 -115 -115 115 -97
3201 -97 -175 163 71 -140 48 74 -146 -36 95 59 -124 9 225 -122 -65 199 -156 -233 141 116 -52 88 8
3224 8 -52 -32 140 62 -121 -19 81 -135 -10 161 -89 -55 39 4 -45 -48 71 -39 -95 109 56 -110 53 87 -114
3249 -114 34 101 13 -52 -30 37 20 -16 74 -10 -120 63 26 -151 88 8 -34 38 -37 -42 -23 20 113 -41 -78 50 -35
3276 -35 -77 98 -54 -61 28 -5 17 7 45 44 -81 -54 87 -49 -32 24 -112 -45 49 12 28 -47 27 33 -87 -1 101 -12
3304 -12 5 -22 -79 43 44 -9 29 -34 -9 88 -4 -37 33 -80 62 67 -82 55 -16 -40 -12 -6 -16 33 -8 43 -23 -94 31
3333 31 2 -65 78 1 25 43 39 84 50 -31 12 27 -31 63 -37 -14 73 0 30 26 -49 -22 -18 -12 44 -22 -24 -13 -63 -15 68 -4
3365 -4 48 50 -45 33 33 32 11 -42 -22 23 -39 52 24 -62 -12 54 -62 35 -26 32 32 -64 52 61 -17 -30 -33 -54 90 -62 -18 0
3397@n3oJ02j48R6m7M6K6p1O7Q0j78J05J8p1P5l1k8P5p8n8J19j9P8j29p5J21R
3425B5j12J37K4q2j7J2M7L5m4m5k4J0R3k5q7R4lj35J75k7p2l0RP8o2J31j7j84
3453i6M0J47q4K2P7j54k0J2J01n2m9J46j08j06J35P8k27J05J48j42oR2j3j26M3
3478c7J23p6r5K13qk89J93M5j79J49Q5j30j23J28%j21N6K19j70j51K34k5j55J55
3502D1Q5k21JJ91K8k37J12N0k01R0L58k27k24K40j06j24K37J53k87q8J78L1k38
3525a58K50J32m22J26K36k01j05J81Mj88J64J66k69j13L08ok78L40k4k70P0J40
3547H3j53m8K19lj67O2P7k20m9K45N6j63J78o2k43L8L06j59n9J25K8j87R1J38
3571A33k11l7J91J7j27J74k55n9R9J71K0j25O3j05n8J45Q1r8J3J0j34P6K1m4L0
$$ plain form
3397 0 -53 -59 43 -105 -9 -56 -10 16 -55 12 92 -86 19 37 -34 41 10 -18 57 -21 -79 40 21 99 -30 -105 16 25
3425 25 -87 50 74 -8 -25 -13 34 69 25 -20 -44 -34 59 34 -53 41 38 -97 78 51 -21 -51 -42 36 -26 105 88 -96
3453 -96 -56 91 7 29 106 -48 -68 -56 45 -7 -56 90 -18 -124 11 89 -138 -33 115 -27 -33 59 46 -80 -37
3478 -37 86 10 -85 128 120 -169 24 69 -110 39 124 -6 -129 -1 -1 -122 -66 153 -17 -168 66 41 -114 41
3502 41 126 -95 -94 97 125 -112 0 50 -151 -61 297 70 -154 86 -20 -144 93 246 -41 -129 49 80 -158
3525 -158 92 224 -198 -72 164 -37 -142 39 43 -145 19 185 -84 -197 111 105 -173 167 143 -127 -57 83
3547 83 -70 -118 101 98 -69 -7 70 -150 -199 46 102 -61 117 55 -188 -150 156 -3 -62 63 91 -96 -5 133
3571 133 -78 -115 76 93 -34 140 -115 -174 -75 96 116 -9 54 -51 -109 36 117 19 32 42 -92 -16 5 -39 -9
3596iO5N9j13J2k4j09N7K47j28p2J55j49j34J74P9k26J54J18j17j58J72l8k09
3619a94K60J95k94j47K81k35m5L60J4l35K5J98k01OL17o2l33K68Q9l90O2L03k13
3642g1r1M43o1l86mL22k78k2N03k36m06L14J76m01J16L57k56k39L24R3n26J11
3664b18M97m01p1M95k41n26M16L02l30p9M16k35l55M40J25n45J83N21m11j91M27
3685B19j47m27L48L30l81r1L51k75k94M92J78n81J82M32m13j86M78r1m12L06L11
3706C29m13j28M49k51l11M89J39n52J16L62k59k01M38r2l99K47L33l88q2L58j81
3727Ck65M09O4m17J19K87k43j71L97m6l77J74L34l81q9L10q4k45L31Q4k77p0K85
3750A32j94m1K85l3l55J68K45k84K3K41j91q4J82J5j82k0J45kj19K00n2k39J26
$$ plain form
3596 -9 56 115 2 14 -10 -119 -62 185 57 -15 140 -9 -143 31 110 -116 38 156 39 -119 53 15 -194
3619 -194 66 261 -33 -180 101 -134 -179 181 195 -140 -115 83 -118 -112 205 143 -190 78 167 -223 -161 142 -71
3642 -71 -162 281 220 -166 -170 152 -126 -148 355 119 -287 27 203 -198 -82 275 19 -220 104 197 -329 -218
3664 -218 279 -122 -193 302 61 -465 -49 253 -77 -156 260 25 -330 110 235 -310 -127 394 -17 -208 219
3685 219 72 -355 -7 323 -58 -149 202 -73 -367 125 303 -278 -96 336 -77 -263 215 124 -288 18 329
3706 329 -84 -212 237 -14 -325 164 303 -249 -133 229 -30 -231 207 115 -284 -37 296 -92 -174 184 3
3727 3 -262 147 211 -206 -87 200 -43 -214 183 137 -240 -66 268 -113 -202 108 24 -221 110 194 -83 -153 132
3750 132 -62 -103 182 149 -206 -38 207 -77 -54 187 -4 -88 94 109 -73 -93 52 50 -69 131 79 -160 -34
3773c4J75j37l3J10j12j10J45J42j96N0M2o6l3J15l8j02P5J38p9m7J3q7j9J51
3797F3M3j37KQ5j01M5J22q4j26J01J0L9m5np8J5J16J0r3j6J4n6J22R4j71n5L0
$$ plain form
3773 -34 141 4 -29 81 -31 -141 4 146 -50 0 42 -24 -57 58 20 -82 -7 131 52 5 18 -69 -88 63
3797 63 106 -31 -29 56 -45 0 122 38 -88 13 23 62 17 12 -66 -51 65 75 -18 -34 -20 -76 46 140 -31 -86 -56
$$ [...]
8191D4
##END NTUPLES=NMR FID
##END=
