##TITLE=1H_DE-158_(LR-750)
 200.13Hz,CDCl3.
 8 sc
 11.6.2026
##JCAMPDX= 6.0         $$ Bruker NMR JCAMP-DX V2.0
##DATA TYPE= NMR FID
##DATA CLASS= NTUPLES
##ORIGIN= UXNMR, Bruker Analytische Messtechnik GmbH
##OWNER= pz
$$ XWIN-NMR		Version 3.5
$$ Thu Jun 11 15:30:56 2026 Russian Standard Time (UT+4h)  she@DPX200
##.OBSERVE FREQUENCY= 200.131
##.OBSERVE NUCLEUS= ^1H
##.DELAY= (6, 6)
##.ACQUISITION MODE= SIMULTANEOUS
##.ACQUISITION SCHEME= undefined
##.AVERAGES= 8
##.DIGITISER RES= 18
##SPECTROMETER/DATA SYSTEM= spect
##.PULSE SEQUENCE= zg30
##.SOLVENT NAME= CDCl3
##.SHIFT REFERENCE= (INTERNAL, CDCl3, 0, 14.3821)
##AUDIT TRAIL= $$ (NUMBER, WHEN, WHO, WHERE, WHAT)
$$ ##TITLE= Audit trail, XWIN-NMR		Version 3.5
$$ ##JCAMPDX= 5.01
$$ ##ORIGIN= Bruker BioSpin GmbH
$$ ##OWNER= she
$$ F:/spectra/data/she/nmr/H-C/1/audita.txt
$$ ##AUDIT TRAIL=  $$ (NUMBER, WHEN, WHO, WHERE, WHAT)
(   1,<2026-06-11 15:29:19.79 +0400>,<she>,<DPX200>,
      <created by zg, POWCHK disabled, PULCHK disabled
       configuration hash MD5:
       00 E9 B6 7A A2 85 ED C7 34 08 36 98 17 FE 4E 26
       data hash MD5: 16K
       73 F8 12 31 05 88 BB 4F 62 6E E6 30 3E ED B2 79>)
$$ ##END=
$$ 
$$ hash MD5
$$ CE 93 A7 74 5F 28 44 13 E1 E2 B4 B5 A2 E7 2C 36
##$RELAX= 
##$RELAX= 
##$RELAX= 
##$RELAX= 
##$RELAX= 
##$RELAX= 
$$ Bruker specific parameters
$$ --------------------------
##$DU= <F:/spectra>
##$EXPNO= 1
##$NAME= <H-C>
##$PROCNO= 1
##$TYPE= <nmr>
##$USER= <she>
##$AMP= (0..31)
100 100 100 100 100 100 100 100 100 100 100 100 100 100 100 100 100 100 
100 100 100 100 100 100 100 100 100 100 100 100 100 100 
##$AQSEQ= 0
##$AQ_mod= 1
##$AUNM= <au_zg>
##$AUTOPOS= <>
##$BF1= 200.13
##$BF2= 200.13
##$BF3= 200.13
##$BF4= 200.13
##$BF5= 200.13
##$BF6= 200.13
##$BF7= 200.13
##$BF8= 200.13
##$BYTORDA= 1
##$CFDGTYP= 0
##$CFRGTYP= 5
##$CHEMSTR= <none>
##$CNST= (0..31)
1 1 145 1 1 1 1 1 1 1 1 1 1 1 1 1 1 1 1 1 1 1 1 1 1 1 1 1 1 1 1 1 
##$CPDPRG= <>
##$CPDPRG1= <>
##$CPDPRG2= <>
##$CPDPRG3= <>
##$CPDPRG4= <mlev>
##$CPDPRG5= <mlev>
##$CPDPRG6= <mlev>
##$CPDPRG7= <mlev>
##$CPDPRG8= <mlev>
##$CPDPRGB= <>
##$CPDPRGT= <>
##$D= (0..31)
0 0.7 0 0 0 0 0 0 0 0 0 0.03 0 0 0 0 0 0 0 0 0 0 0 0 0 0 0 0 0 0 0 0 
##$DATE= 1781177359
##$DBL= (0..7)
120 120 120 120 120 120 120 120 
##$DBP= (0..7)
150 150 150 150 150 150 150 150 
##$DBP07= 0
##$DBPNAM0= <>
##$DBPNAM1= <>
##$DBPNAM2= <>
##$DBPNAM3= <>
##$DBPNAM4= <>
##$DBPNAM5= <>
##$DBPNAM6= <>
##$DBPNAM7= <>
##$DBPOAL= (0..7)
0.5 0.5 0.5 0.5 0.5 0.5 0.5 0.5 
##$DBPOFFS= (0..7)
0 0 0 0 0 0 0 0 
##$DE= 6
##$DECBNUC= <off>
##$DECIM= 32
##$DECNUC= <off>
##$DECSTAT= 4
##$DIGMOD= 1
##$DIGTYP= 9
##$DL= (0..7)
0 120 120 120 120 120 120 120 
##$DP= (0..7)
150 150 150 150 150 150 150 150 
##$DP07= 0
##$DPNAME0= <>
##$DPNAME1= <>
##$DPNAME2= <>
##$DPNAME3= <>
##$DPNAME4= <>
##$DPNAME5= <>
##$DPNAME6= <>
##$DPNAME7= <>
##$DPOAL= (0..7)
0.5 0.5 0.5 0.5 0.5 0.5 0.5 0.5 
##$DPOFFS= (0..7)
0 0 0 0 0 0 0 0 
##$DQDMODE= 0
##$DR= 18
##$DS= 0
##$DSLIST= <SSSSSSSSSSSSSSS>
$$ [...]
##$SUBNAM0= <"">
##$SUBNAM1= <"">
##$SUBNAM2= <"">
##$SUBNAM3= <"">
##$SUBNAM4= <"">
##$SUBNAM5= <"">
##$SUBNAM6= <"">
##$SUBNAM7= <"">
##$SUBNAM8= <"">
##$SUBNAM9= <"">
##$SW= 18.0517599122864
##$SWIBOX= (0..15)
0 0 2 0 0 0 0 0 0 0 0 0 0 0 0 0 
##$SW_h= 3612.71676300578
##$TD= 16384
##$TD0= 1
##$TE= 0
##$TE2= 300
##$TE3= 300
##$TEG= 300
##$TL= (0..7)
0 120 120 120 120 120 120 120 
##$TP= (0..7)
150 150 150 150 150 150 150 150 
##$TP07= 0
##$TPNAME0= <>
##$TPNAME1= <>
##$TPNAME2= <>
##$TPNAME3= <>
##$TPNAME4= <>
##$TPNAME5= <>
##$TPNAME6= <>
##$TPNAME7= <>
##$TPOAL= (0..7)
0.5 0.5 0.5 0.5 0.5 0.5 0.5 0.5 
##$TPOFFS= (0..7)
0 0 0 0 0 0 0 0 
##$TUNHIN= 0
##$TUNHOUT= 0
##$TUNXOUT= 0
##$USERA1= <user>
##$USERA2= <user>
##$USERA3= <user>
##$USERA4= <user>
##$USERA5= <user>
##$V9= 5
##$VALIST= <valist>
##$VCLIST= <CCCCCCCCCCCCCCC>
##$VD= 0
##$VDLIST= <DDDDDDDDDDDDDDD>
##$VPLIST= <PPPPPPPPPPPPPPP>
##$VTLIST= <TTTTTTTTTTTTTTT>
##$WBST= 1024
##$WBSW= 4
##$XGAIN= (0..3)
0 0 0 0 
##$XL= 0
##$YL= 0
##$YMAX_a= 78541
##$YMIN_a= -68056
##$ZGOPTNS= <>
##$ZL1= 120
##$ZL2= 120
##$ZL3= 120
##$ZL4= 120
##$ABSF1= 10
##$ABSF2= 0
##$ABSG= 5
##$ABSL= 3
##$ALPHA= 0
##$AQORDER= 0
##$ASSFAC= 0
##$ASSFACI= 0
##$ASSFACX= 0
##$ASSWID= 0
##$AUNMP= <proc_1d>
##$AZFE= 0.1
##$AZFW= 0.1
##$BCFW= 1
##$BC_mod= 2
##$BYTORDP= 1
##$COROFFS= 0
##$CY= -3
##$DATMOD= 1
##$DC= 2
##$DFILT= <>
##$DTYPP= 0
##$F1P= 0
##$F2P= 0
##$FCOR= 0.5
##$FTSIZE= 0
##$FT_mod= 4
##$GAMMA= 1
##$GB= 0.15
##$INTBC= 1
##$INTSCL= 1
##$ISEN= 128
##$LB= 0.25
##$LEV0= 0
##$LPBIN= 0
##$MAXI= 10000
##$MC2= 0
##$MEAN= 0
##$ME_mod= 0
##$MI= 1.114404
##$NCOEF= 0
##$NC_proc= 0
##$NLEV= 6
##$NOISF1= 3.799351
##$NOISF2= 2.8
##$NSP= 1
##$NTH_PI= 0
##$NZP= 0
##$OFFSET= 14.38212
##$PC= 1
##$PHC0= -4296.451
##$PHC1= 6.992293
##$PH_mod= 1
##$PKNL= yes
##$PPARMOD= 0
##$PSCAL= 0
##$PSIGN= 0
##$REVERSE= no
##$SF= 200.129724274929
##$SI= 16384
##$SIGF1= 3
##$SIGF2= 2
##$SINO= 400
##$SIOLD= 16384
##$SREGLST= <1H.CDCl3>
##$SSB= 0
##$STSI= 0
##$STSR= 0
##$SW_p= 3205.1282051282
##$SYMM= 0
##$S_DEV= 0
##$TDeff= 0
##$TDoff= 0
##$TI= <>
##$TILT= no
##$TM1= 0
##$TM2= 0
##$TOPLEV= 0
##$USERP1= <user>
##$USERP2= <user>
##$USERP3= <user>
##$USERP4= <user>
##$USERP5= <user>
##$WDW= 1
##$XDIM= 8192
##$YMAX_p= 0
##$YMIN_p= 0
$$ End of Bruker specific parameters
$$ ---------------------------------
##NTUPLES= NMR FID
##VAR_NAME=  TIME,          FID/REAL,        FID/IMAG
##SYMBOL=    X,             R,               I
##VAR_TYPE=  INDEPENDENT,   DEPENDENT,       DEPENDENT
##VAR_FORM=  AFFN,          ASDF,            ASDF
##VAR_DIM=   8192,          8192,            8192
##UNITS=     SECONDS,       ARBITRARY UNITS, ARBITRARY UNITS
##FACTOR=    0.0002768,     1,               1
##FIRST=     0,             0,               0
##LAST=      2.2672688,     0,               0
##MIN=       0,             -68056,          0
##MAX=       2.2672688,     78541,           0
$$ Real data points
##PAGE= N=1
##DATA TABLE= (X++(R..R)), XYDATA
0@%%%%%%%%%%%%%%%%%Qj6J6j6J6j6K4l2L2m0M8m9N7o8P6q8J02j11J22j38J57j80
$$ 0 0 0 0 0 0 0 0 0 0 0 0 0 0 0 0 0 0 8 -8 8 -8 8 -8 16 -16 16 -24 24 -25 32 -36 40 -48 54 -57 65 -73 84 -96
39i6K00k21K46k73L03l36L70m06M49m96N46o03O66p31Q04q89R86j094J215j357
$$ -96 104 -117 129 -144 159 -177 193 -213 236 -260 286 -317 349 -382 422 -467 519 -575 640 -717
59g17J525j726J969k274K671l205L971n166P317j2405M6897L9684p4647k6971
$$ -717 808 -918 1051 -1223 1448 -1757 2214 -2952 4365 -8040 38857 78541 3894 -23077
73b3077K3629L4416k4187l7190J029L9509N834l9289l3150K3592M0654L224l1866
$$ -23077 552 34968 10781 -26409 -25380 14129 19963 -19326 -52476 -28884 11770 14994 -16872
86a6872q121K8478K4708j1956j8173J0737K7499k161l7182l1596N887K0685J004
$$ -16872 -24993 3485 28193 16237 -1936 8801 36300 34139 -3043 -34639 -28752 -8067 -7063
99g063j3992N124K6810J3817k0637k8006J608K8947K0145n554r158J0580J4839
$$ -7063 -21055 -15931 10879 24696 4059 -23947 -22339 6608 26753 21199 12041 22621 37460
112C7460j2324l6323k1602J2731K0635l727j9475k468K0033J2534j2757j5186
$$ 37460 25136 -11187 -32789 -20058 577 -3150 -22625 -25093 -5060 7474 -5283 -20469
124b0469J1201K5619M215k1030j1139J7982K0939o301k1327l815J3514r04k6010
$$ -20469 -9268 16351 20566 -464 -11603 6379 27318 21017 -310 -4125 9389 8485 -17525
137a7525j9384J5233L0476P275j6303n526J7263J0910j7150k2391N580K6527J0814
$$ -17525 -36909 -21676 8800 16075 -228 -5754 11509 22419 5269 -17122 -11542 14985 25799
150B5799j7219j7783M941J2360p437k2284p025J6940J5433n614j2445M443J8530
$$ 25799 8580 -9203 -4262 8098 661 -21623 -28648 -11708 3725 -1889 -14334 -9891 8639
163H639R414q649j0493K969Q893j874j1558l404J1645J1655m176j4938r212J455
$$ 8639 18053 9404 -1089 1880 10773 8899 -2659 -6063 5582 17237 13061 -1877 -11089 -9634
177i634K241l814k058R850J6526O192j0488j3435k004N446r8o190pJ0540Q589
$$ -9634 -7393 -11207 -13265 -3415 13111 19303 8815 -4620 -6624 -1178 -1276 -7466 -7473 3067 11656
192A1656n707j3730m931P401N629n124n678O394J2392K910p519l492P153O627
$$ 11656 5949 -7781 -12712 -5311 318 -4806 -10484 -4090 8302 11212 3693 201 7354 13981
206A3981n683j2022l419P103M778m394m098N239O898m265j2875o890M964P710
$$ 13981 8298 -3724 -7143 -40 4738 344 -3754 1485 8383 4118 -8757 -15647 -10683 -2973
220b973J795n16M544P022p21j0457r203J200O911K934j150J632N193J963m887
$$ -2973 -1178 -1694 2850 9872 9151 -1306 -10509 -9309 -2398 536 -614 1018 6211 8174 3287
235C287o655j353L914K999j317j451K996M657L38m040l227k09k81l034l624K9
$$ 3287 -3368 -4721 -807 2192 875 -576 2420 7077 7415 3375 148 -61 -342 -3376 -7000 -6971
251f971M477M676N52k524j503k39k124l889j069M241O266L607n8j310p93j398
$$ -6971 -2494 2182 2734 210 -1293 -1532 -3656 -7545 -8614 -4373 1893 5500 5442 4132 3339 1941
267A941l426l050J069M666L568K16p90J42l21k449l534j923N43J477O91L76J694
$$ 1941 -1485 -4535 -3466 1200 4768 4984 4194 4336 4015 1566 -1968 -3891 -3348 -1871 -1180 -804 890
284H90K106k91l234l448j796n34M48K068L575L685J826r27l032l091j702k61J229
$$ 890 2996 2705 -529 -3977 -5773 -6307 -5859 -3791 -216 3469 5295 4368 1336 -1755 -3457 -3718 -2489
301b489L066L718K265N8j607k502k835j935l82P53J421J665J117L4p59j314j926
$$ -2489 577 4295 6560 6618 5011 2509 -326 -2261 -2643 -1890 -469 1196 2313 2347 1588 274 -1652
318a652j885j060l03M31J554K567K297R86l78j644k585k214n17J346K921L638
$$ -1652 -3537 -4597 -4900 -4469 -2915 -348 1949 2935 2557 913 -1672 -3886 -4403 -3057 -136 3502
334C502K763O40j604k934l315k294l0J786K405K204J437j65k081l002k437j202
$$ 3502 6265 6905 5301 2367 -948 -3242 -3272 -1486 919 3123 4560 4395 2314 -688 -3125 -4327
350d327r0P21J233J785J924P42j015j616j000p69j105m93J423L041K931J349j90
$$ -4327 -4417 -3696 -2463 -678 1246 1988 973 -643 -1643 -2412 -3517 -4010 -2587 454 3385 4734 4544
367D544q20j157k180k788r83K203L594K092J97n65j059k372l567k806P9K924L014
$$ 4544 3724 2567 387 -2401 -3384 -1181 2413 4505 4702 4137 3078 706 -2861 -5667 -5588 -2664 350
384C50R45j15N51J86k116l430j579J420K486J213J25J104K308O62k856l752n50
$$ 350 1295 1180 1731 1917 -199 -3629 -5208 -3788 -1302 -89 36 1140 3448 4110 1254 -2498 -3048
401c048K177J181n34R66L814L260j270m715l283L29O96j981j800K594M929Q14
$$ -3048 -871 310 -224 742 4556 7816 6546 1831 -1452 -1123 -427 -2408 -4208 -1614 3315 4129
417D129m473m054L69J788j127k543J362N997M500j590l901l0K831o48m882k672
$$ 4129 -344 -4398 -4029 -2241 -3368 -5911 -4549 1448 5948 4358 457 427 3258 2610 -2272 -4944
433d944L286M661k8l447o28L617K010l732n089N79N298K686k257j507L171L325
$$ -4944 -1658 3003 2975 -472 -1100 2517 4527 795 -4294 -3715 1583 4269 2012 505 3676 7001
449G001k832p441m288K321L488j205l169J737O184K306n000n103K104O182J874
$$ 7001 4169 -3272 -7560 -5239 -1751 -2956 -6125 -4388 1796 4102 -898 -6001 -3897 2285 4159
464D159l265p85N662N243l380q597l144M313K253n528n505L511Q345J646o354
$$ 4159 894 109 5771 11014 7634 -963 -4107 206 2459 -3069 -8574 -5063 3282 4928 -1426
479a426l759N078N975l084p920j27R044N477n533p299J702N811k528j0550m946
$$ -1426 -5185 -107 5868 2784 -5136 -5263 3781 9258 3725 -3574 -1872 3939 1411 -9139 -14085
494a4085P429R396m19n981J415R163L601p945p744M035R706J180p885l975N539
$$ -14085 -6656 2740 2321 -3660 -2245 6918 10519 2574 -5170 -1135 8571 9751 1866 -2109 3430
509C430M460o731j1393j867Q290M866n122m885N709J0047Q81q287m274O027O649
$$ 3430 7890 1159 -10234 -12101 -3811 1055 -4067 -8952 -3243 6804 7685 -602 -4876 1151 7800
524G800l263q204l04Q361L983p508r151R78P151N49p124k539Q739J0137o27p982
$$ 7800 4537 -3667 -3971 4390 8373 865 -8286 -7308 -157 392 -6732 -9271 -532 9605 8978 996
540I96j840P026L763p198q598K329Q991J168r215o613M360O328l608r319n69J0545
$$ 996 -844 6182 9945 2747 -5851 -3522 5469 6637 -2578 -9191 -4831 1497 -2111 -11430 -11999 -1454
556a454P765l886o058M239R827O36j0006o376N286O988l406r141r55Q492M166
$$ -1454 6311 2425 -3633 606 10433 11069 1063 -5313 -27 6961 3555 -5586 -6541 1951 6117
571F117p495q580K700R222J929o349k018Q159P976l204r392k603N709K587o562
$$ 6117 -1378 -9958 -7258 1964 3893 -2456 -4474 3685 11661 8457 -935 -3538 2171 4758 -1804
586a804o906K716P811Q99p157m334M518O071j247n377O40Q097N965k889n680N15
$$ -1804 -8710 -5994 1817 2716 -4441 -8775 -4257 1814 567 -4810 -4170 3927 9892 7003 1323 1838
602A838M783l29p435n628K712N746o6n279j798M741M009l487o082O08P083M037
$$ 1838 6621 6292 -1143 -6771 -4059 1687 1621 -3658 -5456 -715 3294 -193 -6275 -5667 1416 5453
618E453l062l287L062M936j737p830m550L296M468j772m588J132O545K740m812
$$ 5453 2391 -896 2166 7102 5365 -2465 -7015 -3719 749 -1023 -5611 -4479 2066 4806 -6
633fm810K443N882R80l965j083M944M159l153o776k017L283J011m452l597K816
$$ -6 -4816 -2373 3509 4489 524 -559 4385 8544 5391 -1385 -3402 -119 892 -3560 -7157 -4341
649d341N502Q06l995j996L059L310j578l778M77N027L141k287l506L11K319j017
$$ -4341 1161 1967 -2028 -4024 -965 2345 767 -3011 -2534 2493 5634 3347 -159 152 2471 1454
665A454m510k539K613M271O71k410m00L038J862k627l760L15L696J773k159k214
$$ 1454 -3056 -5595 -2982 1289 1960 -450 -850 2188 4050 1423 -2337 -2022 1674 3447 1288 -926
681i26J310K390j245m575k485K111K744p30k073J308M200J839k563k936P90K743
$$ -926 384 2774 1529 -3046 -5531 -3420 -676 -1406 -3479 -2171 2029 3868 1305 -1631 -841 1902
697A902J34k559o75L158K729j630l818j147J757M34k284j453K231L586O34k417
$$ 1902 2036 -523 -1198 1960 4689 3059 -759 -1906 -149 285 -1999 -3452 -1221 2365 2999 582
713E82j517J251J117j773k508L55K775J400j373j473O47J291p27k333q68J817
$$ 582 -935 316 1433 -340 -2848 -2493 282 1682 309 -1164 -517 774 47 -2286 -3154 -1337
729a337K209K76o64P55J718J40k089k067n3J199M71m95Q7J304Q22j267k343j096
$$ -1337 872 1148 484 1239 2957 3097 1008 -1059 -1112 87 558 63 150 1454 2276 1009 -1334 -2430
747b430N99O87l8J72J247J433M9j506j439j29N20m5l15O49J505Q68m94r55l33
$$ -2430 -1831 -1144 -1182 -1010 237 1670 1719 213 -1226 -1355 -835 -880 -1195 -546 959 1827 1333 378 45
766D5J88j58n93j76Q90J177L32m44l06k8n32j156q85R8P65P48L84K01J39k65r46
$$ 45 233 75 -518 -694 196 1373 1705 1261 955 927 395 -761 -1646 -1548 -783 -35 349 550 689 424 -522
787e22j139m14M81Q27P78Q30O22J9o52r10p15j92L51O80P55O68L25k84p04p16
$$ -522 -1661 -2075 -1594 -767 11 841 1463 1482 830 -80 -795 -987 -636 44 799 1467 1792 1508 804 88
807H8n42l88j3M18N27L43J40k6l13n47n98m54q7L12N44N33N63M25l6n87o77m15
$$ 88 -454 -842 -855 -437 90 433 573 547 234 -313 -911 -1365 -1452 -1140 -596 -63 500 925 889 302 -375 -790
829g90r6K34O49Q30O90K73k55p53q21n27k14J35N21O96M27J5l11n95p50n94j75
$$ -790 -886 -652 -3 827 1517 1790 1535 782 -39 -566 -780 -645 -124 572 999 1014 703 108 -642 -1236 -1411
850a411J62M01N73N06K69J7k82n49m99j13J85L04N27P35N30L1m29n74n03k69l7
$$ -1411 -1249 -848 -275 231 500 517 235 -314 -813 -926 -741 -437 90 825 1355 1386 957 383 -120 -389 -426
871d26J54M44O47M17k28o11n15l52l17k50N1M42O00L19j56l31j47j05m41n26J02
$$ -426 -272 172 819 1236 1008 397 -118 -470 -787 -1037 -986 -544 56 375 219 -112 -259 -364 -805 -1331 -1229
892a229P85Q26L70J06J90J47m14r82p62K80R10N38pJ47M12j88j204j337k49P83
$$ -1229 -444 382 752 858 1048 1195 781 -201 -963 -683 227 765 758 905 1317 1129 -75 -1412 -1661 -878
912h78P23K1K1P21O57n94j431o49O18O13k91m70N53J193L27j002r57L17P99k16
$$ -878 -155 -134 -113 608 1265 671 -760 -1409 -791 -178 -469 -939 -386 807 1134 132 -825 -508 291 75
932G5r08J90J576J218m21j116k57M56l23j442r04R39J659K81j161o81N58L24j118
$$ 75 -833 -643 933 2151 1730 614 357 813 490 -952 -1856 -917 742 1023 -138 -819 -261 63 -1055
951a055j255N30K048J287n64r08M44R49o27j969q55J362J485l87j244J98J627
$$ -1055 -2310 -1780 268 1555 991 83 527 1476 849 -1120 -1975 -613 872 485 -759 -561 1066
968A066N34j606j607O72J895L35j399l76J767J416j271k515o51J337N01j535j247
$$ 1066 1600 -6 -1613 -941 954 1289 -110 -486 1281 2697 1426 -1089 -1740 -403 98 -1437 -2684
985b684J334K387J42k094j039J560J614p71j596O37K500J035j740j925M75J510
$$ -2684 -1350 1037 1179 -915 -1954 -394 1220 449 -1147 -510 1990 3025 1285 -640 -165 1345
1001A345n51k440r40J881J916o90j747K79K069O65j852j705R94K257L27j775p89
$$ 1345 794 -1646 -2586 -705 1211 521 -1226 -947 1122 1787 -65 -1770 -776 1481 1808 33 -756
1018g56J487J118j685k753m26J943J205j008r42J421K365J35k152j152J576J850
$$ -756 731 1849 164 -2589 -3015 -1072 133 -875 -1817 -396 1969 2104 -48 -1200 376 2226
1034B226n90j832N0J928O58k066k304J81J663J7j928p78J970K308k91j801j26
$$ 2226 1636 -196 -146 1782 2440 374 -1930 -1749 -86 -69 -1997 -2775 -805 1503 1212 -589 -715
1051g15J856Q46j664j802P20K195M32j907j375R15J141j110k183k4K423J853n77
$$ -715 1141 1987 323 -1479 -759 1436 1868 -39 -1414 -499 642 -468 -2651 -2675 -252 1601 1024
1068A024j133P04J692l4k048j330J200J664m62j921n70J219N65j558j792L65J893
$$ 1024 -109 595 2287 2253 205 -1125 75 1739 1277 -644 -1214 5 570 -988 -2780 -2415 -522
1085e22Q32r25n20J501J877j42j754p54J053P82j053j529K07J594N82j446j496
$$ -522 310 -615 -1135 366 2243 2101 347 -407 646 1428 375 -1154 -947 647 1229 -217 -1713
1102a713L77J350Q4j147j14J821J704m11j589m36R54L29j417j454M54J516J78
$$ -1713 -1336 14 98 -1049 -1163 658 2362 1951 362 -74 880 1209 -208 -1662 -1208 308 486
1119D86j504r18R76J261m16j303J16J790J296n77r97M98J328j13j859j330O19
$$ 486 -1018 -1936 -960 301 -115 -1418 -1302 488 1784 1207 210 708 2036 1923 64 -1266 -647
1136f47J119l40j230q3J363P57j055j385K80J541O25p97m71J035J118n83j699
$$ -647 472 132 -1098 -1181 182 939 -116 -1501 -1221 320 945 148 -323 712 1830 1247 -452
1153d52p18P66O18p22j021L71J411N35r28p31O83J099j05j004j56J154R56m67
$$ -452 -1170 -404 214 -508 -1529 -1158 253 788 -140 -871 -188 911 806 -198 -354 800 1756 1289
1171A289j155k21O26q1j267r47O09J272K55p45k82P62N60o28r97J33J208O86n75
$$ 1289 134 -87 539 458 -809 -1756 -1147 125 380 -365 -647 115 675 47 -950 -817 391 1077 502
1190E02o85L34O59l91j184m54P55Q10j98n86K49R34L49p61p37L04O94q2p29j48
$$ 502 -183 151 810 419 -765 -1219 -464 346 148 -438 -189 745 1094 333 -404 -100 594 512 -217 -365
1210c65P00N20m83q79k23L94P8n21k46O54R07J50n37k91K28J63l53l96K21P04
$$ -365 335 855 372 -507 -730 -336 -258 -779 -1025 -371 536 686 149 -142 86 249 -104 -500 -279 425
1230D25L79l12m41QJ78k13m94p2M81M57%k46k4J92j9m24l91O7L36J03j59QK71
$$ 425 804 492 51 59 237 24 -470 -542 -61 396 396 150 126 318 299 -125 -516 -449 -113 -10 -169 -161 110
1253A10J57k19l74j68J50K15M0P7K89L52j3l64l23o4M1k0L5J98K84J21k12l41
$$ 110 267 48 -326 -494 -344 -129 -89 -12 277 629 616 252 -71 -135 -94 -114 -79 119 403 524 312 -29
1275b9j72l4n1o3J10K44J67j0j26j12o9o9r7k2J30J95J33O8N7K2r6j79j01l7O3
$$ -29 -201 -235 -286 -349 -239 5 172 162 36 -76 -145 -214 -311 -333 -203 -8 125 193 250 272 176 -3 -104 -141 -78
1300g8J41J69J46L9j04j91k22j48o4N6J47J99J20m1j35j11j59j10r1O3K74K17
$$ -78 63 232 378 417 313 122 -100 -248 -312 -256 -109 90 210 169 34 -77 -236 -346 -437 -374 -100 117
1322A17j7L1l0j3n0j15o1M8J01Q7R3J08P0p0j59j86j39l0O5J00J33J43J7j32j97
$$ 117 100 131 101 88 38 -77 -138 -90 11 98 191 299 369 299 140 -46 -185 -215 -150 -50 83 226 243 111 -86
1347h6j77j16jJ25J66J37J10Oj20j26r4k0N1R1J32R8O5J3m0p9j08n1n4%N1Q0R6
$$ -86 -263 -379 -380 -255 -89 48 158 164 44 -82 -176 -196 -145 -54 78 176 241 254 214 135 27 -24 -78 -78 -27 53 149
1374A49N5Rj21j76j27q2j8O9J49J79J15j4j38j92q5nJ9R1J76K14O1j24j60p4j0
$$ 149 204 213 92 -84 -211 -293 -311 -242 -93 86 201 187 49 -143 -228 -233 -214 -123 53 267 328 204 44 -30 -40
1399d0l7k5N1J61J30m4j37l0N6m6j70r7Q8J54J4q5rJ10M5j87k37J1K12J33k4J8
$$ -40 -77 -102 -51 110 240 196 59 29 85 39 -131 -228 -140 14 28 -57 -66 44 89 -98 -335 -324 -112 21 -3 15
1425A5K10J37j39k98j03J40J57m2p8J01K22n0l23k21O9J86k2j52N0K84J57j67
$$ 15 225 362 223 -75 -178 -38 119 77 -1 100 322 272 -51 -272 -203 -17 -39 -191 -141 143 300 133
1447A33k68RJ84%k54j35K12K75l1k36m8J91J22k09k39J26L92J74j66j46J52J58
$$ 133 -135 -126 58 58 -196 -331 -119 156 125 -111 -159 32 154 -55 -294 -168 224 398 232 86 238 396
1469C96j96m02j26K79K25j42k49M7K61Kl51k12K53L62J9k23jL27J47k73l88J1
$$ 396 200 -202 -328 -49 176 34 -215 -168 93 95 -256 -468 -215 147 166 -57 -58 269 416 143 -245 -234
1491b34K84M8k85j41K94L36q7l43q5K60J93j58k15J70L93Q5l46l08O7J46j61l45
$$ -234 50 98 -187 -328 -34 302 215 -128 -213 47 240 82 -133 37 430 515 169 -139 -72 74 -87 -432
1513d32m4L43K60j25k59M7L15P9k39j45K51L45jl13j10J83J01k68l54KL15J48
$$ -432 -476 -133 127 2 -257 -210 105 184 -55 -200 51 396 395 82 -28 155 256 -12 -366 -364 -49 99
1535I9j98j32K19L15m4l28j00K43K43j14k61K5K44K3l55l30Q8K74K1k13qL31K84
$$ 99 -99 -231 -12 303 259 -69 -169 74 317 203 -58 -33 211 234 -121 -451 -363 -89 -68 -281 -289 42 326
1558C26r2k69PK78J24k30k22J18K67o0l21k11J35J57j43k47L8L52K37j23j71J17
$$ 326 234 -35 -28 250 374 144 -78 40 307 247 -74 -285 -150 7 -136 -383 -345 7 244 121 -50 67
1580F7K26l2l06j59J93K23q2k75o3J96P4k20k18J30L37J28j51o9K02K03j11l26
$$ 67 293 261 -45 -204 -11 212 130 -145 -208 -12 62 -158 -376 -246 91 219 68 -1 201 404 293 -33
1602c3q3J86J24j92k39O2K39nk83j69J80K48j2j77M7K93J87j76k60K9J82j0k49
$$ -33 -116 70 194 2 -237 -175 64 59 -224 -393 -213 35 23 -154 -107 186 373 197 -63 -34 148 138 -111
1625a11j28J86K15o9k33n9K22J07j40j63J35K94M7k02j46J09J27j56k70n4K21
$$ -111 -239 -53 162 93 -140 -199 23 130 -10 -173 -38 256 303 101 -45 64 191 35 -235 -289 -68
1646f8J34j32j61R0K19Jk06r3J97K11k5j39LJ56N3k02k03L6J74Pj56n4J72J40
$$ -68 66 -66 -227 -137 82 83 -123 -216 -19 192 167 28 31 187 240 38 -165 -129 45 52 -104 -158 14 154
1670A54q4j77pJ52Q2j02j03Q6J60j3j84r5P9O7q2j22L9J91R1r0r7N6J09l3j25
$$ 154 70 -107 -114 38 120 18 -85 1 161 148 -36 -131 -52 15 -67 -189 -150 41 132 42 -55 1 110 77 -48
1695d8j7J25J11n7j30mP6k1j27q4P3J31J3p5j3J03L8r1r4J8J12K3m9k8O1O1n5
$$ -48 -65 60 171 114 -16 -20 56 35 -92 -176 -103 28 41 -34 -47 56 94 3 -91 -73 39 62 13 -15 46 107 52
1722E2j09m5Q3L6rl1N7P3Rr8n6J1L1j0n5K3O7L4o2o4J1J6ol2J1O8N7%m6j2L3n
$$ 52 -57 -102 -19 17 8 -23 34 107 116 18 -38 -27 4 -6 -61 -38 29 63 1 -63 -52 -36 -42 -74 -63 5 62 62 16 4 37 32
1754C2m4k5K5N3L2l2rPNn6m3LM2M7j1%J3ml1o4k2K9K5J0NK1K4rl3l0NJ5J7J5K8
$$ 32 -12 -37 -12 41 73 41 32 39 44 -12 -55 -52 -10 37 26 26 39 35 4 -60 -82 -53 -28 -18 -13 8 32 23 -10 -40 -35 -20 -3 12 40
1789D0L1Kk7k7k4noqK5K5K2%k4k6j9l1oj1L6L0K9lnj8l1k2oK0K3L2L1Pjj2m5k3
$$ 40 71 73 46 19 -5 -10 -16 -24 1 26 48 48 24 -2 -21 -52 -58 -69 -33 -3 26 23 18 0 -31 -53 -59 -39 -16 16 47 54 53 41 -4 -27
1825b7mJ0K7J2J5J4Ml6k7k9pJ0J8J5J4K7ml5j2k1j1RPK9M2K5Jl6l0j9Lj7K3L4
$$ -27 -31 -21 6 18 33 47 51 15 -12 -41 -48 -38 -20 -5 9 36 32 -3 -15 -36 -47 -38 -31 -2 40 65 66 30 0 -19 -16 -33 -10 24
1859B4K1J8j9k0l4j3l6j0L3K9K8J0j5mj6k8j5j4K4K8L6K2j3jJ1k8m4j8L2M4RK
$$ 24 45 63 44 24 -10 -23 -59 -69 -36 -7 21 31 16 12 -4 -32 -47 -61 -37 -9 27 49 36 35 46 18 -26 -44 -12 32 41 43
1891D3PJ8k0n3m7qK7K4%J7K6Nm7p0k5K7M2jJ0N1M2%o2m4L1J8j2j8J2P6M2m8n7
$$ 43 50 68 48 -5 -52 -60 -33 -9 -9 8 34 39 -8 -78 -103 -76 -34 -35 -25 26 68 68 6 -38 -7 11 -1 -19 -7 69 111 63 6
1924FpK4k2n5k0Q2Q0rn3j4J3qp8o9N1R1K6m7l0M2K6n4q3PJ08P6k2m4M7N5k4j19
$$ 6 -1 23 1 -54 -74 8 88 79 26 12 25 17 -61 -130 -79 12 38 -9 -39 3 29 -25 -108 -101 7 83 61 17 64 119 95 -24
1956b4o2M9O4Ko8KQ9L7r2j03J8J05J4o2k8J12Q8m2j35m3N2K6o3q2O8J41M1j04
$$ -24 -86 -37 27 29 -39 -37 52 89 -3 -106 -88 17 31 -31 -59 53 141 99 -36 -79 -27 -1 -64 -146 -78 63 104 0
1984@o3N6Q7m5j02PJ54Q2p1j21j0Q1l6j39q9R4J43oq8rJ04Q7r9j07K4J55O1j02
$$ 0 -63 -7 80 35 -67 -60 94 176 105 -16 -26 55 19 -120 -209 -115 28 22 -66 -75 29 116 17 -90 -66 89 150 48
2012D8q8P4R7o3j76p6J14Q9l9r3O5J70N9j40j19M7J35qj30n0J37J02j17j87m9
$$ 48 -40 34 131 68 -108 -184 -70 19 -20 -113 -48 122 181 41 -78 -31 104 96 -34 -84 53 155 38 -149 -198
2037a98J05O8j16o7J32K04M3j47o4J11J19p1j71J2J64O9j37j76M3J31l5j80p2
$$ -198 -93 -25 -141 -208 -76 128 171 24 -40 71 190 119 -52 -40 124 193 56 -120 -77 54 19 -161 -233
2060b33J59J95k7j25QJ76O9j82j84L4J80K7j68r4J26J35r9k15l2J95J67p5j05
$$ -233 -74 121 94 -31 -23 153 222 40 -144 -110 70 97 -71 -165 -39 96 -3 -218 -250 -55 112 37 -68
2083f8J05K18M0k17j40Q7J40o7k10l1J69J15j55k06L4J97M6j64p8J82K33j3k12
$$ -68 37 255 295 78 -62 25 165 98 -112 -143 26 141 -14 -220 -186 11 57 -107 -185 -3 230 217 5
2106Eo2J37Q7j77k17O0K29N4j81j35J30J78p1j95j8K42J80r3j65M6J85j8k42j65
$$ 5 -57 80 167 -10 -227 -167 62 116 -65 -200 -70 108 37 -158 -176 66 246 153 -12 34 219 201 -41 -206
2130b06Q5J78m7j86oJ76J30j29j86N6K06P3j22p9J44J90p8k29r2J04R0j20j62
$$ -206 -121 57 10 -176 -182 -6 124 -5 -191 -135 71 144 22 -57 87 277 199 -30 -122 -18 72 -48 -210
2153b10O7K26O6j60j33J00J54l8j58rJ82J26r8j79rJ21qj69j07J12J83%j26j9
$$ -210 -143 83 149 -11 -144 -44 110 72 -86 -95 87 213 115 -64 -73 48 40 -129 -236 -124 59 59 -67 -86
2177h6J46R2r4j42L5J57N7j07p7P2J00p5j81q4R3J06m4q3M5J50M9j34r5M1R3J
$$ -86 60 152 58 -84 -49 108 165 58 -19 53 153 78 -103 -187 -94 12 -32 -115 -70 80 129 -5 -100 -59 34 35
2203C5r2j3J15P9p9j30k2P7L5p0l4P7J39J8r3l8M7M2n3q6KR7M7o2p1J2L6k5j01
$$ 35 -57 -70 45 124 45 -85 -107 -30 5 -65 -99 -22 117 135 42 4 51 93 40 -46 -44 53 100 38 -33 -21 15 -10 -111
2232a11l7P5Q1K4n0K6N5Lp1q8J4O6L3j5j4M2L3j9r0l3M4N0mj0M1N1jp1n1j1J9
$$ -111 -148 -73 8 32 -18 8 63 66 -5 -93 -79 -13 20 5 -9 33 66 47 -43 -76 -32 18 14 4 45 96 95 24 -27 -38 -19
2263a9oj6JN4M6j6o6k8J9j6qj2M8Q0Oj3m3Jj8k0k7kP4K8jqj4kj8m1j9J0L9J5J0
$$ -19 -25 -41 -40 14 60 44 -22 -50 -31 -47 -55 -67 -19 61 67 54 11 12 -6 -26 -53 -55 19 47 46 38 24 22 4 -37 -56 -46 -7 8 18
2298A8J3Qk8l8l2j5K7L4K1J9J1J8j9m1k2%J0K2J2K5J9Ll2l3k4j1pNJ9K9K8pk3
$$ 18 31 39 11 -27 -59 -74 -47 -13 8 27 38 56 37 -4 -26 -26 -16 6 18 43 62 65 33 0 -24 -35 -42 -37 -18 11 39 32 9
2331Ik3l9lj3QL7L8K4kj3j6k4opJ7K2L0K7oMk9k6l0nMJ3K7QJ5j0j7l1l5j5KK5
$$ 9 -14 -53 -56 -69 -61 -24 14 38 36 23 7 -17 -23 -30 -13 9 39 66 60 64 35 9 -21 -26 -22 -9 18 26 41 31 14 -17 -52 -67 -65 -40
2367d0K7J6L0Ll1l5j1k1K3K3J6K9L3Nk8m6J1j0jLK4L9J5l5j9j2j3j6m2J3L7L3
$$ -40 -13 3 33 36 5 -30 -41 -62 -39 -16 0 29 62 67 39 -7 4 -6 -7 -4 20 59 74 39 20 8 -5 -21 -63 -50 -13 20
2399B0Mj6Kqj5l8l2K5O3J2MNJ5Rn1m8mM4L8oJ3L1K4j9q2m1L2L3j3k8K1N4Ro2n4
$$ 20 24 8 10 2 -13 -51 -83 -58 5 17 21 26 41 50 -1 -49 -53 -9 29 23 36 67 91 72 -10 -51 -19 14 1 -27 -6 48 57 -5 -59
2434e9K1QJ7m4J8P8N0l6m4k3L5jo5l0L9P7J8m2m0L0K6n4n9RR9M9k2n1J8M4m0r1
$$ -59 -38 -30 -13 -57 -39 39 89 53 9 -14 21 20 -45 -75 -36 41 59 17 -23 7 33 -21 -80 -71 28 77 55 4 22 66 26 -65
2466f5m8N6P5ln7KP0L0p6o9J2J06M1m7k6P9O3l9j29n5O7L2m5q0M4J10K2r1q3O1
$$ -65 -113 -57 18 15 -42 -40 30 60 -16 -85 -73 33 74 27 1 80 143 104 -25 -80 -13 19 -26 -106 -62 48 70 -21 -104 -43
2496d3P1j2p8pJ12R7o9r8k9O1Lj01n3O9J46J3r4l6R6O8o7j04L2J35M8q6j01L7
$$ -43 28 16 -62 -69 43 140 71 -27 -56 5 8 -93 -146 -77 69 82 -12 -48 48 116 49 -55 -23 112 160 74 -27 10
2524A0R0m9j69o9R9J11m1j04L7J48N6j15j20N1J45K8j17n2J25R1r9j86k2J20N5
$$ 10 100 51 -118 -187 -88 23 -18 -122 -85 63 119 4 -116 -65 80 108 -9 -61 64 155 56 -130 -152 -32 23
2549B3q8o9R2J70L5j43q8J15J19p7j34j1J38O5j30j48K4J26k5j48o9J46J68k1
$$ 23 -65 -134 -42 128 163 20 -68 47 166 89 -45 -56 82 147 17 -131 -107 19 -6 -154 -223 -77 91 70
2573G0j14RJ42P3j32j51M9J61K4j52p3Q6J04q9j81l1J87J18p3r4Q2J57Rj60j13
$$ 70 -44 -35 107 180 48 -103 -54 107 131 -21 -94 -8 96 7 -174 -205 -18 100 27 -67 15 172 181 21 -92
2598i2R2J29p1j63k2J38P8j30j38L8J53M1j31n0J55J65k6j50m0J02N6j38j30L2
$$ -92 0 129 58 -105 -127 11 89 -41 -179 -141 12 53 -78 -128 27 192 166 16 -24 78 134 -4 -134 -102
2622a02J50L3j31r5P9J01l7j24lJ58J27o4j06K4J00Rj36j08O9J05j5j06l5J12
$$ -102 48 81 -50 -145 -66 35 -2 -126 -129 29 156 92 -14 10 110 119 -17 -125 -56 49 34 -72 -107 5
2646EQ2o9j19L4J10O0q4m4O7J20m7j32p8N6N4o5q4L4J18L2p3q2M6Q4K0p9rJ10
$$ 5 87 18 -101 -67 43 103 19 -25 42 162 115 -17 -95 -39 15 -50 -134 -100 18 50 -23 -105 -59 25 45 -34 -43 67
2674F7P5m7j05k5P3J2q2p1N2R7J0o3l4P5M5m2p9NP4M1m0m9J6M8k2r6o6M8O3Jl5
$$ 67 142 95 -10 -35 38 50 -32 -103 -51 46 56 -7 -41 34 79 37 -42 -37 37 78 38 -11 5 53 31 -65 -131 -83 -20 -19 -54
2705e4J3N9M3m0p6J0P4J2l6j4M0M5k1p7l5M9K3k8m1K6P0L0n0l8J7L7j3p2pN2M2
$$ -54 -41 18 61 21 -55 -45 29 41 5 -9 31 76 55 -22 -57 -8 15 -13 -54 -28 42 72 22 -16 1 38 25 -47 -54 -2 40
2736D0j0m6rK3jm5k6L5O4Oj6KLJ6k9m1jL8L9k8k1QL2j2n9j7K9L4kq%M1%l2l0J
$$ 40 30 -16 -25 -2 -3 -48 -74 -39 25 31 15 17 20 36 7 -34 -35 3 42 14 -7 1 33 21 -38 -55 -26 8 6 -2 -2 39 39 7 -23 -22
2772b2J4J3j0pK6L2nl3k8J0Qj1nJ8L1J0k1k4qoj0rJ6J0K9Kj5pMpj6oRK1J8J0q
$$ -22 -8 5 -5 -12 14 46 41 8 -20 -10 -2 -13 -18 0 31 41 20 -4 -12 -18 -28 -37 -21 -11 18 20 5 -2 2 -5 -21 -27 -18 3 21 31 23
2809B3mLol1OOJ9LJ6Lpj3k2k3KOQNNJ4Mk8k0Mmj7K5J4J2MKNk8KmqK2J6J2J5Lj3
$$ 23 19 22 16 -15 -9 -3 16 19 35 38 31 18 -4 -27 -25 -19 -11 -6 -1 13 17 -11 -31 -27 -31 -48 -23 -9 3 7 9 14 -14 -12 -16 -24 -2 14 26 41 44 31
2851C1lk6oj1OK5KMLqj7j9lj2NJ5QJ2pPj5j4j4OPjK2K5kmJ0j8k2Q%NJ4lK5qj6
$$ 31 28 2 -4 -15 -9 16 18 22 25 17 0 -19 -22 -34 -29 -14 -6 6 -1 6 -9 -23 -37 -31 -24 -25 -3 22 20 16 26 8 -14 -6 -6 -1 13 10 35 27 11
2892A1j1j7QNpKJ3J5Mk4Kj1j6rMRK2J8rkj1Kj4j6J5K7J3pj5J0Kj4k3j4K2J6J9
$$ 11 0 -17 -9 -4 -11 -9 4 19 23 -1 1 -10 -26 -35 -31 -22 0 18 9 7 -4 -2 -16 -32 -17 10 23 16 1 11 13 -1 -24 -38 -16 0 19
2929A9k3J2J6Ml3k4J0K1Nj6KJ9L7k9l3j5J0J4nmK7L0rk6k9LPJk9lM1J7k2k6%K8
$$ 19 -4 8 24 28 -5 -29 -19 2 7 -9 -7 12 49 20 -13 -28 -18 -4 -9 -13 14 44 35 9 -20 -17 -10 -9 -38 -41 0 17 -5 -31 -31 -3
2965cj4k2j3M0M6nj9j5L1J5l5k7qL8L0k8j1J2L5k3n4j8N2K5j3l4K3L5J1o0m0J6
$$ -3 -17 -39 -52 -12 34 29 10 -5 26 41 6 -21 -29 9 39 11 0 12 47 24 -30 -48 4 29 16 -18 5 40 51 -9 -49 -33
2997c3K7Lm0j1M6K9k7m7lN1J7k9pL2N5J2n7k5L4J4l9n4NO7K8l8m5K5M8j6n3qN4
$$ -33 -6 -3 -43 -54 -8 21 -6 -53 -56 -5 12 -17 -24 8 63 75 18 -7 27 41 2 -52 -47 20 48 10 -35 -10 38 22 -31 -39 15
3030A5M0j2n8MN0%o8n9L9N7lm6j3M8M8l3n6J2O0L7m4l8K6O6kq6l9L9M4k7o0RQ7
$$ 15 55 43 -15 -11 39 39 -29 -88 -49 8 5 -41 -54 -6 42 9 -47 -35 25 62 18 -20 6 72 70 -16 -55 -16 28 1 -59 -50 37
3063C7K4m2o2K6P1j3n8j5N6N0k8p3j4M5J7o6n0M4P2Rm8k1N9N1l6o9JO0M0n1m9
$$ 37 61 19 -43 -17 54 41 -17 -32 24 74 46 -27 -41 4 21 -45 -95 -51 21 30 -18 -39 20 71 35 -34 -33 27 67 16 -33
3094c3J2O1j0p1m4L8O7k4k8RO2N5m3p0J4N0J9n4m5M2N0l1p4j3M2K9l0l4L3N7L0
$$ -33 -21 40 30 -41 -85 -47 20 -4 -32 -23 39 94 51 -19 -5 45 64 10 -35 7 57 26 -48 -61 -19 10 -20 -54 -21 36 66
3125F6m8m3J9M9k4n1j7N2L4l4m0oM1J6l8l0L8O4J2l4k0M6J9k4o1lL3K5l4l5J3
$$ 66 18 -25 -6 43 19 -32 -49 3 37 3 -37 -43 -2 14 -24 -54 -16 48 60 26 6 52 71 47 -14 -17 16 41 7 -28 -15
3156a5K5Km3k3L2M0ol4%M4K9m0l8kL4J1l8k3L3L8qm0j3K2L0pk9K8L4K6k5m2jK3
$$ -15 10 12 -31 -54 -22 18 12 -22 -22 22 51 11 -27 -29 5 16 -22 -45 -12 26 18 -22 -35 -13 17 10 -19 9 43 69 44 2 1 24
3190B4Nn3kK7L8l3k6lL3J3l8k8J8L9Rj8j8K5Qrn9QJ2K9oj8J1L0Pl1k8L6K6j0j1
$$ 24 29 -24 -26 1 39 6 -20 -23 10 23 -15 -43 -25 14 23 5 -13 12 20 11 -48 -40 -28 1 -5 -23 -12 18 25 -6 -34 2 28 18 7
3225GJK1J0j6k5j3K1Ok4j3L6J3%j9j6J9Jrk5J0L1%j4j3%J3Jl2oK1K1poORLj4k3
$$ 7 8 29 39 23 -2 -15 6 12 -12 -25 11 24 24 5 -11 8 9 0 -25 -15 16 16 2 -11 -11 2 3 -29 -35 -14 7 0 -6 0 9 12 -2 -25
3263b5QK7Rk0PJ1Mj2j6%J2J4j2oKK1kj7qpJ7nqjJ6Qj1k0PJqj9QK2KJ1pj6LQjj1
$$ -25 -17 10 19 -1 6 17 21 9 -7 -7 5 19 7 1 3 24 22 5 -3 -10 7 2 -6 -7 9 17 6 -14 -7 -6 -14 -33 -25 -3 -1 10 3 -13 -10 -2 -3 -14
3305a4J3J2%llJ6j1lOo%J2%nOllj4j0J1nJmR%Mpj4%Kj5J4OOlmRrkJNNJ2M%Knr
$$ -14 -1 11 11 8 5 21 10 7 13 7 7 19 19 14 20 17 14 0 -10 1 -4 -3 -7 2 2 6 -1 -15 -15 -13 -28 -14 -8 -2 -5 -9 0 -9 -11 -10 -5 0 12 16 16 18 13 4
3353DjlOLN%Qlklqj4kLpJ8Q%k0Qmj1j1J5J1J1j0JnMjqoQKMlJ3LqKnmOOnPRNk0
$$ 4 3 0 6 9 14 14 22 19 17 14 6 -8 -10 -7 -14 4 12 12 -8 0 -4 -15 -26 -11 0 11 1 2 -3 1 0 -8 -14 -6 -4 0 -3 10 13 5 7 2 -2 4 10 5 12 21 26 6
3403FMppmLOkJ3Klk9RjoOMOoMmJ5j4Mj6JO%J8njPJj5qJ5J1j0lQJ9%j9mqK1%j6
$$ 6 10 3 -4 -8 -5 1 -1 12 14 11 -18 -9 -10 -16 -10 -6 0 -6 -2 -6 9 -5 -1 -17 -16 -10 -10 8 3 2 9 10 -5 -13 2 13 3 0 8 27 27 8 4 -4 17 17 1
3450ANlK8k8j0j2J8kj2j6J3L2qoj6J2LOk5JK5J1j1j8%L1rk6MJ2K4rj2J1K0lj3
$$ 1 6 3 31 3 -7 -19 -1 -3 -15 -31 -18 14 6 0 -16 -4 -1 5 -20 -19 6 17 6 -12 -12 19 10 -16 -12 0 24 15 3 14 34 31 18
3487A8j5LK2%k2j8J1J9j0l5lJ8J2nj8%L4J4l3k1K3J8nk8qL6J4j5l7RK5J4l0qL1
$$ 18 3 6 28 28 6 -12 -1 18 8 -27 -30 -12 0 -5 -23 -23 11 25 -8 -29 -6 12 7 -21 -29 7 21 6 -31 -22 3 17 -13 -21 10
3522A0K8Rk6nJ4J0k1l9J4K2J8l5k6J9K1j6l6MM1J2Nl5lM3Jl3m2L2J9kk9j0L3L5
$$ 10 38 47 21 16 30 40 19 -20 -6 16 34 -1 -27 -8 13 -3 -39 -35 6 18 23 -12 -15 28 29 -4 -46 -14 5 3 -26 -36 -3 32
3556C2k5m3J8K9J4j8k5L9M0pm7l0L2J3j4l7KL2K2k4m0J3N0j6l5lM2K3ol6qJ6J0
$$ 32 7 -36 -18 11 25 7 -18 21 61 54 7 -23 9 22 8 -29 -27 5 27 3 -37 -24 26 10 -25 -28 14 37 31 -5 -13 3 13
3589A3l1l0lN1Ok7pJ5K9nl6ML5K5j9l1J3K9Nm4l8K7L3rk7JK3L8k1l8nN1%l2k4
$$ 13 -18 -48 -51 0 6 -21 -28 -13 16 11 -25 -21 14 39 20 -11 2 31 36 -8 -46 -19 14 5 -22 -21 2 40 19 -19 -24 27 27 -5 -29
3624b9J1N2j3l2k7J1K9k5l6J0M1K1j3l4J9K4Nk4k4L8L6j4k6nJ3J3l4j6JM8Oj9
$$ -29 -18 34 21 -11 -38 -27 2 -23 -59 -49 -8 13 0 -34 -15 9 14 -10 -34 4 40 26 0 -5 8 21 -13 -29 -28 20 26 7
3656Gj0J8L1j0m3qL6Ok7j8kK0J1l1l2J5K5%j6mK5L6k0j9j5L0J5k2k5J6L8Kl1k6
$$ 7 -3 15 46 36 -7 -15 21 27 0 -18 -20 0 11 -20 -52 -37 -12 -12 -28 -32 -7 29 9 -10 -25 5 20 -2 -27 -11 27 29 -2 -28
3690b8K6K0j6j5KK8K2j7k0NK5j3k9j8J4K8ol3MJ2K1k8j3OK1J3j9rK1J7pl1j1J7
$$ -28 -2 18 2 -13 -11 17 39 22 2 7 32 19 -10 -28 -14 14 8 -25 -21 -9 12 -16 -29 -23 -2 11 -8 -17 4 21 14 -17 -28 -11
3724a1J9rj6J1K8Kl4pkM2j5j6mL3J1ol0%OQj3k4J9K2Lj8j4J6J1k6pJ1J7Onj6l
$$ -11 8 -1 -17 -6 22 24 -10 -17 -19 23 8 -8 -12 21 32 26 -4 -4 2 10 -3 -27 -8 14 17 -1 -15 1 12 -14 -21 -10 7 13 8 -8 -11
3761a1J7j2ok3J8K0kj3OK6mj5j6J4J7Mj5J6Ojoj5qJ2Mj0j0JK3J3k7j5oOmlJ8M
$$ -11 6 -6 -12 -35 -17 3 1 -12 -6 20 16 1 -15 -1 16 20 5 21 27 26 20 5 -3 9 13 3 -7 -6 17 30 3 -12 -18 -12 -16 -19 -1 3
3799C%Lj8j0J8j2kj4J6K5nnOMrkMkPJ2j2KJ1JrmroK4%Jkkoj0j0mkLP%OJ%j1pj
$$ 3 3 6 -12 -22 -4 -16 -18 -32 -16 9 4 -1 5 9 0 -2 2 0 7 19 7 9 20 21 12 8 -1 -7 17 17 18 16 14 8 -2 -12 -16 -18 -15 -8 -8 -2 -1 -1 -12 -19 -20
3846b0QkJ2OqQpRrmJ1N%OLRk3J2morlKJ0J3kj4qRj4Lj4RJ1orPJ0oj5KjJ8KK%J5
$$ -20 -12 -14 -2 4 -4 4 -3 6 -3 -7 4 9 9 15 18 27 4 16 12 6 -3 -6 -4 6 19 17 3 -5 4 -10 -7 -21 -12 -1 -7 -16 -9 1 -5 -20 -18 -19 -1 1 3 3 18
3893A8j2qpRlOmRMlJ1j0Pk4J9rj1J4K1j1j1j0QJpomMJ4nj5J2Nrlj2QJ3OklOKj8
$$ 18 6 -2 -9 0 -3 3 -1 8 12 9 20 10 17 -7 12 3 -8 6 27 16 5 -5 3 4 -3 -9 -13 -9 5 0 -15 -3 2 -7 -10 -22 -14 -1 5 3 0 6 8 -10
3937a0nJ0K1j2pORPMk0j3K8j0J1j6OOKnk9J6PKqpK8kj9j9mMJ0k1jJ4J8lj1j5K5
$$ -10 -15 -5 16 4 -3 3 12 19 23 3 -10 18 8 19 3 9 15 17 12 -17 -1 6 8 0 -7 21 19 0 -19 -23 -19 -9 -30 -31 -17 1 -2 -13 -28 -3
3977cKpnkK9J5j7j4J4J6k2j3pJ1L1j4k6J8K4J0l5j8J3K7j0k4lJ5K1l4l6ML5mj5
$$ -3 -1 -8 -13 -15 14 29 12 -2 12 28 6 -7 -14 -3 28 14 -12 6 30 40 5 -13 0 27 17 -7 -10 5 26 -8 -44 -40 -5 -9 -24
4012b4j0J4N0ol6jJ4J6lk5J1K4J1k3m0K4J9kl8PL5K7j5l0lL6Qm8k6K2L8kl2j9
$$ -24 -34 -20 30 24 -12 -13 1 17 14 -11 0 24 35 12 -28 -4 15 13 -25 -18 17 44 29 -1 -4 32 40 -8 -34 -12 26 24 -8 -27
4046b7K8J8j7m6lM5J3j1k6K8K3Kk6k9L4K4k2k5NK9J2k6l8KM8Kk4j3K3N1om4j1
$$ -27 1 19 2 -44 -47 -2 11 0 -26 2 25 27 1 -28 6 30 8 -17 -12 17 29 3 -35 -33 15 17 -7 -20 3 54 48 4 -7
4079gK4J2l0l2J7L6Jk7l3J7K2Pl7jL6L3k0l3ML4kk8l7J0M6Mm3k0M4K9k7k8LM6
$$ -7 17 29 -1 -33 -16 20 21 -6 -39 -22 0 7 -30 -31 5 38 18 -15 -11 23 21 -7 -44 -34 12 16 -27 -47 -3 26 -1 -29 -26 20
4113B0J6k5j5J2N2rm6m4M7J7j5l7pN1Lk5l6K0L3J1m2nK5M0j8m6j9M5Lk6l6J4M8
$$ 20 36 11 -4 8 60 51 5 -39 8 25 10 -27 -34 17 20 -5 -41 -21 12 23 -19 -24 1 41 23 -23 -42 3 6 -20 -56 -42 6
4146FJ0l1j8L5L8lm9j3N3K5j4m2J2K6Jm9l7L4M4om8OK3K7k8l4J9L9Kl3k8K1K7
$$ 6 16 -15 -33 2 40 37 -12 -25 28 53 39 -3 9 35 36 -13 -50 -16 28 22 -26 -20 3 30 2 -32 -13 26 28 -5 -33 -12 15
4179A5lm9j8L4L8l0l1J9M6J3l1k2K5K4nl0j8M6L8l1n5J2K5ll0rK2N4j5l1k1L4
$$ 15 12 -37 -55 -21 17 -13 -44 -25 21 34 3 -19 6 30 25 -5 -23 23 61 30 -25 -13 12 9 -21 -30 -8 46 31 0 -21 13
4211A3J4j6l4J7J9Nj9k9J4M0j6m7mL9J2kk3MM4Jl5j7J8J8Jk4jJ3J7%l1j5K6J3
$$ 13 27 11 -23 -6 13 18 -1 -30 -16 24 8 -39 -43 -4 8 6 -17 -13 31 32 -3 -20 -2 16 17 -7 -8 5 22 22 -9 -24 2 15
4245A5j7pJ6K5Pk4j9RQj2j8LK6Nj6k2J3J6rj2j3RK5Jqj4K4mj1j7NK4Pj9NPJ0o
$$ 15 -2 -9 7 32 39 15 -4 5 13 1 -17 -14 12 17 1 -21 -8 8 -1 -13 -26 -17 8 9 1 -13 11 7 -4 -21 -16 8 15 -4 1 8 18 12
4283A2j6kJ1K2rloK2mk7kLJQk1qJ3J3nj3MjppKK1KqNj6L%Qp%J9KjLlkLLqQJ2l
$$ 12 -4 -6 5 27 18 15 9 31 27 0 -2 1 2 10 -11 -19 -6 7 2 -11 -7 -8 -15 -22 -20 1 3 -5 0 -16 -13 -13 -5 -12 -12 7 9 8 11 8 6 9 12 4 12 24 21
4330B1rMmj0Kn%LmQj5%J8kj3j0LmJ3oLJ0Qk2Qj6OJ0LOmJ2Oj0KjjRj6J2JL%j0m
$$ 21 12 16 12 2 4 -1 -1 2 -2 6 -9 -9 9 7 -6 -16 -13 -17 -4 -10 -7 3 11 -11 -3 -19 -13 -3 0 6 2 14 20 10 12 11 10 19 3 15 16 19 19 9 5
4375E%kmJlJ6j3KkoMk1Rk%K0NrPj3KoKJoJ2J2oKnlnONJ2qOpJ0j0kkPlj7J5%Oo
$$ 5 5 3 -1 0 -3 13 0 2 0 -6 -2 -23 -14 -16 -16 4 9 0 7 -6 -4 -10 -8 -7 -13 -1 11 5 7 2 -1 -6 0 5 17 9 15 8 18 8 6 4 11 8 -9 6 6 12 6
4424Fj1J2j6Pj3NQQLk4J9mNk0mjJ3J4j0j0K0nLj3lK2J0npJ0MKj8rPONj9KJ1J4
$$ 6 -5 7 -9 -2 -15 -10 -2 6 9 -15 4 0 5 -15 -19 -20 -7 7 -3 -13 7 2 5 -8 -11 11 21 16 9 19 23 25 7 -2 5 11 16 -3 -1 10 24
4465B4k5j7jJ3J6k0mJ5Rpk2RnJ0j3qJ3K6kmj6J5J4j4j1QJ8J8oj8kJ1mj9k6K6K0
$$ 24 -1 -18 -19 -6 10 -10 -14 1 10 3 -19 -10 -15 -5 -18 -26 -13 13 11 7 -9 6 20 6 -5 3 21 39 33 15 13 24 20 1 -25 1 21
4502B1qk6RJ2J4j7j7%K0%j8pJ0K6pl8kjL6j6j9J5L0Lj5k7K1K3Ol2KK7J3qk8j0
$$ 21 13 -13 -4 8 22 5 -12 -12 8 8 -10 -17 -7 19 12 -26 -28 -29 7 -9 -28 -13 17 20 5 -22 -1 22 28 -4 -2 25 38 30 2 -8
4538hK1Nk5j7J1M1kk3j6K5Rnk9j0M2J3j4m5NK6pk2j9J9L4mk0kL0J4k7k0QL4J0
$$ -8 13 18 -7 -24 -13 28 26 3 -13 12 21 16 -13 -23 19 32 18 -27 -22 4 -3 -25 -44 -25 9 5 -15 -17 13 27 0 -20 -12 22 32
4573C2l5j0J8K3j9j8j3L5Rj6k1J3M0Ql0k7J8K4nm3rL2K4k6m1KL3Kj9l0L4M0Kl3
$$ 32 -3 -13 5 28 9 -9 -22 13 22 6 -15 -2 38 46 16 -11 7 31 26 -17 -26 6 30 4 -37 -35 -2 0 -19 -49 -15 25 27 -6
4607frK8K0k1m2KN0J0l5k5K3L3Mm4j0K3M9j4m0K0K5Rl8m0K1K7j0l3j1K5K0j1l0
$$ -6 -15 13 33 12 -30 -28 22 32 -3 -28 -5 28 32 -12 -22 1 50 36 -4 16 41 50 12 -28 -7 20 10 -23 -34 -9 11 0 -30
4640c0qL8Ok6nK7L4nl1k6K8K8k3l6j0L4L4k3k8J8K8Kk1k5L7L8j3l9pL8Pn1k4M
$$ -30 -38 0 6 -20 -25 2 36 31 0 -26 2 30 7 -29 -39 -5 29 6 -22 -4 24 26 5 -20 17 55 42 3 -4 34 41 -10 -34 -30
4674c0L5J0k8j7J6L9j9l0j4M3K4k8k0J4L5j3k8k1K5J5rj9kL2K1j8l3MM2Mk5j9
$$ -30 5 15 -13 -30 -14 25 6 -24 -38 5 29 1 -19 -5 30 17 -11 -32 -7 8 -1 -20 -22 10 31 13 -20 -16 26 30 5 -14
4706a4K4L2j6k6j7J4K4k5j7KK8J0k2j3J5J6j0k0nJ4J9j7j9J2J3Mk7j4K3K2J0k4
$$ -14 10 42 26 0 -17 -3 21 -4 -21 -19 9 19 -3 -16 -1 15 5 -15 -20 -6 13 -4 -23 -11 2 6 -21 -35 -12 10 20 -4
4738d%J7J3j0k3%K3l%k1J3J2Rl3rJ6J1j1kj0K6J1k3pNNqj3pPJ5jm%rPj0%J0KJ7
$$ -4 -4 13 26 16 -7 -7 16 13 13 -8 5 17 26 -7 -16 0 11 0 -2 -12 14 25 2 -5 0 5 -3 -16 -23 -16 -1 -2 -6 -6 -15 -8 -18 -18 -8 -6 11
4779A1lkJKrOj1J5K0qj8OJjPk1MRJ3j4mKPkk2%Nkj0PLJ2loj1MPkjOpJ7KrnJ2r
$$ 11 8 6 7 9 0 6 -5 10 30 22 4 10 11 10 17 -4 0 9 22 8 4 6 13 11 -11 -11 -6 -8 -18 -11 -8 4 1 -5 -16 -12 -5 -7 -8 -2 -9 8 10 1 -4 8 -1
4826aMNNKKnnMo%mjkJ6j0rRqkqOkQ%jj5Rjjj3NJ4j%jl%LM%LLjlJ6lJLlj0mOrJ4
$$ -1 3 8 13 15 17 12 7 11 5 5 1 0 -2 14 4 -5 4 -4 -6 -14 -8 -10 -2 -2 -3 -18 -9 -10 -11 -24 -19 -5 -6 -6 -7 -10 -10 -7 -3 -3 0 3 2 -1 15 12 13 16 13 3 -1 5 -4 10
4880A0Qlmoj8J2lo%ORJj2lOJj3NkPJ5lj3KKmqJ0jJ2lmLP%mrJ5LlqJ3lPjk1MKQ
$$ 10 18 15 11 5 -13 -1 -4 -10 -10 -4 5 6 -6 -9 -3 -2 -15 -10 -12 -5 10 7 -6 -4 -2 -6 -14 -4 -5 7 4 0 3 10 10 6 -3 12 15 12 4 17 14 21 20 -1 3 5 13
4929A3k4%PJ2npj4NJnj4K0JQmrPPoj2J0J0J4mpJJ0Jk1NLMLjKKPj1j8MJ0%j8NP
$$ 13 -11 -11 -4 8 3 -4 -18 -13 -12 -17 -31 -11 -10 -2 -6 -15 -8 -1 -7 -19 -9 1 15 11 4 5 15 16 -5 0 3 7 10 9 11 13 20 9 -9 -5 5 5 -13 -8 -1
4974aQlk4jJ8j4J0k0J7J7lmj2lK7j9j9J8J1K1j7j5OK0j5Nj8J5J7Lj8j1J4jj2k3
$$ -1 7 4 -20 -21 -3 -17 -7 -27 -10 7 4 0 -12 -15 12 -7 -26 -8 3 24 7 -8 -2 18 3 8 -10 5 22 25 7 -4 10 9 -3 -26
5010b6J3J8Mj6j7J8J4rk8NJ7K2k0pjK3Ok6j9OK4Jj7PJ3J4mk8kL7Mj6rRK5mk7m
$$ -26 -13 5 9 -7 -24 -6 8 -1 -29 -24 -7 15 -5 -12 -13 10 16 -10 -29 -23 1 2 -15 -8 5 19 15 -13 -15 22 26 10 1 10 35 31 4 0
5048@NJ2ok7jK1K6k2k9K6J5Ll4qJ8J4mk2j1K5kj2k9J1M3lk0nJ5L1j0k8kL6J3k4
$$ 0 5 17 11 -16 -17 4 30 8 -21 5 20 23 -11 -19 -1 13 9 -13 -24 1 -1 -13 -42 -31 12 9 -11 -16 -1 30 20 -8 -10 26 39 15
5084A5k4J9K1pl5j7L2J5j9qnL7J0k5k3J7K2nl1j8RL9j1l7MJ3J1j8j7J6M4jl5j
$$ 15 -9 10 31 24 -11 -28 4 19 0 -8 -13 24 34 9 -14 3 25 20 -11 -29 -20 19 8 -29 -25 -12 -1 -19 -36 -20 24 23 -12 -13
5118a3K7K1j7k4kL0K1k4l4%L4J2m0j4L0K5ml3jL8Kj3l7lL2%k4j3RK6rk6oK8J0
$$ -13 14 35 18 -6 -8 22 43 19 -15 -15 19 31 -9 -23 7 32 28 -5 -6 32 34 21 -16 -19 13 13 -11 -24 -15 11 2 -24 -30 -2 8
5153Hqk4J7L0J0k3j6J4RJk5oK4J8j5l3J9K5Kk4pJ1K6rj5j4J9%kk5rK6Kk3pJ2K4
$$ 8 0 -24 -7 23 33 10 -6 8 17 18 -7 -13 11 29 14 -19 0 25 27 3 -4 7 33 24 9 -5 14 14 12 -13 -22 4 6 -17 -24 -12 12
5190A2lk8QPK2mk7J6MJ1j9j2J3K1ok1NLK2j8j2LK0J1j3qJ0K4j5k0j0J9oj1j5j
$$ 12 9 -19 -11 -4 18 14 -13 3 7 18 -1 -13 0 21 15 -6 -1 2 24 6 -6 -3 17 28 15 7 17 41 26 6 -4 15 9 -2 -17 -18
5226a8J8K0j9j2J1LrnoJK2npj0J9jLk1QK3%j8J1QPLl1OPJ5kj4PKKk1%LNOj2pP
$$ -18 0 20 1 -11 0 3 -6 -11 -17 -16 6 1 -6 -16 3 2 5 -16 -8 15 15 -3 8 16 23 26 -5 1 8 23 21 7 14 16 18 -3 -3 0 5 11 -1 -8 -1
5269aJ3qj9nJ1lRj2JJ5lj2mPJ2qkONJ2%j8J8pmJoJ0Pom%%Oj6MLjJ1j0mNNj1lr
$$ -1 12 4 -15 -20 -9 -12 -3 -15 -14 1 -2 -14 -18 -11 1 -7 -9 -3 2 14 14 -4 14 7 3 4 -2 8 15 9 5 5 5 11 -5 -1 2 1 12 2 -2 3 8 -3 -6 -15
5315a5JMqMrJ0J4Lj7Oj0J0mJJ3jPj1KJ3j4K4k2jJ8j4lnQLj0J1nnJ0Nk7J4Oj1K
$$ -15 -14 -10 -18 -14 -23 -13 1 4 -13 -7 -17 -7 -11 -10 3 2 9 -2 0 13 -1 23 1 0 18 4 1 -4 4 7 -3 8 3 -2 8 13 -14 0 6 -5 -3
5356cj3J0kJ0qpQMomRmRoj0J4J6j7MKkJ0pJJ1j0Pr%KPmoklmOj1ljL%mKJ3j0Jq
$$ -3 -16 -6 -8 2 -6 -13 -5 -1 -7 -11 -2 -6 3 -3 -13 1 17 0 4 6 4 14 7 8 19 9 16 7 7 9 16 12 6 4 1 -3 3 -8 -11 -12 -9 -9 -13 -11 2 -8 -7 -15
5404a5MoKnRJ7l%lJ0qQljJ3j3Oj2J8nkj0JKMKlLKmnkrNljjKNj1JKmPo%PJ1m%o
$$ -15 -11 -17 -15 -20 -11 6 3 3 0 10 2 10 7 6 19 6 12 0 18 13 11 1 2 4 8 10 7 10 12 8 3 1 -8 -3 -6 -7 -8 -6 -1 -12 -11 -9 -13 -6 -12 -12 -5 6 2 2 -4
5455dOO%j1NO%Nj2J2nm%qJ8mkmjNpoJNkmnrJJ3mkrJ0PjnoJ9k1RmRKoKPjPKk1O
$$ -4 2 8 8 -3 2 8 8 13 1 13 8 4 4 -4 14 10 8 4 3 8 1 -5 -4 1 -1 -5 -10 -19 -18 -5 -9 -11 -20 -10 -3 -4 -9 -15 4 -17 -8 -12 -3 -1 -7 -5 2 1 8 10 -11 -5
5507eQkOj0ROJrj0J0lmk%OKj8OmQmj0JJ1K6j2j7MJ4mj7kJ1KnJoJ9J0pj2K1Nj4
$$ -5 3 1 7 -3 6 12 13 4 -6 4 1 -3 -5 -5 1 3 -15 -9 -13 -5 -9 -19 -18 -7 19 7 -10 -6 8 4 -13 -15 -4 -2 -7 -6 -12 7 17 10 -2 19 24 10
5551A0omPNnj4R%Jnk1QJ3Lj3lJ3%j1%kjJ9j5pJ1J4jk7J2J2NPk0PJ8oj4MKJ9nj3
$$ 10 4 0 7 12 7 -7 2 2 3 -2 -23 -15 -2 1 -12 -15 -2 -2 -13 -13 -15 -16 3 -12 -19 -8 6 5 -22 -10 2 7 14 -6 1 19 13 -1 3 5 24 19 6
5594Fj0PLKj3mJ2Pj9MKJ3pj5LlOj1nJJ8nJj2LJ2jj1J3J0%nj1J4j0J0jj5K8KMj7
$$ 6 -4 3 6 8 -5 -9 3 10 -9 -5 -3 10 3 -12 -9 -12 -6 -17 -22 -21 -3 -8 -7 -19 -16 -4 -5 -16 -3 7 7 2 -9 5 -5 5 4 -11 17 19 23 6
5636Fj9K5Jj2N%lJ9j4j7J1J6nk0k2K6J4j9rPJ0%nj1LJ1lnNP%LnPJ1ponPJMj3J0
$$ 6 -13 12 13 1 6 6 3 22 8 -9 2 18 13 -7 -29 -3 11 -8 -17 -10 0 0 -5 -16 -13 -2 -5 -10 -5 2 2 5 0 7 18 11 5 0 7 8 12 -1 9
5679ImRj3kRQjqlj0J6j3rjOOj0LrRKkj1J8%Qj0nQKjjKPLjmlJ1mJPrNkKqMLqqj3
$$ 9 5 14 1 -1 8 16 15 7 4 -6 10 -3 -12 -13 -7 -1 -11 -8 -17 -8 -6 -8 -19 -1 -1 7 -3 -8 0 2 1 0 2 9 12 11 7 4 15 11 12 19 10 15 13 15 7 11 14 6 -2 -15
5731a5J1jj1%RnKMj0OKj4L%J5NqPrJ4njJ0qMjj3J5QJj1lkOnNjoJ6jk9%J7mmjM
$$ -15 -4 -5 -16 -16 -7 -12 -10 -6 -16 -10 -8 -22 -19 -19 -4 1 -7 0 -9 5 0 -1 9 1 5 4 -9 6 14 15 4 1 -1 5 0 5 4 -2 14 13 -16 -16 1 -3 -7 -8 -4
5778dPnmq%Pj%RrRj3J0j3RNJ4j3NK0k0LQrKljJ0pnPj0J1j3JJj0RKq%l%k%nPk9
$$ -4 3 -2 -6 -14 -14 -7 -8 -8 1 -8 1 -12 -2 -15 -6 -1 13 0 5 25 5 8 16 7 9 6 5 15 8 3 10 0 11 -2 -1 0 -10 -1 1 -7 -7 -10 -10 -12 -12 -17 -10 -39
5826c9N6k1l0n3O6J2OO6o9m1K5O4p3K9M7n3J3PlKJ0orRj1NnJNqMj4J3qkj0J2p
$$ -39 17 -4 -34 -87 -21 -9 -3 63 -6 -47 -22 42 -31 -2 45 -8 5 12 9 11 21 15 6 15 4 9 4 5 10 2 6 -8 5 -3 -5 -15 -3 -10
5864a0nLj0J4Pj1j0J8kRqJQlkmK3j7JMLlLOooJ0lNj0Pj5NnmNjj2J1nnJ%kjJ9j4
$$ -10 -15 -12 -22 -8 -1 -12 -22 -4 -6 3 -5 -4 4 1 -1 -5 18 1 2 6 9 6 9 15 9 3 13 10 15 5 12 -3 2 -3 -7 -2 -3 -15 -4 -9 -14 -13 -13 -15 -16 3 -11
5911a1KmMOmOrJ0mKNpJ4%j2PJ1lJnLqlkJ1j9J2koJ1qrJ2pLmkPj3mL%LKJ0jknM
$$ -11 -9 -13 -9 -3 -7 -1 -10 0 -4 -2 3 -4 10 10 -2 5 16 13 14 9 12 4 1 -1 10 -9 3 1 -5 6 -2 -11 1 -6 -3 -7 -9 -2 -15 -19 -16 -16 -13 -11 -1 -2 -4 -9 -5
5960eOoRj1J4krPJ4nJ3nk0PPlj0JRj1PoOKmkj0KrO%Rj2QOj0%KRnRj4J1q%J2j7
$$ -5 1 -5 4 -7 7 5 -4 3 17 12 25 20 0 7 14 11 1 2 11 0 7 1 7 9 5 3 -7 -5 -14 -8 -8 1 -11 -3 3 -7 -7 -5 4 -1 8 -6 5 -3 -3 9 -8
6007hJ5J0j2qPJ5lj3KkJ4j0oONKj8%j%Qj4K%JjpM%kRj3J2%MpkJ8nj3nJ5J1Npp
$$ -8 7 17 5 -3 4 19 16 3 5 3 17 7 1 7 12 14 -4 -4 -5 -5 3 -11 -9 -9 -8 -9 -16 -12 -12 -14 -5 -18 -6 -6 -2 -9 -11 7 2 -11 -16 -1 10 15 8 1
6053ALJ8j3lJJ0qQk1RJKj1qKQQk6J5KJ2j1j2jMPlqPJ6j0n%kJ1jj3PQLJnQJjj8
$$ 1 4 22 9 6 7 17 9 17 -4 5 6 8 -3 -11 -9 -1 7 -19 -4 -2 10 -1 -13 -14 -10 -3 -6 -14 -7 9 -1 -6 -6 -8 3 2 -11 -4 4 7 8 3 11 12 11 -7
6099gOPJ4rj5J2j0Rj1kNNpmKLnkKqJ3%jj6JJ5%l2J5J6MOj2JJ5Mj1nKJ4jj6PjK2
$$ -7 -1 6 20 11 -4 8 -2 7 -4 -6 -1 4 -3 -7 -5 -2 -7 -9 -7 -15 -2 -2 -3 -19 -18 -3 -3 -35 -20 -4 0 6 -6 -5 10 14 3 -2 0 14 13 -3 4 3 25
6144B5k4j5JJ5kmrMJ4lmnQJ2k4j1%J0J0j0rNJ2rJ2p%K1Jj5JJ8Mj8j3J0K0j2jn
$$ 25 1 -14 -13 2 0 -4 -13 -9 5 2 -2 -7 1 13 -11 -22 -22 -12 -2 -12 -21 -16 -4 -13 -1 -8 -8 13 14 -1 0 18 22 4 -9 1 21 9 8 3
6184CO%Mj5OMmjKj1KQj9nQJ5qk0mJ8kojLJ9jj9J3RPnnrJ7PrrMRmplPK1j7pLKJ1
$$ 3 9 9 13 -2 4 8 4 3 5 -6 -4 4 -15 -20 -12 3 -5 -25 -29 -11 -13 -19 -20 -17 2 1 -18 -5 4 11 6 1 -8 9 16 7 -2 2 11 7 0 -3 4 25 8 1 4 6 17
6233A7j4rJ2lLj7pRNjj8OJ5JkmKJ2rOj9J1J3ljKn%Oj0KRKJmJ5j3OppPjmoQj1Q
$$ 17 3 -6 6 3 6 -11 -18 -9 -4 -5 -23 -17 -2 -1 -3 -7 -5 7 -2 4 -15 -4 9 6 5 7 2 2 8 -2 0 9 11 12 8 23 10 16 9 2 9 8 4 -2 6 -5 3
6280CJJj4OkJllkPj2K1j8J2q%%J4lkLnKJ1lkkJJ1k1J8qklOj1J4p%rPJj1MnQrO
$$ 3 4 5 -9 -3 -5 -4 -7 -10 -12 -5 -17 4 -14 -2 -10 -10 -10 4 1 -1 2 -3 -1 10 7 5 3 4 15 -6 12 4 2 -1 5 -6 8 1 1 -8 -1 0 -11 -7 -12 -4 -13 -7
6328gKmmMmNJ3rMj8J5LlM%NNJ0j8PkJJ1j3MLmlQlj2MmjjNlMj1klkJ1j7J0nJPN
$$ -7 -5 -9 -13 -9 -13 -8 5 -4 0 -18 -3 0 -3 1 1 6 11 21 3 10 8 9 20 7 11 14 10 7 15 12 0 4 0 -1 -2 3 0 4 -7 -9 -12 -14 -3 -20 -10 -15 -14 -7 -2
6377bqJmKJ3qNJPNlKKpqPj0PLKKnnKmOj0QllLojMOj5OLjk%lJ5lj2KJOL%%J4nj1
$$ -2 -10 -9 -13 -11 2 -6 -1 0 7 12 9 11 13 6 -2 5 -5 2 5 7 9 4 -1 1 -3 3 -7 1 -2 -5 -2 -8 -9 -5 1 -14 -8 -5 -6 -8 -8 -11 4 1 -11 -9 -8 -2 1 1 1 15 10 -1
6431ajJ4J2j1km%%pjlJ4oj3%OJ2j5JoLJo%mRMj1QKJNrjNJK%NJ0moKmJ0rqJ5pJ9
$$ -1 -2 12 24 13 11 7 7 7 0 -1 -4 10 4 -9 -9 -3 9 -6 -5 -11 -8 -7 -13 -13 -17 -8 -4 -15 -7 -5 -4 1 -8 -9 -4 -3 -1 -1 4 14 10 4 6 2 12 3 -5 10 3 22
6481B2j7qJ8nonnJ0j1J2j9mMPrLlmJ5ojNNPj4MQKmNqROj2KjLPj6J2rPOrkLmJj
$$ 22 5 -3 15 10 4 -1 -6 4 -7 5 -14 -18 -14 -7 -16 -13 -16 -20 -5 -11 -12 -7 -2 5 -9 -5 3 5 1 6 -2 7 13 1 3 2 5 12 -4 8 -1 6 12 3 1 4 0 1 0
6530@N%jj5nJ1j0RoJMRrllRJ1oj6J6NJJj4J3J1oj8J4J1lj9J0KKkoj6J5PloLPj4
$$ 0 5 5 4 -11 -16 -5 -15 -6 -12 -11 -7 2 -7 -10 -13 -4 7 1 -15 1 6 7 8 -6 7 18 12 -6 8 19 16 -3 7 9 11 9 3 -13 2 9 6 0 3 10 -4
6575dJj6J3Oj1rQPNj1j1J6MNj7PQlMpo%K7j3j1RJ4Mj1PmjkpqJ7Qk4kMNQk0mjJ5
$$ -4 -3 -19 -6 0 -11 -20 -12 -5 0 -11 -22 -6 -2 3 -14 -7 1 -2 2 -5 -11 -11 16 3 -8 1 15 19 8 15 11 10 8 1 -7 10 18 -6 -8 -4 1 9 -11 -15 -16 -1
6621amj3J2jRj6NKOLj3pMJ6j2MmJ6kNoLQRj3pMRkj0jmJ1lppMPj0Kj0OLlkjOj6
$$ -1 -5 -18 -6 -7 2 -14 -9 -7 -1 2 -11 -18 -14 2 -10 -6 -10 6 4 9 3 6 14 23 10 3 7 16 14 4 3 -1 10 7 0 -7 -3 4 -6 -4 -14 -8 -5 -8 -10 -11 -5 -21
6669b1lJ0KJJ3k8RK0JlrJ2mRj4J5jPrnjJLkn%J3j2%j3J8Pj4nJJLomkJ6lj2JQl
$$ -21 -24 -14 -12 -11 2 -26 -17 3 4 1 -8 4 0 9 -5 10 9 16 7 2 1 2 5 3 -2 -2 11 -1 -1 -14 4 11 -3 -8 -7 -6 -3 -9 -13 -15 1 -2 -14 -13 -5 -8
6715hLjnJ4%mj2K0rRmrJ4jLpNoJ2o%oOJj1mKLomQR%oj6PJ0j1NoOQj6NlJ3lPoo
$$ -8 -5 -6 -11 3 3 -1 -13 7 -2 7 3 -6 8 7 10 3 8 2 14 8 8 2 8 9 -2 -6 -4 -1 -7 -11 -3 6 6 0 -16 -9 1 -10 -5 -11 -5 3 -13 -8 -11 2 -1 6 0 -6
6765fJ3Lj0lJ8qnljJ4qjmkM%Jj0MMLj7J0Oj1MjjjJ2qj4J0jRk%J%lNOpJ0onL%J
$$ -6 7 10 0 -3 15 7 2 -1 -2 12 4 3 -1 -3 1 1 2 -8 -4 0 3 -14 -4 2 -9 -5 -6 -7 -8 4 -4 -18 -8 -9 0 -2 -2 -1 -1 -4 1 7 0 10 4 -1 2 2 3
6814CNj0RMJj3lJ2%j5QkrNj1RnQmRp%kLMnNLplKlJ0NpKJ1nMoJNpkQjMj3NNkKj6
$$ 3 8 -2 7 11 12 -1 -4 8 8 -7 1 -1 -10 -5 -16 -7 -12 -4 -8 1 -6 -6 -8 -5 -1 -6 -1 2 -5 -8 -6 -9 1 6 -1 1 12 7 11 5 6 11 4 2 10 9 13 0 5 10 8 10 -6
6867fL%oJ3r%jPnj4J5%omRlNMkoQlRlo%J0pLKKMLj2J6qkrOmPJ0j2mj2RJknkLk0
$$ -6 -3 -3 -9 4 -5 -5 -6 1 -4 -18 -3 -3 -9 -13 -4 -7 -2 2 0 -6 2 -1 8 5 -1 -1 9 2 5 7 9 13 16 4 20 12 10 1 7 3 10 20 8 4 -8 1 2 0 -5 -7 -4 -24
6919b4J4OmpMOKpNJ0pnKJ3j0MKKJMm%Op%%Nj0LKJoPmrjKj4J1MnmMJ%lkOnkQl%
$$ -24 -10 -4 -8 -15 -11 -5 -3 -10 -5 5 -2 -7 -5 8 -2 2 4 6 7 11 7 7 13 6 6 6 11 1 4 6 7 1 8 4 -5 -6 -4 -18 -7 -3 -8 -12 -8 -7 -7 -10 -12 -6 -11 -13 -5 -8 -8
6972hJ9j5%OJ4r%Pj0KNqKJqLrJ6qQpllJLkKnNrkKPkqLKQmNj3J1JqQkMjNnOqNn
$$ -8 11 -4 -4 2 16 7 7 14 4 6 11 3 5 6 -2 1 -8 8 0 8 1 -2 -5 -4 -1 -3 -1 -6 -1 -10 -12 -10 -3 -5 -13 -10 -8 0 -4 1 -12 -1 0 -8 0 -2 2 1 6 1 7 -1 4 -1
7026aOPmqLOpJpqRJ0qQj5LKllpJ3mKKkLkjjPNpj1J4OjNmkNqLJKKjj3ONr%nJ1K
$$ -1 5 12 8 0 3 9 2 3 -4 -12 -3 7 -1 7 -8 -5 -3 -6 -9 -16 -3 -7 -5 -3 -5 -2 -4 -5 -6 1 6 -1 -12 2 8 7 12 8 6 11 3 6 7 9 11 10 -3 3 8 -1 -1 -6 5 7
7080GjrnMmqPnMJMJkL%j5J1J1kOrJ4%rlNO%jmmLJ7rj1lJ6Rk1pjJ3prJMMoj4QN
$$ 7 6 -3 -8 -4 -8 -16 -9 -14 -10 -9 -5 -4 -6 -3 -3 -18 -7 4 2 8 -1 13 13 4 1 6 12 12 11 7 3 6 23 14 3 0 16 25 4 -3 -4 9 2 -7 -6 -2 2 -4 -18 -10 -5
7131enMJJNQj9NJ1J6j7qnJ3Pj1jJ0KOj4pJ6%pj3J0OQj3oPoQj3qROj0pJ1lQkj3
$$ -5 -10 -6 -5 -4 1 9 -10 -5 6 22 5 -3 -8 5 12 1 0 10 12 18 4 -3 13 13 6 -7 3 9 17 4 -2 5 -1 7 -6 -14 -5 1 -9 -16 -5 -8 0 -2 -15
7176a5J9j3MjLoJ2Nj8J0J2pmmQmJ2jlJPqrKQKrqRNLj7Nj0J1ppNRJmrJJ0%j4JR
$$ -15 4 -9 -5 -6 -3 -9 3 8 -10 0 12 5 1 -3 5 1 13 12 9 10 17 9 0 2 10 12 3 -5 4 9 12 -5 0 -10 1 -6 -13 -8 1 2 -2 -11 -10 0 0 -14 -13 -4
7224dLQj8J4QkoqMJ8nlj1J2Rnj2J3Koqj3J0llJKnJKJlJMnjKjJ7j9JMNJNMlmnJ3
$$ -4 -1 7 -11 3 11 9 3 -5 -1 17 12 9 -2 10 19 14 2 15 17 11 3 -10 0 -3 -6 -5 -3 -8 -7 -5 -4 -7 -6 -2 -7 -8 -6 -7 10 -9 -8 -4 1 2 7 11 8 4 -1 12
7274A2rJ3ljllJ1oqJkJ0mookNPj7J6j2OJj0Rj5L%PKKjjQoJNmQLqkkjJ7kqLkKj9
$$ 12 3 16 13 12 9 6 17 11 3 4 2 12 8 2 -4 -6 -1 6 -11 5 -7 -1 0 -10 -1 -16 -13 -13 -6 -4 -2 -3 -4 4 -2 -1 4 0 8 11 3 1 -1 -2 15 13 5 8 6 8 -11
7325a1J5LJmOKj2Kj2NJK%pJPjmkNm%RlknPjj0QJ9jqOKlooRlJNl%j4J7k1J3JmL
$$ -11 4 7 8 4 10 12 0 2 -10 -5 -4 -2 -2 -9 -8 -1 -2 -6 -8 -3 -7 -7 2 -1 -3 -8 -1 -2 -12 -4 15 14 6 12 14 11 5 -1 8 5 6 11 8 8 -6 11 -10 3 4 0 3
7376CqPj0NMj4%J1j1LPqLJmMPqjORoJ7qkNKj5OkJ2njljJlkj0QNrJ0j2jPpMj0J8
$$ 3 -5 2 -8 -3 1 -13 -13 -2 -13 -10 -3 -11 -8 -7 -11 -7 0 -8 -9 -3 6 0 17 9 7 12 14 -1 5 3 15 10 9 6 5 6 3 1 -9 -1 4 -5 5 -7 -8 -1 -8 -4 -14 4
7426Dk1%N%PM%qPmNOkKJjNJj4K0pjJmmLJnJ%J7j5qJ1j7J2j2rQj1J9nJmkJ1omL
$$ 4 -17 -17 -12 -12 -5 -1 -1 -9 -2 -6 -1 5 3 5 6 5 10 11 -3 17 10 9 10 6 2 5 6 1 2 2 19 4 -4 7 -10 2 -10 -19 -11 -22 -3 -8 -7 -11 -13 -2 -8 -12 -9
7475iLOJ1j7J1ljQKjpQKoJ1qLkLk1J6NnrMQqnoOmLnMl%Lj3NQkJ%KMklMKPRj9J1
$$ -9 -6 0 11 -6 5 2 1 9 11 10 3 11 13 7 18 10 13 11 14 -7 9 14 9 0 4 12 4 -1 -7 -1 -5 -2 -7 -3 -6 -6 -3 -16 -11 -3 -5 -4 -4 -2 2 0 -3 1 3 10 19 0 11
7528A1OpJ%JNj4PrMLpkNJ5j5j7J0J1j3LjOkoj3LOQlJknJ0MJmKlkJ1oJ6J0k2jJ
$$ 11 17 10 11 11 12 17 3 10 1 5 8 1 -1 4 19 4 -13 -3 8 -5 -2 -3 3 1 -5 -18 -15 -9 -1 -4 -3 -5 -10 0 4 5 1 3 0 -2 9 3 19 29 7 6 7
7575GLqjlJ1kpmKmMqoK0m%j0qJ7Lmj4K2j4LjkmJ8mj0J2lMJNJRj0rNJkJ%kMQj4
$$ 7 10 2 1 -2 9 7 0 -4 -2 -6 -2 -10 -16 4 0 0 -10 -18 -1 2 -2 -16 6 -8 -5 -6 -8 -12 6 2 -8 4 1 5 6 11 12 21 11 2 7 8 6 7 7 5 9 17 3
7624Cj0MQLj2kmMkLqJ4j1qjOJ1LopONjnRMPj0Jj0J7qlQnMJLj9J1J1j4jKmM%nl
$$ 3 -7 -3 5 8 -4 -6 -10 -6 -8 -5 -13 1 -10 -18 -19 -13 -2 1 -5 -12 -6 -1 -2 -7 2 6 13 3 4 -6 11 3 0 8 3 7 8 11 -8 3 14 0 -1 1 -3 1 1 -4 -7
7673gJNk0J4koKonJ2Q%Kj1J1OlmLL%rPR%kj2LJ5JqqLPpNmrNmO%qNlqjJ3roJ1l
$$ -7 -6 -1 -21 -7 -9 -15 -13 -19 -24 -12 -4 -4 -2 -13 -2 4 1 -3 0 3 3 -6 1 10 10 8 -4 -1 14 15 7 -1 2 9 2 7 3 -6 -1 -5 1 1 -7 -2 -5 -13 -14 -1 -10 -16 -5 -8
7725hLjL%jQjrkJ8j2J1qKOJkPj4J4Kj1MPnjJoMj1j1J5j7J4kj0J0mJolNJLMJmk
$$ -8 -5 -6 -3 -3 -4 4 3 -6 -8 10 -2 9 1 3 9 10 8 15 1 15 17 6 10 17 12 11 12 6 10 -1 -12 3 -14 0 -2 -12 -2 -6 -5 -11 -14 -9 -8 -5 -1 0 -4 -6
7773fnK1Nj4MPqML%NrMJoPj6OLKmkJlNk0J4pRpqMkjpJ3jJ2jj7J6%mM%QNrOpNl
$$ -6 -11 10 15 1 5 12 4 8 11 11 16 7 11 12 6 13 -3 3 6 8 4 2 3 0 5 -15 -1 -8 1 -6 -14 -10 -12 -13 -20 -7 -8 4 3 -14 2 2 -2 2 2 10 15 6 12 5 10 7
7825GmJ4pLMj1KL%lnjkj1NLKj4NKklJ4j4Nj7K2NqlQNqPo%OKMrNKmJ2q%N%pPqJ
$$ 7 3 17 10 13 17 6 8 11 11 8 3 2 0 -11 -6 -3 -1 -15 -10 -8 -10 -13 1 -13 -8 -25 -3 2 -6 -9 -1 4 -4 3 -3 -3 3 5 9 0 5 7 3 15 7 7 12 12 5 12 4 5
7877EJkmRqJOk0PmqJ1PklrMJPl%kNPlj0J9j3jPJPo%nL%%kPpKnJ1j0LNpp%OjqJ0
$$ 5 6 4 0 9 1 2 8 -12 -5 -9 -17 -6 1 -1 -4 -13 -9 -8 -1 -4 -4 -6 -1 6 3 -7 12 -1 -2 5 6 13 7 7 2 5 5 5 3 10 3 5 0 11 1 4 9 2 -5 -5 1 0 -8 2
7931BplnJ0j0RMj1PNNlkPrlJPlJ7j5JP%koJ0opk%JJ6j8LqM%KLk0J2K%pJNrOJJ
$$ 2 -5 -8 -13 -3 -13 -4 0 -11 -4 1 6 3 1 8 -1 -4 -3 4 1 18 3 4 11 11 9 3 13 7 0 -2 -2 -1 15 -3 0 -8 -4 -4 -2 1 -19 -7 -5 -5 -12 -11 -6 -15 -9 -8 -7
7982gKK%jPMJkJ4pqOnNj1J8qj1NK%%ljJkMpqKjlJ0onlJ2mLJqjQOn%MJ1j1MNL%
$$ -7 -5 -3 -3 -4 3 7 8 6 20 13 5 11 6 11 0 18 10 -1 4 6 6 6 3 2 3 1 5 -2 -10 -8 -9 -12 -2 -8 -13 -16 -4 -8 -5 -4 -12 -13 -5 1 -4 -4 0 11 0 4 9 12 12
8035A2opjK2j4LjMKkKo%Llj5KRj1lnlK8j4j1J2rPJ%QjjmkRNLpRmQkj8ONlLjJj3
$$ 12 6 -1 -2 20 6 9 8 12 14 12 14 8 8 11 8 -7 -5 4 -7 -10 -15 -18 10 -4 -15 -3 -12 -5 -4 -4 4 3 2 -2 -4 5 10 13 6 15 11 19 17 -1 5 10 7 10 9 10 -3
8086cJ0Lj0Pmj0NkJ0opjjkjpQKMJ1j1j2J7%KjjJ0j1LnJ1lJJLoRnoQmqRkkJKkj0
$$ -3 7 10 0 7 3 -7 -2 -4 6 0 -7 -8 -9 -11 -12 -19 -11 -9 -5 6 -5 -17 0 0 2 1 0 10 -1 2 -3 8 5 6 7 10 4 13 8 2 10 6 -2 7 5 3 4 6 4 -6
8136fjNkJlPmj3RPj1QMqLLmmJ1kPpQOn%JLnLmnRKpMj1LpJMrKjmRKlnJJqjOJ
$$ -6 -7 -2 -4 -3 -6 1 -3 -16 -7 0 -11 -3 1 -7 -4 -1 -5 -9 2 0 7 0 8 14 9 9 10 13 8 11 7 2 11 13 6 10 -1 2 -5 -4 0 -9 -7 -8 -12 -3 -1 -4 -9 -8 -7 -15 -16 -10 -9
8191i
$$ Imaginary data points
##PAGE= N=2
##DATA TABLE= (X++(I..I)), XYDATA
0@%%%%%%%%%%%%%%%%%%%%qJ6j6J6j6J6j6K4l2L2l7M5m8N6o4P2q0Q8j02J13j24
$$ 0 0 0 0 0 0 0 0 0 0 0 0 0 0 0 0 0 0 0 0 0 -8 8 -8 8 -8 8 -8 16 -16 16 -21 24 -24 32 -32 40 -40 48 -54 59 -65
41f5J37j53J70j90K11k31K55k83L14l46L80m19M60n06N61o22O91p70Q65r77J110
$$ -65 72 -81 89 -101 110 -121 134 -149 165 -181 199 -220 240 -266 295 -327 364 -406 459 -518 592
62E92j276J487j767K159k752L765n954J9257k0953l0349L1915Q545l5939l6786
$$ 592 -684 803 -964 1195 -1557 2208 -3746 15511 -5442 -35791 -3876 4669 -31270 -68056
76f8056K8762N8508J8612l8426k8947J6335K7582j0110k3802J2379M6645K0613
$$ -68056 -39294 19214 37826 -600 -29547 -13212 14370 4260 -19542 -7163 39482 60095
88F0095k9913m1065o990J3052m130k2044j935K9217K5142j1193k6680j056K6707
$$ 60095 30182 -10883 -17873 -4821 -8951 -30995 -32930 -3713 21429 10236 -16444 -17500 9207
101I207J6394j2050j5284Q872J9715j520k4934j5349J3189J7801j0902l2093j4995
$$ 9207 25601 13551 -1733 7139 26854 25334 400 -14949 -1760 16041 5139 -26954 -41949
114d1949J5970J8644k935q501J3934K8814Q493k2935k2628O906K1945L106j5745
$$ -41949 -25979 -7335 -10270 -18771 -4837 23977 32470 9535 -13093 -6187 15758 18864 3119
127C119l228J8100Q363k3021k9832j221K1410Q378j3863o640J9664K1992o297
$$ 3119 -109 17991 26354 3333 -26499 -27720 -6310 2068 -11795 -18435 1229 23221 16924
140A6924k2792k329K2031J0716j9922k3117M900K1126L160j8393j0103J3297J3092
$$ 16924 -5868 -8197 13834 24550 4628 -18489 -13589 7537 10697 -7696 -17799 -4502 8590
153H590j1768k3104j331K4180K0190k058q398N239J0774m831j9725j1593R234
$$ 8590 -3178 -26282 -27613 -3433 16757 14699 6301 11540 22314 17483 -2242 -13835 -4601
166d601J5429J320j1114n906M756K115r581j0654K905J3369P820m140n511M508
$$ -4601 10828 12148 1034 -4872 -116 1999 -7582 -18236 -15331 -1962 5858 1718 -3793 715
180G15R773R81j0141p825L390N661m195r458L03J2484R959m126j0867k963N569
$$ 715 10488 11469 1328 -6497 -3107 2554 -1641 -11099 -10796 1688 11647 7521 -3346 -6309 -740
195g40J475o563j549J2684J5301K64j3226r850N08R38o405n737N985J2791L767
$$ -740 735 -5828 -7377 5307 20608 20872 7646 -2204 -1696 -758 -7163 -12900 -6915 5876 9643
210I643r542r407J552N507j802n696K244J0386O181m081o100J471N711k49p497
$$ 9643 101 -9306 -7754 -2247 -4049 -9745 -7501 2885 9066 4985 -1115 356 6067 5818 -1679
225a679m901L642N698l22l217J961O279J881n979p423j756L117K415j64J227M664
$$ -1679 -6580 -2938 2760 2438 -779 1182 7461 9342 3363 -4060 -5816 -2699 -284 -448 779 5443
241E443L117m021q538n459N49K780J565J329L256L953P02l948m660m76K754J523
$$ 5443 8560 4539 -3999 -9458 -8909 -6129 -4564 -3235 21 3974 4676 728 -3932 -4408 -1654 -131
257a31o67Q51L711L208l34k785j996l44q06k762k230J711M622K736q28j731j068
$$ -131 -798 53 3764 6972 6638 3853 1857 1513 707 -2055 -4285 -2574 2048 4784 3956 2225 1157
274A157k098l877l175M01L785M237K069j03o45j161k792l337q01K632L560K507
$$ 1157 -941 -4818 -7993 -7592 -3807 430 2499 2396 1751 590 -2202 -5539 -6340 -3708 -148 2359
290B359J531R67m7j382k198j999p13N98R22R02J448J684M72j229k232k729k706
$$ 2359 3890 4857 4810 3428 1230 -769 -1482 -884 38 940 2388 4072 4544 3315 1083 -1646 -4352
307d352j588M64K165K931K695J093j226k915l187k320l65K096L530L375K216O67
$$ -4352 -5940 -5476 -3311 -380 2315 3408 2182 -733 -3920 -6240 -6605 -4509 -979 2396 4612 5279
323E279j300k665k483j152J82J395K188J954J011J04q81j768k062j671j178m27
$$ 5279 3979 1314 -1169 -2321 -2139 -744 1444 3398 4409 4513 3632 1864 -198 -1869 -3047 -3474
339c474P64J533J442J131O41o47k305k825j833k97J296K511L031K661J255j068
$$ -3474 -2710 -1177 265 1396 2037 1390 -915 -3740 -5573 -5870 -4574 -2063 968 3629 4884 3816
355C816l230l205j074P78J529K355L061K363k5k452l163k162o56j60n5J062K523
$$ 3816 586 -2619 -3693 -2915 -1386 969 4030 6393 6368 3916 753 -1409 -2065 -2225 -2280 -1218 1305
372A305J899o55k240j670q45j165j551m89J899L445K471Q1q05j49n63k513k805
$$ 1305 3204 2549 309 -1361 -2206 -3371 -4922 -5411 -3512 -67 2404 2485 1680 1531 968 -1545 -4350
389d350M6L251L620J407k95j16J41j658l896k591J778M192K069p40l13J239j18
$$ -4350 -4304 -1053 2567 3974 3679 3563 3704 2046 -1850 -4441 -2663 1529 3598 2858 2545 3784 3666
406C666l758m775j178K729K178j127j255K474L661o46m569k346K389K942n53j670
$$ 3666 -92 -4867 -6045 -3316 -1138 -2265 -3520 -1046 2615 1969 -2600 -4946 -2557 385 -168 -1838
422a838K277N499K459l761n059n78J995j428m141k71N496M885j253m551j417K438
$$ -1838 439 5938 8397 4636 -423 -1001 994 -434 -4575 -4846 650 5535 4282 -269 -1686 752
438G52P30l592k759L304O067J114m590l362J623J667l439n421l29N475M347j444
$$ 752 1482 -2110 -4869 -1565 4502 5616 1026 -2336 -713 954 -2485 -7906 -8235 -2760 1587 143
454A43k966K317N747J168n148l747L373N334m15m777j058M742K604n801q766j558
$$ 143 -2823 -506 5241 6409 1261 -2486 887 6221 5806 1029 -29 4713 7317 1516 -7250 -8808
470h808N533K663l990k223O357Q205q15q273l836N093M925l531o046K309Q713
$$ -8808 -3275 -612 -4602 -6825 -468 7737 6922 -1351 -5187 -94 4831 1300 -4746 -2437 6276
485F276J950q955q024K758O642j418p143Q6J0288Q124l530p519J244P935R83r341
$$ 6276 8226 -729 -8753 -5995 647 -771 -7914 -7828 2460 10584 7054 -465 779 8714 9697 356
501C56o702N070P962k154r332k871O476L671p102q745K573J1066N197m818l277
$$ 356 -6346 -1276 6686 4532 -4800 -7671 -1195 2476 -4626 -13371 -10798 268 5465 647 -2630
516b630O545P679l298j0557l595O883N638m502p449J213P713J207q939o988M875
$$ -2630 3915 11594 8296 -2261 -5856 1027 6665 2163 -5286 -4073 3640 4847 -4092 -11080 -6205
531f205R488J162o064o67Q561O576n123r837j428O650J748q287p069M520Q992
$$ -6205 3283 4445 -1619 -2286 6275 12851 7728 -2109 -3537 3113 4861 -3426 -10495 -5975 3017
546C017m74r192l905P086O906l545o992K978J1724N622o701p198L290O754l287
$$ 3017 2543 -6649 -10554 -3468 3438 -107 -7099 -4121 7603 13225 6524 -674 2616 9370 6083
561F083j1218m244P653O824m475q430J019Q928K756p746n819O111R916J80p717
$$ 6083 -5135 -9379 -1726 5098 623 -7807 -6788 2140 4896 -2850 -8669 -2558 7358 7538 -179
576a79k070P156M599o532r776p43O821K070o460m555N547Q485j01p137k438O179
$$ -179 -2249 4907 9506 2974 -6802 -7545 -724 1346 -5114 -9669 -4122 4363 4262 -2875 -5313 866
592H66N656k360n065J724P413K609o487p417N0L944j348o570k422N861O521j012
$$ 866 6522 4162 -903 821 8234 10843 4356 -3061 -3011 933 -415 -6985 -9407 -3546 2975 1963
608A963n500q52N210L255l729m502K729P197J854n497m414K338L432l149o984
$$ 1963 -3537 -4389 821 4076 347 -4155 -1426 5771 7625 2128 -2286 52 3484 335 -6649
623f649j527N914N071k027l989K165O240J141n748m018L535N378p60n031j180
$$ -6649 -8176 -2262 2809 782 -3207 -1042 5198 6339 591 -3427 108 5486 4726 -305 -1485
638a485M257K000n109o717k82M726J695l196j289M747N424p48m907j719L489K876
$$ -1485 2772 4772 -337 -7054 -7336 -2610 -915 -4111 -5400 -653 4771 4023 -884 -2603 886 3762
654C762j946l191J361M497R51m455m209O91K610p26l229l40M143M004o44l216
$$ 3762 1816 -1375 -14 4483 5434 979 -3230 -2539 71 -655 -3884 -4224 -81 3923 3279 63
670F3n76K623Q63l288l223J371L816Q48k974k151J421J891j770l732m70L981L566
$$ 63 -513 2110 2973 -315 -3538 -2167 1649 2497 -477 -2628 -1207 684 -1086 -4818 -5288 -1307 2259
687B259n76j850J354L178ll784k734J640K930k91k758n73K648J444k760l646P1
$$ 2259 1683 -167 1187 4365 4362 578 -2156 -516 2414 2123 -635 -1208 1440 2884 124 -3522 -3451
704c451K741Q65j869o67K742L000o06l137j464J348Q68j774j732J503L274R64
$$ -3451 -710 155 -1714 -2381 361 3361 2755 -382 -1846 -498 370 -1404 -3136 -1633 1641 2605
720B605j985j718N62R86q27j610N23K865K154o34j735l21N65p75k144j053J237
$$ 2605 620 -1098 -536 450 -377 -1987 -1464 1401 3555 2921 1186 865 1430 655 -1489 -2542 -1305
737a305J831K61j046m67P11L00j285j530J94J587R88k04n9R67Q83m91j615j089
$$ -1305 526 787 -259 -726 -15 285 -1000 -2530 -2336 -749 239 35 -24 943 1826 1335 -280 -1369
755a369L23P86J23m4R15J424L12j248j488n46J35K2o1N75J253Q60n45j456j043
$$ -1369 -1046 -260 -137 -181 734 2158 2470 1222 -266 -812 -677 -655 -716 -141 1112 1972 1427 -29 -1072
774a072l14k18k83L11J151J146L12m83o24l36k07l35j30N77J000O86J23m0m8l75
$$ -1072 -1386 -1604 -1887 -1576 -425 721 1033 550 -74 -410 -617 -952 -1082 -505 495 1181 1304 1264 1216 841
794H41o55n75k33J73M67M87M03K58p5o36r07p33l84l0M60Q98Q09L05k07n33p83
$$ 841 186 -389 -622 -449 18 505 908 1166 1091 455 -452 -1185 -1569 -1599 -1139 -241 568 873 666 133 -650
815f50p01k47L14Q01J006P76J81k24m37o56o98k22L70O06N42M16J59j82n12o68
$$ -650 -1351 -1598 -1284 -483 523 1299 1480 1256 819 163 -535 -757 -387 219 761 1177 1336 1154 642 -26
835b6o71l85K4K94L87M69M24M6l91n10n38m49j01L90P05O96N39K12j87m64n53
$$ -26 -697 -1082 -1058 -764 -377 92 516 562 171 -339 -877 -1326 -1427 -1037 -332 364 903 1115 928 464 -89
856h9m46r3L99O16M54L05J78j19n97p01m82j46R7K45L03L50L57J1n42p32m16j08
$$ -89 -535 -628 -229 387 841 1146 1324 1205 608 -93 -575 -721 -624 -379 -76 274 631 642 100 -632 -1048 -1156
878a156mJ81N28P62N91K5n63o78l01okK10P80J008M33m02p17m70j61k83m39j9
$$ -1156 -1160 -979 -451 311 902 927 364 -314 -615 -621 -623 -413 367 1375 1808 1406 689 219 58 -225 -664 -683
900f83P11P80p3o67k95K31j42q31o49L90J003N44j71k8O34M23q59j443m15Q76
$$ -683 28 808 735 68 -227 4 -138 -969 -1618 -1228 -225 319 148 120 754 1177 318 -1125 -1540 -664
920f64P95p9m8Q42R16l73j559j046N30J064J59l90M68J204J51j536j670j61Q07
$$ -664 131 52 4 846 1762 1389 -170 -1216 -686 378 537 147 615 1819 1970 434 -1236 -1397 -590
939e90J57p67j88J194J214m58j472m02J034O74p34p41R16J819N20j239j100L75
$$ -590 -433 -1200 -1388 -194 1020 562 -910 -1312 -278 396 -338 -1079 -163 1656 2176 937 -163 212
957B12O90q96j782j70J858J525n62j196K90J263j16j856j144J319K062M2j626
$$ 212 902 6 -1776 -1946 -88 1437 875 -321 -31 1232 1116 -740 -1884 -565 1497 1539 -87
974h7n19J303N49j889k160L29K089P69j291p07J667K037m50k179n55J879J309
$$ -87 -606 697 1246 -643 -2803 -2474 -385 384 -907 -1614 53 2090 1640 -539 -1094 785 2094
991B094j219j601P93K129J25k406j879P34J461o41j860J08K590J761j208j941
$$ 2094 875 -726 67 2196 2321 -85 -1964 -1230 231 -410 -2270 -2162 428 2189 981 -960
1007i60L14J799J62j926j047J583K032n10k330q49J460R25j581j859Q05K587J046
$$ -960 -646 1153 1315 -611 -1658 -75 1957 1447 -883 -1732 -272 653 -928 -2787 -1982 605 1651
1024A651j285q37J529J851o22k489r43J611J270j219j881L70J889J25k370j878
$$ 1651 366 -471 1058 2909 2287 -202 -1145 466 1736 517 -1364 -994 895 1020 -1350 -3228
1040c228R39K093K80j297J29K412J694j312k405j79J748N37j667j272J183J831
$$ -3228 -2289 -196 84 -1213 -1084 1328 3022 1710 -695 -874 874 1411 -256 -1528 -345 1486
1056A486m46k356j053J518J544p38j443P33K488J015j442j471O77J316o41k299
$$ 1486 1040 -1316 -2369 -851 693 -45 -1488 -755 1733 2748 1306 -165 512 1828 1187 -1112
1072a112j026J386J431p78j710L6J617M91j514j194J216K341P60r93m93J167R06
$$ -1112 -2138 -752 679 -99 -1809 -1773 -156 335 -1179 -2373 -1157 1184 1944 951 458 1625 2531
1089B531j256k224n09J398Q58j033j236N11J447J19j518r01J174J726K5j203p9
$$ 2531 1275 -949 -1458 -60 798 -235 -1471 -960 487 606 -912 -1813 -639 1087 1112 -91 -170
1106a70J503Q74j206j844k43J034J02j410r58J084J786J13j375m94J271J125o16
$$ -170 1333 2207 1001 -843 -1086 -52 50 -1360 -2318 -1234 552 665 -710 -1204 67 1192 576
1123E76j094N51J843P10j323j479J46Q31n87j721o04J338J323m84j208J88J434
$$ 576 -518 33 1876 2586 1263 -216 -70 761 174 -1547 -2151 -813 510 26 -1182 -994 440
1140D40N71j076r77P45J502J40j224n58R38P43r82j675l14J126P13n81n18Q88
$$ 440 1011 -65 -1042 -297 1205 1345 121 -437 501 1244 262 -1413 -1727 -601 112 -469 -987 -99
1158i9J461J24j280q09P29R65k89r32M3J031L57j158j396p5Q67J73q23l05J065
$$ -99 1362 1486 206 -603 126 1091 802 -130 -87 944 1301 143 -1253 -1328 -461 -288 -1111 -1416 -351
1177c51J193j31r56j90Q83N04p08q82L19J079K69q73o61M65N89n17j075j11J071
$$ -351 842 711 -245 -435 448 952 244 -638 -319 760 1029 156 -505 -40 549 32 -1043 -1154 -83
1196h3Q45k44n13K87P16j67j096p09N25Q26r0o39n4O04J67p64p77J91Q17L58k99
$$ -83 762 518 5 292 1008 841 -255 -964 -439 387 297 -342 -396 208 375 -389 -1166 -975 -158 200 -99
1217i9r5O07N69k76p48k11M21K19l47l45K52N72J11m93m24J04K26k21l95J00N92
$$ -99 -194 413 982 706 -42 -253 168 387 40 -305 -53 519 630 137 -287 -183 43 -178 -573 -473 119
1238A19M22j30l48j03N8j70m24j66L61N52J66j95r1R9k8l00k38J60M30K91k4j20
$$ 119 541 411 63 -40 18 -152 -576 -742 -381 171 337 142 51 150 122 -178 -416 -256 174 465 441 321
1260C21M8N2k28l76j53J53J85qm0J03J45l0k50k64n6P8M2K1J68K76J61j15k06
$$ 321 369 421 193 -183 -336 -183 2 -6 -46 57 202 172 -78 -342 -398 -320 -278 -257 -89 187 348 233 27
1283B7j60r3l5N5J55K75K34M2j44j91j62j21q6P5J68J45N9%j10j43j53r9o2M3
$$ 27 -133 -226 -261 -206 -51 224 458 500 356 165 3 -118 -204 -129 39 184 243 243 133 -10 -163 -262 -324 -281
1307b81O3J04R4J10K5o5j15m4j17O0KJ12K88N5J34j71m4j61j72j16Q9K28J87O9
$$ -281 -218 -114 -20 90 115 50 -65 -109 -226 -166 -164 -52 236 291 425 254 210 49 -123 -239 -150 78 265 334
1331C34k9j22j65j91j04m0Q7J54J03M0rj9p8j18n6j9M6Q1J04J17Q4M5l1j13j33
$$ 334 305 183 18 -173 -277 -317 -230 -76 27 67 58 39 -39 -157 -213 -232 -186 -105 -1 116 200 245 214 101 -32
1356c2q9LN6J39J58R9mj06j98j98j30K8J11J60J39M9n6j20j57j39n8P5J41J37
$$ -32 -121 -118 -62 77 235 334 330 224 26 -172 -302 -274 -163 -3 136 185 129 9 -148 -287 -345 -270 -129 8
1380HQ1N9Jl7q2r6l6L7P7L3K6R4J08j7j46j38m6l3l4JR0J98J19j06k07q9j7o5
$$ 8 89 148 149 112 30 -66 -102 -65 12 45 71 165 273 256 110 -28 -74 -107 -141 -140 -50 148 267 161 -46 -135 -152 -217
1408b17q7N5K31K12l3j70j01L8Mr3m7J83K94O5j58j12R7L4j46k14RJ90J10j26
$$ -217 -304 -249 -18 194 161 -9 -110 -72 -68 -161 -208 -25 269 334 176 64 161 195 49 -165 -156 34 144 18
1432A8j38J03J62p0k96j29J58J92k9r7J14K70O4k90k84KJ96K5j57J3L01K21j48
$$ 18 -120 -17 145 75 -221 -350 -192 0 -29 -126 -12 258 322 32 -252 -250 -54 -29 -186 -173 128 349 201
1455B01l03o7K11J26j52j10J86L17ll64j98J34J22j95l06J2L41J74j90k06J32
$$ 201 -102 -169 42 168 16 -94 92 409 406 42 -156 -22 100 -95 -401 -389 -48 126 -64 -270 -138
1476a38K91l2l22j04L28L41q1k56MK31Nl80l34J36L69Q6k34o2K98K29k15l66%
$$ -138 153 121 -201 -305 23 364 283 27 31 262 267 -113 -447 -311 58 144 -90 -152 146 375 160 -206 -206
1499b06L30J74k06k15J49K62j01m20k48K00K25j15k35J22M03K17j92k42J12K79
$$ -206 124 298 92 -123 26 288 187 -233 -481 -281 -56 -171 -406 -284 119 336 144 -98 14 293
1519B93Jk97j09K75K52j65l68j29J94O1k42k22J97M12J14k25j44K03K13j36l20
$$ 293 294 -3 -112 163 415 250 -118 -247 -53 8 -234 -456 -259 153 267 42 -102 101 314 178 -142
1540a42m5K93J57k22k90N0K35pl16j80K65L26K5j86N6L12J69k29l17oK28L2k70
$$ -142 -187 106 263 41 -249 -199 36 29 -287 -467 -202 124 149 -37 19 331 500 271 -46 -52 176 208 -62
1563f2j81J73K03j18l43j11K48K17p6j39J61L37J10k70k28R3J98q6l07p3K35J74
$$ -62 -243 -70 133 15 -328 -439 -191 26 -50 -189 -28 309 419 149 -79 14 212 126 -181 -254 -19 155
1585A55j53k55L4K53R7k05j25K07L41K0k56r6J56R6k29l23k5K40J19j91j69J39
$$ 155 2 -253 -219 34 131 -74 -199 8 349 369 113 17 173 269 40 -283 -308 -68 51 -140 -309 -170
1607a70K54k6k65n8K74K59o2j79L7K36L7k94k70Q3K03j6k30n6K62J81j25k40K4
$$ -170 84 58 -207 -265 9 268 206 27 64 300 337 43 -227 -144 59 43 -187 -243 19 200 75 -165 -141
1630a41K35J10j71j32J44K32m9k93j49J21J14j36j98Q2K73J07j48j33J22J96k9
$$ -141 94 204 33 -99 45 277 228 -65 -214 -93 21 -115 -313 -231 42 149 1 -132 -10 186 157
1651A57j90l8K10J47j27j98KJ36j0k15j47J28J95Lj49NJ63J18j45j84M1J66M7
$$ 157 -33 -71 139 286 159 -39 -37 99 89 -126 -273 -145 50 53 -96 -91 72 190 45 -139 -98 68 115
1674A15j07q4R3J28r0k02n3J38J10n3q6R2J74K0j51q9N1J00m4j29NJ31M4j09j14
$$ 115 8 -76 17 145 55 -147 -200 -62 48 -5 -91 1 175 195 44 -45 6 106 62 -67 -62 69 113 4 -110
1699a10KQ8rr8k8J33J33k4r4j9Q6K2r8q1O5J14J2q4k2M8L7p0r4OJ06M5l7k3L5
$$ -110 -108 -20 -29 -127 -155 -22 111 87 -7 -26 60 82 -16 -97 -32 82 94 10 -12 36 73 3 -91 -85 21 66 29 6 41
1728D1M8m4j03l0M1M1j6k2J9O3J1p4n5J5N9Qj1K6O5L5n0o1l2K9kl3KM6M0pm6j9
$$ 41 89 45 -58 -88 -47 -6 -22 -44 -25 38 49 -25 -80 -65 -6 2 -9 17 82 117 67 6 -26 3 1 -32 -30 16 56 49 3 -16
1760a6Ork3k2K5O0J7k6j7nJl9k8J0M3L5J9J2J1j0j8m8j6K2L0K4%J8nqn2l4kNN
$$ -16 -10 -19 -42 -64 -39 21 38 12 -5 -10 -9 -48 -76 -66 -23 12 31 43 54 44 26 -22 -38 -16 14 38 38 56 51 43 -9 -43 -45 -40 -35
1795c5K5K8K7rl6k9j5j3RJ7K5K7K1Nl1j1j8j1pJ7K3M1J1qj5k6j0l5j1J8L1J8L
$$ -35 -10 18 45 36 0 -29 -44 -57 -48 -31 -6 21 42 47 16 5 -13 -24 -31 -14 9 50 61 53 38 12 2 -33 -44 -26 5 23 26
1828B6qpj8l5k3NK4L5J7J9mPk5m4qJ5K5J8K2J0J3jm1l7j2mJ8KK6J4J6pl7j9l2
$$ 26 18 11 -7 -42 -65 -60 -36 -1 16 35 31 38 13 -31 -39 -24 1 19 41 51 64 63 22 -15 -27 -31 -13 -11 15 29 45 38 1 -18 -50
1863e0qJ7J3K2M1J4j1k0k1j5k0K4lM9L8Pj4k9k0j0k8pK2L5K9pk4qj3k6l2k5L4
$$ -50 -58 -41 -28 -6 35 49 38 18 -3 -18 -38 -14 -17 32 70 77 63 34 14 4 -24 -31 -9 26 55 48 24 16 3 -23 -55 -80 -46
1896d6M4Qo%RNm0m2J2N1K5QJ5K5L9m8p4m1L7K7Kj1K9N7j1p0o6jM9rk5L4O7L0n4
$$ -46 -2 6 0 0 9 14 -26 -68 -56 -5 20 28 43 68 107 59 -15 -56 -19 8 10 -1 28 85 74 4 -62 -63 -14 -23 -48 -14 53 83 29
1931B9p6j9M0ll9k4O7Q6Qp5j9L7M0n1n9L3J12L8m9o8J9L4n3j15l0Q8R3l1m8J9
$$ 29 -47 -66 -26 -29 -68 -92 -25 61 69 -6 -25 12 52 1 -58 -25 87 125 76 8 27 61 8 -107 -137 -49 44 13 -35 -16
1961a6P1Jr6p8N5J18K3o4j2O1M1r3j23j6J05M7m0l9P3J17j7j27o0Q2Q2n1r8K5
$$ -16 55 56 -40 -118 -63 55 78 14 2 63 104 11 -112 -128 -23 24 -16 -55 18 135 118 -9 -69 13 95 44 -54 -29
1989b9J13L5j32j17J1R5k2j11rJ53J38l3r7pJ07K3j12j02P3J41J4j16q0O5M5q5
$$ -29 84 119 -13 -130 -119 -24 -46 -157 -166 -13 125 92 -5 -12 95 118 6 -96 -23 118 132 16 -64 1 46 -39
2015c9j54K7J60J18m8j00O0J25j6j57r9Q5J19l3j47k8J25O4j20j49L7J69P3q9
$$ -39 -193 -166 -6 112 64 -36 24 149 133 -24 -123 -38 81 48 -99 -127 -2 62 -58 -207 -170 -1 72 -17
2039a7m4J45J82n3j75q6J06O2j03j58M2J80L6j76j42P8J44k1j34MK06J62q4j76
$$ -17 -61 84 266 213 38 -48 58 120 17 -141 -99 81 117 -59 -201 -123 21 0 -134 -130 76 238 154 -22
2063b2mJ23J4j88j45J02K00j2j84m3J49J18r5j67M7K26J27j29j29J00J50o4k50
$$ -22 -26 97 111 -77 -222 -120 80 68 -116 -159 -10 108 13 -154 -107 119 246 117 -12 88 238 174 -76
2086g6j34J38J27q9j57L3J93P5j61j64J01K23L7j62l6J96J38j27k53m9J50P1j64
$$ -76 -210 -72 55 -34 -191 -158 35 110 -51 -215 -114 109 146 -16 -52 144 282 155 -98 -147 3 74 -90
2109i0j48J17K41Rk00q2J61J74r3j86J4K34J10j70k01N9J50o9k38r0J81J97l8
$$ -90 -238 -121 120 129 -71 -153 8 182 89 -97 -83 151 261 91 -110 -51 99 30 -208 -298 -117 80 42
2132D2j66L9J99P7j65j63J11K22L3j81r2J31J01j37k42k3J77R1r6j21J23J89j
$$ 42 -124 -85 114 191 26 -137 -26 196 229 48 -44 87 188 51 -191 -214 -37 54 -42 -163 -40 149 148
2155A48j81p8J26J22n5j69J0J73O8j54j76L1J39%j57j9J68J83l5j40j5J12N2j27
$$ 148 -33 -111 15 137 82 -87 -77 96 164 10 -166 -135 4 4 -153 -172 -4 179 144 4 -11 101 153 26
2179B6j18O0J60J9j46j00O8P9r6j49K6J42J14n2q0M5J18j0j32r2R2R5j3j04pJ08
$$ 26 -92 -32 128 147 1 -99 -31 48 -48 -197 -171 -29 85 33 -47 -2 116 106 -26 -118 -26 69 56 -48 -55 53
2205E3M1q2j19%J22M2p3nJ03J03m4j27n2M1L2n8p3M8R9K4q5q4K4N0j9o0L2Q9Q1
$$ 53 94 12 -107 -107 15 57 -16 -21 82 185 141 14 -38 3 35 -23 -96 -48 51 75 -10 -94 -70 -20 -39 -99 -67 22 103
2234A03j1o8j8K7J0p9m6N2Q1J7m9j3J8K5m3p1jP4N4j3l4J6K8k5p8l9J3M6Rj0K2
$$ 103 92 24 6 33 43 -36 -82 -30 51 68 19 6 24 49 6 -65 -66 8 62 49 15 31 59 34 -44 -83 -70 -24 -15 -25 -3
2265cM9Qm2n8oN3J3j7J5N1M1l7m5m2lNj2oL1M9K2l4m1k0qj0k1K0M2M0Nj9j4j4
$$ -3 46 54 12 -46 -52 1 14 -3 12 63 104 67 22 -20 -23 -18 -30 -36 -5 44 66 32 -9 -29 -37 -47 -68 -48 -6 34 39 20 6 -8
2299hj0k9rL6L2L4Ookrl1l4kJ9K9J1J3Nj5k1m2l2qL0J9L2MJ9j0l4l1pNJ5K1K1
$$ -8 -18 -47 -56 -20 12 46 52 46 44 35 4 -30 -32 -13 16 27 40 45 30 9 -33 -65 -73 -43 -24 8 12 31 21 -13 -44 -51 -46 -31 -10 11
2335A1K7J4Kk1k1k0pJJ4K2K8J4ok3l3l1k4kRM3K3J3oj3k6k8j4mJ5M0K9J3rKql1
$$ 11 38 52 54 33 12 -8 -15 -14 0 22 50 64 58 35 2 -29 -53 -55 -46 -3 20 33 27 14 -12 -40 -54 -58 -43 -3 26 39 30 32 24 -7
2371gk9QL2PK4J0K2qk9l4k6J0LOML0L2qm5m9NrL%K8N5K2j9l5k1lJj8nN8M1J0k8
$$ -7 -36 -28 4 11 35 45 67 59 30 -4 -30 -20 -17 -11 -7 23 55 47 2 -47 -42 -51 -48 -48 -20 35 57 38 3 -18 -21 -20 -38 -43 15 56 66 38
2409C8k7LOl7k7L1M2K4j9k1K7Mm9o6oN0L2jj7K5N0l0o7m1M0N2NqJ5N2L3o7p6n
$$ 38 11 14 20 -17 -44 -13 29 53 34 13 40 44 -5 -71 -77 -27 5 4 -13 12 62 32 -35 -76 -36 16 21 13 28 80 113 46 -30 -35
2443c5L3J9n2%O2N5k6p5l6M1K6m0k6L8Q7K5o1o6OL6k8p7j1R9O2Jp6J2O8J4q9n2
$$ -35 -2 17 -35 -35 27 82 56 -19 -55 -14 12 -28 -54 -16 71 96 35 -31 -25 11 -17 -94 -105 -6 56 57 -19 -7 61 75 -14 -66
2475f6N6R8On5l2M7K1q2j12oQ3N7l1n5O2Q5j6j10l8N4J00k3q2K2J03K0j00j05
$$ -66 -10 88 94 39 7 54 75 -7 -119 -125 -42 15 -16 -71 -9 76 60 -50 -88 -34 66 43 -39 -17 86 106 6 -99
2503i9J8Q6Qp9k7J16J18k7j10k2R4L6r5q6M9J18K1j28j03M3Q0o5j13j9J79J05
$$ -99 -81 5 13 -66 -93 23 141 114 4 -18 76 112 17 -69 -20 98 119 -9 -112 -69 11 -54 -167 -186 -7 98
2529I8l5j06L8J10K7j35r1R1J35k7j53l8J04P9j13j47K5J58O4q6n4J08J44k3j86
$$ 98 63 -43 -5 105 132 -3 -94 -3 132 105 -48 -86 18 97 -16 -163 -138 20 84 -2 -56 52 196 173 -13
2554a3p4R7Q6r2j35M3J45L2j63j23P3J31J1j09KJ83J35j00j56QJ25K8j52j17Q7
$$ -13 -87 10 96 4 -131 -88 57 89 -74 -197 -124 7 18 -91 -89 94 229 129 -27 -19 106 134 -18 -135 -48
2579d8J38k0j60p1J38J03q7j47M2J98Q1j03r4P4J20m8j87q9J16J08o2j34K5J50
$$ -48 90 70 -90 -161 -23 80 -7 -154 -112 86 167 64 -30 44 164 116 -71 -160 -44 64 2 -132 -107 43
2603D3N1j32j19R6J71K2j10l2J24R0r8j93k1J17M3j33r3Q0J42jj36m8J17J13n1
$$ 43 94 -38 -157 -61 110 132 22 -10 114 204 106 -87 -108 9 52 -81 -174 -94 48 47 -89 -137 -20 93 42
2628D2j14K0J66O7j17j09K9Q8l9j39n7J05J28k6j07J2J14M7j04r4O5J41K1j17
$$ 42 -72 -52 114 181 64 -45 -16 72 33 -106 -163 -58 70 44 -63 -51 63 110 6 -88 -23 118 139 22
2652B2o5N6N4o8j43j8J02P4n8n3M9J22Oq7n8P0R0k8p5j3R6M9q6j09KO9Np3k7Q3
$$ 22 -43 13 67 -1 -144 -162 -60 14 -44 -97 -48 74 80 -7 -65 5 95 67 -8 -21 75 124 38 -71 -69 0 5 -68 -95 -12
2682a2J04pq8l1O0K3n0o4K6Q1L3p8p0K1N1k1o7lO9P9nn5J3O1On7n4K5O2mn0l0
$$ -12 92 85 -3 -34 26 49 -1 -65 -39 42 75 -3 -73 -52 -1 -22 -89 -92 -23 56 51 -4 9 70 76 19 -35 -10 52 48 -2 -32
2714c2N1L9m5p1k4N7L8j9j3K1P1j3n8n6L0L6pl1LM8J7l4m3mL9J5k3j4L1N7j3l8
$$ -32 19 58 13 -58 -82 -25 13 -6 -19 2 73 60 2 -54 -24 12 5 -26 -23 25 42 8 -35 -39 0 15 -8 -22 9 66 53 15
2746A5k4J5Pk9l2J8L7L1l1k2J2J3k3l4%M4M3Pk8MJ5j8k3l9MM6K2k0%J6J6k9k9
$$ 15 -9 6 13 -16 -48 -30 7 38 7 -15 -3 10 -13 -47 -47 -3 40 47 19 23 38 20 -3 -42 -38 8 30 10 10 26 42 13 -16
2779a6j2J3K2pjNK0oj9l2J3NllPL1K0j0k6nj1J1j3J7J4L0Lj0j7nk1kmmM4Mqj4
$$ -16 -28 -15 7 0 -1 4 24 18 -1 -33 -20 -15 -18 -21 -14 17 37 27 1 -4 -15 -4 -17 0 14 44 47 37 20 15 -6 -8 -12 -16 28 32 24 10
2817A0qKk1qnJ2QJ4J2oojk4j0kJ3J9J7%J4mok1nMj4K9J3J5Jj3ql6NrNmK6J2j%
$$ 10 2 4 -17 -25 -30 -18 -10 4 16 10 4 3 -21 -31 -33 -20 -1 16 16 30 26 20 -1 -6 -2 -16 13 26 41 42 29 21 -15 -10 -19 -14 -18 8 20 19 19
2858A9k7nj2rMRJ0K5Kjqoj0%qK0OK0nQqLk2l3J6oJ8LJ0J3Pk4j5j2j1MJ4PK7pJ1
$$ 19 -8 -13 -25 -34 -30 -21 -11 14 16 15 7 1 -9 -9 -17 3 9 29 24 32 24 27 5 -28 -12 -18 0 3 13 26 33 9 -6 -18 -29 -25 -11 -4 23 16 27
2899B7j1k7lJ4mmJ2K0Pmj9lqNj7%QK5J4k2joKj8okK1J9J4j9Mjql3LML1QNj5Qn
$$ 27 16 -11 -14 0 -4 -8 4 24 31 27 8 5 -3 2 -15 -15 -7 18 32 10 9 3 5 -13 -19 -21 0 19 33 14 18 17 9 -24 -21 -17 14 22 27 12 20 15
2941A5j8k5J9J4J0qKJ4J9k0l0k7PK3j7jKL8Lk4k4QK2Jk0RL1L9k3l6lK5j1k4l1
$$ 15 -3 -28 -9 5 15 7 9 23 42 22 -8 -35 -28 -5 -22 -23 -21 17 20 -4 -28 -20 2 3 -17 -8 23 62 39 3 0 25 14 -10 -41
2976d1L0M6om4pK8J2nm2kO4Qj9l3J0K9j6n4k8L8M4jm7PM7K2l1n3K7M5K2l9j3N3
$$ -41 -11 35 29 -15 -22 6 18 13 -29 -31 33 41 22 -11 -1 28 12 -42 -70 -32 12 11 -36 -29 18 40 9 -44 -17 28 50 11 -2 51
3010E1K9m0p0k9N2K2l2m4L1O9J4o2l0K8M6on1mN2L9n3n0nN2Mo1l8N6O7ll7j9N4
$$ 51 80 40 -30 -59 -7 15 -17 -61 -30 39 53 -9 -39 -11 35 29 -22 -26 26 65 12 -38 -43 9 13 -48 -86 -30 37 34 -3 -22 32
3043C2L7n0m6MO7K3n1n0L5M7l5p7k4P2N8m0m3K9O7J5o3l8L6M6mp3jM5M1n2o7K
$$ 32 69 19 -27 -23 44 67 16 -34 1 48 13 -64 -88 -16 42 2 -41 -12 55 70 7 -31 5 51 47 -26 -27 18 59 7 -60 -58
3075e8N5K0m8k7M7Q2on8j9L9K9m6n5J4O2J1m8m3J1N5j0n5j0N8N9nn5MO3Po5l8
$$ -58 -3 17 -31 -58 -11 71 65 7 -12 27 56 10 -45 -31 31 42 -6 -49 -38 17 7 -48 -58 0 59 54 -1 3 66 73 8 -30
3107c0K7M8po6j2L4M3l6o1NO2K3k6l1L7O2oo8m0L0L4j9m0j4O1K2l9m3K2O1qk9
$$ -30 -3 45 38 -28 -40 -6 37 1 -60 -55 7 30 4 -27 10 72 66 -2 -42 -12 22 3 -37 -51 10 32 -7 -50 -28 33 25 -4
3139dj2M3O3l1m6j4L8Pl7m6MN0Pk9l6K8L8j3l7j5N1K9qk3nK5Nl8n2K7L9J4l6j4
$$ -4 -16 27 90 59 13 -1 37 44 7 -39 -35 15 22 -7 -43 -15 23 10 -27 -42 9 38 30 7 2 27 32 -6 -58 -31 8 22 -14 -28
3173b8M8K2j8m2MM0J6rl0J0K8Nl8m2J5L7l6k0rM5K3j5k4JL1Ml1j4L1L6lm4lK4
$$ -28 20 42 24 -18 -14 26 42 33 3 13 41 46 8 -34 -19 18 -18 -38 -47 -2 21 6 -18 -17 14 18 -13 -27 4 40 37 -7 -10 14
3207A4j1k0k6J5L7J2j7j9K7J7Kl1j2K4J4jk2kK7qj4m1PL1J2k4mL7J7j6k4j9K2
$$ 14 3 -17 -43 -28 9 21 4 -15 12 29 31 0 -12 12 26 25 3 1 28 20 6 -35 -28 3 15 -9 -13 24 41 25 1 -18 4
3240DJ5j7j8J6K3Ok7k0QNQj8jJ8L0pk2kJ3Jk4LQJ6Qj6oMJ0j6j0ORJ9j0k1J8Oj3
$$ 4 19 2 -16 0 23 29 2 -18 -10 -5 3 -15 -16 2 32 25 3 1 14 15 -9 -6 2 18 26 10 4 8 18 2 -8 -2 7 26 16 -5 13 19 6
3279Fk4P%J4OnPplj6j1J0J5%j2RKK2j8kooJ7knJ2K0nOj5Lnj4PkRMJj0knnj7MJ0
$$ 6 -18 -11 -11 3 9 4 11 4 1 -15 -26 -16 -1 -1 -13 -4 -2 20 2 0 -6 -12 5 3 -2 10 30 25 31 16 19 14 0 7 5 14 18 19 9 7 2 -3 -20 -16 -6
3324fJ8lKpj0Pj0q%J2KkJ6j0J1Lpj4MKJRPlRlrj1jRpOJ0Jqmj8Pq%J6LjL%%pj1
$$ -6 12 9 11 4 -6 1 -9 -17 -17 -5 -3 -5 11 1 12 15 8 -6 -2 0 1 10 17 14 23 20 11 0 -1 8 1 7 17 18 10 6 -12 -5 -13 -13 3 6 5 8 8 8 1 -10
3372a0QrmK3nNOMj5nJ1j7J0nJ3JLjnoqKMJ0Kj0J0m%kk3K0nNoJ6%%rlkqJ2j1pJ8
$$ -10 -2 -11 -15 8 3 8 14 18 3 -2 9 -8 2 -3 10 11 14 13 8 2 -6 -4 0 10 12 2 12 8 8 6 -17 3 -2 3 -3 13 13 13 4 1 -1 -9 3 -8 -15 3
3418CJ1pqj1J7nnjOMJMrKJ5j0j6QRJ3j4%J0Oj2j3jpK2oj0J2Lkk3rNROkkNKPj2
$$ 3 14 7 -1 -12 5 0 -5 -6 0 4 5 9 0 2 17 7 -9 -1 8 21 7 7 17 23 11 -2 -3 -10 12 6 -4 8 11 9 -14 -23 -18 -9 -3 -5 -7 -2 0 7 -5
3463ej1J1PNj8J1J0J0j3j2MQMk3%K8K6k0j0pK4jk8k5J7K6jk0j0J5Mj9j8%L4J6
$$ -5 -16 -5 2 7 -11 0 10 20 7 -5 -1 7 11 -12 -12 16 42 22 12 5 29 28 0 -25 -8 18 17 -3 -13 2 6 -13 -31 -31 3 19
3499A9j7oJ6K1ol1j9J8K7j5k4NL4Nj9j7LL0j1j5qL6K6k4l9j1L1J2l9j8K3J9Jl5
$$ 19 2 -4 12 33 27 -4 -23 -5 22 7 -17 -12 22 27 8 -9 -6 24 13 -2 -10 26 52 28 -11 -22 9 21 -18 -36 -13 6 7 -28
3533b8rJ9K7j7l1J6L5J6k3j8KL0om1j6L6J4ll0lM2J5k8k5J3M2J0j4l7K4L0k5m3
$$ -28 -37 -18 9 -8 -39 -23 12 28 5 -13 -11 19 13 -28 -44 -8 6 3 -27 -30 12 27 -1 -26 -13 29 39 25 -12 12 42 17 -26
3566b6rL3K1k9j2KL1K0k9l7K8M2j4k8qK7K7k4m5NK4Ol2k5L0K9J1k1pJ9K7k8k7
$$ -26 -35 -2 19 -10 -22 -20 11 31 2 -35 -7 35 21 -7 -15 12 39 15 -30 -25 -1 5 -27 -52 -22 7 18 -3 -10 9 36 8 -19
3599a9NM1J2k7k2nM1j3l2k8L6L6j0k5lL2K0k8l0kM3Rm0j1J3K8k2l5j9L6K5k1k2
$$ -19 -14 27 39 12 -10 -15 26 13 -19 -47 -11 25 15 -10 -13 19 39 11 -19 -21 22 31 -9 -20 -7 21 -1 -36 -55 -19 6 -15 -37
3632c7K2L9J9l8j9J5L2pl1j1K8K2k4l5lL7Pk4j9K7L9kk1k3K9J8k5m4lK5L2l4l4
$$ -37 -15 24 43 5 -14 1 33 26 -5 -16 12 34 10 -25 -28 9 16 -8 -27 0 39 37 16 -7 22 40 15 -29 -32 -7 25 -9 -43
3665d3J0M0pl8j1L9K7%k8NL2J9k6l0LK4%k5qJ3L5k1k7kK0J8nk9J4L7Kl0j9J1J5
$$ -43 -33 7 0 -38 -49 -10 17 17 -11 -6 26 45 19 -11 -8 16 16 -9 -17 -4 31 10 -17 -19 1 19 14 -15 -1 36 38 8 -11 0 15
3700A5ml7j6L1K5ok8LK9%k2k0K9L0Jl1j0J0J9rl9J4K4J0qk8K2J2Mk9kJ3K0oj4
$$ 15 11 -26 -42 -11 14 8 -20 -17 12 12 -10 -30 -1 29 30 -1 -11 -1 18 9 -30 -16 8 18 10 -18 4 16 20 -9 -11 2 22 16 2
3735BKJ3Jj5k3J0PPj3pJ2J7mj8mQPj6NmK2Jk2MLQj6qLK0J1mj8J1J3jj7nJ8Plm
$$ 2 4 17 18 3 -20 -10 -3 4 -9 -16 -4 13 9 -9 -13 -5 2 -14 -9 -13 9 10 -12 -8 -5 3 -13 -21 -18 2 13 9 -9 2 15 14 -3 -8 10 17 14 10
3777A0Lj0J0j7%nK0JJrNrQj6l%Q%j3NJ6qnrJ1OoqRJ2Rj0K%k%jmJ0PJoj3NqmnR
$$ 10 13 3 13 -4 -4 -9 11 12 13 4 9 0 8 -8 -11 -11 -3 -3 -16 -11 5 -3 -8 -17 -6 0 -6 -14 -5 7 16 6 8 8 6 6 5 1 11 18 19 13 0 5 -3 -7 -12 -3
3825cjO%mmNnkqlJ2RloJ1jmrkPPkJ9moOj1nKpJ0J0pJ7j6Mj1j0nJ2oJ4rQkNj6m
$$ -3 -4 2 2 -2 -6 -1 -6 -8 -16 -19 -7 2 -1 -7 4 3 -1 -10 -12 -5 2 0 19 15 9 15 4 -1 1 -6 4 14 7 24 8 12 1 -9 -14 -2 -8 6 -3 5 3 8 -8 -12
3873a2MjjjRmQmj2J1mj2KJ4nK1j7J3oJj1JpPJ4qOqOJpqMQmR%JMk0olJ2Nj2LQL
$$ -12 -8 -9 -10 -11 -2 -6 2 -2 -14 -3 -7 -19 -17 -3 -8 13 -4 9 3 4 -7 -6 -13 -6 8 0 6 -2 4 5 -2 -10 -6 2 -2 7 7 8 12 -8 -14 -17 -5 0 -12 -9 -1 2
3921Bqj0J0jj0PnMJ9jqmPKj0%RNMmnOlj3lOMNMj0JK5j7k6kJ4K1j5j1lJ2Lnj8p
$$ 2 -6 -16 -6 -7 -17 -10 -15 -11 8 7 -1 -5 2 4 -6 -6 3 8 12 8 3 9 6 -7 -10 -4 0 5 9 -1 0 25 8 -18 -20 -6 15 0 -11 -14 -2 1 -4 -22 -29
3966b9J6PnqJ6L3j3j9j5K4Kj5kK3J1Jj8rKOpj8MK7J1j8k0J4K2mk9j1J6K1pk6l
$$ -29 -13 -6 -11 -19 -3 30 17 -2 -17 7 9 -6 -8 15 26 27 9 0 2 8 1 -17 -13 14 25 7 -13 1 23 19 -10 -21 -5 16 9 -17 -20
4003b0K2J5l0k6LM7jj7PJ3J7nl6jK1J4k8pJ0J5Pk8l1J9L4Jk8OL5J4k8k0JL0rl6
$$ -20 2 17 -13 -39 -36 11 10 -7 0 13 30 25 -11 -12 9 23 -5 -12 -2 13 20 -8 -39 -20 14 15 -13 -7 28 42 14 -6 -5 25 16 -20
4039b0j5K3L3on0J4J2J9j9l2J9M3J0k2j6J9J7j0m5k1M7J8j6j7lK9Rl0j9K8M5j8
$$ -20 -35 -12 21 15 -35 -21 -9 10 -9 -41 -22 21 31 9 -7 12 29 19 -26 -47 0 18 2 -15 -18 11 20 -10 -29 -1 44 26
4071B6j4j8K2K1j5n1OK4J5l2j8QM7nm1nK5L2k2l4J1N4Pl4k8RJ0%k9j7K7M9j4m8
$$ 26 12 -6 16 37 22 -29 -23 1 16 -16 -34 -26 21 16 -25 -30 -5 27 5 -29 -18 36 43 9 -19 -10 0 0 -29 -46 -19 30 16 -32
4105c2J1L2K2k2m2L0M1Jk6k8J8K8pn9j6L1L3k3l2J4N0J2l7l2K0L9ll7j0L0L6m5
$$ -32 -21 11 33 11 -31 -1 40 41 15 -13 5 33 26 -33 -49 -18 15 -8 -40 -26 24 36 -1 -33 -13 26 23 -14 -24 6 42 -3
4137cl9OK2J9l1j0K4N3nl5j5L7K4j6m3J4K8K3m2m5J7K9nl6j6L1M5k2k4KL3J5l2
$$ -3 -42 -36 -14 5 -26 -36 -12 41 36 1 -14 23 47 31 -12 2 30 53 11 -34 -17 12 7 -29 -45 -14 31 9 -15 -13 20 35 3
4170Cm1K2M5j2k9k3L2L3l2m0KL1K8pk7K0L8nl2k2K6K4pm2pM0J8m8j8NM3%k4k4
$$ 3 -38 -16 29 17 -12 -35 -3 30 -2 -42 -40 -9 19 12 -15 5 43 38 6 -16 10 34 27 -15 -22 18 36 -12 -30 -25 18 18 -6 -30
4204c0L1K5Ml4j1L3Ok8l7J2L4J7m2qK2J6j6k5pM6K3ql7J3K9rk6k5K6K5ok9J1J3
$$ -30 1 26 30 -4 -15 18 24 -4 -41 -29 5 22 -20 -28 -6 10 -6 -31 -38 8 31 23 -14 -1 28 19 -7 -32 -6 19 13 -16 -5 8
4238HOmk4KK7Mj4j5K1J4kl2j1J4J3j7k3K0J8Qk1rLJ6j0llJ5J8j2k3RJ2Pk7QJ2
$$ 8 14 10 -14 -12 15 19 5 -10 11 25 23 -9 -20 -6 7 -10 -33 -13 5 13 -8 -17 -14 2 -8 -11 -14 1 19 7 -16 -7 5 12 -15 -7 5
4275EJ1J0j5mNRj4omPJPj1pJ5Mk6j4OK4rkOPmpj9OJJ4QoKRloloRL%LJ1Ompj3J0
$$ 5 16 26 11 7 12 21 7 1 -3 4 5 12 1 -6 9 13 -13 -27 -21 3 -6 -8 -2 5 1 -6 -25 -19 -18 -4 4 -2 0 9 6 0 -3 -9 0 3 3 6 17 23 19 12 -1 9
4323IlqkRJ5jj2mk1NjllK6oJjkokklJ6NrPlMjlj7J3%MJ3pLKnrKlJpK1pP%j1pJ
$$ 9 6 -2 -4 5 20 19 7 3 -18 -13 -14 -17 -20 6 0 1 0 -2 -8 -10 -12 -15 1 6 -3 4 1 5 4 1 -16 -3 -3 1 14 7 10 12 7 -2 0 -3 -2 -9 12 5 12 12 1 -6 -5
4374erQmJ2JLNk3mLJ6j2PkNNj1oJJ4rKOmPK%QoQk0MQKrNOrmj0J3j1PJkNJKj2k0
$$ -5 -14 -6 -10 2 3 6 11 -12 -16 -13 3 -9 -2 -4 1 6 -5 -11 -10 4 -5 -3 3 -1 6 8 8 16 10 18 -2 2 10 12 3 8 14 5 1 -9 4 -7 0 1 -1 4 5 7 -5 -25
4424b5J3J0Mj8jJ8Lmj4jJ5%qqJ7J1krKJ1pLj7J2KJ4j5jKn%j0lK0krj3J2%J6k8
$$ -25 -12 -2 2 -16 -17 1 4 0 -14 -15 0 0 -8 -16 1 12 10 1 3 14 7 10 -7 5 7 21 6 5 7 2 2 -8 -11 9 7 -2 -15 -3 -3 13 -15
4465a5j5J4K0krNKPj4j8PJ0J7k0j2L4lJ8l3lK0J3j4j3PK1Rk8l0K3J0j3j2j0L6
$$ -15 -30 -16 4 2 -7 -2 0 7 -7 -25 -18 -8 9 -11 -23 11 8 26 -7 -10 10 23 9 -4 3 24 33 5 -25 -2 8 -5 -17 -27 9
4500IPj7qjK8j1j6k1J9L3j8j8j4K7J4k4j6JJ9K0j6j9J9L2Mk3k5J7J1Ql6MJ9K5
$$ 9 16 -1 -9 -10 18 7 -9 -30 -11 22 4 -14 -28 -1 13 -11 -27 -26 -7 13 -3 -22 -3 29 33 10 -15 2 13 21 -15 -11 8 33
4534C3l1l1OK7Mj1j0K2L2j7k5k8L1K4l0j1jK9jk8j5MK8mk4nK7M3k3k1RK9jk4l9
$$ 33 2 -29 -23 4 8 -3 -13 9 41 24 -1 -29 2 26 -4 -15 -16 13 12 -16 -31 -27 1 -3 -27 -32 -5 38 15 -6 3 32 31 7 -32
4569c2K6K4nl1nK9K0k1l4jM2K2j9m1L7K8%n0j5K2J7k1l2oN0J0k6l2J0L8J2k9j9
$$ -32 -6 18 13 -18 -23 6 26 5 -29 -30 12 34 15 -26 11 39 39 -11 -26 -4 13 -8 -40 -46 4 14 -12 -44 -34 4 16 -13 -32
4602c2L1M1mm5j5L6K8l2l5J1L1J9l6j8K5K0rl7JN7J2k1m2J3L7j3m8k7L5K5%m3
$$ -32 -1 40 36 -9 -24 12 40 8 -27 -16 15 34 -2 -20 5 25 16 -21 -20 37 49 28 -14 -1 36 23 -25 -52 -17 8 8 -35
4634c5oM7K0k6l5J5N1mk1k9L3K4pm4k1M3J6l3j6J3M4J0k9l2K5M1k0l3JK8K3k7
$$ -35 -41 6 26 0 -35 -20 31 27 6 -23 10 34 27 -17 -38 5 21 -12 -28 -15 29 39 10 -22 3 44 24 -9 -8 20 43 16
4666A6l7rL2J0l7k8K3L8Ml6pL0L0j8l3mM4Ok1m1L3L2k4k7j1K7L2j4k6PL7Ok5l3
$$ 16 -21 -30 2 12 -25 -53 -30 8 12 -24 -31 -1 29 11 -22 -26 18 24 3 -38 -5 27 3 -24 -35 -8 24 10 -16 -9 28 34 9 -24
4700b4J9L0nk3k1K2L6k6l7jK7J8k9qJ5L0%k6j2K4Qj3l2J2J8Rj2k7LK3krj1K2J7
$$ -24 -5 25 20 -3 -24 -2 34 8 -29 -30 -3 15 -14 -22 -7 23 23 -3 -15 9 17 4 -28 -16 2 11 -1 -28 -25 -2 -4 -13 -24 -2 15
4735A5J4l1%K8J0k3k8J1J7Rj7oJ0Rkk2kJ3Opj9J7J5%l5mJ6kJj3mJ0J4j2KpJ2J4
$$ 15 29 -2 -2 26 36 13 -15 -4 13 22 5 -1 9 18 16 -6 -8 5 11 4 -15 2 17 17 -18 -22 -6 -8 -7 -20 -24 -14 0 -12 -10 -17 -5 9
4773IpmJ0J2%j4r%J6nj2KJ9Kooj4J4jj4mJ3Rppj2J7lmpj2K0LmpkJ5llj2J2jO%
$$ 9 2 -2 8 20 20 6 -3 -3 13 8 -4 -2 17 19 13 7 -7 7 6 -8 -12 1 10 3 -4 -16 1 -2 -6 -13 -25 -5 -2 -6 -13 -15 0 -3 -6 -18 -6 -7 -1 -1
4817aJJ2pjj7JK3noKJ2oJ0j5mkpJ0rJ5nJ3j6Jmj0NlkJ5KKqJNj2KrRJ1kj0KJ7m
$$ -1 0 12 5 4 -13 -12 11 6 0 2 14 8 18 3 -1 -3 -10 0 -9 6 1 14 -2 -1 -5 -15 -10 -13 -15 0 2 4 -4 -3 2 -10 -8 -17 -8 3 1 -9 -7 10 6
4862Fj0mkOjPOLJ0mj1j3mJ6KlOJ0j2oj7J4j4J2j0MJ4lr%okLMJlRJ7k7J2KKj1M
$$ 6 -4 -8 -10 -4 -5 2 8 11 21 17 6 -7 -11 5 7 4 10 20 8 2 -15 -1 -15 -3 -13 -9 5 2 -7 -7 -13 -15 -12 -8 -7 -10 -1 16 -11 1 3 5 -6 -2
4906bNKJ6j0nNPj9Jj2K2pRj7RLk0J0k0J4J3onkQRj2j5OQ%j5PJ7jOj1j0J3MQj0
$$ -2 3 5 21 11 6 11 18 -1 0 -12 10 3 12 -5 4 7 -13 -3 -23 -9 4 -2 -7 -9 -1 8 -4 -19 -13 -5 -5 -20 -13 4 3 9 -2 -12 1 5 13 3
4948CpJ3J0j4QnJmj5J3NJ7k8jmQKk1JpK3kllkJ1j2qLJ5%%oK1kj4j3%K1Jjk0K2
$$ 3 -4 9 19 5 13 8 9 5 -10 3 8 25 -3 -4 -8 0 2 -19 -18 -25 -2 -4 -7 -10 -12 -1 -13 -21 -18 -3 -3 -3 -9 12 10 -4 -17 -17 4 5 4 -16 6
4991FQkqqlK0Pk4nJ4J5rj5j3K2ok2nJ6K1Nl2nJ1J8j3lpK9Jj6qLJ5lj8j1J5K2J
$$ 6 14 12 4 -4 -7 13 20 -4 -9 5 20 11 -4 -17 5 -1 -23 -28 -12 9 14 -18 -23 -12 6 -7 -10 -17 12 13 -3 -11 -8 7 4 -14 -25 -10 12 13
5031A3j1j0K2J5pl3J5K0nj9JK0J4k3k2j1K1J1j6kJL1ll0j2J4J7pk5QJ9Ok0k3P
$$ 13 2 -8 14 29 22 -11 4 24 19 0 1 21 35 12 -10 -21 0 11 -5 -7 -6 25 22 -8 -20 -6 11 4 -21 -13 6 12 -8 -31 -24
5066b4K7Kj7j4K0K5Jk1qL3J3l2j2JK7Lk9rJ2K0ok4j6K3L5j6l4J9J7K2m6k7K9J7
$$ -24 3 5 -12 -26 -6 19 20 -1 -9 24 37 5 -7 -6 21 24 -5 -14 -2 18 12 -12 -28 -5 30 14 -20 -1 16 38 -8 -35 -6 11
5100A1nl5MJ3K3k0k1J8J4J5j3k1K6K4%k1j5J1J6j5k9lL8J4k2k0OK6kk3k7M1K2
$$ 11 6 -29 -25 -12 11 -9 -30 -12 2 17 4 -17 9 33 33 12 -3 8 24 9 -20 -23 15 29 7 -13 -7 19 17 -6 -33 8 30
5133C0j4k8lK4J5l8j4J1K9Rm7j0L7J6j0k7RK2J5k6kRK1nj4k1K6Kqj1j1K5J1lk7
$$ 30 16 -12 -15 9 24 -14 -28 -17 12 21 -26 -36 1 17 7 -20 -11 11 26 0 -2 7 28 23 9 -12 14 16 8 -3 -14 11 22 19 -8
5168hJ9J8qj4j9K3J5k3k0JK1%j2j9J1J7Oj8kJ7J7k9j1J4J6Mk2KkK3qj2j5J3K4
$$ -8 11 29 21 7 -12 11 26 3 -17 -16 5 5 -7 -26 -15 2 8 -10 -12 5 22 -7 -18 -4 12 16 -6 -4 -6 17 9 -3 -18 -5 19
5203A9Lk1nK4Ppl6K4J7Ok4LNJoj5j9J7J2j2rMK9jk2j1J4PPk0LJ3Pj2LkjOnpMK1
$$ 19 22 1 -4 20 27 20 -16 8 25 31 7 10 15 16 10 -5 -24 -7 5 -7 -16 -12 17 16 -6 -17 -3 4 11 -9 -6 7 14 2 5 3 2 8 3 -4 0 21
5245B1Jj1NkQj0j2PNMok0J0J6j2rlQjKrjKOQj7J2kNj1kMJ4Nj0j1MJ5Mj6LJ2jK
$$ 21 22 11 16 14 22 12 0 7 12 16 10 -10 0 16 4 -5 -8 0 -1 1 -8 -9 -7 -1 7 -10 2 0 5 -6 -8 -4 10 15 5 -6 -2 13 17 1 4 16 15 17
5289A7rKLj2kmKJ7pLj6MLNj3J5onoMJ0qJj5PKJ1Oj8PkNJj4J5pJ0J3rJ1Pk1LnM
$$ 17 8 10 13 1 -1 -5 -3 14 7 10 -6 -2 1 6 -7 8 2 -3 -9 -5 5 -3 -2 -17 -10 -8 3 9 -9 -2 -4 1 2 -12 3 -4 6 19 10 21 28 7 10 5 9
5334I%l%KJPj1%j1J7ppRmKLj8J0kjqJ1lKlKRoJ6j9J0MljlnJ4Qk6mJ7MPj0oJJ6
$$ 9 9 6 6 8 9 16 5 5 -6 11 4 -3 6 2 4 7 -11 -1 -3 -4 -12 -1 -4 -2 -5 -3 6 0 16 -3 7 11 8 7 4 -1 13 21 -5 -9 8 12 19 9 3 4 20
5381B0j1kj3ML%j6J8mmqJ1j1J2jMkrNkOpMJpPJ2PomJ1qmO%mMoQj7J5nOj4lNJ2
$$ 20 9 7 -6 -2 1 1 -15 3 -1 -5 -13 -2 -13 -1 -2 2 0 -9 -4 -6 0 -7 -3 -2 -9 -2 10 17 11 7 18 10 6 12 12 8 12 6 14 -3 12 7 13 -1 -4 1 13
5428A3j0rQkolJj2J6klMNJLqKPKpLKLQj6JRjmKqJ4J2j6j0JPo%KMPmj0rmJ7qqN
$$ 13 3 -6 2 0 -6 -9 -8 -20 -4 -6 -9 -5 0 1 4 -4 -2 5 7 0 3 5 8 16 0 1 10 9 5 7 -1 13 25 9 -1 0 7 1 1 3 7 14 10 0 -9 -13 4 -4 -12 -7
5478gJ2k0QjmKJkMMRj0oJ0KRmmQlLoMNj5MJOJ1Jj3rRj1J0j3mkJ6j5oQKJ%OnOo
$$ -7 5 -15 -7 -8 -12 -10 -9 -11 -7 -3 6 -4 -10 0 2 11 7 3 11 8 11 5 9 14 -1 3 4 10 21 22 9 0 9 -2 8 -5 -9 -11 5 -10 -16 -8 -6 -5 -5 1 -4 2 -4
5527drMJ9j1J8j6KP%j2j2K7mkjlJ4lrlNjRj5JrJ1Nj6LQppj9K1J1oj0oK7rJj1R
$$ -4 -13 -9 10 -1 17 1 3 10 10 -2 -14 13 9 7 6 3 17 14 5 2 7 6 15 0 1 -8 3 8 -8 -5 3 -4 -11 -30 -9 2 -4 -14 -20 7 -2 -1 -12 -3
5571cOPqkJQj4J0jPJ0jj6NNJ1k4j8K0J1nj7pJ2J2j2j5KK3mormJ6JrJOlNj4QOl
$$ -3 3 10 2 0 1 9 -5 5 4 11 21 20 4 9 14 25 1 -17 3 14 9 -8 -15 -3 9 -3 -18 -16 7 3 -3 -12 -16 0 1 -8 -7 -1 -4 1 -13 -5 1 -2
5615bLk0J7K2j2rMJ5Kmj2lJ2roLJ0KJj6%MQj3oNJ8j3j7lK5nj0nlJ7qLnlQOj2N
$$ -2 1 -19 -2 20 8 -1 3 18 20 16 4 1 13 4 -2 1 11 13 14 -2 -2 2 10 -3 -9 -4 14 1 -16 -19 6 1 -9 -14 -17 0 -8 -5 -10 -13 -5 1 -11 -6
5659fJ6KJl%lMrlLMPj5nRK0j1j6MJQnnm%KLj4jJ7jj9nJ6QMqjJOmj1J2QOromJ4
$$ -6 10 12 13 10 10 7 11 2 -1 2 6 13 -2 -7 2 22 11 -5 -1 0 8 3 -2 -6 -6 -4 -1 -15 -16 1 0 -19 -24 -8 0 4 -4 -5 -4 2 -2 -13 -1 7 13 4 -2 -6 8
5708HJpoQJ0j5P%J0prjjJ4Kk4J2rJ3j7NJJJolJ3OlnnkMProK2jmqOJ1l%O%Kojj1
$$ 8 9 2 -4 4 14 -1 6 6 16 9 0 -1 -2 12 14 -10 2 -7 6 -11 -6 -5 -4 -3 -9 -12 1 7 4 -1 -6 -8 -4 3 -6 -12 10 9 5 -3 3 14 11 11 17 17 19 13 12 1
5758AJ1J1j8njPjmj3OPj3LoMNLojOLj3OPQj3MmJ0MolJ0rJ3nRj0MKj0JMlMrNMj0
$$ 1 12 23 5 0 -1 6 5 1 -12 -6 1 -12 -9 -15 -11 -6 -3 -9 -10 -4 -1 -14 -8 -1 7 -6 -2 -6 4 8 2 -1 9 0 13 8 17 7 11 13 3 4 8 5 9 0 5 9 -1
5807aMnoJ8j3oJQoJj4PLkJQQMrj6rJ1L2MO7j29O4Rm1k3N9j0j6k0N8n2L0k4J4o
$$ -1 3 -2 -8 10 -3 -9 -8 0 -6 -5 -19 -12 -9 -11 -10 -2 6 10 1 -15 -24 -13 19 23 90 -39 25 34 -7 -30 29 19 3 -17 41 -11 19 -5 9 3
5847CmPqPjkrMJ5k0lNklrJ8j3OJR%J1rQrMLj6J6Rj6J2rNKonLQrlPkj1MkO%Kok
$$ 3 -1 6 -2 5 4 2 -7 -3 12 -8 -11 -6 -8 -11 -20 -2 -15 -9 -8 1 1 12 3 11 2 6 9 -7 9 18 2 14 5 10 12 6 1 4 12 3 0 7 5 -6 -2 -4 2 2 4 -2 -4
5898dkjOrNljJ4rJ2qOqmRoJ3ljoJ0Oj3J2lnqOMnLj0KLkKLpMj5J0KkMj0%%J0mJ1
$$ -4 -6 -7 -1 -10 -5 -8 -9 5 -4 8 0 6 -2 -6 3 -3 10 7 6 0 10 16 3 15 12 7 -1 5 9 4 7 -3 -1 2 0 2 5 -2 2 -13 -3 -1 -3 1 -9 -9 -9 1 -3 8
5948Hj6QKpJ4o%L%L%rK4j4J%kKnPlLpm%MpLp%J5j9PKlknNoJ1Rj2NrJ7mqMLL%k
$$ 8 -8 0 2 -5 9 3 3 6 6 9 9 0 24 10 11 11 9 11 6 13 10 13 6 2 2 6 -1 2 -5 -5 10 -9 -2 0 -3 -5 -10 -5 -11 0 9 -3 2 -7 10 6 -2 2 5 8 8 6
6000FLLqJ0j3RMljpJ2KrrMjNo%LqPmj3J0pRmP%%npOOjnNJ0OonjPPlj1J2Mpj3J5
$$ 6 9 12 4 14 1 10 14 11 10 3 15 17 8 -1 3 2 7 1 1 4 -4 3 -1 -14 -4 -11 -2 -6 1 1 1 -4 -11 -5 1 0 -5 0 10 16 10 5 4 11 18 15 4 16 20 13 0 15
6052A5Qj1mmOrJ3j1qNN%j2j5J7Qj9OORJ8j3j7LJ4lpmJ1opRnJ9Mj3oQJ6kl1RRo
$$ 15 23 12 8 4 10 1 14 3 -5 0 5 5 -7 -22 -5 3 -16 -10 -4 5 23 10 -7 -4 10 7 0 -4 7 1 -6 3 -2 17 21 8 2 10 26 24 -7 2 11 5
6096EQk6J7Oklj1KPRk0jOJ3j9LJRoj0nJ2JKLkJJ5j0oJ4jPooPPj1LlMOj4j3lRK
$$ 5 13 -13 4 10 8 5 -6 -4 3 12 -8 -9 -3 10 -9 -6 -5 4 -2 -12 -17 -5 -4 -2 1 -1 0 15 5 -1 13 12 19 13 7 14 21 10 13 10 14 20 6 -7 -10 -1 1
6143AjrJJ9rLj6JJ8j7rJQPlj0OJ9j0MlONj2%RPJ4j3k1J0J4Kj6j0J0MJj9KJ8Kp
$$ 1 0 -9 -8 11 2 5 -11 -10 8 -9 -18 -17 -9 -2 -5 -15 -9 10 0 4 1 7 12 0 0 9 16 30 17 -4 6 20 22 6 -4 6 10 11 -8 -6 12 14 7
6186GlkJMj5MQj1KJkmJ2j1M%QJ0j3j0J7KMqnLJ4ollLon%MJ1JqKNJoj6NJ6j1jk0
$$ 7 4 2 3 7 -8 -4 4 -7 -5 -4 -6 -10 2 -9 -5 -5 3 13 0 -10 7 9 13 5 0 3 17 11 8 5 8 2 -3 -3 1 12 13 5 7 12 13 7 -9 -4 12 1 0 -20
6234b0RNLMj2J0mNkj0J7MpLk%Jj5J1J2mQj5QNJ1j0j4RP%j3kLjkj4JJ3MpkQoNj
$$ -20 -11 -6 -3 1 -11 -1 -5 0 -2 -12 5 9 2 5 3 3 4 -11 0 12 8 16 1 9 14 25 15 1 10 17 17 4 2 5 4 2 -12 -11 2 6 -1 -3 5 -1 4 3
6280Ck2J3QRk1%NKLlLPPq%OqRj9J0PQl%j7K3lpqkLKKj1On%jj3J5J0j5qKJ3KmL
$$ 3 -19 -6 2 11 -10 -10 -5 -3 0 -3 0 7 14 6 6 12 4 13 -6 4 11 19 16 16 -1 22 19 12 4 2 5 7 9 -2 4 -1 -1 -2 -15 0 10 -5 -13 -11 2 4 0 3
6328CkNj5PK%JJ0jMLlj3J1olJ1qKolMoJ2Rk1jMnNKkKj2kJJPKJrJ1Qj1P%j7J6q
$$ 3 1 6 -9 -2 0 0 1 11 10 14 17 14 1 12 6 3 14 6 8 2 -1 3 -3 9 18 -3 -4 0 -5 0 2 0 2 -10 -12 -11 -10 -3 -1 0 -9 2 10 -1 6 6 -11 5 -3
6377cOKKj2PRllQk%nkP%j2l%J1j1J4j4lJNolJ2j1qJ4lnNmPjQj1J1Mo%MjnLONJ
$$ -3 3 5 7 -5 2 11 8 5 13 11 11 6 4 11 11 -1 -4 -4 7 -4 10 -4 -7 -6 -1 -7 -10 2 -9 -17 -3 -6 -11 -6 -10 -3 -4 4 -7 4 8 2 2 6 5 0 3 9 14 15
6427A5Rj5Pj3J5qJLmoLJj1J1lj1Jl%K0j3mjJMLmJQJ%JoP%oOPjkLl%Jj0oRmjj2
$$ 15 24 9 16 3 18 10 11 14 10 4 7 8 -3 8 5 -6 -5 -8 -8 12 -1 -5 -6 -5 -1 2 -2 -1 7 8 8 9 3 10 10 4 10 17 16 14 17 14 14 15 5 -1 8 4 3 -9
6477iJ0J6j3Qj5PkPoj4J4orPoJ1loRj1K1j1MoMJ2Lnj7J6RnqKQopNlRj6NlJ1qK
$$ -9 1 17 4 12 -3 4 2 9 3 -11 3 -3 -12 -5 -11 0 -3 -9 0 -11 10 -1 3 -3 1 13 16 11 -6 10 19 14 6 8 16 10 3 8 5 14 -2 3 0 11 3 5
6523Ej5KJ5mj1kKJ6lpKQj1%j%K1mj3jJ4moLM%Mkj5OJQqJJ2nRqpJlMmnJ2qpkNO
$$ 5 -10 -8 7 3 -8 -10 -8 8 5 -2 0 8 -3 -3 -4 -4 17 13 0 -1 13 9 3 6 10 10 14 12 -3 3 4 12 4 5 17 12 21 13 6 7 4 8 4 -1 11 3 -4 -6 -1 5
6573Ej1Pj0KJ7rpNJ6j8OoRJ0j7J2j1kJ5Jj0pK4KLk5J6Nj1j1%KJ5j5krJ2JqmKM
$$ 5 -6 1 -9 -7 10 1 -6 -1 15 -3 3 -3 6 16 -1 11 0 -2 13 14 4 -3 21 23 26 1 17 22 11 0 0 2 17 2 0 -9 3 4 -4 -8 -6 -2
6615bJ1j0pPNMoj0PQ%qLOkllJ9J%j4mJ1J8k4jJ2M%j0j0Qj%j0qJ7lmooJ9kr%KP
$$ -2 9 -1 -8 -1 4 8 2 -8 -1 7 7 -1 2 8 6 3 0 19 20 20 6 2 13 31 7 6 18 22 22 12 2 10 9 9 -1 -9 8 5 1 -5 -11 8 6 -3 -3 -1 6
6662F%qlJ0MrMjJ3Qj8oNJ5jqmmJ1Kj8RRJj1j6K1JJ2j7j1jJ5j2oQrJ1ppJ7Jj1j
$$ 6 6 -2 -5 5 9 0 4 3 16 24 6 0 5 20 19 11 7 3 14 16 -2 7 16 17 6 -10 11 12 24 7 -4 -5 10 -2 -8 0 -9 2 -5 -12 5 6 -5 -6
6706fj1J4PNroJ7NJj9J5kkmPmJ5j6lmJ7Jpj3PJ9rnoJ0j1mjnLJ2rj1J1kQj0OlJ1
$$ -6 -17 -3 4 9 0 -6 11 16 17 -2 13 11 9 5 12 8 23 7 4 0 17 18 11 -2 5 24 15 10 4 14 3 -1 -2 -7 -4 8 -1 -12 -1 -3 5 -5 1 -2 9
6751IloMJ5kj5J4Qj3Jj2J3nMknJO%KpnROk0Kj1J1QnnjLprJ0Pr%OlJ6lnjJOmMk
$$ 9 6 0 4 19 17 2 16 24 11 12 0 13 8 12 10 5 6 12 12 14 7 2 11 17 -3 -1 -12 -1 7 2 -3 -4 -1 -8 -17 -7 0 -9 -9 -3 -6 10 7 2 1 2 8 4 8 6
6801FLLLqKRkqQpKoKnJ4oj0PpPlqokOOmnMkQJkj0OLJkKJ0lMnMmK1k2MJ6j4MrJ3
$$ 6 9 12 15 7 9 18 16 8 16 9 11 5 7 2 16 10 0 7 0 7 4 -4 -10 -12 -6 0 -4 -9 -5 -7 1 2 0 -10 -4 -1 0 -2 0 10 7 11 6 10 6 27 5 9 25 11 15 6 19
6854A9Jj6J4j8KjMjQlKj2%mmJklJ3MrlLNjMj2K0jo%JlJ0JjNKKj7R%KpOrLnmjj
$$ 19 20 4 18 0 2 1 5 4 12 9 11 -1 -1 -5 -9 -8 -10 -13 0 4 -5 -8 -5 0 -1 3 -9 11 10 4 4 5 2 12 13 12 17 19 21 4 13 13 15 8 14 5 8 3 -1 -2 -3
6905cJ1j5%JmRMmjj0J6lLrM%%%MnQJ0j3J1kJ1k0MMLnLLj%qoMkjNmOKj2oOpPqK
$$ -3 8 -7 -7 -6 -10 -1 3 -1 -2 -12 4 1 4 -5 -1 -1 -1 -1 3 -2 6 16 3 14 12 23 3 7 11 14 9 12 15 14 14 6 0 4 2 1 6 2 8 10 -2 -8 -2 -9 -2 -10 -8
6956hQMjrRQmqJ3MmlMnKKLnL%o%mQoNrN%Mq%Mj1%kNlOj0%OMm%Q%KLlKj2PQpJ4
$$ -8 0 4 3 -6 3 11 7 -1 12 16 12 9 13 8 10 12 15 10 13 13 7 7 3 11 5 10 1 6 6 10 2 2 6 -5 -5 -7 -2 -5 1 -9 -9 -3 1 -3 -3 5 5 7 10 7 9 -3 4 12 5 19
7012A9qNj3J5LjKqj4J8j2lJ%J1lrnJ0NpqqJ0LKqKNqMj1J3JlOlKPrnQJ9rj0LKL
$$ 19 11 16 3 18 21 20 22 14 0 18 6 3 4 4 15 12 3 -2 8 13 6 -2 -10 0 3 5 -3 -1 4 -4 0 -11 2 3 0 6 3 5 12 3 -2 6 25 16 6 9 11 14
7060A4kklRkjj0NqLjkRn%j2JlJ8j8PjKOnj1%J3Mj0J1jLQrJ1%Mj8JKNjJQj3J4j4
$$ 14 12 10 7 16 14 13 3 8 0 3 2 0 9 4 4 -8 -7 -10 8 -10 -3 -4 -2 4 -1 -12 -12 1 5 -5 6 5 8 16 7 18 18 22 4 5 7 12 11 12 20 7 21 7
7108Gn%mJ3j1oJ1NKj4%kJ2j6LnMKjoKK4oj6NNJ8pj8MJ6%j1MPNrj4J7pLmj0QkJ0
$$ 7 2 2 -2 11 0 -6 5 10 12 -2 -2 -4 8 -8 -5 -10 -6 -4 -5 -11 -9 15 9 -7 -2 3 21 14 -4 0 16 16 5 9 16 21 12 -2 15 8 11 7 -3 5 3 13
7154A3j2mjJmnjOPolj0J4J4pj3PJPj1jOJ4%k8K0kJ1%j6KJ4J2k1L%J3mj1lPlJq
$$ 13 1 -3 -4 -3 -7 -12 -13 -7 0 -6 -9 -19 -5 9 2 -11 -4 -3 4 -7 -8 -2 12 12 -16 4 2 13 13 -3 -1 13 25 4 7 7 20 16 5 2 9 6 7 -1
7198anO%nj2J8J5qk1jJ5Lkj4RJMJmnNJ1j6PJ3LrpQkJ2j6pJ5Pj0kmlJ5lj5j%jR
$$ -1 -6 0 0 -5 -17 1 16 8 -13 -14 1 4 2 -12 -3 -2 2 3 -1 -6 -1 10 -6 1 14 17 8 1 9 7 19 3 -4 11 18 8 6 2 -1 14 11 -4 -5 -5 -6 3
7244CrjJ2j1qPMjnoQLj%lJ3lqJ2oJ3j1J3rmJ7Ok0KlJ3Kj6r%J2Jj8NRlMj2LMqJ0
$$ 3 -6 -7 5 -6 -14 -7 -3 -4 -9 -15 -7 -4 -5 -5 -8 5 2 -6 6 0 13 2 15 6 2 19 25 5 7 4 17 19 3 -6 -6 6 7 -11 -6 3 0 4 -8 -5 -1 -9 1
7291Aj1oJ5jNpnJ0Qk0J5%JQj1KrJ8%j1OPrJ0nmmQpoPJ3qj1J0ppjOlJkNjnQqqP
$$ 1 -10 -16 -1 -2 3 -4 -9 1 9 -11 4 4 5 13 2 4 -5 13 13 2 8 15 6 16 11 7 3 11 4 -2 5 18 10 -1 9 2 -5 -6 0 -3 -2 -4 1 0 -5 3 -5 -13 -6
7340fJ4lJKNkkj4PRpPjJoJ1j4Oj3J6pj4L2k2J4j5MMqKj5J6nJ%Jj0lK0q%j2QJ1
$$ -6 8 5 6 8 13 11 9 -5 2 11 4 11 10 11 5 16 2 8 -5 11 4 -10 22 0 14 -1 3 7 -1 1 -14 2 -3 -2 -2 -1 -11 -14 6 -2 -2 -14 -6 5
7384ELnPj1Qj1OONq%%JKOllNrLjJ0j8%KllQqnLmpLLJ7q%NqJ7j0JnLjLj%nJ3rj
$$ 5 8 3 10 -1 7 -4 2 8 13 5 5 5 6 8 14 11 8 13 4 7 6 16 -2 -2 0 -3 -6 2 -6 -11 -8 -12 -19 -16 -13 4 -4 -4 1 -7 10 0 1 -4 -1 -2 1 0 0 -5 8 -1 -2
7437bPKMljMKPj2MjpKj0Lj0J2j3QjjLokjOmJ1nJ2%j3J0kjJ3j3J2nrQNoPlMOq%
$$ -2 5 7 11 8 7 11 13 20 8 12 11 4 6 -4 -1 -11 1 -12 -4 -5 -6 -3 -9 -11 -12 -6 -10 1 -4 8 8 -5 5 3 2 15 2 14 9 0 8 13 7 14 11 15 21 13 13
7486A3lmJ0orKllLkJ4oj2LJ2j8J0OkkK%Lj2RkQ%pjQMJ2mj1nLOlj0NQop%NNknj4
$$ 13 10 6 16 10 1 3 0 -3 0 -2 12 6 -6 -3 9 -9 1 7 5 3 5 5 8 -4 5 3 11 11 4 3 11 15 27 23 12 7 10 16 13 3 8 16 10 3 3 8 13 11 6 -8
7536hJ4mn%P%j0j1JJ5MnnQkJ0j4LOnJ4rjJLJ1j1JJ4oMpmJ1nkqLMj5kJ1j2Lmj4
$$ -8 6 2 -3 -3 4 4 -6 -17 -16 -1 3 -2 -7 1 -1 9 -5 -2 4 -1 13 4 3 4 7 18 7 8 22 16 20 13 9 20 15 13 5 8 12 -3 -5 6 -6 -3 -7 -21
7582b1J4Qkj4QmOlKkMLqPlJ4Nmj4J0J0Nk0NPmPnJMj1q%PkJNj3lQonJ4omqMmJ2
$$ -21 -7 1 -1 -15 -7 -11 -5 -8 -6 -8 -4 -1 -9 -2 -5 9 14 10 -4 6 16 21 1 6 13 9 16 11 12 16 5 -3 -3 4 2 3 8 -5 -8 0 -6 -11 3 -3 -7 -15 -11 -15 -3
7631cj1KLKjjkORQlJj4J3lolKQlmkJ6nrLJ1qKooLK5k9J3qqJlnJ4mlmKM%KoMRP
$$ -3 -14 -12 -9 -7 -8 -9 -11 -5 4 12 9 10 -4 9 6 0 -3 -1 7 4 0 -2 14 9 0 3 14 6 8 2 -4 -1 24 -5 8 0 -8 -7 -10 -15 -1 -5 -8 -12 -10 -6 -6 -4 -10 -6 3 10
7683A0KqkOKj6J2mJ3mljJ0ojOpLj0jMPnqKpKkKoLLlQlJjNJj1J2Oj0OmJ0j2RqO
$$ 10 12 4 2 8 10 -6 6 2 15 11 8 7 17 11 10 16 9 12 2 1 5 12 7 -1 1 -6 -4 -6 -4 -10 -7 -4 -7 1 -2 -1 -2 3 4 -7 5 11 1 7 3 13 1 10 2 8
7733HJ4kj3LnJKj2ROMj7JKJ2pj3jJ1Qj1qNJnPjrRPKMj2Ol%J8j5jmPmPKkkkNk%
$$ 8 22 20 7 10 5 6 8 -4 5 11 15 -2 -1 1 13 6 -7 -8 3 11 0 -8 -3 -2 -7 0 -1 -10 -1 6 8 12 0 6 3 3 21 6 5 1 8 4 11 13 11 9 7 12 10 10
7783A0KnoJLpj%KnJ0j2J1nqkLJ6pJ0rKNqLllkPLJKJ1rkKoRnKj2jJ5j0lJ2j3lj
$$ 10 12 7 1 2 5 -2 -3 -3 -1 -6 4 -8 3 -2 -10 -12 -9 7 0 10 1 3 8 0 3 0 -3 -5 2 5 6 8 19 10 8 10 4 13 8 10 -2 -3 12 2 -1 11 -2 -5 -6
7832fQk0J0%kpJ2pNrMJ1MjMlMqKN%rLJ2krORr%jNrRpKj0Rj1PoLPj1L%mJ4rj0M
$$ -6 2 -18 -8 -8 -10 -17 -5 -12 -7 -16 -12 -1 3 2 6 3 7 -1 1 6 6 -3 0 12 10 1 7 16 7 7 6 11 2 11 4 6 -4 5 -6 1 -5 -2 5 -6 -3 -3 -7 7 -2 -12 -8
7883hJlNLnNkqRQ%%LJ0j3KlO%qJ3%mrJ4oLj1Mk%pqJ1PrKrPKj4NJ2mqJ0kOj%Jk
$$ -8 -7 -10 -5 -2 -7 -2 -4 -12 -3 5 5 5 8 18 5 7 4 10 10 2 15 15 11 2 16 10 13 2 6 4 4 -3 -11 0 7 -2 0 -9 -2 0 -14 -9 3 -1 -9 1 -1 5 4 4 5 3
7935C%%J%Lj1J8rKOnKJ%j0jQmP%o%j1kJ0oqJjOKPnJjJNlklMJkJRj0J2%noMOj1
$$ 3 3 3 4 4 7 -4 14 5 7 13 8 10 11 11 1 0 8 4 11 11 5 5 -6 -8 2 -4 -12 -11 -12 -6 -4 3 -2 -1 -2 -1 4 1 -1 -4 0 1 -1 0 9 -1 11 11 6 0 4 10 -1
7988aJJ1Jkj0J1LpNqjNo%qJ1mnMpJlJ4qmkKK%NJLJLJMrK%J0qqP%OmJKmj0J0lp
$$ -1 0 11 12 10 0 11 14 7 12 4 3 8 2 2 -6 5 1 -4 0 -7 -6 -9 5 -3 -7 -9 -7 -5 -5 0 1 4 5 8 9 13 4 6 6 16 8 0 7 7 13 9 10 12 8 -2 8 5 -2
8041bjJnk%jjMRj4J6r%OjMj6J1pJ1rJ1RnmpPK%MKJKomLjrJKKqORj6OOj3Kn%MM
$$ -2 -3 -2 -7 -9 -9 -10 -11 -7 2 -12 4 -5 -5 1 0 4 -12 -1 -8 3 -6 5 14 9 5 -2 5 7 7 11 13 14 16 10 6 9 8 -1 0 2 4 -4 2 11 -5 1 7 -6 -4 -9 -9 -5 -1
8094akOj2JOoMoJ1qJ2JnMJMmLJJ5oompRnMlknlMpQnJMq%OqJJ1nLmjMlmoJ5%LQ
$$ -1 -3 3 -9 -8 -2 -8 -4 -10 1 -7 5 6 1 5 6 10 6 9 10 25 19 13 9 2 11 6 10 7 5 0 -3 1 -6 2 -3 -2 2 -6 -6 0 -8 -7 4 -1 2 -2 -3 1 -2 -6 -12 3 3 6 14
8149A4mj%Njmn%OnLloMjPj1n%RmnNmQkoLKj0KJJ2Lj2RpJ3qpJ4J
$$ 14 10 9 9 14 13 9 4 4 10 5 8 5 -1 3 2 9 -2 -7 -7 2 -2 -7 -2 -6 2 0 -6 -3 -1 -11 -9 -8 4 7 -5 4 -3 10 2 -5 9 10
8191A0
##END NTUPLES=NMR FID
##END=
