##TITLE=1H_DE-157_oil_N2
 200.13Hz,CCl4.
 8 sc
 10.6.2026
##JCAMPDX= 6.0         $$ Bruker NMR JCAMP-DX V2.0
##DATA TYPE= NMR FID
##DATA CLASS= NTUPLES
##ORIGIN= UXNMR, Bruker Analytische Messtechnik GmbH
##OWNER= pz
$$ XWIN-NMR		Version 3.5
$$ Wed Jun 10 13:40:19 2026 Russian Standard Time (UT+4h)  she@DPX200
##.OBSERVE FREQUENCY= 200.131
##.OBSERVE NUCLEUS= ^1H
##.DELAY= (6, 6)
##.ACQUISITION MODE= SIMULTANEOUS
##.ACQUISITION SCHEME= undefined
##.AVERAGES= 8
##.DIGITISER RES= 18
##SPECTROMETER/DATA SYSTEM= spect
##.PULSE SEQUENCE= zg30
##.SOLVENT NAME= CDCl3
##.SHIFT REFERENCE= (INTERNAL, CDCl3, 0, 14.3821)
##AUDIT TRAIL= $$ (NUMBER, WHEN, WHO, WHERE, WHAT)
$$ ##TITLE= Audit trail, XWIN-NMR		Version 3.5
$$ ##JCAMPDX= 5.01
$$ ##ORIGIN= Bruker BioSpin GmbH
$$ ##OWNER= she
$$ F:/spectra/data/she/nmr/H-C/1/audita.txt
$$ ##AUDIT TRAIL=  $$ (NUMBER, WHEN, WHO, WHERE, WHAT)
(   1,<2026-06-10 13:38:42.09 +0400>,<she>,<DPX200>,
      <created by zg, POWCHK disabled, PULCHK disabled
       configuration hash MD5:
       00 E9 B6 7A A2 85 ED C7 34 08 36 98 17 FE 4E 26
       data hash MD5: 16K
       BB 8B 54 44 17 E3 22 C5 6C 24 4A D9 3B 24 3F 63>)
$$ ##END=
$$ 
$$ hash MD5
$$ C7 55 36 8A 46 85 8C A0 17 D9 53 4F 96 87 10 92
##$RELAX= 
##$RELAX= 
##$RELAX= 
##$RELAX= 
##$RELAX= 
##$RELAX= 
$$ Bruker specific parameters
$$ --------------------------
##$DU= <F:/spectra>
##$EXPNO= 1
##$NAME= <H-C>
##$PROCNO= 1
##$TYPE= <nmr>
##$USER= <she>
##$AMP= (0..31)
100 100 100 100 100 100 100 100 100 100 100 100 100 100 100 100 100 100 
100 100 100 100 100 100 100 100 100 100 100 100 100 100 
##$AQSEQ= 0
##$AQ_mod= 1
##$AUNM= <au_zg>
##$AUTOPOS= <>
##$BF1= 200.13
##$BF2= 200.13
##$BF3= 200.13
##$BF4= 200.13
##$BF5= 200.13
##$BF6= 200.13
##$BF7= 200.13
##$BF8= 200.13
##$BYTORDA= 1
##$CFDGTYP= 0
##$CFRGTYP= 5
##$CHEMSTR= <none>
##$CNST= (0..31)
1 1 145 1 1 1 1 1 1 1 1 1 1 1 1 1 1 1 1 1 1 1 1 1 1 1 1 1 1 1 1 1 
##$CPDPRG= <>
##$CPDPRG1= <>
##$CPDPRG2= <>
##$CPDPRG3= <>
##$CPDPRG4= <mlev>
##$CPDPRG5= <mlev>
##$CPDPRG6= <mlev>
##$CPDPRG7= <mlev>
##$CPDPRG8= <mlev>
##$CPDPRGB= <>
##$CPDPRGT= <>
##$D= (0..31)
0 0.7 0 0 0 0 0 0 0 0 0 0.03 0 0 0 0 0 0 0 0 0 0 0 0 0 0 0 0 0 0 0 0 
##$DATE= 1781084321
##$DBL= (0..7)
120 120 120 120 120 120 120 120 
##$DBP= (0..7)
150 150 150 150 150 150 150 150 
##$DBP07= 0
##$DBPNAM0= <>
##$DBPNAM1= <>
##$DBPNAM2= <>
##$DBPNAM3= <>
##$DBPNAM4= <>
##$DBPNAM5= <>
##$DBPNAM6= <>
##$DBPNAM7= <>
##$DBPOAL= (0..7)
0.5 0.5 0.5 0.5 0.5 0.5 0.5 0.5 
##$DBPOFFS= (0..7)
0 0 0 0 0 0 0 0 
##$DE= 6
##$DECBNUC= <off>
##$DECIM= 32
##$DECNUC= <off>
##$DECSTAT= 4
##$DIGMOD= 1
##$DIGTYP= 9
##$DL= (0..7)
0 120 120 120 120 120 120 120 
##$DP= (0..7)
150 150 150 150 150 150 150 150 
##$DP07= 0
##$DPNAME0= <>
##$DPNAME1= <>
##$DPNAME2= <>
##$DPNAME3= <>
##$DPNAME4= <>
##$DPNAME5= <>
##$DPNAME6= <>
##$DPNAME7= <>
##$DPOAL= (0..7)
0.5 0.5 0.5 0.5 0.5 0.5 0.5 0.5 
##$DPOFFS= (0..7)
0 0 0 0 0 0 0 0 
##$DQDMODE= 0
##$DR= 18
##$DS= 0
##$DSLIST= <SSSSSSSSSSSSSSS>
$$ [...]
##$SUBNAM0= <"">
##$SUBNAM1= <"">
##$SUBNAM2= <"">
##$SUBNAM3= <"">
##$SUBNAM4= <"">
##$SUBNAM5= <"">
##$SUBNAM6= <"">
##$SUBNAM7= <"">
##$SUBNAM8= <"">
##$SUBNAM9= <"">
##$SW= 18.0517599122864
##$SWIBOX= (0..15)
0 0 2 0 0 0 0 0 0 0 0 0 0 0 0 0 
##$SW_h= 3612.71676300578
##$TD= 16384
##$TD0= 1
##$TE= 0
##$TE2= 300
##$TE3= 300
##$TEG= 300
##$TL= (0..7)
0 120 120 120 120 120 120 120 
##$TP= (0..7)
150 150 150 150 150 150 150 150 
##$TP07= 0
##$TPNAME0= <>
##$TPNAME1= <>
##$TPNAME2= <>
##$TPNAME3= <>
##$TPNAME4= <>
##$TPNAME5= <>
##$TPNAME6= <>
##$TPNAME7= <>
##$TPOAL= (0..7)
0.5 0.5 0.5 0.5 0.5 0.5 0.5 0.5 
##$TPOFFS= (0..7)
0 0 0 0 0 0 0 0 
##$TUNHIN= 0
##$TUNHOUT= 0
##$TUNXOUT= 0
##$USERA1= <user>
##$USERA2= <user>
##$USERA3= <user>
##$USERA4= <user>
##$USERA5= <user>
##$V9= 5
##$VALIST= <valist>
##$VCLIST= <CCCCCCCCCCCCCCC>
##$VD= 0
##$VDLIST= <DDDDDDDDDDDDDDD>
##$VPLIST= <PPPPPPPPPPPPPPP>
##$VTLIST= <TTTTTTTTTTTTTTT>
##$WBST= 1024
##$WBSW= 4
##$XGAIN= (0..3)
0 0 0 0 
##$XL= 0
##$YL= 0
##$YMAX_a= 164786
##$YMIN_a= -159253
##$ZGOPTNS= <>
##$ZL1= 120
##$ZL2= 120
##$ZL3= 120
##$ZL4= 120
##$ABSF1= 10
##$ABSF2= 0
##$ABSG= 5
##$ABSL= 3
##$ALPHA= 0
##$AQORDER= 0
##$ASSFAC= 0
##$ASSFACI= 0
##$ASSFACX= 0
##$ASSWID= 0
##$AUNMP= <proc_1d>
##$AZFE= 0.1
##$AZFW= 0.1
##$BCFW= 1
##$BC_mod= 2
##$BYTORDP= 1
##$COROFFS= 0
##$CY= -3
##$DATMOD= 1
##$DC= 2
##$DFILT= <>
##$DTYPP= 0
##$F1P= 0
##$F2P= 0
##$FCOR= 0.5
##$FTSIZE= 0
##$FT_mod= 4
##$GAMMA= 1
##$GB= 0.15
##$INTBC= 1
##$INTSCL= 1
##$ISEN= 128
##$LB= 0.25
##$LEV0= 0
##$LPBIN= 0
##$MAXI= 10000
##$MC2= 0
##$MEAN= 0
##$ME_mod= 0
##$MI= 1.114404
##$NCOEF= 0
##$NC_proc= 0
##$NLEV= 6
##$NOISF1= 3.799351
##$NOISF2= 2.8
##$NSP= 1
##$NTH_PI= 0
##$NZP= 0
##$OFFSET= 14.38212
##$PC= 1
##$PHC0= -4224.847
##$PHC1= 19.39229
##$PH_mod= 1
##$PKNL= yes
##$PPARMOD= 0
##$PSCAL= 0
##$PSIGN= 0
##$REVERSE= no
##$SF= 200.129724274929
##$SI= 16384
##$SIGF1= 3
##$SIGF2= 2
##$SINO= 400
##$SIOLD= 16384
##$SREGLST= <1H.CDCl3>
##$SSB= 0
##$STSI= 0
##$STSR= 0
##$SW_p= 3205.1282051282
##$SYMM= 0
##$S_DEV= 0
##$TDeff= 0
##$TDoff= 0
##$TI= <>
##$TILT= no
##$TM1= 0
##$TM2= 0
##$TOPLEV= 0
##$USERP1= <user>
##$USERP2= <user>
##$USERP3= <user>
##$USERP4= <user>
##$USERP5= <user>
##$WDW= 1
##$XDIM= 8192
##$YMAX_p= 0
##$YMIN_p= 0
$$ End of Bruker specific parameters
$$ ---------------------------------
##NTUPLES= NMR FID
##VAR_NAME=  TIME,          FID/REAL,        FID/IMAG
##SYMBOL=    X,             R,               I
##VAR_TYPE=  INDEPENDENT,   DEPENDENT,       DEPENDENT
##VAR_FORM=  AFFN,          ASDF,            ASDF
##VAR_DIM=   8192,          8192,            8192
##UNITS=     SECONDS,       ARBITRARY UNITS, ARBITRARY UNITS
##FACTOR=    0.0002768,     1,               1
##FIRST=     0,             0,               0
##LAST=      2.2672688,     0,               0
##MIN=       0,             -159253,         0
##MAX=       2.2672688,     164786,          0
$$ Real data points
##PAGE= N=1
##DATA TABLE= (X++(R..R)), XYDATA
$$ [...]
$$ plain form
1803 51 28 217 -133 160 289 134 65 65 91 7 -1 83 -200 -61 -135 120 14 -19 38 105 -38 -162 -25 -76 232
1828 232 290 -101 129 88 -101 -81 -18 239 58 33 16 43 -91 -62 191 -279 30 44 -215 270 -34 -64 49
1851 49 94 112 -264 217 -35 -47 -111 -105 33 13 50 -14 20 413 -408 48 -95 -47 84 -269 237 -311 -250 -178 -81
1876 -81 106 -156 101 -6 33 128 143 -178 60 -32 -67 78 44 -222 83 -316 35 186 -75 -126 -179 73 -75
1899 -75 181 -163 -201 269 -106 108 149 39 94 -44 151 -65 104 -131 3 8 -142 155 -185 -5 195 -39
1921 -39 263 -211 83 75 141 87 -43 290 103 87 -266 -106 -52 -24 -124 -53 -100 422 -239 -15 -165 47 49 -53
1945 -53 162 -158 -61 132 50 206 -292 93 39 9 -104 -56 -11 97 20 -174 -13 251 -104 -144 -62 184 55
1968 55 134 69 -34 157 -147 -122 -11 120 268 65 74 115 80 12 -111 193 -145 144 -76 -99 -34 -301 -28 95
$$ packed form
1803E1k3J89l50K93J29j55o9%K6q4qQ4k83J39p4K55j06l3N7O7j43j24J37n1L08
1828B32N8l91K30m1j89K0O3K57j81k5j7K7j34K9K53m70L09J4k59M85l04l0J13
1851D9M5J8l76M81k52j2o4OJ38k0L7o4L4L93q21M56j43M8J31l53N06n48O1P2R7
1876h1J87k62K57j07L9R5J5l21K38r2l5J45l4k66L05l99L51J51k61n1n3K52j48
1899g5K56l44l8M70l75K14M1j10N5j38J95k16J69k35J34Nj50K97l40J80K00k34
1921c9L02m74K94qO6n4j30L33j87j6l53J60N4K8j00P1m7N22o61K24j50K12Kj02
1945e3K15l20R7J93q2J56m98L85n4l0j13M8M5J08p7j94J61K64l55m0Q2K46j29
1968E5P9o5j03J91l04K5J11J31J48k03RM1l5o8j23L04l38K89k20k3O5k67K73J23
$$ plain form
1992 95 159 241 24 123 70 -37 129 -83 128 24 -228 -137 284 111 118 -189 68 114 -64 -122 -22 76 62 -47
2016 -47 -77 -31 -77 -370 -346 191 80 -390 106 -58 -365 307 -163 204 83 -168 -248 162 -161 -270 -108 -14
2038 -14 -117 163 -8 118 -144 -91 113 6 18 -126 -2 -233 -8 234 -118 -125 114 122 -320 68 -26 22 274
2061 274 -63 -30 13 -43 214 -115 100 -143 0 -153 20 -100 -144 -61 -61 -68 47 -242 -42 -235 -29 -28 192 168
2085 168 -241 -153 -225 41 -14 -178 -24 -90 -108 -132 93 -72 -32 240 -41 -95 -160 -46 123 -197 -30 128 165
2108 165 293 74 109 -50 -87 -209 11 25 95 -79 -79 -290 303 -118 -126 -8 151 -66 221 -41 13 364 20
2131 20 -257 -147 111 193 -70 32 77 -103 192 -109 203 253 -79 102 -14 -24 -171 -10 -45 -312 293 120
2153 120 -44 23 -71 -131 119 35 -87 144 -158 -124 15 17 -135 -29 34 -67 10 124 -59 272 211 240 282 -28
$$ packed form
1992I5O4Q2k17R9n3j07J66k12K11j04k52R1M21j73Pl07K57M6j78n8J00R8j4j09
2016d7l0M6m6k93K4N37j11m70M96j64l07O72m70L67j21k51q0M10l23j09J62R4
2038a4j03K80j71J26k62N3K04j07J2j44J24k31K25K42l52pK39Qm42L88r4M8K52
2061B74l37L3M3n6K57l29K15k43J43j53J73j20m4Q3%pJ15k89K00j93K06JK20k4
2085A68m09Q8p2K66n5j64J54o6j8k4K25j65M0K72k81n4o5J14J69l20J67J58L7
2108A65J28k19L5j59l7j22K20J4P0j74%k11N93m21qJ18J59k17K87k62N4L51l44
2131B0k77J10K58Q2k63J02M5j80K95l01L12N0l32J81j16j0j47J61l5k67O05j73
2153A20j64O7r4o0K50q4j22K31l02L4J39Kj52J06O3j01P7J14j83L31o1K9M2l10
$$ plain form
2177 -28 44 86 -71 -115 -19 -48 -38 43 172 112 80 57 52 112 114 43 24 -87 -143 -15 -204 94 118 -196 -61 -70 -83 28
2205 28 102 -220 69 74 -12 92 -259 157 -78 -139 8 -37 -154 -6 15 94 -60 105 77 -17 58 134 152 318 -103
2230 -103 -220 -61 101 33 -80 254 -8 8 22 -33 -32 29 -9 102 -83 -52 258 -81 -43 226 102 30 -183 153
2254 153 -146 60 -96 31 -74 -102 -117 71 -283 56 233 39 44 -47 123 -111 242 208 138 -106 -222 -38
2276 -38 -104 -49 -133 125 -111 81 400 -304 137 50 215 -184 179 184 -78 -27 180 -127 2 26 4 -157 -50
2299 -50 65 140 51 155 -142 -256 -91 257 -29 -261 -208 -41 -44 -14 254 149 184 55 -92 63 -31 -40 96 217
2323 217 145 6 -125 208 113 -91 -29 -58 279 408 -44 218 14 58 -60 134 74 -101 -100 -65 66 87 -92
2346 -92 179 16 21 146 15 138 -44 238 79 -159 -11 234 -188 -106 -248 -23 -165 40 44 -13 468 141
$$ packed form
2177b8P2M2j57m4R6k9J0Q1J29o0l2k3nO0Kp1j9j11n6J28j89K98K4l14J35rj3J11
2205B8P4l22K89Nq6J04l51M16k35o1J47m5j17J48K1P9j54J65k8r4P5P6J8J66m21
2230a03j17J59J62o8j13L34k62J6J4n5JO1l8J11j85L1L10l39L8K69j24p2k13L36
2254A53k99K06j56J27j05k8j5J88l54L39J77j94Nr1J70k34L53l4p0k44j16J84
2276c8o6N5q4K58k36J92L19p04M41q7J65l99L63Nk62N1K07l07J29K4k2j61J07
2299e0J15P5q9J04k97j14J65L48k86k32N3J67lL0K68j05L5j29j47J55r4rJ36J21
2323B17p2j39j31L33r5k04O2k9L37J29m52K62k04M4j18J94o0j75JL5J31K1j79
2346i2K71j63NJ25j31J23j82K82j59k38J48K45m22Q2j42K25j42K05Mn7M81l27
$$ plain form
2368 141 -83 -65 -27 68 -65 -32 -4 136 149 -46 40 281 -41 -237 -148 -118 107 -155 198 99 1 147 -136 56
2392 56 91 -45 99 -106 319 68 -8 -74 -78 -23 5 -137 22 57 -71 88 -23 -41 59 9 74 295 -44 -178
2416 -178 330 -32 45 -25 104 -20 -85 -6 -102 65 119 -187 -48 1 181 97 -82 -78 -142 -56 -264 74 26 -54 -40
2441 -40 -75 101 76 146 -89 143 378 387 160 132 -81 -100 -62 159 -126 174 -223 46 -251 -100 -21 -39 16 290
2465 290 103 144 190 -262 149 -21 -72 -95 -59 310 61 -59 -270 90 -88 352 28 -95 -200 -23 43 -127
2487 -127 -170 100 42 148 -301 -48 61 -124 -8 -82 -45 -37 131 -61 -201 196 102 286 158 44 106 16 -39
2510 -39 -139 120 287 -51 90 -273 18 -89 142 -69 -220 -24 -116 -172 -109 100 -47 -55 180 42 55 63 -110
2533 -110 -103 58 293 -117 74 -61 -98 167 14 -300 141 217 -251 124 -50 301 -225 21 -129 -172 -207 84
$$ packed form
2368A41k24J8L8R5j33L3K8J40J3j95Q6K41l22j96Q9L0K25k62L53r9r8J46k83J92
2392E6L5j36J44k05M25k51p6o6mN5K8j42J59L5j28J59j11j8J00n0O5K21l39j34
2416a78N08l62P7p0J29j24o5P9r6J67N4l06J39M9J80q4j79Mo4Q6k08L38m8q0J4
2441d0l5J76k5P0k35K32K35Rk27k8k13j9L8K21k85L00l97K69k97J51P9j8N5K74
2465B90j87M1M6m52M11j70n1k3L6L69k49j20k11L60j78M40l24j23j05J77O6j70
2487a27m3K70n8J06m49K53J09j85J16p4L7QJ68j92j40L97r4J84j28j14O2r0n5
2510c9j00K59J67l38J41l63K91j07K31k11j51J96r2n6O3K09j47qK35j38J3Qj73
2533a10PJ61K35m10J91j35l7K65j53l14M41P6m68L75j74L51n26K46j50m3l5K91
$$ plain form
2555 84 44 47 69 -153 177 -10 25 -238 247 127 -123 -3 -96 -152 13 54 71 -161 134 -98 140 66 -45 35
2579 35 85 -215 39 -15 51 127 92 82 -29 160 -123 -60 -304 -272 -153 -178 95 -57 -52 -4 154 124 -3 40 -74
2604 -74 80 -45 90 58 -28 -266 121 -34 -31 -233 28 -73 -3 82 -35 56 71 180 45 86 213 -219 87
2627 87 174 162 267 -367 -129 172 -164 -26 -65 23 115 246 214 290 131 -42 178 -241 82 -131 -17 81 104
2650 104 -144 -52 26 -36 -230 -146 -83 135 240 198 77 235 -202 236 46 -4 -138 -92 212 153 64 111 -262 -115
2674 -115 138 -167 65 -86 31 144 -11 202 -107 102 -42 69 -66 270 174 -239 -62 74 132 -257 -96
2695 -96 -211 40 72 28 -129 -47 -239 -34 -39 256 277 44 269 -63 -322 208 -216 248 70 174 -52 -56 319
2718 319 142 103 -76 -114 -352 -185 133 157 142 -131 -165 224 -264 27 -148 -35 73 70 64 -245 77 -3 -102 229
$$ packed form
2555H4m0LK2k22L30j87L5k63M85j20k50J20r3n6J65M1J7k32K95k32K38p4j11Q0
2579C5N0l00K54n4O6P6l5j0j11J89k83O3k44L2J19k5K73j52NM8J58l0j27M3j14
2604g4J54j25J35l2q6k38L87j55Lk02K61j01P0Q5j17R1J5J09j35M1J27m32L06
2627H7Q7j2J05o34K38L01l36J38l9Q8R2J31l2P6j59j73K20m19L23k13J14R8K3
2650A04k48R2P8o2j94Q4O3K18J05m2j21J58m37M38j90n0j34M6L04n9q9M7l73J47
2674a15K53l05K32j51J17J13j55K13l09K09j44J11j35L36r6m13J77J36N8l89J61
2695i6j15K51L2m4j57Q2j92K05nK95K1k33K25l32k59N30m24M64j78J04k26mL75
2718C19j77l9j79l8k38J67L18K4j5k73l4L89m88K91j75J13J08lol09L22q0r9L31
$$ plain form
2742 229 -10 125 -56 179 -94 229 27 81 -49 -145 -46 50 -138 0 14 54 130 50 207 -279 -31 217 180
2765 180 9 -23 82 -131 21 -44 63 190 -149 -153 188 -106 35 -252 34 -114 -218 -88 163 0 -197
2786 -197 69 -104 90 -111 10 -156 -163 324 -77 40 13 -144 101 41 -35 -22 118 10 92 65 2 45 -15 -211
2810 -211 91 15 12 -119 20 -8 141 54 -4 -73 -46 227 147 -5 -213 15 32 149 -167 9 -206 44 -145
2833 -145 -126 -84 -160 -118 -174 -49 131 41 171 -174 -5 -169 -155 61 -227 86 -99 -84 190 25 -51 108 -22
2856 -22 142 -86 -172 190 -254 -167 -2 31 63 28 98 15 123 99 58 -39 -8 -137 57 -6 -350 -260 -181 -63 138
2881 138 64 -89 70 -72 -10 187 358 141 -138 -321 -33 -181 -54 53 -26 88 -50 42 47 141 -93 -46 -43
2904 -43 -201 -108 252 -183 -132 60 288 -43 -271 418 186 -263 135 -262 219 193 -2 -22 108 343 238 38
$$ packed form
2742B29k39J35j81K35k73L23k02N4j30r6R9R6j88J38J4M0P6q0J57m86K48K48l7
2765A80j71l2J05k13J52o5J07J27l39mL41k94J41k87K86j48j04J30K51j63j97
2786a97K66j73J94k01J21j66pM87m01J17k7j57K45o0p6J3J40j08Q2k7o3M3o0j96
2810b11L02p6lj31J39k8J49q7n8o9K7K73q0j52k08K28J7J17l16J76k15K50j89
2833a45J9M2p6M2n6J25J80r0J30l45J69j64J4K16k88L13j85J5K74j65p6J59j30
2856b2J64k28q6L62m44Q7J65L3L2l5P0q3J08k4m1r7L1j29J94o3l44R0P9J18K01
2881A38p4j53J59j42O2J97J71k17k79j83K88j48J27J07p9J14j38R2NR4k34M7L
2904d3j58R3L60m35N1J92K28l31k28O89k32m49L98l97M81k6j95k0J30K35j05k00
$$ plain form
2926 38 -186 12 126 23 -1 -229 -119 -379 -1 416 -11 -150 -155 -119 35 362 56 121 315 117 61 -12 186
2949 186 -63 -137 -222 55 -88 -14 39 1 -71 2 -75 -40 248 55 -51 72 -298 -69 86 -46 133 -170 261
2972 261 137 44 46 178 -21 33 -146 7 113 -128 130 -1 63 -83 58 31 99 -40 81 -187 -110 135 -152
2995 -152 148 92 -202 133 -48 -14 -94 -66 7 66 195 3 21 124 189 -1 -44 -106 184 -44 66 87 13 51
3019 51 23 -249 75 -151 84 -98 -8 43 -119 156 -10 -29 -203 -274 -369 -43 -48 226 178 69 127 259 -101 148
3043 148 310 171 57 -42 141 -264 52 -135 -94 47 -148 277 66 112 123 -36 -13 63 -66 62 -238 55
3065 55 70 -128 -168 104 -53 69 62 126 77 -127 -63 55 -99 476 110 -103 -38 -30 264 87 -65 -164 150 297
3089 297 75 -58 77 -7 -134 82 -70 136 162 -80 -15 105 120 -161 -38 -28 -183 81 95 -171 235 -146
$$ packed form
2926C8k24J98J14j03k4k28J10k60L78M17m27j39nL6J54L27l06O5J94j98n6p3J98
2949A86k49p4q5K77j43P4N3l8p2P3p7L5K88j93j06J23l70K29J55j32J79l03M31
2972B61j24r3KJ32j99N4j79J53J06k41K58j31O4j46J41k7O8j39J21k68P7K45k87
2995a52L00n6k94L35j81L4q0K8P3N9J29j92J8J03O5j90m3o2K90k28J10K1p4L8
3019E1k8k72L24k26K35j82R0N1j62K75j66j9j74p1r5L26nK74m8j09N8J32l60K49
3043A48J62j39j14r9J83m05L16j87M1J41j95M25k11M6J1j59K3P6j29J28l00K93
3065E5J5j98m0K72j57J22pO4m9k04O4J18j54N75l66k13O5QK94j77j52r9L14J47
3089B97k22j33J35q4j27K16j52K06K6k42O5J20J5k81J23J0j55K64J4k66M06l81
$$ plain form
3111 -146 116 -134 -132 -124 137 195 -1 -85 -12 97 67 36 53 112 -145 67 6 -78 -164 -51 -21 47 -63 -38 -23 -316
3137 -316 61 103 -27 71 133 -95 -166 16 -80 304 84 4 101 -224 -82 58 206 74 135 86 -105 75 212
3160 212 11 97 119 195 18 250 117 -82 25 87 -191 -58 -338 -200 154 135 -80 -12 57 69 11 -132 -55
3183 -55 127 157 -84 -2 -324 111 -204 -155 -33 12 -26 255 -72 -288 458 119 -4 9 -214 82 -11 160 293
3206 293 -240 13 2 -99 -382 167 -85 35 22 162 343 -15 -100 57 339 -36 329 -222 50 -118 123
3227 123 -1 122 195 -57 -99 2 5 -12 -73 -65 244 138 117 -235 -33 -183 -175 -219 -170 -138 -104 42 30 119 201 127
3253 127 -309 91 -168 -50 21 -57 249 11 141 -102 98 2 169 -106 213 173 -135 90 -214 -94 27
3274 27 -390 -240 -209 -54 160 25 -67 -40 139 -164 46 320 169 50 -149 -21 -13 181 180 127 -88 -153 170
$$ packed form
3111a46K62k50KQK61N8j96q4P3J09l0l1J7N9k57K12o1q4q6J13L0O8j10K5J5k93
3137c16L77M2j30R8O2k28p1J82r6L84k20q0R7l25J42J40J48j32O1m9j91J80J37
3160B12k01Q6K2P6j77K32j33j99J07O2k78J33k80J38L54j9k15O8O9J2n8j43P7
3183e5J82L0k41Q2l22M35l15M9J22M5l8K81l27k16P46l39j23J3k23K96r3J71J33
3206B93n33K53j1j01k83N49k52J20j3J40J81l58q5J57K82l75L65n51K72j68K41
3227A23j24J23P3k52m2J01Lj7o1QL09j06k1l52K02j50Qm4M9L2L4J46j2Q9Q2p4
3253A27m36M00k59J18P1p8L06k38J30k43K00r6J67k75L19m0l08K25l04J20J21
3274B7m17J50L1J55K14j35r2K7J79l03K10K74j51j19j99J28QJ94jn3k15o5L23
$$ plain form
3297 170 240 63 213 97 -253 -101 -62 60 -42 -163 78 161 315 -24 197 90 286 -58 -243 53 7
3318 7 191 -23 -25 12 -8 -5 -20 60 -143 168 68 0 91 183 199 9 -71 -75 155 -5 26 -28 10 174 -34 28 79
3345 79 45 -5 20 31 109 -134 -4 132 -208 -69 -136 281 -154 35 -39 -380 95 79 -184 110 183 321 34
3368 34 77 88 -168 23 121 173 45 -5 -17 73 75 -55 -134 124 -18 -26 -35 254 97 -113 -37 160 -7 129 94 -38
3394 -38 37 119 271 68 -58 -3 90 -63 -56 -100 107 298 -258 -83 -70 -55 -155 91 -96 -47 -40 -79 -32 95 -63
3419 -63 66 57 -148 -22 211 1 -278 126 172 73 -67 161 -3 47 5 88 50 236 -61 58 134 -103 243
3442 243 -95 55 -199 -101 83 234 -133 -129 -38 -191 178 103 -87 -78 -8 54 -29 -110 288 -64 76 245 -54 102
3466 102 -72 98 -146 -49 116 -108 -271 -152 148 97 -116 117 1 -10 -397 120 111 134 -87 -107 260 -193
$$ packed form
3297A70P0j77J50j16l50J52L9J22j02j21K41Q3J54l39K21j07J96l44j85K96m6
3318GJ84k14kL7k0Lj5Q0k03L11j00o8R1R2J6j90q0mK30j60L1n4L8J64k08O2N1
3345G9l4n0K5J1P8k43J30J36l40J39o7M17m35J89p4l41M75j6k63K94P3J38k87
3368C4M3J1k56J91R8N2j28n0j2R0Kj30p9K58j42qrK89j57k10P6J97j67J36l5j32
3394c8P5Q2J52k03j26N5R3j53Pm4K07J91n56J75J3J5j00K46j87M9Pl9M7J27j58
3419f3J29rk05J26K33k10k79M04M6r9j40K28j64N0m2Q3l8J86k97J19P6k37L46
3442B43l38J50k54R8J84J51l67MR1j53L69p5j90RP0O2q3q1L98l52J40J69k99J56
3466A02j74J70k44R7J65k24j63J19L00n1k13K33j16j1l87N17rK3k21k0L67m53
$$ plain form
3488 -193 -93 -42 92 -44 -81 8 214 82 -45 -361 135 -419 294 286 90 143 -126 153 50 191 -236 234
3510 234 356 29 50 124 36 -104 192 -91 43 -30 60 -237 -21 -262 -50 145 193 136 -174 138 22 11 38
3533 38 42 -150 -194 -184 -185 205 -35 167 -7 -60 143 149 69 -11 16 56 -88 -60 -42 -133 -130 -104 194 128 59 -40 -90 62
3561 62 52 279 -209 144 109 324 281 22 -60 -272 -66 113 -169 67 -42 111 -201 -22 177 -75 82 -92
3583 -92 -132 -31 6 80 122 134 -10 -178 56 -3 -198 212 104 152 -82 99 -79 -103 4 -105 -74 -103 -69 182
3607 182 -208 -38 25 96 118 44 -10 -143 63 -93 251 142 239 12 -87 127 245 195 -47 117 -155 272 185
3630 185 34 -257 194 -115 -62 -189 20 175 238 18 311 7 186 -204 -145 122 -129 29 -5 -77 -157 16
3652 16 180 8 -189 -29 -204 107 -57 -39 59 82 126 -238 21 -20 -65 30 68 93 69 -4 -12 297 314 -93 -45
$$ packed form
3488a93J00N1J34j36l7Q9K06j32j27l16M96n54P13qj96N3k69K79j03J41m27M70
3510B34J22l27K1P4q8j40K96k83J34p3R0k97K16k41K12J95M8n7l10L12j16j1K7
3533C8Mj92m4J0jL90k40K02j74n3K03Oq0q0K7M0j44K8J8r1LK6K98o6o9r9n0J52
3561F2j0K27m88L53l5K15m3k59q2k12K06J79k82K36j09J53l12J79J99k52J57j74
3583i2m0J01L7P4M2J2j44j68K34n9j95M10j08M8k34J81j78k4J07j09L1k9L4K51
3607A82l90J70O3P1K2p4n4j33K06j56L44j09R7k27r9K14J18n0k42J64k72M27q7
3630A85j51k91M51l09N3j27K09J55O3k20K93l04J79l90N9K67k51J58l4p2q0J73
3652A6J64j72j97J60j75L11j64J8R8K3M4l64K59m1m5R5L8K5k4p3qL09J7m07M8
$$ plain form
3677 -45 -74 -104 -58 115 -20 32 -15 55 144 53 -50 -75 185 227 -112 -85 -90 -136 62 142 21 -23 52 64 -7 -123 -149
3704 -149 -216 143 -13 68 68 70 60 -81 18 240 -224 -15 64 262 52 77 -34 122 46 -130 -80 -35 12 112 -4
3729 -4 -75 28 110 172 -194 -19 203 -65 11 -19 183 112 -44 138 -84 -77 42 34 -236 171 -47 44 -77 6 -67
3754 -67 195 175 -108 161 24 -51 119 119 -335 -21 -131 12 192 52 -27 -17 97 -280 -135 20 16 86 -181
3777 -181 -122 25 26 -146 -186 303 -189 159 -260 -227 356 -116 98 237 -195 165 119 128 49 -10 -71 333 -137 83
3801 83 -18 -43 -160 7 -170 151 13 -42 -169 234 85 -14 -382 -176 15 84 -171 -55 -257 -51 80 -189
3823 -189 -48 -202 37 282 -137 115 -65 -117 184 -62 -25 -31 -25 129 -60 -130 -86 64 -1 172 72 -53 34
3846 34 62 -43 -46 112 -65 -212 -137 502 53 -109 19 -182 91 -147 -73 266 -140 -130 -23 -27 17 -15 -204 -106
$$ packed form
3677d5k9l0M6J73j35N2m7P0Q9r1j03k5K60M2l39K7nm6J98Q0j21m4P5J2p1j16k6
3704a49o7L59j56Q1%Kj0j41R9K22m64K09P9J98k10K5j11J56p6j76N0M5M7J00j16
3729dp1J03Q2O2l66J75K22k68P6l0K02p1j56J82k22PJ19qk70M07k18R1j21Q3p3
3754f7K62k0k83K69j37p5J70%m54L14j10J43J80j40p9J0J14l77J45J55mP0k67
3777a81N9J47Jj72m0M89m92L48m19L3N83m72K14J39m32L60m6Rp9n9o1M04m70K20
3801H3j01k5j17J67j77L21j38n5j27M03j49r9l68K06J91O9k55J16k02K06J31k69
3823a89J41j54K39K45m19K52j80n2L01k46L7oOJ54j89p0M4J50o5J73j00j25Q7
3846C4K8j05lJ58j77j47P5O39m49j62J28k01K73k38P4L39m06J0J07mM4l2j89R8
$$ plain form
3870 -106 107 13 -62 -29 -26 15 26 204 73 -251 304 -7 -230 16 -20 14 45 83 61 -70 -48 -279 90 80 -29
3895 -29 -7 -60 8 102 -213 -296 -43 35 -173 -150 212 -11 -90 -66 -47 -5 -112 216 -16 22 193 125 -205 90 216
3920 216 38 -221 371 194 -57 5 22 -62 -54 -168 -5 66 101 110 -278 -70 -45 -30 46 -145 47 -6 217 -79
3944 -79 38 -145 -128 -100 50 20 -137 -59 68 51 -3 -42 17 67 16 -17 -175 -52 19 132 -32 -179 171 107 -148
3969 -148 -96 -62 -396 -167 -54 -170 111 166 -18 219 -143 165 -127 128 131 51 55 46 -38 -85 37 -31 -78 -118 102
3994 102 -1 -110 5 220 -144 -171 -73 -77 -20 -93 58 99 22 273 139 -73 170 124 -140 -44 -62 -124 78 -232
4018 -232 3 253 -143 167 327 -2 -261 -299 -204 29 102 -136 -49 -131 228 -57 168 -89 -233 50 -61 -139
4040 -139 135 60 -32 -287 -153 -67 -38 -279 104 -83 184 -142 -13 46 60 180 173 -181 22 -71 -74 44 56 16
$$ packed form
3870a06K13r4p5L3LM1J1J78j31l24N55l11k23K46l6L4L1L8k2j31K2k31L69j0j09
3895b9K2n3O8R4l15q3K53P8k08K3L62k23p9K4J9M2j07L28k32L8J71o8l30K95J26
3920B16j78k59N92j77k51O2J7q4Qj14J63P1L5Rl88K08K5J5P6j91J92n3K23k96
3944g9J17j83J7K8J50l0j57P8J27j7n4l9N9N0n1l3j58J23P1J13j64j47L50o4k55
3969a48N2L4l34K29J13j16K81N5j84K37l62L08k92K55Lq0Mrq4m7J22o8m7m0K20
3994A02j03j09J15K15l64k7R8mN7p3J51M1p7K51j34k12K43m6k64R6j8o2K02l10
4018b32K35K50l96L10J60l29k59l8R5K33P3k38Q7q2L59k85K25k57j44K83j11p8
4040a39K74p5r2k55J34Q6K9k41L83j87K67l26J29N9J4J20pl54K03r3lJ18J2m0
$$ plain form
4064 16 -276 196 -160 -196 24 -122 119 -195 41 -29 -232 -254 -89 125 23 -89 -148 24 -136 213 -172 -172
4086 -172 -145 -107 -136 -143 -100 -119 -92 -90 124 -36 103 62 229 112 3 33 -8 191 -33 -66 21 -122 4 -120 68
4111 68 94 -25 52 -119 -49 -39 -13 -146 34 -277 -116 -216 -14 173 152 114 -166 127 168 -63 -7 -81 81 136
4135 136 205 -145 28 43 78 161 -238 42 -3 17 -6 64 -83 -391 -11 136 220 -44 261 -222 -23 -384 -133
4158 -133 85 -67 -237 -2 108 173 187 -86 123 -165 86 174 96 73 -167 124 166 -140 -29 72 355 99
4180 99 -331 -15 44 40 -282 273 44 130 -63 164 37 262 67 308 -125 144 220 -201 150 73 152 -75 -144
4203 -144 236 -1 43 45 28 84 -78 78 -138 121 -219 174 -75 -22 33 38 -206 176 -23 -20 -20 197 -190 122
4227 122 122 -33 -139 -1 193 87 -220 -6 -69 -43 286 -51 7 76 -155 -13 91 -31 -52 149 166 -227 233
$$ packed form
4064A6k92M72l56l6K20j46K41l14K36p0k03k2J65K14j02j12n9J72j60L49l85%
4086a72K7L8k9pM3j9K7KK14j60J39m1J67j17j09L0m1J99k24l3Q7j43J26j24J88
4111F8K6j19P7j71P0J0K6j33J80l11J61j00K02J87k1l8k80K93M1k31N6p4J62N5
4135A36O9l50J73J5L5Q3l99K80m5K0k3P0j47l08L80J47Q4k64L05m83J99l61K51
4158a33K18j52j70K35J10O5J4k73K09k88K51Q8p8k3k40K91M2l06J11J01K83k56
4180I9m30L16N9ml22N55k29Q6j93K27j27K25j95K41m33K69P6m21L51p7P9k27o9
4203a44L80k37M4Kj7N6j62J56k16K59l40L93k49N3N5Nk44L82j99L%K17l87L12
4227A22%j55j06J38J94j06l07K14o3K6L29l37N8O9k31J42J04j22k1K01J7l93M60
$$ plain form
4250 233 102 -171 71 197 34 82 51 -11 -135 -96 -89 61 206 -50 -154 -23 -167 -91 -4 42 -52 140 -128
4273 -128 -234 -95 -145 10 200 41 127 -249 20 -63 127 20 -276 -312 -197 395 -69 -91 -35 -225 477 16
4295 16 268 16 -25 248 -242 -210 25 153 -52 57 -79 62 -220 33 -77 -32 289 -25 -217 108 105 -89
4317 -89 38 -373 -124 28 -171 -189 70 43 100 5 -44 -152 -29 121 109 224 105 2 -115 208 -108 -39 493
4340 493 62 -184 130 -252 211 -157 -108 -151 48 2 -114 95 3 335 110 -194 -5 119 192 -2 -96 126
4362 126 -130 -125 -53 -134 -122 -12 -18 106 134 247 122 -151 -116 116 -76 403 18 24 -26 -38 51 -69 -241 127 156
4387 156 22 56 89 123 -199 -7 -147 -232 -82 13 12 -140 126 -137 28 22 -103 -10 173 141 16 -40 50 -52
4411 -52 -129 -152 -159 54 355 -8 -145 -157 12 -48 45 110 -100 79 -14 -205 -118 176 -56 127 211 51 285 58
$$ packed form
4250B33j31k73K42J26j63M8l1o2j24L9PJ50J45k56j04J31j44P6Q7M6r4J92k68
4273a28j06J39n0J55J90j59Q6l76K69q3J90j07k96l6J15N92m64k2N6j90P02m61
4295A6K52k52m1K73m90L2K35J28k05J09j36J41k82K53j10M5L21l14j92L25lj94
4317h9J27m11K49J52j99j8K59k7N7r5m9j08J23J50j2J15j19j03j17L23l16O9N32
4340D93m31k46L14l82M63l68M9m3J99m6j16K09r2L32k25l04J89J24P3j94r4K22
4362A26k56NP2q1J2J10oJ24K8J13j25k73L5K32j92M79l85On0j2Q9j20j72L68K9
4387A56j34L4L3L4l22J92j40q5J50R5jj52K66k63J65oj25R3J83l2j25n6R0j02
4411e2p7k3pK13L01l63j37j2J69o0R3O5k10J79r3j91Q7K94k32J83Q4j60K34k27
$$ plain form
4435 58 181 -61 123 -29 -142 105 -106 -56 64 46 -7 -141 -197 128 -182 -48 57 -95 224 -158 93 -137
4457 -137 6 196 138 -130 -96 40 128 267 6 -69 -391 -204 96 163 100 -219 37 -117 -121 -59 13 -54 95 78
4481 78 23 -110 115 85 23 321 107 -52 -69 -47 -145 94 22 -32 -111 -138 -144 30 -395 126 -25 -12 -64 -52 -140 -193
4507 -193 134 -137 -32 144 -191 -345 216 138 136 -158 136 211 16 -10 67 -97 -98 74 -177 -73 233 -164 28
4530 28 -129 -39 1 41 -113 -9 284 61 42 -244 -158 88 -17 -63 95 18 -120 30 263 -107 -58 -241 -286
4553 -286 33 -114 -70 97 169 213 -77 367 -272 63 48 2 -61 -111 -27 171 287 -166 239 -83 114 -135 157
4576 157 73 52 -67 -23 29 -80 145 14 -146 -1 -172 -109 44 65 133 47 -74 -131 -216 -121 -337 -18 -57 -32
4600 -32 373 77 -38 -70 -18 -236 -71 -232 -110 47 -140 -311 -34 124 17 -81 -66 -125 -156 -132 131 -15 -98
$$ packed form
4435E8J23k42J84j52j13K47k11N0J20j8n3j34n6L25l10J34J05j52L19l82K51k30
4457a37J43J90n8k68L4J36Q8J39k61p5l22J87L00O7o3l19K56j54mO2P2o7J49j7
4481G8n5j33K25l0o2K98k14j59j7K2r8K39p2n4p9k7oJ74m25N21j51J3n2J2q8n3
4507a93L27k71J05J76l35j54N61p8kk94K94P5j95k6P7j64jJ72k51J04L06l97J92
4530B8j57R0M0M0j54J04K93k23j9k86Q6K46j05m6J58p7j38J50K33l70M9j83m5
4553b86L19j47M4J67P2M4k90M44o39L35j5m6o3n0Q4J98J16m53M05l22J97k49K92
4576A57q4k1j19M4N2j09K25j31j60J45j71O3J53K1O8q6j21n7q5R5k16L19l9K5
4600c2M05k96j15l2N2k18J65j61J22J57j87j71K77J58j07r8J5n9l1K4K63j46q3
$$ plain form
4623 -98 -18 -150 -19 -86 114 51 -19 297 57 -150 13 -89 -253 86 -140 -107 76 266 53 44 192 -26 21
4646 21 133 -34 239 -118 110 35 -75 61 -147 63 -23 -150 119 -96 -205 64 -141 182 -180 89 123
4667 123 -156 173 -16 -142 -13 55 270 -209 -22 340 -149 228 207 -33 -64 161 -37 -83 -91 187 319 235
4689 235 40 345 -507 -32 -600 210 -147 116 -157 585 242 -278 328 -165 161 155 -39 -209 42 105 4
4710 4 -158 -98 95 482 -167 -179 -122 -247 -54 237 181 173 255 19 207 -246 -331 -134 -161 48 29 123 -15 -7 102
4735 102 42 -104 -31 128 230 -118 49 124 303 118 -176 106 -31 57 148 21 -67 -135 -16 -173 119 153 -113
4758 -113 -174 -84 -19 148 -54 -178 -192 -148 -70 238 112 389 97 139 600 28 121 90 -168 -30 27 -215 -185 -243
4782 -243 76 -179 -57 -92 -73 26 -149 263 151 18 67 145 -25 -14 -24 -21 163 102 -179 -168 -64 -16 33 34 52
$$ packed form
4623i8Q0j32J31o7K00o3p0L16k40k07J63j02j64L39k26L3J83J90k13rJ48k18M7
4646B1J12j67K73l57K28p5j10J36k08K10q6j27K69k15j09K69k05L23l62K69L4
4667A23k79L29j89j26J29O8K15m79J87L62m89L77k1k40l1K25j98m6qK78J32q4
4689B35j95L05q52M75n68Q10l57K63k73P42l43n20O06m93L26oj94j70K51O3j01
4710Dj62O0J93L87o49j2N7j25J93K91n6qQ2k36J88m53q5J97k7K09j9R4j38QJ09
4735A02o0j46P3J59J02l48J67P5J79j85k94K82j37Q8R1j27q8o8J19j57K92L4k66
4758a13o1R0O5J67k02j24j4M4P8L08j26K77k92M2M61n72R3l1k58J38N7k42L0n8
4782b43L19k55J22l5J9R9j75M12j12j33M9P8j70J1j0LJ84o1k81J1J04M8M9JJ8
$$ plain form
4807 52 62 78 -139 80 61 149 -60 401 52 -23 40 -54 -102 3 -76 160 -19 23 122 27 43 94 144 137 -152 -129
4833 -129 115 110 62 -147 -211 -143 -210 -99 -7 -40 -63 -27 -144 106 143 -177 -122 -92 40 116 67 -94 -76 -18 -24 -87 46
4860 46 293 -204 -136 68 160 -107 -129 147 -198 87 -43 -117 66 -297 -166 66 -102 -236 91 291 -246 -146
4882 -146 101 -139 -6 -139 -278 149 123 185 72 4 -224 89 -201 -185 -73 -62 122 178 -7 -64 -145 118 -91
4905 -91 21 45 30 -137 -121 -20 -71 -192 107 -83 -98 258 -130 41 -118 -21 102 -31 -129 -4 10 -259 -60
4928 -60 -25 -15 13 -70 99 -136 -126 -60 263 176 -19 49 32 -256 -148 -102 -10 -9 -86 -101 144 39 -112 151 68 -140
4954 -140 -404 -148 -55 -164 407 57 6 304 -117 -44 -160 -270 -151 52 21 87 -186 102 152 -6 -74 -61 -92
4977 -92 211 114 -138 162 -67 -112 88 100 160 -282 3 138 -66 148 -159 44 388 133 -114 -130 -119 49
$$ packed form
4807E2J0J6k17K19j9Q8k09M61l49p5O3r4m8J05p9K36j79M2R9r5J6N1N0pk89K3
4833a29K44nm8k09o4O8o7J11R2l3k3L6j17K50L7l20N5L0J32P6m9j61J8N8oo3J33
4860D6K47m97O8K04R2k67k2K76l45K85j30p4J83l63J31K32j68j34L27K00n37J00
4882a46K47k40J33j33j39M27k6O2j13o8k28L13k90J6J12J1J84N6j85n7q1K63k09
4905i1J12K4j5j67J6J01n1j21K99j90j5L56l88J71j59R7J23j33r8J25J4k69J99
4928f0L5J0K8q3J69k35J0O6L23q7j95O8j7k88J08M6R2Jp7j5K45j05j51K63q3k08
4954a40k64K56R3j09N71l50n1K98m21P3j16j10J19K03l1O6k73K88N0j58o8J3l1
4977i2L03r7k52L00k29m5K00J2O0m42K85J35k04K14l07K03L44k55k47j6J1J68
$$ plain form
4999 49 -164 85 -20 86 76 81 -12 41 -76 -1 -63 282 97 8 -57 -19 -68 -249 -286 -38 -139 -27 32 -5 -99
5024 -99 81 295 -150 -158 208 -152 -11 -78 111 171 148 108 -7 -7 19 -33 115 111 -172 18 -69 132 -207 -65 209
5049 209 68 -205 107 70 107 -85 91 28 16 -14 -117 33 84 -42 -24 -182 230 48 -248 132 -41 23 93
5072 93 161 -137 -8 68 52 -17 8 172 -40 -92 -32 112 -191 -85 -40 -69 -50 32 -40 218 4 10 181 414 146
5097 146 -16 -96 -138 166 199 -54 167 114 -102 11 -27 -115 -37 137 -14 -354 -215 77 45 3 307 -61 275
5120 275 6 144 230 153 -37 -36 -167 212 -332 47 -68 29 -191 -147 -148 69 -330 -33 0 -236 -6 -12 -27 -5
5144 -5 99 27 -12 -27 73 105 129 -108 22 258 -81 -197 87 189 -42 -53 50 12 -287 86 -27 -77 -35 -221
5168 -221 -11 -45 -94 194 -203 -43 -85 -262 -57 -188 109 -128 -221 -92 24 -77 57 163 254 122 -69 -83
$$ packed form
4999D9k13K49j05J06j0Nr3N3j17P5o2L45j85q9o5L8m9j81l7K48j01J12N9l7r4
5024i9J80K14m45qL66l60J41o7J89O0k3m0j15%K6n2J48mk83J90q7K01l39J42K74
5049B09j41k73L12l7L7j92J76o3j2l0j03J50N1j26J8j58M12j82k96L80j73O4P0
5072I3O8k98J29P6j6o9K5J64k12n2O0J44l03J06M5k9J9Q2p2K58k14OJ71K33k68
5097A46j62q0m2L04L3k53K21n3k16J13l8q8P8J74j51l40J39K92l2m2L04l68L36
5120B75k69J38Q6p7j90Jj31L79n44L79j15R7k20M4jK17l99K97L3k36K30oj5K2
5144eJ04p2l9j5J00L2K4k37J30K36l39j16K84J02k31j1J03l8k99L73j13n0M2j86
5168b21K10l4m9K88l97J60m2j77K05j31K97k37r3J29J16j01J34J06R1j32j91j4
$$ plain form
5190 -83 295 151 -123 -63 17 20 -315 -54 -164 -77 69 -22 -95 113 -238 -230 -168 -122 -15 36 1 -38 135 -202 -104
5215 -104 36 -162 9 43 -35 -221 -16 -65 20 28 -137 50 -61 -153 139 -132 38 148 33 68 99 169 109 153
5239 153 70 44 -66 106 363 -57 36 -4 196 264 4 -38 -89 27 -64 107 58 90 -24 -128 -172 113 173 132
5263 132 -51 -44 124 -213 -295 -167 149 4 -61 -234 36 -59 -261 -262 -156 -129 -96 44 -53 -10 -251 -20 -23 -139
5287 -139 -148 162 -130 -35 -98 159 81 30 361 -104 -216 -77 -235 -199 -151 -117 -69 -146 -106 32 105 185 -389 53 171
5312 171 129 -31 -95 244 46 -87 -197 -165 -151 15 -255 60 218 -91 -64 -58 -161 -226 1 -367 -51 -214 -138
5335 -138 26 63 -115 -47 -78 -127 2 -87 -123 122 90 268 -167 -207 172 -92 9 149 -150 -41 -184 -9 -182
5358 -182 53 10 -224 60 201 80 -160 -248 -41 -2 50 -173 59 -8 -67 -138 256 -28 167 138 119 69 -110
$$ packed form
5190h3L78j44k74O0Q0Ll35K61j10Q7J46r1p3K08l51QO2M6J07N1l5l9J73l37R8
5215a04J40j98J71L4p8j86K05m9Q5Qj65J87j11r2K92k71J70J10j15L5L1P0o0M4
5239A53q3k6j10J72K57m20R3m0K00O8k60m2n1J16r1J71m9L2j14j04m4K85O0m1
5263A32j83PJ68l37q2J28L16j45o5j73K70r5k02jJ06K7L3J40r7M3k41K31lj16
5287a39rL10k92R5o3K57p8n1L31m65j12J39j58L6M8L4M8p7M0J38P3Q0n74M42J18
5312A71m2j60o4L39j98j33j10L2J4J66k70L15J58l09K7Oj03o5K27l68L16j63P6
5335a38J64L7j78O8l1m9J29q9l6K45l2J78m35m0L79k64J01J40k99J09j43J75j73
5358a82K35m3k34K84J41j21k40q8K07L9N2k23K32o7n9p1L94k84J95k9j9n0j79
$$ plain form
5381 -110 -174 -67 -36 232 57 -100 44 -81 -285 49 47 93 121 -161 -17 -192 -147 -26 59 42 263 -148 173
5404 173 -220 7 124 -53 100 -97 106 -41 -232 -11 -99 90 5 17 161 68 5 115 55 -139 141 42
5426 42 -4 93 -3 -65 83 54 118 -143 -46 10 -65 -73 -80 -15 94 25 108 129 -8 -299 -94 -5 142 24 56 26 102
5453 102 -39 -84 147 41 -155 -162 161 45 -111 26 10 51 89 104 52 -237 -144 110 197 -17 -10 -80 -36 -108 -2
5478 -2 16 -240 -20 -247 124 -109 -215 43 15 -38 -42 -153 17 148 -83 48 -82 66 141 -177 175 -23 34
5501 34 -106 -5 -235 -276 -10 208 -49 32 -1 43 95 -46 38 -248 -98 -18 -225 -129 183 17 -132 -249 175
5524 175 87 -84 50 54 -139 -54 -177 136 147 14 204 -82 -29 45 -33 55 -213 126 -362 -15 62 108 69 -164
5548 -164 -64 171 -110 -34 -123 181 -91 -98 -85 115 106 36 -57 148 125 -56 -111 250 70 170 20 -91 108 -12
$$ packed form
5381a10o4J07L1K68j75j57J44j25k04L34kM6K8k82J44j75M5J21Q5j7K21m11L21
5404A73l93K27J17j77J53j97K03j47j91K21q8J89q5J2J44r3o3J10o0j94K80r9
5426D2m6R7r6o2J48k9O4k61R7N6p5qpO5J09o9Q3K1j37k91K05Q9J47j18L2l0P6
5453A02j41m5K31j06j96pL23j16j56J37j6M1L8J5n2k89R3K54Q7k14Pp0M4p2J06
5478bJ8k56K20k27L71k33j06K58k8n3mj11J70J31k31J31j30J48P5l18L52j98N7
5501C4j40J01k30m1K66K18k57Q1l3M4N2j41Q4k86J50Q0k07R6L12j66j49j17M24
5524A75q8j71J34Mj93Q5j23L13J1j33J90k86N3P4p8Q8k68L39m88L47P7M6l9k33
5548a64J00K35k81P6q9L04k72pJ3K00rp0r3K05k3j81n5L61j80J00j50j11J99j20
$$ plain form
5572 -12 -61 -64 49 93 -102 11 86 -147 -170 195 79 89 -129 -33 87 86 -29 -135 47 40 111 4 90 -76 -56
5597 -56 -105 19 12 286 -50 -71 214 -16 -9 -29 -94 -105 -24 136 -283 -108 -296 20 145 -109 58 -171 86 319
5621 319 11 283 37 108 -5 170 -88 228 -142 -326 15 -83 53 -43 -9 211 -52 -98 -58 126 52 38 -20
5644 -20 -33 105 48 -47 7 156 137 78 4 162 70 95 -91 100 -136 -8 -206 -137 -9 143 89 -31 189 -94
5668 -94 -101 209 -37 179 38 -134 246 136 -63 -287 302 25 -154 45 -50 -81 151 145 82 30 167 -201 -22
5691 -22 -232 -162 162 -116 90 131 -146 53 -8 174 154 -63 177 165 367 -87 146 36 -53 132 -76 -37 112
5714 112 -250 122 231 10 -10 62 -119 -112 67 110 167 125 63 -152 358 -144 79 -30 148 23 -71 -301 206
5737 206 3 293 172 -7 144 14 259 3 -301 113 -27 40 234 146 -182 -79 -102 221 -5 80 44 -71
$$ packed form
5572a2m9lJ13M4j95J13P5k33k3L65j16J0k18R6J20jj15j06J82pP1j07Q6j66K0
5597e6m9J24pK74l36k1K85k30Pk0o5j1Q1J60m19J75j88L16J25k54J67k29K57K33
5621C19l08K72k46P1j13J75k58L16l70j84L41r8J36r6L4K20k63m6M0J84p4j4n8
5644b0j3J38n7r5N4J49j9n9p4J58r2K5j86J91k36J28j98O9J28J52n4j20K20k83
5668i4pL10k46K16j41j72L80j10j99k24N89k77j79J99r5l1K32oo3n2J37l68J79
5691b2k10P0L24k78K06M1k77J99o1J82k0k17K40j2K02m54K33j10q9J85k08L9J49
5714A12l62L72J09k21k0P2j81PJ79M3N7m2o2k15N10n02K23j09J78j25r4k30N07
5737B06k03K90j21j79J51j30K45k56l04M14j40O7J94q8l28J03k3L23k26Q5l6j15
$$ plain form
5759 -71 109 187 -78 261 -46 -274 56 110 157 17 69 273 -253 190 363 -23 265 203 156 -133 -206 40 57
5782 57 27 100 -37 48 -37 -197 -160 -94 -88 -56 -116 9 -44 119 104 171 -110 99 150 165 180 40 -33 153 -83 39
5808 39 -121 42 -195 28 98 -5 224 -35 75 -226 -28 119 272 153 338 11 -72 -74 114 -5 267 5
5830 5 162 132 70 -164 86 -139 -97 0 76 -123 206 215 168 -45 77 140 72 -5 -102 -101 -77 -161 -82 198 -6 -170
5856 -170 80 -264 -113 -121 -33 109 -29 -161 -8 -163 69 -58 -246 29 -80 126 -26 -97 29 -78 -129 -153
5878 -153 -80 -42 4 -102 58 -63 -25 217 24 -37 88 53 -215 -314 113 33 110 -161 -258 1 53 -102 5 -131
5902 -131 136 -59 -120 -342 -98 -31 23 -234 112 -77 -25 46 -163 -115 84 1 -115 101 -15 108 -30 384
5924 384 210 -101 -237 63 -102 -29 112 -18 88 -74 104 208 -12 244 175 153 -86 -108 82 266 -59
$$ packed form
5759g1J80P8k65L39l07k28L30N4M7j40N2K04n26M43J73l86K88o2m7k89p3K46J7
5782E7l0P3j37Q5q5j60L7O6OL2o0J25n3J63j5O7k81K09N1J5J5j40p3J86k36J22
5808C9j60J63k37K23P0j03K29k59J10l01J98J47J53j19J85l27q3kJ88j19K72k62
5830EJ57l0o2k34K50k25M2R7P6j99L29Rm7k13J22O3o8p7r7JK4q4P9K80k04j64
5856a70K50l44J51qQ8J42j38j32J53j55K32j27j88K75j09K06j52p1J26j07n1k4
5878a53P3L8M6j06J60j21L8K42j93o1J25l5k68r9M27q0P7k71r7K59N2j55J07j36
5902a31K67j95o1k22K44O7N4k57L46j89N2P1k09M8J99q3j16K16j16J23j38M14
5924C84j74l11j36L00j65P3J41j30J06j62J78J04k20K56o9k2k39k2J90J84l25
$$ plain form
5945 -59 -97 337 24 280 295 19 -63 77 -194 204 131 143 -96 66 111 95 129 -79 -92 -68 66 -48 39 -2
5969 -2 -189 132 93 -105 119 208 20 -77 -84 -28 -10 145 -147 259 46 -16 73 -42 -71 -159 150 44 216 86
5993 86 -92 211 -157 49 73 -181 -280 -39 1 75 -225 2 -126 160 25 -85 -134 173 155 206 -108 -31 234
6016 234 -109 -142 -164 -44 -119 74 -52 152 -196 -249 -1 -25 6 -48 175 -144 385 72 -99 39 -17 49 139
6039 139 75 26 89 -22 240 -58 -53 -123 -217 31 -346 -112 -29 -51 -63 -58 -196 250 -178 -242 55 20 159 114 193
6064 193 -170 -40 -37 -142 -39 84 -163 -33 -136 -219 56 -136 48 40 -69 10 -178 26 65 107 106 -258 -107
6087 -107 -11 14 91 -48 172 259 -2 13 103 169 108 453 -123 -21 151 -77 132 220 -102 10 122 42 -101
6110 -101 105 -105 72 -150 291 -132 -35 29 21 -151 178 173 85 77 -54 130 226 171 78 -44 -32 -83 -36 -50 -172
$$ packed form
5945e9l8M34l13K56J5k76q2J40k71L98p3J2k39J62M5j6L4k08j3K4J34j14Q7m1
5969bj87L21l9j98K24Q9j88r7pN6J8J55k92M06k13o2Q9j15k9q8L09j06J72j30
5993H6j78L03l68K06K4k54r9K41M0P4l00K27j28K86j35j10m9L07j8N1l14P7K65
6016B34l43l3k2J20p5J93j26K04l48n3K48k4L1n4K23l19N29l13j71J38n6O6R0
6039A39o4m9O3j11K62k98Np0r4K48l77K34Q3k2j2Nj38M46m28o4K97l5J39m5P9
6064A93l63J30Lj05J03J23k47J30j03q3K75j92J84qj09P9j88K04L9M2jl64J51
6087a07R6K5P7j39K20Q7k61J5R0O6o1L45n76J02J72k28K09Q8l22J12J12q0j43
6110a01K06k10J77k22M41m23R7O4qj72L29nq8qj31J84R6n5r3j22J2n1M7j4j22
$$ plain form
6135 -172 40 256 5 27 -73 -100 70 -443 -185 -84 124 -63 157 -346 241 -33 -239 -10 -78 254 215
6156 215 265 115 232 67 -44 207 -180 -305 357 81 169 211 116 -228 -35 42 -194 387 -111 -114 166 23
6178 23 73 250 211 -143 56 59 -209 65 -63 -35 95 196 -51 91 198 20 -190 104 -7 -60 201 -232
6200 -232 221 75 -124 216 -8 -68 132 111 -40 12 59 141 64 62 -109 -200 116 150 -188 197 118 159 100 96 -16
6225 -16 -154 35 9 250 95 253 229 181 -54 69 -204 -124 -56 136 -50 -114 239 124 86 212 -58 -148 115
6248 115 104 -235 -195 150 13 -512 -122 117 -186 229 147 20 -126 64 -53 46 -210 -291 48 216 24 -116
6270 -116 -78 283 105 39 -208 114 366 -83 -72 -162 -200 -130 -44 56 -24 -114 41 -229 -52 -3 41 86 97 -145
6294 -145 312 -71 65 -1 98 207 -277 6 -270 34 93 94 -94 75 19 18 -154 -82 -241 207 6 138 134 -165
$$ packed form
6135a72K12K16k51K2j00k7J70n13K58J01K08j87K20n03N87k74k06K29o8L32l9
6156B15N0j50J17j65j11K51l87j25O62k76Q8M2r5l44J93P7k36N81m98lK80j43
6178B3N0J77l9l54J99Lk68K74j28K8J30J01k47J42J07j78k10K94j11n3K61m33
6200b32M53j46j99L40k24o0K00k1j51N2M7Q2p7kj71r1L16L4l38L85p9M1n9mj12
6225a6j38J89k6K41j55J58k4m8k35J23k73Q0O8J92j86o4L53j15l8J26k70r0K63
6248A15j1l39M0L45j37n25L90K39l03M15q2j27j46J90j17R9k56q1L39J68j92j40
6270a16L8L61j78o6k47L22K52m49J1r0l8P0Q6J00q0r0J55k70J77M9M4M5J1k42
6294a45M57l83J36o6R9J09m84K83k76L04N9Jj88J69n6jj72P2j59M48k01J32mk99
$$ plain form
6318 -165 -25 -146 53 -174 115 6 -75 -113 -163 -70 -95 -120 -249 118 -59 41 -15 82 -24 -116 -2 -39 -31 -46
6342 -46 67 209 247 -178 37 -156 126 -81 -159 -12 143 61 -177 24 -47 -100 12 -5 -59 225 124 -185 201
6365 201 -23 7 -183 -107 -62 -36 73 -86 10 -37 -118 -117 187 143 -32 5 -234 -275 -246 -228 236 232 26 207 297 58
6391 58 153 40 4 316 -6 -168 -401 -27 162 -183 24 335 -3 77 -105 -66 -53 -261 -38 65 166 174 13
6414 13 -307 18 255 -72 -2 147 3 -52 -210 216 -263 -47 -2 -188 -112 -105 -250 -207 120 -7 166 -200 86
6437 86 -86 213 20 46 -56 174 -105 -51 76 -421 -186 -77 -120 209 -27 -24 112 -13 -111 146 -2 232
6459 232 231 -153 107 30 -20 224 -78 115 70 -202 37 -141 356 67 -27 23 -185 -262 123 265 -14 -198 -109
6482 -109 1 -69 -151 50 54 -118 92 276 109 -146 -41 -118 -152 23 442 -142 -239 38 113 -24 278 41 166
$$ packed form
6318a65J40j21J99k27K89j09q1l8n0R3k5k5j29L67j77J00n6R7j06r2J14l7Qj5
6342d6J13J42L8m25K15j93K82k07p8J47J55q2k38K01p1n3J12j7n4K84j01l09L86
6365B01k24L0j90P6M5K6J09j59R6m7q1JL04m4j75L7k39m1K9J8M64mk06J81R0k39
6391E8R5j13l6L12l22j62k33L74J89l45K07L11l38Q0j82L9J3k08K23J03J01Qj61
6414A3l20L25K37l27P0J49j44n5j58M26m79K16M5j86P6Pj45M3L27j27J73l66K86
6437H6j72K99j93K6j02K30k79N4J27m97K35J09m3L29k36LJ36j25r8K57j48K34
6459B32jl84K60p7n0K44l02J93m5k72K39j78M97k89r4N0k08p7L85J42k79j84Q9
6482a09J10p0q2K01Mj72K10J84j67k55J05p7l4J75M19n84r7K77P5j37L02k37J25
$$ plain form
6505 166 160 81 -186 -11 140 183 -31 245 -223 103 13 229 37 56 -72 39 8 -65 150 113 341 136 -218
6528 -218 -85 -42 94 55 -178 -124 26 -102 46 197 -229 -11 202 -52 43 4 77 38 -54 -32 185 100 88 -146
6552 -146 -133 44 -20 -117 -85 -178 152 125 -69 169 175 -119 -186 -25 294 8 116 49 -211 -79 -153 -73 115 21
6576 21 243 -21 22 -195 -10 149 -286 -36 -209 -149 -166 374 -216 252 -110 -189 -97 78 7 122 204 -310 -190
6599 -190 241 80 -122 -193 -159 78 143 96 -155 145 -60 150 -92 6 -4 -48 8 -20 -5 94 80 -164 -301 295
6623 295 95 4 141 10 117 -84 -353 149 -182 -30 12 -73 318 -56 10 298 -123 91 280 -51 -61 15
6645 15 64 -83 -20 145 -258 -56 245 -164 83 171 125 111 -48 149 -2 -115 -166 -179 -144 33 103 207 72
6668 72 334 -238 -223 -25 147 46 -32 -442 91 345 35 156 55 -15 -169 68 -298 -60 20 95 110 132 193
$$ packed form
6505A66op9k67J75J51M3k14K76m68L26r0K16j92J9j28J11l1p3K15l7K28k05l54
6528b18J33M3J36l9k33N4J50j28J48J51m26K18K13k54R5l9P3l9r2K2K17q5j2k34
6552a46J3J77o4r7L2r3L30k7j94K38Ok94o7J61L19k86J08o7k60J32p4Q0J88r4
6576B1K22k64M3k17J85J59m35K50j73O0j7N40n90M68l62p9R2J75p1J15Q2n14J20
6599a90M31j61k02p1L4K37O5m7k51L00k05K10k42R8j0m4N6k8J5R9j4k44j37N96
6623B95k00r1J37j31J07k01k69N02l31J52M2q5L91l74O6K88m21K14J89l31j0P6
6645A5M9j47O3J65m03K02L01m09K47Q8m6j4j59J97j51j13n1j3L5J77P0J04j35
6668G2K62n72J5J98J72j01p8m10N33K54l10J21j01p0j54K37l66K38Q0P5J5K2O1
$$ plain form
6691 193 106 111 141 -51 137 -179 -99 -151 -54 25 -85 47 -23 -27 -36 -75 6 62 127 -96 -89 93 161 -136 19 298 -2
6718 -2 -13 144 107 -306 38 -93 -143 -71 -186 -186 -38 -7 45 11 -70 119 187 -105 -234 -441 -144 -111 -101 -34 -389
6743 -389 -379 -517 145 83 -237 475 -20 -661 -226 353 272 228 -868 315 -700 -162 595 -941 38 91
6763 91 -1010 850 -74 -282 444 -690 -266 -509 -88 -17 -495 342 -962 -30 307 -219 -403 251 -844
6782 -844 487 -529 -189 2 -90 534 -44 614 -597 258 -408 -100 -627 118 -880 -500 -516 -68 -63 -209
6802 -209 282 -588 693 -508 -550 46 -697 -48 -154 -742 -266 837 85 -379 -63 -110 -135 -207 -274 305 203
6823 203 -250 -575 552 -477 268 189 -97 -18 -103 -490 -3 -382 -634 366 140 -16 85 118 -236 296
6843 296 448 447 -147 -75 -231 628 29 247 -121 741 -25 -865 184 365 -1 -90 -49 -89 246 -238 94 -55
$$ packed form
6691A93q7NL0j92J88l16Q0n2R7P9j10J32p0mrl9Q1N6O5k23PJ82O8k97J55K79l00
6718bj1J57l7m13L44j31n0P2j15%J48L1N2l4q1J89O8k92j29k07K97L3J0O7l55
6743c89J0j38O62o2l20P12m95o41M35N79q1m4j096J183j015N38P57j536R79N3
6763I1j101J860r24k08P26j134M24k43M21P1m78Q37j304R32L37n26j84O54j095
6782h44J331j016L40J91r2O24n78O58j211Q55o66L08n27P45r98L80j6M48Nj46
6802b09M91q70J281j201m2N96p43O49j06n88M76J103p52m64L16m7k5p2o7N79j02
6823B03m53l25J127j029P45p9k86P9q5l87M87l79k52J000k26j56J01L3l54N32
6843B96J52jn94P2j56Q59n99K18l68Q62p66q40J049J81l66q9M1m0L35m84L32j49
$$ plain form
6865 -55 552 288 -54 -42 128 -477 174 -187 -13 31 183 331 70 63 -294 -176 -139 -128 151 27 -117 -135 -19
6888 -19 109 -70 -367 63 100 -169 52 109 294 185 56 -305 -165 148 -75 93 120 305 -273 -191 293 -29
6910 -29 160 -91 -114 37 -80 -36 -150 0 -106 -52 -38 55 201 -77 65 184 -144 195 -285 48 -40 -28 203
6933 203 -108 -228 114 -10 25 172 23 18 218 -233 -73 -90 361 60 176 21 190 21 33 -136 285 -26
6955 -26 38 186 -29 138 194 -153 -137 110 -65 110 233 -32 58 21 -244 347 27 -8 -32 -68 67 -189 195
6978 195 160 211 -11 101 -101 0 31 -38 7 79 -95 20 217 51 -191 386 9 -41 333 82 -62 107
7000 107 142 42 201 204 57 38 -153 -157 40 -42 100 119 -4 -167 -36 161 -104 193 -70 371 -78 58 -151
7023 -151 77 207 51 370 -322 434 -312 -189 -370 321 -318 -9 245 11 217 -138 -238 444 15 -170
$$ packed form
6865e5O07k64l42J2J70o05O51l61J74M4J52J48k61pl57J18L7J1K79j24j44j8J16
6888a9J28j79k97M30L7k69K21N7J85j09j29l61J40L13k23J68K7J85n78Q2M84l22
6910b9J89k51k3J51j17M4j14J50j06N4J4R3J46k78J42J19l28L39m80L33q8J2K31
6933B03l11j20L42j24L5J47j49nK00m51J60j7M51l01J16j55J69j69J2j69M21l11
6955b6O4J48k15J67N6l47J6K47j75J75J23k65R0l7k65N91l20l5k4l6J35k56L84
6978A95l5N1k22J12k02J01L1o9M5P2j74J15J97j66k42N77l77n0L74k51j44J69
7000A07L5j00J59Lj47j9j91mJ97q2J42J9j23j63J31J97k65K97k63M41m49J36k09
7023a51K28J30j56L19o92P56p46J23j81O91o39L09K54k34K06l55j00O82m29j85
$$ plain form
7043 -170 211 373 -235 -21 -181 -21 -508 271 356 -341 176 -825 -334 -630 -245 -113 314 -697 255 160
7063 160 316 216 -80 -65 88 153 -302 513 -252 541 -411 -607 -133 890 -460 319 -853 146 20 -57
7083 -57 542 -188 144 630 -67 203 305 55 472 -59 -106 358 -88 281 -135 80 -12 -129 -26 -86 9 5
7105 5 -175 -139 314 -99 60 -102 -10 345 425 226 164 -120 42 135 253 -13 -62 -152 -141 46 116 -18 45 122
7129 122 -178 -276 294 237 91 -167 -182 23 221 19 51 55 167 140 2 26 202 -400 -210 100 46 29 -67 283
7153 283 -169 -81 -119 182 193 -77 397 101 -37 164 -53 -37 -49 152 -190 115 -86 -106 150 79 -46 7 39
7176 39 37 -208 -60 115 -145 -154 17 54 130 53 -149 291 -15 -50 -162 39 102 146 175 130 37 -192 30 204 16
7201 16 259 87 50 -161 -66 116 -118 -22 25 30 157 -204 -90 -114 4 -268 -34 130 -53 27 39 172 -64
$$ packed form
7043a70L81J62o08K14j60J60m87P79Q5o97N17j001M91k96L85J32M27j011R52r5
7063A60J56j00k96J5J53O5m55Q15p65P93r52j96M74J023j350P79j172R99j26p7
7083e7N99p30L32M86o97K70J02k50M17n31m7M64m46L69m16K15r2j17J03o0R5m
7105Ej80L6M53m13J59j62R2L55Q0j99o2k84J62R3J18k66m9r0J1J87P0j34O3P7
7129A22l00r8N70n7j46k58j5K05J98k02L2MJ12k7j38K4J76o02J90L10n4j7r6L50
7153B83m52Q8l8L01J1k70M74k96j38K01k17J6j2K01l42L05k01k0K56p1j25N3L2
7176C9kk45J48J75k60rJ71L7P6p7k02M40l06l5j12K01O3M4K9m5r3k29K22J74j88
7201A6K43j72l7k11R5J82k34R6M7NJ27l61J14k4J18k72K34J64j83Q0J2J33k36
$$ plain form
7224 -64 25 270 -36 -141 -67 3 69 -38 -75 -63 1 -141 279 271 -33 64 -36 237 167 -128 -114 102 -223 53
7248 53 76 13 -171 49 49 -94 -289 -129 -111 -113 65 223 104 -221 72 -66 78 -174 -252 -215 38 146 168 -42
7272 -42 -93 -50 100 159 -151 41 126 281 -51 -29 -1 196 205 41 31 -230 154 -67 -200 -22 -66 -79 -115 -278
7296 -278 -337 -466 40 113 -2 -163 358 -54 215 12 -11 -102 -174 157 -14 5 157 -307 115 -40 -217 -66
7318 -66 -18 80 -21 45 -108 4 -65 -93 -16 96 84 50 -33 -107 -107 -124 138 147 -83 -19 69 32 -89 -157 -113 140 -19
7345 -19 292 164 131 -107 -153 -70 52 -33 185 -141 73 -110 -9 177 -65 -148 71 182 86 98 -59 93 54
7368 54 -41 -101 42 210 62 -67 131 30 -69 332 380 -46 113 -269 -34 92 62 -69 -156 -62 -336 162 -487
7391 -487 -332 78 -26 -233 163 -61 -124 276 86 184 248 -55 -99 213 -457 -197 -82 334 0 52 -368 -561
$$ packed form
7224f4Q9K45l06j05P4P0O6j07l7J2O4j42M20ql04R7j00K73p0k95J4K16l25K76
7248E3K3o3j84K20%j43j95J60J8kJ78J58j19l25K93j38J44k52p8L7K53J08K2k10
7272d2n1M3J50N9l10J92Q5J55l32K2K8J97Rj64j0k61L84k21j33J78m4j3l6j63
7296b78n9j29N06P3j15j61N21m12K69k03k3r1p2L31j71J9J52m64M22j55j77J51
7318f6M8R8j01O6j53J12o9k8P7J12j2l4q3p4%j7K62Rk30O4Q8l7j21o8M4K53j59
7345a9L11j28l3k38m6Q3J22q5K18l26K14j83J01J86k42q3K19J11r6J2j57J52l9
7368E4r5o0J43J68j48j29J98j01r9M01M8m26J59l82K35J26l0j31q7R4k74M98o49
7391d87J55M10j04k07L96k24o3M00j90R8O4l03m4L12o70K60J15M16l34N2m20j93
$$ plain form
7413 -561 40 837 249 -136 303 -1107 -576 209 -278 153 115 344 443 -684 -188 381 161 -695 454 120
7433 120 -688 549 272 926 -378 -518 -193 298 246 -499 -595 172 54 -396 -289 -86 -355 -769 365 255
7453 255 -356 110 -248 -730 117 82 726 303 -49 66 230 446 38 -279 -101 150 300 -353 154 -698
7473 -698 -304 -171 58 -159 571 407 -685 416 32 -307 -11 -61 257 -671 -233 85 139 -595 -185 112
7493 112 680 477 381 -143 16 -110 -255 -326 -415 -143 -169 131 -301 -296 -106 -241 -327 -48 -238 -175 -148 -276 83
7516 83 -180 136 -11 -53 -178 -167 93 142 175 -24 120 -40 70 -76 76 7 211 -73 -75 -111 -202 -179 58 142
7540 142 63 38 -74 -48 -3 -131 -162 37 -21 200 -209 -175 -35 175 67 92 -365 -79 -61 133 3 -29 70 38
7564 38 273 -463 -262 -5 -12 -130 -81 -149 -102 243 -144 229 -130 97 -125 31 174 121 -80 76 -23 -279 240
$$ packed form
7413e61O01P97n88l85M39j410N31P85m87M31l8K29R9j127M96N69k20q56J149l34
7433A20q08J237k77O54j304j40L25M91n2p45r6P67j18m50J07K03k69m14J134j10
7453B55o11M66l58m82Q47l5O44m23l52J15J64K16m08l17J78K51J50o53N07q52
7473f98L94J33K29k17P30j64j092J101l84l39K96n0L18r28M38L18N4p34M10K97
7493A12N68k03r6n24J59j26j45p1q9K72k6L00m32NJ90j35q6K79j90O3K7j28L59
7516H3k63L16j47m2j25J1K60M9L3j99J44j60J10j46J52o9K04k84kl6r1K3K37Q4
7540A42p9k5j12K6M5j28l1J99n8K21m09L4J40K10j08K5m57K86J8J94j30l2R9l2
7564C8K35p36K01K57pj18M9o8M7L45l87L73l59K27k22J56J43n3k01J56r9k56N19
$$ plain form
7587 240 -33 15 -98 -288 102 -62 22 91 59 58 -161 79 -174 65 182 -136 -185 15 81 -49 206 108 -31
7610 -31 179 -23 202 -27 38 132 -91 -138 -93 -291 44 98 -120 -140 -96 -149 130 152 46 -30 4 223 -149 78
7634 78 -154 -28 -225 31 294 -40 119 -183 -191 49 -45 -340 -371 -18 152 56 -132 199 281 -10 28 148 -123
7657 -123 -5 -70 -58 140 -212 -265 9 -183 -7 -14 -13 -59 -246 72 106 312 42 -50 72 261 115 268 -42
7680 -42 -11 -110 8 37 -5 -60 -139 -3 5 -72 -169 45 93 252 -17 159 -181 -51 35 -23 162 75 83 52 14 -78 -137
7707 -137 78 150 144 -158 -108 165 -155 -133 -168 -169 23 -213 -109 -225 -77 -244 -138 -212 20 -147 124 -21 -76
7730 -76 62 11 36 -123 83 50 -48 420 -135 -107 106 62 309 -102 -199 159 -51 -17 -30 31 63 79 72 -75 -196
7755 -196 -139 226 50 -56 -194 9 -129 115 6 350 122 265 -90 -79 -165 -117 66 -159 -169 -71 -27 -154
$$ packed form
7587B40k73M8j13j90L90j64Q4O9l2jk19K40k53K39J17l18m9K00O6j30K55r8j39
7610c1K10k02K25k29O5R4k23m7M5j98L35N4k18k0M4n3K79K2j06p6L4K19l72K27
7634G8k32J26j97K56K63l34J59l02qK40r4k95l1L53J70r6j88L31Q2k91L8J20k71
7657a23J18o5J2J98l52n3K74j92J76pJm6j87L18L4K06k70r2J22J89j46J53l10
7680d2L1r9J18K9m2n5p9J36Qp7r7K14M8J59k69J76l40J30Q6n8J85q7Ql1l8r2n9
7707a37K15P2ol02N0K73l20K2l5jJ92k36J04j16J48j67J06p4K32j67K71j45n5
7730g6J38n1K5j59K06l3r8M68n55K8K13m4K47m11r7L58k10L4j3O1L2J6pj47j21
7755a96N7L65j76j06j38K03j38K44j09L44k28J43l55J1q6M8J83k25j0R8M4j27
$$ plain form
7777 -154 53 3 113 66 87 146 47 146 145 -32 118 26 -240 45 266 304 238 -107 -8 212 80 -241 -218 170
7801 170 -74 67 -149 -344 58 -36 94 -35 -229 9 -34 199 275 47 97 232 26 -103 93 100 442 74
7823 74 -10 -160 175 70 -10 35 48 -163 -13 -21 -75 -121 -183 325 -114 90 -181 -258 -53 288 136 -188 44 -177
7847 -177 -72 81 104 141 -85 -171 78 214 249 177 101 -1 150 11 -111 268 204 93 89 44 -48 -183 -145 -70
7871 -70 -253 75 14 -141 -17 176 -37 -86 66 -29 214 -190 -76 -91 27 -19 133 -80 -16 94 33 46 -238
7894 -238 5 -212 -100 -54 -49 290 -294 -340 -53 138 -643 -101 273 -9 -6 393 225 -538 -426 -243 145 160
7916 160 -348 444 573 -423 274 -327 281 -177 -622 -321 606 -105 131 -10 76 814 -1021 -99 20 -449
7936 -449 477 -275 366 -121 276 7 -45 -200 445 -541 149 639 460 341 130 -566 -601 -58 -119 632 -351
$$ packed form
7777a54K07n0J10m7K1N9r9R9jj77J50r2k66K85K21L8o6l45R9K20j32l21K3L88
7801A70k44J41k16j95M02r4J30j29j94K38m3K33P6k28N0J35k06j29J96PL42l68
7823G4q4j50L35j05q0M5J3k11J50qn4m6o2N08m39K04k71p7K05L41j52l24K32k21
7847a77J05J53K3L7k26q6K49J36L5p2p6j02J51j39j22L79o4j11mm5r2j35L8P5
7871g0j83L28o1j55J24J93k13m9J52r5K43m04J14j5J18m6J52k13O4J10o1J3k84
7894b38K43k17J12M6NL39n84m6K87J91p81N42L74k82LL99j68p63J12J83L88J5
7916A60n08P92J29r96O97o01O08m58m45L01R27p11K36j41Q6P38j835R22J19m69
7936d49R26p52O41m87L97k69n2j55O45r86O90M90j79j19k11o96l5N43o1P51r83
$$ plain form
7957 -351 -260 -444 324 -181 337 195 -366 -58 73 -151 20 -46 -202 -131 221 92 813 192 374 -118 -120 845
7979 845 -885 108 -11 258 345 -207 -269 -537 59 -147 -183 -216 -101 52 229 200 -225 -25 34 -140 139 -21
8001 -21 37 152 -7 -123 81 186 -26 -157 -7 22 -174 130 -221 57 -267 261 32 -231 69 96 -185
8022 -185 56 -128 -83 8 58 115 -88 32 102 165 -171 -250 -146 165 23 -156 1 103 -198 202 -123 -8
8044 -8 69 50 -88 158 -85 170 0 -165 161 -320 -65 -95 -53 18 -164 28 -9 92 -115 55 79 319 28
8067 28 65 88 30 -136 151 183 116 50 -297 122 -206 -48 105 35 -50 -150 -141 162 114 -213 -117 82 -80 236
8091 236 -25 -354 89 16 -53 -149 2 -57 149 -48 10 -80 -211 -29 172 -17 -106 45 -198 -285 -105 111 87
8114 87 -150 38 4 -209 127 -67 -47 163 110 13 -305 106 -21 -97 -136 26 -198 52 -10 401 200 568 -91
$$ packed form
7957c51R1j84P68n05N18j42n61L08J31k24J71o6j56P1L52j29P21o21J82m92kR65
7979H45j730R93j19K69Q7n52o2k68N96k06l6l3J15J53J77k9m25K00N9j74K79j60
8001b1N8J15j59j16K04J05k12j31J50K9j96L04l51K78l24N28k29k63L00K7k81
8022a85K41j84M5R1N0N7k03J20P0O3l36p9J04L11j42j79J57J02l01M00l25J15
8044hP7j9j38K46k43K55j70j65L26m81K55l0M2P1j82J92l7J01k07J70K4K40k91
8067B8L7K3n8j66K87L2o7o6l47M19l28J58J53p0q5j00RL03m8l27R6J99j62L16
8091B36k61l29M43p3o9r6J51n9K06j97N8r0j31J82K01j89q9J51k43q7J80K16k4
8114H7k37J88l4k13L36j94K0K10n3r7l18M11j27p6l9J62k24K50o2M11k01L68o59
$$ plain form
8137 -91 -101 208 -356 489 -74 80 -189 33 181 397 52 -33 120 70 181 -79 306 40 -77 97 -139
8158 -139 -362 21 30 0 153 97 342 94 -136 -196 -154 -224 -95 -57 -367 -56 87 11 270 -153 -121 44 -114
8181 -114 -326 131 30 229 -35 160 -56 -38 203 52
$$ packed form
8137i1j0L09n64Q45n63J54k69K22J48K16l45q5J53n0J11k60L85k66j17J74k36
8158a39k23L83Rl0J53n6K45k48k30o0M2p0J29L8l10L11J43p6K59m23L2J65j58
8181a14k12M57j01J99k64J95k16J8K41j51
8191E2
$$ Imaginary data points
##PAGE= N=2
##DATA TABLE= (X++(I..I)), XYDATA
$$ plain form
0 0 0 0 0 0 0 0 0 0 0 0 -8 8 -8 8 -16 16 -24 24 -32 40 -48 56 -64 79 -88 104 -120 143 -160 185 -213 241
32 241 -273 311 -351 396 -444 496 -556 619 -688 766 -847 939 -1037 1148 -1264 1394 -1536
49 -1536 1690 -1862 2050 -2259 2494 -2756 3050 -3387 3772 -4221 4750 -5385 6162 -7141 8417
64 8417 -10149 12648 -16579 23684 -40558 164786 86401 -104727 161303 -90914 -19240 107711
76 107711 -9443 39742 116646 -43678 19208 57059 -85639 55320 33809 -52910 76495
87 76495 -29082 -6473 23326 -28649 -9209 13272 615 -45224 30987 -24547 -39774 52146
99 52146 -54768 -3450 18698 -43062 5109 7190 -37421 -3819 33200 -66222 17980 15550
111 15550 -78446 71870 -36229 -41321 70613 -54880 -5371 34625 -34504 -5428 40519
$$ packed form
0@%%%%%%%%%%qJ6j6J6k4L2m0M8n6P2q8J04j20J43j67J92k24K63l03L45l98M54
32B41n14N84o62P47q40R40j052J175j307J454j613J786j976K185k412K658k930
49a536L226l552L912m309M753n250N806o437P159p993Q971j0135J1547j3303J5558
64H417j8566K2797k9227M0263o4242K05344p8385j91128K66030k52217P1674J26951
76A07711j17154M9185P6904j60324O2886L7851j42698J40959k1511q6719J29405
87G6495j05577K2609K9799n1975J9440K2481j2657m5839P6211n5534j5227R1920
99E2146j06914N1318K2148o1760M8171K081m4611L3602L7019r9422Q4202k430
111A5550r3996J50316j08099n092J11934j25493M9509L9996o9129K9076M5947
$$ plain form
122 40519 -28616 -6838 40921 -50966 33606 7102 -43342 50915 -21825 346 18033 -10511
134 -10511 11446 6780 7403 -13666 32858 -13734 -5290 44014 -40757 19607 24119 -17243 11722
147 11722 10509 3790 -324 27770 -23120 21429 23709 -37322 53638 -19303 -14852 44026 -33319
160 -33319 7811 15025 -15300 1856 20528 -24894 -1828 39321 -45264 22513 10533 -36063
172 -36063 35276 -21073 -4393 8580 -12072 3477 -2332 -4 -17919 20698 -14961 -7898 22303
185 22303 -33018 23992 -4009 -22315 17009 -8090 -4891 -4766 10292 -22787 9077 9977 -33140
198 -33140 32926 -20838 -3123 27450 -32852 10968 6870 -9581 -3241 10338 -10905 -3396 23225
211 23225 -36308 22639 6507 -28369 35998 -16298 -3023 13620 -1580 1254 -2631 9541
$$ packed form
122D0519o9135K1778M7759r1887Q4572k6504n0444R4257p2740K2171J7687k8544
134a0511K1957m666O23k1069M6524m6592Q444M9304q4771O0364M512m1362K8965
147A1722j213o719m114K8094n0890M4549K280o1031R0960p2941M451N8878p7345
160c3319M1130P214l0325J7156J8672m5422K3066M1149q4585O7777j1980m6596
172c6063P1339n6349J6680J2973k0652J5549n809K328j7915L8617l5659P063L0201
185B2303n5321N7010k8001j8306L9324k5099L199J25J5058l3079L1864R00m3117
198c3140O6066n3764J7715L0573o0302M3820m098j6451O340J3579k1243P509K6621
211B3225n9533N8947j6132l4876O4367n2296J3275J6643j5200K834l885J2172
$$ plain form
223 9541 -8518 17033 -12941 -423 22527 -26259 25501 -795 -9112 22881 -7231 5435
235 5435 3092 7181 -8377 16135 2992 -24313 35387 -18050 -3937 19958 -21960 15807 739
248 739 -4939 1003 6604 -6158 -2214 17731 -28642 17585 1647 -23162 23434 -21879 2419
261 2419 8711 -12538 -812 1912 3378 -15967 13973 -12175 -4434 15729 -26449 16385 -10375
274 -10375 -12082 16057 -15351 -603 353 4024 -10603 6020 -458 -13977 26779 -23007 2504
287 2504 16369 -24800 14097 -1769 -5694 1280 6922 -2448 -4807 13101 -16877 20498 -361
300 -361 -15504 27249 -15428 4003 5880 -7377 4950 1165 4438 -8935 14262 -10397 1721
313 1721 17792 -22824 19430 137 -5646 11104 -11766 6855 426 1929 -6838 7381 -546
$$ packed form
223I541j8059K5551k9974J2518K2950m8786N1760k6296q317L1993l0112J2666
235E435k343M089j5558K4512j3143k7305N9700n3437J4113K3895m1918L7767j5068
248G39n678N942N601j2762L944J9945m6373M6227j5938k4809M6596m5313K4298
261B419O292k1249J1726K724J466j9345K9940k6148P741K0163m2178M2834k6760
274a0375j707K8139l1408J4748R56L671j4627J6623o478j3519M0756m9786K5511
287B504J3865m1169L8897j5866l925O974N642r370k359J7908k9978L7375k0859
300c61j5143M2753m2677J9431J877j3257J2327l785L273j3373K3197k4659J2118
313A721J6071m0616M2254j9293n783J6750k2870J8621o429J503q767J4219p927
$$ plain form
326 -546 -12552 20871 -19834 5311 13423 -18642 15504 -6827 -5310 6014 2153 -7890 -1800
339 -1800 12982 -19602 10729 -3039 -12659 19968 -16052 5719 3165 -9031 5089 -1401 582
352 582 -9346 11923 -8421 -2697 7401 -19684 17889 -6622 -7908 12887 -8614 3699 -1722
365 -1722 2561 -5907 4878 2200 -9918 13808 -18500 7204 8301 -19197 14565 -3698 -826
378 -826 2859 -286 -1389 1247 9617 -14099 14109 -3279 -10144 19000 -15537 4024 4302 -3318
392 -3318 5264 -3713 3261 -2959 10877 -7765 1578 11107 -14560 14684 -6304 -4383 10059 -9392
406 -9392 5829 -1883 335 -3324 6067 -128 -9504 15459 -11282 5006 3053 -13917 13989 -8030
420 -8030 -1821 2919 -2598 -2416 -199 5769 -13856 11277 -2523 -6614 13548 -16057 7188 3049
$$ packed form
326e46j2006L3423m0705K5145Q112l2065L4146k2331J517J1324l861j0043O090
339a800J4782l2584L0331j3768r620L2627l6020K1771k554j2196J4120o490J983
352E82r928K1269k0344N724J0098k7085L7573k4511j286K0795k1501J2313n421
365a722M283q468J0785k678j2118K3726l2308K5704J097k7498L3762j8263K872
378h26L685l145j103K636Q370k3716K8208j7388o865K9144l4537J9561K78p620
392c318Q582q977O974o220J3836j8642R343R529k5667K9244k0988J921J4442j9451
406i392J5221p712K218l659R391o195r376K4963k6741J6288j953j6970K7906k2019
420h030O209M740n517J82K217N968j9625K5133j3800m091K0162k9605K3245m139
$$ plain form
434 3049 -7878 2407 -1629 2598 -7042 6593 -6518 -213 7032 -11289 12818 -8081 -908
447 -908 10247 -9081 4152 -2662 2599 -2063 792 -1328 -4963 11625 -13002 6070 4551 -11030
461 -11030 13407 -5229 -390 2065 -93 1052 -1131 3622 -8907 11493 -4509 -6837 12716
474 12716 -11575 7738 902 -4676 6150 -2063 3002 -3079 5315 -5785 2511 6014 -11967 9978
488 9978 -5370 1253 5809 -9003 8127 -1313 731 -1442 2059 131 -4967 9419 -10746 4312
502 4312 1821 -8560 10086 -8655 287 3328 -797 -1698 -1647 5939 -7371 7165 -3689 -3436 9253
517 9253 -12186 6737 -1586 -6349 6010 -1981 692 -3365 4895 -3339 2122 2155 -8951 12246
531 12246 -6642 -1116 5334 -7697 5429 -3539 1032 -1516 184 2084 -2641 5918 -8259 6714
$$ packed form
434C049j0927J0285m036M227r640J3635j3111O305P245j8321K4107k0899P173
447i08J1155j9328J3233o814N261m662K855k120l635J6588k4627J9072j519j5581
461a1030K4437j8636M839K455k158J145k183M753j2529K0400j6002k328J9553
474A2716k4291J9313o836n578J0826q213N065o081Q394j1100Q296L503j7981K1945
488I978j5348O623M556j4812J7130r440K044k173L501j928n098J4386k0165J5058
502D312k491j0381J8646j8741Q942L041m125r01N1P586j3310J4536j0854K53J2689
517I253k1439J8923q323m763J2359p991K673m057Q260q234N461L3j1106K1197
531A2246j8888N526O450j3031J3126q968M571k548J700J900m725Q559j4177J4973
$$ plain form
545 6714 2371 -6905 7731 -6567 3084 300 -2949 1396 -652 3448 -6291 7110 -3554 -2624
559 -2624 10145 -9385 5671 -358 -2777 5000 -4194 346 -634 4904 -5845 1541 3419 -7607
573 -7607 9656 -5345 1433 5097 -6221 7030 -3653 -189 193 1321 661 -4244 4627 -5329
587 -5329 5054 -1655 -4375 8767 -6806 3649 563 -2724 1503 -1107 3404 -5969 4412 -2979
601 -2979 -2495 5462 -10174 5844 493 -2972 2929 -2148 1941 -2866 3156 -3456 590 2085 -6165
616 -6165 7151 -7599 743 4694 -6000 5130 -3689 1711 1433 -1125 184 -640 5378 -5799
630 -5799 4518 -936 -4117 6656 -5729 3608 -792 -1277 3432 -1991 2386 -3525 5492 -1355 -2140
645 -2140 4979 -6034 4818 -2070 -1242 3463 -3217 2780 -1685 2351 -3041 2104 3647 -5336 6303
$$ packed form
545F714m343r276J4636j4298R651k784l249M345k048M100r739J3401j0664R30
559b624J2769j9530J5056o029k419P777r194M540r80N538j0749P386J878j1026
573g607J7263j5001O778L664j1318J3251j0683L464L82J128o60m905Q871r956
587e329J0383o709k720J3142j5573J0455l086l287M227k610M511r373J0381p391
601b979M84P957j5636J6018n351l465N901n077M089m807O022o612M046J495q250
616f165J3316j4750Q342L951j0694J1130q819N400k78k558J309q24O018j1177
630e799J0317n454l181J0773j2385R337m400m85M709n423M377n911R017o847p85
645b140P119j1013J0852o888Q28M705o680N997m465M036n392N145J543q983J1639
$$ plain form
660 6303 -4749 2160 2381 -6781 5663 -2521 264 -64 -363 77 -1561 4342 -4727 3691 -853 -2293
676 -2293 6085 -7032 2933 69 -1389 1721 -3837 2825 -2642 2150 -2451 -601 3655 -5388 5111
691 5111 -2741 -1668 2981 -2653 2127 -3106 1698 -1840 832 593 -4817 6443 -4075 784 2697
706 2697 -3893 4559 -2665 1464 -284 -733 1064 -709 2618 -4851 4187 -222 -2257 4481 -4892
721 -4892 4777 -80 -1841 3309 -1741 2460 -1476 2628 -1996 53 3191 -4354 4348 -3123 545
736 545 3476 -3656 2298 -1295 2359 -1532 418 1305 -3650 4210 -4080 1272 845 -3950 4589 -2701
752 -2701 257 -227 227 1116 -2409 2457 -2913 3625 -1749 -2241 4290 -5363 3081 -639 -2085 1658
768 1658 -1737 2076 -2071 1566 -1707 1055 2373 -5043 3990 -1865 -252 1191 -3319 2610 -1882
$$ packed form
660F303j1052O909K21r162J2444q184K785l28k99M40j638N903r069Q418m544j440
676b293Q378j3117R965k864j458L110n558O662n467M792m601J850M256r043J0499
691E111p852J073M649n634M780n233M804l538K672k39n410J1260j0518M859J913
706B697o590Q452p224M129j748m49J797j773L327p469R038m409k035O738r373
721d892R669m857j761N150n050M201l936M104m624K049L138p545Q702p471L668
736E45K931p132N954l593L654l891J950Q87m955P860q290N352m27m795Q539p290
752b701K958m84M54Q89l525M866n370O538n374m92O531r653Q444l720j446L743
768A658l395L813m147L637l273K762J318p416R033n855J613J443m510N929m492
$$ plain form
783 -1882 1237 -879 -90 899 -2238 4326 -3724 1134 1748 -2529 3084 -3297 1561 609 -407 450
799 450 -1103 3139 -2542 3083 -748 -1212 4096 -3333 3718 -1437 -1416 2698 -1653 850 -1852 2547
815 2547 -1461 -65 1900 -3267 4501 -1899 488 2139 -3076 2503 -1282 580 -1323 150 1245
830 1245 -2790 1786 -3086 2401 646 -3275 3100 -2497 1232 -472 -879 300 -1694 2206 -2744
845 -2744 1479 -1899 -1311 3320 -4010 1815 -694 -336 1345 -2416 1632 -983 1476 -1453 -303 1271
861 1271 -3358 3692 -2088 -361 1619 -1741 2798 -1776 834 -24 648 494 -1844 3091 -2299 1423
877 1423 54 -2025 2490 -2801 1794 -51 -994 1197 -653 2124 -2567 2022 76 -721 2006 -3582
893 -3582 2440 -973 -761 1585 -1746 1641 -1241 1347 -943 134 1773 -1801 2718 -2680 620
$$ packed form
783a882L119k116P89R89l137O564q050M858O14m277N613o381M858r52j016Q57
799D50j553M242n681N625l831m64N308p429P051n155K1M114m351K503k702M399
815B547m008J396J965n167P768o400K387J651n215N579l785J862j903J473J095
830A245m035M576m872N487j755l921O375n597L729j704m07J179j994L900m950
845b744M223l378N88M631p330N825k509L58J681l761M048k615K459k929J150J574
861A271m629P050n780J727J980l360M539m574K610q58O72j54k338M935n390L722
877A423j369k079M515n291M595j845r43K191j850K777m691M589j946p97K727n588
893c582O022l413K12K346l331L387k882K588k290J077J639l574M519n398L300
$$ plain form
908 620 1828 -2687 1650 -1542 1045 -478 -314 601 -1292 2158 -2276 1626 -80 -1937 2667 -2396
924 -2396 864 -841 -461 1067 -1954 908 -1547 1660 -931 -937 2405 -2439 2374 -1153 -191 997
940 997 -1761 1943 -1597 477 -713 327 1466 -2180 2341 -1099 800 941 -1882 2472 -930 821
956 821 -276 -208 72 -1035 2485 -2128 1123 666 -1023 2075 -2217 1847 72 -146 947 -1479 1436
973 1436 -1401 1232 -711 -763 1208 -2123 2284 -1399 -665 1804 -1340 1045 -1149 939 -202 -118
989 -118 459 -2024 2186 -1803 584 711 -1852 1661 -997 684 -791 -478 954 -1192 1079 -2125
1005 -2125 1299 -74 -1370 1545 -2106 1286 -742 -612 754 -1247 1106 -863 1046 -928 -154
1020 -154 1901 -2007 1232 -1236 100 658 -1850 1437 -1044 805 -350 -25 801 -1354 2166 -966
$$ packed form
908F20J208m515M337l192K587j523J64R15j893L450m434L902j706j857M604n063
924b396L260j705L80J528l021K862k455L207k591oL342m844M813l527R62J188
940I97k758L704l540K074j190J040J139l646M521l440J899J41k823M354l402J751
956H21j097O8K80j107L520m613L251m57j689L098m292M064j775k18J093k426K915
973A436k837K633j943n2J971l331M407l683P34K469l144K385k194K088j141Q4
989a18N77k483M210l989K387J27k563L513k658J681j475L13J432k146K271l204
1005b125L424j373j296K915l651L392k028J30J366k001K353j969J909j974P74
1020a54K055l908L239k468J336N58k508L287k481J849j155L25Q26k155L520l132
$$ plain form
1036 -966 466 403 -875 1689 -1655 552 -84 133 477 -1012 1457 -957 1294 64 -578 1699 -1930
1053 -1930 1469 -278 -721 651 -456 1004 -1462 693 -338 152 894 -2053 1963 -1026 -38 785
1069 785 -1597 1057 -1112 892 -666 -384 523 -930 1293 -1536 550 606 -1170 1516 -1268 918
1085 918 -136 -477 382 -875 1173 -1325 687 -449 -1129 1490 -1142 810 -492 1 1170 -632
1101 -632 789 -778 1150 -587 -114 1027 -1705 1281 -828 185 604 -1197 1760 -850 366 -483
1117 -483 56 781 -870 1232 -1084 983 193 -1345 1530 -1304 806 -40 -161 622 -528 1118 -1097
1134 -1097 640 -49 -341 1221 -1524 951 -297 43 758 -867 1039 -376 383 -48 -228 575 -1285
1151 -1285 1088 -943 -178 536 -794 1400 -989 354 -109 -194 362 -572 1303 -845 499 -170 -954
$$ packed form
1036i66J432o3j278K564l344K207o36K17L44j489K469k414K251j230o42K277l629
1053a930L399j747m43J372j107J460k466K155j031M90P42k947M016k989R88Q23
1069G85k382K654k169K004j558K82R07j453K223k829K086N6j776K686k784K186
1085I18j054l41Q59j257K048k498K012j136o80K619k632J952j302M93J169j802
1101f32J421j567J928j737M73J141k732K986k109J013M19j801K957k610J216q49
1117d83N39P25j651K102k316K067p90j538K875k834K110q46j21P83j150J646k215
1134a097J737o89k92J562k745K475j248L40P15j625J906j415P59m31j80Q03j860
1151a285K373k031P65P14j330K194k389J343m63q5N56r34J875k148J344o69p84
$$ plain form
1168 -954 949 -934 900 -176 -447 517 -833 710 -944 604 192 -489 816 -1049 1084 -477
1184 -477 -50 664 -1218 688 -477 425 -443 -117 1113 -1178 954 -844 323 622 -969 863 -649
1201 -649 551 131 -368 318 -864 1219 -871 411 265 -649 1224 -1266 519 264 -22 272 -848
1218 -848 709 -489 366 -209 -545 924 -921 1120 -265 -111 579 -339 730 -747 281 -78 -33
1235 -33 397 -998 646 -586 -124 337 -941 917 -806 440 135 -282 253 -541 1027 -987 426
1252 426 111 -659 693 -929 406 -77 -291 448 -588 380 -361 500 -278 -171 905 -634 469 -426
1270 -426 -33 801 -528 528 -411 362 -279 -74 329 -402 549 -485 247 252 -609 557 -256 310 -398
1289 -398 -356 420 -668 592 -756 396 126 -607 790 -729 374 -46 -62 345 -801 749 -399
$$ packed form
1168i54J903j883J834j076k71R64j350J543j654J548m12o81J305j865K133j561
1184d77M27P14j882J906j165R02q68L26J230k291K132j798J167K99j591J832j512
1201f49J200m20m99O86j182K083k090J282j46r14J873k490J785k55k86K94j120
1218h48J557j198Q55n75l36J469j845K041j385J54O90r18J069j477J028l59M5
1235c3M30j395J644j232M62M61j278J858j723J246l05m17N35p94J568k014J413
1252D26l15p70J352j622J335m83k14P39j036R68p41Q61p78J07J076j539J103q95
1270d26L93Q34j329J056r39P73o41K05M03p31R51j034P32Nq61J166q13N66p08
1289c98M2P76j088J260j348J152k70p33J397j519J103m20j6M07j146J550j148
$$ plain form
1306 -399 476 -23 -106 577 -890 502 -190 -171 316 -559 712 -541 54 -165 -217 338 -543 906 -389
1325 -389 243 317 -304 583 -481 526 -156 -89 276 -539 488 -381 425 204 -375 447 -711 592 111
1344 111 -231 87 -545 539 -642 419 31 -172 408 -605 513 -315 -94 537 -550 338 -112 229
1362 229 -123 -34 375 -478 286 -620 241 54 -356 619 -182 33 -65 -192 332 -486 528 -307 -109 -23 -475
1383 -475 454 -661 393 -113 101 435 -568 322 -295 396 270 -279 372 -617 423 -269 -106 146 -488
1402 -488 521 -248 -182 419 -188 261 -390 565 -371 229 201 -422 83 -711 641 14 -330 26 -423 409
1422 409 -165 94 -11 -389 254 -714 332 15 -17 430 -304 561 -270 184 37 -81 468 -57 665 -444
1442 -444 155 84 -168 286 -537 270 -62 -3 374 -318 587 -185 262 -3 -578 14 -243 360 -102 78 174
$$ packed form
1306c99Q75m99q3O83j467J392o92J9M87q75J271j253N95k19n2N55q81J449j295
1325c89O32P4o21Q87j064J007o82O7L65q15J027q69Q06k21n79Q22j158J303m81
1344A11l42L18o32J084j181J061l88k03N80j013J118q28K21O31j087Q88m50L41
1362B29l52Q9M09q53P64r06Q61j87m10R75q01K15r8j27N24q18J014q35J98Q6m52
1383d75R29j115J054n06K14L34j003Q90o17O91j26n49O51r89J040o92J63K52o34
1402d88J009p69O6O01o07M49o51R55r36O00k8o23N05p94J352o27l44L56m49Q32
1422D09n74K59j05l78O43r68J046l17l2M47p34Q65q31M54j47j18N49n25P22j109
1442d44N99p1k52M54q23Q07l32N9L77o92R05p72M47k65n75N92k57O03m62J80R6
$$ plain form
1463 174 -168 355 -371 -10 131 -130 214 -317 366 -162 -50 193 -208 275 -48 -90 56 -40 143 -470 365
1484 365 -177 -56 23 -104 325 -326 92 287 20 313 -424 319 82 42 164 -123 537 -537 -98 10
1504 10 -302 125 -232 316 -288 21 22 -125 281 -102 498 -36 -203 74 -59 155 -234 2 -92 -44 -15 -42
1526 -42 469 -152 388 173 -466 395 -55 118 -176 -153 360 105 385 -241 183 49 -197 455 -501 35 69
1547 69 -133 251 -109 101 -76 67 38 -124 170 -366 78 -187 87 516 -171 152 -91 31 -55 150 -76
1568 -76 -262 266 -338 152 220 -116 27 -119 -75 99 -22 136 -313 110 -383 0 41 -279 502 -359 190
1589 190 -31 -294 172 9 60 -141 0 132 -230 325 -361 178 -245 105 151 137 137 -366 100 72 -177 239
1611 239 -7 270 -270 41 261 -477 231 69 142 117 19 233 -23 221 38 89 -159 -10 113 -40 71
$$ packed form
1463A74l42N23p26L61J41k61L44n31O83n28J12K43m01M83l23m2J46r6J83o13Q35
1484C65n42J21P9j27M29o51M18J95k67K93p37P43k37m0J22k87O60j074M39J08
1504A0l12M27l57N48o04L09Jj47M06l83O00n34j67K77j33K14l89K36r4M8K9k7
1526d2N11o21N40k15o39Q61m50J73k94K3N13k55K80o26M24j34k46O52r56N36L4
1547F9k02L84l60K10j77J43k9j62K94n36M44k65K74M29o87L23k43J22q6K05k26
1568g6j86N28o04M90O8l36J43j46M4J74j21J58m49M23m93L83M1l20P81q61N49
1589A90k21k63M66j63N1k01J41J32l62N55o86N39m23L50M6j4%n03M66k8k49M16
1611B39k46K77n40L11K20p38P08j62P3k5r8K14k56K44j83N1k48J49J23j53J11
$$ plain form
1632 71 67 3 -43 -266 28 -55 37 293 -414 32 -138 281 223 229 319 83 354 27 244 26 29 469 -34 354
1656 354 37 197 116 -9 260 -219 -96 31 -259 239 -122 32 -53 53 -161 155 401 -438 165 -361 -61
1677 -61 51 70 325 -152 -25 -28 85 129 -90 310 37 188 56 -420 -8 53 -33 17 -63 90 -338 -31 -40 103
1701 103 232 -230 16 67 89 -81 -8 76 -81 334 5 7 100 -84 62 84 -109 -18 99 152 -53 -148 -211 122
1725 122 35 -40 215 79 -106 63 -64 -160 -210 98 -112 114 -88 123 6 28 -56 -255 12 231 99 228
1747 228 -369 -287 -32 76 169 -405 164 115 86 207 -152 94 -92 197 -193 -66 -26 26 40 -64 116 16
1769 16 38 -224 -233 -54 -74 71 -196 -285 73 -93 -21 -124 9 235 -243 213 104 135 32 -145 67 -57 -48
1792 -48 0 41 -90 -302 343 236 227 106 -152 165 -35 -22 -174 -238 -75 50 -113 36 -188 -186 58 78 -72
$$ packed form
1632G1mo4m6k23K94q3R2K56p07M46j70M19n8OR0k36K71l27K17k18LM40n03L88
1656C54l17J60q1j25K69m79J23J27k90M98l61J54q5J06k14L16K46q39O03n26L00
1677f1J12J9K55m77J27lJ13M4k19M00k73J51j32m76M12O1q6N0q0J53m28L07rJ43
1701A03J29m62K46N1K2j70P3Q4j57M15l29KR3j84J46K2j93R1J17N3k05r5o3L33
1725A22q7p5K55j36j85J69j27r6n0L08k10K26k02K11j17K2q4j99K67K19j32J29
1747B28n97Q2K55J08R3n74N69m9k9J21l59K46j86K89l90J27M0N2J4j04J80j00
1769A6K2k62rJ79k0J45k67q9L58j66P2j03J33K26m78M56j09L1j03j77K12j24R
1792d8M8M1j31k12O45j07rj21k58L17k00J3j52o4J63J25j63J49k24KK44K0j50
$$ plain form
1815 -72 -51 52 -16 79 -365 256 113 84 57 -70 82 -149 -153 -107 -4 283 -134 -26 85 -2 120 37 -16 92
1839 92 -5 -87 -227 107 -160 0 -106 191 -82 150 178 -306 194 60 189 102 46 249 119 191 196 -35 -113
1862 -113 -69 134 -34 86 301 169 -259 -66 190 -227 125 240 148 -109 112 71 270 -414 -63 -239 66
1883 66 -47 48 -40 -342 206 -92 278 80 -172 86 -296 180 -265 172 0 100 314 -142 203 -118 35
1904 35 152 -188 131 22 88 -30 -100 -77 -66 -110 -45 -24 -41 -192 -35 -200 14 -256 -3 389 -135 -77 -120 99
1928 99 237 -42 139 -356 362 392 121 -52 147 -248 -120 -32 152 127 -107 -27 0 -43 -22 383 78 12 -270
1951 -270 -206 219 -10 45 14 55 306 9 37 -128 86 -131 82 98 -66 228 -160 -287 -188 250 -80 -166 160
1974 160 143 181 -4 -150 208 -126 -191 73 -183 13 -219 -138 -8 -41 -38 -150 366 -279 11 119 3 -37 -67
$$ packed form
1815g2K1J03o8R5m44O21j43k9k7j27J52k31mM6J03K87m17J08J11q7J22q3n3J08
1839I2r7q2j40L34k67J60j06K97k73K32K8m84N00j34J29q7n6K03j30P2Nk31p8
1862a13M4K03j68J20K15j32m28J93K56m17L52J15r2k57K21m1J99o84L51j76L05
1883F6j13R5q8l02N48k98L70j98k52K58l82M76m45M37j72J00K14m56L45l21J53
1904C5J17l40L19j09O6j18p0K3J1m4O5K1j7j51J57j65K14k70K53L92n24N8m3K19
1928I9J38k79J81m95P18L0k71j73J99l95J28Q8J84k5k34Q0K7m3K1M05l05o6k82
1951b70O4M25k29N5l1M1K51k97K8j65K14k17K13J6j64K94l88j27R9M38l30q6L26
1974A60j7L8j85j46L58l34o5K64k56J96k32Q1J30l3Lj12N16o45K90J08j16m0l0
$$ plain form
1997 -67 12 -265 -150 -158 93 -29 -251 138 -146 236 12 -84 12 -141 135 294 -38 100 -50 182 191 -72 -237
2020 -237 -347 140 -140 325 -185 332 163 93 95 -172 -101 -68 149 39 -7 -37 84 182 -73 -241 24 31 89 176
2044 176 -230 -29 -152 207 1 78 24 33 -165 -117 210 -240 -33 50 82 -4 -5 -138 276 -37 -83 139 -49 -21
2068 -21 -248 -21 -206 185 7 -113 -99 108 -260 -340 141 -22 222 -260 35 39 -72 127 155 66 -8 13 351
2091 351 65 118 -266 -119 168 -87 -84 180 65 -19 -213 174 -84 -11 60 -145 45 -56 143 -238 -215 -62
2113 -62 -176 98 -157 47 98 135 177 143 31 256 40 137 -123 -11 53 -133 68 -185 30 -178 -190 59 -90
2136 -90 169 -111 -198 56 67 128 -155 -1 256 -131 128 81 32 -514 -89 -51 166 -30 -83 -345 26 -130 81
2159 81 -8 211 91 -118 34 18 90 118 167 -178 11 -9 -55 29 -79 -112 -18 -179 -64 -176 -173 107 296 14
$$ packed form
1997f7P9k77J15qK51j22k22L89k84L82k24r6R6j53K76J59l32J38j50K32Rk63j65
2020b37j10M87k80M65n10N17j69p0Kk67P1L3K17j10m6l0J21R8k55j68K65PN8Q7
2044A76m06K01j23L59k06P7n4Rj98M8L27m50K07Q3L2q6jj33M14l13m6K22j88K8
2068b1k27K27j85L91j78j20J4K07l68q0M81j63K44m82K95Mj11J99K8q9p4K1L38
2091C51k86N3l84J47K87k55LK64j15q4j94L87k58P3P1k05J90j01J99l81K3J53
2113f2j14K74k55K04N1L7M2l4j12K25k16R7k60J12O4j86K01k53K15k08j2K49j49
2136i0K59k80q7K54J1O1k83J54K57l87K59m7m9n46M25L8K17j96n3k62L71j56K11
2159H1q9K19j20k09J52j6P2K8M9l45J89k0m6Q4j08l3R4j61J15j12LK80J89k82
$$ plain form
2183 14 66 -49 -145 -11 -206 -183 -105 18 43 3 2 107 -39 82 -68 222 -77 -186 -26 -30 -154 -160 -32 33 -127
2208 -127 -17 128 -122 -51 -71 122 -4 44 57 5 199 121 -154 7 -49 104 102 -146 -86 107 -45 56 -141
2231 -141 -139 142 -14 74 20 21 -31 362 -131 -106 -94 -250 235 -87 311 126 5 -82 -193 -122 130 -257 364 118
2255 118 -86 55 -364 -220 273 -127 -378 -246 -72 -243 -115 198 152 -116 -253 131 -107 10 193 -227
2275 -227 -150 26 61 -187 63 -96 -51 -303 -44 47 -225 15 100 -24 31 74 26 -49 144 -68 287 44 -97
2298 -97 249 -98 157 28 -17 -213 -52 -4 -3 -49 -105 -32 92 -100 80 23 -284 154 -84 -185 17 129 33
2321 33 212 77 -223 46 195 28 -43 -50 107 134 -242 82 -60 84 31 42 150 -28 -98 -58 125 -154 -50
2344 -50 33 23 40 -117 98 9 60 -206 204 -23 -10 59 95 -81 163 -332 -106 107 -73 101 187 97 -24 -69
$$ packed form
2183A4N2j15r6J34j95K3P8J23K5m0jJ05j46J21j50K90k99j09J60mj24oJ28O5j60
2208a27J10J45k50P1k0J93j26M8J3n2J94p8k75J61n6J53kk48O0J93j52J01j97
2231a41KK81j56Q8n4Jn2L93m93K5J2j56M85l22L98j85j21q7j11P1K52l87O21k46
2255A18k04J41m19J44M93m00k51J32J74j71J28L13m6k68j37L84k38J17J83m20
2275b27P7J76L5k48K50j59M5k52K59R1k72K40Q5j24N5M3m8p5J93k12L55k43j41
2298i7L46l47K55j29m5j96J61M8Jm6n6P3J24j92J80n7l07M38k38j01K02J12r6
2321C3J79j35l00K69J49j67p1pJ57K7l76L24j42J44n3J1J08j78p0M0J83k79J04
2344e0Q3j0J7j57K15q9N1k66M10k27J3O9L6j76K44m95K26K13j80J74Q6r0j21m5
$$ plain form
2368 -69 -107 126 -74 73 71 -81 -342 78 -32 -74 -189 232 70 -55 134 -1 178 252 10 -80 -303 40
2390 40 -136 -187 24 -170 -50 -150 218 117 -193 230 -84 50 -317 29 -34 50 -26 -140 1 -190 -296 -72
2412 -72 132 138 -58 55 179 -34 110 -241 128 143 83 48 144 284 -110 -187 5 104 -106 11 -114 5 104
2435 104 -103 65 -108 -93 45 -95 172 13 -4 140 -157 34 30 -11 61 -302 -58 -121 -17 156 -88 89
2457 89 13 142 -233 -186 123 -112 43 118 -60 -267 -95 264 23 -54 80 123 -4 -90 -157 84 -82 -102 -149
2480 -149 -55 -55 142 313 -33 -42 96 209 -176 158 129 -56 226 -30 36 -11 -14 -112 -132 -29 -144 -78 -25 -234 -194
2505 -194 -200 -66 327 -86 -173 -46 93 -114 328 69 45 99 56 -43 11 203 -106 -165 -275 -174 109 217 157
2528 157 -43 -171 32 -268 132 -90 214 -49 -123 213 -5 204 93 119 112 -98 -87 44 45 46 -31 114 -460
$$ packed form
2368f9l8K33k00J47kj52k61M20j10m2j15M21j62j25J89j35J79P4k42r0k23L43
2390D0j76n1K11j94J20j00L68j01l10M23l14J34l67L46o3Q4p6j14J41j91j06K24
2412g2K04Oj96J13J24k13J44l51L69J5o0l5R6J40l94p7J92R9k10J17j25J19R9
2435A04k07J68j73J5J38j40K67j59j7J44k97J91mm1P2l63K44o3J04J73k44J77
2457H9p6J29l75M7L09k35J55P5j78k07J72L59k41p7J34M3j27q6o7K41j66k0m7
2480a49R4%J97J71l46rJ38J13l85L34k9j85K82k56O6m7lr8k0J03j15O6N3k09M0
2505a94oJ34L93m13q7J27J39k07M42k59k4N4m3r9N4J92l09n9j10J01K83J08o0
2528A57k00j28K03l00M00k22L04k63p4L36k18K09j11K6pk10J1J31JJp7J45n74
$$ plain form
2551 -460 19 -12 12 -33 9 21 -4 -263 120 13 144 117 -49 130 94 -42 30 -194 -108 -149 274 29 50 -201
2575 -201 58 -6 37 -57 -145 -108 113 34 55 45 48 -143 168 -162 -54 338 166 258 -22 230 -102 -119 -137 -116 17
2600 17 45 253 197 -32 85 37 -27 240 -56 43 75 124 -266 -14 232 69 128 -92 -84 -207 135 117 77 408
2624 408 154 88 347 -68 266 -161 99 22 -5 -55 88 117 31 -44 75 191 9 -35 129 18 186 182 75
2647 75 -115 -31 -83 -184 23 39 -203 -113 230 -316 71 35 -137 -93 -24 52 147 -82 35 56 145 152 82 -263 101
2672 101 -243 37 -3 28 -227 -3 134 -246 -196 108 81 -275 164 27 7 -81 -150 0 3 267 123 232 -85
2695 -85 116 21 158 -246 14 -70 -181 138 -67 199 -63 -117 46 111 104 -166 -178 40 60 80 -134 -159 -71 115
2719 115 52 -17 -92 146 20 149 50 -217 -192 32 -89 66 -99 190 -263 -5 70 -71 25 105 43 -16 141
$$ packed form
2551d60M79l1K4m5M2J2k5k59L83j07J31k7j66J79l6j36P2k24Q6m1M23k45K1k51
2575b01K59o4M3r4q8L7K21p9K1j0Lj91L11l30J08L92j72R2k80K52l32j7j8K1J33
2600A7K8K08n6k29J17m8o4K67k96R9L2M9l90K52K46j63N9k20Qj23L42j8m0L31
2624D08k54o6K59m15L34m27K60p7k7n0J43K9q6p5J19J16j82m4J64j11J68mj07
2647G5j90Q4n2j01K07J6k42R0L43n46L87l6j72M4O9P6R5k29J17K1Q9Pp0l45L64
2672A01l44K80m0L1k55K24J37l80N0L04k7l56M39j37k0q8o9J50LK64j44J09l17
2695h5K01r5J37m04K60q4j11L19k05K66k62n4J63O5pk70j2K18K0K0k14k5Q8J86
2719A15o3o9p5K38j26J29r9k67K5K24j21J55j65K89m53K58P5j41R6Q0o2n9J57
$$ plain form
2742 141 -184 225 98 -256 -270 -189 -22 -15 -77 127 -94 -53 78 34 -328 -107 166 160 -61 -25 -106 -195 36 171
2766 171 228 185 48 -6 23 -52 -85 -40 63 -86 204 63 -85 150 -58 -82 -55 -89 65 192 156 -188 67 49
2790 49 -25 -194 64 42 -212 -91 76 53 8 -145 350 70 -108 -60 9 -143 -233 114 -219 -36 329 58 93
2813 93 -4 37 -35 183 -171 -87 125 265 123 -64 214 9 65 -25 15 -176 86 183 9 -64 -200 22 16 161
2837 161 221 280 -44 157 -72 -133 -6 190 122 -290 -57 9 45 0 34 -84 84 -133 89 20 60 182 -66
2860 -66 8 -119 -36 124 100 54 -65 -25 23 5 -232 -81 -95 75 160 -81 -264 -166 -239 -25 -154 151 -49 -134
2884 -134 -42 -137 -70 244 255 185 105 154 -117 196 44 19 -161 159 -103 -15 -40 -171 -25 -52 99 20 -48 17 123
2909 123 103 423 -30 -103 -373 -3 -98 -174 159 -162 123 -259 186 341 7 8 -17 11 129 -80 67 -48 119
$$ packed form
2742A41l25M09j27l54j4Q1J67Po2K04k21M1J31m4l62K21K73ok21L6q1q9K31J35
2766A71N7m3j37n4K9p5l3M5J03j49K90j41j48K35k08k4K7l4J54J27l6l44K55j8
2790D9p4j69K58k2k54J21J67k3m5j53M95k80j78M8O9j52r0L47l33J83L65k71L5
2813I3r7M1p2K18l54Q4K12J40j42j87K78k05N6r0M0j91K62R7j74p3j36K22oJ45
2837A61O0N9l24K01k29o1J27J96o8m12K33O6L6m5L4j18J68k17K22o9M0J22k48
2860f6P4j27Q3J60k4m6j19M0M8j8k37J51j4J70Q5k41j83R8p3K14j29L05k00q5
2884a34R2r5O7L14J1p0q0M9k71L13j52k5j80L20k62Q8k5j31J46k7J51p9o8O5J06
2909A23k0L20m53p3k70L70r5p6L33l21K85l82M45J55l34Jk5K8J18k09J47j15J67
$$ plain form
2932 119 -202 -23 -90 -161 -60 -60 -205 80 -45 46 4 -63 -9 -120 -40 -108 129 -50 140 -66 -136 108 20 -172
2956 -172 -221 -2 -21 40 27 -136 83 -33 -230 106 10 169 -96 182 146 18 286 73 -231 -19 241 -264
2978 -264 -34 -97 -57 -73 -135 7 -47 -180 245 296 -78 -69 -169 4 122 35 155 97 -135 -127 -80 1 -46 -21 99
3003 99 52 -15 -129 41 -221 -320 77 59 44 97 -154 -219 -139 -83 -121 127 123 46 -39 -26 -204 -100 -102 -92 -128 5 -77
3030 -77 -129 3 127 38 118 -9 -129 201 -93 -250 -93 -111 94 -10 203 -284 218 144 155 324 -168 -80 -124
3053 -124 96 -149 -84 153 226 246 -191 -61 91 96 156 -65 145 43 -79 133 433 -158 -6 59 180 -25
3075 -25 2 -81 -42 -64 150 -146 -196 18 362 -56 185 30 -5 -164 -144 -23 334 -56 -208 229 67 80 -77
3098 -77 3 151 -306 -46 113 -308 5 -187 113 24 205 132 310 -26 79 -199 -235 118 72 -41 16 -4 -47
$$ packed form
2932A19l21J79o7p1J01%j45K85j25R1m2o7N4j11Q0o8K37j79J90k06p0K44q8j92
2956a72m9K19j9O1j3j63K19j16j97L36r6J59k65K78l6j28K68k13l04K12K60n05
2978b64K30o3M0j6o2J42n4j33M25N1l74Rj00J73J18q7J20n8k32QM7Q1m7K5J20
3003I9m7o7j14J70k62r9L97j8j5N3k51o5Q0N6l8K48mp7q5J3j78J04kJ0l6J33q2
3030g7n2J32J24q9Q0j27j20L30k94j57J57j8K05j04K13m87N02p4J1J69m92Q8m4
3053a24K20k45O5K37P3K0m37J30J52NO0k21K10j02j22K12L00n91J52O5J21k05
3075b5K7q3L9k2K14k96n0K14L44m18K41j55l5j59K0J21L57l90j52M37j62J3j57
3098g7Q0J48m57K60J59m21L13j92L00q9J81p3J78l36J05k78l6L53m6j13N7k0m3
$$ plain form
3121 -47 135 -110 103 -37 13 106 304 -142 68 -194 -192 148 145 -43 226 -134 200 -76 16 154 142 -66 13
3144 13 -311 -37 29 -247 129 -232 -54 125 69 -85 114 25 122 -115 -157 58 -20 31 43 165 137 -212 87
3167 87 168 -86 -114 -147 -52 124 233 -201 -43 218 -155 -96 -206 248 -212 111 -28 160 -119 78 60 116 75
3190 75 71 109 192 243 124 -210 132 327 -17 -161 -228 92 -82 -102 -244 107 38 -21 -170 -80 137 160 -88 -168
3214 -168 16 -87 43 163 45 192 -206 181 94 81 39 25 -12 327 14 99 -143 -141 196 -49 136 -163 -219
3237 -219 80 -165 -249 28 -64 195 82 -5 -49 139 24 -75 80 91 -61 -71 8 -178 13 108 38 86 -140 265
3261 265 416 -91 73 -208 32 -281 -114 -80 46 108 -219 -66 92 101 -255 183 -32 -166 -301 3 -6 165
3283 165 50 -156 -55 -43 -216 -209 -162 114 -185 92 -12 35 11 120 15 -216 -21 116 315 395 59 29 -89
$$ packed form
3121d7J82k45K13j40N0R3J98m46K10k62KL40lj88K69l60L34k76R2J38j2k08P9
3144A3l24K74O6k76L76l61J78J79n6j54J99q9R7k37m2K15p8N1J2J22k8l49K99
3167H7Q1k54k8l3R5J76J09m34J58K61l73N9j10M54m60L23j39J88k79J97j8N6m1
3190G5mL8Q3N1j19l34L42J95l44j44o7L20j74k0j42L51o9n9j49R0K17K3k48q0
3214a68J84j03J30J20j18J47l98L87q7j3m2j4l7L39l13Q5k42KL37k45J85k99n6
3237b19K99k45q4K77r2K59j13q7m4J88j15r9J55J1j52j0P9j86J91R5p0M8k26M05
3261B65J51n07J64k81K40l13J67L4J26O2l27J53J58Rl56M38k15j34j35L04rJ71
3283A65j15k06J01J2j73PM7K76k99K77j04M7k4J09j05k31J95J37J99Q0l36l0j18
$$ plain form
3306 -89 210 -185 -61 -136 -102 34 -356 179 -7 -22 273 -60 -180 69 -117 226 4 145 89 1 12 243
3328 243 242 -173 82 -2 -31 -207 -296 28 -206 -100 6 -128 41 -167 79 17 -41 107 -81 199 84 247
3350 247 -127 -29 51 133 183 -22 93 -183 -250 -10 -280 218 64 13 5 -34 91 137 -131 -160 -125 252 -47 113
3374 113 -118 -106 47 258 -56 -45 2 -150 -119 -6 98 -77 85 210 76 273 -52 -290 52 -153 255
3395 255 -179 -185 -75 -64 69 -31 25 62 -65 31 -158 -47 -139 -159 177 -73 -243 -93 -263 371 24 193 -265
3418 -265 50 149 -54 83 -119 182 -79 3 99 -183 -5 119 44 -27 365 -47 -172 56 -72 144 7 137
3440 137 -63 85 -141 -76 -104 142 259 119 32 -213 57 -162 153 -71 5 234 -146 18 73 -76 -56 -28
3462 -28 12 16 38 -80 -55 45 243 -81 34 -111 -265 53 306 161 13 -96 -19 -160 -213 238 -144 46 -8
$$ packed form
3306h9K99l95J24p5L4J36l90N35j86j5K95l33j20K49j86L43k22J41n6q8J1K31
3328B43jm15K55q4k9j76q9L24k34J06J06j34J69k08K46o2n8J48j88K80j15J63
3350B47l74R8Q0Q2N0k05J15k76o7K40k70M98j54n1ql9J25M6k68k9L5L77k99J60
3374A13k31J2J53K11l14J1M7j52L1J13J04j75J62J25j34J97l25k38L42k05M08
3395B55m34oJ10J1J33j00N6L7j27R6j89J11r2k0L36k50j70J50j70O34l47J69m58
3418b65L15R9k03J37k02L01k61Q2R6k82J78J24p5p1L92m12j25K28j28K16j37J30
3440A37k00J48k26O5k8K46J17j40q7k45K70k19L15k24P6K29l80J64N5j49K0K8
3462b8M0MK2j18K5J00J98l24J15j45j54L18K53j45j48j09P7j41n3M51l82J90n4
$$ plain form
3485 -8 -45 241 -165 271 301 -123 169 -83 105 49 21 -57 -259 158 -10 283 -1 -192 -212 9 -86 -194 -9
3508 -9 -189 -189 -104 108 88 -33 -115 -181 -43 157 229 -12 -132 -185 89 49 -105 -95 127 11 121 -304 -127 16
3532 16 -72 -121 -17 -102 -121 -272 -152 216 -154 -129 -118 116 -77 8 -146 -250 227 -26 134 -73 170 -94 190
3555 190 -27 3 27 160 25 306 -56 286 -463 -182 56 109 -192 -187 65 -236 67 -4 -139 -137 -224 39 45 -43
3579 -43 62 -82 -2 226 -64 -328 -112 22 41 -23 -135 26 199 54 -19 -161 -83 35 97 65 263 104 -97
3602 -97 -17 -139 -175 -43 -135 -82 98 -9 -159 -146 2 55 -90 -178 -285 -111 -92 -149 -151 217 -52 213 295 78
3626 78 -215 48 164 35 -140 172 52 -127 -29 -376 280 140 -116 -96 140 2 -2 122 53 97 -49 -76 104
3649 104 33 -35 -128 -10 2 223 62 -11 -74 42 3 159 238 8 182 288 8 18 -33 287 -233 -47 -17 67
$$ packed form
3485hl7K86m06M36L0m24K92k52J88n6k8p8k02M17j68K93k84j91k0K21r5j08J85
3508ij80%Q5K12k0j21q2o6J38K00P2k41j20n3K74m0j54J0K22j16J10m25J77J43
3532A6q8m9J04q5j9j51J20L68l70K5J1K34j93Q5j54j04M77k53J60k07K43k64K84
3555A90k17L0K4J33j35K81l62L42p49K81K38N3l01NK52l01L03p1j35Kq7K63Oq8
3579d3J05j44Q0K28k90k64K16J34J9o4j12J61J73j45p3j42P8J18O2l2J98j59k01
3602i7Q0j22l6J32r2N3J80j07j50J3J48N3j45q8j07J74J9n7kL68k69K65Q2k17
3626G8k93K63J16j29j75L12j20j79R8l47O56j40k56K0K36j38mJ24o9M4j46k7J80
3649A04p1o8r3J18J2K21j61p3o3J16l9J56P9k30J74J06k80J0n1L20n20J86L0Q4
$$ plain form
3673 67 109 152 -44 -77 -127 -18 -75 -68 153 106 80 83 -176 270 55 7 -93 114 -263 203 218 161 -49 -185 -106
3698 -106 -152 145 25 -150 -134 -66 -19 75 153 -60 241 155 -345 113 8 -164 145 -165 107 113 -47 0 -202
3721 -202 5 -121 81 130 116 -1 22 -37 -46 65 169 -9 19 63 -154 204 157 -32 -7 54 -64 -82 -195 -75
3745 -75 235 -99 277 -66 -44 55 -185 36 -77 -132 132 -140 -240 52 65 165 132 -168 -33 226 -71 -81
3767 -81 -29 263 7 52 -44 192 232 50 -92 -127 -142 -82 23 -14 153 -339 -343 51 -176 -74 292 92 -94 -228
3791 -228 -50 -102 88 -110 -179 55 -111 -146 180 -94 -17 85 163 -47 -59 131 154 77 35 22 -53 106 220 56
3815 56 -123 89 4 -109 58 -208 -76 -8 -153 134 -128 115 168 -240 162 140 -115 59 -32 -162 -53 -211
3837 -211 101 -82 -280 -216 54 316 -106 -86 -119 116 60 -120 124 -53 -84 -20 -121 -44 91 177 -134 95 -74
$$ packed form
3673F7M2M3j96l3n0J09n7PK21m7k6Lk59M46k15m8j00K07l77M66J5n7k10j36P9
3698a06m6K97j20j75J6O8M7R4P8k13L01q6n00M58j05j72L09l10K72Oj60M7k02
3721b02K07j26K02M9j4j17K3n9rJ11J04j78K8M4k17L58m7j89K5O1j18j8j13J20
3745g5L10l34L76l43K2R9k40K21j13n5K64k72j00K92J3J00l3l00J35K59k97j0
3767h1N2K92k56M5r6K36M0j82j42l5j5O0J05l7J67m92mL94k27J02L66k00j86j34
3791b28J78n2J90j98o9K34j66l5L26k74P7J02P8k10j2J90K3p7m2j3p5J59J14j64
3815E6j79K12q5j13J67k66J32O8j45K87k62K43N3m08M02k2k55J74r1j30J09j58
3837b11L12j83j98O4K70K62m22K0l3K35n6j80K44j77l1O4j01P7J35Q6l11K29j69
$$ plain form
3860 -74 154 90 26 -35 178 7 176 -187 -87 -69 -100 115 43 -109 135 -48 94 -32 24 5 86 -187 -218 152
3884 152 134 149 38 99 -11 91 -187 15 -155 -70 69 -38 -224 190 -92 21 -145 141 221 -116 153 -43
3906 -43 -118 -17 -104 266 63 -326 -59 -100 -32 101 -30 -189 -7 -45 133 131 -18 44 164 2 -54 192 -117
3929 -117 85 144 -115 -8 80 8 -141 205 42 52 83 241 -120 -30 433 -154 -31 -28 36 8 137 162 -214 -59
3953 -59 -21 -190 14 3 26 72 -275 -174 193 61 60 105 -129 47 32 -77 117 -166 138 -186 159 15 140
3976 140 47 189 35 -189 96 -82 -166 -99 -143 -123 45 136 259 319 -78 50 -18 -133 13 42 -4 151 12
3999 12 -45 420 63 144 124 35 -195 127 93 42 -289 -43 172 -2 0 224 -275 103 247 109 297 81 -99
4022 -99 -142 -99 28 -65 -79 -62 237 -107 -238 -98 -27 134 270 -10 23 51 5 -37 -258 98 264 196 265 -183
$$ packed form
3860g4K28o4o4o1K13j71J69l63J00J8l1K15p2j52K44j83J42j26N6j9Q1k73l1L70
3884A52j8J5j11O1j10J02k78K02j70Q5J39j07j86M14k82J13j66K86Q0l37K69j96
3906d3p5J01q7L70k03l89K67m1O8J33j31j59J82l8J78kj49O2J20j62n6K46l09
3929a17K02N9k59J07Q8p2j49L46j63J0L1J58l61R0M63n87J23LO4k8J29K5l76J55
3953e9L8j69K04j1K3M6l47J01L67j32jM5k34J76j5j09J94k83L04l24L45j44J25
3976A40r3J42j54k24K85j78q4O7m4K0J68R1J23O0l97J28o8j15J46K9m6J55j39
3999A2n7M65l57Q1k0q9k30L22l4n1l31K46K15j74KK24m99L78J44j38J88k16j80
4022i9m3M3J27r3j4J7K99l44j31J40P1J61J36k80L3K8m6m2k21L56J66o8O9m48
$$ plain form
4046 -183 -174 99 20 1 89 -141 -101 57 -95 -246 -49 -9 -246 -177 -242 -33 -99 5 65 193 19 -281 -22 -72
4070 -72 -31 247 288 0 -119 -88 -142 -299 50 194 305 -267 -185 -267 114 66 84 10 115 249 -137 -131 100 395
4094 395 85 16 121 258 67 136 -66 61 81 240 -21 -76 -211 219 54 -207 21 -21 -45 123 254 -56
4116 -56 -237 -99 233 50 -149 159 -145 49 1 -104 171 4 -212 227 27 -317 62 -164 82 227 -153
4137 -153 -102 30 104 -24 -23 -112 -102 288 37 -311 33 216 -25 0 -234 -109 -26 -87 -95 19 -35 -152 96 -248
4161 -248 -150 4 -105 -108 163 199 124 205 205 122 -168 193 172 -69 217 8 -98 -6 -23 164 -182 20 23 4 195
4186 195 -31 -9 -64 -151 -536 129 179 -140 -151 27 146 -57 -17 -36 -140 208 42 -200 -65 -8 191 -90 13
4209 13 -269 -244 -124 260 219 -346 133 54 -189 99 -74 186 223 -84 -77 193 -56 -63 11 214 -91 -12 -116 27
$$ packed form
4046a83RK73p9j9Q8k30M0J58j52j51J97M0k37O9o5K09o6J04O0J28j74l00K59n0
4070g2M1K78M1k88j19L1n4j57L49J44J11n72Q2q2L81m8J8p4J05J34l86OK31K95
4094C95l10o9J05J37j91O9k02J27K0J59k61n5j35M30j65k61K28m2k4J68J31l10
4116e6j81J38L32j83j99L08l04J94m8j05K75j67k16M39k00l44L79k26K46J45l80
4137a53N1J32P4j28Jq9J0L90k51l48L44J83k41K5k34J25Q3o1qJ14n4j17K48l44
4161b48R8J54j09lK71L6p5Q1%q3k90L61k1k41K86k09j06R2j7J87l46K02Lj9J91
4186A95k26K2n5q7l85O65N0l19j1J78J19k03M0j9j04L48j66k42J35N7J99k81J03
4209A3k82K5J20L84m1n65M79p9k43K88j73K60L7l07PK70k49pP4K03l05P9j04J43
$$ plain form
4233 27 80 -32 232 28 -61 -55 -37 -236 149 -54 214 28 83 87 -13 67 -52 -137 57 246 -19 363 -55 55
4257 55 9 75 -15 -63 -137 -274 146 99 -126 100 17 58 -242 236 192 125 46 102 -152 9 285 175 -93 65
4281 65 173 137 -212 97 -99 192 51 21 -113 59 67 296 24 83 88 -325 -7 238 -194 -141 -113 -255 -139
4304 -139 -82 63 -83 42 -37 -239 78 -81 317 69 134 47 -135 80 65 99 -18 26 183 -62 -191 87
4326 87 44 202 51 158 137 75 92 -10 23 -206 9 -194 227 -62 212 182 34 51 -30 -145 63 -58 103
4349 103 270 -48 103 100 5 -193 295 -58 227 112 -94 -171 158 -184 -280 -20 -350 -207 284 -32 0 101
4371 101 120 5 53 -110 -128 33 67 96 16 -33 -234 40 -169 -159 213 -51 183 -27 -99 228 163 -284 31
4394 31 -101 114 72 57 29 82 -8 78 -6 -284 157 67 281 127 121 96 114 47 -130 -144 -121 -122 24 1 -11 -1 -17
$$ packed form
4233B7N3j12K64k04q9OJ8j99L85k03K68j86N5Mj00Q0j19q5J94J89k65L82m18J10
4257E5m6O6r0m8p4j37M20m7k25K26q3M1l00M78m4o7p9N6k54J61K76j10k68J58
4281F5J08l6l49L09j96K91j41l0j34J72QK29k72N9Nm13L18K45m32N3K8j42J16
4304a39N7J45j46J25p9k02L17j59L98k48O5q7j82K15j5L4j17M4J57k45j29K78
4326H7m3J58j51J07k1o2J7j02L3k29K15k03M21k89K74l0j48J7q1j15K08j21J61
4349A03J67l18J51lr5j98M88l53K85j15k06p7L29l42r6K60l30J43M91l16L2J01
4371A01J9j15M8j63j8J61L4K9q0m9k01K74k09J0L72k64K34k10p2L27o5m47L15
4394C1j32K15m2j5k8N3r0Q6q4k78M41r0K14j54ok5J8o7j77j4K3jJ46k3j2J0j6
$$ plain form
4421 -17 280 -127 231 213 -168 67 182 204 -160 -190 -115 -281 -75 -376 97 376 13 108 -17 -30 10 158 11
4444 11 332 87 214 -83 -30 153 -1 -73 32 -158 348 -70 -137 122 -28 -122 230 126 -281 -5 46 -160
4466 -160 -114 -178 171 113 -305 -243 -172 3 -173 -72 -139 48 119 -39 66 205 113 60 8 86 287 178 -10 298
4490 298 -9 198 -35 -116 -60 40 -9 85 59 94 -80 -141 161 36 -417 -19 -117 47 32 -106 -356 -225 188
4513 188 -56 214 127 129 95 73 15 -140 258 213 -292 -25 -5 -24 -220 -123 -289 88 80 212 36 37 202 -114 66
4538 66 283 -44 33 -6 121 -82 -41 186 55 165 -65 -111 -46 73 30 129 -95 178 -24 7 204 144 -20
4561 -20 54 -151 7 206 47 257 37 -184 -167 91 -157 194 159 -302 69 -131 -139 443 49 40 17 139 -77
4584 -77 157 95 -17 -132 49 -65 58 116 31 33 -70 143 -280 0 210 78 -146 -23 151 -149 26 135
$$ packed form
4421a7K97m07L58j8l81K35J15K2l64l0P5j66K06l01M73K79l63R5j25j3M0J48j47
4444A1L21k45J27k97N3J83j54p2J05j90N06m18o7K59j50r4L52j04m07K76N1k06
4466a60M6o4L49n8m18O2P1J75j76J01o7J87P1j58J05J39r2n3n2P8K01j09j88L08
4490B98l07K07k33q1N6J00m9R4k6L5j74o1L02j25m53L98r8J64j5j38k50J31M13
4513A88k44K70q7Kl4k2n8j55L98m5n05K67K0j9j96R7j66L77qJ32j76JJ65l16J80
4538F6K17l27P7l9J27k03M1K27j31J10k30m6O5J19m3R9k24K73k02L1J97o0j64
4561b0P4k05J58J99j59K10k20k21J7K58k48L51l5m61L71k00qN82l94rk3J22k16
4584g7K34o2j12j15J81j14J23N8q5Kj03K13m23K80K10j32k24J23J74l00J75J09
$$ plain form
4606 135 -42 -295 -11 193 362 34 -325 -93 9 170 150 219 108 -105 25 178 64 85 14 -34 111 305
4628 305 9 -34 92 -243 -295 215 -28 -88 -83 -90 7 156 -102 -224 70 121 -42 33 93 231 22 -18 47 -114
4652 -114 -184 73 249 131 263 96 178 -251 60 247 -19 -114 -214 184 280 -15 -21 -188 -173 68 59 174 25
4675 25 151 6 55 -104 -281 203 14 53 149 -385 -136 -51 261 262 -259 292 -118 -267 619 -266 -83 72
4697 72 -304 186 -45 183 -150 -475 154 239 -273 -387 393 258 42 125 206 199 -182 70 80 -128 23 248
4719 248 -72 -138 47 26 108 197 -301 -229 -173 4 14 120 41 -128 53 37 -36 33 116 -146 24 144 -159 4
4743 4 -49 -219 177 98 5 -13 -164 112 -120 0 129 -91 -44 17 -56 9 47 42 -38 509 122 -576 -79 244 -145
4768 -145 764 1100 727 154 -6 271 11 -33 197 23 -142 98 103 246 -275 13 -145 44 -64 -78 27
$$ packed form
4606A35j77k53K84K04J69l28l59K32J02J61k0O9j11k13J30J53j14K1p1m8J45J94
4628C05k96m3J26l35n2N10k43o0NpR7J49k58j22K94N1j63P5O0J38k09m0O5j61
4652a14p0K57J76j18J32j67Q2m29L11J87k66r5j00L98R6k95oj67J5K41rJ15j49
4675B5J26j45M9j59j77M84j89L9R6n34K49Q5L12Jn21N51m10j49Q86q85J83J55
4697G2l76M90k31K28l33l25O29Q5n12j14P80j35k16Q3Q1pl81K52J0k08J51K25
4719B48l20o6J85k1Q2Q9m98P2N6J77J0J06p9j69J81j6p3O9Q3k62J70J20l03J63
4743Dn3j70L96p9r3j8j51K76k32J20J29k20M7O1p3O5L8nq0N47l87o98M97L23l89
4768a45R09L36l73n73j60K77k60m4K30j74j65K40NJ43n21K88j58J89j08j4J05
$$ plain form
4789 27 -70 -13 333 162 -158 -93 -31 -9 38 90 -47 5 94 22 232 -8 -206 69 71 20 -156 -44 101 -150 41
4814 41 -232 -114 -141 324 50 299 296 -51 182 -259 -8 188 224 -111 -93 119 213 30 -166 45 90 -157 105
4837 105 94 -4 -131 144 -203 -38 -114 248 12 139 81 -127 63 -186 85 -68 66 -97 79 -150 100
4858 100 -127 233 156 -30 -32 232 238 -117 44 -9 68 -193 55 118 91 139 390 131 18 71 31 -88 -72 49
4882 49 -138 300 168 -53 -127 83 -98 82 -73 45 -223 -17 -216 164 116 -221 -65 -87 -31 34 160 -121
4904 -121 52 6 -11 164 -4 -307 -144 -113 119 -132 -148 43 13 -123 22 -158 -67 -27 -148 -19 33 175 194
4927 194 -198 -150 256 -61 21 -236 72 253 -120 -31 48 -39 -125 -21 -228 43 -210 -225 83 -198 90 -171
4949 -171 -20 -170 318 -170 98 -201 -69 -211 -174 -43 91 52 248 -7 23 -186 -201 -209 9 -20 22 93 -57
$$ packed form
4789B7r7N7L46j71l20O5O2K2M7N2j37N2Q9p2K10k40j98K75Kn1j76J12J45k51J91
4814D1k73J18k7M65k74K49ll47K33m41K51J96L6l35J8K12R4j83j96K11M5k47K62
4837A05j1r8j27K75l47J65p6L62k36J27n8k08J90k49K71j53J34j63J76k29K50
4858A00k27L60p7j86kK64Ol55J61n3P7k61K48O3k7M8K51k59j13N3m0j19J6J21
4882D9j87M38j32k21p4K10j81J80j55J18k68K06j99L80m8l37J56k2N6O5J26k81
4904a21J73m6j7J75j68l03J63L1K32k51j6J91l0j36J45j80R1M0j21J29N2J42J9
4927A94l92M8M06l17Q2k57L08J81l73Q9P9q7q6J04k07K71k53j5L08k81K88k61
4949a71J51j50M88m88K68k99J32j42L7J31J34l9J96k55L0k09j5qK18k9M2P1j50
$$ plain form
4972 -57 100 -125 243 -106 102 147 66 -85 -27 16 188 -68 233 79 58 -116 103 -144 107 8 -19 -171 68
4995 68 29 123 -59 -94 88 -71 175 -94 112 -159 -145 -15 88 166 -151 124 -167 167 46 232 21 -43
5017 -43 -195 107 51 142 -302 -17 190 -239 178 189 -43 -90 -9 -33 220 -38 239 -197 -5 -16 -158 17 91
5040 91 -132 172 160 170 36 -163 -231 -36 -112 217 -54 -279 -8 -18 -24 -170 78 -21 8 -6 20 -35 4 -58 136
5065 136 73 -40 70 81 16 55 77 407 -195 -66 271 0 -19 115 53 38 -9 141 20 215 113 -86 69
5088 69 -41 123 -152 -65 -119 -99 64 -30 -27 162 -138 58 -51 -34 201 -68 147 -22 -82 -94 -73 373 146 104
5112 104 -148 2 259 66 36 376 253 80 200 -13 142 -94 89 75 -207 63 -16 -37 258 -92 26
5133 26 7 83 9 -25 117 -36 -87 1 -77 -31 -82 -118 211 5 -203 17 -1 38 209 79 51 -11 266 -8 176
$$ packed form
4972e7J57k25L68l49K08M5q1j51N8M3J72k56L01j54k1j74K19k47K51r9k7j52K39
4995F8l9R4j82l5J82j59K46k69K06k71J4J30J03P8l17K75k91L34j21J86k11o4
5017d3j52L02n6R1m44K85K07m29M17J1k32m7Q1k4K53k58K77m36J92j1j42J75P4
5040I1k23L04j2J0j34j99o8J95p6L29k71k25K71j0oj46K48r9K9j4K6n5L9o2J94
5065A36o3j13J10J1o5L9K2L30o02J29L37k71j9J34o2j5m7J50j21J95j02j99J55
5088F9j10J64k75Q7n4K0J63r4LJ89l00J96j09J7K35k69K15j69o0j2K1M46k27m2
5112A04k52J50K57j93l0L40j23j73J20k13J55k36J83j4k82K70p9k1K95l50J18
5133B6j9P6p4l4J42j53n1Q8p8M6n1l6L29k06k08K20j8L9J71j30k8o2K77k74J84
$$ plain form
5158 176 -53 -114 22 34 10 -201 307 -124 46 -105 169 -91 101 -105 -213 -98 156 13 -203 116 -125
5179 -125 -95 -185 -139 -119 -69 -220 -305 9 -59 -67 92 102 104 128 -102 83 -18 -102 315 -130 -34 27 -96 -277 128
5204 128 -45 -228 -103 144 -11 -49 8 -71 -114 -159 72 -2 225 -19 251 251 -158 133 -97 -18 300 -201 -12
5227 -12 -114 -47 514 111 198 -41 -85 -235 40 -24 -84 34 -171 -77 -73 18 -147 55 -72 -108 -105 -22 266 52 -58
5252 -58 9 -80 6 78 92 137 36 78 84 222 83 150 -91 -123 65 121 140 93 -190 -15 -72 -217 -90 152 -60
5277 -60 -104 -219 34 61 -40 -104 167 56 -192 136 -72 -70 -352 -40 163 125 251 -141 -80 -298 265 -18 -181
5300 -181 269 33 -121 -208 -38 103 219 208 -80 171 -27 -73 -142 -91 -183 55 7 -275 50 -74 66 79 -40
5323 -40 46 -26 36 -163 92 -90 48 54 -189 -215 36 156 -138 -136 124 60 18 329 -70 205 -134 157 22 -87
$$ packed form
5158A76k29o1J36J2k4k11N08m31J70j51K74k60J92k06j08J15K54j43k16L19k41
5179a25L0r0M6K0N0j51q5L14o8qJ59J0KK4k30J85j01q4M17m45R6O1j23j81M05
5204A28j73j83J25K47j55l8N7p9m3m5K31p4K27k44K70%m09K91k30P9L18n01J89
5227a2j02O7N61m03Q7k39m4j50K75o4o0J18k05R4MR1j65K02j27l6LQ3K88k14j10
5252e8O7q9Q6P2J4M5j01M2OJ38j39O7k41l2J88N6J9m7k83J75n7j45J27K42k12
5277f0m4j15K53K7j01o4K71j11k48L28k08Kk82L12K03l8J26l92O1k18N63k83j63
5300a81M50k36j54q7J70J41J16j1k88K51j98m6o9N1r2K38m8k82L25j24J40J3j19
5323d0Q6p2O2j99K55j82J38Ok43k6K51J20k94KK60o4m2L11l99K75l39K91j35j09
$$ plain form
5347 -87 -106 129 -193 6 -298 19 -93 -164 -44 -145 5 181 -93 -98 241 129 -228 152 -223 -5 159 -132
5369 -132 27 -57 89 71 175 -31 101 -137 179 -119 -38 -169 36 -96 1 -37 195 -198 74 -157 27 -113
5391 -113 94 -132 199 -13 -296 228 128 49 119 -109 26 86 -71 156 175 198 -372 -283 147 -158 -101 82
5413 82 366 3 -60 -9 -108 12 9 -108 -54 77 78 -4 178 69 151 17 -31 -42 -78 -42 -162 -6 -85 87 -138
5438 -138 -17 -26 80 -84 -40 -45 514 22 144 -43 94 59 -105 -114 350 52 -78 134 -80 -47 167 145 -31
5461 -31 -122 -351 16 75 -134 -50 -199 113 146 -94 -371 -48 -134 122 164 301 289 -77 148 -12 -208 337 95
5484 95 157 -8 -184 -215 -165 -52 130 115 -41 -108 96 73 -188 176 62 57 198 54 -44 -5 -196 58 26 -11
5508 -11 -136 327 132 -61 -102 -25 73 -59 -332 55 -35 -142 44 -32 98 168 70 94 -25 146 -107 -85 206
$$ packed form
5347h7j9K35l22J99l04L17j12p1J20j01J50J76k74nL39j12l57L80l75K18J64k91
5369a32J59q4J46j8J04k06J32k38L16k98Q1j31K05j32R7l8K32l93K72k31J84j40
5391a13K07k26L31k12k83N24j00p9P0k28J35O0j57K27J9K3n70Q9M30l05N7J83
5413H2K84l63o3N1r9J20lj17N4J31Jq2J82j09Q2j34m8j1l6L6j20J56p9J72k25
5438a38J21rJ06j64M4nN59m92J22j87J37l5j64rM64k98j30K12k14L3K14k2j76
5461c1r1k29L67N9k09Q4j49L12L3k40k77L23q6K56M2J37j2l66K25j60j96N45k42
5484I5O2j65j76l1N0J13J82j5j56o7K04k3k61L64j14nJ41j44r8L9j91K54l2l7
5508a1j25M63j95j93m1P7R8j32k73L87r0j07J86p6J30P0r8K4j19J71k53K2K91
$$ plain form
5531 206 -107 -138 -168 19 68 83 -27 28 188 -97 149 -90 271 -90 -128 144 188 -10 -19 -72 -154 -152 336 116
5555 116 -110 152 -111 96 -66 129 332 106 -360 148 -147 -178 -150 78 50 -172 170 31 27 -326 -104 -372
5577 -372 -220 124 -149 32 -77 -288 367 138 -70 -86 162 40 -42 239 -110 89 -95 -41 -302 225 266
5598 266 -23 13 -42 -8 -135 -91 -15 -128 -53 118 246 67 -99 29 42 7 26 4 41 -72 75 112 22 75 -259
5623 -259 -176 -94 -146 8 -176 -138 -141 167 -110 22 -6 414 -54 -36 18 152 -219 -191 32 60 78 -14 -152 -79 185
5648 185 -322 28 -24 55 31 295 -328 -21 143 30 -48 -51 -28 116 -49 -34 -91 -6 -20 5 -9 -41 -53 -112 -22 -41
5674 -41 62 310 285 -55 328 -23 77 168 -203 18 36 32 -158 -65 -350 130 202 170 51 64 54 -21 -35 -170
5698 -170 -56 -169 56 65 -152 -30 23 -241 -54 -71 214 305 182 -231 -52 -99 43 -13 50 227 4 -90 -39
$$ packed form
5531B06l13l1l0J87M9J5j10N5J60k85K46k39L61l61l8K72M4j98rn3q2KM88k20
5555A16k26K62k63K07j62J95K03k26m66N08k95l1K8K28k8k22L42j39ml53K22k68
5577c72J52L44k73J81j09k11O55k29k08j6K48j22q2K81l49J99j84N4k61N27M1
5598B66k89L6n5L4j27M4P6j13P5J71J28j79j66J28J3l5J9k2L7j13J47L7r0N3l34
5623b59Q3Q2n2J54j84L8lL08k77J32k8M20m68J8N4J34l71K8K23K8J8r2j38P3K64
5648A85n07L50n2P9k4K64o23L07J64j13p8lK3J44j65J5n7Q5j4K5j4l2j2n9R0j9
5674d1J03K48k5l40L83l51J00R1l71K21J8mj90R3k85M80P2l2j19J3j0p5j4j35
5698a70J14j13K25Rk17J22N3k64J87j7K85R1j23m13J79m7J42n6O3J77k23r4N1
$$ plain form
5721 -39 186 59 263 -79 139 -226 -60 277 9 -3 -8 -45 129 -189 18 -163 268 -115 54 -71 -117 -58
5743 -58 -261 92 -4 -79 -199 -118 -60 -163 121 366 91 95 295 -116 101 141 134 -82 -152 16 -89 9 -30 -271
5767 -271 -160 32 129 -88 -216 52 24 -189 163 70 -47 112 -327 74 18 133 19 -18 27 33 12 79 -170
5790 -170 292 146 -237 -94 74 -4 -239 22 -27 -14 118 -5 -4 107 -63 68 -77 116 2 155 -251 -282
5812 -282 122 -98 25 91 -140 -33 267 176 102 4 -137 -6 25 31 -107 -9 -8 120 -418 153 -21 51 -214 -80
5836 -80 143 -48 -36 -6 229 57 -19 21 -192 186 85 109 -89 112 108 -177 -187 -22 -224 -9 38 128 117 246
5860 246 -66 -91 -22 126 -75 -13 26 -160 -277 31 -153 -141 -291 174 -60 6 -104 -71 16 -130 -185 -257 167
5883 167 168 86 -119 112 190 -20 -299 126 176 -186 179 41 117 221 159 -281 88 167 162 -125 -141 38 -370 -45
$$ packed form
5721c9K25j27K04l42K18l65J66L37k68j2nl7J74l18K07j81M31l83J69j25m6N9
5743e8k03L53r6p5j20Q1N8j03K84K45k75MK00m11K17M0pk16p0J68j05R8l9k41
5767b71J11J92R7k17j28K68k8k13L52r3j17J59m39M01n6J15j14l7M5Ok1O7k49
5790a70M62j46l83J43J68p8k35K61m9J3J32j23JJ11j70J31j45J93j14J53m06l1
5812b82M04k20J23O6k31J07L00r1p4r8j41J31L1Oj38R8JJ28n38N71j74P2k65J34
5836h0K23j91J2L0K35j72p6M0k13L78j01K4j98K01mk85j0J65k02K15M7R0j1J29
5860B46l12k5O9J48k01O2L9j86j17L08j84J2j50M65k34O6j10L3Q7j46n5p2M24
5883A67Jq2k05K31P8k10k79M25N0l62L65j38P6J04o2m40L69P9nk87j6J79m08L25
$$ plain form
5907 -45 249 56 -164 182 0 64 127 177 26 28 -7 40 -100 96 -45 -122 -33 -46 -107 53 172 -147 -70 268
$$ packed form
5907d5K94j93k20L46j82O4O3N0j51Kl5M7j40J96j41p7Q9j3o1J60J19l19P7L38
$$ [...]
8191b2
##END NTUPLES=NMR FID
##END=
