##TITLE=1H_DE-157R_TFA
 200.13Hz, DMSO.
 8 sc
 23.6.2026
##JCAMPDX= 6.0         $$ Bruker NMR JCAMP-DX V2.0
##DATA TYPE= NMR FID
##DATA CLASS= NTUPLES
##ORIGIN= UXNMR, Bruker Analytische Messtechnik GmbH
##OWNER= pz
$$ XWIN-NMR		Version 3.5
$$ Tue Jun 23 14:35:18 2026 Russian Standard Time (UT+4h)  she@DPX200
##.OBSERVE FREQUENCY= 200.1313
##.OBSERVE NUCLEUS= ^1H
##.DELAY= (6, 6)
##.ACQUISITION MODE= SIMULTANEOUS
##.ACQUISITION SCHEME= undefined
##.AVERAGES= 8
##.DIGITISER RES= 18
##SPECTROMETER/DATA SYSTEM= spect
##.PULSE SEQUENCE= zg30
##.SOLVENT NAME= DMSO
##.SHIFT REFERENCE= (INTERNAL, DMSO, 0, 14.3821)
##AUDIT TRAIL= $$ (NUMBER, WHEN, WHO, WHERE, WHAT)
$$ ##TITLE= Audit trail, XWIN-NMR		Version 3.5
$$ ##JCAMPDX= 5.01
$$ ##ORIGIN= Bruker BioSpin GmbH
$$ ##OWNER= she
$$ F:/spectra/data/she/nmr/H-C/1/audita.txt
$$ ##AUDIT TRAIL=  $$ (NUMBER, WHEN, WHO, WHERE, WHAT)
(   1,<2026-06-23 14:33:59.81 +0400>,<she>,<DPX200>,
      <created by zg, POWCHK disabled, PULCHK disabled
       configuration hash MD5:
       00 E9 B6 7A A2 85 ED C7 34 08 36 98 17 FE 4E 26
       data hash MD5: 16K
       EC 4A C9 55 51 00 37 99 D1 32 30 57 47 91 D2 30>)
$$ ##END=
$$ 
$$ hash MD5
$$ A5 6E FD 35 9F 70 A3 E4 BD 77 9E 8D 18 79 9D 38
##$RELAX= 
##$RELAX= 
##$RELAX= 
##$RELAX= 
##$RELAX= 
##$RELAX= 
$$ Bruker specific parameters
$$ --------------------------
##$DU= <F:/spectra>
##$EXPNO= 1
##$NAME= <H-C>
##$PROCNO= 1
##$TYPE= <nmr>
##$USER= <she>
##$AMP= (0..31)
100 100 100 100 100 100 100 100 100 100 100 100 100 100 100 100 100 100 
100 100 100 100 100 100 100 100 100 100 100 100 100 100 
##$AQSEQ= 0
##$AQ_mod= 1
##$AUNM= <au_zg>
##$AUTOPOS= <>
##$BF1= 200.13
##$BF2= 200.13
##$BF3= 200.13
##$BF4= 200.13
##$BF5= 200.13
##$BF6= 200.13
##$BF7= 200.13
##$BF8= 200.13
##$BYTORDA= 1
##$CFDGTYP= 0
##$CFRGTYP= 5
##$CHEMSTR= <none>
##$CNST= (0..31)
1 1 145 1 1 1 1 1 1 1 1 1 1 1 1 1 1 1 1 1 1 1 1 1 1 1 1 1 1 1 1 1 
##$CPDPRG= <>
##$CPDPRG1= <>
##$CPDPRG2= <>
##$CPDPRG3= <>
##$CPDPRG4= <mlev>
##$CPDPRG5= <mlev>
##$CPDPRG6= <mlev>
##$CPDPRG7= <mlev>
##$CPDPRG8= <mlev>
##$CPDPRGB= <>
##$CPDPRGT= <>
##$D= (0..31)
0 0.7 0 0 0 0 0 0 0 0 0 0.03 0 0 0 0 0 0 0 0 0 0 0 0 0 0 0 0 0 0 0 0 
##$DATE= 1782210839
##$DBL= (0..7)
120 120 120 120 120 120 120 120 
##$DBP= (0..7)
150 150 150 150 150 150 150 150 
##$DBP07= 0
##$DBPNAM0= <>
##$DBPNAM1= <>
##$DBPNAM2= <>
##$DBPNAM3= <>
##$DBPNAM4= <>
##$DBPNAM5= <>
##$DBPNAM6= <>
##$DBPNAM7= <>
##$DBPOAL= (0..7)
0.5 0.5 0.5 0.5 0.5 0.5 0.5 0.5 
##$DBPOFFS= (0..7)
0 0 0 0 0 0 0 0 
##$DE= 6
##$DECBNUC= <off>
##$DECIM= 32
##$DECNUC= <off>
##$DECSTAT= 4
##$DIGMOD= 1
##$DIGTYP= 9
##$DL= (0..7)
0 120 120 120 120 120 120 120 
##$DP= (0..7)
150 150 150 150 150 150 150 150 
##$DP07= 0
##$DPNAME0= <>
##$DPNAME1= <>
##$DPNAME2= <>
##$DPNAME3= <>
##$DPNAME4= <>
##$DPNAME5= <>
##$DPNAME6= <>
##$DPNAME7= <>
##$DPOAL= (0..7)
0.5 0.5 0.5 0.5 0.5 0.5 0.5 0.5 
##$DPOFFS= (0..7)
0 0 0 0 0 0 0 0 
##$DQDMODE= 0
##$DR= 18
##$DS= 0
##$DSLIST= <SSSSSSSSSSSSSSS>
$$ [...]
##$SUBNAM0= <"">
##$SUBNAM1= <"">
##$SUBNAM2= <"">
##$SUBNAM3= <"">
##$SUBNAM4= <"">
##$SUBNAM5= <"">
##$SUBNAM6= <"">
##$SUBNAM7= <"">
##$SUBNAM8= <"">
##$SUBNAM9= <"">
##$SW= 18.0517328524113
##$SWIBOX= (0..15)
0 0 2 0 0 0 0 0 0 0 0 0 0 0 0 0 
##$SW_h= 3612.71676300578
##$TD= 16384
##$TD0= 1
##$TE= 0
##$TE2= 300
##$TE3= 300
##$TEG= 300
##$TL= (0..7)
0 120 120 120 120 120 120 120 
##$TP= (0..7)
150 150 150 150 150 150 150 150 
##$TP07= 0
##$TPNAME0= <>
##$TPNAME1= <>
##$TPNAME2= <>
##$TPNAME3= <>
##$TPNAME4= <>
##$TPNAME5= <>
##$TPNAME6= <>
##$TPNAME7= <>
##$TPOAL= (0..7)
0.5 0.5 0.5 0.5 0.5 0.5 0.5 0.5 
##$TPOFFS= (0..7)
0 0 0 0 0 0 0 0 
##$TUNHIN= 0
##$TUNHOUT= 0
##$TUNXOUT= 0
##$USERA1= <user>
##$USERA2= <user>
##$USERA3= <user>
##$USERA4= <user>
##$USERA5= <user>
##$V9= 5
##$VALIST= <valist>
##$VCLIST= <CCCCCCCCCCCCCCC>
##$VD= 0
##$VDLIST= <DDDDDDDDDDDDDDD>
##$VPLIST= <PPPPPPPPPPPPPPP>
##$VTLIST= <TTTTTTTTTTTTTTT>
##$WBST= 1024
##$WBSW= 4
##$XGAIN= (0..3)
0 0 0 0 
##$XL= 0
##$YL= 0
##$YMAX_a= 196542
##$YMIN_a= -256957
##$ZGOPTNS= <>
##$ZL1= 120
##$ZL2= 120
##$ZL3= 120
##$ZL4= 120
##$ABSF1= 10
##$ABSF2= 0
##$ABSG= 5
##$ABSL= 3
##$ALPHA= 0
##$AQORDER= 0
##$ASSFAC= 0
##$ASSFACI= 0
##$ASSFACX= 0
##$ASSWID= 0
##$AUNMP= <proc_1d>
##$AZFE= 0.1
##$AZFW= 0.1
##$BCFW= 1
##$BC_mod= 2
##$BYTORDP= 1
##$COROFFS= 0
##$CY= -3
##$DATMOD= 1
##$DC= 2
##$DFILT= <>
##$DTYPP= 0
##$F1P= 0
##$F2P= 0
##$FCOR= 0.5
##$FTSIZE= 0
##$FT_mod= 4
##$GAMMA= 1
##$GB= 0.15
##$INTBC= 1
##$INTSCL= 1
##$ISEN= 128
##$LB= 0.25
##$LEV0= 0
##$LPBIN= 0
##$MAXI= 10000
##$MC2= 0
##$MEAN= 0
##$ME_mod= 0
##$MI= 1.114404
##$NCOEF= 0
##$NC_proc= 0
##$NLEV= 6
##$NOISF1= 3.799351
##$NOISF2= 2.8
##$NSP= 1
##$NTH_PI= 0
##$NZP= 0
##$OFFSET= 14.38212
##$PC= 1
##$PHC0= -4220.551
##$PHC1= 14.99229
##$PH_mod= 1
##$PKNL= yes
##$PPARMOD= 0
##$PSCAL= 0
##$PSIGN= 0
##$REVERSE= no
##$SF= 200.129724274929
##$SI= 16384
##$SIGF1= 3
##$SIGF2= 2
##$SINO= 400
##$SIOLD= 16384
##$SREGLST= <1H.CDCl3>
##$SSB= 0
##$STSI= 0
##$STSR= 0
##$SW_p= 3205.1282051282
##$SYMM= 0
##$S_DEV= 0
##$TDeff= 0
##$TDoff= 0
##$TI= <>
##$TILT= no
##$TM1= 0
##$TM2= 0
##$TOPLEV= 0
##$USERP1= <user>
##$USERP2= <user>
##$USERP3= <user>
##$USERP4= <user>
##$USERP5= <user>
##$WDW= 1
##$XDIM= 8192
##$YMAX_p= 0
##$YMIN_p= 0
$$ End of Bruker specific parameters
$$ ---------------------------------
##NTUPLES= NMR FID
##VAR_NAME=  TIME,          FID/REAL,        FID/IMAG
##SYMBOL=    X,             R,               I
##VAR_TYPE=  INDEPENDENT,   DEPENDENT,       DEPENDENT
##VAR_FORM=  AFFN,          ASDF,            ASDF
##VAR_DIM=   8192,          8192,            8192
##UNITS=     SECONDS,       ARBITRARY UNITS, ARBITRARY UNITS
##FACTOR=    0.0002768,     1,               1
##FIRST=     0,             0,               0
##LAST=      2.2672688,     0,               0
##MIN=       0,             -256957,         0
##MAX=       2.2672688,     196542,          0
$$ Real data points
##PAGE= N=1
##DATA TABLE= (X++(R..R)), XYDATA
$$ [...]
1904B27j07O2j30j23L63q4k87J39o1K50M1l31K15j09j41M3p2q8K04l0q4l37L86
1927e4K41l8L5l09K38k4j47K22l6j63K25L4o4m21L45j00J37j89j03K49o8q8K4
1950e4ln9K28j09k46O5K48k56R0J43K4o47N36L6M6p8J48j18j63K84M3l13j50M67
1974A62k14N4j60k3j9J80J86L5j03j63jN8L3N2m47M07r2J81k38K31j35R4j11L36
1998C03j19j22l22J10K11L7j32l9J2l0P4N0J63j77N9J16j88L7K09J28m05Pl13
2021c31K67L1J45j62P0j64k3M43j59p1j57R1j14K04k3j76l9L01J78m23J39n4m0
2044f7J28p5j40L51k52O8k10j22J1M64q6K5j73O1R5j15Jk07Q6m6M93j74k48M1
2068i1M42m78J36K6j61Q2L7J80J67l13j85K25P0j23M7j39J1J58J40j74J0l5o6
$$ y = [227, 120, 182, 52, -71, 292, 208, -79, 60, -1, 249, 290, -41, 174, 65, -76, -33, -105, -193, 11, -19, -103, -440, -54, 187, 149, 184, -125, 113, 89, -58, 164, 128, -35, 190, 224, 160, -261, 84, -16, 121, -68, -171, 78, 10, -78, -54, -57, -116, 112, 3, -243, -178, 70, -186, -96, 47, 71, -576, -40, -4, 42, -36, 112, -6, -169, 115, 158, -155, -305, 162, -52, 2, -158, -181, -200, -20, 166, 201, 98, -65, -66, -8, 25, 77, -370, 37, -55, 126, -112, 119, -16, 78, -33, 303, 184, 62, -260, -150, 61, 98, -34, -73, -61, -91, -17, 33, 196, 19, 78, 194, 6, 43, 252, 380, -25, -18, -331, -64, -33, 112, -50, 20, -144, -167, 276, 117, 46, -111, -20, -134, 70, 47, -129, -168, 133, 311, -112, 27, -27, -67, 61, -14, -154, 197, -55, 13, -197, -319, -308, 156, 70, 95, -78, -17, 78, -37, -36, -243, -157, -203, 290, 116, -132, -91, 351, -127, 9, 35, -126, -44, -7, 173, 340, 27, -158, 67, 137, 14, 61, -78, -67, 91, 231, 57, 67, 32, -34]
2091c4R6k05J52k70K39L41j68j29J34m62L87j96J33J4l1lj64r4J89k2J30m62M92
2114F7j45J94j53n7J03l5o1k12M12r9j21P4M2j0J24kj18j1K48k06J26j37j37J48
2138C4k51L11L9j0k84K59j20K05J8k20J30k88K82k89J56o2N8p6M97j32k76K2k0
2161a7L17j23L7k55j21R1P5km2k14M74j47j50j24J04L54l15j77K38j28n0J88O2
2184G5j30Q3n6o7J6Q6j76J24N2p1M2P1J13J5L7j85j91M24k44j54Q9Q3J22j00k26
2209a68K45Q4l63K80j67Q3j90N5J76o3r9O9K97l83K85q6J29m3r4j22L2J66l21
2232a98K35L1j23O2j26L13j80K67l5m70K82M7k32K15o7k87J79j14J85N9L28l1
2254C40n17N4L33j38p0K3k03R4K09j06L23k98q7r1M9N20m47LR5q1k1l8Q3J2O3
$$ y = [-34, 62, -143, 9, -261, -22, 319, 151, 22, 156, -306, 81, -115, 18, 32, 1, -2, -166, -260, -71, -93, 37, -425, 67, -78, 116, -37, -94, 9, -26, -87, -299, 113, 14, -107, -33, 9, -1, 123, 121, 3, -8, 240, 34, 160, 23, -114, 34, -217, 94, 133, 123, -161, 98, -22, 183, 201, -19, 111, -177, 105, -184, -28, -90, -32, -108, 389, 257, -19, 3, -17, 300, 177, 214, -41, -162, -71, 4, 2, -40, -254, 220, 73, -77, -201, -97, 257, -58, -235, 3, -125, -175, 13, 75, -55, 28, -28, -95, -79, 7, -169, -45, 7, -64, -22, 49, 162, 177, 214, 29, -162, 262, 18, -136, -47, 36, 158, 58, -168, 77, 161, -202, 78, -89, -6, -196, -141, 35, -28, -127, -58, 239, -144, 141, 55, 184, 141, 47, -75, -43, 123, -198, 37, 68, -55, 7, -119, 194, 14, 281, 246, -224, 58, 105, -127, 88, 21, -266, -87, -201, -16, 43, 371, 340, -177, -123, 210, 72, 2, 25, -178, -84, 125, 19, 342, 44, -43, -134, -85, 435, -12, -9, 86, 5, -16, -54, 29, 41, 104]
2279A04J56j21r1Mn9O3o1p3j21L29J03l7j06n3p5N0M6j41K18o6Rk7J14l76L47
2304A36j31J28j51j09Q3j5J69n8o0j0O1J30k09j70L63j41k04L67n8j72J50k31
2326a32P4K15k15J44l8j53n5M47m98K13N5m43N38j37J91m6j85j46M11k58J08j9
2348G1j67K20p1m0K02j89P0k05M4J41o3l0J09p0j09J03J41pj80r9R7R5k00K32
2372I5o0k8r6J27m1J93jo7M0k36J87J72k39j34O3J23j96P8M6j51J29M5k67J41
2396g7J1j78J9K59k71L73p0J72lj6j27p6L52m53r%K50J52j34k90J47J18j27r8
2420g6j69N7K56J49k03P7k44L8J85J87j79J28m04K14q9j48L04K9k96L61j16J11
2442A72J26l26L00j67j52L5K9j41R5J47J08k85Q8J05j17J19j78K75j32J13q7j70
$$ y = [104, 260, 139, 48, 52, -7, 56, -5, -78, -199, 130, 233, 196, 90, 37, -38, 12, 58, -83, 135, 69, 78, 51, 165, -211, 136, 5, 133, -18, -127, -44, -59, 110, 52, -8, -18, 43, 173, -36, -206, 157, 16, -188, 179, 121, -51, 99, -132, -58, 157, -58, 86, 48, -105, -160, 287, -211, 2, 57, -386, 152, 15, 206, 160, -25, -171, 240, -18, 90, 71, -96, 124, 53, 13, 215, 26, 96, -109, -65, 76, 13, -17, 92, 22, -87, 16, 157, 150, -30, -129, -32, 63, -137, 95, 35, 7, -89, 38, -3, 190, 189, 122, 162, -74, 113, 285, 46, -88, -25, 98, -98, -20, 26, -125, 4, 49, -218, -77, -66, -244, -225, 34, -237, 136, 66, 238, 235, 219, 92, 16, 368, -85, -94, -94, 156, 308, 174, -116, 31, 149, 22, -76, -245, -188, 68, 217, 14, 91, -153, -115, 70, 257, 78, 206, -198, 16, -73, -221, 83, 112, -184, 177, 61, 172, 298, -28, 272, 105, -47, -12, 17, -124, -29, 118, 226, -59, 29, 134, 17, 136, -42, 233, 101, 214, 127, -43]
2464d3k56J50K43l48K36l21L72j37J93j8l18L30j48jo6J68j49J23J56j25j10L8
2486c1l6o8l6J63m5J7R1j14j52J59L13j90N8j41L5k69J18R7k5K27q2R0J50l91
2510f2M0j97OK34K5J08kj72j10L70m15M38j97k5J85l02J57k7j01Q4J3j05J36M3
2534A24p6j45n1J98L1k9j41L29l07M08m48N6L70k63r4m18N00m3N9j20l7r2J94
2557Ej8K8K7k24J13K36m5Lj52J3j82K15P2n3q6l6J31L11n19K50k07J19J83l00
2581a16M8P6N3M5k07J7J75R3m02J16J15K02k25L78l27j43M00k09J27l38Q0N4Q0
2604I2p9n7J84k11o7oJ17R6k03K85j89J13k76j8K15j72j04N4L12M1j35jJ82j43
2628C0q0K73l32L93j90k21J08K04k93J08o6N5J01k14K41Q9j12q4j29L8p8K47p6
$$ y = [-43, -299, -149, 94, -254, -18, -339, 33, -104, 89, 71, -247, 83, -65, -66, -132, 36, -113, 10, 166, 41, -69, -31, -67, -135, -171, -8, -53, -36, 55, -59, -211, -52, 261, 71, 129, -12, 23, -246, -128, -31, -56, 171, 89, 179, 329, -62, -22, -219, -213, 21, 46, 154, 152, -20, -130, 240, -175, 263, 66, 41, 226, -76, 81, 54, -47, 37, 50, -55, 81, 124, 48, -97, -148, 50, 81, 52, -89, 240, -67, 341, -107, -51, 319, 56, -38, -456, 44, 1, 60, -60, -97, -189, 5, -13, 15, 42, -182, -69, 167, 122, 125, -27, -14, -196, 19, 91, 38, -48, -84, 47, 358, -161, 89, -118, 1, 184, -116, -68, 8, 61, 106, -101, -84, 91, 184, -218, -102, 13, 215, -10, 368, 41, -102, 298, 89, 216, -122, -42, 12, 92, 13, -44, 140, -71, -138, -144, -27, 69, -134, 151, -38, 75, -201, -219, -4, -176, -280, -226, 86, 127, -8, -9, 173, 30, -50, 223, -109, 284, 94, -127, -19, 185, -108, 0, -66, -11, 90, -124, 117, 206, 94, 10, -119, -81, -159, 88, 12]
2651A2P4k93K67jl72M48k7J3j63J88p6pj1q0K2K2m00M51k37J23j07M80j32k53
2675e9K82j87L6j69K33j76j16K63r8j19K26k75J27Nk6J89j62m8j53Q3J29r2J26
2698A9K9k13K25j71J5L7J4Q9O0n1k5j1p2j34J49k86N12j15j09Q6R0j66L50k22
2722A00r5l9j57K21j94K65J16l81J31k03K23J56l69K0L95k3P8k73p8K26j51k18
2744b50M98lm22J98J24k42K67j27j86P9J11j02j56K39l8l05L43l48K07k8l91P80
2766B48j32p2m6J20k39J06J02j03Q8j13J4M0r0K42k10n3j99N58l98K28l75K70
2788a4j66N4K49k58m0K35K32o07K3M25P8n3j24k20M01r2k28L02j01j56k43K76
2810b7N5j10L03k89M11n06k9R9K13l98M08P0l14K9L65n81M1K00N0Q8k26N3K99
$$ y = [12, 86, -207, 60, 59, -313, 135, 108, 121, -42, 146, 70, 63, 52, -28, -6, 16, -384, 67, -170, -47, -154, 326, 194, -59, 223, 36, 72, -97, 136, -40, -156, 107, 9, -110, 116, -159, -32, -27, -53, 136, -26, -74, -227, -144, -15, -107, 19, 48, -165, 60, -111, -96, -59, -45, 44, 104, 53, 28, 17, -55, -189, -40, -326, 186, 71, -38, 48, 138, -28, 322, 100, 5, -34, -191, 30, -164, 101, 217, -164, -33, -236, -13, 143, -226, -206, 189, 166, 244, -29, -107, 119, -32, -250, 248, 245, -177, 21, 145, -97, 170, 43, -143, -64, 47, -55, -211, 28, -10, -315, 28, -320, -113, -141, -532, 248, 116, 44, -2, 118, -121, -15, 87, -16, 72, -41, -27, 13, -77, 165, -45, -98, -297, 261, -137, 91, -284, -14, -180, -126, 123, -135, -175, 60, 292, -315, -292, 133, 211, 158, 34, -186, 215, 123, -105, 197, 96, -60, -303, -27, 28, -82, 221, -68, 343, -163, -192, -93, 120, -278, 130, 200, -114, -85, 280, -301, -260, -60, -10, 78, -148, -95, 204]
2833B04Om46K21Jn3j75L12J0n5J60p3Q1k33J94Ok09J39k07R7l58L48J70k72L22
2857A90m33J93k82M02j13J63j55R5k06K75n5j35J04L1j92J82j66k8J34n8K55k05
2879dm5k8J03N1j49J19L77m58K13N3o17N05j65J49Ol16j5J90J35j60Q2M10k16
2902B20k38j07L04k00k19L81j43n7j81J70K05q4on6k73P5J29K18j47OK4k21J4
2925a86P7l4K20l37K36j34J54l0p1M3l1j7J31j22J07K67k60J60j35j05J46k84
2947b05m1O0K9R1l1K40k19O1k78K54j16L58l04P7k8K92j91L4Q3l33P8r7K22J06
2971A42P3l44K86K5j51l17O7L66k66K1j7J61l14L5M65k8l01Q6n9R0j8j08l6J21
2995b1R6j38j33K33j68K24J3J20j10j16J13k13K3l4L72k62k89M11k31K22j01k60
$$ y = [204, 210, -236, -15, -14, -67, -242, 70, 80, 25, 185, 112, 193, -40, 154, 160, -49, 90, -117, -20, -378, -30, 140, -132, 190, -243, -50, -332, 70, -43, 120, -35, 60, -146, 129, 74, -61, 43, 74, -118, 64, -102, -130, 4, -54, 201, -4, -49, -77, 26, 77, -72, 47, 424, -34, 179, 232, -385, 120, -45, 104, 110, -206, -221, -31, 104, -56, 26, 436, 220, -18, -125, 179, -21, -240, 141, -2, -59, -240, -70, 135, 51, 45, -11, -284, -209, -80, 138, -9, -3, 21, -200, -186, -109, -143, 77, -260, -24, -158, -4, -34, -105, -62, -93, -110, 21, -101, 6, 273, 13, 173, 38, -67, 79, -205, -246, -186, -157, -66, -97, 143, -76, -15, -293, -39, -155, 203, -101, -24, -52, 240, 49, 83, 166, -167, -89, -186, 36, 142, 215, -129, 157, 182, 31, -286, -219, 147, -119, -98, -115, 46, -268, -233, 232, 204, -97, -11, -70, 20, 2, -106, -142, -21, 75, -63, -196, 37, -131, 93, 106, 226, 116, 0, 113, -100, -77, -111, 261, -1, -290, 121, -110, 112, 11, -249]
3017b49K36rJ7J89Q8j11j22q5J58P2k17m3pK03J8j92L7m4j45j2K66j62J87P3K0
3042A66j25k66M36p4R5j97m3M9L0k01J08k1p4K5K0j34L65j12J14k79j89L13Q3
3065H9K01j95L9l25K73K19k04p7j93L60o9k03K63RL3j27m63N20Q0k91P6J12j44
3088a7J68p7j66n4q2K07J06j28J78J16m33O4r4J67O9L4k01K41l01K69J05r6L6
3111A11J1q8j23Q0J19k50J73k42L11j94P8j25n0J97n5Jj51J05M08k27J64k50p5
3134g2nl38M50j01J23M5k83J22N2m8k9m9K39j21J6J5K88m95M7J41l3J37k32L13
3158A82k88P%O2j9N6p4l7R1RJ02Lj09m0lJ00l5j34J13k42J41J48q7J33k21M46
3184C04j63l4k05J41q3N9L39o59L91o1n2Q4K99o8k47r2K09j30J4J52l99L49k4
$$ y = [-249, -13, -22, -5, 184, 272, 161, 39, -46, 112, 184, -33, -76, -83, 120, 138, -54, -17, -61, -206, -218, 48, -114, 73, 146, 166, 41, -225, 211, 137, 232, 35, -8, 41, 71, -130, -22, -43, -117, -92, -72, -206, 159, 47, 161, -118, -307, 6, 89, 290, 95, 134, -191, 82, 301, 97, 20, -173, 187, 118, -85, 178, 187, 220, 93, -370, 150, 230, -61, 15, 127, -17, 151, 74, -92, -146, -228, -21, 85, -43, 135, 251, -182, -118, -212, -45, 24, 58, -143, 98, -203, 66, 171, 75, 111, 122, 34, -89, -9, 110, -140, 33, -209, 102, -92, -14, -139, -189, 8, -47, -46, -197, -92, 316, 89, 253, 3, -72, -77, -415, 35, -66, 57, 102, -181, -59, -7, -55, -84, -133, 106, -15, 1, 16, 304, -191, -144, -3, -36, 101, -131, 182, -106, -99, -99, -37, -56, 0, -74, -111, -20, -11, 91, 94, -15, -55, -58, 42, 7, -127, -14, -256, -115, 33, -54, 79, -142, 304, 141, 107, -98, 43, -40, 19, 358, -301, 90, 29, -23, 61, 360, 292, 45, -47, 162, 32, 46, 198, -201, 148, 124]
3207A24L8R9k42q6l3k6J01J30k64Q8Q5k21L25j39j0J8j26M23j64l44J61J59m67
3230c71L20k12K71m7K39l29J92j29L8O2JJ20k63O0N5J93k92P1j14J26J68k21L9
3253b3l4J58j15K16k04k70K63n1K82l51J7J53j06M8Q6k0m5k52J75J2K83n14O21
3276C29l86j32J00r4K56k73J33K00n6m22J67K51j9J54l82K82m3k09J72po6j23
3298a68K46r1j20J04O0j5j19K41j24J71l66K96N8N4P2j86j97q5L60p1n3o7J71
3321A71k42L0o5l2Q9J43R8P8m11R2m6K50K2j77j01j9J44J97k87l1KJ18k09L82
3345A96l03K9J59j44K17k31L19l50O1J72L26o35J81J00jj91L14j20M2j10N4o4
3367B1K59p2l04P2L60l29J1M1r1j9k10M08k78J80r4j84L74J1k00K45k38j34L77
$$ y = [124, 162, 261, 19, -67, -100, -126, -25, 105, -159, -71, 14, -207, 118, -21, -31, -13, -139, 284, 120, -224, -63, 96, -371, -51, -263, 8, -39, 200, -129, 63, -66, -28, 34, 35, 155, -108, -48, 7, 200, -92, -21, -135, -9, 159, -62, -23, -57, 101, -14, 202, -2, -272, -9, -60, 222, -129, -112, 41, -65, -17, 69, 49, 4, -248, -73, -61, 222, -292, 329, -57, -189, -89, -183, 73, -200, -67, 133, 77, -345, -178, 73, 54, 208, -174, 108, 65, -144, 28, 21, -45, -168, 78, -13, -133, -29, 31, 16, -103, 138, 14, 185, -181, 115, 173, 227, 299, 113, -84, -169, 191, 120, 67, 0, 171, -71, -41, -106, -138, -49, 94, 192, 270, -141, -49, -95, 155, 177, 0, -101, -120, 24, 221, -66, -97, -95, 23, -186, 196, -107, -78, 81, -63, 154, -77, 242, -108, -47, 125, 451, -184, -3, 97, 96, -95, 219, 99, 141, 31, 85, 21, 280, 208, -96, -24, 336, 7, 18, 59, -32, -51, -261, 147, -131, 49, -45, -229, 145, 156, -44, 201, -37, -171, 206]
3390B06m7p5j39k5o2k08L54N0N6j56q4J25j95j32K52Q1J51L8n2k84J34k25K57
3413B0k60J43K63k2j66K91l33K7l9K52j36k2m8p4k8J71j31j31L67k03k1J94j17
3436cK8L55k73J64m85K94m2k15L86j41K13p58M68j2k14J93PJ54n8o4OK1K02j71
3460E5J16k18j55K12J25j82M6k99L85j45j44K92k01J57M6j00N4O8Oj03j03n8n4
3483b00K22l41K36J96k80K51M7k0k57K13k29J78Q3j53K42l84L20k61R4N1L5k1
3505B2J64j61m1O1k21L16j18L2j1o3J67j91o4J08j30K52l04P0R0J37P6o04L26
3528h7J18N9k95K3K29M5l71M41k11k4M3N1j62P1N20n12K37l93M6Q7J01q3L39j38
3552A34l40M98m50K54n3k76K97k54J80j40M5K0M0J33l7O8j00k83L34J14j5r6j65
$$ y = [206, 159, 84, -55, -80, -142, -350, 4, 54, 110, -46, -130, -5, -200, -332, -80, 1, 152, 190, 138, -146, -12, -237, 20, -240, -97, 166, 144, -22, 269, -64, -37, -76, 176, 40, 18, -30, -104, -132, 39, -92, -223, 144, -59, -80, 114, -3, 25, 380, 107, 271, -214, 80, 38, -177, 209, 68, 281, -477, -9, -21, -235, -42, -35, 119, 61, -3, 3, 24, 226, 55, 171, -47, -202, 10, 135, -47, -1, -300, 85, -60, -204, 88, -113, 44, 90, -10, 44, 112, 118, 15, -88, -146, -200, 22, -319, -83, 113, -167, 84, 131, 111, -146, 67, -162, 16, 99, -54, 188, -196, 124, -137, -43, 8, 43, 22, 186, 25, -16, 45, -176, 140, 22, 54, 43, -20, 147, -44, -108, 0, -130, 122, -182, -112, -22, 115, 191, -413, -87, 31, 90, -205, -182, 47, 92, -279, 162, -49, -73, -30, 21, -141, -70, 450, -62, 175, -218, -172, -85, 16, -67, 272, 134, -206, 292, -158, 96, 43, -233, 64, -190, -10, -150, -105, -85, -45, 88, 51, 119, 19, -264, 70, 184, 169, 73, -92]
3575i2J67j37q2J56Mk3pj20J24J02p4j31L11m6j53m19M49p1JQ4m3j03J71J2n0
3600C0r5l7K6j9R7R9j22j3J07L29k28J31k86J04j37O6m8J94o2o8K28m03R6n3L6
3625b8m4k56J92r4N32j15l21K49m2P7k52J65m7K64j37j76J9J21l34L66k07K73
3647B05j93J5k35L30k6lJ08n3K0n1m48J32P0j82M64k82N10l48k06J14L5R7J76
3670B49L8j32j44k1M2J52k21j50J75K91k35M0K10n50M31l46RK01l5n8j66J48q
3693h0K36k90Q1j61K88o6q4J92j23J7k86L61n4R7m26J90L90k64J74n7L0p8J69
3716B56n12K5R2K53m5j10N5P7l9k9l3O2L1K6l19K66k04K10k69J8J72j22K4K51
3740A36M3k07l05L56O3j39J03j3j98L01r2m4l1j22J76L4q4om43O50j74J60r8j63
$$ y = [-92, 75, -62, -144, 12, 16, -7, -14, -134, -10, 92, 18, -113, 198, 152, -1, -420, 29, -42, -41, 43, 0, -103, 68, 80, 30, -65, -102, -76, -95, 2, 101, -21, -34, 73, 402, 174, 305, 19, 123, -14, 52, 4, 198, 136, 68, 296, -107, -11, -64, -28, -72, -328, -136, -230, 302, 187, -134, 115, 73, 150, -102, 63, 16, 280, 143, -33, -14, 107, -227, 139, -68, 205, 12, 27, -208, 122, 96, 93, 201, 148, 168, 117, -331, -199, -129, -311, 153, -129, 381, 33, -173, -59, -24, 73, 249, 287, 155, 11, -10, 32, 184, -37, -187, -12, 279, 44, 84, 294, -256, 175, -171, -162, 39, 4, -54, -220, -72, -80, 156, -134, -53, -214, 74, 8, -76, 116, -7, 10, -276, 85, 31, 128, -298, -108, 282, 18, 192, 135, 165, 87, 256, -256, -231, -139, 114, 69, -41, 14, 91, 52, 23, -10, 52, 83, 109, -210, 56, -148, 62, -207, -189, -17, -139, -115, 136, 179, -28, -333, 23, 86, -53, 50, 37, -161, 140, 48, 4, -27, -149, 27, 61, -23, -29, -472, 178, 4, 164, 66, -97]
3764i7R1n4j35NK44K2k32J14K23j84O1j60J46j79J58L17k45l0j55J2L92l79O4
3787al5K3j35K87N7q3Nk26k22K94k7j52O8L38N9n48M77j44p7L57k83oj56J84j70
3812a16J80j31j7K52k77J58K7K94k60l78L68k5M8j53O6q2L1L83l30P1k60K90l49
3835b10JM59m68J85J84k21k52J91L56m29J13M7J6QK19m84M9L85k39K16j0K6k06
3858f4Q7K0K8k72O9L21J13j4l71k46M81k47m8K54j90M1k98O04n06K62o4K14k84
3881a10L1K15m5k12M21k12k19M1J68J47j84m1L91m68K02J96m20L3j99K45q1j54
3903b55J98J69j31K53k35oj25J10K13k23K9k65L51k4N9j64j71L47o2J47j89j88
3925a62L4j51L19l31L89Rj68J26k80K31j58J51r3J40j75L88k57k16L61l18J85
$$ y = [-97, -6, -60, -195, -190, 54, 76, -156, -42, 181, -3, 58, -102, 44, -135, 23, 340, 95, 65, -90, -78, 314, -65, -1, -36, -13, -148, 139, 196, 113, 118, -108, -330, -36, -63, -215, -147, 191, 250, -298, 179, 35, -42, 315, 32, 26, -130, 54, -116, 64, -67, -84, 168, -109, 49, 76, 370, 110, -268, 100, 75, 123, -30, 36, -46, -15, 368, 38, 109, -151, 139, -210, -209, 250, -218, -33, 151, -70, -322, -131, 225, -204, -91, -44, -28, -20, 199, -285, -236, 149, -90, 126, 116, 142, -64, 23, 43, 71, -201, -132, 189, 302, 288, -83, -329, 152, -95, -143, 111, -79, -38, -336, 268, -238, 24, -40, 174, -110, -79, 136, 91, -121, 300, 88, -131, -90, 78, 225, 41, 0, 391, -77, 125, 321, -99, -66, -265, -20, -101, -255, -57, 112, -19, 234, -1, -7, -132, -22, 191, -32, -3, -268, 83, 59, 118, -46, -217, 130, 68, 215, 26, -162, -128, -279, 40, -291, 98, 107, -61, 65, -215, 16, -142, 9, -84, 56, -119, 269, 12, -204, 157, -161, 24]
3946B4p1K59Ll3m9j57o3j66L43j5o4J20j20N6N7j27L38n34N5K25P9j15l19J13
3970a61J99J21m04m3N18j02l30J33o3j38L02K80k49j64J62n2J71l00j5J94o7N5
3992D7q8k30K13j00K4M9L58K1o08M64j5L9j82k4K17N0m33K29J13k74J23O1j13
4015e9K7r8J63O0m4J17l34L25l46P7P0L04k74PL00k03l8Q4q1j03J32j86L1o1J68
4040C8l7m1J44j85J07j36M97l08k66L23J8l89K11k05J87M1K30j31k68L01l6l04
4062b09N9K03j30K16k2k75M0K51k41L82j91L9j06k74K94k6j07L45j79n2K05k13
4084IR1j33K1j76Q1K42lp8%J31O7k79P6k78J46K22j33N4k25L19j30Q1j83O4k1
4109c5L4j73P5L07k65J58J30j91O7j04j9J38l7k1M4l05J04O9J85j78j99K29P6
$$ y = [24, -47, 212, 215, 182, 133, -24, -87, -253, 90, 75, 11, 131, 11, 67, 124, -3, 335, -199, -144, 81, 160, 45, -274, -161, 38, 159, -245, -288, 230, 128, -202, -69, -132, -270, 32, 312, 63, -101, 61, 9, 180, -120, -135, 59, -8, 47, -41, -271, -58, -158, -134, -85, 273, 294, -314, 150, 135, 174, -8, -32, 185, 235, -198, 31, 144, -130, -7, 54, -59, -32, -130, 33, 93, 49, 166, -168, 157, -189, -112, -42, 262, -12, -5, 295, 92, 54, 138, 57, -46, 86, -100, -69, -130, 38, 1, -40, 104, -81, 26, -110, 387, 79, -187, 136, 154, -235, -24, -229, -42, -1, 229, 98, -170, 131, 95, -209, -150, 53, -77, 139, 117, -158, -118, 133, -108, 274, 83, 122, 16, -258, 36, 10, -97, 248, 69, 17, 222, 9, 100, -33, -12, -188, -107, 135, 132, 54, 54, 185, 252, -27, 49, -229, -83, 139, 6, 60, -165, 154, 24, 105, -78, -14, -35, -1, -174, -99, 208, -57, 101, 231, 40, 107, 3, -16, 122, 85, 64, 108, -197, -93, -24, 161, -17, -216, 13, 89]
4132H9l34N0L23j55l9M2M20q53L97k25K24J31l52L30O7P38n92k93k59l19O51M60
4154E01p75N56O8o12m08O64n65J15M37j25J49N3M64p80O0P9J52l29K92p31Q13
4175G8q6j20l74M83J89q72O58R2o00L02P93j042k47J428j022l72l72J379j15m90
4195c10R4O35k64j18j94N1L00N2k32k36J70J57l5k04K1R5o7m8K89l37L83k60M5
4218a3J56l64K30oR2j24j57J23j6K73K05l50J94l27P6k34L08m07M61j11q6j38
4240b15L7L2K96l75O2P3J06K74m9j57j46j02J52j65n0J57r7K27K05l41K37M7k88
4263h0J47j07OJ36j00p8r2M3J29j99M39j54l10K98k66K83j49Q2Q9M3l4l83L57
4286A00q2J92r4k10J9J80r1M4k42l6K24K84n28L35k37M1j22K09K60k54q7o0M32
$$ y = [89, -245, -195, 128, -27, -66, -24, 396, -457, -60, -285, -61, 70, -282, 48, 115, 853, 261, -32, -291, -610, 41, 501, -274, 282, 350, -262, -670, -6, -571, -456, -19, -144, 5, 58, 522, -258, -198, -119, 33, -296, -4, -735, 78, -8, -128, -502, -19, 170, -702, -44, 48, -552, -250, 543, -499, -746, 682, -340, -712, -1084, 295, 180, -310, -216, 419, 155, 37, -157, -106, 194, 246, 14, -222, -52, 105, 70, -134, -113, -18, -85, -133, 156, -181, 202, -58, -13, 143, -221, 9, 3, 95, -29, -186, -63, -79, 194, 399, 49, 243, -84, -8, -242, 66, -341, 120, 9, -77, -215, -178, -146, 150, -225, -163, -90, 16, 290, 241, 84, -62, -164, -12, -177, -227, -70, -167, 60, 265, -76, 161, 208, -80, 67, -40, -34, 102, 2, -76, -168, -125, 4, -195, 244, 90, -220, 78, -188, 95, -54, 28, 117, 160, 126, -257, 100, 18, 210, 116, -94, -75, 105, 14, 58, -184, -220, 4, 288, -240, 95, -142, -101, -223, -14, 246, -8, -95, -155, 277]
4309B77l74p0J55n5P9P7K18l57K47m19L54k32J07J54k42j2Q9l21M84l36J66oJ96
4332A79j50L0J60k76J85l39K42m0J73l32L23N4k93K63l13O8mJ18j43n6o9r7k39
4355e56J98J032j62q69m7R85m10o63N88m97k92K7P96p13N19K08m09L59j24K44
4375B14L4r82Q94m05N13n30k98m2J061k48J66qk57K52l54L09J30p75l0K11M81
4396C36l10j48m59M43L1L00Q4m2k39j9M2K11K81m42jj00J40O8l40j31J75q6J72
4419c4J2k7j76L83l6n0j79J76m4J52k60M9j7R3l9K54k92P3R6n2k8m20M26K4k71
4444a87K3p6J74J16L63m66J49J26l11J11k02K7L27l17m1L01L7n10J023j295N73
4465e5j03J83R85j385o12J111m00j79M57q30K66R62J33p60N80p13N84L99j168
$$ y = [277, -97, -167, -12, -67, 12, 89, 307, -50, 197, -222, 132, -100, 7, 161, -81, -93, -4, -325, 159, -177, -11, -17, 179, 29, 59, 219, -57, 128, -211, 31, -9, 164, -168, 155, 209, -84, 179, -134, -66, -70, 48, -95, -151, -220, -317, -556, -358, 674, 512, -357, -404, 581, 171, -492, 96, -401, -693, -666, 130, -583, -64, 144, -265, 94, -30, 214, 248, -734, 160, -245, 268, -262, -560, -602, 459, 211, 377, 369, 112, 364, 10, 319, 449, -326, -356, -145, 336, 26, -122, -581, -138, -107, 193, 277, 235, -4, -23, 19, 230, 511, 69, 68, -32, 108, 176, -164, -295, -120, -206, -34, -22, -49, -225, 158, 122, 72, -107, 69, 25, 177, -83, -34, -51, 42, 3, 257, -35, 38, 134, 82, 54, -366, 60, 84, -187, -164, -240, -66, 50, 413, -53, 96, 222, -89, 22, -180, -153, 174, -143, -184, 117, 154, -356, 667, -628, -55, -158, 25, 1010, -375, -987, 124, -276, -455, 2, -828, -562, 400, 533, -227, 353, -360, 224, 623, -545]
4484e45N06k73J113j107K06J0K52p39Q09K54r14O88o41P28q41J450j087m69j17
4503g17M82l89N64n23K13l14N32n66J79R88n0n82n44L5M70J94P36q31m62O43N3
4524A11O1m55J39k13Q49q72K73M2r5q9M7J72M09l68k40L03l36L52j08L9m5j65
4546a89j7M37l41K38k40j01LN09m73J13L4L95m67r7K53j38M7j4k2L84j80N7k74
4569h3j78L12j10Q6mk5j9J91j97Q7Q2m57N46J7l06O7j69N7j72J56r8L83J38j58
4593A46j76k3J44k1m83N63j21J89k49k53l13K10Q79l97PM5J59j66L42j002L78
4614a42J51Q1j97o04O65l72J00M54M36n26PK92r6o14j59K37j65L18n89N35J81
4635gn02N84O6N40J9j016K0P02j6m1l70j76O21n51j58P1j63J188q97j02j88O59
$$ y = [-545, -39, -312, 801, -306, -100, -90, 162, -577, 232, 486, -428, 260, -381, 347, -494, 956, -131, -600, -717, -235, -624, -60, -583, -370, -684, -152, -718, -539, 449, 399, -183, -727, -692, -222, -28, 708, -123, -585, 58, 111, 172, -283, -144, -357, 492, -380, -107, -65, -160, -249, -202, -30, 379, 11, -229, 74, -262, 90, -18, 21, -24, -189, -206, 231, -110, 128, -112, -213, -210, 299, -174, -61, -27, 368, -99, -196, 57, -81, -34, -48, -70, 314, 134, 191, -83, -261, 51, -59, 27, 23, -2, -21, 170, -27, 60, 142, -315, 231, 248, -58, 9, -160, -103, -275, -119, -217, 166, 304, 146, -30, -53, 91, 70, -413, 150, 29, 218, -31, -284, -597, -387, 492, 95, 102, 147, 306, 140, 482, -520, -142, 9, 90, -107, -711, -46, -418, -318, 136, 572, 46, 53, 345, 249, -365, -524, -287, -452, -134, -723, -188, -7, -509, 75, 141, 681, 700, -316, -296, 406, 390, 349, -21, -197, 424, -127, -285, -214, -377, 811, -86, -188, -376, 283]
4657B83q2k37l6K01J15l62J35J30k27RK23J26l49K10j57m4L73m81K3J23j93J02
4679a15p2J62J82l22O2J65k89K35J20K3M4l85R5Q4k40L32j03K9m1k14L8J69K9
4702a2J00k71L11k05k7n9q5K15J4M2j45K2J30O4Q6j81J42o3j47J94q5O6J32j58
4726H0l6M0J0q2J61N5k24n4J32N7k03J87k52j09J44n1N9J18R3j26j46K90j82K7
4750a2P9P2j32LR4j50j28R0J55j8K5P0k90j90L27n5N2l02L30J84k61o1K96j97
4774a9n8J84R4j36j37L79k41j75j45L07R6k34p1M7J00m1J7O5q7J50j28l35K99
4797f9N7M0O9J02j15r3j22N6n6L56l12J50l0l9P4j06J62j34Oj41L10k08k7K23
4821A53k97M40m51J82k9J06l49J19NL00j69K1PK4q3Q6r7J9j49L04r0qj93K75k28
$$ y = [283, 201, -36, -72, 129, 244, -118, 17, 147, -80, -71, 152, 278, -71, 139, -18, -62, 311, -170, -147, -24, -217, -115, -187, -25, 157, -165, -103, 62, -227, 8, 128, 151, 195, -190, -95, -11, -251, 81, -22, 7, -34, -248, -210, -41, -12, 88, -183, 128, -77, -104, -163, -248, -33, -19, 23, -122, -100, 30, 94, 180, -1, 141, 78, -69, 125, 40, 106, 238, 80, 44, 84, 94, 12, 173, 228, 4, -50, 82, 139, -64, 123, -129, -238, -94, -145, -86, 32, 125, -1, -147, 143, -39, -12, 67, 139, 7, 10, 104, -46, -174, -84, 71, 53, 78, 148, -142, -332, -5, -60, -8, -310, 20, 204, -57, -118, 178, -19, -77, 107, 201, 65, -72, 307, 66, -109, -254, 53, 149, -85, -156, -109, -9, -50, -33, 32, -55, 95, -33, -368, -69, -12, 28, 97, 199, 84, -9, -131, -75, -131, 225, -87, 63, 33, -6, 68, -38, 124, -10, -4, -145, 165, -43, -70, 153, -144, 296, -155, 27, -2, 104, -245, -126, -121, 179, 10, 31, 38, 62, -21, 65, -32, -13, -162, 142, 52, 44, -149, 126, -102]
4846a02L4J96r3O8l3j37J98r5J6J42j50J28l91o1M46j52%n6q6K86k83Q6o4K55
4870A52m7j02M1j64L03l80p2L11K04l44J61n3o1j82K81L1l35N92k17J20j11r0
4892C8k08k4J1J15j09J99J25j32J76l4j13j02K64r2M7k63J36Ml96L80R0O1j92
4915a9L3J46k04K22k33K96k60K81k41k00P1L25k39m19M70J97k47k9l8j03J28K57
4937A94J44j59l15K42m8j47r0J97M6L62n32L44p2m00K48P1M7%j11K99j56k0j82
4960c8R8j71o5k3J41j50M5J65k3j5j21j4J13J87j38R8j79L98m95MM05l43l25M20
4984b6k96K91k70O27j98j31L7N3j92K52o0l55M13n6j20K24j31k27J82k85L29n
5006E6R8m5JJ0k2j4o1J37N2j13j68J64j37P1q8j18J68J44K27k23N9k61k40K26
$$ y = [-102, -68, 128, 35, 103, 70, -67, 131, 36, 52, 194, 44, 172, -219, -280, 166, 14, 14, -42, -128, 158, -125, -39, -103, 152, 105, 3, 44, -120, 183, -197, -269, 42, 246, -98, 63, 10, -51, -233, 48, 79, -256, 336, 119, 239, 128, 38, -170, -194, -183, -68, -177, 22, 147, 15, 191, 157, 44, -58, 206, 114, 161, -102, 34, 38, -358, 22, 112, 173, -19, 14, 160, -44, 178, -55, 241, -19, 262, 21, -179, -108, 217, -22, -441, 29, 226, -21, -50, -88, -191, -63, 194, 338, 179, -136, 106, 58, -89, -179, 18, 64, 426, -106, 238, 166, -234, 14, 85, 132, 132, 21, 320, 164, 144, -38, 60, -111, -176, -199, -58, -208, -163, 2, -21, -36, -157, -171, -58, 129, -9, 89, -90, 308, -187, -183, 222, -121, -446, -26, -322, -31, -301, 326, 128, -3, 34, 87, -105, 147, 87, -268, 145, 89, -31, 193, 62, -165, 17, -268, 61, 56, 154, 109, 110, 120, 98, 84, 23, 160, 212, 99, -69, 95, -42, 29, -59, -177, -9, 135, 362, 139, 198, -63, -303, -77]
5030g7p0q4K66J3k56K59j51J92k2j01p1L86N8k32n3q2Q1k44q7J24L70k40J62L4
5054A75p6l15L15rm6j85J30k3R5l04R9L59q8k79L31J50l64N4K5K19l3l47J51l14
5078b80J83j92J62k88L24J78l33L13J49m85L47j56J81K15l72K05k49N9j3Q5k4
5099Ij3k24J58J99j37k75L19j38l3K57L4l48K25j51R0pm5J31j4l68J10J75O6r
5123A1L79k60m6j81j01J88J87k31Q5J36k48R0k67K73K27j40J15j20j88J64j17
5144d4RO1k01MK63m0n5K01j68k0M1O9L0k84L6P3k71K65k4M68l33m4J69m02J27
5169g0j45K36J04pn0L0j09j2L51k32k04J67J62l51K99q6K0l50K05r5K84N8j52
5192E3J97m53K08Q2L8j81J7LK82k69K6J10J23j08J17k1rj25q1l24J94J31K5j01
$$ y = [-77, -147, -231, 35, 48, -208, 51, -100, 92, 70, -31, -102, 284, 342, 110, 57, -25, 56, -188, -275, -151, 219, -21, 141, 175, 99, -216, 99, 90, 44, -141, -11, -34, 61, -243, -144, 215, 127, -152, 179, 329, -35, 19, 44, 263, 230, -117, 34, -280, -97, -289, -127, -415, -91, 87, -246, 67, 216, -269, 78, -78, 103, 318, -54, 151, -98, -39, -52, 33, 9, -4, -228, -70, 129, -8, -283, 36, -102, -135, 122, 156, -192, 33, -118, -28, -35, -80, 51, 37, -331, -221, -46, 20, 11, 390, 130, 84, -97, -198, -10, 177, -54, 31, 167, -81, 9, -258, 15, 242, 102, 217, 97, -91, 73, -44, -35, 26, -175, -171, 92, 52, -3, 198, 30, 10, 51, 120, 150, -134, -98, -25, -296, -31, -55, 413, 80, 36, 205, -197, -70, -215, 21, 125, 118, 68, 98, -11, -23, 328, 96, -108, 59, 221, -130, 169, 83, 103, -247, -42, -137, 147, 205, 53, 250, -203, 5, 87, 125, -56, -39, -36, 246, -23, 3, 113, 236, 128, 245, 224, 215, 90, 9, -315, -121, 10, 35, -66]
5216f6K89k01Q0j77J25j64l2L16j20j15J03K16k02J71k70J03k56J46P7P0n32O08
5238A69j93r3m1K35k74L86q6j62j69L55j25k51J56k43M21k52K98k01K08l41K04
5259AK9j46M2J78J74k26O6m06K85K48k39p3n7P2L18m49M03l38Q4J48q7K12k82
5282d3O4j80K94l49L27j72J36lJ07j78p1n1Q8l0J36l64K24J23n2o3l1k4R9O6j06
5307e3K34l37J30Q4j30J85j40J48L32n34R5Lq8n8Q5l5L62m24K87N9l42M99k25
5330A37n0n98O13Q0j20o4j20J61O7N0j76k1J62j58j63K29J43N8k13J8N0o6N0N4
5354A23K8k50nL80j02l96K79q9l2M7M5n2pr0J09K5J46P4k1l12m6J43l9j35j9J89
5380gm7j30J72K61l77J96n7M9j63K40j04j88K48r7J44n3J4r1J61k4j19k02J67
$$ y = [-66, 223, 22, 102, -75, 50, -114, -146, 170, 50, -65, 38, 254, 52, 223, -47, 56, -200, -54, 23, 93, -439, 169, -24, -117, -158, 77, -197, 189, 103, -59, -228, 127, 2, -249, -93, -336, 85, -167, 131, -70, 138, -203, 1, 30, -116, -74, 104, 278, 52, 118, -288, -3, 245, 6, -67, -124, -52, 266, -183, 220, -118, -34, 114, 27, 239, -43, 21, -159, 135, -214, 113, -59, 77, 74, 181, 3, -68, -119, -31, -61, 75, -289, -65, 58, 6, -57, -88, -112, -13, 53, -53, 181, -156, -26, 58, -72, 113, -27, 121, 453, -81, 14, 17, -71, -129, -44, -79, 283, -141, 146, 205, -137, 362, 137, 87, -511, 102, 182, 62, -2, -122, 39, 106, 156, -20, -41, 121, -37, -200, 29, 172, 230, 17, 35, 85, 19, 69, 123, 151, -99, -104, 276, 174, -222, 57, -32, -64, -17, 28, -24, -31, -121, -12, 13, 159, 233, 212, -100, -146, -3, -42, -177, -196, -7, -54, -184, -12, 249, -128, 68, 11, 60, -103, 137, 33, -155, 93, -4, 140, 87, 101, 10, 171, 147, 28, -174, -7]
5403gjj71J89p8m7L0K03kl00J83m4N7M0L5j22q4O5N0L5Pj92K64L1k33J27o8J61
5430A28k25J24J88k95J00p5j23P6J84q3L2m2rn8P3k13l9M30p8J96l12L5k60K39
5454gj07J12k96J96M2J51k80L87j83J72k6k88J51j64Q5j60L41q7m5m3j69K53j27
5477i2J47J8j43L93l24m5j2q3L80k65p1K55r7Jl03J83L59j59j73j85L04j9r2j8
5501d1k38M31j93k1j83K98n1j0r5J17J09j53K10l01J59j51l1K9J27K5J14j42j6
5524gP2j22J17K14j25k32L31k61K27j71j16Q4k40J63k22M72J47m14J99J8J52l77
5546i1qL6L45l22Jj65M81j63n13K07J97j95K08j0j16K42m9q9l96L03K47p1l92
5569c13K54l7K36n4o9k13j32M71k92Q5j90J62N2n5J61L7j07P9j44k0J01j20NJ35
$$ y = [-7, -8, -179, 10, -68, -115, -85, 118, 116, -184, -1, -45, 12, 52, 87, -35, -119, -54, -4, 31, 38, -154, 110, 141, -92, 35, -33, 128, -97, 27, 215, -80, 20, -55, -178, -102, 82, -1, 31, -11, -20, -78, -5, -218, -257, 173, 95, 291, -21, 14, -246, -7, -114, -2, -298, -102, -60, 91, -189, 198, 15, 187, 161, -127, 24, -140, -55, -215, 126, 39, -6, -49, -218, 35, -92, 55, 73, -70, 323, -1, -46, -58, -141, 239, -26, -97, 158, 61, 62, -241, -58, 301, 142, -31, -216, 88, 69, -23, -41, -279, 152, -41, -62, -245, 53, 2, -8, -103, 14, 123, -30, 180, -121, 38, -113, -144, -115, 12, 37, 151, 9, -7, 65, -57, 60, 274, 149, -83, 248, -13, 214, 43, -73, 11, -229, -66, -288, 184, 331, -83, 116, 134, 286, -91, -99, -63, 282, -40, -39, -204, 277, 114, -399, -192, 5, -190, 18, 8, -108, 134, 85, -4, -400, -97, 150, 79, -313, -59, -96, 140, 86, 17, -196, -328, 143, -149, -64, -254, -92, -40, -95, 66, 103, -4, 75, -69, -89, 12, -108, -103, 32]
5593C2m3M4K46k87j67j99J83L6p7M56n92K82o9J56j20j09K27k97K99k45rK44J89
5616A80k14j87J95m4K2L14l06Q1j05k3J03Q1l70K40P0j88j43J38J36J11j40J15
5638F6kk04J31L09k41j38J06k96N72j85j72J16J00l83K94j47K1L58l57L8p3K1
5660f6J09j88J86N9k62K20j05L47k74Q8J4L6J06l09k18J69J92l31K13j28M05j81
5682H2K0J26k72R2j81j07M80j28r2J37l9k7l12K92J02m11J88p8r1k28N03k34K46
5705F8j3l9P5l9q2j3K53k39J52j65K35k03J05l76J96k6j13L41jk14PM1N5j0m9
5730e4K10j20q6J78j4K00n7l99O0j18K5K54j03r0K97k1l28L08j52L8l3J71l04
5753a38J87j07l1J48j70L5rJ07J03j91J07j48qJ88j81p8K63k69K83j15l07M33
$$ y = [32, -11, 33, 279, -8, -175, -374, -191, -155, -232, 224, -368, -86, -155, 1, -119, -228, -1, -298, 1, -244, -253, -9, 180, -34, -221, -26, -70, -48, 266, -40, 41, -64, -87, 16, 97, -273, -33, 37, -151, -294, -156, -20, 91, -49, 66, 64, -140, -9, 300, 59, -79, 27, -269, 303, 118, -54, 62, 162, -221, 73, -74, -53, 305, -52, -14, -87, -66, 43, -145, 41, 100, -162, 58, -47, 300, 26, 114, 128, 164, 270, -39, -257, -88, 104, -227, -14, -142, 263, 82, 102, 228, -44, 48, -133, -240, 240, 112, 20, 157, 118, 91, -221, 71, 173, -238, -50, -128, -219, -447, 56, -178, 68, 55, 16, 91, 52, -30, -43, 210, -29, 123, -42, 193, -10, 95, -281, -85, -111, -224, 117, 116, -98, -91, -50, 5, -5, -54, 156, 36, -50, 128, 114, 314, 257, -142, -82, -200, -175, 79, -24, -114, 183, 162, -166, 142, -10, 28, -5, 166, -138, 49, -58, -89, 59, -111, -76, -85, 22, 125, -66, 41, -107, -115, 73, -108, -186, 77, -192, 91, -24, -331, 102]
5775A02k5n1k65K91j6Q9j02j62O9K18n23N75l3q9j76P2q4J16j04P0J72k41J81
5798H4r5J41m0l53J80KJJ55J47n03K11n7J34J57p3l12N0K83j90M4j7J37p0j90
5822a74J06K52l90p5N47k46O1k06K44j48q9P1J6j04K8L3q1K02J05Q6m49M58k25
5845B2k23L00LJ98m20K9l0K11o1J81k04pk66J13K33J13k96L3o9r8N4J94j09K5
5869g4k4K1o2K64N1j18j17j70K77n3K2o3p0K40l61K42m7J21o3j59K07r0J4p7K12
5894A23j06N3J9j18n9J39J46k21J85l8p6k13J26n3L6Q4l2j83K15o4J38K00m91
5917a90m9j04M39RJ40k29J57k87J19k19N36l62o2J39p7o0J10J82j89K94l04n25
5939e32K36N79l89J10J44k04L23p2m33K72q8j91K88n9lR0K04j03l63L32j02L18
$$ y = [102, 77, 26, -239, 52, 36, 125, 23, -139, -70, 148, -375, 200, 167, 78, -98, -26, -110, 6, -98, -28, 144, -97, 84, -11, 130, 90, -263, -83, -81, -80, 75, 222, -281, -70, -127, 7, 164, 91, -221, -171, 112, -78, -34, -51, 86, 16, -174, -68, 184, -206, -281, 266, 20, 81, -125, 119, -29, -118, -47, -31, -135, -107, -74, -155, 47, 152, 238, -211, 247, 22, -201, 99, 102, 300, -120, -91, -121, 90, 29, 210, 6, -1, -267, -154, 79, 192, -104, -71, -140, -238, -184, 10, -99, -74, -98, -77, -139, 125, 176, 58, -59, -229, 48, -5, 17, -46, -116, 124, -237, 5, -42, 79, 16, -143, 64, -26, -12, -89, 123, 17, 70, 89, -29, -88, 51, 197, -24, 161, 123, 47, -166, -40, -93, -57, 27, -5, -188, 27, -37, 101, 301, -190, -239, -343, 96, 105, 245, 16, 173, -114, 5, -214, 322, -40, -102, 37, -40, -100, 10, 192, 3, 297, -7, -532, -296, 283, -106, 4, 148, -56, 267, 195, -238, 34, -54, -245, 43, -16, -19, 71, 275, 172, -191, 141, 39, 357]
5961C57m39k9k47L64q5J56Pj73J04o8Q2j68k7P3J07R8Q0k61J58J37l30J50K09
5984B55n98L00kj05J60J90l59J94j03n2J90J33j60j35K18m2j60k56J65P2P6K15
6006A96k12J96l78o0J93K61j69n7N3k94Q1K44J06k23lNr0L32l3l43J64r0K5J52
6030E6K4k07r4K99j4o0M1O8j58n0R7n4J75k00L96m00P8Ll1Q8K0j3j57j95K91J55
6056A58j73O4l4p7j77L0K11J17j34J94m72Q0J7O9R9q9L6J07n6R8J53m38J62K60
6080B05l57J97j45K8L69m38K11k16n7L62l06K04j78K56n74N54O4ol78M2M9K72
6102A58j99m1L43k08j64m5L48l35J43p7k4L19l79m9L35p7J4j65K5M8J29j43k6
6125g0J28K8J00n0m36J38J28k3j66L70k18R6q9N3J0M2L0o8O2r2O9L1K57m20K67
$$ y = [357, -82, -111, -358, 6, -79, 77, 84, -89, 15, -53, 29, -139, -166, -93, 14, 112, 192, -69, 89, 226, -104, 46, 255, -343, -43, -45, -150, 10, 200, -159, 35, -68, -120, 70, 203, 43, -92, 126, 84, -76, -332, -167, -95, -19, 196, -16, 180, -198, -258, -65, 196, 27, -30, 23, -271, -190, 54, 160, -63, -66, -61, -151, 181, 148, -195, -31, -121, -96, 56, 80, -127, -221, 78, 64, 4, 45, 113, -45, -95, 2, -52, 123, -77, 319, -81, -3, 0, -31, 57, 77, 64, -93, -288, 3, 158, -15, 49, 15, -62, -239, -209, 2, 119, -15, 179, -293, -213, -196, -127, -28, -117, -81, 26, -30, 68, 221, -217, -55, 205, -152, 45, -100, -72, 297, -141, 70, -146, -203, 159, -147, 57, -121, 135, -439, 115, 179, 173, -205, -163, -114, 158, -41, -82, 261, 53, -111, -156, 192, -143, 0, -77, -101, 218, -161, -210, 125, 48, 62, -103, -78, -30, 99, -44, -70, 58, 86, 186, 136, -300, -162, -34, -57, -223, 147, -71, 25, -64, -11, -1, 41, 71, 3, 65, -27, 42, 73, 330, -90, 177]
6150A77k84J51M0R2j63J39j26n2J56j65k67L89j34J17r5k87L36o2L75k75j23K00
6172A39k45J87n58M23N6m1K12j05m05L74o4k1K8o5P5o9L3k08M01k38m5J99o0J31
6196A34lK4Q3k34j02K36j41j05K5K4R0N8m57L92K8p8L5L06m64k8P1J07m2J21K20
6221C00n21K14J38j63L4J00k85j03J62J45Q3l49J02L25k93K3Q2J99P2m26j75N25
6243A89l03p4K2K75m48K93L6K44k52rj7q3K83j71L0R6p4P4Q0o34N37l86K25l6
6267a03p6N14m44K6M8K58l37l8Rk8K81j50P1J14k26J23j2j36L14l04Q0j72K16
6290B8O6o7P3J1j33K1j8M8k8M9J28j30k39J22k2J08L2q6M7J01k78M13m59j1J51
6315g3p1J58K04k90J03o3K23l94K00j71K58m34M18J60j94J15j51R2j93n1M10k41
$$ y = [177, -107, 44, 84, 176, 13, 152, 26, -26, 130, -35, -302, 87, -47, 70, -25, -312, 24, -38, 337, 62, -61, 139, -106, 81, -477, -54, 2, -39, 173, 68, -337, 37, -27, -48, -20, -85, -10, -79, -46, -254, 147, -91, -136, 63, 3, 134, 131, 155, 238, 4, -98, 138, -3, -108, -83, -59, 31, 89, -368, 24, 52, -26, 9, 315, -149, -177, -106, 1, -41, 80, 300, -221, -7, 131, -32, 2, 102, -183, -286, -124, 21, 104, -245, -143, 182, -111, -88, -6, 193, 265, -161, -336, 189, -114, -188, -166, 109, -339, -46, -10, 234, -18, -27, -44, -127, 156, -15, 15, 111, 37, 111, 191, -443, 94, -292, -67, -103, -179, 335, -109, -83, -35, 223, -114, -152, -143, -171, 110, -40, 31, 145, -81, 42, 30, -106, 208, -96, -16, -188, 28, 94, 27, 100, 111, -22, -1, -19, 29, 1, 50, 178, 48, -191, -69, -91, 17, 49, -37, 10, 111, -167, 246, -213, -224, -73, -144, 14, 218, -72, 31, -32, 191, -203, -3, -174, 84, -350, 68, 228, 34, 149, -2, 90, -103, -154, 256, 15]
6337A5j35P2K5J62k75K33j33K15j87j07J14r1o0N0J08J98j31qj90r4M57J36k64
6360A10j48l0J67k16J27K6j14j69M26k82K12j94J8J97j07o3J71J3k5k41K08k25
6382a39R9j3J91l11K88l40N46k02j37l80M82J76l22L95m88P5P1M3o1J67k96K86
6404A30m3j59J99k8k14K57P2Oj78J65k12J48j11j1m6k18R3M40l39K43R3l28M7
6427Fj25J50l27K27J67n3j08M88k49O5m43O6M3M0j29K35k20M19k60J07m7n2r3
6450i3Q9J55o4j87j5J22l3l6QR6j98J79j39L7jM50m42J39j60L46l49M3J57J7k01
6475h0J27l07M59l11K30j02R9k44K50k25p5k0J98lR0J46k03J12Q1j37k2j63J99
6498I9r4p3K5r2K35l94L29j16N9n9L07j88k62J43L4J9j90L39k78J10j8J28k50
$$ y = [15, -120, -48, -23, 139, -136, 97, -36, 179, -8, -115, -1, -92, -152, -102, 6, 204, 73, 65, -125, -219, 238, 374, 110, -38, -68, 99, -117, 10, 36, -78, -247, 179, -103, 109, -85, -67, 130, 23, -40, 131, 144, 119, -122, 86, -139, -40, -53, 138, -173, 115, -225, 321, 119, -18, -398, 84, 260, -62, 333, -155, -80, -9, 34, -27, 140, -156, 130, 87, -72, 127, 99, -115, 142, 214, 220, 42, 207, -5, 143, 32, 21, -25, -243, -150, 290, -49, 194, 287, -41, 6, -119, 31, -296, -69, 98, 45, -63, 425, 176, 241, -202, -136, -93, -53, -182, 53, -167, 252, -8, 99, 52, 0, -93, -4, 151, 87, -100, -115, 7, -26, -62, -54, 42, -156, 23, -116, -79, -80, 370, -72, 67, -93, 253, -96, -53, 104, 121, -80, 47, -260, 199, -112, 118, 16, 115, -129, 121, -104, -179, -199, -1, -4, 86, 232, 29, 141, 222, 85, 63, -100, 99, 5, -68, -43, -135, 100, -294, 35, -81, -22, -81, 226, 38, -224, -81, -47, -28, -218, 121, -157, -47, -65, 63, -187]
6521a87L44m0J76j43j41J16j81K5N5k17N6K13k40J18J04J08j31M4J12l00M6j05
6543a68J98j03j28L9L10j96J25l78M16k3Q1J8l32M7K06l46M31k09J01j4j22J09
6565F2l94L16K43k43pk59L40j0p6R6r5K0q6K10j69r1L22j99o0nQJ32Q8k95J21
6590c1k15J43K4K43l41qJ72K8j1J55Oj2j83j02l9L9j39L84l04J34J27J74m0j24
6614H0l17K92n4nKj04J54j87J90K20k99J74p2l0j26l4K63k65K80k20q7N0l9M51
6638C17j58j70j29j28J49L05l08J49j21L9K33M5k61p9j00L94Q7k76L5K7k08RK32
6661H3k54K19k62J71l3k0k6K37R4j99M55m67k10j09K26o9m3J93r9K08j42j59K92
6684H6k48L27k56L77l03k47L00k5J49M2l29K26j92R1j21j12J25M18k28j30n4J62
$$ y = [-187, 157, 117, 293, 150, 9, 125, -56, -31, 24, -193, -137, 76, -164, -46, 58, 166, 35, 79, 191, -109, -63, -168, 30, -73, -201, -162, 148, -48, 77, -301, 115, 92, 173, 191, -141, -94, 112, -234, 197, -12, 89, 75, -47, 62, -332, -16, 227, -16, -23, -282, 58, 48, -28, 68, -27, -7, -93, 117, -52, -143, 179, -20, -80, -85, -77, 55, 143, -152, -31, -246, -103, -79, 164, -177, -185, -13, 15, 4, 159, 165, 153, -30, -132, -171, -132, -271, 113, -191, -57, 70, 244, 204, 80, -237, 55, 1, -4, -2, -106, 48, -139, 51, 271, -28, 146, 74, 44, -82, -116, 147, -118, 162, -58, -145, -95, -134, 317, 159, -11, -140, -268, -119, 186, -122, 27, -94, -55, 178, 223, -38, -117, -217, 177, 264, -12, 23, 50, -158, -149, 83, -171, 48, -214, -43, -76, -96, -122, 115, 209, 10, 465, -2, -212, -321, -95, -164, -207, -14, -113, 95, -47, -206, 86, -162, 165, -91, 286, -17, -264, 36, 11, 160, 202, -127, 99, -93, -2, -123, -235, -110, 308, 80, -50, -104, 58]
6706E8o3n9j74K34K15k76L2k69K32K58J97l69o1J00J53k49M2R4k6J3k5J38P6j12
6730A59l10j47L75J40l97L45L5k03P3N5m3J38j02o7j49P0L1J48j33J04k36O2o2
6753a14k1J80K83k88n8J37J75k25l19QK44K6l9j63k5K16Q0l58J53R3n9O4p3l4
6777a17k43J85J88Mj9p1J25k9J84k43Q1n4j9j47j5L17j77J27j95L62j17r3J18
6800A52O9l24K61%p7k30J49J87Q1n12K96L3j1k95K13N2N5M2l07KJ66p8r4J61O0
6825E1j20N5K0j8k2J35k86R1Q9J29j2j88O0l9K50q8j63Q6J59j14k43J76k5q0J83
6850H6l06L9J01R8J79J6k76j0J19N3j56k7Q0O4p2k11J80J32k66K28L8j37P4j82
6874a56L4K75l38L2J72p5J93k24J16q7K4Nk10K29o5K04p7j84M8l1J84n2k44J71
$$ y = [58, -5, -64, -238, -4, 211, -65, -33, -302, -70, 188, 385, 16, -45, 55, 208, -41, 1, 95, 69, 82, 57, 195, 271, 159, -151, -298, 77, 217, -180, 165, 200, -3, 70, 125, 82, 220, 118, 51, -98, -28, 3, 151, 18, 122, -114, -52, -114, -135, 45, 328, 40, -18, 119, 294, 69, -250, -242, 2, 28, -11, -174, -199, 17, 97, -261, -108, -15, -74, -10, -83, -117, -360, -175, 13, 17, -2, -73, 52, 23, 207, -36, 45, -9, -28, -175, -190, 127, -50, 77, -118, 244, 127, 34, 152, 221, -103, 158, 158, 81, -149, 0, 187, 268, -244, 52, 85, 74, -221, -8, 44, 99, 141, -166, -164, 2, -76, -170, -9, 51, -69, -14, 6, -12, -34, 101, -185, -94, -5, 124, 112, -76, -16, -55, 195, 107, -56, 30, 189, 75, -168, 8, -17, -97, 86, -220, -181, -80, 18, 197, 213, -63, -73, 46, 99, -57, -84, -4, 60, -12, -223, -43, 89, -177, 51, 89, -48, 26, -156, -122, 153, -185, -153, 19, -56, 137, -87, 29, -58, -34, -29, -239, -10, -75, 129, 52, -132, -84, -115, 69, 17, -227, -56]
6898e6j55P0K64j4r7M4K23o02K39L29k82l9J9L4o9L7q7M35l01Mn4j56K52l5j44
6923a41J27l3J60r6Jo9j7Q5J7o0P8P9k05Q4p0M31m71o3J54j60O4j69J01K69j77
6948h1J07r7K3J14j81P7L72m30j51K47r3J69N9k9r6o4J40m07R8J76M0O0q4j26
6972a57M52j17J70k66k40j03M43k84K2R4j69K65k56O5j07K85k55J36j61K33k3
6993B7j21K70l18J27L5L9K8k75K22j31J81N7l65Q0J89p8J80k77mQ0K84o4j55r0
7017g9K87m28J85j22j11K90L9QO9j45k8j64N5K33j80O7K14k00M9j91j1R8K82j97
7041B0j43L39k00q8k4qJ22o6k2J00j44J53K12j86j6j81K99l04K11k37L51O9k57
7064@K94n79K29R9j45K24j56N4j52J48n6M1rPO4J34l24J55J93k10k00K38l33K40
$$ y = [-56, -211, -141, 123, 109, 12, 56, 279, -323, -84, 245, -37, -76, -57, -23, -92, -55, -142, 293, -8, -4, -58, -214, 38, 3, -141, -14, -47, 113, 17, 18, -51, -68, 17, 34, -26, 52, 131, -74, 10, -60, 371, -100, -163, -9, -169, -105, -274, -173, 96, -81, 26, -71, -48, 66, -115, -38, 334, -96, -247, 0, -93, 76, 135, 106, 10, -54, 86, -321, -223, -47, -7, 53, -31, -157, 295, 178, 348, 82, -158, -261, 182, -102, -80, 14, -155, 110, -146, -81, -188, 97, -158, -22, -183, 50, 27, -94, 176, -142, -15, 20, 59, 87, -188, 34, -97, 84, 141, -224, -144, 45, -33, 147, -130, -134, -54, 230, 166, 11, -79, 208, -220, -35, -157, -268, 22, 61, 69, 138, -7, -35, -199, -144, 89, -91, -24, 190, -10, 39, -152, -163, -65, 217, 20, -123, 216, 16, -72, -96, -104, 18, -48, -70, 30, -114, 39, 251, 65, 49, -132, 167, -137, 74, -163, 188, 257, 0, 294, -285, -56, 43, -102, 122, -34, 20, -132, 16, -40, 1, -8, -1, 63, 197, -127, 28, 221, 11, -189, 49, -284, -44]
7088d4k40L07k96M61k37J56RNj04k18K89p8j27l1L04k70K10l78L01K09l01J70
7110I7r4l5N0r2J01j07J54l19J92l5J96J5j69J58No1k29J11K49k01J73l07k19
7133c67K47J39j8PR3J5k62L58k48J04J36k34n2JM37l00K9j48N8j98J53%p1K06
7157H5j71L22l30j75J63K08j65J46J76l86M9j60J20M7J20l51M39l50L5L92j81
7178C3K14k22J88j34Q0l25K2L30k60J31nJ06m9j95o7J77J25j71k22K35J5J07K72
7201C85m68J34Q4k0j40P5J20j47j17J64Q6j11j97K23j58K51Qk18K30k91J01l8
7223d4Q7O4k04J01J38L5j33J82j25P0n6j22k3qJ23r3o2J22Kp5J82M2j85K26l43
7248i9j28N40n33N4J22K57j28j30k9P6j30K82p7j12m8J35Rj5J00j7j31J54p0L
$$ y = [-44, -284, 23, -273, 188, -49, 107, 116, 121, 17, -201, 88, 10, -117, -148, 156, -114, 96, -282, 19, 228, -73, 97, 3, -32, 18, -74, 27, -80, 74, -245, -53, -88, 108, 123, -46, 112, 117, 56, -173, -62, 187, -14, 159, -148, -367, -120, 19, 1, 8, 101, 116, -146, 212, -36, 68, 204, -30, -82, -81, 356, 56, 85, -63, -5, -203, -50, -50, -121, 85, -86, 236, -94, -269, -106, 102, -63, 83, 259, -127, -78, -238, -118, -71, 49, -302, 137, -213, -178, 214, 33, 247, 25, 213, 79, 159, -166, -144, 186, -74, 57, 52, 158, 109, -86, -153, 24, 149, -22, -244, -9, 6, 113, 385, -83, 51, 135, 115, -25, 50, 170, 23, -94, 70, 156, 45, -152, 71, -87, 164, 172, -46, 184, -107, -6, -44, 43, 107, -97, 4, 142, 177, 44, 226, 101, 171, 115, -7, -30, -38, 85, -8, -70, 52, 54, -21, 161, 203, 18, 244, -99, -227, 313, -220, -166, -44, 213, 85, -45, -74, 2, -128, 154, 77, -35, -83, 52, 61, 46, 146, 129, -2, 152, 82, 85]
7272H5k71O7M05n96M26k87K37q8R1L6r5K83l29J07Q7j19j20l1J12J00l59K04O0
7295EJ1J40j5K3Pj34J57j95m7j22o8L01J46l51m4K82j88P3K2j78K98l04kR7J10
7320B4k18L14j47pL98l92k39L31J89r7j89j27J72J38j68N6K74p7m41K11j05J96
7342I6J8N6N7k57j13J78j49M31m84K41k90L87k85LL69l41J07k99L58n8rn8q6K25
7366I7q8j47J65J35j24j17K89l05k06K31N2N4k00K68j50j22K23m3K27m25K63k86
7388b09N78l46J05l52L76n8j81L1q1L37j11k66M9P3k56M47j8k21L5n7K32l27J93
7411b7R6Km38L09K86l1k00l8P5k37J05l6r8M30k68O6j8j81J45P1K54l9q6l8rj55
7437f0j27K49k61R0K14j21J00K02n9j81k1j17j5K83j26p6K0j52J87j23J52p0m1
$$ y = [85, -186, -119, 286, -310, 116, -171, 66, -22, 69, 105, 10, 293, -36, 71, 158, 39, -81, -112, 0, 100, -259, -55, 5, 16, 156, 141, 164, 171, 37, 194, -1, -48, -170, -238, 63, 209, -142, -186, 96, -92, -19, 3, -175, 123, -181, -183, -86, 24, -194, 120, -27, -34, 364, -28, -267, 64, 253, 156, -33, -160, 12, 150, -18, 38, 312, 235, -206, 5, -100, 96, 114, 170, 227, -30, -143, 35, -114, 317, -167, 74, -216, 171, -114, -111, 258, -83, 24, -275, 83, 25, 16, -42, -128, 97, 9, -138, 27, 162, 38, -79, 210, -95, -301, -70, -18, 36, -164, 104, -46, -168, 55, 12, 239, -186, 77, -209, 369, 23, 128, -224, 152, 94, -87, -56, -137, 200, 89, -177, -128, -55, -311, 136, 118, -103, -68, -125, 107, -220, -27, 69, 71, -367, -58, 228, 197, -3, -41, 34, -203, -98, -134, -232, 198, -70, -4, -22, -203, -58, 13, 267, 228, 142, 104, 95, -60, -187, 62, -199, -109, 105, -16, 84, 286, 227, 46, 25, -92, -107, 176, 50, -26, -6, -158, 29, -94, 58, -12, -53]
7460e3k57M11r1r0K53p5j17j6R4k20K17j0j82L35j27j76n3J13n7K78q2m3k7j05
7484h0J78k10jP1Q5j3k28L12K67m65J06N4o4l67L59J86l28L76j65l50K36q2K52
7507A29j90K17l25j37L32P8o1k49J7K57j46K46l26P0j4K09j23J39j93J14k12M14
7529B46j84L38j47k90j43K75k07K40k19K36j22j01J46j96L04j94J65o8J98k33
7549D4m3P3k34J15L16k54mK89k78j45j68M49k90K71k3k75M07j30l7j3k41J01p3
7572a43q6K63j00L5j59n6K71l18K21K58k48j0J75o0p8j79K93p6J01j57j03J41
7594a5o5p9L8L13j53N5n4l4k02L79q1k72O7K93k16J5K10j61j04R2m6k47L62rq5
7619AR0k0M4j7j57K19o1R4R2l00k46M58k98J07k2K40j29m21L98l4k51J63J07j66
$$ y = [-53, -310, 101, 10, -80, 173, 98, -19, -35, 59, -161, 56, 46, -136, 199, 72, -104, -157, -44, -101, 177, 95, 52, 25, -80, 98, -112, -113, -42, 43, 30, -198, 114, 381, -84, 22, 76, 12, -355, 4, 190, -138, 238, 73, -277, -41, -123, 129, -61, 156, -169, -306, 26, 104, 43, -206, -189, 68, -78, 168, -158, -88, -102, 107, -16, 123, -70, 44, -168, 246, 62, 400, 253, -37, -180, 95, -112, 128, -91, 145, 23, -78, 68, -128, 176, -18, 147, 79, 277, 44, 1, 74, -160, -45, 271, 17, 13, 302, 24, -121, -289, 160, -130, 141, 118, -157, 250, 120, 83, 70, -171, -70, -143, -229, 34, -66, -31, -190, -246, 25, -293, -72, 186, -62, -72, 103, 43, -35, -214, 79, 3, 104, -53, -156, -15, -80, -159, -121, 192, 39, 94, 40, 6, -196, 183, 102, -170, -103, 190, -26, -11, 199, 38, -66, 26, -20, -267, 95, 86, 1, 91, 71, 115, 98, -59, 160, 99, 193, 285, -15, -261, 197, -101, 6, -16, 224, 95, -326, 72, 38, -213, -50, 57, -109]
7643a09J9M9J29k77O3J19J48j04Mj9k7j25M9Q9q7J1%l4j34K60J49k55P3L7J73
7668B01l46k6J34K2P6l57L48j12r2P9j03J70k28M85Rk52ql12L88j60L18m19K17
7691C2j33K37o0m34N56l39K69j77L9k06L3L56l05K35q5J33j38j82j5K80j12K6
7713A0J50j52N6r5K83Kk35P0l82K41k32K26l6J93j97JJ4K07j14K06k1o3k25j28
7737b21M65l24J30L5m0l11K70J5J7J1P5k20p9M7K75j44J08j70Q9J24k90L06k35
7760f7L7M81l12oo7O5l26K75p9J73k91K67l53MJ36P8K4P9o0O9k06m5N2k88K32
7785a28J4o6Q6K16l93M03O6k06O8K02k99Q9j69K56j50q8p2J2p9k2K04j34J0K21
7809D1M7n9J88N3k16M0k71K33q9j13L5K48j77O9K96m25R1J07k3j71K62j32N7j62
$$ y = [-109, -90, -41, 88, -189, -126, -7, 141, 37, 41, 22, -5, -130, -81, 8, -79, -68, -68, -102, -236, 24, 173, -82, -9, 28, 201, -145, -171, -37, -15, 61, -296, 52, -60, -152, -73, -176, -6, -234, 251, 260, 8, 0, -312, 76, -84, 234, -185, 32, -101, 136, 76, -358, 198, -141, 128, -49, -10, -216, -183, 173, -132, 103, 18, 151, 13, -169, -184, 96, -16, 10, 160, 8, 64, -31, 252, 254, 19, 89, -293, -52, -284, -58, -94, 99, -98, -97, -83, 124, 10, 216, 195, 132, -93, -221, 244, -80, 50, 85, 45, -266, 4, 19, 36, 47, 122, -98, -177, -130, 145, 1, 109, -61, 28, 152, -138, 168, -67, -30, 451, 139, 133, 66, 131, -195, 80, 1, 174, -117, 150, -203, -199, -63, 15, 39, 118, 58, 127, -79, -124, -72, -360, -128, -114, -180, -94, 122, -271, 132, 198, -8, 60, 262, -37, 52, -117, 139, -11, -99, -171, -159, -238, -260, -56, -190, -180, 41, 88, 29, 217, 270, 54, 94, -177, 56, -33, -146, -111, 137, -40, 29, 325, -100, -9, 98, 75, -96, 166, 34, 91, -71]
7833g1K15k72K57j79J59k81N0J72k11L97k80K19l61L17k85j34M33l28M87l15o5
7854g6O0j35J06j25K81l22K07j81K18j61J51j75K68K7k84K60l50L07m30L02K95
7875B43k72K18l80P5M16l68K11n48L35K17l14L46k05J44j49P1J2M2r2r8O6J24
7897I4K4q7O5j16J05mj36L29p9k61J78J44l10JL6J16J3p0k77M62j00j56K17m6
7921A42m28K22k5J84k04J41K43j75J67k37J57n3k16n1Q4J55o5R3k30O2K2m5L03
7944B46k85J28j03K9m7J34j22j24M7J47l3q3K5J6M4n7j28J72n4J64l20R0R3J7
7968dj7l0r1j10J22n3J9K77R9j06j52NK98l17J26j24l6k1J92p5k6J77k89R2p1
7993a15Q5N1j72R7J34j46K6P4p6p5Q8J18j3k00K2j75J65K41k18J45q7K60m4m70
$$ y = [-71, 144, -128, 129, -50, 109, -172, -122, 50, -161, 236, -44, 175, -186, 131, -154, -288, 145, -183, 304, -11, -76, -16, -151, -45, -170, 111, -211, -4, -185, 33, -128, 23, -152, 116, 143, -141, 119, -231, 76, -354, -52, 243, -29, 189, -191, -116, 300, -68, 143, -405, -70, 147, -167, 179, -26, 118, -31, 40, 52, 94, 2, -96, -30, 94, 118, 31, 96, -20, 85, 81, -55, 274, 195, -66, 112, 256, -54, -53, -17, 99, 112, 42, -235, 227, 127, -29, 188, 142, -286, -64, -89, 95, -109, 32, 275, 100, 267, 30, 187, 134, -82, -133, -49, 106, 41, 134, -96, -34, -12, -57, 246, -39, 89, -14, 15, -32, 102, -20, -144, -97, 50, 17, -66, -41, -25, 19, -38, -166, 6, -48, 116, -204, -114, -21, -4, -21, -51, -142, -252, -130, -183, -164, 113, 212, 106, -46, -41, 257, -60, 66, -58, -94, -115, 77, 2, -24, 153, -136, -44, -115, -30, 21, -151, -54, 80, -66, -40, 34, -42, -117, -29, 89, 76, -124, -102, -277, -112, 129, -89, 56, -31, 229, 185, -285]
8017b85K37L57l28o3j39K29l2o2Mj87J81M6M1K02j23R3k6l6o2N2Mr7m9n1K44J4
8043A64k23K10j46k05K27O7M3j83j79K42K76j52p4k69K15o0M5M3l6j23j5K93j97
8066c7o6p9J9J55j15J9r3j43L72qj24K29j57J69r7j71K74M3J4l42L16r2M0l37
8090b11K22J05j23Pj40K1L07q1j68K01Mj90J91j18k40O2K85P3k82J12K08m55J66
8113d4L3L72n49L34k05K17l7j05j51RJ42O8l09L15k6o7J1j29K93k12L9K01l01
8136a01J46K7J25k47j6J34M6j65j82L84l1l6j43O0R9k1j30J01K84k48k59K53k54
8159a74K4j1L44j52n2K21l62rJ14K04J24l22rj74M03j10k00L1K11k3j52M7r9m
8183a30K76r6M5J06m6j25Q8k20
$$ y = [-285, -48, 309, -19, -82, -221, 8, -24, -86, -82, -269, -88, -42, -1, 201, 78, 171, 145, 109, 47, 99, 103, 6, -43, -94, 150, 164, -59, 151, 5, -200, 27, 94, 137, -46, -225, 17, 293, 141, 67, -202, 13, -47, -2, 41, 5, -118, -133, 160, -37, -103, -182, -163, -8, -123, -104, -197, -340, 32, 24, -100, 129, -28, 141, 44, -127, 147, 190, 204, -138, 178, 86, 126, -211, 11, 116, -7, 0, -140, -119, 188, 107, -61, 140, 144, -46, 145, 27, -213, -151, 134, 207, -75, 37, 245, -210, -44, -11, 361, -188, 146, -59, 158, 121, 16, -135, -126, 16, 84, -225, 90, 64, -3, 8, -121, 172, -40, -1, 200, -101, 45, 72, 197, -50, -66, 68, 114, -51, -233, 151, 120, 84, -59, 1, 100, 79, -51, 50, 334, 86, -173, 80, -174, -150, -161, 183, 31, -21, 200, -162, -171, -57, 147, 271, -51, -60, -234, 169, 59, -141, -110, 101, 78, -74, -27, -126, -130, 146, 50, 95, 201, 155, 30, 118, -102]
8191a02
$$ Imaginary data points
##PAGE= N=2
##DATA TABLE= (X++(I..I)), XYDATA
0@%%%%%%%%%%qJ6j6J6k4L2m0M8n6P2q8J04j20J39j63J92k24K59k99L44l95M51
32B40n12N79o54P41q36R33j044J168j299J445j605J777j966K173k398K646k917
49a529L213l539L900m298M741n237N792o423P147p984Q965j0136J1557j3333J5627
64H463j8706K3085k9843M1746o8748K40545k239m04141K18758J9952j87124R8696
76e9556K12197j31370o7424R0602o5547j51301J11519R7423n7757L6755R0051
87A05592q1901o4087K3088m042k1733M6015O3151R02n0887J129j0419o6964J340
100e8816O4800m12m597M0410q645o9763n798M2488k4045j2111P7357P545o0177
113a1764K1872J1239o3326Q167N3307j2379r606L5354o185m7225K87J9983k2956
$$ y = [0, 0, 0, 0, 0, 0, 0, 0, 0, 0, 0, -8, 8, -8, 8, -16, 16, -24, 24, -32, 40, -48, 56, -64, 75, -88, 104, -120, 139, -160, 184, -211, 240, -272, 307, -347, 394, -442, 491, -553, 615, -684, 761, -844, 933, -1033, 1140, -1258, 1388, -1529, 1684, -1855, 2045, -2253, 2488, -2749, 3043, -3380, 3767, -4217, 4748, -5388, 6169, -7164, 8463, -10243, 12842, -17001, 24745, -44003, 196542, 194303, -209838, 8920, 28872, -158252, -59556, 152641, 21271, -46153, 44449, -21098, -172399, -60880, 36543, -21214, 15541, 105592, 23691, -40396, -17308, -21350, -43083, 2932, 66083, 66985, 16098, 17227, 6808, -60156, -58816, 5984, 5572, 975, 41385, 32740, -37023, -42821, -333, -24378, -36489, 40868, 48413, -11764, 10108, 21347, -41979, -33812, 19495, 7116, -2490, 32864, 26679, -20546, -20259, -276, -23232]
126b3232M163M5226n191k4605J0462o026k2300N874J5947M601Q54P705M86k0342
140f378p725J3266m063n129J7327Q005j1938n471L100o345q682J2037J1336r207
154A33K597R591j4681r516J1764N5m891J0192N400r760m306N423m145p436Q927
169f53P175o338R43M333p300l522N046J83j789L560L209l411m491K268K36l430
185c981L579M367k358j366J072k041k633J217L290j29r76K591n44m980J285K761
201A154k859N64M095j478k830Q52P76k396o4M019l10k459K961j68m401M60K497
218D13j285L62K548l85k245l56J229j511q96L388L71k327J567j93k288K77J533
235B02m38l70J198J819k591j319K510j420j403K524P55j894J063N59k217n52J671
$$ y = [-23232, -19069, 26157, 20966, -3639, 6823, 797, -21503, -15629, 318, 4919, 5773, 13478, 13964, -6378, -14103, -837, -4900, -10029, 7298, 15303, 3365, -2106, 994, -5351, -14033, -1996, 9340, 133, 2730, 12321, -2360, -11876, -112, -57, -4948, 5244, 10644, 884, -3422, 2001, -2144, -9580, -653, 6522, 184, 1127, 5460, -1840, -5362, -316, -133, -1922, 1638, 4847, 1436, -3055, -787, -551, -3981, -402, 3965, 1607, 241, 1313, -728, -3361, -2144, 1146, 1017, 41, 2632, 2088, -2892, -1607, 1154, -1705, -1141, 2954, 1476, -1354, -502, 274, -2122, -2186, 1833, 1523, -936, 2025, 1857, -2544, -2084, 413, -872, -510, 2038, 1653, -592, -948, 281, -1230, -2126, 1262, 1633, -694, 873, 680, -1608, -1331, 202, -236, -606, 592, 2411, -180, -1499, 1011, -409, -1812, 712, 1467, -427, 636, 1195, -1022, -1574, 97]
252I7K42j269J216J433k145o00J708j519n29K092n1p21M83M30j057j117J290p
270b4q70J575P53j787P0R16j134n94J538L66r39M68M27j045q18J318l89r46J590
289D75P94j753N86K52p60m13Q28N19q93N09J108j281n48J037q04l26J202k13n52
308b33K8P22o96j181J379O06j042Q16N04j184r5N81l59l87P22M72r29j52R41m59
328E4q50J190n52p86J308K13j011J70L48p5l32L79M97p90K97O17j061J32O85m18
348A5n20P65J88o57q4K57m0l23L24M86q97K94N29k69m33L95J46l55L28J97k48
369I8j11L94m85m15N95J06m18K47J83k37j68L43n2m3J83R5l58L6K84k55k92M74
391B04j63m50M58M63n47j31J23j01K60J59j75m0J98k70m5nM42n19kK57K33l33
$$ y = [97, 339, -930, 286, 1719, -426, -1026, 682, -837, -1366, 726, 675, -46, 437, 867, -190, -1307, -17, -24, -894, 681, 1434, -353, -283, 633, -501, -1095, 443, 809, -130, 338, 765, -280, -1098, 220, -169, -1115, 475, 1269, -484, 102, 354, -406, -819, 9, 528, -365, 144, 1252, -29, -577, 460, -344, -670, 532, 319, -233, -205, 517, -179, -1360, 19, 625, -417, 399, 903, -281, -376, 205, -154, -541, 181, 653, -276, -428, 513, 54, -796, 394, -158, -944, 364, 577, -434, -264, 84, 9, -323, 56, 553, -237, 60, 677, -384, -252, 433, 15, -505, 260, 448, -209, -293, -36, -76, -399, -75, 411, -486, -192, 337, 68, -365, 30, 176, -179, 149, 346, 98, -13, 381, -104, -519, 76, 182, -236, 11, 194, -43, -211, 132, 80, 37, 220, 315, -43, -7, 277, 22, -270, 204, 41, -409, 49, 512, -35, -166, -43, -144, 116, 275, 100, 60, 258, -12, -57, -62, 380, -139, -141, 116, 349, 16]
413A6Q8j0k6j88K96m67J49M28k98l7J19Q8n1k46K5O0l65R6M96k09J8m0r5J30J70
438A47R5j66j65K54k37j36L74Q0n82Q46m32m37K80J82j85mJ78L06p50K40L58m05
460a59j51N38m44J49K87K5n30M5L29j88m2K64L31r38N88K22o52K51L05m64K67
481C3J10M4N3n61N06k76j71M56l85j82M80J17m75O9M04l25q1M17j06k43r4N43
503C33n83k22O43j91l52L33J29k23O5M02j55n17M04L95o88q4N95m76L92Q2j89
524I3r6m7J59j97j69L20j04k62N18N5m13K02n4M4L1k02K84k37J4qJ96l68M72k58
548b7n9K04j68M3j04L08p5j72n5J63j81l7N32q12J70M79j83l90L59m1n5L6J50
571H5k73m6N76j10l88M67j53k9k32L16j45j79K39J06l69j69M99k35j08L4K01m54
$$ y = [16, 104, 94, 68, -120, 176, -291, -142, 286, -12, -49, 70, 158, 107, -139, -114, -54, -419, -323, 173, -36, -18, -58, -153, -23, 147, 242, 76, -89, 165, -72, -208, 166, 246, -336, 510, 78, -359, -79, 103, -82, -86, 92, 398, -352, -112, 246, -159, -310, 228, -216, -67, 220, 245, -285, -240, 89, -99, -141, 123, 454, -484, 104, 326, -326, -75, 230, -234, 33, 143, 187, 240, -321, 185, -91, -262, 194, -191, -373, 107, 224, -251, -182, 222, -103, -184, 233, 127, -116, -210, 333, -250, -472, 171, -20, -372, -39, 90, -133, -68, 334, 179, -338, 66, 461, -227, -311, 284, -192, 200, 282, 93, -3, -50, 109, -88, -257, 63, -41, -303, 215, 270, -143, 59, 5, 49, 80, -122, 162, -75, -61, -69, 127, -241, 231, -27, -86, 118, -50, -7, -111, 197, 122, -50, -105, 58, -123, -160, 372, -440, -270, 209, 26, -364, -5, -46, -101, -65, 85, -188, -234, 342, 232, -156, 311, 158, 129, -103, 213, 68, -111, 128, 234, -135, -304, 195, -40, -148, -114, 87, -367]
593c67L81l6r8M5M05n40K21k3J76m41R7J44J26r6n3N16m85r2J94J89l94PJ29q0
617g5o8K03l5k19N18k5m84L30K77m32k5J41j38l3J75K11p32N28O6k90K39j00j7
640A5j53N0lJ21j10K80k15k00J80J20O3l18K46r8j63J11K65j84p0K58k63o2M03
663B73k05m11M65O2n67N75j40k46L41j41K14l51j5L37k14l23N55j69k34L83l63
684a74L50k22k9K21j60M96k55j89k78K18R4m0j96J41K14l58L05j31k28OK37m80
706d58L85J60k75K77N2k08R1j89M6M3N9K64j49q6j19k2o6K91j14j2J2J00j08o9
730i5J69rj51J5j44J41j27J24L16k82Pj3M9j43J06J73J31n05L24l7n7J04j84K18
754A30K3r8j19R2K8K6k61K22p8k93N85k95pK29j49m27L12J65J2m1N2Ql07K80j63
$$ y = [-367, 14, -22, -120, -75, 330, -210, 11, -12, 164, -277, -180, -36, 90, -6, -59, 457, -28, -120, 74, 263, -131, -124, 5, -75, -143, 60, 25, -194, 324, 299, -185, 145, 422, -10, -35, 106, -32, -65, 110, 321, -411, 117, 183, -107, 132, 32, 15, -138, -88, -91, 30, -80, 200, -15, -215, -35, 85, 148, -170, 76, -22, -185, -74, 191, 7, -63, 195, -68, -130, 273, 68, -343, 122, 184, -383, 192, 52, -194, 147, 6, 220, -131, -146, 191, -23, -346, 209, 40, -194, 189, -174, 176, -46, -75, 146, -14, 482, 227, 38, -240, -22, 72, 32, -164, -23, 191, -167, 138, 7, -221, -215, 22, -458, -73, 87, -188, 89, 141, -67, 24, -165, -119, -76, -17, 247, 98, 12, -107, -129, -195, 96, -18, -30, -18, 82, -26, -95, 74, 65, -86, -71, -215, -74, -201, -77, 239, -43, -36, -49, 0, -143, -37, 136, 267, -238, 86, 49, -8, 96, -88, 130, 153, 55, -64, 28, 56, 82, -179, 43, -35, -328, 257, -38, -45, 184, 35, -392, -80, 85, 97, 56, 108, 116, -191, 89, -74]
779g4J48J68j53R2k0Oj61P6l19k9M2N04j89l4j86J39J22M5j75J11j72r5Q6J42
803G4Q5l38K30l16J03j18L04n7KQ7j32L06l08J25J53k92O6jJ42R3l50Q6L05m74
827b25L96j07rm6j15R7j81K22j77K44q0L9o5j62J61j3K17k02j3j64J35r1K95n8
851I8m5j22J54k48KJ88R8j59k1j9k53J91L55r3k02j16O3K07n7j19O5p6J99p5j18
876a03J42k31N20m43K61k33J70k7q6M0OJ94k14m8p6Q5m2J14j82Q9O6K04m33K9
900a98J45K0k40K49J15Jl1K19j31j18k29k4J71J66k72P3K37k40j5J91nj04j05
923a25J84k68K78r0RK26l11R4q2J2K27l32L02j03j12J01rj69Q3r3J59P1q9J55
947A18l49K31j18J23r8J29j21m7j52L00J0l6J08m6J18r3NP9L1k09M0o0r4p2L12
$$ y = [-74, 74, 242, 89, 181, 161, 167, 6, 82, -237, -266, -224, 280, 91, 57, -129, 10, 132, 177, 2, 113, -59, -154, -68, 74, 159, -179, 51, -265, -162, -280, 24, -33, -31, 56, -76, 230, -78, 47, 200, -92, -26, -27, 115, 208, -142, -56, 249, -225, 171, 64, 55, 9, -106, -9, -190, 32, -145, 99, 19, 58, -7, -169, -8, -21, 196, -6, -19, -183, -48, -139, 156, 98, 53, -69, 85, -163, -161, 27, 125, -34, -55, -74, -327, -136, 219, 126, -76, -192, -129, 78, 21, -98, -33, -109, 90, 15, -103, 39, -192, 328, -115, 146, -87, 83, 56, -30, 10, 16, 210, -4, -52, -128, -43, -85, 29, -153, -64, 2, 206, -227, -198, -53, -33, -273, -24, 91, 92, 61, 280, 149, 31, -198, -222, -51, 115, -157, -84, 153, -87, -102, 89, 84, -20, -125, 59, -209, 69, -21, -12, 214, -97, -3, -85, -73, 154, -178, 124, 21, -91, 10, 1, -168, -85, -178, -19, 52, -37, 118, -231, 0, -118, 5, -93, 36, -85, -132, -284, 16, 26, -10, 98, 52, 170, 77, 82, 161, 192, -17, 23, -37, -131, -203, 109]
972A09j64M4k9k03J19J34q9K89m08J04J24J27j7k56K18p9P1m91J90K58k32K50
994F9j1j09Q5J03J7O1l77M36j75j88J81n9L60k00m59N16l26j14L65l53K41k13
1016a50K14j52p9K00L7o7j25J86l04J35J4K38L8k34Q6j44k07N61J0r4l29J30L40
1039C04j14K8o07N50j32J58lk98L2Q4L01k26l14K64JJ29j78k04M96k75J7J7K65
1062B95j27k06l7K04j38q9j06J89J82j26k08O3o2J66J78k86M9J56P3j68j53K59
1084A08j53j29J41M37l31j74KJ29j33j30Q0L70j57k01k2J73j36J15k01L01j48
1105e9O4J65j77qm4K70k25m6p6K75j81n0K37k25K14k35K11K2Q0j37r5k82L70j8
1129E0l7l24K95j76K3J52j7j70j25J68K35P8p9l1r8J3p3K78q9J18l80J51n9P9
$$ y = [109, -55, -11, -40, -243, -124, 10, -79, 210, -198, -94, 30, 157, 140, -116, 102, 23, 94, -397, -207, 51, -181, 69, 58, -51, 34, 137, 154, 215, -162, 274, 99, -89, 92, 33, 393, 193, -266, 250, -76, -190, 175, -178, 63, -150, 64, -88, -167, 33, 70, 3, -122, 64, -240, -105, -91, 147, 185, -49, 37, -107, -314, 247, 257, 163, -166, -36, 304, 190, 218, -389, 161, 29, 187, 184, -114, -82, 2, 303, 77, -237, 27, 28, 157, -21, -225, 271, -4, 13, 30, 295, 168, -38, -75, 129, -9, -98, -204, -15, 167, 41, -167, -104, -166, 0, 178, -108, -59, 97, 170, 2, -151, 108, -45, -174, -33, 404, 73, -101, -99, 30, -103, -233, -153, 217, 60, -141, -163, 10, -126, -11, -212, 89, -59, 5, 170, -7, -15, -59, 211, -14, -60, -136, 139, -42, -92, 145, -80, 134, -101, 110, 132, 212, 75, -20, -302, 68, 50, 13, -311, -16, -192, -169, -17, -34, -204, -329, -161, 74, 152, 73, 42, -56, -43, -116, 162, 73, 191, -189, -38, -97, -18]
1153a8N9R0k20l5R9L7j1J34j40j4O3k91R2M36k77r4L41k78j80Q4O6Q8J21j06l1
1178A5n6p9l25M74R0j41J1j20K61l59K24j66M85k14j07o1P8k06K83Qr4J23J70
1201B94k61l16M73j32j47O0J37j12L26k08M8m31K96K73n85J67J64j90L28k02L7
1222A9K65j27l3n4k38K23N0j15K03j15m7n3J22j09J58P0r5M5l55J13K4j95L22
1245G8N1L5L3Ql41J85r6R1K29l02j27K62j34K12l31J44o9k58M30R0l69J53R5k36
1269a67P0P1N9L6q5o3j30K00K6L9L3k13K86q9N5j84K00k22J71R4l1J21m11M43
1293C09m30J32k2j4lJ54q9L0j31K98j56Q3l46M64o61N83J10j48l37n5L82J0k95
1316a32j6nn6K11O1j15L5j14K39J12l14J48j29J12K6P1o6o7j16j2j70K22J62R0
$$ y = [-18, 41, 131, -89, -124, -25, 12, 1, 135, -5, -19, 44, -247, -155, 281, 4, -90, 251, -27, -207, -123, -57, 31, 152, 46, 15, -41, -120, -445, 29, 119, -22, -11, -131, 130, -229, -5, -171, 314, 100, -7, -68, 10, -196, 87, 95, 1, 124, 294, 33, -283, 190, 58, -89, -29, 108, -4, 322, 114, 162, -269, 27, 300, -285, -118, 46, -144, 184, -18, 19, 284, 157, 124, 70, -168, 55, 105, -10, 193, 78, 31, -22, 100, -9, 149, 219, 124, 169, -186, -73, -49, -244, 78, 129, 164, 197, 205, -136, 49, -47, 44, 273, -29, -156, 106, -28, 184, -147, -3, -72, -330, 100, 190, -179, -26, 69, -167, -97, -26, 33, 69, -16, -79, -209, -9, 17, 56, 89, -124, 162, 73, 128, -56, 144, -78, 93, 187, 156, 277, -134, 309, -121, 11, -11, -25, -28, 126, 37, 67, -64, 234, 78, 161, -185, 279, -382, 201, 311, 163, -174, -229, 153, 163, -132, -148, -153, -209, 2, 63, -52, -17, -131, 108, 220, -94, 54, -75, 37, 63, 134, 68, 1, -115, -127, -297, -75, 87, 177]
1340A77n7j1o1j68N1N2L4p1Q1j79r8L88j06j55K73j73K52k51q6L38l86K24m1P2
1364I9j15J50k08L19r2k08K65Ll58L91k22l9o7N7K02j08p1J85k95m8J81j69Q4
1387f4L39k64j68K3m0M73k74J15n1r4o8O0r1J08J34J10m09N9Q3J69k08L6Q7j93
1411a28m0J33n8M16p9k82J06J14m44K35N6j11J16J01k44O6k04J95j63K68rk64
1433b20J80J35M9j1j29r0J6K15j55Kj87K09j13R0m5K80k00P5k40K08n6q2N8L11
1457C00m04J70J31k32LL3k0l0K61k53K46j70j25J05q0L18k57K38l89L29rk29K00
1480A36j85K41j25O3ml09M54n57L27J21k21Q5M5K14k33J06j92K52k71R1o9L7l33
1503c27J22K22q2O0l18M08j61J08q1N0k6kJ42j25J57l25K79j00K07n6j9j40j87
$$ y = [177, 120, 109, 48, -120, -69, -17, 17, -54, 27, -152, -250, 138, 32, -123, 150, -23, 229, -22, -108, 230, -156, 68, 27, 99, -16, 134, -74, 245, 153, -55, 210, 213, -145, 246, 24, -15, -82, -25, 177, 69, -2, 183, -112, -160, 21, -148, -64, 275, 11, -157, -134, -174, 299, 25, 140, 89, -5, -73, -13, -104, 4, 138, 248, -161, -102, -19, 150, -58, -22, 65, -128, -168, -35, -93, 323, 244, -38, 68, 182, -262, -27, 29, -82, 34, 135, -109, -43, -247, -52, -215, 53, 44, -220, -40, 95, 144, 133, 4, -86, -70, 145, -10, -8, -195, 14, -99, -9, -54, 226, 26, 101, -139, 69, 13, -69, -11, 300, -104, 66, 197, -35, -32, 1, -19, -49, 212, -41, 205, 35, -90, 15, -65, 253, -4, 234, -155, 174, 165, -64, 136, -49, 192, 67, 130, 126, -183, 271, -286, 41, 162, -59, 26, 71, 285, 52, 158, -34, 218, -53, 38, -31, 6, -327, -205, 17, -65, -5, -323, 85, -76, 32, -49, 1, -25, -27, 115, -10, 147, -178, 101, 1, 208, 152, 133, -7, -194]
1526a94K91k51J08J78j3k12R9p7J5J70m81M68j32K33k25k9k14j5N76L2k21k32
1548a26J86o2Q9l9p4J24j34j37R6J83j43J01Q2o0l2P2l44K22O5K7nj15l53M02
1572B5o4rlo9q9K23J83l3k59N4R6j23J07L4j16J8J97O7k57K25j11k08J2M5LL59
1598C07l89k8K99j90N1L50m23M9J04j70K37j01K03j67L5K7n2j99n7Q2j54N35l29
1621B0j25m6K75j34K57k64J42k41Q3k18K93j19k87J90L70r0l27J29p6J63J56l74
1643b23L69j88j32K70J6J17r9j36J39M4l79L1Q1j97p4N98k80Rm08L91L30l07J58
1666A30j81N2L26l84n9Q2K34j16j15J50K3k27J6P8J74j13k3O0j26P9J60l35R4
1689b1K51j60k28o8L30l2K32k90J40j58J30j45J99m8p0j69J17J76j25j87J52j22
$$ y = [-194, 97, -154, -46, 132, 119, -93, 6, -71, -56, 114, -367, 101, -31, 202, -23, -52, -266, -281, 295, 327, 106, -126, 60, -2, 87, 48, -26, 98, -36, -173, -77, 106, -37, 64, 146, 86, 54, 126, -218, 4, 69, 96, 91, -24, -377, 25, -39, -48, -51, -120, -209, 14, 197, 164, -95, -41, 55, -68, 39, 73, -43, -25, 172, 239, -18, 207, 96, -112, -100, -55, -52, 307, -82, -110, 189, -1, 50, 400, -23, 26, 130, -40, 197, 96, 299, 132, 167, 194, 142, -57, -114, -32, -186, 349, 20, -105, -151, 124, -10, 247, -17, 125, -116, -33, -251, 42, -77, -364, -174, 196, 106, -221, -92, -168, -5, 151, -223, 146, -42, -174, 96, 112, 229, 130, -6, 133, 177, -202, -171, -90, -287, -361, 237, -43, -34, -442, -51, 279, -28, 130, -51, 1, 327, -57, -116, -34, 200, 84, -31, 119, 142, -85, -69, 9, 183, 70, 47, 107, -19, 60, 220, -115, -21, 230, 70, -158, -226, 104, 72, 304, 14, 154, -4, 126, -19, 180, 132, 62, -107, 10, 186, 61, -126, 26, -96]
1711i6J69J21K51n33l5K06R5j55j64L00j09L2j51J2j8m7J45k61K36R2j88J52m
1734E0m2l7j57K26J83k5m15L69j01rj4M2j35J07j61n4K77p1j30J10O1M0j03k07
1758a96L90j82K29j80Q0lj55J77L9j44j21k08N29m43J89J18L5l2J90k44Q1m9l39
1781b39J95O7J73k65K8L2l5k41L03j1J05p8Q2m9k43L80k26p5J16P3j06j17L26
1804A95j85j36L6J42m8N9J05k59LJ4K98j92J86J35m40R7K34l05L42l53P0PJ16
1827A21M8k49K90j60P8p3j6J99k16O1j72k32J61K20j53o1M0kK43j3k09J95o9K1
1851E2p4k6j84K61J63j16r2L86k76o6l1K98l95J14N9J86n6l00J60k90N8L21j96
1874d4k10M61j98L3Qj35K92k14P3J73l96L85l13P0J49j43%p1J54k57J75K66k09
$$ y = [-96, 73, 194, 445, -88, -123, 83, 178, 23, -141, 159, 50, 82, -69, -57, -75, -122, 23, -238, -2, 90, -98, 54, 50, 8, -29, -186, 40, 223, 198, -217, 152, 51, 42, 28, 70, -65, 42, -119, -173, 104, 33, -97, 13, 74, 114, 11, -196, 194, 12, 241, 61, 141, 138, -17, 160, 199, 55, -66, -274, 255, -188, 1, 119, 154, 122, 312, 68, 149, 100, -239, -44, 23, 196, -69, -41, -9, -44, -285, 18, 7, 112, 34, 116, 67, -176, 204, -22, -97, 19, 92, -14, -131, 195, 10, -126, -90, 52, 4, 63, 168, -91, -88, -74, 224, 32, 218, 353, -87, 10, 244, -61, 281, -72, -2, 5, 121, 169, -80, 210, 50, 128, 55, 39, 238, 22, 83, -89, -321, -160, 60, -93, -154, -114, -116, 127, 114, -95, 100, 31, 52, -22, -48, -232, 29, 192, 76, -16, 370, 94, 28, -3, 295, -100, 14, 73, 259, 203, -97, 63, -227, -169, 152, -44, -254, 207, 9, 42, 50, -85, 207, -7, 66, 239, -157, 228, -85, -15, 134, -9, -9, -80, 74, -183, -8, 258, 49]
1897D9J4nk00P2L63k19r3j56R9O0J50j72r3K12j28Q3N0O7l24J37J51j29j84K10
1921A4R1O1j23m7P6j3Qk17J33j34J12K08j26k42M20j30j09l0J8q9r2L00r0j58
1945a59L03j61OJ42J53k46J12j80J38j11K72L4l87K16j24q5M8J81q6J47j83L0
1967F0k26L54k74L92k71K52K8m58O5L49j22j37K1K5l14K55j63K84n6K56l83J61
1989I8k7J1k7l55K62j94J34Q5j32L95n3k36O5j06k0K16m37K85j32L85l32K60j88
2012d3j2J15%j39j02K64L3j56N8L03k50r4j02j21L74Kk87L93l46J11R5j7L4m82
2036c69K95J44k14j10k0K45L4J33M3l11M5P3j08M11l53n1M3j84J34J71j16q2K21
2059G4r2J44j27O1j9j11Q7P9l60R3L58l02K16K38m53K90k74M08l42r3k8L48j44
$$ y = [49, 63, 58, -142, -70, 293, 74, -19, -175, -76, -16, 134, -38, -131, 81, -47, 36, 86, 153, -171, -34, 117, -12, -196, 14, 105, 166, 43, -4, 72, 59, 67, -150, -17, -151, -39, 169, 43, -199, 221, 91, -18, -48, -30, -119, -211, 89, -1, -159, 144, -17, -11, 131, 284, 38, 150, -30, 108, -3, 269, 303, -84, 132, 8, -77, -29, 152, 66, 213, 30, 60, -166, 188, -86, 306, 35, 287, 315, -143, -78, 271, 149, 12, 33, 58, -256, -1, -164, 120, 64, 320, -63, 98, 71, 82, 55, -300, -38, -232, -98, -13, -145, 250, 197, -39, 26, -80, -100, 116, -321, -36, -168, 217, -115, 145, -43, -55, 60, 60, -79, -181, 83, 116, -40, 18, 321, 71, -23, -125, -246, 128, 130, -157, 236, -110, 1, 96, 79, 113, -369, -74, 70, -144, -254, -274, -29, 5, 138, 181, -130, -85, -12, -120, 291, -62, -113, -70, -254, -120, 51, -65, -147, 74, -18, 126, -1, 60, 41, -70, 17, 96, -264, -171, 187, -115, 101, 339, -114, 176, -98, 310, -32, -125, -153, 195, 51]
2082E1q0O2r9J3k2P9J32P8r5k75L61k18K6r9K52j85Q7j10j86M03l14J36J61k91
2106a33K24r1m7J51n0O9m5O4k31J92p4R5pj12L64l87o3K18J3k08J02J8j9l7J61
2131A67j08j08k3P2P8n9L93q3n31L81J76m98k4J46L19j45j94J76j31r9K50O1k51
2154c5j24L09Ol2j60m1M2K7J53l40J28J7Kr4J44qJ49nJ4J53l30J47J15k80Q8K7
2180G2k58M05P7l77j6o9M50m65K22j61N4m6K85n4j97J58j34M3j23K11j51J23%
2203D9j56LK41l99M84j29j84L34n6n21K96N8J22p2L7p6R3l06R5J03q5K86k24L63
2227C56l27R5k13j62K33L3k9K52J34m81J24Rl78O45r2k96K85Ol28O2O4j97K29
2250B4N9l3l33L13J77kj27j16J40J43o9j34j33J6K60k22n6K41J49p5j78K4J63
$$ y = [51, -29, 33, -66, -53, -75, 4, 136, 214, 119, -156, 205, -13, 13, -86, 166, -19, 68, -42, -228, 175, -139, -3, 158, -133, 91, 0, -47, 104, 54, 123, 78, 142, -89, 103, 29, 124, 117, 5, 369, -18, -81, 137, 150, -58, 44, 62, 43, 6, 167, 59, -49, -72, 0, 78, 19, 412, 329, -202, 179, 355, -143, -167, -21, 298, 153, -41, 135, 4, -95, 155, 216, -35, -159, 150, 156, 124, -36, -77, -35, -8, 145, -195, -67, -50, -48, -142, 2, -6, 143, 138, 152, 305, -25, 122, 237, -43, 45, 72, -186, 219, 296, -81, -97, -166, 284, -181, 41, -120, -66, -112, 173, 119, -78, 80, -54, -11, -134, 77, -74, 49, 49, -107, -104, 137, -262, 222, 93, -91, 243, 187, -334, -38, 20, 142, 70, 107, 31, 124, -182, -87, 16, -69, 217, -7, 356, 29, 124, -89, -251, -18, 15, -14, 238, 372, -109, 15, 24, -354, 291, 199, -97, 188, 194, -134, -72, -8, -205, 24, 83, 50, -283, 30, 207, 205, 78, -38, 102, 245, 176, 42, -91, -75, 185, -37, -93, 148, 297, 222, 44, 68, 231]
2273B31p9O5n1j52Pn2O5P4q6K19l27J54j20q8J39k34L94j86J65m23K89j66K00
2296C8q2L5l91O25n9Ll1j03J41n24L88j8o3J2K99j49l9O9k06K06k62J38k0K7P2
2321A06L28l27l55L98k55o6J50n5j8%NR5m85M16J64n8k1k04J84m7J64l06M8m6
2345a85J2L71j25l6L4o7j58K76Q2l58j3K70l20K84Q0l6r3k5j46O9J53l32K59O8
2369F4l3Q4l17J62j37L69j70k10O4J89J29k08L01j27j61J57J09l27q8J43l2J52
2391A13k80L61m31l4R7L87k70m6O5L47l85L19k91o6N2L54k12Qo7O9K36n26j3P0
2415a43K27q3K8p2o0j57K37O3j02j46J66M6J03k67j02L17M2k19K28j52j02J15
2437c3n6J48k09j3L59k31R6Oj8r3p1L26m32L96j27L9K36l32j6J54j63P1K76l05
$$ y = [231, 152, 217, 166, 14, 21, -31, 34, 108, 22, 241, -86, 68, -52, -140, -1, -235, 159, -27, 138, -285, 4, -162, 38, -44, -9, -400, 225, 166, 169, 138, 35, 176, -348, 40, 22, -41, -29, 270, 121, 82, 151, -55, 151, -111, 27, 7, 34, 106, 434, 107, -248, 150, -105, -171, -21, -76, -94, -94, -89, 6, -479, -63, 101, 43, 22, -182, 2, -45, 119, -187, -139, -185, -173, 198, 73, 37, 71, 4, -154, 122, 204, -154, -167, 103, -217, 67, 147, 111, 18, -7, -153, -84, 69, -263, -4, 64, 31, 115, -202, -40, -177, 192, 22, -188, -124, 65, 194, -14, 287, 160, -1, 156, 265, -62, -150, -7, -39, 113, -167, 194, -237, -271, -174, 213, -57, -103, -38, 309, -76, 243, -48, -114, -62, 292, 80, 88, 21, 90, 326, -200, -213, -143, 84, 1, 29, -43, -103, -260, -23, 40, -62, -208, -42, 4, 107, -160, -262, 55, 97, -122, 106, -46, -148, -33, -89, 59, -150, -163, 196, -35, 61, 67, 49, -44, -115, 211, -221, 175, 48, 87, 323, -9, -25, 129, -34, 37, 313, 8]
2461Hj1n8J75O6l03L50k24j20J28o5N5l0lK8n6j33J42k9pr5J95J20j22M8q8J66
2487A37o9m10N36J12j35J30k27K8k1J2k19K22M7q5o0NJ01K39l35J99j61j6J34
2510A64k60J51l89M63pj03j4Lk56O7M87k13M1k50M07m23N8nO82q47J94j30O9M1
2534g0n4j5M8K47k6Qk09qN7RKJ71o5j66M07j11l50P7j73L50p5l7R5j74Q8j08j20
2561b02J07J01j07o5J66M7j16J20r5R5j32n8J94K14J09o00J07J50N6k09J88k05
2583a35J29mM9R1m61M30P2M7N5l60J67j37p3L80l93Q4J46J2l7oR4k81J09k3ML4
2609gn5J44k11n2K10J02m63K45K50k07l2o8P8R6k01L2K73k15J62k24K22O2L2j88
2633a5mJ72l22L51n2r9j07L88l71J97j93M6K32m14K31k35J32N7J54k3q9jM0k98
$$ y = [8, -3, -61, 114, 180, -123, 227, 3, -117, 11, -54, 1, -29, -32, -4, -60, -193, -51, -80, -87, -182, 13, 133, 11, 59, -29, 137, 68, -342, 194, 306, 171, 301, 74, 102, 81, 93, -126, 96, 143, 58, -2, 3, 104, 343, 8, 207, 46, 30, 164, -96, 55, -334, 129, 122, 19, 5, 8, -248, -181, 306, 93, 134, -116, 291, -132, -74, -79, 603, -244, -50, -180, -111, -70, -124, -139, -91, 156, 130, 138, -71, -79, -22, -13, -11, 160, 95, -71, 336, 225, -125, -48, -221, 129, 54, 17, 112, -62, 26, -82, -202, -95, 6, -101, -166, 0, 47, -69, 51, -44, 51, -81, -139, 55, 269, 378, -222, -115, 35, 91, -118, 70, -135, -6, -10, 39, 130, -331, 99, 171, 218, 273, -87, 80, -57, -130, 250, -143, -59, 87, 99, 62, 56, 150, -131, -22, -45, -41, -7, -62, 82, -129, -181, 29, 131, -332, -87, 163, -44, -76, -144, -66, 30, -171, -139, 134, -81, 81, -143, 79, 141, 173, -15, -19, 153, -169, 182, 130, 31, -76, 312, -59, 138, -55, -9, 223, -191, 40, -195, -63, -6, 148, 125, 36, 35, 75, -223]
2657b23K12L1J40l1J1m14K69L9kj92J63J01n6j74J44P9m0M5M6n5l0J20j59R1M9
2682A64j21k41J15p8J63J71l06Q1rL4J6J42l49L29k55M0J41j88M46n67L45O2j64
2705b9j2J93%l11J23K31l30J49j29l6Q7k03J34N5J26k17J46J04k90M17n5k79Q7
2728c9j8L0N7J32k01j61l0J66l9p6J80K24q4m0J83k65l9MK61m47J28N2l1Q1M2
2753G0j52o0p7M00j61L66l80j00K76k19P8r6K32j64Mm1L02m93m2L63Pj81J93n58
2777d33L58J33Q9l68K47j23n3K61k18N5m1L0J29M3k4L6j57q8k09M02k34M9J17
2800AK7m11L63p7p3k0J07K64m64M05q0r0J28R1j15k26J92J62o5l52J28J8m5Q2
2824e0l3l4j0N3k6K49k19J80j30Q6o1j97K55m3L9j44J16J05j67K30r3l93L80p3
$$ y = [-223, -11, 20, 160, 129, 140, -274, -5, 34, 32, -160, 3, 104, 48, -126, 18, 97, 57, 102, 148, 93, 63, 183, 24, 115, 164, 43, -198, -83, -161, 2, 173, -133, -52, -61, -27, -11, 131, -218, 111, -144, -104, 37, -151, 295, -272, 73, 135, -29, -41, 152, 152, -159, -36, 195, -135, 14, -115, -151, -64, -267, -133, -78, 48, -169, -23, 81, -209, 208, 153, -126, -39, -57, -27, 30, 162, -39, -200, -230, -64, -103, -179, 1, 225, 141, 101, 284, 19, -20, -16, 245, -202, -74, -22, -53, 28, 70, -82, -142, -219, 181, 20, 386, 6, -94, 182, -37, 41, -55, 177, 13, 17, -24, 278, -215, -257, 106, 113, -68, 125, -433, -75, 58, 147, -221, 26, -97, -150, 111, -107, -52, -93, -63, 66, 109, 85, 121, -36, -124, -333, 69, -165, -116, 1, 28, -383, -20, -97, -170, -190, -83, 181, -283, 122, 42, -48, 80, 171, 56, -170, 22, 184, 119, -233, -105, -87, -132, -50, -83, -117, -127, -74, -100, 149, -70, 110, -20, 66, 5, -192, 63, 20, 59, -85, 31, 136, -31, 199, 106, -287, 93, 20]
2848B0q6J72j89K86k13J81k40J14J60j67J39l01P1J74j92J30m0k9j48Pj20N91
2870C20n79J54K52m02P4J92J41Pk24Q5j54O2J06j97K07j24K6n1O6l2L1L79j44
2893A95m99K53J16J33l04R8J75k01k5M7J30J39k15j33N4nj25P4j10L45k48J74
2915F8l52K75L1l51J68j47K42J55j00k07K62P0j37m8J91r9k87L92N2p3o8J34j29
2938D2m46M59k71M19j73M8j06J77j62j01K06q2K79k76m7j70L01j07J68q5J8l32
2960b41K87k12O1P9J24q3o6O7k9J36p5K7N0n5k37L35M5k34j08N3p2J01j92J66
2984g3O8l25K48R5J69k21LN3m0l00M59P2j11Oj44Q2k1M5J73q2j60j99J07J98p0
3009C2j97O0K20pK57l43P3n9Q3J08m93K73j8M6k36N4o0L9J43k1R6M0q7M4M7n5
$$ y = [20, -66, 106, -83, 203, -10, 171, -69, 45, 205, 38, 177, -124, -53, 121, -71, 59, 19, -10, -158, -151, -271, 320, -259, -105, 147, -255, -181, 11, 152, 159, -65, 20, -134, -72, 34, -163, 44, -80, -54, -105, -39, -71, -40, 339, 195, -304, -51, 65, 198, -106, -8, 167, -34, -59, -12, 118, 257, 42, -91, -37, -42, -167, -93, -203, 142, -106, 68, -284, -9, 22, -329, -161, -308, -66, 89, -11, -218, 44, 114, -23, -71, 120, 21, -266, 126, 178, 105, 37, 171, 42, -404, 55, -216, 203, 30, 78, -28, 149, -13, -114, 92, 10, 289, 13, -34, -204, 97, -10, 158, 73, 91, -241, 46, -166, -105, -26, 98, 15, -51, 16, -13, 123, 48, 75, 125, 70, -167, 168, 213, -21, -129, -76, -148, -47, -239, -73, -5, -330, -82, 13, 182, -39, -36, 17, -23, -323, 136, 208, 97, 103, -41, 41, 20, 65, 238, 156, -4, -203, -96, 102, 32, -165, -105, 115, 108, 365, 22, 95, 36, 119, 227, -266, 7, -11, 35, -201, -147, -207, -168, -25, -46, 50, 90, 3, 47, 94, 39]
3035C9j71K41N3K6l38p6J49J01k6j24J50j67J94P6l35J1J34NN37k02r5j56R6p6
3059D6k05k1J02O6N6J21j81L1Jj36J22K19l8l91M28j29j0k3J93j47j94J72j66
3082h4J19K08n37J77K80n7k66n8r1N85m36K20M6o3L8j26j55K04M68l72N0P1k52
3105c1J43m5j1Q2k77m9J21j17K90l68L12Q9k35M43m39J24m0O5J2j89j56M04j9
3128A09r6K11l16L9J38L40j51k72P6J10l58M45k94m2J14n2Oj28j10J13R5k03J6
3151b10K38j52K25p7k44L13P5k33J70j17J53k36J21j23K09N8k74L98n24R9J23
3172hJ46j49j5M8K60j65j11j47J44j91K55m2n2Q5n0K12m16K34J2k53Q8L72m42
3195a85Q8P0K42j91J8j38J47j15J19P1Kk46J54L27l20k14M18l47O8j37J90l70
$$ y = [39, -132, 109, 162, 188, -150, -226, -77, 24, -2, -126, 24, -143, 51, 127, -208, -197, -63, -58, 479, 277, 182, 26, 122, 46, -159, -180, -78, -12, 44, 165, -16, 15, 16, -120, 2, 221, 183, -208, 220, 91, 81, 58, 251, 104, -90, 82, -84, 35, 243, -294, -117, 163, 106, -160, -218, -309, 276, -160, 60, 106, 43, 81, -45, -200, 4, 472, 100, 150, 221, -31, 112, 67, 56, 138, -139, -188, -67, -184, 106, -262, 50, 139, -96, 347, -92, 32, -8, 57, 69, -120, -276, 128, 109, 13, 224, -92, -53, 85, 425, 274, 2, 78, 188, -170, 275, -19, -61, 53, 1, 7, -121, -231, -118, -23, -226, -210, 28, -124, 101, 24, -220, 93, 168, -65, 105, -12, 141, -95, 26, -97, 112, 170, -104, 294, -230, -131, -8, 138, -11, -26, 22, 282, 117, 6, -141, 3, -188, 67, 25, -27, 58, 8, 220, -196, 38, 50, -203, -115, 257, -185, -97, -27, 215, 24, 42, -96, 51, -64, 55, 126, 128, -118, 36, 363, 43, -171, 247, -100, -32, -169, 21, -349]
3217c49K68j84J65PM0JN3L13m93K47O2k49L05j84O2k55J42J55j96J09o5k37L18
3240C5J01r4j68k17R1J19L48J94l98o7L8Oj11J42M4j12J24j91j71L30l0J05j12
3263Fj27o0K3L86j71j90L19j99j75L4K72k30L1j23k2L39j47o4K22L5l24K17k15
3286a63M50l69J33j22J95K15j97j44K4K68j52k19K89n8j09k6p8j15K26o4rm1K79
3309B13k28M38m25k20K43p1J33P3k35N6K48j18j32L3J18M8j87J7j56L51p2j16
3331A1j41J63q5N6j58K01J18q6j41j58J73L6M2R6j17P7Pj24j58J42P7J42l59J51
3355c5K7p5l0K48k28J57j35L6l2L17k03J13j09n4J84m03L0J78J1J09j24Q9m5L01
3379C27k23J20m05J44K8J05L2r9k20J25M2J35k36J66o5j35j17J57j78J40K20l35
$$ y = [-349, -81, -265, -100, -93, -53, -52, 1, 314, -179, 68, 130, -119, 186, 2, 64, -191, -49, 106, -90, 19, -46, -283, 35, 136, 42, -126, -343, -252, -133, 215, 409, 11, -56, -18, -12, -123, 19, 63, -49, 75, -116, -287, 43, 13, 118, 6, -121, -181, -158, 228, 57, -133, 186, -13, -188, -154, 118, -112, -81, -204, -226, 113, -34, -98, 124, 159, -165, 52, -163, 287, -82, 51, -71, 124, 339, 142, -2, 22, 290, 138, -81, 208, 150, 41, 15, -63, -178, 48, -16, -25, -66, 213, -15, 423, -2, -222, 21, -50, 83, 156, -79, -23, 225, 107, -25, 8, 126, 174, -13, 4, -152, 199, 127, 11, -130, 33, -52, 4, -154, 47, 165, 79, -62, -220, -47, -11, 31, 127, 10, 87, 94, -30, -188, -46, 31, 173, -186, -35, -8, -83, -113, 135, -93, 64, -71, -35, -67, 250, 47, 160, 51, -3, 181, -222, -192, -14, -3, 106, -18, 71, 26, 327, 104, 224, -181, -37, -9, 96, 128, 29, -191, -66, -24, 111, -125, 41, -24, -159, -276, -119, -297, -157, 63, -272]
3401b72K25o3K13J6k04J08m4j77RP7J52R5N9q5K41n6l75J86p8J32l3j49J19j04
3425hO6L2j02L19j94j78J23j43J07k7k55K49j02Mj21N0R2M1o4J42o2j74J84J3
3449hj1q6J5Kj01j01L27M7j40L35k32J41m43L43J58j43j76j2k2P3N9p5j37J98
3473A1jq0K51K07j89q8l27K32j51j0K75R1k22J33l93M16j21Q5mj42o9P5q5K98
3497A92k12N8r2J34L9j38j36M3N09l95n6J11j17J3m6J08J26k33J62j67k53N76
3519B26l87P2j63l4K21L31j86k88M95k11O2q2j51O8p5JK62j09N0J29k14K53l10
3542d0J11k31K24r3k5J70j68p9K16k27j4L15o9j06Q0j60K27k56m9J38Q0j80J34
3565bOQ4j99J34j21Q4k96N46k67O3J80j78j41J81P5K5k37MR7j2K9k64L82j93N3
$$ y = [-272, -47, -110, 103, 119, -85, 23, -21, -198, -189, -112, 40, 135, 194, 109, 350, 294, -81, 105, 27, 159, 126, -23, 96, -8, 58, 90, -12, 307, 113, -65, 58, -85, 22, -5, -260, -11, -113, -109, -230, -180, -88, -47, -111, 31, -31, -205, -21, -8, -19, -105, -90, -88, -189, -290, 37, 84, -56, 279, 47, 188, -255, 88, 246, 103, -73, -85, -107, -34, 25, -50, -187, 11, 10, -70, 181, 388, 199, 111, -216, 16, -135, -145, 130, 221, -1, 132, -261, 155, 34, 119, 115, -27, -96, -21, -106, 192, -20, 38, -54, 80, 119, -19, -155, -112, 397, 2, -54, 57, -60, -47, -93, 15, 141, -92, 70, -97, -350, 226, -161, -89, -252, -286, -65, 266, 80, -208, 287, 76, 138, 56, -95, -27, -102, -101, 161, 52, 102, 231, 17, 270, -40, 71, -160, 64, -29, -54, 116, -52, -131, 85, -142, -156, 159, 90, -16, 64, -96, 131, -125, -174, -36, 44, -136, -2, 4, 88, -111, 23, -98, -14, -310, 236, -31, 32, 212, 34, -107, 74, 149, 174, -63, -59, 38, 26, 55, -209, 173, -20, 33]
3590C3K55q4J6m9L7k43K9j89J87P3KO4J3j43m6q1M9Q2j83K37m3j44K78k69K40
3615A21k5l5Rj85M6j75K17OJ2o5J07P1j19m8l0Q3q9K55k42M5J35j39k9N5o2J14
3641C3J08l26L06j40j29M8L35l5q3o5o3j15O6k44M94m30K29K14l28J21K6Lo2k5
3665f2Q7N6k40J90J08k83J61J00n7l8Jj26m4K87j56K29l77L12m47K15K49k26p1
3688a32J63K53m46J67j22k3J80Nj88R5L12J17l69k7K7k5Q2qk38nK80p4j46J68
3712D6k14l6K56l23M10q9k10l7Q3J05q4K32P3j17k89J98k8k1L19m37lM23k00L77
3736D34n23R0J33l5m9J82k36J67j17r7L7l8K35q2k68j0J14K56j57J00m0j56L37
3759B77M4m60L36j5k58K07j47J56l15K84k21P8Q7j39k3J87L70l80Q3j38j68M49
$$ y = [33, 288, 204, 220, 171, 208, -35, -6, -195, -8, 65, 67, 131, 144, 1, -45, -126, -77, 5, -178, 59, 16, -128, 150, -119, 121, 96, 61, 70, -115, -69, -244, -27, -21, -9, -74, 33, 104, -15, -63, -93, -10, -99, 156, -86, -41, 94, -45, -74, -19, -81, 33, 141, -185, 121, -19, -148, -100, 235, 200, 117, 52, -11, -126, -60, -304, 190, -240, -11, 203, -125, -4, 22, 25, -37, -62, 25, 81, -159, 31, 139, -144, 17, 117, 60, 22, 23, -103, -147, 140, -16, 213, -164, 148, -299, -84, 165, -61, -132, 31, 284, -162, 5, -117, -140, 40, 45, -143, -48, 264, 381, 12, -15, 12, -13, 69, 61, -177, -182, 98, 24, -122, 46, -168, -204, 52, -271, 139, 50, -160, -197, -114, -9, -93, 139, 212, 95, -194, 4, -24, -45, 274, -163, -166, 257, 57, 434, -89, 1, 134, 99, 50, 232, -4, 163, 46, -51, -14, -52, 183, 101, -167, -177, -63, 193, 36, 136, 96, -60, 277, 321, -139, 197, 182, -76, 131, -16, 140, -175, 109, -112, -34, 53, -86, -109, 78, 448, 68, 151, 13, -155, 294]
3781B94j50m2N1l7k40R9k80M11l01L73k44LK46k11kK2qnk2J61Jk72O25q70L24
3806g4N3J97j45K72l28l19L69j33J44LJ02K2j84J08r6K26k9j0p7j72J0R7p8o5
3830a07L26j73K0l1J84l69K08J66j59j76J66q2K78j74k73L8K26k21J25mm0o4L18
3853A82k04K79o2j42r5J52j03JK63l06p3J0K02k77N71m39J11o8O7J56l7j67M9
3876G0n2p7M42l42l45K86O3l12J55J14J84j31j14q3l2O9K12j95r8K33p3J17n6
3899C5j17J72l15M97j94j88J59l3k15j1K73k31N0K02p2r5l7K23m1m0j02r3L38
3922A65r7j39Rm0K27l78L1J77k84J47R1k69M53J65j65j04k27K64O4R0k94p9L03
3945A10l93L47N6l08J30K65j85L38k31l33K55n9Oj8M3P3r8r1K85j55l2J94K02
$$ y = [294, 144, 102, 153, 116, -124, -25, -305, 106, -195, 178, -66, -63, 183, -28, -30, -8, -16, -21, -43, 118, 119, -153, 472, -398, -74, -21, 176, 31, 303, -25, -344, 25, -108, 36, 39, 141, 163, -21, 87, -9, 217, 188, 178, 101, -71, -61, 36, -42, -107, 219, 46, 66, 35, 219, -150, 58, 224, 65, -111, 55, -27, 251, 77, -196, -158, 68, -153, -28, -32, -72, -136, 182, -22, 257, 195, 53, -42, 110, 7, 8, 271, -35, -108, -98, 104, -173, 398, -41, 70, 2, 69, 225, 188, 21, 70, 18, -59, 383, 41, -304, -18, 45, -267, -112, 2, 186, 55, -59, -142, -174, -105, 107, -88, -186, 47, -26, 91, 35, -82, 90, -225, 272, 78, -110, 49, 16, -199, -210, 63, -168, -118, 84, 12, -83, -120, 103, 62, 22, -80, -173, 165, 68, -71, -62, -102, 125, -253, -222, -45, -329, -182, -91, -360, 93, 258, 93, -11, -238, 26, 90, 180, -114, -193, 110, -283, 64, 120, -188, -58, 207, 22, 360, 129, -204, 51, -8, -2, -20, 23, 96, -2, -93, 192, 37, 5, 199, 401]
3968D01n97K10P0k53K16j5q5Q0l8L2J40j38Q5p3r9J64k26J89j18M7rJ63l50K33
3992B9L5r6n2L4M1J9J40k96k4J22j15J9m0J66R9j92P1j0J05m7J81l23J74j87L71
4017B24n05L47LK5j42n0K60l69J31j57Q9l5K31l3K2MJ0l02J40M20n58L75O4j44
4041E0J2Lo0J38l35q9J16J06J4m7N3j39jL9M23m69P7P4j32J03r1J90l4N4p7j02
4067a24J93kl17j1L43n8o6%Kr9j16L02J20p0l21K98k21K8k09N56j32k1ok3j15
4092f9j33O3Q9q9P1kj7M41m15k9Q6J22N7j89j5R1q4l1K23n3j60J54j89k18L73
4117G7j75K20m1k10L9O7J59j18l3l64K99j59M99m02J13m3P4j8L94n91J63k29M44
4140A65m4k15k69Q79p04K76K08m54K27o11k63R27o47L22L39k73p92J116m44J17
$$ y = [401, -196, 14, 84, -169, 47, 32, -53, 27, -11, 21, 161, 23, 108, 35, -64, 100, -126, 63, -55, -8, -17, 146, -204, 29, 64, -32, -84, -50, -9, 10, 150, -146, -170, -48, -163, -144, -184, -18, 81, -111, -40, -50, 55, 8, 189, -134, 40, -147, 224, -281, 66, 69, 94, -48, -98, 162, -207, -76, -233, -144, -179, 52, 19, 41, 45, 55, -247, -107, 313, -245, 130, 194, 50, 62, 65, 5, 143, -192, -281, -165, -59, -45, -92, -39, -178, -179, -140, 283, -186, -109, -35, -167, -64, -155, 35, 1, 55, -22, -124, 69, 67, -250, -261, 82, 24, -42, -42, -40, -139, -255, 47, 167, 97, -224, 74, -147, -119, -328, 228, 96, 75, 69, 46, -69, -202, -139, -50, -139, -68, -70, -87, 354, -61, -90, -4, 118, 175, -14, -29, 62, -22, -53, 170, 117, -43, 111, -78, -296, 77, -98, 122, 81, -129, -90, -23, 136, 18, -15, -379, -80, -239, 260, -142, -29, -72, 2, -16, 378, -213, -50, -279, 165, 121, -94, -363, 516, -188, 88, 296, -158, 69, -542, -805, 122, -525, -203, 136, -137, -929, 187, -257, -140]
4160a40j11o63J252j33J61o04m10J132o40M93Q0p05j1M6R3N06m56K55O07p28p5
4181e1n37K51%R09n12p84N39M73n23K54J09l25o0M30L96o91M23k84j8jj53J11
4203d4L17m50L93l17J03k68M5J10J38q6J3J7k28P8N07k02l1J5k13oJ74j21j06
4226a62J78L9j09K34l3k94J88o9L09k55j82M4L17j73k51N58m48K20J58oj88k39
4248a64J01J42p4j70k9OK45O3j40l8k08K52k59J19K4K86M3k0M2k00O3R4m48O1
4272b09K31n8Q0q1P8k13J26J37Ml6q6m3J37o4j36J97OJ1l52L81j29m7r4P0L72
4297B82o7j17j20L6K26l88K93k43L15l95L79k49L5l12L32J72j44j71L88j56r9
4318cj47J00K55k60l61N77m8j09j15J28j28j9J94r0k8j17J34J08j88L23j62r9
$$ y = [-140, -251, -914, 338, 205, 366, -238, -648, 484, -156, 337, 417, -288, -299, -253, -160, 346, -110, 145, 752, 24, -51, -588, -337, -337, 572, 60, -724, -185, 288, -235, 19, 128, -197, -257, 173, 569, -122, 301, 17, -1, -2, -155, -44, 273, -177, 216, -101, 2, -266, -221, -111, 27, -59, -46, -29, -257, -179, 328, 126, 95, 110, -103, -109, 65, -56, -162, 16, 55, -54, 180, 147, -147, 41, -28, 281, 26, -156, -112, 205, 32, -219, 339, -109, 111, 269, 263, 75, -164, -63, 79, 5, -165, -194, -188, 57, 120, -20, -58, -266, -14, -273, -154, -130, 156, 199, 179, 221, 21, 84, 178, -270, -209, 22, -36, 44, -37, 41, -172, -46, 91, 95, 59, -27, -70, 67, 3, -133, 64, 70, 81, -271, 110, -19, -66, -160, -90, 282, 215, 98, -22, 14, 240, -148, 145, -98, 217, -178, 201, -48, -13, -325, 7, 179, 35, -136, 252, 96, -3, -150, -50, 205, -55, -416, 161, 113, 4, -111, 17, -111, -130, 64, -26, -54, -171, -37, 71, -117, 206, 44, -55]
4340e5J20j08J57l7k86J23j3J10L61k88J49j11l66k77L55L5L77j91k30J95J82
4361B02J25r53M07J68l31R5j89J018k88L95m27l40Q6L50n09Q0o17P28m59L90n17
4382e86L36L17m2l10L95L06j604R95N6N86m51L97l13j95o78R99o98O49j70k43
4402b54L55K63k27o12K56N20j24j74j6J00j6J67m22M10m15k6J74k24L22n4l96
4423c93L68j13o6j29M68l66L45o34N88p4j21J34mP7K14l01J31k49r2Q8K15k07
4445a21L48L18l17J70o39J71K18k22m47R41m34j08J34K79K88q84j6K35k92N59
4465A81L07p12M49j023L16K3K93k11J53R1n24R60J40p88J078m49n11N12M6n58
4485b27o9P24J09o80J0j84O62J95K6q58R0N33q58M54r4K14N23q11P55l98p10N19
$$ y = [-55, 65, -43, 114, 77, -209, -86, -99, 11, 372, 84, 233, 122, -244, -521, -166, -131, 246, 55, -175, 20, 202, 327, -626, -219, -51, -382, -287, -476, 542, 254, 649, 222, -118, -32, 318, -191, -111, -728, 0, -459, -69, -586, -250, 67, 25, -285, 110, 416, -1188, -193, -137, 449, -2, 395, 82, -113, -791, 208, -490, 159, -11, -254, 101, 364, 137, -475, -219, 301, 177, 3, -13, 87, 71, 238, -184, 226, -189, -215, -41, -265, 57, 3, -393, -25, -138, -204, -333, 135, -231, 114, -520, 68, -6, -127, 7, 3, 80, 294, -7, 124, -125, -217, -129, 86, -121, 227, 545, 228, 398, -241, -70, 148, -74, -521, 420, -14, -122, 12, 291, 579, -305, -321, -86, -378, 181, 488, -224, 225, -798, -482, -459, -166, -377, -224, -133, -657, 303, 443, -345, 733, 284, -227, 285, 331, -227, -296, 428, 537, -143, -133, -317, 345, 540, 566, -292, -202, 331, -527, -73, -167, 47, 570, -241, 514, 116, -594, -75]
4507g5n73j23P72k5O08J3l90j25p4k92L25R0p33J013n45n6L34j71j71M67m47N15
4529C37m23K73k31R40o42M9l72J2j18O15o53K89r1K30j41M7PO1l17p4L55j74m3
4552f4L52j77n9J28l03k89O13j10j67J66l60L80k53K24J9j22kJ00k54K35k53R9
4574i7J29l42N30k61k8P2J52k48K16j21n9L43k19J41q1L6k64M79m32o1K26k76
4596a65r5K17k15M62n87L50K06j184Q02P25m71k21L02q5k02j98O0M00K52q18L45
4617a20l10L34Mj79K68n88R85l32j75m16J08Q51n79n4o98M72J302o52K11k80m9
4638A03j25j081J168l10N22M99k17r46K11M78J1K18o55j99J17P86m15R6o70K32
4658a77R7K07l66O42m12j62L71q6P8k73j03J13P6J28r8K7J1K50l47R0p4k56K37
$$ y = [-75, -648, -771, 1, -24, 584, 597, 207, 82, 8, -284, 41, 131, -602, 411, -134, -190, 144, -27, -198, 269, -178, 337, -86, 187, -44, 896, 254, 303, -69, -57, -175, 440, -213, 76, -15, 215, 74, 121, 128, 189, -128, -202, 153, -21, -64, 288, 111, 52, 180, -123, -412, 201, 91, -76, 90, -270, 110, -143, 81, 100, -22, -24, 76, -178, 57, -196, -97, 32, -310, 220, -41, -69, 3, 155, -93, 123, 2, -57, 286, 67, 208, 127, 163, -101, 378, -54, -115, 111, -165, -260, -43, -258, 204, -383, -33, 173, -1011, -209, 516, 45, -176, 126, 41, -161, -359, -299, 101, 353, -465, -120, -430, -96, -92, -271, -3, -591, 394, 62, -113, -529, -421, 430, -149, -203, -901, -429, 873, 221, 432, 152, 103, -22, -1103, 65, -245, 277, 776, 559, -387, -176, 302, 313, 531, -124, -323, -206, 580, 165, 261, -409, -177, -80, 127, -239, 403, -9, -171, 200, 114, 192, -81, -184, -71, 5, 133, 35, 62, 73, 323, -24, 66, -8, -264, -27]
4681b7M0L24k75k01K86pj0r2K91m30J83k18L00l1j08J8l84M11o4n3KQ8J0M2k25
4706a30K28l48K14RqL6q7K80Lj60q1O3R9Mj4o6J39n14K49O1J22kJ90j29k29J05
4732C4j08O1p0k0j7j3O2K59j59j78J24j9J38J97k94j1j23J44k7r5M44m35L67k02
4756E9L8L1n5l2J07j07j48J33J66l09J58r3j11R7J38j14j12K0K01n3k80L34n3
4779A5k19K49k4q6k88L83R5q5j95K97J11m26L24O1r7k2j6m5j72K63j76K1l9p8
4803a49K81j47j17P2J25l9m3L29k72m3K12j31j80J11q8J64Q9k55l0j44K61j00
4825i4N8J15m8o8J00j80j27N81k45m9J48k35l2M0j35L47p0k07J26K82j76k49J82
4848F4J16n4j84l2L7Qj85K40j13J61j06q2J90j65K21j59p8J99n9m6k0J14J7k38
$$ y = [-27, 13, 337, 62, -139, 147, 140, 130, 38, 329, -101, 82, -136, 164, 133, 25, 43, -341, 70, 6, -47, -45, 43, 53, 95, -130, 98, -250, -36, -27, -35, 1, -86, 194, 197, 37, -44, 19, 118, 122, 108, 42, 181, -333, -84, -23, 99, 97, 287, 158, -71, 34, -74, -13, -83, -103, -120, -133, -71, 188, 29, -149, -25, -44, 94, 291, -3, -14, -137, 7, -20, -115, 329, -106, 261, 59, 97, 128, 73, 41, 148, 41, -107, 26, 192, -117, 41, -52, -163, -66, 72, -42, -154, -134, 67, 14, -266, 68, 15, -204, 45, 21, -65, -353, 30, 125, 40, -155, 142, 253, -173, 151, 212, 115, 93, 77, 32, -140, 123, -53, -32, -71, -149, 132, -15, -132, -60, 65, 26, -17, 312, 40, -3, 209, 78, -102, 9, -79, 85, 174, -81, -111, -255, 6, -94, -36, 79, 31, -37, 63, -117, -244, 337, 92, 43, 191, -44, -76, -36, -171, 176, 106, -101, 25, 307, 131, -118, 64, 180, 126, -58, -90, -53, -45, -230, 10, -103, 58, -48, -130, 60, -105, 116, -43, -121, 78, 19, -27, -47, 67, 84, -154]
4872a54p0M54j15k64K81k08K69k01Qj74p4J71J25L0o2rJ61r3LK87n99M4n0K95
4896E5r0j18M0J85K6n3J09l50L70k37J35r0J34j45J76k65Q9k81M49k09j47K42
4918B5J86m52L88j13l46M21k57K1K1j30K16j92L60k43M16m56L71k29J80k86k2
4939a21K19j19J72j60j71J51%J10j86MLj39M77k71K10j03r5L76l28j62J88k00
4961a45L08L1l50K96l85L86k64J13K67l79J84j06J23J9j32l05M56j18p8J19q0
4982d0K38j82k0r2J57j03K33l52L10J78k62p5o7K84l32L88k03j97O3o2K93k31
5004g4L29k60KK17m6k67Q8J5L9Ql91J39lL61k65J97j00k54M35k32P8m5J13K1j71
5029f6R5k13J20k3K23n2j32R8Rj61J85l15P0L20l5r5K74j60k11k4p4L85l38j01
$$ y = [-154, -224, 230, 115, -149, 132, -76, 193, -8, 0, -174, -248, -77, 48, 78, 16, 7, 168, 75, 78, 365, -234, -190, -240, 55, -35, -153, -113, 72, 98, 45, 154, -196, 174, -63, 72, -18, 116, -29, 147, -118, -29, -310, 139, -70, -217, 25, 211, -241, 147, 34, -312, 109, -148, -127, -106, -236, -20, -212, 148, -95, 321, -135, 236, 7, 187, -99, -121, 98, -21, 151, -9, -180, -29, -29, 81, -105, -101, -98, -237, 240, -31, 179, 76, -19, 357, 29, -133, 55, -145, 163, 194, -156, 140, -245, 141, -123, -10, 257, -122, 62, -44, 79, 98, -34, -339, 117, -1, -79, 40, -40, 198, 16, -4, -96, 61, -42, 191, -161, 149, 327, 65, -10, -77, 207, -125, 263, 60, -137, -74, -136, 157, -74, 255, -5, -3, 214, 168, -99, -11, 4, 43, 51, -340, -201, -204, 157, -108, 89, -11, -265, 170, -62, 16, -29, 84, 105, -66, 29, -184, -64, -87, 136, 84, -48, 50, 59, -102, 83, -232, -162, 158, 123, 28, 302, 142, -69, -93, -167, 218, -120, -221]
5053b21K78j68j36L08J66j4k78J70oO8k12J20r3K08l77K41j46j32L17k50K82k32
5075a07J01j19J11K5j40J62J05k85K90k07pK37l06L15k99K85j45j92L24j29J02
5096A21j42J33M1k71L1L14k68P8q4j51l7J68j31K63Q8k87L62k62k03K12J39j43
5118b9j30O9J71l13K33j90j44M16m71K15j46L04J88k92m1J68n6J91j25L4j24J95
5140A23k20J52j80J55j20J98L5n11N57l02L92l15k5J74j31J0j58j84J66M05l09
5161h8J60l9QL04n07J71J04j40N9j61M60l43J46K0l32rL04O0j16j77J93K68n71
5184b26J16N0J35K6m73L76P2k64K30l26K75n6J22j40R4j84O8P3k8j24L53j65J15
5207A19l96L48O8k23J53j24k6K42j59l3J28k48O0J72l2l0R4Pm0J51l69J79L54
$$ y = [-221, 57, -111, -247, 61, 227, 213, -65, 105, 99, 167, -45, 75, -18, 190, -187, 54, -92, -224, 93, -157, 125, -107, -6, -125, -14, 11, -129, 33, 138, -147, 143, -64, -71, 166, -140, 175, -124, 161, 16, -176, 148, 19, 121, -21, 112, 153, -118, -87, 227, -41, 37, -47, -198, -235, -67, -198, 65, 153, -134, 228, -34, -237, -25, 114, -29, -159, -90, 81, -232, 1, -189, -333, 83, -388, -173, -319, -15, 173, -119, -160, 8, -48, 143, 18, 52, -72, 123, -97, 55, -125, 30, -90, 108, 143, -368, 189, -113, 279, -36, -61, 113, -18, -8, -166, -350, -184, 221, -88, 72, 33, 41, 345, -162, 9, 113, -27, 32, -129, 331, -12, 134, 154, -178, -187, 117, 177, 61, -116, 77, 345, -226, -110, -60, 75, 101, -372, 4, 76, -188, 42, -284, -9, -65, 57, -83, 11, -173, -105, -32, -60, -184, 169, 4, 119, -277, 71, 139, -84, 69, -55, -81, 161, 2, -31, 97, -151, -91, 81, 49, 19, 113, 120, 80, 231, -138, 41, 395]
5230C95k56J8q1jk30N01n98L82q6J66o2Oq8j71J70o3K3k55K55K6j20J62NM2q5
5255E5j51J63J14n4k89J50j65K29J43l93L23Q3r1j06m8J99j64J52j15J60M7l37
5277i5j40J01N63m75j2K49j42k40m3M0K37O6j33q3O1J44k02J61j8J33j34m9%j41
5301a52J92J72k34Q2j09J58k42O7J74m6J05j58l26N22l8k12m9J6O3M5J07l3N2
5324A56rp9L1l40O1M15J82k80N2Jm77M33j7j00l5j23K53j47K59m13J66j72K17
5347C4N7q5P9j64J16R6P8j02Oj07P1L5l01P2M9K67j82Nj06J74J63l36M76m18n1
5372g4J40n3M9k66K21K6k74j4K42n2K74j09J31k98q4k4M35k39k71M04Ll6j85K95
5396B41l56L66l66j22L30n3J95j11k06QJ58r6K6M00m24J64l05K00j73N3j21J66
$$ y = [395, 139, 157, 76, 75, -155, 346, -252, 130, 44, 210, 148, 154, 66, -105, 65, 2, 25, -230, 25, 51, -69, 93, 98, 140, 55, -96, 67, 181, 127, -162, -12, -177, 52, 195, -198, 125, 208, 117, 11, -37, 162, -2, 150, 35, 195, 242, -95, -235, -134, 429, -46, -58, 191, 49, -191, -234, -194, 43, 109, -24, -107, -46, 98, -104, 57, 39, 172, 38, -11, -11, -152, 40, 212, -22, 60, -49, 109, -133, -66, 108, 62, 167, 9, -317, 205, 167, -45, -94, -78, -15, 30, 137, 104, 156, 147, 68, 99, -241, -180, 235, 417, 137, 189, 190, -287, 146, 129, 29, -6, -129, 124, -23, 236, -177, -11, -183, 34, 91, 6, 85, -79, 37, 133, 211, 109, 115, 8, 79, 114, -187, -115, -66, 201, 19, 24, -82, 92, 255, -81, 395, -23, -74, 66, 13, 62, -204, 17, 43, -231, -245, -3, -55, 219, 110, 241, -57, -141, -165, 270, 31, -240, 164, 167, 131, -54, 241, -115, 251, -115, -237, 93, 40, 235, 124, -82, -74, 84, -12, 14, 414, -10, 154, -151, 49, -124, -71, -192, -26]
5418b6k6K6r3L61j35k82J22qk9J15k24J62K01k80K0l78P51k98j05p4L69n1j97
5441g9J09q2Q2Q7k7j68L03k88J04j48L70r6j72k96L65k04L85j22j29K14m81K57
5463a6j9JJ0j41K09K24on31L91k56K88l84L06k6J16l18J85M8n8j42P7J08j41O9
5487fK92n51R6j3J45J85k59k4p0J26Q2j11j9L1ML64m13J83j00K6K94l86R7L03
5511B76l31q6K0K01j96L51k7k50R2J5m02J25J09J78K7j12l6j08o8J15l8K56qk59
5535a56J37J53j93K8L0j52J70k50M1j35K03O2j6R0Q9m8J1j31j04N8k7L89l5k74
5559f0j97J36p0L08k28K75r7J31k27j15J55m07L88R5J27l5l46N91m83L31m10J21
5581a7LL5L6k11M77n02K45j49k0Q6p1J23j51O2O5j88l1L12j68J58m5m09O20l54
$$ y = [-26, -52, -26, -119, 242, 107, -175, -53, -61, -90, 25, -199, -37, 164, -116, -96, -474, 277, -21, -126, -200, 169, 118, -79, 30, -52, 30, 117, 90, -78, 225, -63, 41, -107, 263, 167, -5, -301, 64, -140, 245, 123, -6, 208, -273, -16, -35, -34, -24, -165, 44, 268, 262, -269, 122, -134, 154, -230, 76, 50, 166, -152, 33, 81, 23, -119, -42, 66, -75, -6, 286, -265, -169, -182, -37, 148, -111, -135, -205, -79, 3, -108, -127, -96, -92, 272, -141, 42, -58, -32, 262, -124, -27, 276, -55, -141, -121, 80, -116, 235, 208, -42, 50, 65, -337, -212, -103, 75, 102, -10, -46, -154, -222, -107, -145, 111, 103, -156, -19, 134, -59, -31, -1, -153, 17, -233, -192, -327, -124, -62, -78, 12, 101, 53, 64, -67, -171, -113, -140, 249, 214, -60, -257, -121, -191, 117, -111, 164, 67, 198, -29, -144, 11, -396, -8, 87, 214, 179, -167, 424, -59, 272, -138, -17, -14, 21, 57, -154, 323, -179, 66, -83, -103, -17, -88, 35, -116, -54, 11, -177, -208, 104, -64, 94, 49, -360, 260, -94]
5605i4ol2l6N60k79Q5j87j19K52l61J16R7J8m4L31m67M6j14K02j78M8m4L18r4
5629A8J07j59J23J84l34ok4j4J62n0J17k82L6J24p4K30j59j2M4J15j80M2K09L6
5653B53k44q4Kl0L2k2L9l2j06M83j97j01l2q5J9R0k82K92Pj02K05J39k36J27l2
5678A03o8K03k98j39M03k62j33P3K81j25j52J45R5j06m6J84p5p0N3j4j54m3L49
5701B04j69j32L9O6r2L29j9J09j29j83nK2JM8M1j13J01l1J79j44j35j70K37k83
5725b29K08j7j68J6P7J70J29l23L23q1j38j81K63N2j57j51L5J91m9k29L92j1j58
5748c6m2J33l62J31Q3K24j89j35P5M6LL18m26J64J40k55L8L49k97n1K54k74m4
5771a53j7J85Qj10K22k23J94k35J00j73K16j14J39j13J23l2m2q2J44P9j55R9j22
$$ y = [-94, -100, -132, -168, 392, 113, 198, 11, -108, 144, -217, -101, -4, 14, -30, 301, -166, -120, -234, -32, -210, -162, -206, 112, 18, 125, -34, 89, 273, -61, -67, -91, -105, 57, 7, 124, -158, -122, 2, -72, 158, -1, -13, 31, 146, -34, 8, 217, 253, 9, -75, -73, -103, -71, -93, -54, -86, -192, 291, 94, -7, -39, -124, -105, -15, -297, -5, 2, -100, 105, 244, 8, 135, 103, 35, 238, -60, -199, 204, -58, -191, -118, 163, 38, -114, 31, 126, 20, -26, 158, 83, 13, 66, 52, -102, -145, 204, 35, -97, -58, 8, -84, 245, 226, 335, 206, 23, 18, 40, 41, 89, 130, 17, 118, 87, 266, 122, -13, -183, 54, -229, -21, -38, -206, -190, -113, 57, 186, -137, 186, 105, -33, -214, 49, 101, -56, -207, -172, 19, -30, -259, 133, 122, -36, -78, 55, -307, -176, -93, 131, -58, -193, -118, -72, -69, 249, -177, -13, 127, -128, -90, 259, -38, -89, 165, -109, -153, -170, 15, 23, -87, 135, -88, 106, -129, -29, -202, 14, -100, 39, -74, 49, 17, -25, -107, 37, 116, -39, 60, -62]
5794f2j00K52n5l2j07Q1q9M6J45m5j6J83l9j29j78R1J41n7K69l29Kj06j8K27j77
5819a02N54m83j79K48j98J77j48j69L70j44Rj5J00J96j38j53m1J82P5nj43j67
5841a74r2K26nQ8J07k22j42J76l2N0K45j25l38J64J34J7k96J67J50k96L95Kj06
5864I3j47o1L8%O6j4p2J50n4L7M0r8j56R3M8k4j13L19j91J06r3N5j73jK14n6J73
5891A79j71P0j65PK33J97k13l57M4L28m54L05n67P44l38M42l94K28R5m23K91J64
5913B45l54J88k40k6J78J67m7k2j69j03J80o1J22j51M1J38K7l30L75l11M6Q1j77
5936b03R8J85O1j97J6K18k52J20j71J54j44o8J73L6k99K57j53M28n87L11n3K8
5958d2J61p0J06q4J34j82k00N5n0J29K86l82J16l02K37J64J79l91K25l4k12M77
$$ y = [-62, -162, 90, 35, 3, -104, -23, -112, -66, 79, 34, 18, 201, 162, 33, -145, -54, 87, 30, 299, -30, -28, -134, -152, 75, -102, 452, -31, -210, 38, -160, 17, -131, -300, 70, -74, -65, -80, 20, 216, 78, -75, -116, 66, 141, 136, -7, -174, -266, -40, -45, 43, 150, -72, -214, -38, -70, -20, 225, 100, -238, -74, 60, 77, -219, -52, 98, -198, 197, 199, 93, -54, -115, -77, -77, -11, -25, -97, 53, -1, 36, 76, -22, -178, -85, -37, -61, -174, 145, -46, 60, -33, 22, -151, -152, 62, 6, 179, 8, 78, -87, -80, 153, 350, 137, -220, -176, 152, -302, 3, -564, 180, -158, 284, -110, 118, 213, -210, 81, 245, -109, 79, -161, -187, -9, 158, 111, 89, -80, -183, -3, -64, 58, -93, -52, 86, 113, -217, 158, -153, -107, -26, -203, -105, 80, 141, -56, -40, 178, -74, 46, -125, 29, -115, -183, -10, 26, -273, -16, -169, 259, -328, -17, -70, -42, 119, 49, 155, 71, 205, 23, -177, -122, -172, -43, 243, -139, -23, -325, -88, 76, 255, -136, 89, 55, -157, 320]
5980C20k68J0j4l1k7J48j31j00J90k89j88K62K50j90j57L65N6J53n61K87q7j4
6002a6P2K0k5o8K24l42J64j2j5l8OJ29j08L6j9K37o0j1j75J02p7k36M2N36n68
6027b02J22J20j02M7R7%j81J21p5J02j97J04O5P1k1n9o2O1j50J74J43l0j1j20
6051A7k5J22j13J5k1j25J77P5l11J21J19L34j39j88k89J08J2q0O7L5j67J91K21
6074A56j25J49j50k20J01Q4q7L42p2l4l49K28k2J04j21j47J45k2J5L03l3l16J07
6097C6r4k32N9J16o2L57j14k4mj41P9j60K65k56J01k21K69K60j3k77l0l3mL70
6121B47J34m51r3L45l30k7J80k09j79N46n4l23L30k4j95J71m6m1pJ50j81k3J69
6144H9j12J57l83J24K10j00K26m88N59l67K36j65P9K2j35J38j92K64j27k7n4L06
$$ y = [320, 52, 62, 48, 17, -10, 138, 7, -93, 97, -192, -380, -118, 132, -58, -215, 150, 206, 359, -202, 85, -2, -16, 56, 76, 51, -17, 207, -135, 29, 17, 2, -36, -30, 99, -9, 27, 8, 245, 185, 174, -1, 101, 24, -212, -170, 366, -202, -80, 40, -62, -15, 82, 82, -99, 22, -53, 49, -148, -44, 21, 92, 71, 12, -50, 11, -139, 35, 178, 148, 137, 17, -8, 114, 1, 16, -5, -130, 47, 122, -189, -68, 51, 385, 246, 58, -231, -123, -111, -191, -124, -89, -256, -65, 156, 31, 180, 30, -190, -89, -5, -92, 250, 178, 144, -205, 23, 1, 105, -16, -163, -18, -40, -25, 278, 245, -71, 36, -58, -290, -231, -115, -177, 180, 66, 42, 38, -103, -24, -184, 81, -175, -74, -295, -26, 234, 221, -56, -86, -119, -123, 247, 381, -70, -163, 182, -148, -175, 5, -204, -383, 163, 109, -214, 116, 92, -103, 68, 22, -19, -26, 124, -57, -80, 89, -23, 134, -249, -125, 85, -15, 211, -277, 282, -85, 151, -14, 65, 87, -48, 90, -102, 162, 35, 8, -46, 260]
6166B60k63K2O9r3J49k03J65J69m03L0o6M8K7L51l62k8l7n1O2P1j31MM50j7L1
6191B54k83K6J81k02J49l02P0K05k84Q5J71J07l60K59k29L23p3o2r4o2k2K52J19
6214B28j4r9O7k26P3Nk50N2J36K6rK05k81J39j87O2L2KJ06Ml2l1O1k16J95j83
6240a35J44k10M06N2j46K0k40Q1qp1q5M01k64J18l9J13J82m77P1K03j22j36J33
6263iJ23j2n5Q4j48j18L20k38j19J90p1J82k91J16j27J62J09r7j51L6K63j25j3
6286A1j3J38k32J63K74k38L1k68J02j86J79K96l12K4J66m75L61J86m61J39P3j2
6308e4M4j96O20j11k02j04J65k76q7R2J77L9j60k4Q4K9Lr7J25m1k43Q6K26j64
6332f9k1J94J65q2p4L0j26K15mj67k25L38J30m34J50l74L34P3QJ5J12m7k33j13
$$ y = [260, -3, 19, 88, -5, 144, -59, 106, 275, -128, -98, -164, -116, -89, 262, -100, -128, -165, -216, -154, -83, -214, -210, 240, 223, 254, -29, -3, 178, -24, 125, -177, -107, 98, -186, -101, 70, 177, -183, 76, -153, 170, 97, 35, -59, -121, -143, 109, 228, 214, 115, 182, -44, 29, 34, -216, -164, -28, -2, -11, 194, -87, 52, -135, -73, -41, -39, 67, 71, 39, 8, 69, -147, 48, -135, 9, -201, 205, 257, 111, 131, -109, -28, -36, -107, -192, 209, -55, 63, 24, 137, 319, -158, -87, 116, -6, -142, -9, 114, 102, 47, 131, -17, -135, 185, -53, -172, 18, -53, 129, -162, -46, -173, -11, 98, 1, -150, -114, 149, 24, 11, -2, 136, -96, 67, 341, 103, 134, -134, -32, -218, -39, 257, -55, -31, 135, -340, 21, 207, -254, -115, -42, -54, -10, -206, 414, 303, 101, -3, 162, -114, -201, -109, 68, 107, -53, -77, 7, 36, 39, -58, 67, 26, -217, -131, 95, -69, -90, 104, 269, 187, 113, 143, 17, 232, 228, 61, -164, 174, 304, -130, 20, -354, -20, 53, 61, 76, 188, 141, -92, -205]
6356b05J03r1J57J70k65Q7l9NO6K87m04M49m24LJ62mK4J14k62o5K42k27J24QK26
6381B41j40J8K11o52K32O6j82L03j24K04j01l53M24j48j53J39J71j34j27J25L05
6402C25m43n8J15J08K6j98J82r0k12K05j26j19L94j92K39j55J81M5j78j53K5j01
6424a80O8J33J65j69PL8m9kO5k53M6L5K55k85K14N3J86m67N62k91JJ15l87m3K52
6449F9m6K04l57K69l2O2k55o2L64k71j14K9J62J1j86J54m4J28oq5k19J27K25L7
6473A64J13n05K08K87l89K47j0l9K4j11r6J06k08K92k05K89j46J80m45K20J27
6494A03r1L74l13m80K65kK19n9j86K50k5J49k86L32k41k35K85k55K30j52J89r5
6516b4J67K09l10ll15L57o5nj54k9j00O74k25J0r2K9m3J23j92J6L8j23j91L2Q6
$$ y = [-205, -102, -193, -36, 134, -131, -44, -83, -78, -12, 275, -129, 320, -104, -101, 61, 57, 81, 195, -67, -132, 110, -117, 7, 15, 241, 101, 119, 330, -322, -90, -24, -206, 97, -27, 177, 76, -277, 147, -1, -154, -15, 156, 22, -105, 20, 325, -118, -176, -61, 47, 73, -125, 57, -33, -245, -40, -166, -285, 109, -83, 156, 1, 182, 227, 49, -104, -79, -180, -112, 21, 186, 17, 24, 62, 13, 11, 76, -177, -131, -96, 159, -126, 88, 141, 327, -140, 422, 131, 132, 247, -140, -183, 69, 23, 227, -130, 139, 107, 169, -86, -148, 216, -55, -169, -140, 22, 33, -153, 1, -43, 85, 79, -6, -225, -98, 127, 164, 277, -228, -20, 267, -122, 125, 115, 76, 100, -11, -107, -1, -209, 83, -122, 167, 21, 201, -244, -24, 103, 12, 386, 73, -407, -142, -144, 75, 16, -170, 80, 55, 204, -82, 250, 9, -226, 59, -196, 34, -118, 71, -24, 143, 352, 42, 39, -276, 81, 16, 11, -143, -172, -272, 402, 177, 187, 95, 124, 81, 204, 12, 28, 66, -57, -248, -216, -130]
$$ [...]
8191f6
##END NTUPLES=NMR FID
##END=
