##TITLE=1H_DE-156_TRA_CCl4p
 200.13Hz,CCl4.
 8 sc
 10.6.2026
##JCAMPDX= 6.0         $$ Bruker NMR JCAMP-DX V2.0
##DATA TYPE= NMR FID
##DATA CLASS= NTUPLES
##ORIGIN= UXNMR, Bruker Analytische Messtechnik GmbH
##OWNER= pz
$$ XWIN-NMR		Version 3.5
$$ Wed Jun 10 14:06:29 2026 Russian Standard Time (UT+4h)  she@DPX200
##.OBSERVE FREQUENCY= 200.131
##.OBSERVE NUCLEUS= ^1H
##.DELAY= (6, 6)
##.ACQUISITION MODE= SIMULTANEOUS
##.ACQUISITION SCHEME= undefined
##.AVERAGES= 8
##.DIGITISER RES= 18
##SPECTROMETER/DATA SYSTEM= spect
##.PULSE SEQUENCE= zg30
##.SOLVENT NAME= CDCl3
##.SHIFT REFERENCE= (INTERNAL, CDCl3, 0, 14.3821)
##AUDIT TRAIL= $$ (NUMBER, WHEN, WHO, WHERE, WHAT)
$$ ##TITLE= Audit trail, XWIN-NMR		Version 3.5
$$ ##JCAMPDX= 5.01
$$ ##ORIGIN= Bruker BioSpin GmbH
$$ ##OWNER= she
$$ F:/spectra/data/she/nmr/H-C/1/audita.txt
$$ ##AUDIT TRAIL=  $$ (NUMBER, WHEN, WHO, WHERE, WHAT)
(   1,<2026-06-10 14:04:43.98 +0400>,<she>,<DPX200>,
      <created by zg, POWCHK disabled, PULCHK disabled
       configuration hash MD5:
       00 E9 B6 7A A2 85 ED C7 34 08 36 98 17 FE 4E 26
       data hash MD5: 16K
       59 BF 74 C1 FF 70 CA BE E3 39 2D 13 24 A8 01 5A>)
$$ ##END=
$$ 
$$ hash MD5
$$ 76 16 9A B5 1F C8 B6 62 98 BF 12 20 A2 0F 4A F1
##$RELAX= 
##$RELAX= 
##$RELAX= 
##$RELAX= 
##$RELAX= 
##$RELAX= 
$$ Bruker specific parameters
$$ --------------------------
##$DU= <F:/spectra>
##$EXPNO= 1
##$NAME= <H-C>
##$PROCNO= 1
##$TYPE= <nmr>
##$USER= <she>
##$AMP= (0..31)
100 100 100 100 100 100 100 100 100 100 100 100 100 100 100 100 100 100 
100 100 100 100 100 100 100 100 100 100 100 100 100 100 
##$AQSEQ= 0
##$AQ_mod= 1
##$AUNM= <au_zg>
##$AUTOPOS= <>
##$BF1= 200.13
##$BF2= 200.13
##$BF3= 200.13
##$BF4= 200.13
##$BF5= 200.13
##$BF6= 200.13
##$BF7= 200.13
##$BF8= 200.13
##$BYTORDA= 1
##$CFDGTYP= 0
##$CFRGTYP= 5
##$CHEMSTR= <none>
##$CNST= (0..31)
1 1 145 1 1 1 1 1 1 1 1 1 1 1 1 1 1 1 1 1 1 1 1 1 1 1 1 1 1 1 1 1 
##$CPDPRG= <>
##$CPDPRG1= <>
##$CPDPRG2= <>
##$CPDPRG3= <>
##$CPDPRG4= <mlev>
##$CPDPRG5= <mlev>
##$CPDPRG6= <mlev>
##$CPDPRG7= <mlev>
##$CPDPRG8= <mlev>
##$CPDPRGB= <>
##$CPDPRGT= <>
##$D= (0..31)
0 0.7 0 0 0 0 0 0 0 0 0 0.03 0 0 0 0 0 0 0 0 0 0 0 0 0 0 0 0 0 0 0 0 
##$DATE= 1781085883
##$DBL= (0..7)
120 120 120 120 120 120 120 120 
##$DBP= (0..7)
150 150 150 150 150 150 150 150 
##$DBP07= 0
##$DBPNAM0= <>
##$DBPNAM1= <>
##$DBPNAM2= <>
##$DBPNAM3= <>
##$DBPNAM4= <>
##$DBPNAM5= <>
##$DBPNAM6= <>
##$DBPNAM7= <>
##$DBPOAL= (0..7)
0.5 0.5 0.5 0.5 0.5 0.5 0.5 0.5 
##$DBPOFFS= (0..7)
0 0 0 0 0 0 0 0 
##$DE= 6
##$DECBNUC= <off>
##$DECIM= 32
##$DECNUC= <off>
##$DECSTAT= 4
##$DIGMOD= 1
##$DIGTYP= 9
##$DL= (0..7)
0 120 120 120 120 120 120 120 
##$DP= (0..7)
150 150 150 150 150 150 150 150 
##$DP07= 0
##$DPNAME0= <>
##$DPNAME1= <>
##$DPNAME2= <>
##$DPNAME3= <>
##$DPNAME4= <>
##$DPNAME5= <>
##$DPNAME6= <>
##$DPNAME7= <>
##$DPOAL= (0..7)
0.5 0.5 0.5 0.5 0.5 0.5 0.5 0.5 
##$DPOFFS= (0..7)
0 0 0 0 0 0 0 0 
##$DQDMODE= 0
##$DR= 18
##$DS= 0
##$DSLIST= <SSSSSSSSSSSSSSS>
$$ [...]
##$SUBNAM0= <"">
##$SUBNAM1= <"">
##$SUBNAM2= <"">
##$SUBNAM3= <"">
##$SUBNAM4= <"">
##$SUBNAM5= <"">
##$SUBNAM6= <"">
##$SUBNAM7= <"">
##$SUBNAM8= <"">
##$SUBNAM9= <"">
##$SW= 18.0517599122864
##$SWIBOX= (0..15)
0 0 2 0 0 0 0 0 0 0 0 0 0 0 0 0 
##$SW_h= 3612.71676300578
##$TD= 16384
##$TD0= 1
##$TE= 0
##$TE2= 300
##$TE3= 300
##$TEG= 300
##$TL= (0..7)
0 120 120 120 120 120 120 120 
##$TP= (0..7)
150 150 150 150 150 150 150 150 
##$TP07= 0
##$TPNAME0= <>
##$TPNAME1= <>
##$TPNAME2= <>
##$TPNAME3= <>
##$TPNAME4= <>
##$TPNAME5= <>
##$TPNAME6= <>
##$TPNAME7= <>
##$TPOAL= (0..7)
0.5 0.5 0.5 0.5 0.5 0.5 0.5 0.5 
##$TPOFFS= (0..7)
0 0 0 0 0 0 0 0 
##$TUNHIN= 0
##$TUNHOUT= 0
##$TUNXOUT= 0
##$USERA1= <user>
##$USERA2= <user>
##$USERA3= <user>
##$USERA4= <user>
##$USERA5= <user>
##$V9= 5
##$VALIST= <valist>
##$VCLIST= <CCCCCCCCCCCCCCC>
##$VD= 0
##$VDLIST= <DDDDDDDDDDDDDDD>
##$VPLIST= <PPPPPPPPPPPPPPP>
##$VTLIST= <TTTTTTTTTTTTTTT>
##$WBST= 1024
##$WBSW= 4
##$XGAIN= (0..3)
0 0 0 0 
##$XL= 0
##$YL= 0
##$YMAX_a= 119791
##$YMIN_a= -89654
##$ZGOPTNS= <>
##$ZL1= 120
##$ZL2= 120
##$ZL3= 120
##$ZL4= 120
##$ABSF1= 10
##$ABSF2= 0
##$ABSG= 5
##$ABSL= 3
##$ALPHA= 0
##$AQORDER= 0
##$ASSFAC= 0
##$ASSFACI= 0
##$ASSFACX= 0
##$ASSWID= 0
##$AUNMP= <proc_1d>
##$AZFE= 0.1
##$AZFW= 0.1
##$BCFW= 1
##$BC_mod= 2
##$BYTORDP= 1
##$COROFFS= 0
##$CY= -3
##$DATMOD= 1
##$DC= 2
##$DFILT= <>
##$DTYPP= 0
##$F1P= 0
##$F2P= 0
##$FCOR= 0.5
##$FTSIZE= 0
##$FT_mod= 4
##$GAMMA= 1
##$GB= 0.15
##$INTBC= 1
##$INTSCL= 1
##$ISEN= 128
##$LB= 0.25
##$LEV0= 0
##$LPBIN= 0
##$MAXI= 10000
##$MC2= 0
##$MEAN= 0
##$ME_mod= 0
##$MI= 1.114404
##$NCOEF= 0
##$NC_proc= 0
##$NLEV= 6
##$NOISF1= 3.799351
##$NOISF2= 2.8
##$NSP= 1
##$NTH_PI= 0
##$NZP= 0
##$OFFSET= 14.38212
##$PC= 1
##$PHC0= -4224.473
##$PHC1= 24.39229
##$PH_mod= 1
##$PKNL= yes
##$PPARMOD= 0
##$PSCAL= 0
##$PSIGN= 0
##$REVERSE= no
##$SF= 200.129724274929
##$SI= 16384
##$SIGF1= 3
##$SIGF2= 2
##$SINO= 400
##$SIOLD= 16384
##$SREGLST= <1H.CDCl3>
##$SSB= 0
##$STSI= 0
##$STSR= 0
##$SW_p= 3205.1282051282
##$SYMM= 0
##$S_DEV= 0
##$TDeff= 0
##$TDoff= 0
##$TI= <>
##$TILT= no
##$TM1= 0
##$TM2= 0
##$TOPLEV= 0
##$USERP1= <user>
##$USERP2= <user>
##$USERP3= <user>
##$USERP4= <user>
##$USERP5= <user>
##$WDW= 1
##$XDIM= 8192
##$YMAX_p= 0
##$YMIN_p= 0
$$ End of Bruker specific parameters
$$ ---------------------------------
##NTUPLES= NMR FID
##VAR_NAME=  TIME,          FID/REAL,        FID/IMAG
##SYMBOL=    X,             R,               I
##VAR_TYPE=  INDEPENDENT,   DEPENDENT,       DEPENDENT
##VAR_FORM=  AFFN,          ASDF,            ASDF
##VAR_DIM=   8192,          8192,            8192
##UNITS=     SECONDS,       ARBITRARY UNITS, ARBITRARY UNITS
##FACTOR=    0.0002768,     1,               1
##FIRST=     0,             0,               0
##LAST=      2.2672688,     0,               0
##MIN=       0,             -89654,          0
##MAX=       2.2672688,     119791,          0
$$ Real data points
##PAGE= N=1
##DATA TABLE= (X++(R..R)), XYDATA
0 0 0 0 0 0 0 0 0 0 0 0 0 0 0 0 0 0 2 -8 8 -8 8 -8 16 -16 16 -24 24 -29 32 -40 45 -52 58 -67 77 -85 98 -109
38 -109 124 -135 152 -171 191 -211 234 -260 285 -317 349 -385 424 -465 515 -566 623 -691 762
57 762 -842 936 -1043 1169 -1314 1491 -1711 1987 -2347 2841 -3575 4869 -15610 42364 -89654
72 -89654 -46116 57830 -32910 50080 55838 -18883 40118 36862 -33863 49813 21886 -14796
84 -14796 71878 18199 12639 49545 -406 21776 25582 4723 13843 37333 5608 3272 31694
97 31694 -21639 8208 23048 -21682 15062 3603 -17054 13117 4051 -29972 12563 7328 -34431
110 -34431 20805 -19091 -24716 24913 -38899 -8188 10474 -31730 492 1698 -26137 -2676
122 -2676 5585 -24966 7932 -5364 -23277 23863 -21636 -15278 14299 -17277 -2251 456 -6544
135 -6544 -4218 4696 -7538 -4713 13758 -15739 10028 9379 -20856 9479 5238 -5198 731 5616
149 5616 -3344 6055 5863 -14076 21058 -1256 -5139 25184 -12687 5132 13083 -6894 6660
162 6660 3715 -2833 6634 6032 -16603 11703 8421 -14947 18743 -6473 -3315 13496 -9998 2999
176 2999 2727 -2511 -350 5982 -7298 -6327 13383 -9835 4003 2806 -7418 13987 -3447 -2432
190 -2432 5185 3198 -1168 2420 3492 -11083 11167 -3391 -5130 10709 -14243 8457 7160 -11119
204 -11119 4084 5254 -1463 -2069 4600 -8582 5424 2323 -14235 11218 -10229 -5761 10091
217 10091 -10654 -1672 644 683 -3029 -1958 -3865 -832 5908 -14122 4111 554 -11898 6964
231 6964 -6604 -2650 1724 -1087 463 -426 241 -3638 12029 -5776 -4347 13318 -7985 5317
245 5317 1090 -4248 7438 911 1026 2543 5667 -3079 8795 6083 -6897 13908 -1233 2532
259 2532 7552 -7847 8169 3553 -1986 878 5382 107 -147 7476 -7361 7799 2867 -5446
273 -5446 10582 -7449 -1008 5625 -3741 -4128 231 2009 -6162 2523 -7169 -910 7012 -12009 5232
288 5232 -142 -7861 3585 -3627 -3807 -2629 1284 -4395 -173 -3688 -7905 10905 -8599 -3160 7644
303 7644 -6035 3229 -858 -2018 331 2104 -874 -305 3852 -9092 7353 2481 -8191 9361
317 9361 -718 3405 3625 -2844 2487 4257 1718 -2872 7850 -3593 -761 7673 -9366 5084
331 5084 1621 -1499 7130 -3473 -619 3846 3037 -5020 3260 2948 -5587 6260 -7542 -1381 4875
346 4875 -7281 4361 -689 -3105 1198 2809 -2231 -2638 5716 -3828 4545 -2058 -7005 8907 -5708
361 -5708 -1737 3025 -1979 75 971 1027 -3486 4905 -1366 1604 5258 -9216 6557 1416 -5657
376 -5657 2907 -1461 1391 -462 -200 -2655 2711 573 -4061 7660 -5909 -340 5946 -6566 1235
391 1235 -1629 -467 727 -1685 -3634 -419 4138 -7326 3436 1579 -4792 6486 -4067 -214
405 -214 1421 -2416 1804 -806 -1468 -2996 5393 -3182 -2443 5236 -4061 6360 -975 -2809 6270 -1769
421 -1769 987 1527 1255 -2165 3104 1754 -5165 5271 -2580 3297 4183 -6136 5709 1972 -692
436 -692 488 1678 814 -764 3050 -4547 2520 -823 -2783 6017 -6171 273 3248 -1949 -105
451 -105 -1570 1619 -793 849 -4816 -473 2863 -7714 3556 -2042 -4644 3590 -2466 -674 -1354
466 -1354 210 -523 1701 -1500 -4132 6240 -4000 -1602 2200 -4743 3530 -1954 -1138 1276 -535
481 -535 945 1486 2383 -3812 5260 1871 -2696 4170 -3993 3356 2064 -3843 2429 1680 1096 -1029
497 -1029 3846 -1685 150 4838 -3780 3376 -994 -1129 4613 -3861 -1106 557 1313 -2926 -800 626
513 626 -2719 3753 -3802 747 2099 -5262 3796 -2295 -3483 353 -409 -1104 -2390 436 -2481 3134
529 3134 -2017 -3691 6053 -3439 706 1676 -2045 1348 -518 1236 -1601 1194 -631 889 2018
544 2018 -4940 4006 1649 -506 2588 -2029 3453 270 -433 -556 866 525 -2136 3844 -4197 -24
560 -24 3043 -3384 2653 -2256 -228 2581 -1144 -2006 151 2346 -4124 1183 -1023 -3651 3146 -4227
576 -4227 832 57 -2742 3151 -1171 -709 -1184 2273 82 -902 607 -2332 3746 -2419 -1261 3413
592 3413 -2121 2135 656 497 -308 1800 2985 -1314 3172 -1419 2336 2700 -4377 2602 807 110
608 110 316 30 783 -280 2519 -1623 2262 -506 -1266 3970 -4428 192 448 -1527 1231 -2988 -136
625 -136 32 -364 -2682 -114 1198 -3319 2609 -1623 -1941 1090 -2542 973 -2545 -1328 -154 -318
641 -318 -595 -3334 2651 -776 -173 1161 -1409 2543 -1354 428 749 -785 1389 289 1491 -2287
657 -2287 1683 1171 -377 2377 -2390 3789 1677 -1797 2227 232 1182 -97 1147 -600 -333 1676
673 1676 -1758 2176 -1865 557 2795 -2423 1068 -894 1095 699 -1550 952 -674 614 -2035
688 -2035 495 13 -2388 2441 -2118 -472 -163 -734 1749 -1338 -73 -902 1524 -1662 -2413 2309
704 2309 -2644 1123 -331 -1989 1391 -1280 1140 62 -124 -16 1254 1337 -3019 1981 -876 455
720 455 911 -3571 2539 -310 -712 973 -191 622 22 2397 -1555 453 970 -1192 2330 -3008 171
737 171 1654 -1253 -123 -732 1665 -1121 905 -81 -773 2402 -2105 1686 -517 -2075 2142 -833
753 -833 -230 -993 636 465 -190 -98 -1296 3291 -1319 48 2347 -2394 1816 -26 -352 411 -664
770 -664 1262 -198 615 -1692 1996 1136 -2110 2158 -441 1221 814 -977 1247 -921 127 -776
786 -776 535 -1046 -1014 1911 -2220 356 -214 -587 1686 -2275 59 -49 -313 -1306 -802 374 -2482
803 -2482 980 -1933 -1402 927 -2005 1741 -889 -1272 789 97 316 -1711 1320 -1168 532 118
819 118 -1429 2407 -1306 853 1482 -826 1323 575 1459 -376 903 1411 515 1415 -2028 2106 740
836 740 -1017 1513 -498 1310 284 762 319 131 1397 -277 1818 -1654 -643 1904 -1863 294
852 294 -1033 20 356 -1261 -229 -650 839 -1355 239 -25 -2322 1437 -1367 -777 -706 -1488 1028
869 1028 -1343 -728 -1250 890 -215 -1409 1204 -1124 1198 -127 -762 1160 -1324 841 167 -446
885 -446 -670 261 1501 -1373 1027 140 893 1450 -1453 1648 244 101 649 -67 574 -740 1100 -597
903 -597 -247 597 -99 2197 -1423 299 1196 -602 669 -1111 936 -248 -94 -136 -948 776 -1872
920 -1872 1231 -174 -1290 1269 -305 785 -1030 108 809 -377 -37 -1287 1148 -596 -541 696
936 696 -1101 966 -244 352 232 -1074 929 -22 662 -1214 310 463 -1357 623 -1215 747 512
953 512 -981 921 -670 488 -16 349 -375 -861 1384 -893 225 -823 -317 1099 -1685 107 -411
970 -411 18 117 -561 642 -953 783 -302 -103 223 -1549 1588 -927 -768 120 -411 472 -990 520
988 520 -252 575 639 -525 1345 -927 701 907 -794 624 -514 1057 -582 -207 626 570 1040 -1285
1006 -1285 1054 450 100 1093 -811 1052 -100 -90 470 -623 147 -76 852 -882 -263 936 -369
1023 -369 964 -948 -19 400 -838 8 -859 31 -670 -342 -48 -1328 351 -887 160 -695 -1030 1183
1041 1183 -549 -57 -290 142 442 -924 449 -858 455 -269 -315 907 -1471 920 652 -161 -8
1058 -8 159 1071 -540 368 -164 278 916 -899 1091 -126 415 698 -486 792 -324 889 447 -38
1076 -38 32 -377 1126 -874 32 198 -324 484 -1093 48 33 -85 -88 -83 428 -1078 653 -357 -1093 516
1096 516 -590 547 -980 -527 440 -63 331 -993 724 -293 33 445 -763 865 -724 207 173
1113 173 -1128 703 -65 308 -564 111 598 -154 620 -723 690 421 -827 1007 -353 280 235 180
1131 180 -45 -618 858 -76 332 -623 -195 1164 -709 589 -220 -95 172 -876 84 -465 157 -305
1149 -305 62 309 -750 991 -277 -91 204 -425 711 -380 -57 -93 330 -109 -825 802 -863 424
1167 424 738 -189 535 -326 1065 -74 -283 319 256 527 -582 231 -40 26 515 -699 510 -272 -209
1186 -209 903 -281 366 -163 788 -753 -201 398 -323 599 -748 -326 145 -664 310 -844 306 -175
1204 -175 93 415 -592 415 -389 266 -445 -1050 285 -545 257 -486 7 872 -302 284 -226 525 -179
1223 -179 -185 801 -734 452 227 -271 -45 -744 747 -216 164 -192 369 929 -427 695 -173 191 536
1242 536 -580 606 -595 638 336 -119 127 -456 1022 -254 138 -8 -139 817 -726 -112 6 -626
1260 -626 76 -280 173 -704 191 224 -650 172 -418 769 -436 -590 237 -329 491 -436 47 57 -274 334
1280 334 -305 251 -504 256 181 -663 493 -48 678 -358 41 315 -317 653 -581 273 315 -246 659 -159
1300 -159 243 45 110 309 -528 266 270 308 -268 -605 695 -203 98 -281 -231 322 -377 92 -478 64 -507
1321 -507 153 10 -876 316 1 96 -194 -377 492 -334 42 216 -357 450 -320 620 -418 58 189 52
1341 52 143 -703 478 151 -170 79 -313 655 -93 307 444 68 424 -183 534 -209 10 -23 -268 162 -317
1362 -317 250 64 -338 176 -107 533 -381 -43 309 -533 364 -380 33 -85 -220 433 -360 -194 -255 450
1382 450 -158 -531 312 -352 -198 -288 -233 434 -496 436 -364 7 328 -41 573 -488 312 -97 172 433
1402 433 -489 567 187 23 -77 -166 417 -400 392 -315 269 181 -271 642 -316 -87 292 -32 114 -317
1422 -317 340 -206 -126 -151 -371 111 -407 418 -96 -315 192 -100 256 -309 90 48 -261 -29 -497 375 -86
1443 -86 -73 319 -278 222 -347 82 192 -92 188 -63 367 -239 153 296 -305 -85 44 154 -211 -61 187
1464 187 -19 59 -259 294 -21 109 491 -423 261 -117 -237 406 -250 -345 -53 230 25 -207 471 -49 3
1485 3 114 -32 320 -441 337 -390 -122 74 -58 232 -602 55 -21 314 -253 -540 713 9 -188 -20 -126
1506 -126 -17 -343 -42 -424 -10 123 -149 648 -282 255 485 -12 -8 -148 353 -33 -65 18 -59 268 -81 431
1528 431 52 -203 9 -42 61 -336 88 345 -503 -164 -418 269 -74 -298 -22 -128 149 -112 -72 147 -247
1549 -247 178 -214 323 -340 148 -53 -311 437 -84 38 -50 10 80 31 83 -76 -212 -65 53 121 -190 142
1571 142 -88 -161 537 -277 146 96 117 41 61 669 -159 663 -43 -18 119 -87 205 -297 -69 99 167 258 -199
1594 -199 539 -41 81 301 -64 344 -476 138 -106 -235 29 -149 -28 -287 -162 -39 -147 -91 -215 372
1614 372 -78 -291 138 -267 202 39 16 132 -40 269 -309 196 180 -199 126 -128 176 -209 146 89 -86
1635 -86 48 -189 32 -15 -75 125 -80 305 -148 442 -425 289 -75 -49 -34 -138 206 72 -292 437 106 77
1657 77 168 -214 -51 -573 -59 -86 -124 121 21 236 -429 -113 63 405 -173 -278 199 -154 261 -181 -262 -5
1679 -5 1 -17 101 64 14 -220 126 -10 47 69 -113 95 -176 302 135 206 80 -67 106 -340 145 -235 -151 50
1703 50 6 148 -81 43 158 -92 64 -399 387 -122 -201 94 61 269 -179 268 69 22 -38 -140 1 -143
1725 -143 192 106 -86 146 -35 323 3 -344 295 31 -46 -222 159 -6 -400 -149 -125 39 18 -214 27
1746 27 -161 0 40 77 18 -358 -1 113 524 -169 -240 -131 -168 689 -119 -50 -72 153 133 -217 -11 167 67
1769 67 -167 182 141 2 249 61 -42 24 -260 -26 211 34 -145 -6 -5 -30 62 236 -132 -70 -270 -17 -110
1792 -110 247 -122 41 45 -274 211 -40 134 32 -208 179 -30 37 109 -210 236 7 332 93 123 35 100
1814 100 -65 -159 -71 -141 -17 266 33 448 57 203 325 -194 -28 -147 176 -138 9 177 -252 186 78
1835 78 -249 14 -92 95 63 -136 124 310 33 -347 75 -260 29 70 -286 48 -113 137 127 -46 -69 -38
1857 -38 136 -335 -17 183 326 -103 -291 53 -172 303 119 -92 303 61 183 158 92 141 32 56 325 23
1879 23 131 159 35 -391 52 64 -352 -56 -265 262 -28 53 288 -50 372 154 90 -191 -35 -140 -101 -144
1901 -144 -142 164 43 -209 -19 -42 98 141 -77 87 154 90 -107 9 -100 257 195 -80 58 -218 260 -138
1923 -138 138 -177 -27 21 1 -32 -190 84 -45 -59 88 43 30 336 -47 39 27 -63 148 46 109 -438 140
1946 140 -97 -37 -20 -241 -180 -126 -8 -52 -23 -86 -189 -225 86 297 42 -291 100 95 -167 -259 104 72 -32 -115
1970 -115 -142 -11 -5 -28 161 -113 166 165 55 -4 -159 82 -336 -1 -154 -19 331 -83 116 -147 -38 -166
1992 -166 -128 84 -103 -169 247 -133 57 -160 176 7 -91 114 -21 223 -56 -24 31 79 -34 -292 -40 129
2014 129 341 117 -52 157 8 -85 154 -107 125 -98 201 121 73 15 -190 241 21 218 -64 -36 -58 7
2036 7 -314 76 -58 158 128 284 -105 41 4 -152 233 22 89 -19 -17 -123 72 -15 -132 -5 93 186 58
2059 58 -187 77 87 85 173 12 -20 -209 -105 -39 -29 -73 -130 -24 -415 55 -304 32 -45 -33 -7 -189 25 -25 -121
2084 -121 258 35 -42 -131 -162 204 27 186 170 121 94 -105 147 -109 169 181 94 33 188 -49 -42 -217 37 48
2108 48 272 -72 196 -258 131 235 251 -48 -109 195 75 -14 -22 -60 56 4 -110 136 -328 -141 62 53 144 160
2132 160 -55 72 -13 42 -71 52 -151 128 -13 30 251 -83 -58 6 43 -56 -37 230 -183 148 22 145 -130
2155 -130 -39 213 -265 105 146 255 41 -131 -300 -17 142 16 162 96 29 29 47 -106 117 -53 117 39 44
2178 44 -234 48 152 35 0 -70 -60 61 -193 200 -306 68 84 -173 -152 9 223 -137 -29 38 -158 210
2200 210 -110 -33 -126 -155 36 -209 -6 -314 10 -225 -35 33 28 47 -66 -129 -71 158 -101 67 169 41 16
2223 16 5 0 354 -250 -98 161 -107 143 -282 -13 -78 52 -139 -22 118 18 -301 -12 105 30 -148 269
2245 269 -94 71 -53 -264 216 -194 96 -16 66 -203 -199 171 142 93 29 -268 381 -192 -144 -233 -181 -70 -5
2268 -5 195 -98 76 231 -12 -296 -147 410 -254 -24 -38 -86 252 88 5 126 50 4 -214 -249 -339 110 -52
2291 -52 24 -204 -282 268 109 56 82 -160 135 60 -38 -100 95 153 -177 44 -47 35 -25 -14 106 205 1 165 -364
2316 -364 -289 -154 269 -205 -201 -55 -434 394 -65 365 767 538 -52 -293 -69 273 -58 -1 -325 430 373 19
2338 19 -59 -221 316 191 -47 -189 18 114 -97 202 -23 -285 160 78 -19 59 -81 225 94 -169 -20 -112
2360 -112 -40 -42 62 -128 -238 66 132 102 83 79 171 196 -84 -73 142 -42 -256 -355 108 89 120 -252 147 -207 83
2385 83 346 -70 106 230 164 143 -84 113 280 -180 -79 -378 80 194 -2 133 286 30 -89 -52 123
2406 123 -138 76 -131 116 -12 56 44 36 135 -145 -93 -116 -92 25 43 39 -183 140 -111 -194 56 -29 -21 -206 148
2431 148 128 93 -107 -28 51 90 122 -47 198 186 -31 156 74 125 -55 -42 -59 -112 -170 132 -140 -151 -125 138 -65
2456 -65 -246 135 -10 -130 -32 -42 212 -268 -57 -106 -110 -111 -7 -150 93 -84 -43 -237 -70 296 119 -171 135
2479 135 282 9 114 -82 -1 36 -24 -27 6 -33 -223 43 -224 -137 78 -241 -95 93 212 -109 -85 -171 29
2502 29 4 173 -8 138 -26 26 -41 -134 80 -166 -224 24 -54 -47 44 -61 231 -84 62 11 -327 -130 112 -89
2526 -89 -337 58 198 -57 94 236 91 -16 -126 -72 137 -87 -188 -145 -181 -220 -73 -69 -362 -17 -231 -63
2548 -63 31 52 -134 34 218 -18 157 59 -114 84 -103 -103 -135 119 74 -131 213 37 -238 121 -294 197 -277
2571 -277 38 -7 -24 -142 -268 55 -50 102 -232 -202 21 -152 -68 73 132 128 -88 28 22 -120 46 44 49 74 -65
2596 -65 -21 -137 -30 -104 56 96 3 -31 -294 -71 67 10 -326 259 80 -26 26 -107 20 -230 58 -53 107
2619 107 -74 -35 -54 -5 14 204 -16 -69 -44 180 -52 -150 189 -21 86 -269 -26 -59 -12 39 -31 75 -17 -66
2643 -66 -378 -77 148 -54 -229 49 118 -4 116 196 90 -85 227 176 -240 211 116 163 105 -29 95 73 91
2666 91 -460 117 171 -75 -152 -152 38 77 17 37 32 79 -153 -146 -62 116 -260 152 318 -281 -37 278 35 53 -165
2691 -165 174 115 126 297 -85 190 -305 -16 -106 -74 -204 -14 148 356 -35 161 -189 16 -30 -226 33 -154
2713 -154 -59 -68 186 -105 -142 5 -70 -343 247 -121 -10 14 76 50 233 -53 -184 213 -67 109 -6 -172 -28
2736 -28 181 84 229 -177 164 46 -92 -249 -55 86 262 181 -17 139 91 49 -1 -114 127 -134 18 -149
2758 -149 -113 -234 -267 -74 -178 -150 -167 -112 -79 -92 50 340 -102 -28 13 -84 -6 10 134 215 -355 -275 117 -5 4
2783 4 -135 142 13 4 -90 139 375 62 -55 26 67 -35 -79 64 24 -45 -6 -208 -86 -82 44 -25 -58 69 -24
2808 -24 -88 -15 -439 -22 51 -26 39 -126 28 30 203 -7 39 53 246 140 42 -43 -108 -84 -71 -57 75 -19 -178 162
2834 162 264 72 137 -88 -52 213 24 195 1 -108 -123 8 -18 -137 358 58 0 414 -120 203 -34 -19
2856 -19 78 180 -58 -46 163 -41 178 -37 310 -69 -21 -137 73 -188 110 -34 78 76 -178 105 -14 226
2878 226 -71 -18 84 -154 185 51 -160 32 112 284 48 -47 94 95 -125 -30 -78 -29 275 -43 -117 -23 10 -133
2902 -133 -27 -87 1 -92 -136 4 148 -18 -79 90 152 -47 -30 -121 39 -163 -16 -42 66 -38 20 178 -110
2925 -110 122 59 -3 -228 178 -129 169 -45 92 33 12 -38 60 197 46 28 -33 -254 113 245 83 87 343
2948 343 146 215 -46 -217 -96 -14 -243 8 37 -139 -10 -178 -157 31 -20 77 113 47 -32 -41 131 193 165 -54
2972 -54 19 54 -217 225 55 -232 104 -61 -128 -11 120 -13 -78 -245 -129 -6 75 17 -161 -95 135 -190 76
2995 76 -82 48 -30 -8 317 118 -11 95 25 -230 93 -137 -38 -23 -230 31 132 -94 152 -180 -92 -249
3017 -249 -262 -75 -83 -59 19 -3 -270 75 147 90 204 111 -28 58 42 -165 116 171 -69 180 62 20 -26 81 115
3042 115 173 -225 206 -47 276 100 -149 79 97 39 -117 -28 -95 -8 27 46 -132 15 109 415 -93 12 17 312
3066 312 -124 95 52 -253 92 -212 -88 -55 33 31 165 -14 -298 -85 -61 104 145 24 -313 55 17 50 55 156
3090 156 -74 60 -17 155 -92 207 277 -29 -23 -103 -424 12 238 -205 -73 96 -104 -146 -77 -80 -42 100 -259
3113 -259 -153 15 30 187 108 239 -46 23 52 -56 17 142 -78 275 -172 59 10 -288 149 27 -234 -45
3135 -45 -111 272 129 -8 86 61 76 -98 -4 112 15 -271 -221 -45 100 -120 -211 -284 89 87 173 -192 -84 285
3159 285 46 -61 -35 245 136 -9 49 -243 -152 7 104 143 -91 35 88 -128 44 -96 183 38 -22 -76 153
3182 153 101 -172 109 -18 -281 -282 -207 -230 55 28 49 130 -32 -39 -75 126 -346 -56 -63 -10 147 -27 -169 -63 25
3207 25 189 8 -316 -117 172 211 -94 -14 -19 -91 15 74 -42 -305 78 133 153 88 -128 -215 -67 -41 192 -111
3231 -111 -14 -137 46 -35 -114 120 -68 122 1 -37 -86 -221 -126 88 149 10 284 58 -99 -60 31 105 53 109
3255 109 -25 -130 -86 -60 -309 -122 -45 146 -96 -39 -5 -149 -183 -9 59 100 -218 138 93 147 1 -51 308 172
3279 172 2 107 -88 -65 -37 -107 -188 -183 81 37 -58 353 254 -18 68 8 -81 65 -48 27 212 -52 -291 -133
3303 -133 -69 25 46 -81 192 -147 -104 10 62 243 -205 145 -79 -210 102 215 309 -26 70 250 -9 -2 -90
3326 -90 -178 -216 173 -139 62 162 17 -232 -103 266 70 86 188 104 65 206 -24 138 47 94 -312 -13 55
3349 55 183 -80 -32 217 -57 99 1 -5 123 50 124 51 -117 -242 236 -166 45 172 138 -111 185 302 93
3372 93 -217 17 3 -89 80 -124 -149 -254 61 -95 -27 -116 206 -58 9 86 -161 60 94 147 53 -25 -33 31 2
3397 2 75 -130 -94 -44 -64 110 146 -100 -8 95 118 -23 -276 -57 377 92 -96 23 52 288 -130 -40 -113 152
3421 152 -113 -107 -268 -9 106 -125 59 -79 -155 -207 -128 1 130 -105 89 -148 -97 -112 402 111 106 -170 -239
3444 -239 137 -39 -15 -44 64 -200 -200 -97 153 119 -286 85 15 138 25 -235 12 51 134 229 128 146 -27
3467 -27 -20 -78 121 -239 155 -83 -215 -292 153 -147 -67 -28 106 -8 -51 151 -201 -113 -92 41 -1 -41 147 319
3491 319 -74 -49 -41 -97 320 215 -19 92 85 38 60 -56 39 -131 -13 41 3 254 49 34 -64 85 41 29 -37
3516 -37 67 98 58 65 155 213 104 -20 -26 6 154 303 -240 -240 225 -59 -146 -9 32 108 -229 67 -121 85 -58
3541 -58 -172 12 -51 1 11 167 143 -218 -83 156 -173 -299 119 27 237 -249 85 33 233 82 -158 181
3563 181 -53 -75 24 -4 -89 -72 -18 36 -205 2 82 222 71 -244 59 -117 234 36 101 -128 74 132 150 -153
3587 -153 -215 -72 -149 -92 -177 142 -82 -244 -32 -143 -129 17 -31 -81 171 25 -192 69 -249 -343 49 -24 -40
3610 -40 -115 -179 155 246 115 16 20 73 -56 -102 79 -130 -187 75 135 -26 137 160 216 -139 -107 15 154 -212 312
3635 312 57 -50 220 -107 233 167 113 -91 85 24 -204 56 19 -6 -265 60 -210 -140 151 297 108 -104
3657 -104 -19 26 210 -51 114 -133 297 -211 -158 93 -155 135 -42 76 -61 23 -108 -59 -285 -69 -53 -95
3679 -95 211 62 -156 13 45 -344 5 -201 -16 -53 146 -84 -235 373 -327 -15 -41 -319 116 -59 79
3700 79 -198 -33 192 7 2 -18 -82 123 -114 36 26 -225 -57 -95 183 -142 -69 -196 47 155 -106 177 -71
3723 -71 -212 257 -125 110 -76 64 209 -19 38 -95 44 -156 15 -18 60 20 12 -78 -136 -162 99 14 -66 77
3747 77 220 81 -193 50 -148 13 -263 -56 129 192 -61 67 209 -24 94 29 32 12 -17 18 -11 108 19
3770 19 -235 22 82 -160 -27 38 124 -57 -170 170 58 69 155 105 78 -79 24 -61 -87 33 165 -36 64
3793 64 166 -161 -161 263 236 -118 12 -49 -12 128 82 117 79 -157 -37 66 -30 -27 -51 -118 -23 48 7 -100 157 -111
3819 -111 -136 -20 103 43 -12 56 11 105 -83 -190 89 -18 272 20 -253 75 -229 -197 113 -154 34 160
3841 160 -11 60 -195 -181 -174 -102 -13 -186 -41 449 -28 191 -140 288 -116 -156 141 275 22 71 167 21 218
3864 218 100 13 -10 225 61 48 125 444 60 -111 179 -47 -207 78 23 109 355 51 251 250 293 -189 -172
3887 -172 122 -20 -8 85 -30 -157 76 203 -143 -112 -152 66 -294 -37 -51 47 11 -59 -75 -150 72 -16 212 -186
3911 -186 32 -20 -117 76 77 33 -201 -267 -20 -166 227 24 -267 93 50 -281 147 36 155 127 -45 145 -68
3934 -68 106 -84 -140 -186 -40 -109 -121 113 -174 135 -158 -179 -95 -39 2 -50 45 -104 -59 -67 -124 389 80 -40 -44 -64
3960 -64 -52 51 497 143 99 115 -5 -260 36 -150 -13 -147 -15 -239 114 -15 254 19 74 -142 -315 -109
3982 -109 -70 32 70 299 20 76 -40 -162 63 38 57 -42 -380 -272 155 -100 2 201 -103 166 -171 187
4004 187 -55 -260 -42 110 -54 -213 113 173 297 248 193 68 -66 130 -109 142 -38 -47 80 -162 29 37
4026 37 142 80 215 81 -63 -1 -6 15 25 55 71 -175 217 -64 124 118 69 231 -109 218 150 -11 -25 -64 -34
4051 -34 122 -222 126 -295 213 -213 126 -83 -127 -72 88 70 -91 201 51 -27 72 63 -29 288 236 -247 -153 -163
4075 -163 -39 42 66 70 -93 208 145 -39 -115 78 153 104 -277 -76 -95 -336 36 -29 -126 -238 34 -84 -31 41
4099 41 -28 -206 61 -126 452 375 -41 67 -65 44 -199 -64 -51 -161 247 22 102 -91 13 203 -228 269
4121 269 144 30 -11 266 62 -230 -10 188 7 80 64 93 -31 -111 163 89 -176 125 95 26 211 -129 191
4144 191 -41 -105 -159 -25 34 -113 222 -98 -69 120 214 6 165 49 -42 -203 228 231 -32 -110 185 -125 20
4167 20 152 39 -99 115 -2 -283 -6 -142 81 -57 47 -89 -78 -301 -43 -79 16 27 -111 -21 151 128
4189 128 -84 19 47 113 93 135 -150 91 -94 73 -29 60 -235 -139 -2 398 -44 -152 -87 -57 -80 81 324
4212 324 -60 -101 -318 70 68 -20 79 40 85 -130 -30 -360 -59 -126 -88 54 -187 -33 -191 -307 -178 -226 -255 -252
4236 -252 68 57 -209 -15 -62 -128 -105 -37 245 9 204 -82 -117 -47 -109 -125 83 215 -15 -124 -49 101 175 99
4260 99 132 246 -179 125 86 -93 -38 23 275 -122 -77 114 318 38 -74 112 34 77 41 -20 -128 -18 -20 171
4284 171 229 207 31 -124 482 -24 97 -51 143 284 71 85 8 240 -12 -37 190 82 -125 58 31 -45
4306 -45 247 -5 18 -242 -121 -136 -66 54 169 40 -196 33 -115 -121 93 60 64 29 19 24 93 -95 -13 249 -76
4331 -76 90 71 181 -30 -113 409 31 35 6 -47 -15 -261 37 228 -171 81 222 188 40 -10 -112 181 -276
4354 -276 25 53 -103 22 -218 136 194 -283 -108 36 60 217 94 261 -19 133 -20 102 110 -169 -311 -148
4376 -148 108 -46 93 229 -71 101 70 -87 -92 43 34 92 304 -203 -185 -27 209 -53 -71 -14 90 77 56 -174
4400 -174 -291 230 77 -22 72 11 -309 -242 -39 -160 -210 80 84 -16 39 58 226 113 -58 351 95 -64 -42
4423 -42 25 203 42 -120 246 -1 -115 -37 113 -60 -147 -69 -197 2 62 -19 -101 -56 226 -11 205 50 105
4446 105 89 -167 -37 44 -172 226 -125 -281 89 312 -67 -119 32 -119 -38 102 333 23 120 -108 3 -41
4468 -41 19 136 245 -233 25 101 169 1 74 -110 200 -52 -127 3 33 -123 -180 199 -55 -144 -44 232 99
4491 99 231 7 70 63 -180 -225 22 41 37 15 -57 150 123 23 41 51 -60 -178 -105 40 56 161 -54 28 63 -112
4517 -112 81 47 17 90 59 158 98 140 -46 30 -46 -34 33 64 -88 -79 -242 -61 -64 -222 4 -70 -330 -61 -111 -8
4543 -8 43 36 -239 145 -74 -23 192 -186 -199 97 42 -60 97 12 -307 64 -148 231 272 -42 65 150 -201 -59
4567 -59 -12 -216 237 -52 -381 -135 -33 -122 302 -3 -158 -27 0 81 149 50 157 198 50 -197 -104 -178 -194 -190
4591 -190 -203 -132 49 162 26 1 213 57 60 18 451 36 98 97 -236 47 -100 -36 -2 123 -195 -119 -6 110
4615 110 393 -144 43 51 309 -139 251 -165 -107 66 -273 -36 202 178 -343 -81 -131 197 54 -291 -301 -172
4637 -172 -22 57 187 74 -16 -104 -92 -55 185 37 -7 19 117 83 -104 -194 141 42 -62 -122 -9 -51 -49 149 -12
4662 -12 -86 77 180 33 23 -77 -150 205 -126 132 24 -161 170 -220 15 -71 3 26 -71 -51 -11 -51 -68 91
4686 91 113 395 -175 327 -49 -26 -111 182 -76 -300 56 335 5 -132 22 -148 -45 109 14 101 -184 -55
4708 -55 -35 -25 150 -44 84 -117 18 -176 103 -81 157 -196 -163 145 134 72 -52 248 149 57 -160 79 180
4731 180 -159 -139 12 -178 -156 29 -34 -226 308 79 -73 384 47 -139 -110 -51 96 45 106 -72 231 -124
4753 -124 109 211 -169 -102 -61 70 -231 246 -92 -49 -255 231 -122 -38 -127 88 69 -25 -221 77 -75 -80 54
4776 54 18 188 -153 375 -83 -27 -118 -219 -32 -110 9 -88 -133 64 216 -83 -166 52 -38 -97 15 123 -43
4799 -43 224 92 -163 -65 -381 -130 -41 -88 19 -254 -281 -216 60 -1 131 186 312 -137 -25 -259 -111 -117 199
4822 199 -64 -62 -81 -194 50 -141 43 294 -209 -47 -19 -67 88 60 -46 -175 -234 277 102 -174 -132 175 -74
4845 -74 -11 159 -57 -63 -141 2 -18 44 -19 -124 -45 28 47 11 -62 -78 -282 -54 169 -121 232 221 152 114 -77 71
4871 71 -93 -80 153 95 46 61 -86 -214 138 -180 -28 108 -104 -213 -260 -98 -157 -139 -134 -85 193 196 60 -110
4895 -110 -40 79 118 -238 100 -53 -113 16 181 145 -118 1 -48 -206 72 -104 73 -93 -68 -184 -44 -67
4917 -67 -222 -247 -161 -148 -39 220 15 -34 91 40 293 34 20 68 104 -387 -64 176 -105 71 210 -10 2
4940 2 170 122 109 -291 136 -113 287 40 -157 -178 -119 45 113 -283 120 -234 68 -73 24 46 72 -83 -303
4963 -303 -29 -56 197 -112 22 78 117 -86 258 245 60 -23 -93 30 251 -184 -79 -53 -66 -198 73 -16 106
4986 106 19 -32 -123 113 -236 4 58 66 -194 5 108 -105 -235 48 -66 -43 104 -108 -205 -252 48 -6 -46 -73
5010 -73 292 222 -76 -17 44 195 -41 78 -44 -83 134 31 38 -247 -189 61 -309 353 67 106 223 -131 -47
5033 -47 -216 -10 -7 -413 25 -74 -54 -51 -204 31 33 79 90 108 -16 -112 -352 188 24 294 -325 -202 -139 -315 -161
5058 -161 31 148 159 -67 119 -40 -85 266 -161 -21 102 95 86 11 -206 185 195 -78 3 -7 -143 151 -26
5081 -26 125 -265 -127 216 -74 -113 -375 419 118 39 33 32 -11 -21 -94 198 -92 139 -210 151 -158 -214 253 -107
5105 -107 2 20 26 -25 -113 -66 133 -68 119 16 264 -160 -206 127 28 46 -244 193 90 31 165 191 49 -42
5129 -42 -9 308 -26 274 30 234 52 -143 -57 -114 138 31 156 -10 -134 -1 -257 77 114 -4 119 341
5151 341 248 -253 5 -92 11 -148 102 317 -36 318 -196 -109 -102 -70 -47 -36 -66 129 -115 62 -19 -92 -52 27
5175 27 230 381 116 -126 358 1 103 126 128 -206 156 115 80 166 -159 28 87 -18 -136 -19 47 -78 -175
5198 -175 59 270 -58 119 -44 69 127 -130 47 -56 110 -101 -152 -162 97 42 92 126 -167 -255 -115 92
5220 92 94 0 -43 32 113 -117 -146 -60 -81 115 -27 151 -89 -200 190 61 134 -227 150 89 20 -69 -478 79 -26
5245 -26 84 -147 -166 -213 -136 -79 105 64 248 -37 99 111 50 -326 58 68 -46 -74 210 -224 -54 176 75
5268 75 104 57 117 148 -108 43 -150 307 272 34 1 -45 218 175 -115 -7 -94 -226 94 -143 -252 58 -233
5291 -233 203 -4 151 70 -13 46 42 236 -171 42 120 -67 16 139 -29 117 -70 82 -82 347 28 271
5313 271 8 -129 -52 -35 -283 36 211 171 -258 -16 8 20 -37 32 30 -72 -289 176 -200 -3 -10 -6 -13 89 -161
5338 -161 159 -14 148 -3 82 -36 -280 -106 -366 247 61 164 319 -32 95 -106 135 268 301 -77 -13
5359 -13 11 55 -17 -23 -198 -79 154 -194 194 160 279 150 136 -86 48 -52 -86 135 95 256 -47 229 74
5382 74 69 145 18 170 21 85 -5 8 184 -48 -444 129 -62 -215 182 -198 75 -107 50 269 -253 -342 63
5405 63 98 -105 -142 -260 103 -11 170 -246 83 143 138 76 -58 12 54 223 -91 -182 196 -102 19 6 -90 -203
5429 -203 125 86 66 -127 -275 -133 -244 -127 23 -59 -132 72 158 53 -50 -103 111 -101 -117 115 17 -1 15
5452 15 154 -267 62 59 -178 76 -87 101 -35 108 -153 184 180 80 -341 -131 -173 243 -135 -226 198 164 3
5475 3 22 56 -55 -170 -83 38 135 115 153 175 -187 -45 81 168 107 227 28 -234 70 73 166 -90 -12 63 -88
5500 -88 55 -24 -73 194 32 4 110 -44 -88 -141 89 -78 -277 -146 300 -34 57 284 -103 -118 -112 -141 211 -32
5524 -32 -158 137 -244 138 63 146 62 -118 -190 -136 -157 35 72 247 -267 -64 76 -180 -152 -22 -92 -66 -73 217
5548 217 -313 17 -128 -178 125 93 184 4 -155 -109 91 -110 27 67 46 -150 -68 -226 204 25 87 0 117
5571 117 141 -178 59 26 90 90 198 207 256 -151 173 -72 147 -383 59 -94 111 185 167 -205 94 -40 -135 66
5595 66 251 24 116 154 260 125 -98 -422 -164 -11 -46 248 -35 -48 409 204 223 84 247 -153 61 -59
5617 -59 142 255 -148 109 -100 190 -82 135 -72 -342 145 94 -99 117 154 18 -183 90 -15 -11 134 6
5639 6 136 279 -15 -117 168 -44 246 -297 93 -69 -3 55 -4 -21 -67 125 -132 70 22 -159 -54 -193 -267
5662 -267 80 2 -7 -54 57 -98 24 -35 -286 -108 28 -53 -7 160 -9 150 99 88 -302 -48 144 -3 102
5685 102 -288 35 121 -57 -98 -158 131 74 31 -33 -78 -33 -19 -56 15 92 122 -80 269 68 -21 -69 -125 -241 -224 45
5711 45 -190 55 10 233 -298 101 -67 -202 -172 109 111 -74 229 84 -20 130 -2 33 -165 89 -13 37
5733 37 128 18 -33 -133 -193 -59 125 -193 97 111 -10 -136 230 168 58 -147 -89 79 471 -91 -80 124 -146
5756 -146 162 -54 -37 102 -181 52 -15 149 67 75 282 102 -22 -48 -248 135 135 141 13 15 -5 -187 35 108 84
5781 84 51 -64 -39 -372 -44 244 113 91 -179 80 382 -195 20 173 5 98 47 51 -8 55 -210 -99 42
5804 42 -80 -62 273 15 -158 -296 -53 -78 -46 197 -82 121 6 126 154 48 19 207 -38 -54 -143 -126 94
5827 94 -27 234 31 101 -99 -3 230 -101 196 -61 206 -12 -105 18 65 36 -209 -7 -81 156 188 -97 -110
5850 -110 33 -155 -143 -272 -3 34 -55 -42 -21 -98 -3 -10 0 146 283 -49 55 -142 102 35 140 -104 -184 144
5874 144 -124 -147 -334 -221 43 344 -71 54 171 26 -150 -16 -124 72 -28 28 210 280 -99 143 -105
5895 -105 -101 233 78 267 -77 187 -16 -111 73 -136 -147 -204 174 167 320 -200 -65 289 126 -427 1 89 -306
5918 -306 289 101 -24 60 -100 -81 30 135 -41 -158 15 -323 250 -247 28 191 -19 -87 211 16 49
5939 49 -195 16 -182 -203 2 -148 329 -155 -79 -148 -103 -86 180 123 30 90 375 -20 92 -78 233 160 -109
5962 -109 276 -238 -188 137 -102 -113 116 -204 30 -295 -49 178 202 122 -9 -59 34 34 -126 -39 20 95 92 -7 311
5987 311 50 20 10 103 -109 128 -19 62 35 -237 -80 317 -19 68 27 -227 -88 45 105 -168 -68 -231 38
6010 38 -152 -158 244 21 -252 130 -119 -115 -41 38 -324 247 -18 -57 -141 34 -9 -244 -146 -172 67 101 -132 35
6034 35 25 31 -29 39 290 -81 76 153 70 -89 -128 13 -188 52 -10 230 -1 -50 -196 -92 -103 -35 184 47
6058 47 165 -130 -89 11 -13 134 174 177 -16 -298 168 75 372 -39 -168 294 -159 290 130 -202 -150 -189 123
6081 123 33 -57 -91 -34 197 31 2 -40 192 183 140 274 -109 -182 8 -49 11 55 119 -220 -114 -180 -41 109 26
6106 26 79 -128 -279 -83 -234 11 -126 -163 -116 154 -221 321 -68 83 193 -204 132 103 175 -57 73 215
6128 215 39 -221 -34 88 -19 -117 -120 254 24 283 108 -6 192 -247 -10 234 59 -52 -241 -174 101
6149 101 45 -47 -19 168 35 159 0 -100 -123 36 -92 -148 -227 4 190 -49 161 89 60 131 -85 95 -100
6172 -100 -206 -10 -125 191 -70 -302 -355 -116 -61 128 95 -114 114 72 -118 -277 78 6 -78 143 3 52
6194 52 -329 -74 -121 28 71 51 180 -24 52 40 -219 -68 5 -152 -91 146 -27 -118 -189 -37 230 28 0 77
6218 77 78 265 101 11 -74 87 60 -192 -259 -138 -164 -76 113 -66 -189 109 79 -210 220 -364 48 30 -17 -204
6242 -204 -113 189 -194 50 254 194 -241 1 -232 -114 -41 -9 -91 99 134 -46 144 3 -9 -11 74 -6 -8 177
6266 177 -75 87 18 24 44 -172 -2 117 18 215 23 153 -99 -85 -53 -34 -7 93 -135 -229 -94 -197 74
6289 74 -158 191 -76 -32 -1 1 -41 -78 115 58 79 -126 263 15 -47 74 -131 -9 -137 143 -11 -71 -83 137
6313 137 12 182 120 -4 -113 -24 -61 -181 -23 -27 59 -87 -22 -54 -46 -123 -295 285 22 -61 16 113 127 -11 -14 -133
6339 -133 21 -120 -1 -374 202 -43 85 -23 45 269 115 -216 97 27 20 -202 56 104 113 -97 182 170 -101
6362 -101 6 -16 35 252 33 -58 -176 29 -74 -98 132 107 -32 92 27 111 47 125 106 155 64 -91 135 102
6386 102 176 -92 141 -19 -78 -57 108 -130 -52 223 26 -343 151 -139 -160 -140 -183 -107 -213 -116 60 223 71
6409 71 170 120 -250 -24 64 -147 -166 40 -146 -194 127 -64 -198 -99 45 321 -40 182 71 112 144 -26 159
6432 159 -143 21 -120 -140 -5 -65 102 -105 -125 49 -317 -230 -34 -187 -26 11 41 -26 12 -107 -213 136 155
6455 155 46 -152 7 -4 10 -196 236 377 65 180 39 -58 47 -88 -131 -88 90 -425 -26 111 -40 -40
6477 -40 249 9 -98 130 252 -327 -22 -92 -72 215 -123 -126 192 284 -145 31 89 -154 284 -389 48 -123
6499 -123 34 -15 27 -50 294 67 120 -211 -110 144 175 -12 134 45 -88 -38 16 -210 158 -58 218 132 -108
6522 -108 50 40 217 -37 -80 2 96 -185 136 -53 146 211 89 3 132 -110 -222 297 166 49 -49 36 -249
6545 -249 266 -154 -72 -19 75 -24 165 48 31 -205 87 124 44 -128 73 -151 10 -81 45 55 -199 -171 108
6568 108 -100 168 55 43 175 80 -62 -124 139 46 20 -58 56 -114 30 221 -7 -4 281 307 -8 -65 66
6591 66 -4 48 244 92 323 107 -201 66 52 -71 78 -106 161 -9 -54 117 109 125 89 -62 16 -108 -95 -9
6615 -9 208 -285 60 -273 11 -46 -229 -14 -69 -158 -116 27 87 -14 -159 -34 9 40 256 25 -35 168 107 106
6639 106 -214 -48 -175 -223 -214 -115 110 -5 -244 -5 -340 -108 -249 75 232 -60 306 -153 201 -47 25 -99
6661 -99 99 180 7 87 -44 -286 148 -6 12 -75 -208 55 110 118 49 139 -48 -4 -43 -144 -35 153 -13 -167
6685 -167 -66 -33 131 2 -2 143 176 223 -229 197 86 246 327 -131 12 -319 3 79 -66 86 -101 61
6707 61 47 149 141 -28 40 120 137 97 56 234 227 63 65 100 -8 154 6 21 -144 8 -18 297 -51 89 55 174
6733 174 -151 162 123 73 -133 -78 -36 328 -15 -235 -189 101 88 -63 -18 135 322 -69 -296 -103 80 -50
6755 -50 18 37 37 -109 62 -56 -77 229 -26 -86 -95 -4 309 61 -49 -118 -33 -33 -49 -64 -88 -39 -52 193 315 -20
6781 -20 -157 -134 -30 -98 20 44 204 -330 -379 -165 59 -140 -158 46 242 19 153 -22 7 -181 -144 11 109
6804 109 -289 140 -160 59 -192 -97 42 15 153 -202 28 13 191 -149 15 -40 -3 165 30 96 6 -22 -42
6827 -42 -345 -150 -55 -188 28 -225 292 -72 -22 141 226 -352 66 79 134 64 -55 -134 -65 48 -147 16 -53
6850 -53 -95 62 -86 -26 160 -97 0 221 17 296 -70 32 -8 -38 188 -115 -99 -27 -102 -46 47 105 3 39
6874 39 42 -61 242 89 187 -354 -83 72 -15 -125 -190 -150 -33 271 -154 86 31 -9 -50 -61 -71 -216 -325 54
6898 54 92 203 -96 -71 96 11 110 246 95 15 -32 157 -188 25 -12 -66 -46 165 166 -74 -70 -14 107 -114 26
6923 26 -280 -198 116 2 -165 -64 144 -115 279 87 57 -44 151 -100 179 511 7 -42 -148 -74 -148 260
6945 260 -138 -302 229 -133 63 81 226 -380 -323 -210 238 40 4 96 -99 66 231 30 52 -24 -92 -46 -100
6968 -100 233 227 90 43 5 14 275 -33 119 -88 173 109 1 117 -200 -156 177 158 -25 -71 138 160 -73 -120
6992 -120 51 -198 -61 -32 193 109 48 168 -10 -42 -48 -29 -29 110 13 11 147 158 99 -251 -37 -264 42 45 -172
7017 -172 -66 44 31 111 -83 57 22 -361 40 -40 9 -280 -76 -62 -227 -126 191 110 282 -56 165 -300
7039 -300 200 -26 82 113 -53 -156 -33 170 56 23 228 64 -42 240 -66 61 -125 259 35 -2 271
7060 271 -38 127 -146 -56 143 11 -96 194 -144 -103 -62 121 -45 -18 52 -266 -77 290 -82 143 -14 -112
7082 -112 -175 -196 127 -5 259 -36 155 223 -76 -43 10 -338 -125 10 121 -136 -151 132 -172 24 -59 78
7104 78 -248 150 -214 -55 -45 -231 -43 33 -52 56 -45 -303 -64 94 -52 -241 60 90 6 113 44 -94
7126 -94 -233 -69 -152 169 170 145 12 86 -142 11 -128 85 -163 96 80 331 97 16 -5 -159 182 -71 129
7149 129 74 -67 157 139 -97 54 8 72 1 90 87 -101 240 -10 7 12 50 -119 65 -309 -130 32 255 -103
7173 -103 -59 1 -27 58 -47 -33 180 -49 157 -246 -166 149 167 132 -52 -21 -142 79 -116 117 -117 70 -292
7196 -292 53 142 128 -66 -87 -201 16 27 73 169 -9 216 102 24 -7 -22 -60 -93 -163 -62 -90 140 -63 150
7220 150 -74 133 -73 98 -334 -356 62 11 114 -166 -6 -157 44 -22 -76 146 -245 -37 232 141 23 148
7242 148 5 -68 -139 -57 18 335 -129 -255 85 -21 281 58 40 -99 -10 -132 207 40 -126 29 -66 132
7264 132 14 110 -193 -133 -73 86 -181 133 92 137 164 -105 50 -42 11 -141 -23 -121 -90 -93 -176 208 -139 -67 -6
7289 -6 -117 150 -93 -61 221 -50 134 -4 -21 275 147 -262 -410 -245 -46 176 -84 65 210 -127 29
7310 29 160 7 -253 -202 -172 23 -376 161 18 83 229 -122 6 48 -120 -52 38 97 23 82 91 162 -143 133
7334 133 -256 100 -208 267 113 37 57 -157 22 -91 20 236 -23 -22 113 56 114 131 55 -95 157 -195 129
7357 129 -43 -137 -31 -35 -96 90 270 242 -21 77 151 -57 263 6 -16 54 -126 -100 -55 99 -51 -40 -271 139
7381 139 290 204 -19 115 -102 95 118 92 -342 -160 -177 120 12 -39 112 56 -186 6 -29 28 -151 -144 46
7404 46 98 3 -41 -92 -122 48 -190 11 -204 -9 44 30 -191 -199 -304 120 46 146 361 41 -32 19 163 -119
7428 -119 -27 15 -247 -58 61 -35 -209 -126 -270 -23 200 216 -12 9 38 165 -13 -117 23 34 -155 -13 24
7451 24 -220 -181 -73 70 147 -84 82 -237 195 219 136 129 -7 -37 180 142 126 -8 -15 -6 -113 224 255 -70 10
7476 10 -91 12 25 -82 6 69 153 101 -205 73 -216 125 -244 16 -59 84 189 -236 114 -6 122 347
7498 347 -52 -143 -234 72 -71 -80 -45 24 -47 25 -141 -203 197 -115 237 -29 121 -151 -76 373 91 97 -205 -288
7522 -288 200 187 309 -126 -81 -140 85 14 295 268 16 190 -285 81 -46 -241 90 -191 58 -331 -122 60
7544 60 -68 -83 -4 112 -247 37 -184 -152 144 24 -35 30 20 42 -155 -42 134 86 75 181 -112 -3 -40 -390
7568 -390 -160 90 268 -131 -202 -126 -217 -32 166 -164 127 -160 30 -187 176 182 -8 -96 -7 211 -159 -257 -53
7591 -53 208 38 21 190 207 -312 85 -102 57 135 160 8 159 209 2 149 134 -170 194 42 75 -251 54
7614 54 -309 0 73 26 -39 -80 262 10 303 -134 160 251 149 196 16 -57 80 -112 -79 1 149 88 -117 -19
7638 -19 119 -11 -20 -207 -221 -23 141 35 -150 -17 -306 -87 314 203 -134 -172 -169 76 -267 94 -17 -208
7660 -208 -66 -71 207 -118 73 -269 -36 225 -66 76 220 20 0 101 -288 76 152 95 -108 37 -63 -63
7682 -63 -49 164 133 182 90 0 18 -43 54 17 -75 66 101 -172 15 -40 -116 -116 -96 2 67 -133 -38 -129 151 -172 27
7709 27 -185 172 113 -99 -168 -112 322 -107 14 68 29 -9 158 100 -125 245 101 -41 64 -94 96 -48 306
7732 306 -48 -4 -166 -348 -129 120 115 -8 48 233 110 -69 167 -316 -145 167 -12 37 171 65 179 -67
7754 -67 162 -202 -241 51 -95 -62 137 -83 42 -134 -227 -199 -21 242 -39 -86 51 255 13 41 146 96 3
7777 3 91 252 -176 138 145 88 -170 -148 -54 -234 29 94 0 -43 101 181 -100 -458 -238 -77 -3 -257 -12 -11 -109
7802 -109 99 -59 -62 350 -60 76 40 -225 -174 -201 -14 142 -218 -131 51 -197 89 -127 -46 -43 101 -102 -23
7825 -23 -87 -247 -14 -277 -28 -79 -167 176 -401 228 -92 209 55 -64 50 121 -284 -286 260 195 -51 -145 -57
7848 -57 -102 -23 99 263 31 119 271 -173 74 -49 143 75 62 -278 119 -270 -50 56 -17 -174 -253 122 87
7871 87 86 -63 54 131 158 -467 -113 73 147 145 -126 53 -91 -196 -281 -2 -184 79 247 107 12 75 -28 138
7895 138 256 -62 -169 -316 -534 -63 157 51 -8 188 35 -267 -113 -214 17 12 -41 -18 165 33 41 -283
7917 -283 89 -93 33 324 -234 109 -149 85 207 162 122 4 -22 -234 -5 -2 114 42 15 -240 -86 -24 2
7940 2 -377 -122 76 -143 178 90 56 -24 -67 -155 30 107 -45 -355 -17 44 39 58 -26 -68 18 -107 -138 -66 -86 111
7966 111 215 137 -219 87 6 35 89 29 -73 35 83 102 176 24 -107 -13 -96 36 69 -210 80 -91 6 191
7990 191 258 -15 7 172 50 0 -126 251 -80 -116 68 -10 196 -150 0 28 -36 -93 125 -269 -262 -316 -124 136
8014 136 18 -211 96 -69 11 154 56 -18 78 344 -139 78 -21 -41 446 88 -234 -84 150 -138 146 44
8036 44 157 29 47 -17 154 126 135 58 -268 -222 -71 251 17 -310 51 18 -6 154 159 108 -48 180 -109 -273
8060 -273 29 148 -139 -169 -187 -190 -52 -61 62 -57 -1 -185 -91 -71 30 15 -93 -202 -13 332 -35 -210 -248 100
8084 100 18 87 360 116 59 132 249 189 -66 -125 -281 -41 29 -52 -173 15 -162 13 148 153 48 87 67 -9
8108 -9 255 -43 12 211 -69 -204 -68 -212 -146 -248 -88 -44 147 -284 189 -148 69 179 188 207 5 48 47 148
8132 148 203 -106 -455 8 34 41 125 -134 -68 -266 32 18 97 -12 -110 117 147 142 75 -194 -24 231 -213 -134 -70
8157 -70 -145 -97 -48 44 -97 -136 79 -59 -16 -128 48 191 -6 177 82 13 -6 193 -218 34 -94 -35 -280 30
8181 30 96 -45 228 65 300 124 -73 -278 173 -90
8191i0
$$ Imaginary data points
##PAGE= N=2
##DATA TABLE= (X++(I..I)), XYDATA
0 0 0 0 0 0 0 0 0 0 0 0 0 3 -8 8 -8 8 -16 16 -24 24 -32 37 -40 48 -56 71 -80 95 -104 120 -140 160 -181 205
34 205 -232 261 -293 327 -365 408 -453 505 -559 620 -684 757 -835 920 -1014 1118 -1230 1355
52 1355 -1493 1650 -1822 2016 -2239 2495 -2791 3141 -3561 4078 -4727 5572 -6727 8399 -11044
67 -11044 15892 -27662 119791 102324 -45730 90920 -32768 2532 71904 9777 42298
78 42298 84823 -15078 24466 37424 -40032 33469 27314 -29133 36276 -8254 -11262 10515 -16882
91 -16882 -13642 7281 -11103 -31112 6368 -24119 -28053 18802 -32788 -13227 3711 -29966 -4011
104 -4011 1822 -31817 -7057 15311 -37323 567 6061 -38596 25327 -14107 -23975 29032 -19882
117 -19882 -4566 17492 -15434 -1882 20001 -10399 1975 17473 -19885 20538 4015 -22672
129 -22672 27909 -1680 -2850 15075 1015 4424 9090 5773 -3145 18158 -1781 -512 21104
142 21104 -16582 6048 17336 -5246 3636 8226 2790 1156 11302 -9032 11780 13549 -16078
155 -16078 20833 -4253 -11373 17278 -9849 -1527 4531 -5332 184 4761 -12843 454 16940
168 16940 -18116 7062 4548 -16407 14258 -7476 -5312 6739 -4774 -670 2362 -2148 -9775
181 -9775 12406 -2212 -6099 10656 -9298 8487 2068 -9587 6387 682 -2157 -3078 3656 -8811
195 -8811 2976 5918 -13238 10854 -6985 -2465 13275 -14081 -161 6328 -3901 -5617 1669
208 1669 -4234 -3059 7234 -14795 4744 2058 -12746 13710 -5844 -4800 6486 6 -800 -2855
222 -2855 1564 -1223 6985 -6971 -2146 11576 -10320 7293 4123 -3398 9256 1607 3539 1948
236 1948 3885 591 8286 3483 -9301 14714 -1652 -2450 9053 -6029 7136 3549 -965 2522
250 2522 3907 -777 720 8285 -9645 5691 3619 -8992 6799 -8855 488 5540 -7422 -1209
264 -1209 1527 5 -6030 3593 -5677 -3147 6076 -12388 3563 -4108 -10056 5913 -5920 -5783
278 -5783 -1049 2018 -5593 -1165 -346 -5660 9351 -8364 -2114 7274 -10349 3300 250 -4213
292 -4213 535 2257 77 -1698 3247 -5090 10164 1932 -7747 12944 -2291 -168 4425 -2854
306 -2854 3275 2572 1839 -1898 5348 -3615 2078 10256 -9100 7176 4946 -2956 5125 -4359 1401
321 1401 3024 295 -4115 2792 497 -7152 8090 -6167 -1541 7378 -5974 4379 -2893 -4374
335 -4374 3550 501 -4645 -2011 4854 -7605 1578 -1375 -6965 8431 -5310 624 3846 -5242
349 -5242 1746 1557 -560 -3891 5257 -1313 -1963 2449 -8663 7307 564 -6251 6615 -1053 -182
364 -182 894 1476 -2367 1987 2695 -3812 5144 -7602 10 6671 -9391 2313 994 -785 927
379 927 -1500 -679 549 3380 -4814 4471 -868 -6588 8027 -5827 -2034 2432 -2096 2349 -2082
394 -2082 -1097 -142 5059 -3016 -344 6898 -5998 4526 174 -3692 4592 -2095 1723 511 -706
409 -706 -856 3998 1991 -4573 7187 -1224 1404 3636 -5847 5950 -101 -2349 1960 -535 -1294
424 -1294 -254 3348 -5293 2868 1608 -2915 5511 -6880 1067 3936 -4677 -486 -685 193 -3171
439 -3171 330 -2893 -1901 2725 -5357 4147 -2724 -3946 5460 -3267 -961 -1139 326 -390 -1515 -1561
455 -1561 -2819 4644 -5285 -54 4312 -5694 4747 394 -1571 1335 168 1782 695 1067 -3669
470 -3669 5216 643 -5066 5700 -2573 2234 2400 -2534 3746 428 1623 1153 1674 -2003 1023 4442
486 4442 -5779 2889 -994 -1200 4654 -5196 1443 2354 -556 -1262 1009 500 -3314 4283 -3187 -1670
502 -1670 1759 -4789 3027 -3261 -3264 1906 220 -1845 -2333 2765 -2439 1592 -808 -2882 4597 -4937
518 -4937 1137 1328 -4904 2345 786 -50 -1165 1847 347 1587 1809 -4264 5875 207 -2528 4202
534 4202 -2385 1224 509 309 -139 -460 1625 -1133 3239 -3180 1360 4405 -3468 2167 -1908 313
550 313 764 -2833 92 -737 1012 -2873 1543 -1017 -3593 5040 -2941 129 583 -2527 2766 -1764
566 -1764 -2092 -255 2304 -2620 -1704 2316 -3913 3542 -194 -728 3929 -2619 3016 1055 -1161 763
582 763 1256 1592 -2070 1829 -1160 2216 1002 -3135 5016 -539 70 2316 -1098 662 359 2878
598 2878 -2017 488 464 -1898 2790 -5363 -136 2330 -2147 300 -1447 413 -1147 611 -1301 -1352
614 -1352 773 -3645 2654 -2995 -3383 2776 -2695 634 -1741 -1346 1424 -814 -925 -845 2961 -2140
630 -2140 752 1474 -3486 2813 -1357 440 466 -1449 2262 108 1382 -1325 2681 2722 -1675 2462
646 2462 -789 1983 495 -1054 2622 -777 1500 724 665 -972 -164 3218 -1592 2190 -955 515
662 515 3443 -3742 1280 406 -1297 -515 -887 -289 -2204 1566 -1268 70 -83 -2063 3196 -2363 -969
679 -969 438 -1022 854 -2907 24 -456 -519 -748 -1215 1456 -2193 1570 451 -1932 1673 -612 1421
696 1421 -712 -1072 489 465 317 -2966 2840 -208 -667 2363 -2179 1863 369 78 1439 -790 648
713 648 295 1574 -2335 663 1392 -1172 1771 -2598 1233 2112 -2048 1667 -437 202 63 857 -618
730 -618 -1398 1914 -2207 1051 -1241 -1589 2836 -1479 -137 -60 706 303 -387 1180 -1651 1649 -843
747 -843 -682 1382 -3333 1927 349 -1099 201 -128 1648 -489 769 -517 1878 837 -2195 2874
763 2874 -1734 -119 1241 -1754 816 -470 885 -82 36 -598 372 2192 -2715 808 760 -1160 980
780 980 -2521 159 -450 -779 -80 -752 76 -1799 2089 -1412 -1288 1482 -1656 1123 -1539 -1425 1291
797 1291 -722 -523 -829 1305 -1360 679 1122 -1771 2369 -470 1347 1354 -1530 1703 977 427 -748
814 -748 1063 1073 -398 1562 -1308 2582 665 -621 2791 -925 1051 932 391 77 -705 1483 -776
831 -776 763 -1684 -34 2016 -2292 671 -299 -523 425 -614 -120 -1196 861 -1242 -284 -729 -2634
848 -2634 1646 -1565 -1381 266 -1213 894 -1422 -224 -464 438 -504 -990 1247 -2210 631 243 -1356
865 -1356 913 -974 1093 204 -802 425 568 1509 -1126 1663 118 236 1369 -1024 1200 -290
881 -290 34 999 -586 431 205 1573 -575 173 1467 -381 1417 -1646 305 1062 -898 670 -459
898 -459 50 -365 453 234 -1203 974 -675 971 -626 -1191 1565 -910 -262 -800 -333 299 -943 346
916 346 -1007 604 -127 -28 1292 -1836 1210 309 -395 -36 -656 1331 -677 9 -1021 292 686 -1515
934 -1515 1357 -788 246 639 -512 898 -1077 653 233 -424 -256 -422 1147 -1450 164 -186 -505
951 -505 1260 -1358 540 284 -108 264 -602 134 -1265 1049 -433 -1048 508 -754 1587 -1139 -491
968 -491 989 -458 576 -628 722 -110 64 618 -1061 608 -964 1054 311 -1357 1010 -53
984 -53 692 -202 145 816 -99 650 -1082 724 206 -535 1153 -1070 120 -76 373 388 -848 1012 44
1003 44 496 -618 133 1278 -1222 533 -902 -243 157 -1171 535 -844 -295 38 374 -447 -1259 1199
1021 1199 -767 -26 -362 -748 958 -1105 -142 -131 -304 92 -717 884 -908 500 617 -385 555 -1000
1039 -1000 1052 339 -780 498 -161 576 -592 747 88 484 1021 -454 1431 -218 654 1606 -717
1056 -717 407 -102 779 29 -481 348 -135 1104 -1231 230 515 -447 689 -621 395 -448 -186 428
1074 428 -1143 -236 -480 412 -694 -1128 926 -1016 401 -686 -237 707 -460 169 -499 427 -534 24
1092 24 506 -1351 536 -47 35 229 -743 968 -134 229 -413 153 826 -559 775 -309 397 329 -207
1111 -207 963 -1234 149 515 -230 291 -253 950 -421 -39 -334 -249 827 -1484 544 -117 -647 382
1129 382 -331 9 -417 331 170 -333 199 -612 859 -633 -331 358 -595 522 -452 234 -61 -368 384
1148 384 -551 486 -742 683 338 -1273 490 -94 685 96 -323 -16 26 323 -737 645 168 -252
1166 -252 1227 -633 429 55 159 795 -698 379 -278 44 -278 -301 547 -481 452 -520 -2 552
1184 552 -776 748 -493 -352 -146 36 -264 -1204 522 -484 64 -20 -574 893 -113 -32 -110 -206 298
1203 298 -452 741 -457 -117 284 -224 216 -1073 980 47 -300 426 -230 993 -79 229 72 -131
1221 -131 303 -437 834 -817 159 816 -407 539 -251 677 267 226 85 -113 705 -628 53 244 -569
1240 -569 468 -584 430 -164 -234 313 -269 37 -449 290 -223 -791 469 -426 353 -434 -424 85 -599
1259 -599 72 -207 27 -411 49 298 -516 288 -114 264 252 -679 487 3 29 -81 424 346 -183 568 -21
1280 -21 646 595 -13 939 -525 -61 366 -36 99 -45 289 -189 -48 2 -213 451 -590 371 -90 -451
1300 -451 55 -70 98 -475 175 188 -446 -151 -449 539 -608 -405 60 -376 525 -246 -164 -271 -353 398 86
1321 86 19 -617 54 313 -685 190 -493 518 110 -180 390 -58 255 -169 400 121 -263 728 -18 170
1341 170 45 296 767 -468 407 -161 397 73 -549 515 -314 125 -398 131 -89 -703 77 -183 -279 -36
1361 -36 222 180 -386 -159 -153 175 -308 -606 490 -450 -238 -322 -544 371 -224 372 -75 -177 115 305 512
1382 512 -644 504 217 -121 261 -231 504 -56 -171 61 -32 547 -155 447 -184 57 271 -137 348 -500
1402 -500 281 417 -116 -244 -273 570 45 48 75 -477 143 -410 24 -179 -616 100 -193 -100 -483 -54 174 -394
1424 -394 294 -180 230 -281 -522 467 -317 158 -276 -203 -107 -80 468 -226 -127 -197 184 614 -275 220 184 207
1446 207 6 6 452 -346 417 -146 70 136 -247 511 -329 274 278 178 254 -525 345 142 -45 -248 142 436
1468 436 -321 50 -63 -544 143 -111 348 -1 -60 401 -30 -21 -379 121 -99 37 -186 -494 -132 -290 -236
1489 -236 112 -21 -25 -229 274 -203 -71 507 -360 242 -334 235 46 -388 340 -162 172 -58 273 110 -148
1510 -148 657 -291 217 -101 -153 472 -167 268 -190 163 116 -110 149 241 116 -60 -87 141 -72 258 -93
1531 -93 57 -257 -242 222 -357 20 -165 191 -364 -487 392 -9 25 -18 -112 170 20 175 -13 -46 -168 -144
1553 -144 396 -384 179 160 43 58 -136 229 338 87 -2 -52 279 -2 429 -183 -3 79 60 326 -237 252
1575 252 59 -297 223 -222 330 -147 1 31 -307 153 -259 217 -183 19 216 -95 -68 -427 -144 83 -128
1596 -128 58 -340 111 -198 -173 -57 -319 11 -281 -103 -47 -236 95 80 -122 -337 -50 233 -412 -20 -219
1617 -219 85 -37 -252 387 -89 20 -84 -69 63 -1 366 -274 247 5 24 261 -317 -23 26 60 84 -19
1639 -19 120 290 164 244 -124 211 -33 303 17 -42 -9 -350 255 -308 319 53 -151 311 -179 0 -172
1660 -172 124 55 19 126 -153 -47 -87 -215 45 -217 121 -277 51 124 -246 108 -49 67 227 -101 -134 -44
1682 -44 -12 -398 178 -143 -7 238 14 120 -153 312 30 -60 194 -129 -104 200 52 -59 -21 153 -299 39
1704 39 -20 -264 398 -135 -184 101 40 -348 -59 198 -284 -151 173 -470 60 -216 232 -66 -131 -72 -230 247
1726 247 -151 -194 78 -27 -39 -61 193 -137 271 339 -374 255 89 77 183 59 -79 185 322 -150 -167 168
1748 168 -99 39 -44 -57 39 17 17 212 159 -156 -7 153 -282 -244 1 177 -287 7 332 -89 -83 -331 133
1771 133 37 110 -33 -140 49 -113 77 -65 -218 -182 -120 -29 -123 -147 341 -107 128 -44 371 -158 -340 -28
1793 -28 -68 13 -226 51 148 -266 -86 93 82 17 261 130 -74 178 -122 -132 -226 43 232 -97 -186 -91 -201
1816 -201 146 -9 214 -335 -83 -114 135 45 -85 -70 96 11 -181 -373 -10 -121 -85 -80 -213 -221 -126 157 124 -284
1840 -284 97 0 -40 -123 -37 121 -148 82 -22 -20 19 -37 180 261 54 71 -18 -172 -204 -35 36 127 11 17 171
1865 171 -209 343 4 95 25 -101 196 -271 -107 206 -20 18 -101 93 -546 -86 -64 -26 223 -168 201 -208
1887 -208 107 185 -148 -289 -203 6 35 -42 -158 -243 143 86 111 143 45 102 -225 41 -145 166 187 -66 248 -39
1911 -39 52 45 24 -85 -20 24 117 143 26 -26 -27 -145 -105 83 68 24 -191 142 -96 79 202 -517 44 -92 -37
1936 -37 -43 -34 -70 -3 -47 -70 156 -11 -263 -70 -108 -47 -259 141 -52 -91 50 -89 184 -182 144 170 -6 0 36
1961 36 -120 22 -103 223 -125 228 -47 -178 124 15 144 192 78 13 -98 342 -116 -122 -41 -27 205 -67
1983 -67 -218 -104 279 137 -140 -82 -47 3 64 -1 -42 81 -246 -7 16 164 55 -353 67 -119 -30 -209 146
2006 146 -1 133 -124 -85 -69 -346 51 57 -79 -459 -132 361 -239 131 162 -41 237 214 211 118 109 -115 189 -44
2030 -44 -62 -302 -59 150 -48 -25 89 21 363 91 -122 -22 136 40 -120 36 -50 18 -21 -266 161 -43 -45
2053 -45 -233 -73 137 53 25 -320 -86 55 -153 99 -43 -43 164 28 155 -128 3 103 40 -163 99 116
2075 116 -54 173 -212 -339 131 -150 256 -26 55 111 -227 126 70 -115 -116 113 92 -78 35 -170 127 143
2097 143 114 222 -35 64 -56 -24 125 -118 -102 28 -75 107 16 -70 -55 -50 -230 32 243 -216 -17 -17 -109 -208
2121 -208 17 73 -319 -68 -114 263 -48 -75 120 -186 150 211 41 -102 -143 137 -55 -81 26 176 55 -210
2143 -210 209 -144 -20 12 112 262 -155 90 -109 74 69 -171 -16 -126 -154 -114 67 -284 -299 136 -51 178
2165 178 -209 -249 -27 100 48 104 223 -145 -24 -149 36 -135 211 147 31 292 177 -104 -194 177 -30 83
2187 83 -80 -51 -209 275 -157 -208 -38 12 269 46 37 -129 -341 -144 275 -34 -396 197 42 -46 258 54
2209 54 -70 -68 126 167 -135 -149 23 108 88 -14 -110 -45 -416 132 -180 80 -85 14 68 -391 -302 83 -30 -123
2233 -123 88 90 -325 -33 -6 -4 125 -47 80 42 -71 83 -122 238 41 41 -78 62 -80 146 374 -136 -82
2256 -82 -123 41 190 44 363 44 -121 -5 -260 -158 -45 174 11 -35 -31 19 70 263 510 -61 157 60 -102
2279 -102 -31 272 58 104 -432 18 131 -196 -102 185 211 80 250 -157 -107 180 -78 -130 -98 -26 103 -182 -9
2302 -9 -157 3 -42 236 224 -189 58 -146 38 61 -148 339 -88 -439 -180 181 -342 -140 -243 -35 12 702
2324 702 319 35 -107 -271 -273 208 119 129 112 -310 -150 -479 -64 6 -161 254 188 -286 -199 73 575 -120 -133
2347 -133 -6 16 -411 -23 -229 -150 195 -89 301 -147 -338 -87 -55 -247 222 250 66 -208 170 139 126 -159
2369 -159 -22 -295 104 -138 82 -47 83 -29 104 206 -122 -54 -234 -228 -189 -63 14 -187 154 172 156 45
2391 45 3 123 5 121 -313 -42 -207 -62 110 51 -26 277 18 73 193 406 156 -55 -299 -97 -21 -69
2413 -69 269 -164 -122 -7 -327 149 -46 -145 -87 -52 247 -115 -77 213 -185 -200 94 35 -83 -293 -99 -91 -100 -100 1
2438 1 -81 89 112 -141 53 44 -43 50 -74 217 107 136 -220 -88 -259 -261 44 128 235 -5 334 134 34 -59
2462 -59 71 5 223 20 136 -103 -236 -159 84 -296 -323 10 -32 -2 -292 157 120 400 -18 10 166 -117 1
2485 1 110 -110 -164 -71 -231 -4 185 -137 83 -133 146 231 45 11 -138 -15 207 -420 -15 68 163 -312 -15
2508 -15 -46 53 -372 7 -108 -28 0 85 153 3 119 -8 -35 9 13 182 -331 35 -159 -188 -46 -46 143 -216 -94
2533 -94 217 111 -162 129 32 -53 44 212 118 98 -135 131 102 -94 -181 -129 207 87 -116 16 -28 63 28 151
2557 151 -28 -110 40 79 135 -88 -33 363 -76 -4 -86 121 110 38 -44 -143 308 191 -60 37 -50 124 6 -337
2581 -337 -48 -163 371 -222 -33 -153 236 -87 -69 -216 -169 148 5 69 -276 12 -57 -163 -121 -161 75 -131
2603 -131 -74 378 78 15 157 55 -133 200 -48 -108 -275 275 -132 57 -90 11 -136 -204 -2 63 -9 215
2625 215 277 2 206 -160 15 62 -80 -44 338 92 150 212 3 -290 113 24 -6 230 233 -61 -164 -48 -230
2648 -230 223 28 86 -84 23 96 -48 5 54 -51 116 232 47 -93 28 -19 -102 -284 -162 65 -67 37
2670 37 -87 -87 209 -235 -57 31 -373 -51 -159 15 341 -176 246 -111 -91 -36 -33 132 -193 -3 -8 17 37 -141
2694 -141 -11 -152 200 115 -147 130 47 -182 119 75 -51 25 38 229 107 -21 21 -122 136 -31 -54 -283
2716 -283 205 -45 1 -27 111 137 -210 55 -194 88 192 -165 200 71 -56 55 201 320 -117 35 -236
2737 -236 -7 239 -127 3 -26 -166 157 121 -24 -93 45 -306 157 27 109 -195 -11 121 10 -152 130
2758 130 -74 -93 129 -121 -110 180 -172 155 141 -28 205 15 -154 35 -3 -133 -170 30 262 -150 -231 60
2780 60 -239 163 83 -140 -62 -108 -101 -365 30 14 114 -114 122 177 210 -68 18 -93 198 -16 -25 1 -47 0 -324
2805 -324 -97 66 -174 42 71 -70 -27 113 84 -127 169 -20 -12 224 -60 107 103 122 178 27 -148 -111 -89 53
2829 53 65 89 37 -81 -121 168 101 71 82 -95 61 208 -12 195 163 -141 229 34 2 52 121 -120 84 125
2853 125 -60 246 -39 -24 -266 -396 -294 21 -223 -93 -13 -49 -189 63 -87 -313 79 -274 276 5 64
2874 64 -194 -179 -105 89 -127 159 -58 -137 -50 -218 20 -86 -70 -263 -221 31 -437 -208 -212 4 185 -63 -226
2897 -226 -252 -53 -187 -29 -163 -239 -2 68 -138 -443 -101 -175 -17 52 -71 -166 -29 251 -160 -212 -97 25
2919 25 -76 -163 -88 297 -5 158 156 299 -95 46 14 54 43 -322 131 51 76 -323 -306 124 -21 -4 -144 -147 -244
2944 -244 -85 -72 -77 -206 -114 148 -274 -116 120 69 -217 80 -26 -7 118 -150 11 -366 -217 24 89 -367
2966 -367 -154 -70 -213 195 -1 33 -103 96 -112 -73 -54 58 -109 209 33 -22 168 87 -69 41 -118 -191
2988 -191 188 256 -27 49 54 -28 -286 -227 57 58 -150 91 -28 91 -166 -107 183 99 -192 -139 -2 144 103 5
3012 5 -192 -6 170 61 -118 -252 -130 -254 -36 -314 152 126 23 -21 -30 42 90 -170 142 54 -8 1 91 -44
3036 -44 -151 163 21 58 -114 -85 61 -24 18 -203 -182 -35 -98 -214 7 185 187 -239 -213 75 186 -137 -212 44
3060 44 -88 -81 -233 -249 87 -99 -39 -100 75 -26 138 156 56 -108 18 -6 -88 82 -7 -25 -218 -72 -375 79
3084 79 56 -3 -182 86 -63 90 -180 -103 -56 186 18 169 200 -32 -200 86 98 69 -139 225 -189 -111 -57
3107 -57 274 -184 -36 182 -137 78 17 -69 93 165 -172 -45 232 177 -20 115 -125 -261 232 158 -76 207
3129 207 -32 68 -8 155 183 -121 61 70 226 163 237 163 94 -11 -56 213 47 15 -83 -211 -62 -150 -159 203 -27
3154 -27 114 35 -277 34 -153 -114 -195 -72 100 -130 182 179 25 88 -82 -93 145 -11 -87 -19 -17 -124 225 101
3178 101 -20 -68 -354 168 60 -239 -145 -358 -95 -85 -267 -106 -61 -255 62 -50 19 -34 -11 418 214 193 110
3201 110 37 35 -59 -86 -154 -171 37 45 -34 -66 6 74 32 153 -153 107 139 188 2 47 170 -229 112 -99 325 167
3227 167 -89 -38 -128 -64 -115 40 7 112 81 20 -65 131 -32 -56 -219 128 -37 -159 231 -97 -133 31 -86
3250 -86 -1 59 -157 -76 139 60 314 -142 218 51 137 169 -17 221 -114 -126 28 4 -48 71 2 88 82 -62 -69
3275 -69 -237 -83 108 -4 100 63 -17 105 51 40 -17 237 -81 473 312 -114 -47 -89 -229 131 76 58 -53
3298 -53 6 -149 246 -166 -180 -90 -161 113 -116 196 -93 132 49 75 -109 46 -234 -105 -321 -128 16 -44 -81
3321 -81 -75 51 138 273 21 24 11 15 96 31 56 17 -117 199 -60 -26 -56 -312 -49 -189 172 -45 419 9 -90
3346 -90 3 -40 -111 -93 -219 91 -46 64 46 195 -2 91 85 40 149 238 57 57 -121 31 -191 -62 140 -177
3370 -177 -115 44 46 -61 53 -240 -169 -185 -352 79 -136 -133 210 191 165 85 46 -186 -90 2 152 27 167 -7
3394 -7 70 6 -155 112 110 72 -87 61 -50 154 -92 -36 98 -30 -73 -309 -40 38 -144 -208 -230 -77 -95 -327
3418 -327 239 133 -106 258 113 -248 22 -152 -370 127 47 120 -267 -106 140 -70 -120 -262 36 15 -11 -26
3440 -26 71 70 -106 -154 -41 27 158 -5 -36 16 -31 107 -141 -76 -65 -263 -68 277 -86 -319 0 -92 -96 -134 151
3465 151 -66 0 8 -65 83 22 117 -157 -34 9 135 63 -1 142 -105 64 134 135 -70 -37 -111 22 173 -281 25
3490 25 -222 123 -3 239 -151 87 -200 -123 -28 162 -59 -5 48 -98 21 159 27 -86 25 -242 315 35
3512 35 154 153 -166 57 -105 -89 -111 -70 56 103 -124 108 16 -38 -23 438 14 -187 -22 113 147 19 -65 -108
3536 -108 -43 -195 112 -137 40 100 0 -162 -230 -154 -68 -297 146 -8 -78 -8 39 -30 32 35 -93 -354 -55 151
3560 151 -135 -46 -157 -116 112 24 -147 164 57 33 -381 -120 130 23 102 89 181 -22 -103 -75 -23 172 219 212
3584 212 192 56 -54 272 -22 126 155 -52 -145 56 238 64 -62 -189 33 14 -31 68 119 99 -57 3 29
3607 29 -14 45 -77 44 46 164 185 89 144 -164 30 -10 -28 223 144 -286 143 38 -75 1 88 28 -34 -201 -156
3632 -156 71 -266 -117 -16 18 179 -336 -31 282 -56 2 22 124 62 -107 21 100 -61 -130 -120 93 159 -204
3655 -204 69 137 0 205 163 130 -164 68 -98 312 125 -11 90 26 -15 75 -44 -53 -91 134 -87 -54 12 42
3679 42 -50 -211 14 -160 -25 -27 84 -181 6 37 23 -67 -11 -138 -145 -82 -61 -22 -134 189 159 -214 -77 171 -55
3704 -55 61 -14 -155 54 -235 -342 211 -106 -175 134 150 10 -374 -27 -23 -143 25 152 -20 240 -110 -120
3726 -120 -105 358 91 152 -134 -112 -295 -70 -84 -203 5 54 26 -20 -132 -9 -13 -66 -236 -8 -76 4 312 129
3750 129 -110 49 71 46 182 101 51 4 -33 -67 165 -115 113 -331 -12 99 77 -252 -40 60 25 -98 105
3773 105 -42 54 149 49 -129 23 -66 -145 -145 -9 -318 32 -68 59 18 -80 55 10 -28 -90 49 207 -62 -32
3797 -32 -97 86 26 -98 127 10 198 -257 -165 -3 136 -163 -189 203 -467 -478 187 -10 -404 -256 51 176
3819 176 -222 213 4 36 135 69 56 -166 -225 167 -172 0 93 56 7 126 144 -111 -11 -76 80 -227 240
3842 240 38 30 -150 -248 -108 176 206 149 153 142 -387 -95 -25 39 -119 -188 39 -344 -76 -15 162 -89 -111 -7
3866 -7 10 -109 -25 71 -132 -34 52 -242 -105 31 91 150 27 72 -92 145 97 177 -243 217 -175 -179 -159 -237 106
3891 106 -64 23 -254 138 -268 -131 122 -101 144 -65 134 -141 23 214 -178 -50 -233 -28 35 121 173
3912 173 -213 -11 -146 -1 117 186 192 -17 -56 -224 22 18 244 -235 192 234 254 121 186 73 -33 101 -252
3935 -252 -359 103 22 -199 -20 84 -123 -275 119 143 -103 -1 -13 -74 235 -120 72 165 31 -74 79 -50
3957 -50 -161 72 -141 -35 21 142 -27 191 -27 -139 115 68 132 -50 -245 265 85 121 59 -289 -55 161
3979 161 -21 38 64 92 165 35 396 418 -125 -207 125 -150 -13 122 270 67 193 3 38 -12 65 54 -129
4002 -129 92 25 7 165 -293 22 -78 -323 -54 100 -23 145 99 -88 149 190 -224 -105 -145 -108 -50 -28 -176
4025 -176 -10 151 137 -262 -183 -130 -310 -30 5 -6 195 -255 -57 -154 -220 173 303 425 41 -93 68 -13 112
4048 112 60 188 1 -87 91 275 -261 -115 -167 -2 194 -90 46 -213 -143 57 -148 -75 115 31 122 -302
4070 -302 -135 24 -229 -93 -143 70 212 5 117 112 -38 213 -97 34 36 88 0 16 -138 68 53 97 -27
4093 -27 -105 -94 -126 -78 113 20 77 203 133 -227 -52 58 50 -74 117 215 84 -244 -129 -62 -5 -60 -85 -64 -66 100
4119 100 113 62 -64 186 -68 -174 -157 -61 158 -43 -89 -191 66 -215 -83 17 149 -127 67 67 59 115 6
4142 6 -61 237 -117 -237 131 -80 42 200 -87 132 91 79 72 234 -34 -87 -152 222 -194 -50 -215 51 165
4165 165 16 108 18 -122 -13 142 -83 -194 184 -86 -98 -154 198 41 74 129 -52 43 23 -135 61 -62 20
4188 20 -21 140 30 66 -83 235 103 -110 -152 -39 172 98 -8 -41 -96 145 25 -121 89 38 -129 -198 147
4211 147 143 -325 103 -10 -323 -322 -67 289 -107 -187 139 -47 -234 123 -57 -159 73 -61 136 -180 116 -21
4233 -21 -80 42 195 284 -34 120 -129 -124 262 51 -98 171 46 20 -113 92 283 -203 41 48 20 -107 319
4256 319 10 40 -114 319 -20 140 1 42 -202 -130 -51 27 137 -79 56 351 -17 -43 44 137 13 -27 -44
4279 -44 -193 -291 -108 223 -365 -87 87 61 274 -161 -67 -96 66 100 -246 -55 -88 128 -140 85 -11 -198 75
4302 75 -161 -18 -141 78 138 -104 -103 -45 85 131 95 2 -77 -1 -29 -128 -2 168 15 -66 360 81 -237 0
4326 0 -59 -18 277 -216 85 237 -58 57 178 -227 -126 27 -98 -32 -369 -9 376 -84 -16 -105 158 -19
4348 -19 40 101 43 -36 230 -146 -97 158 -85 22 -24 -213 -60 388 266 63 70 -230 53 -340 75 260 204
4371 204 176 -173 302 54 52 78 14 77 -138 81 -145 -174 21 -39 -8 71 -244 3 61 -120 79 69 37 113 -181
4396 -181 -12 43 -87 32 -63 -186 200 -35 47 176 57 -152 149 -175 32 -72 126 138 146 -82 -203 84
4418 84 212 55 -69 97 -78 -182 130 126 -321 -234 -88 36 79 117 -133 -121 -136 37 157 -76 -4 -6 -40 -153
4442 -153 -64 117 246 74 -73 -107 -223 -22 -13 232 -123 -28 6 265 13 66 42 -17 -29 -37 -125 255 59 -53
4466 -53 -100 151 -11 -126 51 -139 -3 -151 -24 135 -149 -204 -14 149 57 -66 134 39 -72 66 -62 -54
4488 -54 -93 245 -96 115 41 16 -149 -58 -79 50 -125 -15 -63 68 -88 0 32 -250 -232 -196 119 27 119 97 -39
4513 -39 -116 122 -56 -124 -216 154 135 -301 207 -96 31 -178 12 -63 173 29 105 -115 -161 51 42 -169 -28
4536 -28 -14 116 -184 185 59 -16 77 326 -277 173 231 -153 -17 70 -47 -268 295 82 5 -21 -65 24 10 12
4560 12 59 -37 -238 64 -49 -220 -9 -105 150 -84 34 24 22 262 -7 -45 63 200 109 -125 276 106 -97
4583 -97 209 -38 174 35 -52 29 119 -45 8 -39 -232 237 -9 -50 278 -46 -5 175 122 -189 105 -236 -11
4606 -11 -156 195 -4 132 -38 -213 169 262 -221 -55 46 66 -9 115 42 -44 22 241 -43 349 -17 -79 26
4629 26 112 -187 113 -253 25 171 64 43 94 -4 -122 184 82 232 -152 27 -58 109 277 -40 240 -184
4651 -184 -105 -78 158 38 87 130 143 -61 -136 -153 138 189 -94 208 -159 234 -210 -229 -104 151 93 -54 -17 128
4675 128 -1 -36 -241 -172 -67 -250 -176 -36 -102 -169 37 -114 -199 -81 -43 149 -459 -82 -61 74 -123 83 159
4698 159 32 76 52 -17 244 -160 242 231 32 -82 -116 -166 -124 -113 31 -94 72 210 -220 102 -132 -207 27
4721 27 -167 44 8 -102 245 196 -147 0 -122 223 -162 -113 -157 165 158 33 -66 43 -107 -60 -189 -7 134
4744 134 107 21 -124 -185 -87 102 -172 28 -68 177 40 -134 -117 6 134 64 -196 -106 -9 -34 18 305 -17 -140
4768 -140 78 91 -133 -148 188 292 -157 -167 -38 194 -166 -106 5 -1 -38 -7 -216 -108 -92 34 -20 -35 85 -156
4792 -156 67 -292 48 -76 -98 32 185 55 185 -165 -108 -54 209 97 -118 -151 10 139 -28 -81 165 -118
4814 -118 55 44 -45 -116 -218 10 14 61 83 113 192 -52 -19 122 -175 -139 54 277 103 127 73 -32 142 -351
4838 -351 -166 152 -62 -108 -139 136 165 -112 -140 136 25 -115 89 -101 67 -30 -56 99 -140 -27 170 170 55
4861 55 -4 230 -59 103 -175 203 -180 -190 -33 -154 -31 -23 220 9 79 -159 77 25 143 -79 292 85
4883 85 -208 -239 190 -22 -129 -32 52 -116 21 120 -53 -173 40 117 42 -164 34 -44 6 153 -23 -151 159
4906 159 30 -71 -96 -38 -27 8 143 -32 -169 -3 40 -83 185 12 -107 -196 304 -118 64 22 -168 146
4928 146 -106 50 -89 -176 -91 -170 7 189 128 -132 -83 48 -228 145 -222 228 31 -52 -119 -232 5 -95
4950 -95 -5 281 106 144 203 -186 83 -43 137 -61 -235 299 69 185 -77 -121 -112 319 19 141 139 -240 46
4973 46 230 -41 -246 356 100 1 -50 138 -352 -43 -21 -63 -241 -169 -110 -290 -148 -157 84 -35 234 49 109
4996 109 -27 -56 -99 68 196 -91 -20 -43 -110 152 54 -112 -236 49 -163 -126 -192 308 -170 32 182 142 -62
5019 -62 -141 1 -41 146 -19 -42 64 58 122 -193 -112 -63 -81 106 -99 -211 354 224 140 -42 145 -34 -85 -92 -92
5044 -92 11 -95 78 -21 -80 56 72 -55 43 -333 49 123 252 254 -206 -2 -99 59 -93 -202 69 -3 -104
5067 -104 78 113 -183 -7 -107 349 -41 31 -69 35 150 -75 -137 104 -86 -215 -3 -126 -127 155 26 6
5089 6 -23 -152 144 -32 77 -35 -219 -247 -11 73 -36 90 -62 -67 242 100 225 38 -173 -156 95 -94 -59
5112 -59 -125 -100 135 20 -45 -141 -51 123 -180 74 -270 77 -233 -261 95 -63 -264 -89 -33 151 82 124 73 -108
5136 -108 -54 -206 -160 -81 -22 18 -214 95 100 -26 231 83 71 -12 184 139 -72 -172 286 -118 16 -139 278
5159 278 -98 65 99 65 -154 -103 69 242 -107 -126 -212 100 209 176 90 1 -88 -20 38 56 -57 107 -5 -90
5183 -90 -279 99 118 47 64 -26 -31 -97 -81 -358 -113 24 139 282 -16 249 14 -4 95 -86 102 194 -10 -128
5207 -128 117 107 152 -110 -106 128 57 -69 -301 199 -244 -22 118 137 27 -238 -137 207 -65 -153 71 -131
5229 -131 94 -152 122 22 24 -45 -14 64 72 36 281 58 58 123 -16 75 393 -127 -22 118 -180 -274 -65 -204
5253 -204 32 7 140 -58 134 -55 -307 134 40 90 -116 158 166 140 -62 59 3 -30 3 -292 -243 170 -114
5276 -114 -27 -124 -12 346 0 22 -195 15 -31 -231 -38 289 173 -71 -220 -344 39 162 -244 107 -199
5297 -199 285 -54 76 -9 -129 45 330 19 23 32 -152 49 135 37 -85 -30 -189 -188 -92 229 -49 134 -50 9
5321 9 -162 16 -69 -180 8 293 -42 110 -119 -178 -195 11 330 -3 210 37 76 -284 45 145 -69 3
5343 3 256 -172 -60 90 153 159 18 -156 -224 15 -24 -15 -128 137 -214 5 82 111 -64 28 -143 295 -41 -7
5367 -7 -215 87 -21 -107 78 -385 95 43 128 -73 46 98 102 41 12 -94 33 89 83 6 244 -129 -115 -15 157
5392 157 -125 19 24 -111 -2 -25 -47 -46 -97 -68 -284 -254 26 165 -194 -66 49 -102 283 20 98 -103 -159 -95
5416 -95 315 -99 28 77 -296 -215 -161 -149 288 133 77 -33 -248 238 -57 -67 21 -143 -161 185 -244 78 62
5439 62 -18 -35 -112 -136 100 -74 57 117 -31 -107 -106 -95 22 234 119 137 -87 49 334 -120 -63 -138 -28 134
5463 134 -163 -153 173 58 201 -69 189 83 -128 -300 29 -13 -143 -195 -38 -188 100 148 100 85 -53 -143
5485 -143 -183 83 265 151 38 -102 246 -127 -27 28 -240 -47 -381 13 -51 -116 99 390 -149 239 96
5506 96 -204 -92 161 62 185 315 -18 179 -15 -74 -122 105 -67 34 133 162 -327 186 -73 -67 -316 -65 29
5529 29 6 -55 149 253 229 181 180 72 131 210 250 158 71 -24 14 100 292 169 -125 177 111 97 -143 -8 -243 -206
5555 -206 164 72 166 -143 -15 258 156 9 178 -181 -276 -112 -117 0 171 66 206 151 10 -101 -74 15 -261
5578 -261 -142 -270 97 -41 -139 -62 -96 147 -21 -59 267 -210 -182 48 -3 56 -217 132 -154 -127 -165 5 118
5601 118 64 -176 78 95 120 150 -278 -25 6 92 94 133 195 123 -128 -33 36 25 91 -84 103 116 -85 -71 -16 54
5627 54 15 33 48 -54 -124 -118 -244 -113 6 21 -60 -41 -151 -406 -202 -14 -11 -67 58 152 -64 -117 -102 -34 134 116
5653 116 112 1 -142 91 373 -81 182 13 -132 -79 0 116 -36 -112 -22 263 -140 139 82 -210 -136 -195 144
5676 144 398 289 -54 141 107 -9 -151 84 -176 99 145 -186 -72 -6 118 264 -45 56 40 16 83 -28
5698 -28 5 -147 57 -194 -117 -219 -68 -259 -59 -101 107 -190 156 140 171 -263 -63 -112 -95 -143 -16 71 -305
5721 -305 272 177 190 56 -172 69 64 -101 -28 115 105 346 207 18 -77 -123 10 -200 -256 74 117 -132 -68 331
5745 331 121 146 -109 140 -95 -57 -76 -25 -95 43 -74 123 -190 16 12 42 269 372 139 -20 -71 -22 -49 129
5769 129 -53 -129 168 -60 -105 115 173 -34 87 76 -121 -85 105 36 115 29 -255 61 -74 -99 -9 -30 -193 -47
5793 -47 -114 141 70 -68 -138 88 97 42 202 -111 -221 118 -33 -10 -193 142 158 9 140 -173 248 -28 -22 -9
5817 -9 -72 158 -104 -63 45 80 232 -27 -104 60 64 75 148 -5 -271 166 -22 91 87 156 -5 10 -3 -168 -58
5842 -58 120 15 78 6 -153 -14 -152 -160 -49 -75 -204 -176 -58 -132 145 14 18 -265 55 -50 246 1 37 -224
5866 -224 133 11 98 283 34 35 -121 -208 34 15 -147 84 100 -77 -178 -106 2 -256 94 -31 111 73 212
5889 212 -43 -75 -15 -306 -11 20 -135 82 -43 1 -226 -218 -17 17 241 -70 4 -316 -233 -109 156 -66 108
5912 108 -160 195 90 -70 138 -180 323 114 7 210 -363 -44 -11 164 91 148 18 -201 17 -107 42
5933 42 -85 -253 -179 -235 108 -124 -23 52 -144 225 220 -131 86 -15 61 -158 55 87 -53 -171 -170 165 -68
5956 -68 -12 193 105 -38 157 -63 7 -155 162 -260 -12 9 77 30 -6 -24 -188 -35 33 35 -206 -14 203 -187
5980 -187 132 166 81 51 183 -38 168 -247 48 -34 59 175 -109 88 284 -127 -155 -85 -121 17 -53 -157 -172
6003 -172 145 19 56 143 -192 37 45 2 -54 22 -10 -145 160 -121 217 -241 -17 3 27 46 -82 -46 -63 104
6027 104 -82 130 9 -202 -19 -17 -300 -189 29 14 258 94 56 111 203 156 332 17 -104 -94 176 145 214
6050 214 -61 -31 21 -82 -106 143 -235 -106 198 -328 -13 4 24 99 0 -236 31 252 266 -140 76 126 -77
6073 -77 -25 42 152 -177 -47 145 24 104 340 -51 -61 -214 -106 -43 -144 70 105 55 -16 -184 95 -115 -140
6096 -140 -92 102 -147 29 133 6 219 -27 91 -264 -62 -132 188 -14 17 106 -91 158 160 -33 16 -125
6118 -125 -50 -190 -121 141 199 -149 -179 29 -108 -74 18 -80 207 424 10 -126 16 39 66 25 237 -174 4
6141 4 -132 423 21 7 61 -252 128 164 86 116 47 -132 -28 -269 -21 -256 76 -161 17 30 80 73 -76 114
6165 114 -59 292 -87 -122 102 15 -37 -25 -147 249 173 -136 154 -91 -116 -119 277 23 25 75 -55 -21 137 -145
6189 -145 -2 156 -56 -184 8 62 150 -68 139 -199 201 -169 22 -78 -174 62 -76 61 -178 -24 -62
6210 -62 66 19 120 67 -115 55 -98 27 273 -96 30 -83 -143 -40 200 -104 182 154 78 -59 -134 146
6232 146 -130 117 -183 96 -6 199 -75 257 261 109 -196 -250 268 -70 117 -12 -4 -95 -201 135 46 328
6254 328 278 -176 -201 -231 18 -54 -67 136 -305 32 101 111 0 123 25 -14 215 -43 89 83 -94 90 0 100
6278 100 -394 -35 -32 106 353 47 224 19 -3 95 133 178 42 71 -63 -235 44 -198 -451 -108 -134 60 -5
6301 -5 226 120 -109 -21 174 -30 -13 307 -106 131 -168 -197 87 -97 96 -201 110 90 153 -129 -99 49 100
6324 100 -22 -77 -56 -56 -132 20 25 -146 65 -218 -8 -56 48 -10 -6 207 39 -132 96 56 -7 106 193 -25 59
6349 59 157 -11 -121 -220 2 -10 31 -23 -206 -26 -90 241 -33 35 -148 214 151 -20 -132 29 -15 -149 -35
6372 -35 -78 36 29 158 -210 -45 82 -39 -25 326 -11 127 -56 -52 102 -11 -42 8 -14 190 32 -237 109
6395 109 -239 -3 209 146 -121 124 28 -114 -247 -109 -36 -24 -17 -225 -83 210 106 -115 174 54 -88 -64
6417 -64 -20 -91 256 126 126 23 -141 -86 190 252 -115 69 -55 95 -124 412 8 68 166 -29 -151 105 -34
6440 -34 -7 -173 -1 -13 -37 58 8 85 -77 -222 23 78 169 -148 -159 -30 -82 -18 232 133 27 95 98 -34 -212
6465 -212 -70 189 -62 -37 282 -119 -45 -68 159 -78 7 82 138 31 21 -77 -81 127 129 -177 -292 -249 -202 428 38
6490 38 3 -100 36 9 14 -141 175 -157 283 -114 -37 31 261 -107 10 290 -33 -19 -91 -28 -54 -106 -48 -161
6514 -161 -252 -124 152 -189 173 75 -179 14 -226 73 -115 131 -166 -101 -221 -5 244 59 -49 188 -84
6535 -84 -170 15 20 224 24 -148 174 -3 -97 -26 127 -256 -215 94 79 156 129 -98 -131 178 24 -137 307 -16
6559 -16 2 -214 37 -64 -241 92 -27 -132 51 171 55 -27 -7 186 252 250 -60 45 98 125 -32 -86 -146 104
6583 104 104 106 -186 191 -4 49 -208 -198 36 -323 -234 120 -183 111 181 29 73 -198 171 202 -139 72 -67
6606 -67 120 -74 32 -26 -60 -66 143 -53 -7 41 2 95 73 90 -209 41 -66 -97 131 43 255 185 -127 -87 127
6631 127 -327 181 58 115 -95 58 -151 -36 162 33 192 47 -120 265 23 63 -62 -183 127 63 -171
6652 -171 141 -205 69 -1 -31 -193 18 93 -273 99 -54 -176 -17 11 -42 -22 -29 -101 69 62 89 199 -65 -4
6676 -4 136 64 225 -13 196 -26 -117 14 57 -32 27 62 109 382 -133 -27 -47 -15 -268 -91 35 -13 195 -109
6700 -109 36 126 -62 -96 35 -119 -4 -56 -92 56 -64 -123 100 43 -178 91 -96 10 49 -154 -61 -109 32
6723 32 149 58 -69 -38 -41 -65 -177 137 -4 -92 198 58 -201 110 47 12 17 -111 3 94 100 20 -104 112 -149
6748 -149 64 62 110 -162 324 25 113 -95 89 159 -12 22 121 -43 -97 -135 8 104 -37 144 102 -5 -44 33
6772 33 222 -37 -68 257 -38 -80 -134 6 -5 -39 165 -327 -70 115 -121 275 219 -189 275 163 -218 34
6794 34 -186 -41 19 7 156 -30 -256 77 -5 -73 123 93 175 -259 -177 60 113 -29 -266 -41 -22 59 13 43
6818 43 -41 75 -14 -83 106 133 267 71 -111 77 96 25 -356 -213 -84 -31 85 -32 112 -8 58 -58 151
6841 151 -45 -59 -43 216 -78 -406 209 -320 81 -150 -185 23 20 114 -117 21 200 -20 -199 -18 131 121
6863 121 -26 -334 -77 -54 -21 -105 -218 -14 -52 24 55 33 87 -150 42 121 28 -31 -48 210 -80 -16 -295 150
6887 150 -62 87 -477 -122 -185 101 -12 -182 -61 -29 66 -187 -159 215 61 -118 315 -48 -10 -297 -90 -97
6909 -97 128 -16 28 -227 28 -13 70 96 233 -168 -106 221 92 106 204 60 169 76 29 59 -204 328 -283 19
6933 19 -53 -58 -222 188 37 16 -179 235 25 129 151 32 282 -109 -132 -8 173 -187 -158 190 -81 118 -73
6956 -73 -51 -171 79 98 66 278 64 45 -61 -1 -113 20 223 -145 -47 -213 -81 63 95 -38 -89 6 -44 55
6980 55 15 148 46 172 -270 -160 231 -158 116 159 95 53 -213 -202 88 -50 249 65 49 162 26 -96
7002 -96 167 -38 211 210 10 166 233 -100 -24 -119 -93 166 -35 -80 -70 -247 12 -46 -150 102 -166 -103 141 185
7026 185 146 105 -40 43 86 -41 29 -25 -7 -148 217 98 70 155 -11 157 -108 -142 -60 -32 4 134 -54 30 3
7051 3 -54 -33 71 -143 -28 -31 -77 -50 -271 158 125 290 8 70 99 241 53 175 -195 -141 -79 -117 11 -159 -116
7076 -116 232 -62 71 80 -400 -36 -104 288 -214 139 308 -84 -311 163 -209 211 -10 -273 -325 -72 -2 309
7098 309 -136 7 14 -94 67 207 82 137 -60 10 5 17 133 -143 -131 24 23 -61 175 238 -316 -242 -23 23 -30
7123 -30 -103 -74 74 68 -212 28 24 -113 -122 -304 11 143 259 -126 -2 20 -321 -53 135 32 -35 -82 -103 238
7147 238 36 -49 295 0 -143 65 -221 52 398 132 65 -203 -7 -61 134 -33 -144 -181 137 -32 149
7168 149 128 259 -265 -71 -112 -234 -52 -93 107 -187 38 119 -120 -83 -261 99 -58 -27 -89 362 330 -76 -152
7191 -152 40 -86 93 -42 -37 -2 -297 -172 30 123 152 -29 -179 -122 -205 108 97 154 27 123 264 4 -7 182
7215 182 -113 189 -47 -110 -72 -4 -255 249 317 146 -81 25 -242 83 27 40 -86 -210 51 35 -173 -76 204
7238 204 54 87 -45 240 -17 22 -74 529 117 163 -157 202 50 -120 -6 -181 167 -57 -82 -61 98 -190
7260 -190 13 136 143 -225 -184 254 -10 251 -74 -167 -45 91 -322 184 -15 137 -129 107 -268 -91 121
7281 121 36 -12 -167 -17 -154 27 -44 -47 -210 113 258 -112 127 201 -355 102 -47 -23 -370 -50 -300 86
7303 86 -147 15 144 -155 166 151 8 -185 131 290 -271 198 15 187 175 -49 68 25 78 -126 65 -400
7325 -400 -51 -26 -6 -72 -152 72 -96 136 180 -75 -122 -201 -134 84 -15 -79 178 -169 -202 -17 80 -116 81 -19
7349 -19 -39 349 -237 -74 49 -132 -232 87 -240 -157 89 69 111 87 -167 15 166 -156 185 80 104 -227
7371 -227 -95 -109 7 226 157 -98 -368 94 31 -167 18 -46 306 94 -46 84 -259 -72 147 -15 101
7392 101 93 12 -74 -148 -95 -12 152 72 173 -204 178 -113 -37 -51 134 -201 90 -8 89 182 39 -158 111 47 -257
7417 -257 146 -5 -188 98 258 -294 -173 -231 -88 124 -18 311 -212 -168 14 -8 124 86 -210 -11 -19 18
7439 18 -117 27 31 40 153 2 -79 -344 58 -84 213 -146 37 -203 -49 26 -4 126 -61 183 170 159 -338
7462 -338 90 44 -210 53 -152 -204 -54 -10 -7 143 -39 14 -108 -18 -100 -145 -85 -223 141 404 -185 -207 39 -133
7486 -133 -42 -161 37 -170 -181 45 -54 -3 -40 -167 -144 82 -148 -128 -69 177 -11 210 -137 13 181 -12 183
7509 183 -252 -146 -118 30 -45 -80 111 118 143 -58 74 -36 193 144 -86 -33 172 92 -84 -26 240 165 52 -29
7533 -29 -26 83 -118 150 -94 26 74 -105 74 84 -166 -165 81 10 -39 133 -322 -217 182 59 -47 102 149
7556 149 -244 53 -23 114 4 98 -6 16 -8 -62 111 -151 21 337 95 3 94 -59 -45 47 83 -109 -21 -234
7580 -234 60 -58 -20 -135 17 157 35 -49 -146 0 -65 37 103 -121 -2 -75 44 129 13 11 -19 -138 -130 211
7604 211 163 31 -288 118 95 -26 -128 -106 115 17 -103 -123 -59 143 143 -14 61 122 -12 238 72 -33 181
7627 181 -224 28 64 -176 -152 -168 -268 -44 192 -10 -23 -26 -287 244 -57 35 104 70 110 132 -253 151 -296 44
7651 44 95 -110 64 -177 35 225 177 -71 261 239 6 -353 250 -170 -140 77 26 315 -23 -58 -153 62 101
7674 101 -137 87 212 -322 50 -170 80 -94 213 275 98 -6 -156 -77 -139 -159 90 -160 -187 113 24 -222
7696 -222 254 37 -18 -78 -111 -49 -292 102 266 -77 281 15 -53 -196 -117 -262 -254 118 -199 -240 143 104 266
7719 266 -151 -50 -22 -252 0 120 -48 -9 320 -107 -266 53 -145 -91 -49 58 196 30 -269 45 321
7740 321 6 240 75 33 165 148 113 -89 208 74 -100 -40 -21 -19 -159 -168 200 -230 -17 46 433 140 -55
7763 -55 132 71 -52 68 62 -192 42 -181 -37 71 -40 149 -213 37 -170 -103 -54 -52 74 209 -175 -109 181
7786 181 -233 98 72 161 -41 72 87 -121 -189 -36 87 -73 46 -120 48 -110 -192 -186 79 -38 -118 -107 281
7809 281 -45 93 49 -55 174 -155 24 110 -86 226 89 -3 192 -56 -21 -27 109 60 6 -66 70 -249 -186
7832 -186 -39 -68 -110 94 29 -70 -343 66 -46 -106 -39 -315 -53 -65 4 -108 -7 -85 -128 -93 69 94 -133 -97
7856 -97 -122 -68 78 -298 124 34 -157 -251 -207 -54 -53 257 125 -160 13 160 35 236 62 -291 17 -93 39
7879 39 128 167 18 -106 -93 -76 -38 -153 141 173 63 212 22 82 -32 93 200 -77 -53 -139 -110 96 -15 -53
7903 -53 -46 102 -172 -95 171 -41 -236 179 120 111 117 232 -270 88 -137 -3 1 141 95 -190 266 157 -113 65
7927 65 10 -39 -127 2 -85 -4 196 -83 -52 -164 -86 -47 -37 -59 -251 64 96 -67 112 -218 -179 137 -97 -82 -117
7952 -117 -203 68 33 -45 -77 220 57 -314 -136 -122 -154 147 18 165 -17 -45 20 66 116 25 -15 124 -19 26
7976 26 -142 -11 99 351 16 -288 127 -16 191 214 -70 -236 81 100 38 -48 99 40 -8 -27 155 103 80
7999 80 202 241 60 67 -136 162 212 -160 130 76 6 -10 -30 -25 -28 32 35 -155 111 19 -30 225 421 -57 70 45
8025 45 -139 -310 107 34 -63 10 53 220 -30 -205 -11 -68 -258 24 -41 25 -262 1 -78 -84 -167 120 70 -146
8049 -146 278 -212 -21 -202 -15 -32 153 -102 198 337 -39 -15 -72 -242 -117 54 184 -21 -12 -389 -74 1
8071 1 199 148 -40 43 -112 -22 -96 -9 312 -274 -43 55 62 -241 131 -118 197 111 108 276 -210 159 307 -18
8095 -18 2 -2 83 89 126 13 -38 180 -107 -310 -87 -272 -30 16 -175 15 -19 40 -181 72 -119 56 -93 -7
8119 -7 54 226 322 -226 -23 -181 -89 189 -216 -158 -157 -51 42 -146 78 35 -51 86 -184 249 31 -359 43 79
8143 79 -80 -167 5 -61 9 56 -5 129 -3 34 -21 -266 -147 100 -55 132 -27 175 -141 -185 193 99 -219
8166 -219 -43 165 69 192 6 -39 6 -91 41 -47 14 30 -56 120 -48 -131 27 -35 41 3 -137 -41 3 37 125
8191A25
##END NTUPLES=NMR FID
##END=
