##TITLE=1H_DE-155_R_TFA
 200.13Hz, DMSO.
 8 sc
 23.6.2026
##JCAMPDX= 6.0         $$ Bruker NMR JCAMP-DX V2.0
##DATA TYPE= NMR FID
##DATA CLASS= NTUPLES
##ORIGIN= UXNMR, Bruker Analytische Messtechnik GmbH
##OWNER= pz
$$ XWIN-NMR		Version 3.5
$$ Tue Jun 23 15:09:46 2026 Russian Standard Time (UT+4h)  she@DPX200
##.OBSERVE FREQUENCY= 200.1313
##.OBSERVE NUCLEUS= ^1H
##.DELAY= (6, 6)
##.ACQUISITION MODE= SIMULTANEOUS
##.ACQUISITION SCHEME= undefined
##.AVERAGES= 8
##.DIGITISER RES= 18
##SPECTROMETER/DATA SYSTEM= spect
##.PULSE SEQUENCE= zg30
##.SOLVENT NAME= DMSO
##.SHIFT REFERENCE= (INTERNAL, DMSO, 0, 14.3821)
##AUDIT TRAIL= $$ (NUMBER, WHEN, WHO, WHERE, WHAT)
$$ ##TITLE= Audit trail, XWIN-NMR		Version 3.5
$$ ##JCAMPDX= 5.01
$$ ##ORIGIN= Bruker BioSpin GmbH
$$ ##OWNER= she
$$ F:/spectra/data/she/nmr/H-C/1/audita.txt
$$ ##AUDIT TRAIL=  $$ (NUMBER, WHEN, WHO, WHERE, WHAT)
(   1,<2026-06-23 15:08:35.10 +0400>,<she>,<DPX200>,
      <created by zg, POWCHK disabled, PULCHK disabled
       configuration hash MD5:
       00 E9 B6 7A A2 85 ED C7 34 08 36 98 17 FE 4E 26
       data hash MD5: 16K
       80 F7 71 05 B0 E2 EC 5A 2D FC 78 61 80 DF 31 3B>)
$$ ##END=
$$ 
$$ hash MD5
$$ CB EC AB CE DE 66 07 B0 AE F2 72 73 0C B4 39 32
##$RELAX= 
##$RELAX= 
##$RELAX= 
##$RELAX= 
##$RELAX= 
##$RELAX= 
$$ Bruker specific parameters
$$ --------------------------
##$DU= <F:/spectra>
##$EXPNO= 1
##$NAME= <H-C>
##$PROCNO= 1
##$TYPE= <nmr>
##$USER= <she>
##$AMP= (0..31)
100 100 100 100 100 100 100 100 100 100 100 100 100 100 100 100 100 100 
100 100 100 100 100 100 100 100 100 100 100 100 100 100 
##$AQSEQ= 0
##$AQ_mod= 1
##$AUNM= <au_zg>
##$AUTOPOS= <>
##$BF1= 200.13
##$BF2= 200.13
##$BF3= 200.13
##$BF4= 200.13
##$BF5= 200.13
##$BF6= 200.13
##$BF7= 200.13
##$BF8= 200.13
##$BYTORDA= 1
##$CFDGTYP= 0
##$CFRGTYP= 5
##$CHEMSTR= <none>
##$CNST= (0..31)
1 1 145 1 1 1 1 1 1 1 1 1 1 1 1 1 1 1 1 1 1 1 1 1 1 1 1 1 1 1 1 1 
##$CPDPRG= <>
##$CPDPRG1= <>
##$CPDPRG2= <>
##$CPDPRG3= <>
##$CPDPRG4= <mlev>
##$CPDPRG5= <mlev>
##$CPDPRG6= <mlev>
##$CPDPRG7= <mlev>
##$CPDPRG8= <mlev>
##$CPDPRGB= <>
##$CPDPRGT= <>
##$D= (0..31)
0 0.7 0 0 0 0 0 0 0 0 0 0.03 0 0 0 0 0 0 0 0 0 0 0 0 0 0 0 0 0 0 0 0 
##$DATE= 1782212914
##$DBL= (0..7)
120 120 120 120 120 120 120 120 
##$DBP= (0..7)
150 150 150 150 150 150 150 150 
##$DBP07= 0
##$DBPNAM0= <>
##$DBPNAM1= <>
##$DBPNAM2= <>
##$DBPNAM3= <>
##$DBPNAM4= <>
##$DBPNAM5= <>
##$DBPNAM6= <>
##$DBPNAM7= <>
##$DBPOAL= (0..7)
0.5 0.5 0.5 0.5 0.5 0.5 0.5 0.5 
##$DBPOFFS= (0..7)
0 0 0 0 0 0 0 0 
##$DE= 6
##$DECBNUC= <off>
##$DECIM= 32
##$DECNUC= <off>
##$DECSTAT= 4
##$DIGMOD= 1
##$DIGTYP= 9
##$DL= (0..7)
0 120 120 120 120 120 120 120 
##$DP= (0..7)
150 150 150 150 150 150 150 150 
##$DP07= 0
##$DPNAME0= <>
##$DPNAME1= <>
##$DPNAME2= <>
##$DPNAME3= <>
##$DPNAME4= <>
##$DPNAME5= <>
##$DPNAME6= <>
##$DPNAME7= <>
##$DPOAL= (0..7)
0.5 0.5 0.5 0.5 0.5 0.5 0.5 0.5 
##$DPOFFS= (0..7)
0 0 0 0 0 0 0 0 
##$DQDMODE= 0
##$DR= 18
##$DS= 0
##$DSLIST= <SSSSSSSSSSSSSSS>
$$ [...]
##$SUBNAM0= <"">
##$SUBNAM1= <"">
##$SUBNAM2= <"">
##$SUBNAM3= <"">
##$SUBNAM4= <"">
##$SUBNAM5= <"">
##$SUBNAM6= <"">
##$SUBNAM7= <"">
##$SUBNAM8= <"">
##$SUBNAM9= <"">
##$SW= 18.0517328524113
##$SWIBOX= (0..15)
0 0 2 0 0 0 0 0 0 0 0 0 0 0 0 0 
##$SW_h= 3612.71676300578
##$TD= 16384
##$TD0= 1
##$TE= 0
##$TE2= 300
##$TE3= 300
##$TEG= 300
##$TL= (0..7)
0 120 120 120 120 120 120 120 
##$TP= (0..7)
150 150 150 150 150 150 150 150 
##$TP07= 0
##$TPNAME0= <>
##$TPNAME1= <>
##$TPNAME2= <>
##$TPNAME3= <>
##$TPNAME4= <>
##$TPNAME5= <>
##$TPNAME6= <>
##$TPNAME7= <>
##$TPOAL= (0..7)
0.5 0.5 0.5 0.5 0.5 0.5 0.5 0.5 
##$TPOFFS= (0..7)
0 0 0 0 0 0 0 0 
##$TUNHIN= 0
##$TUNHOUT= 0
##$TUNXOUT= 0
##$USERA1= <user>
##$USERA2= <user>
##$USERA3= <user>
##$USERA4= <user>
##$USERA5= <user>
##$V9= 5
##$VALIST= <valist>
##$VCLIST= <CCCCCCCCCCCCCCC>
##$VD= 0
##$VDLIST= <DDDDDDDDDDDDDDD>
##$VPLIST= <PPPPPPPPPPPPPPP>
##$VTLIST= <TTTTTTTTTTTTTTT>
##$WBST= 1024
##$WBSW= 4
##$XGAIN= (0..3)
0 0 0 0 
##$XL= 0
##$YL= 0
##$YMAX_a= 224622
##$YMIN_a= -179672
##$ZGOPTNS= <>
##$ZL1= 120
##$ZL2= 120
##$ZL3= 120
##$ZL4= 120
##$ABSF1= 10
##$ABSF2= 0
##$ABSG= 5
##$ABSL= 3
##$ALPHA= 0
##$AQORDER= 0
##$ASSFAC= 0
##$ASSFACI= 0
##$ASSFACX= 0
##$ASSWID= 0
##$AUNMP= <proc_1d>
##$AZFE= 0.1
##$AZFW= 0.1
##$BCFW= 1
##$BC_mod= 2
##$BYTORDP= 1
##$COROFFS= 0
##$CY= -3
##$DATMOD= 1
##$DC= 2
##$DFILT= <>
##$DTYPP= 0
##$F1P= 0
##$F2P= 0
##$FCOR= 0.5
##$FTSIZE= 0
##$FT_mod= 4
##$GAMMA= 1
##$GB= 0.15
##$INTBC= 1
##$INTSCL= 1
##$ISEN= 128
##$LB= 0.25
##$LEV0= 0
##$LPBIN= 0
##$MAXI= 10000
##$MC2= 0
##$MEAN= 0
##$ME_mod= 0
##$MI= 1.114404
##$NCOEF= 0
##$NC_proc= 0
##$NLEV= 6
##$NOISF1= 3.799351
##$NOISF2= 2.8
##$NSP= 1
##$NTH_PI= 0
##$NZP= 0
##$OFFSET= 14.38212
##$PC= 1
##$PHC0= -4225.362
##$PHC1= 11.79229
##$PH_mod= 1
##$PKNL= yes
##$PPARMOD= 0
##$PSCAL= 0
##$PSIGN= 0
##$REVERSE= no
##$SF= 200.129724274929
##$SI= 16384
##$SIGF1= 3
##$SIGF2= 2
##$SINO= 400
##$SIOLD= 16384
##$SREGLST= <1H.CDCl3>
##$SSB= 0
##$STSI= 0
##$STSR= 0
##$SW_p= 3205.1282051282
##$SYMM= 0
##$S_DEV= 0
##$TDeff= 0
##$TDoff= 0
##$TI= <>
##$TILT= no
##$TM1= 0
##$TM2= 0
##$TOPLEV= 0
##$USERP1= <user>
##$USERP2= <user>
##$USERP3= <user>
##$USERP4= <user>
##$USERP5= <user>
##$WDW= 1
##$XDIM= 8192
##$YMAX_p= 0
##$YMIN_p= 0
$$ End of Bruker specific parameters
$$ ---------------------------------
##NTUPLES= NMR FID
##VAR_NAME=  TIME,          FID/REAL,        FID/IMAG
##SYMBOL=    X,             R,               I
##VAR_TYPE=  INDEPENDENT,   DEPENDENT,       DEPENDENT
##VAR_FORM=  AFFN,          ASDF,            ASDF
##VAR_DIM=   8192,          8192,            8192
##UNITS=     SECONDS,       ARBITRARY UNITS, ARBITRARY UNITS
##FACTOR=    0.0002768,     1,               1
##FIRST=     0,             0,               0
##LAST=      2.2672688,     0,               0
##MIN=       0,             -179672,         0
##MAX=       2.2672688,     224622,          0
$$ Real data points
##PAGE= N=1
##DATA TABLE= (X++(R..R)), XYDATA
$$ [...]
1924B7O4l08M5k6N20l11j96M6J31O3j99K26l6N1j7j8K14k77j80j1J96j63r9L22
$$ 27 91 -217 -172 -198 322 11 -185 -139 -8 55 -144 82 46 97 80 62 276 -1 -181 -192 4 -159 -258 64
1948F4Qq0J23j51j19K63j96N5K4p6J35K0M9KO4j88J00j23J12R8j36r3q9Q7J55
$$ 64 72 -8 115 -36 -155 108 -88 -33 -9 -85 50 70 119 121 185 -3 97 -26 86 184 48 -45 -134 -47 108
1973A08k81P5K29l14M49j80M4N5Jl96P2J69k6j15J44j26Q1k4L03K03l74J16k34
$$ 108 -173 -98 131 -183 266 86 130 185 186 -210 -138 31 5 -110 34 -92 -11 -35 268 471 97 213 -21
1996b1J00j43J31k6J10j80J35l7j63J76k00J42J43q5k7K3j34J58J0k31J8K2O9
$$ -21 79 -64 67 41 151 -29 106 69 -94 82 -118 24 167 82 55 78 -56 102 112 -119 -101 -79 -10
2019a0R2KJ24j68Q2k67J86J63j04o2k21J86M1J40r9N8j85Q3lO0M6k79J44j22K57
$$ -10 82 84 208 40 122 -145 41 204 100 38 -183 3 44 184 85 143 -42 41 38 98 144 -135 9 -113 144
2044A44k99L13m00P0j8P1J45K14k22k01L26r0m02L63n0L8J44K24m52j34L01r7
$$ 144 -155 158 -242 -172 -190 -119 26 240 18 -183 143 53 -349 14 -36 2 146 370 -82 -216 85 -12
2066a2m4M8j63K89Nl25J60J29J07l1k32%J91j53J10J44j61k75k7L94k51J34l6
$$ -12 -56 -8 -171 118 123 -202 -42 87 194 163 -69 -69 122 -31 79 223 62 -213 -240 154 -97 37 1
2089Aj03P9p5J28O9r1J4O6m6q4OP0J05J3l58M37M0k66Q4r8l16M51k76J62k15K9
$$ 1 -102 -23 -98 30 99 8 22 88 42 -42 -36 34 139 152 -206 231 271 5 89 -9 -325 126 -150 12 -203 -174
2115a74M9J82r4Q3N6k37Q7L06J12l76k21K72P2k57K34k24L21l24k34K3K07J81
$$ -174 -125 57 -37 46 102 -135 -48 258 370 -6 -227 45 117 -140 94 -130 191 -133 -367 -344 -137 44
2137D4k7k5j66L38J03j69l46J63NR9L9nk42J57o9j46M15j30N4k9n8K71k11j08
$$ 44 17 -8 -174 164 267 98 -248 -85 -80 19 58 53 -189 -32 -101 -247 168 38 92 63 5 276 65 -43
2161d3P6j79L00k64j39L04j08J06k57K88r0j05J58P4j99k6J20M8k37J12j2J32
$$ -43 33 -146 154 -110 -249 55 -53 53 -204 84 -6 -111 47 121 -78 -104 16 64 -173 -61 -73 59
2183E9J23k37J62j64j35K67l05K51P8k50J23P0m3Lr4N3N2J86p0lo1J38rj90r1
$$ 59 182 -55 107 -57 -192 75 -230 21 99 -151 -28 42 -1 2 -92 -39 13 199 129 126 65 203 194 4 -87
2208h7j9K00l63L92p2M4j76Q7%J7L9J44k15l58K33qJ43l5J04p6J59K35m31K41
$$ -87 -106 94 -269 123 51 95 -81 6 6 23 62 206 -9 -367 -134 -142 1 -34 70 -6 153 388 -43 198
2232A98k73O5p7J27P1j62q0Pj47L64J43m8j51J41M8k85O5k32M22j27k83J22P6
$$ 198 -75 -10 -87 40 111 -51 -131 -124 -271 93 236 188 37 178 226 -59 6 -226 196 69 -214 -92 -16
2255a6j62L19%l84K22o7L21k54J51j49j00J30o9L12k31K20j81J32m01L6L21j67
$$ -16 -178 141 141 -243 -21 -88 233 -21 130 -19 -119 11 -58 254 23 243 62 194 -207 -171 150 -17
2277a7L5R7j12L0O7j16J09j84l0J47j30K3K89j82O8O4j98J17m9j5R9l05J48m3
$$ -17 18 115 3 33 100 -16 93 -91 -121 26 -104 -81 208 26 94 158 -40 77 28 13 112 -193 -45 -88
2301h8J4L6L7k6p8K15q1j45L8J31j56K4M6j67J00k12K19j67L76l95J88K77j18
$$ -88 -74 -38 -1 -27 -105 110 29 -116 -78 53 -103 -79 -33 -200 -100 -312 -93 -260 116 -279 -91 186 68
2324F8j12J12J75K5k30K46l96K07J23K4l63L71k56j25L25j10j46L02m19k18M91
$$ 68 -44 68 243 268 38 284 -112 95 218 242 -121 250 -6 -131 194 84 -62 240 -179 -397 94
2345I4k82L48r3K39m75M79k50O1j05N6j98K34k6j16K0j24K1J20L3l23J57J58J07
$$ 94 -188 160 67 306 -169 310 60 121 16 72 -126 108 82 -34 -14 -138 -117 3 36 -287 -130 28 135
2368A35J9Nj35p6L86m79K67k79M45j57j83M9k83Q0J42q8N7K24jq8O7j82K19j77
$$ 135 154 159 24 -52 334 -145 122 -157 288 131 -52 -3 -286 -206 -64 -152 -95 129 128 40 107 -75 144 -33
2392c3K12k61m1K45l4j45Q1k44J61L41k63J26j93J03Q2j18Q6Rk72J98k41L00N1
$$ -33 179 -82 -123 122 88 -57 24 -220 -59 282 19 145 -48 55 137 19 105 114 -158 40 -201 99 150
2415A50j13O4J17k72n0k4J39k2J48j99J72p4J54J75n20K41qnK34m0k47Nn7j90
$$ 150 37 101 218 -54 -104 -128 11 -11 137 -62 110 36 190 365 -155 86 78 73 307 267 20 25 -32 -222
2439b22L46n35L74K72j33k19R2J28j90K17k37R7P0k4r6J47k92K24j43qQ8j32J44
$$ -222 124 -411 -37 235 102 -117 -25 103 -87 130 -107 -10 60 36 -60 87 -205 19 -124 -132 -44 -176 -32
2462c2P0R4J1o5Mj6j21M4l2J8J66l98M30q2Q5j29k13L75l57J30M4n8J77K2Pm3
$$ -32 38 132 143 78 82 66 -55 -11 -43 -25 141 -257 173 91 176 47 -166 209 -148 -18 26 -32 145 167 174 131
2488A31r4j45K26j92K54j64Q4J08r7k36j29R5K28J7k12J44o3M7o7J56r0n9J32
$$ 131 37 -108 118 -74 180 16 100 208 111 -125 -254 -159 69 86 -126 18 -45 2 -65 91 1 -58 74
2511G4j17j32K77j16p9K14o3R7k28j74P8q6L55n8l03K76Q1J4k72Q5m4j60M37k19
$$ 74 -43 -175 102 -14 -93 121 58 155 -73 -247 -169 -255 100 42 -261 15 96 110 -162 -77 -121 -281 156 -63
2535f3K49k41RK34j15K33j73j58K97l71J11K0p6qK98k72m7J58j14r1K6Q8J93l31
$$ -63 186 -55 -46 188 73 306 133 -25 272 -99 12 32 -44 -52 246 -26 -73 85 -29 -120 -94 -6 187 -144
2559a44J82j6Q9k3K9l0k64L75j09P5l3Rm60J25K61j03L2p6K06j02J08k46KJ93
$$ -144 38 22 111 88 117 87 -177 198 89 164 131 140 -320 -195 66 -37 -5 -81 125 23 131 -115 -113 80
2583H0K0l8lk13K90k73J89j69K02K37m02N4j29K23L2m3j23J4K81p2k00l0L9P1
$$ 80 100 62 59 -154 136 -137 52 -117 85 322 -80 -26 -155 68 100 57 -66 -52 229 157 -43 -73 -34 37
2607C7O3k86P1L23k54K17n7l2J13m30L83l38J76j64K71J06l02J46l4L7Mo5n7J88
$$ 37 100 -186 -115 208 -46 171 114 82 195 -235 148 -190 -14 -178 93 199 -103 43 9 46 50 -15 -72 116
2631A16k80J89J65j07r8P6j40k2m1L93m85K80K1o9Q2K4l27K07pr3K26j74K37l26
$$ 116 -164 25 190 83 -15 61 -79 -101 -142 251 -234 46 67 -2 80 104 -223 -16 -23 -116 110 -64 173 -153
2655a53J83j93L17p8j55J88k81J62j26K06q0J39Mj59j11m8M65j61j06M9j59p0
$$ -153 30 -163 154 76 -79 109 -172 -10 -136 70 -10 129 133 -26 -137 -185 280 119 13 62 -97 -167
2677a67J12J05J0n8J21j96N3J3j31K69l34m8M01j69k4r1K99j91K6K01N0o7ml43
$$ -167 -55 50 60 2 123 -73 -20 -7 -138 131 -203 -251 150 -19 -43 -134 165 -26 0 201 251 184 180 -163
2701a63L00Mm20L54p7j54J56R9m7p2j85K54Q9p0l70M49l16J8O1j51K17k64J49
$$ -163 137 141 -279 75 -2 -156 0 99 52 -20 -205 49 138 68 -302 147 -169 -151 -90 -241 -24 -288 -139
2724a39J64p7J42p6N9N5o0p4K34j79l84K34K7o5K07j57l8j2K89l7j36J08o9J57
$$ -139 25 -52 90 14 73 128 68 -6 228 49 -335 -101 -74 -139 68 -89 -127 -139 150 113 -23 85 16 173
2748A73k27Qn7J4K24N8k49O3l5J12l0J16j74j00J27j6j8j39K64j0K3k8m14L63
$$ 173 -54 -46 -103 -89 135 193 -56 7 -28 84 54 170 -4 -104 23 7 -11 -150 114 104 127 99 -315 48
2772D8J88j19L6j06n6r5J15Ok66J91L08j48J0j99K17N0k29K18k85J81k6j53J02
$$ 48 236 117 153 47 -9 -104 11 17 -249 -58 250 102 112 -87 130 180 -49 169 -116 65 39 -114 -12
2795a2P1m5l5k9K20K26l65J79l45L31l75J2K05n8n9l0J95l07K69k03R6r8J37M3
$$ -12 59 14 -21 -50 170 396 31 210 -135 196 -179 -167 38 -20 -79 -109 86 -221 48 -155 -59 -157 -20 23
2819B3K3p0J45N0j65j20L79l96K03N4j57J38N2L1J38k43p1k19R7J74M0l0j40K10
$$ 23 46 -24 121 171 6 -114 265 -131 72 126 -31 107 159 190 328 85 14 -205 -108 66 106 76 -64 146
2843A46k5J90m26J88R0l69K83n1k1r0L60k27J36j37Q8l13L25j37n5O6J86n87K24
$$ 146 121 311 -115 73 163 -206 77 26 5 -85 275 48 184 47 135 -178 147 10 -45 21 207 -380 -156
2866a56K41p7J07M2K63n13j23M85j83k17M14j00R4n73K98o3j00K07mk51L97m14
$$ -156 85 8 115 157 420 -93 -216 269 86 -131 283 183 277 -296 2 -61 -161 46 42 -209 188 -226
2888b26L65P6J68P0m87j1O2K8J23n06M88n2K57j69k47M9q5R0J8L8J02k34K65l0
$$ -226 139 215 383 453 -34 -45 17 45 168 -338 150 98 355 186 -61 -12 -97 -7 11 49 151 -83 182 152
2912A52N5j33L2p3j94M49n23J63J93l07K69N7j62Jk11K98j86L55N3m66J21j1R5
$$ 152 207 74 106 33 -161 288 -235 -72 121 -186 83 140 -22 -21 -232 66 -120 235 288 -178 -57 -68 27
2935B7j05p7J81K4k65K62J16J21l20J80j42K16j55j09j41J70j78L82L0l27L44
$$ 27 -78 -155 26 50 -215 47 163 284 -36 144 2 218 63 -46 -187 -17 -195 187 217 -110 234
2956B34k55j17N4P8j40J08P4L9j8O2l07P1R1L56m41O8L39o8k10m2J87j17J71k39
$$ 234 -21 -138 -84 -6 -146 -38 36 75 57 119 -188 -117 -26 330 -111 -43 296 228 18 -24 163 46 217 -22
2980b2J82j34r5j15J80j6j75M17k57l07K07J00l4j49K24J26k77J98K9j1R8k67
$$ -22 160 26 -69 -184 -4 -20 -195 222 -35 -342 -135 -35 -69 -218 6 132 -145 53 82 71 169 -98
3002i8M9j02Q8J12j27L0K55k76O7j08J83j88nj7m7m8Q7N2l15M55k11R0R5M3n9
$$ -98 -49 -151 -63 49 -78 -48 207 -69 -2 -110 73 -115 -120 -137 -184 -232 -145 -93 -408 47 -164 -74 21 64 5
3027Ek71M03j00J33R9k41j66j41K10J09J05k54K88k00j62K47j9l05K30J91j66
$$ 5 -266 137 37 170 269 28 -138 -279 -69 40 145 -109 179 -21 -183 64 45 -260 -30 161 -5
3048eJ11K73k15j83j11J11K56k41J56l50Q9M76m67J91j83j18O9p4J3K10l3rJ4
$$ -5 106 379 164 -19 -130 -19 237 -4 152 -198 -109 367 -100 91 -92 -210 -141 -215 -202 8 -25 -34 -20
3071b0M1P3K4l07L44j25K36m25J38J14K3j32Q9k6l2l3k05J74J29K83k17p0Lj75
$$ -20 21 94 118 -189 155 30 266 -159 -21 93 116 -16 73 47 15 -18 -223 -49 80 363 146 76 79 -96
3095i6J5q6K14L23m56O3j01M04k44M3j65K15n8R0m4J40k01l22L78k09J3J73Jl51
$$ -96 -81 -167 47 370 -86 -23 -124 280 36 79 -86 129 71 161 117 257 56 -266 112 -97 -84 89 90 -261
3119b61K54J4Lo6J66q8o8j29O6J12J09m56P21j32N5n44N46m29K27J49n25K92j68
$$ -261 -7 7 10 -56 110 22 -46 -175 -109 3 112 -344 377 245 300 -244 302 -127 100 249 -276 16 -152
3142a52Q3n7K08p3j67L93m42L28l63K77n4q2K69k85K6K03Q2j03j32k83L81j53
$$ -152 -69 -126 82 9 -158 235 -207 121 -242 35 -19 -101 168 -117 -91 112 194 91 -41 -324 57 -96
3164i6J77k20p7K87j81L5J86k27J12J8j2J05j08L17n14K52K2K08m19K39L6k49
$$ -96 81 -139 -216 71 -110 -75 111 -116 -4 14 2 107 -1 316 -198 54 76 284 -135 104 140 -109
3186a09K68k73K16Ml39J00K78k93M5K56K05j00j98J97q2k37J0K49k12K96j16q
$$ -109 159 -114 102 106 -233 -133 145 -148 -103 153 358 258 60 257 175 -62 -52 197 -15 281 165 157
3208A57q1o8j3l8Rk59N99m0l60K91j30m1k95K24J49m2l6p9O6j07j79J45J34k03
$$ 157 76 8 -5 -43 -34 -293 306 266 -94 197 67 26 -269 -45 104 62 26 -53 13 -94 -273 -128 6 -197
3232a97K19m2P9j94n6J72L7j73K41N0N4k96K8K45M5j29n5K6Pj07j21K39O0J19
$$ -197 22 -20 59 -135 -191 -19 18 -155 86 136 190 -106 -78 167 212 83 28 54 61 -46 -167 72 132 251
3256B51k71m2Q8lk35N9J67k8j14J89j9k0j91K78K3J33l45Q9J36Lp3k74L28j15
$$ 251 -20 -62 26 23 -212 -153 14 -14 -128 61 42 22 -169 109 132 265 -80 9 145 148 75 -199 129 14
3280A4k1J55j94N5Q9K69k26k6k90Q9m2N3Q6O0n4N4j56j23J22K62j01j32lk3J99
$$ 14 -7 148 -46 9 98 367 141 115 -175 -86 -128 -75 11 71 17 71 -85 -208 -86 176 75 -57 -60 -83 116
3305A16q4j16K68k09l9K58m7p7j24K26k48r1K45j25J93m50K76J71k52MK56k65
$$ 116 32 -84 184 -25 -64 194 147 70 -54 172 -76 -167 78 -47 146 -304 -28 143 -109 -105 151 -114
3327a14K8j76L93k44N4j99K44N7l0Q9n4%L8k06J51M72o49j13J66q0J02J4L9K44
$$ -114 -86 -262 131 -113 -59 -258 -14 43 13 102 48 48 86 -120 31 503 -146 -259 -93 -173 -71 -57 -18 226
3351B26m49q1M65j50j36K51j6j99N51o92L40L5k25Q3J48o7k09J05K05k46J23j86
$$ 226 -223 -304 161 11 -125 126 110 -89 462 -230 110 145 -80 3 151 84 -125 -20 185 -61 62 -124
3373a24l9j8rK97j51j76Q7o7o9N52m01j42J17R3K6K39m2m04L10K37m47K12n6j38
$$ -124 -163 -181 -190 107 -44 -220 -133 -200 -269 283 -118 -260 -143 -50 -24 215 173 -231 79 316 -131 81 25 -113
3397a13R7J42k33rK0L35k51OR4k02J45O2n4j42R1j67k9L87k27k53K77O8l92J11
$$ -113 -16 126 -107 -116 -96 239 -12 -6 88 -114 31 93 39 -103 -12 -179 -208 179 -48 -301 -24 44 -348 -237
3421b37K44j23LL62k34j45J86L1J48r9j67n9J15J36k66k4J34j16J80j64J18O9
$$ -237 7 -116 -113 249 15 -130 56 87 235 136 -31 -90 25 161 -105 -129 5 -111 69 -95 23 92
3443I2j29K42k97k24J22K60k8j19R6K1J67k61J65Ml89L54j84O7k19L67J2n6j22
$$ 92 -37 205 -92 -316 -194 66 38 -81 15 36 203 -58 107 111 -278 76 -108 -41 -260 107 119 63 -59
3466e9L26l37l1K41N7n07M50j21O9R3j62j9r7J60k61J75P2J47l1m96K78J74j79
$$ -59 267 -70 -101 140 197 -310 140 19 88 181 19 0 -97 63 -198 -23 49 196 165 -331 -53 121 -58
3489e8J93N8K8r6k1p6K02l66J95J8R5k91J08L7o2lJ24p6j67J47M7O4jk37J17Q9
$$ -58 135 193 221 125 104 28 230 -136 59 77 172 -119 -11 26 -36 -39 85 9 -158 -11 36 100 99 -138 -21 68
3515F8K3J07j17K4k05M09k31j14J98k82J96J34m99N67j50P8l95P7J26k39J10J21
$$ 68 91 198 81 105 -100 309 78 -36 162 -120 76 210 -289 278 128 206 -189 -112 14 -225 -115 6
3537FJ12j65L2OJ0r7J15p5R3r6J09l6PR9j85L01j93J54r6l12K42N5M8m84J86j02
$$ 6 118 -47 -15 -9 1 -96 19 -56 37 -59 50 14 21 120 -65 236 43 197 101 -211 31 86 134 -350 -164 -266
3563b66O7K66j44J43j59rR1J20r1jJ25j52K16m44K11J15j27P4m09L48m0J26m7
$$ -266 -199 67 -77 66 -93 -102 -11 109 18 17 142 -10 206 -238 -27 88 -39 35 -374 -26 -66 60 13
3586A3J45ok76N79m77Q9q1R7n9n4O4k49O5K97O2k97K22k76K02o3j5K88k23J57
$$ 13 158 152 -124 455 -22 67 -14 83 24 -30 34 -215 -150 147 209 -88 134 -142 60 -3 -18 270 47 204
3610B04k35PR4p2q6J73k83l0K63Q9q7j23l4M07j30j05j71M4K51l47J16J13K06
$$ 204 -31 -24 70 -2 -88 85 -198 -228 35 124 37 -86 -120 287 157 52 -119 -75 176 -171 -55 58 264
3633B64j19j83J59j17k69L09k37N04k76K0j21J44r7j87M16o5L6j38K28l62M8J10
$$ 264 145 -38 121 4 -265 44 -193 311 35 55 -66 78 -19 -206 210 145 181 43 271 -91 -43 67
3655F7j36J15J70j15L9l57J84N44o13l71K33M56k78J51m17k68L14N02l02P9J11
$$ 67 -69 46 216 101 140 -217 -33 511 -102 -473 -240 216 -62 89 -328 -596 -282 220 -82 -3 108
3676A08K89m71K7J27k26K03l82J31L86j99j01K85j33n9l5P5Rp5J1R4j42J29k8
$$ 108 397 -74 -47 80 -146 57 -325 -194 192 -7 -108 177 44 -15 -50 25 34 -41 -30 64 -78 51 23
3699B3j22K81kj52P3p7j41Q3q8K20j56J38m9q7o1L7K51n5m03K14k1J55j37p4j3
$$ 23 -99 182 180 28 101 24 -117 -34 -122 98 -58 80 31 -56 -117 -80 171 116 -287 -73 -94 61 -76 -150 -163
3724a63J78k14K21k58M27p1n73L15lo0K34L79K8k85j01L39m50J08m30N16q4k0
$$ -163 15 -199 22 -236 191 120 -453 -138 -141 -201 33 412 440 155 54 393 -57 51 -379 137 53 33
3746C3j62l19K96n4J29K34k72J75J3o0n4j1K25k04K67k75J56m1k07Q2J1J41O2
$$ 33 -129 -448 -152 -206 -77 157 -115 60 73 13 -41 -52 173 -31 236 -39 117 76 -131 -49 -38 103 165
3769A65j97J03L4N0l19K32k28L51k9j80l38J91K91L7k05O1n8k91M22k49l3N40
$$ 165 -32 71 105 155 -164 68 -160 191 162 -18 -356 -165 126 163 -42 19 -39 -330 92 -157 -190 350
3791C50j62l21M1K27j14j74N4J70L3P7m03K36j84R2K28k00P2k37l98L66J41L53
$$ 350 188 -133 -92 135 21 -153 -99 71 104 181 -222 14 -170 -78 150 -50 22 -215 -613 -247 -106 247
3813B47K12m30K59M44j448J63M75N4J55p92M40N08m80r2N29O05j440N89j54p83
$$ 247 459 29 288 732 -716 -553 -78 -24 131 -661 -221 287 -193 -285 244 849 -591 -2 -156 -939
3833i39J07J542j495O6M66q30L43J500n78j74L43j596K79Q62N23k38p85P25O54
$$ -939 -832 710 -785 -719 -253 -1083 -740 760 182 8 351 -1245 -966 -104 419 181 -604 121 775
3852G75n83p08%J122n34j78O86r53J97N29m59P6n02R28p53Q4l73J039L99j276
$$ 775 192 -516 -516 606 72 -106 580 -373 -176 353 -106 -30 -532 396 -357 -273 -646 393 792 -484
3872d84M53j59J21L09r53Q02j204J258P3L50l41r0J30K94l40n94K62j54N68j60
$$ -484 -31 -190 -69 240 -713 89 -1115 143 216 566 225 135 265 559 219 -375 -113 -267 301 141
3892A41N16m47m98J089j188N81N03l40p26K84N30n71l8r4O47j73m46L63J19j19
$$ 141 657 210 -288 801 -387 194 697 357 -369 -85 445 -126 -164 -258 389 216 -230 133 252 133
3912A33O23j330M9O21o9J87kk14or7rq2N46r98J231p86J33M81p25J256j039O4
$$ 133 756 -574 -525 96 27 214 212 -2 -8 -105 -114 -196 350 -648 583 -203 -70 411 -314 942 -97 -33
3934c3JK67K33j70P69j439LP78k28n96P11P5p60N32q87N56K1l29K87N2L15mK92
$$ -33 -32 235 468 298 1067 -372 -369 409 181 -415 296 371 -389 143 -744 -188 -167 -496 -209 -157 158 154 446
3957D46m90n75J074k63m00N74n42J23k14O75J67o7j39L02q89k7P75j080L07K54
$$ 446 -44 -619 455 192 -208 366 -176 -53 -267 408 575 508 369 671 -218 -245 530 -550 -243 11
3977A1K1J80q02K65Q7P55l99J05o7r33J119j47r40J055K22o38M60K4q85o59K238
$$ 11 32 212 -590 -325 -238 517 118 223 156 -777 342 195 -745 310 532 -106 354 378 -507 -1166 1072
3998A072j732o6O37l81O74l49M94N90j018J21j20J34o35J291j045j22N31L3o37
$$ 1072 -660 -726 -89 -470 204 -145 349 939 -79 42 -78 56 -579 712 -333 -455 76 109 -528
4017e28K74J09J037j348K31P0l43J35J08j53Q58J87r04k57J82M57P02k93j092
$$ -528 -254 -145 892 -456 -225 -155 -498 -363 -255 -408 450 637 -267 -524 -342 115 817 524 -568
4036e68K78k03J197q61j272Q98N48o37J149p07J3M11j493M76Q70o48Q43l65K75
$$ -568 -290 -493 704 -157 -1429 -531 17 -620 529 -178 -165 246 -1247 -771 99 -549 294 -71 204
4055B04N08j652N17J76l38J069J33j828L41P51L09q67P40l35O1n93L98O04l99
$$ 204 712 -940 -423 -247 -585 484 617 -1211 -870 -119 190 -677 63 -272 -211 -804 -406 198 -201
4074b01o1O36l80L36o85Q46l35j38j3P1n5l28K60n0n73M96N04q43J268m10m67
$$ -201 -262 374 -6 330 -355 491 156 18 5 76 21 -307 -47 -97 -670 -174 330 -513 755 345 -122
4095a22N79r60P8K10J90J17P7o07k43K13M63l67M26k35Q9R6J60r51M95q0O87N68
$$ -122 457 -503 -425 -215 -25 92 169 -438 -681 -468 -5 -372 54 -181 -92 4 164 -787 -292 -372 315 883
4117H83j066m28J091m05o75R54m41M41l41J36j79j24K8L38o8p84R85m36N08o08
$$ 883 -183 -611 480 75 -600 354 -87 354 13 149 -30 -154 -126 212 144 -640 345 -91 417 -191
4137a91L06m76K90J11r0l41R60m64o25Q93q3J00j53J43k55j233J227J48k37j02
$$ -191 115 -361 -71 40 -50 -391 569 105 -520 373 290 390 237 380 125 -1108 119 267 30 -72
4157g2K18J27K03o28q1r3K43J84M60o40N59m6j012J091o74j68l1k99Q25Q03q91
$$ -72 146 273 476 -152 -233 -326 -83 101 561 -79 480 434 -578 513 -161 -329 -360 -659 166 969 78
4178G8l05Q54L92j94o73n3m0k92O03j97j05Kj73n4J12R5m6j1rJ14j00J82k68J36
$$ 78 -227 627 1019 825 152 99 59 -233 370 173 68 70 -103 -157 -45 50 4 -7 -16 98 -2 180 -88 48
4202D8J06l77K00p2R2K80l55K10j31j36oj2j7k2O1K35m0r9j3nj7k78K73m4O6P3
$$ 48 154 -223 -23 -95 -3 277 -78 132 1 -135 -141 -153 -170 -192 -131 104 64 -35 -48 -53 -70 -348 -75 -119 -53 20
4228B0K1j38J90r2k57N2K05J09j40J83k93K7K03k32J36k6O2p2o2J59J0j33K4m6
$$ 20 41 -97 93 1 -256 -204 1 110 -30 153 -140 -113 90 -142 -6 -32 30 -42 -104 55 65 -68 -44 -90
4252i0K68l12J38j62M44l38m4L8o7J50j21%r4L45j28r2M44k01k84J31J7K84m25
$$ -90 178 -134 4 -158 286 -52 -96 -58 -125 25 -96 -96 -190 155 27 -65 379 178 -106 25 42 326 -99
4275i9J03O9l16J33J8J45K28k24m7K8j71K85l06J36Q8j35J86j53J96j75L11l85
$$ -99 4 73 -243 -110 -92 53 281 57 10 38 -133 152 -154 -18 70 -65 121 -32 164 -11 300 -85
4297h5n5N0O7m21L29J32m5O9j13R7J43P1j77P3l23mK59j22j7n1R6K08l07J47J40
$$ -85 -140 -90 -23 -444 -115 17 -28 41 -72 25 168 239 62 135 -188 -192 67 -55 -72 -123 -27 181 -126 21 161
4322A61k6k3m45O35l58K44M2j50J9N2p1j92J44J21p3K8l8j36J56o1j42J23K5K11
$$ 161 135 112 -333 302 -56 188 230 80 99 151 80 -112 32 153 80 108 70 -66 90 29 -113 10 35 246
4346B46j21j65j4j6LJ54k7o8k4K8P0p6L70k36l35K13L10k80J68j87j51k34K04
$$ 246 125 -40 -54 -70 -67 87 60 -8 -32 -4 66 -10 360 124 -211 2 312 32 200 13 -138 -372 -168
4369a68J22R4j31K54j40J17k37J90m40L37J27l15K90K4k27M0j1J23j7k73K36j75
$$ -168 -46 48 -83 171 31 148 -89 101 -339 -2 125 -190 100 124 -103 -63 -74 49 32 -241 -5 -180
4391a80J81k32J66J59k79L11m64N69nj01K4m06L65k29K06p0P8r1r5o0J34J92q0
$$ -180 1 -231 -65 94 -185 126 -338 231 226 125 149 -257 108 -121 85 15 93 2 -93 -153 -19 173 93
4414I3j6k13o1n9M93j26k53r0j06M56k69J93j11J67l72M79l89M6L47k06Kj56J69
$$ 93 77 -136 -197 -256 237 111 -142 -232 -338 118 -151 42 -69 98 -274 205 -184 -138 209 3 5 -151 18
4437A8p4J36j53R5%J26j24M4m81N70m5J0j0k24J71R3j21j08j70L07J5k1j20n3
$$ 18 -56 80 -73 22 22 148 24 68 -413 157 112 122 112 -112 59 152 31 -77 -247 60 75 54 -66 -119
4461a19l0K93m26K90j99P2J66k21K11M14n20K24j9j04M6n1R9k46O8j0p1J02J79
$$ -119 -149 144 -282 8 -191 -119 47 -174 37 451 -69 155 136 32 78 27 126 -120 -52 -62 -133 -31 148
4484A48r5Q7j67P1r1pL04l50J68k33j86L30m8J37J13J49k72o1o0q5J09K15P7p1
$$ 148 53 140 -27 44 -47 -54 250 -100 68 -165 -351 -21 -69 68 181 330 58 -3 -63 -148 -39 176 253 182
4508A82j03l32M81p9j44j74J94R9r6R5j24j5m0o6J67O6j44k06K12J4rp3j22M81
$$ 182 79 -253 228 149 5 -169 25 124 28 123 -1 -16 -56 -122 45 111 -33 -239 -27 -13 -22 -95 -217 264
4532B64n28N9J18J06j98K67o6j70J50Pj68K02J04l5J59j78k3q6L64l73J59j51
$$ 264 -264 -205 -87 19 -179 88 22 -148 2 9 -159 43 147 112 271 93 70 -16 348 -25 134 -17
4554a7Q4J4q7j16J39J46j75L33k19k25L15k46j04k5J86J1r1p7J53N9k33L96k85
$$ -17 67 81 -6 -122 17 163 -12 321 102 -123 192 -54 -158 -183 3 14 -77 -154 -1 58 -175 221 -64
4577f4J31P9n1n3m8J08k09j09L37j52j33L06m8j82K65j20m13N08l6k13K01p3k98
$$ -64 67 146 95 42 -6 102 -107 -216 121 -31 -164 142 94 -88 177 57 -356 152 116 -97 104 31 -267
4600b67K25j46J91J88j65m5J10k97l8M07k74J66l2l7O9r9K5J18j52J13j21K0j15
$$ -267 -42 -188 3 191 26 -19 91 -206 -244 163 -111 55 23 -14 55 -44 -19 99 -53 60 -61 -41 -156
4623a56R9K21Q2j66q7j6j99K02j59J11J37j7j9l18J40J19N1Q7q2J06k67n4k2r1
$$ -156 -57 164 246 80 -7 -23 -222 -20 -179 -68 69 52 33 -285 -145 -26 25 112 30 136 -131 -185 -207 -298
4647b98L68j36J32l42K72J6MN4j98N17k51M7k55n9K30K0j19K06r3r4K05j24r0
$$ -298 70 -66 66 -276 -4 12 16 70 -128 389 138 185 -70 -129 101 121 2 208 115 21 226 102 12
4670A2j4j64J9J89R0o4m9j05p8J33J89j61j69L32k50K1n4j55L15oJ37o4j54j12
$$ 12 -2 -166 -147 42 132 68 19 -86 -164 -31 158 -3 -172 160 -90 -69 -123 -278 37 31 168 104 -50 -162
4694a62j46M43p1L70n63M03k77P6K30j94l87K88P8K15j67j84J02j18J25k72L46
$$ -162 -308 135 64 434 -129 274 -3 73 303 109 -278 10 88 303 136 -48 54 -64 61 -211 135
4715A35k59J68J51n8l24J56P0j89J79J27l49J04J80n6j3k47K18j1k0P7k90n8K53
$$ 135 -124 44 195 137 -187 -31 39 -150 29 156 -193 -89 91 35 22 -225 -7 -18 -38 39 -251 -309 -56
4738e6N7J39P1j68P5m68L55R4l32J45J89j67R4On7J12o5P9j71K97j6k53J48p6
$$ -56 1 140 211 43 118 -350 5 99 -233 -88 101 -66 28 34 -23 89 24 103 -68 229 213 -40 108 32
4762C2J0O8k58J51l2l0M1j24JK02j55k20K99K27N6p29N87Q6l17J42j74K98j20
$$ 32 42 110 -148 3 -29 -59 -18 -142 -141 61 -94 -314 -15 212 268 -461 126 212 -105 37 -137 161 41
4785D1N2j86MP7J30m4r8j05OL6J39pM1j91Kp0K50K11j90j95l6J45Lj6J69l30L88
$$ 41 93 -93 -89 -12 118 74 -24 -129 -123 -87 52 45 86 -105 -103 -173 77 288 98 -97 -133 12 15 -1 168 -162 226
4812B26j83p8N32o57J03M6j84M20r7l48L02OM2l92K06k2J00j9o6J04L6l39L80
$$ 226 43 -35 497 -160 -57 -11 -195 225 128 -220 82 88 130 -262 -56 -78 22 3 -63 41 77 -262 118
4835A18l21L53l54K60Oj93l9o1J20o3J26J24k14j18L26pL31m95J9j33K11j11L7
$$ 118 -203 150 -204 56 62 -131 -170 -231 -111 -174 -48 76 -138 -256 70 63 394 -101 -82 -215 -4 -115 -78
4858g8K75j28O5n7J62m48K73M5N4K6m21K06J96l53M5K04k53L97k19J61j67j7r6
$$ -78 197 69 134 77 239 -209 64 109 163 189 -232 -26 170 -183 -138 66 -187 210 -9 152 -15 -32 -128
4881a28q6K11J15k66J85r2L4R9P2j76k7J35N6J40l42m4J75J54l18L15k36j0L51
$$ -128 -214 -3 112 -154 31 -61 -27 72 144 -32 -59 76 132 272 -70 -114 61 215 -103 212 -24 -34 317
4904C17n04L76j62j52L04l14R6p7P2P1l65M00p6l9J22j88M9j22J93R3p9L7j53
$$ 317 -187 189 27 -125 179 -135 -39 -116 -44 27 -338 62 -14 -53 69 -119 -70 -192 1 94 15 52 -101
4927a01k07N40k3k95j23K37p5J87m9j40K00M4k6k43M6K15n7j16M6r8N7J54j40
$$ -101 -308 232 209 -86 -209 28 -47 140 91 -49 151 195 169 -74 -28 187 130 14 60 -38 19 173 33
4950C3L5p2nJ8k91K41P4j1k99L57o4j09M15j62L5k48J32l49K90j04K60J01r1q0
$$ 33 68 -4 -9 9 -282 -41 33 22 -277 80 16 -93 322 160 195 -53 79 -270 20 -84 176 277 186 106
4974A06j07N3j76j16L40j70k9O4Q4K17m93K83J2o2J67k90k99M43o7J36r9K17k86
$$ 106 -1 52 -124 -240 100 -70 -99 -35 49 266 -227 56 68 6 173 -117 -416 27 -40 96 -3 214 -72
4997g2K40J26m83M09k45M1o5J5j97K18l8J06l73L15L38k64J41k77P9L7l6J22j76
$$ -72 168 294 -189 220 -25 16 -49 -34 -231 -13 -51 55 -318 -3 335 71 212 -65 14 51 15 137 -39
5020c9L9n5K8K26q9j35j53K94k92J79J37j41L28m27N9j82K12l9Q4k84P6O5n0L78
$$ -39 0 -55 -27 199 110 -25 -178 116 -176 3 140 -1 327 -100 -41 -223 -11 -50 34 -250 -174 -109 -159 219
5044B19l12J94k2J33k6l63L51n2P9l48P2j8L2K49l7Q6m27L01m0J72j68OK3m5K30
$$ 219 -93 101 79 212 186 -177 174 122 201 -147 -75 -93 -61 188 151 237 -190 111 71 243 75 81 104 59 289
5069B89m15J84j79J98j06J02K23j88l8k55J15J11j38L31l14J3K28j47j6J95j43
$$ 289 -126 58 -121 77 -29 73 296 108 70 -185 -70 41 -97 234 -80 -67 161 14 -2 193 50
5090E0r1l02L33J31k81KP2j40J82J00J26K09l96K4P7p7N1k08J91j90o8J15J81
$$ 50 -41 -343 -10 121 -160 -158 -86 -226 -44 56 182 391 -5 19 96 19 70 -138 53 -137 -205 -90 91
5113I1L2j50lK11k80j46J43N0l8Q3J21r1J4K6R3j58j63J17mK2N8j88M03k04P4
$$ 91 123 -27 -30 181 -99 -245 -102 -52 -90 -7 114 23 37 63 156 -2 -165 -48 -52 -30 28 -160 243 39 113
5138A13K18l47q4Q4J75j9m34J58KL14l39J43j0K02r3l3K12k19O4j97J97k77O5
$$ 113 331 -16 -100 -16 159 140 -294 -136 -134 180 -159 -16 -26 176 83 50 262 43 107 -90 107 -170 -105
5161a05J87Q7k3o9j93M2J37k70K69K26k56j15J57M4j00j9k7K8J5j22M9J54o0k38
$$ -105 82 169 146 77 -116 -74 63 -207 62 288 32 -83 74 118 18 -1 -28 0 15 -107 -58 96 36 -202
5185b02Q3J92j46J30O9o0R0L9r3k23K11j00l1m4N2K50l01K73m02J44J48j57P8
$$ -202 -119 73 -73 57 126 66 156 195 102 -121 90 -10 -41 -85 -33 217 -84 189 -213 -69 79 -78 0
5208@J9k6K10o9J43j23m28N38k86j83K88J95m47o7J60J61L4j81J55Q4l05P8K7
$$ 0 19 -7 203 134 277 154 -274 264 -22 -205 83 278 -169 -236 -76 85 119 -62 93 177 -128 -50 -23
5231b3J55p9j81K94k32L6r8J27j9k1J21o1l5K05n50J79K68j56L36k3l02M3K19
$$ -23 132 53 -128 166 -66 -30 -128 -1 -20 -41 80 19 -16 189 -361 -182 86 -70 266 243 -59 -16 203
5254B03p6q6l2k86K96J74m15J74J11j67PJ46L8k26K54p3J0q3k35M80k90J28j28
$$ 203 127 41 9 -277 19 193 -222 -48 63 -104 -97 49 87 -139 115 42 52 -31 -266 214 -76 52 -76
5277g6K57q3j20j6OK48k39l7K71k63R4kO8k00j82K28O2L9l02J48K1L09j55k47
$$ -76 181 98 -22 -38 -32 216 -23 -60 211 -52 42 40 108 -92 -274 -46 16 55 -247 -99 -78 231 76 -171
5301a71K57q5n7RJ33k90J30K42k18P3p1L55l78J63j69K39k77l6J73J59j10k77
$$ -171 86 1 -56 -47 86 -204 -74 168 -50 23 -48 307 -71 92 -77 162 -115 -151 22 181 71 -206
5323b06K77j45q5L21k60lM2m1K9QL8R0n2n8r4L18j04q5j10K84l33K71j46j76K98
$$ -206 71 -74 -159 162 -98 -101 -59 -100 -71 -63 -25 65 13 -45 -139 179 75 -10 -120 164 -169 102 -44 -220 78
5348G8k19J38M0J55l37K42P7j95j22R4J1k5L04P0j75k95J21J95l0q7k91Q3Q1L63
$$ 78 -141 -3 37 192 -145 97 174 -21 -143 -49 -38 -63 241 311 136 -159 -38 157 127 40 -251 -168 -87 276
5372B76l35q9L7J17K43j42J6p8o7J27j30k9L5k82K50p9Q9j69K86k71N5K33l10
$$ 276 -59 -148 -111 6 249 107 123 45 -22 105 -25 -54 -19 -301 -51 -130 -41 -210 76 -195 -140 93 -217
5395b17L57o3J64l59K10l0j6l42M30l37O3K86k57L21k66j7P8j40J27J6j64Q8j67
$$ -217 140 77 241 -118 92 62 46 -296 134 -203 -140 146 -111 210 -56 -73 5 -135 -8 8 -156 -68 -235
5418b35M02j33q3Q4j38R1L8j84J89j06P4jj12J08j5L6J94m02L24j66J52j91j42
$$ -235 167 34 -49 35 -103 -12 26 -158 31 -75 -1 -2 -114 -6 -21 15 209 -193 131 -35 117 -74 -216
5441b16K80O3k75k6J57j00j5J40j74J39N5j18P3J21k5j90J90j23j91J21O6P4J47
$$ -216 64 127 -148 -174 -17 -117 -132 8 -166 -27 28 -90 -17 104 79 -111 79 -44 -235 -114 -48 26 173
5464A73j04k36J40j98L1L01L3l18K41j09j80J83J47o6K02l80k1K92j47p9K30k99
$$ 173 69 -167 -27 -225 -194 107 140 -178 63 -46 -226 -43 104 38 240 -140 -161 131 -16 -95 135 -164
5486a64L15k75K70L9k51N5J16j51j02k2K25j53L9l42M82j63RJ82j75Kn1O4O5k3
$$ -164 151 -124 146 185 -66 -11 105 -46 -148 -170 55 -98 -59 -401 81 -82 -73 109 -66 -64 -115 -51 14 -9
5510io8N7Q3J73l73L00k56j60oM79l75J06JJ07P4j63L2j88M31l24J86j11K67j75
$$ -9 -77 -20 63 236 -137 163 -93 -253 -259 220 -155 -49 -48 59 133 -30 2 -186 245 -79 107 -4 263 88
5534H8p5k0r5P9J05kk77L21j33QJ32P6j39J76m27J71o4K23J39j39j14j59j1r7
$$ 88 13 -7 -102 -23 82 80 -197 124 -9 -1 131 207 68 244 -183 -12 -76 147 286 147 33 -126 -137 -234
5558b34m9L11K91n97L19O2l34K31m3R0R0k04k29L97m7j01J57k33O9k43J86J18
$$ -234 -283 28 319 -278 41 103 -231 0 -43 47 137 -67 -296 101 54 -47 110 -123 -54 -297 -111 7
5580Gj54L51k06n5j78L20m0j64oK82k69kr1K31L5j16mK04j03j18O4j96J89J60
$$ 7 -147 204 -2 -57 -235 85 45 -119 -125 157 -112 -114 -205 26 61 -55 -59 145 42 -76 -12 -208 -19 141
5604A41k81L4K43j2j06l0oJ0j62K15J15j08K00k83P0j7K69Jm53L97m99P6k73M86
$$ 141 -140 -106 137 125 19 -11 -17 -7 -169 46 161 53 253 -30 40 23 292 293 -160 237 -262 -186 -459 27
5628B7M18o15K52j44J50j40QN4O7k71K53j42o1j5RJ23J08jJ70j98k8L0j8l93N55
$$ 27 445 -170 82 -62 88 -52 -44 10 77 -194 59 -83 -144 -159 -150 -27 81 80 250 52 24 54 36 -357 198
5653A98m96L86j30j03j12p5L42l35L53m5p7J76Jl8l27K59k8J51n8l58O90N3n16
$$ 198 -298 88 -42 -145 -257 -332 10 -325 28 -17 -94 82 83 45 -282 -23 -51 100 42 -316 374 427 -89
5676h9J24O19N42l09j177P27j209N75l35J168k80J02j089M02K99k37l93J09j34
$$ -89 35 654 1196 887 -290 437 -772 -197 -532 636 356 458 -631 -229 70 -167 -560 -451 -585
5695e85N84j58O51q90K41K3n6P88q00o8P17J88K22q21K4N5K41k12l9M24l93R2
$$ -585 -1 -159 492 -398 -157 -134 -190 598 -202 -270 447 635 857 36 60 115 356 144 105 529 136 228
5717B28k04J45j4k29Q7m2k75J24L4M2J90j32N7n0k90L82j58J4O3k08J83P8r1N2
$$ 228 24 169 155 -74 13 -29 -304 -180 -146 -104 86 -46 11 -39 -329 53 -105 -91 -28 -236 -53 25 -66 -14
5741a4J51k66N1L03n5k02k3l7K39k76q6J10rJ06K58l70L02m24K43K18k05jj14
$$ -14 137 -129 -78 225 170 -32 -55 -92 147 -129 -215 -105 -114 -8 250 -120 182 -242 1 219 14 13 -101
5764a01N4J16j42j71N76o48L65O0k91nK91k6p9P4k83K49k08M08l78K06q0J88k15
$$ -101 -47 69 -73 -244 332 -316 49 109 -182 -187 104 78 -1 73 -210 39 -169 239 -139 67 -13 175 -40
5787d0O2l6M9M6J02m2Jj87j54K71m9k60L32j14k52N15l03q8l8L78k16J36q7j04
$$ -40 22 -14 35 81 183 141 142 -45 -199 72 23 -237 95 -19 -271 244 -59 -147 -185 193 -23 113 26 -78
5811g8K43j64q2j0K31j06j61J35l08J47L69n47N69n12K08K57Ro4r9Q6k41n7K4
$$ -78 165 1 -81 -91 140 34 -127 8 -300 -153 216 -331 238 -274 -66 191 200 136 37 123 -118 -175 -151
5834a51K47L1N7j13j29J4k43Q03l73k50K78J2m08K64j1K42k11j75N87n10M2k26
$$ -151 96 127 184 71 -58 -44 -287 516 143 -107 171 183 -225 39 28 270 59 -116 471 -39 3 -223
5856b23K54k6n0r5J04J78j04M2k8mm2K51k95M0j24J97j28j10J00R5Mn5q1l1M0
$$ -223 31 5 -45 -140 -36 142 38 80 52 48 6 257 -38 2 -122 75 -53 -163 -63 32 36 -19 -100 -131 -91
5881i1oK02j20m0R4j59N9M0r8K69j31J01J16l37k1J20j22R1j60K50l32R9J21j36
$$ -91 -97 105 -15 -55 39 -120 -61 -21 -119 150 19 120 236 -101 -122 -2 -124 -33 -193 57 -275 -176 -55 -191
5905a91J99j12m9o9K08j37J64L0j33K41j15k8j6K18n55L05j10K8M1K37j58M3n4
$$ -191 8 -104 -153 -222 -14 -151 13 43 -90 151 36 8 -8 210 -345 -40 -150 -122 -81 156 -2 41 -13
5928a3L2J23k87M7l46O42j93j28O1J31k35l5K14j20K27j30j50L49j28p5J09j61
$$ -13 19 142 -145 -98 -444 198 5 -123 -62 69 -166 -201 13 -107 120 -10 -160 189 61 -14 95 -66
5950f6K34o7k23Lo2J12p3J35o9j00J89j50K07J03R0l85R4J52k80K7L1n8J09M4
$$ -66 168 101 -122 -119 -181 -69 -142 -7 -76 -176 13 -137 70 173 263 -122 -28 124 -156 -129 -98 -156 -47 -3
5974cj16j14J19J12j36J39K7kj41K63j92J90Q5k97K48N3k13J76j65o2J16j63j43
$$ -3 -119 -233 -114 -2 -138 1 28 26 -115 148 -44 146 231 -66 182 235 22 198 33 -29 87 -76 -219
5997b19k2M2l5L16J73l12k22K69J19O1j73J0j34J30m4lK48j88L8PKL2m2j04J10
$$ -219 -241 -199 -234 82 255 -57 -279 -10 109 170 -3 7 -127 3 -41 -44 204 16 54 61 63 95 53 -51 59
6022E9j81P4j39O9J64j6r0J23j88J04j6J44n4k8n9K63q0k02N9NJ28QL8j48K93
$$ 59 -122 -48 -187 -118 46 30 -60 63 -125 -21 -37 107 53 25 -34 229 149 -53 6 11 139 147 185 37 330
6047C30n22J57K14M7m81K52J37j72J87k26J84P7r2K2l77K15k3J73j86J36J49k46
$$ 330 -192 -35 179 226 -255 -3 134 -38 149 -77 107 184 92 114 -263 -48 -71 102 -84 52 201 -45
6069d5j09K46m5k06P9j22J56j31J99L4j82j64J90j8K36j68NJ7K4L1J30p5k72J79
$$ -45 -154 92 47 -159 -80 -202 -46 -177 22 56 -126 -290 -100 -118 118 -50 -45 -28 -4 27 157 82 -190 -11
6093a1J62j24K3p8P7O9k31R7k09K26K06j87Q1l6J28l07NmJ10m5L8o7L3NL49m43
$$ -11 151 27 50 -28 49 118 -113 -16 -225 1 207 20 101 65 193 -114 -109 -113 -3 -48 -10 -77 -44 -39 310 -133
6119a33K07q1L3o6K82l29j13Q6J23j14JJ86p9j87J89J08j96K80m37K15Q2k14k8
$$ -133 74 -7 26 -40 242 -87 -200 -114 9 -105 -104 82 3 -184 5 113 -83 197 -240 -25 57 -157 -185
6142a85M12k68L29K6l49J26r8j10K70l53P7j52L52n6P5k72K79q6q8P5j6K61k56
$$ -185 227 -41 288 314 -35 91 -7 -117 153 -200 -123 -275 77 21 96 -176 103 17 -71 4 -12 249 -7
6165gj52J46m9q6J50p4J62N8l15K10p1j44K71k23K14j66J64l13J81J08Q3k04K73
$$ -7 -159 -13 -62 -148 2 -72 90 148 -167 43 -28 -172 99 -124 90 -76 88 -225 -44 64 147 -57 216
6188B16m16J86O2l02J99K22Q1l65L81l66L67j98o8K23l1j89o0J65j16Q3j24j7
$$ 216 -200 -14 48 -254 -55 167 248 -117 264 -102 265 67 -1 222 191 2 -58 107 -9 74 -50 -67
6210f7o1K59j01J9k96J56kJ51o0M2l5Q4R7k80K13J07k73L7j14N3Q7P3j93J61k1
$$ -67 -128 131 30 49 -247 -91 -93 58 -2 40 5 89 186 -94 119 226 -47 -10 -124 -71 16 89 -104 57 36
6235C6J46j52l14J00O39k79o30P56m77J20L8J37J1k30m0K40O3j49lj32r0K72j09
$$ 36 182 30 -284 -184 455 176 -454 302 -175 -55 -17 120 131 -99 -139 101 164 15 12 -120 -210 62 -47
6258d7J43l93L39%N0n5J15P1r2k03P4M6q2O7j33J88k78J67l2K48k58J75k24J57
$$ -47 96 -297 42 42 92 37 152 223 131 -72 2 48 -34 33 -100 88 -190 -23 -55 193 -65 110 -114 43
6282D3J1J52k95m1L45k57j70M0J24Kj01K52N3J05m34m0K41J7r8J34R2k12j2OM7
$$ 43 54 206 -89 -130 215 -42 -212 -172 -48 -46 -147 105 158 263 -171 -211 30 47 -51 83 175 -37 -49 -43 4
6307Dk11K95j18l2k10K62j22J10L6j45K02J02l44O2LJ00k53K10J64l37oJ27P5
$$ 4 -207 88 -30 -62 -272 -10 -132 -22 14 -131 71 173 -171 -109 -106 -6 -259 -49 115 -222 -228 -101 -26
6330b6J42l11L90m42K67j98K82J04k54J04n2M22m23k68L10K19j62p9O6k79L22
$$ -26 116 -195 195 -247 20 -178 104 208 -46 58 6 428 5 -263 47 266 104 25 91 -188 134
6351A34j84K13l07J45PM9L9l92M67j17l8r3J65j26J10j51L8k2n4J68j63N5N3j04
$$ 134 -50 163 -144 1 8 57 96 -296 171 54 16 -77 88 -38 72 -79 -41 -63 -117 51 -112 -57 -4 -108
6375a08J44r8J89J7j56p0N2k8L5L45m97J91n3J2k32K74N8j20J18Kk9l01K91K98
$$ -108 36 -62 127 144 -12 -82 -30 -58 -23 322 -175 16 -37 -25 -257 17 75 -45 73 75 46 -255 36 334
6399C34l35k4N1q7K29j57k03J79N5j4k78M38p1J54l04J57j78J10M9k47J37K35
$$ 334 -1 -25 26 -61 168 11 -192 -13 42 28 -250 188 117 271 -33 124 -54 56 105 -142 -5 230
6421B30o5l2j92K29k4n1j71K63j26p5L7k10K15j91K65J41j78j88K35l57N93n90
$$ 230 165 133 -59 170 146 95 -76 187 61 -14 23 -187 28 -163 102 243 65 -123 112 -245 348 -242
6443b42q9L34l5nk96M5K93k1J5K22j15o9k55L08r2k28J98q7J32J79j59J9j58J8
$$ -242 -331 3 -32 -37 -333 -288 5 -16 -1 221 106 37 -218 90 -2 -230 -32 -119 13 192 33 52 -106 -88
6467h8p4K07l14K87K90o37M60j16N5K8o2J69m8J35l34j79M51l66o7K59k63L70
$$ -88 -162 45 -269 18 308 -329 131 15 70 98 36 205 157 292 -42 -221 230 -136 -203 56 -207 163
6489A63k90k24L30J52j56j04J83j11J03J91n23K84o7J26J31m03K00KL25l10m3
$$ 163 -127 -351 -21 131 -25 -129 54 -57 46 237 -286 -2 -69 57 188 -215 -15 -13 312 2 -41
6510d1J50o0l1r5J25r%r7P5M6j86qj7J33j06J9J85Pn9m3Lk7lJ84p7O8k0J1j63
$$ -41 109 49 18 -77 48 39 39 -58 17 63 -123 -131 -148 -15 -121 -102 83 90 31 -12 -9 -36 -39 145 68 136 116 127 -36
6539c6J48j92L65k75J36n21L91j04J50Q3k70J89j77P1J18K11l30R6j34L91l30
$$ -36 112 -80 285 10 146 -375 16 -88 62 145 -125 64 -113 -42 76 287 -43 53 -81 310 -20
6560b0k64J09K63l26J11K97j96Q5l51N02k60n2J51j51L9K31r5m8j99J62J10L3
$$ -20 -284 -175 88 -238 -127 170 -26 59 -292 210 -50 -102 49 -102 -63 168 73 25 -174 -12 98 131
6582A31j70Q2l2k06K73M3J7p8j9J7q5j54K36K16k1l36JJ49n0jJ47O8m02J09J28
$$ 131 -39 43 11 -195 78 121 138 60 41 58 -27 -181 55 271 250 -86 -85 64 14 13 160 228 -174 -65 63
6607F3k25lK76l87K57m5J78j6n0l7J44O9j60n4p9l8OK61j74%n4O8R9p7j64J91
$$ 63 -162 -165 111 -276 -19 -64 114 98 48 11 155 224 64 10 -69 -107 -101 160 -14 -14 -68 0 99 22 -142 49
6633D9j14M45l03n09N89J9k19j57M1J8J04p2K58k30P6QJ28q3R4q6J3j51ro5j38
$$ 49 -65 380 77 -432 157 176 -43 -200 -159 -141 -37 -109 149 -81 -5 3 131 48 142 56 69 -82 -91 -156 -294
6658b94N17k74J0J59j71j81J67K1K46k43J25J66k36J59j24J59l32R5R7O4j2j57
$$ -294 223 -51 -41 118 -53 -234 -67 -46 200 -43 82 248 12 171 47 206 -126 -31 66 130 118 -39
6680c9J26j59j93K58jQ4l05L07N2p2J53j05j93Q6K21L4k68L18o89J45J17O5j42
$$ -39 87 -72 -265 -7 -8 76 -229 78 130 58 211 106 -87 -1 220 254 -14 304 -385 -240 -123 -58 -200
6703b00K6K01j85J36K87m08J05J73j45l9O4o9o2J08P7m5r3P1r6P7l8r0o8K14o4
$$ -200 -174 27 -158 -22 265 -143 -38 135 -10 -49 15 -54 -116 -8 69 24 -69 2 -94 -17 -55 -145 -213 1 -63
6728f3J31R8j61pJ00j43K8P4J80l13K49l07k48M17j04J27j36K57l21M18j61k34
$$ -63 68 166 5 -2 98 -45 -17 57 237 -76 173 -134 -382 35 -69 58 -78 179 -142 276 115 -119
6750a19J37N5k31K72M6l04K8J27J6P2J03j44K3k05M56l92N1j21J16oR6j96K39
$$ -119 18 73 -158 114 160 -144 -116 11 27 99 202 58 81 -124 332 -60 -9 -130 -14 -20 76 -120 119
6773A19j80j90K15J58j37L1p1l6R1n3j18K28j78J10j86L55k2m4J4j37J16m6N7
$$ 119 -61 -251 -36 122 -15 16 -55 -91 0 -53 -171 57 -121 -11 -197 158 136 92 106 -31 85 39 96
6796I6J26j41l82J90L53n54M97q5o7j69r7J47J08m4p8L19r8Kr4N1j71J68L8j12
$$ 96 222 81 -301 -111 242 -312 185 100 33 -136 -233 -86 22 -22 -100 219 121 123 29 80 -91 77 115 3
6820CJ06m47K34J93j29P9j0l1L8n9P5j10R7j01J11p5j62N4K54l55J12o2K51M3
$$ 3 109 -338 -104 89 -40 39 29 -2 36 -23 52 -58 39 -62 49 -26 -188 -134 120 -235 -123 -185 66 109
6844A09j4q0Jj07QOL83j32k93N2p6K22j49L16j99J26j35j12L8k0J67l68L23l73
$$ 109 95 15 16 -91 -83 -77 306 174 -119 -67 -143 79 -70 246 47 173 38 -74 -36 -56 111 -257 66 -307
6868c07J24K51l36K31J30k35M26k28o0J14l11J57j04K2L01loj97M6L1j47o0m2
$$ -307 -183 68 -268 -37 93 -142 284 56 -4 110 -201 -44 -148 -126 175 172 166 -31 15 46 -101 -161 -203
6891b03K19j06J17J84j6q8l82N35m56j9K02q4KJ7K02q5N5k18L22l33K93k10P1
$$ -203 16 -90 27 211 195 107 -275 260 -196 -215 -13 -97 -95 -78 124 39 94 -124 198 -135 158 -52 19
6914A9L1R2k38J60L9R8k50J04O4k03J78j4l9j66J83K1k73L01p2K5J49l30P5j3
$$ 19 50 142 -96 64 103 201 -49 55 119 -84 94 80 41 -125 58 79 -194 107 35 60 209 -121 -46 -59
6938e9J65q9K4J07j78j03p3M10o14M43J30j50O2l67M9j08M39K7k01K84l00K45
$$ -59 106 17 41 148 -30 -133 -206 204 -410 33 163 13 75 -292 -243 -351 88 115 -86 198 -102 143
6960A43O6l69L95m68l77J159K06j137P34m86J0J27J16j08j16J49J90l46q9K11
$$ 143 209 -160 235 -233 -610 549 755 -382 352 -134 -124 3 119 11 -105 44 234 -112 -201 10
6980A0o9P0K6k09J20N1J19j47L5Q1j97K70j75K59n52L19r2J4J27j04j38n0J42
$$ 10 -59 11 37 -172 -52 -1 118 -29 6 87 -110 160 -15 244 -308 11 -81 -67 60 -44 -182 -232 -90
7003i0R2K53l53J17r9m0j35J25M3K16K47k28j23m9j5Q6l22L52L8j60R7J08j26
$$ -90 2 255 -98 19 -80 -120 -255 -130 -87 129 376 148 25 -24 -39 47 -275 77 115 -45 52 160 34
7026C4L5m0J15l16J12J70m1o1P7j65J92J27k77j16Q2k48K54m5j0J04P4q4J4r9
$$ 34 69 29 144 -172 -60 110 69 8 85 -80 112 239 -38 -154 -72 -320 -66 -111 -121 -17 57 -27 -13 -112
7050a12P1Q2r2n8J87Q8k56J16J93K2l59j2J60M2M0q2Pj2j15j03K4j8K54l24M18
$$ -112 -41 41 -51 -109 78 166 -90 26 219 241 -118 -130 30 72 112 30 37 25 -90 -193 -169 -187 67 -257 161
7075A61P0J9j01k68j04L96Nj94j4K51m15K22Lk0J30j84Q8j76oL25j48J11O0j18
$$ 161 231 250 149 -119 -223 173 178 -16 -30 221 -194 28 31 11 141 -43 45 -131 -137 188 40 151 211 93
7099I3k21J59o8j05J69j17R4K7O4k55K97j75pQ9J47O0l75R0k12J79J72J5m03M57
$$ 93 -128 31 -37 -142 27 -90 4 31 95 -160 137 -38 -45 44 191 251 -124 -34 -246 -67 105 120 -283 174
7123A74k90J53J58l40M1K89j44k6l35J56K60q7m5J47j12k37K64n8L41l50j2j4
$$ 174 -116 37 195 -145 -104 185 41 15 -320 -164 96 9 -36 111 -1 -238 26 -32 309 -41 -53 -67
7145f7J05R2K7j20j08M9k0p2J64j29j68J95j38L73j18J38m12M24l04K08R9k47
$$ -67 38 130 157 37 -71 -22 -42 -114 50 -79 -247 -52 -190 183 65 203 -209 215 -89 119 218 -29
7167b9K84j87k52J78j16K8j7P8MO1k31M31k37j9K06j05m6l2J61l68J94r0J01q7
$$ -29 255 68 -184 -6 -122 -94 -111 -33 -29 32 -199 232 -5 -24 182 77 31 -1 160 -208 -14 -104 -3 -90
7191i0L08l48n8L91l12K6o7o2J76R0r2M3j98L41m07M24m4O4J37l69K06l03R0k8
$$ -90 218 -130 -188 203 -109 -83 -150 -212 -36 54 -38 5 -193 148 -259 165 121 185 322 -47 159 -144 -54 -82
7215h2J88M8r8j47M38m45K99j20J69m26R9P4J41l13m8r4L33j5J40j55L68k57k50
$$ -82 106 154 56 -91 347 -98 201 81 250 -176 -77 -3 138 -175 -223 -317 16 1 141 -14 354 97 -153
7238a53L47k48k71L87R3k27L12j95k56M33j49m4o4pl4J7J50r8K44l05K37j68K42
$$ -153 194 -54 -325 62 155 -72 240 45 -211 222 73 29 -35 -42 -76 -59 91 -7 237 -68 169 1 243
7261B43l31J49k44J46k03J71J33k47J76J57J8k67L8p9K13o4J35J76l07r4J05Q6
$$ 243 -88 61 -183 -37 -240 -69 64 -183 -7 150 168 -99 -61 -140 73 9 144 320 13 -81 24 110
7283A10N4m1L1l91L61j99k07K04M6J94k50J40j33o3M83l09j34N6J12j29j8j2Q4
$$ 110 164 123 154 -237 124 -75 -282 -78 -32 162 -88 52 -81 -144 339 30 -104 -48 64 -65 -83 -95 -11
7306a1M10l60j81K51o1K36j92Q0m00M36l71J15o4J72j67R9J14k65K64pj1j40N9
$$ -11 399 39 -142 109 48 284 92 172 -228 208 -163 -48 -112 60 -107 -8 106 -159 105 98 87 -53 6
7329Fj05M7K16K4n34J19K49J33l44k58M26o5MK92k51j01k6K72j16k25L6J89K03
$$ 6 -99 -52 164 188 -346 -227 22 155 -189 -447 -21 -86 -82 210 -41 -142 -168 104 -12 -237 -201 -12 191
7352A91Q2j63j05O7Q2q8k10J56R1l14J40j54L37o2J24k49P0J5J53k5j83r9J29
$$ 191 273 110 5 72 154 66 -144 12 103 -211 -71 -225 112 50 174 -75 -5 10 163 138 -45 -144 -15
7375a5R3k41J99M4P0j84j21K04q6p8p4m5J14K8oJ01R7L13m85l67K27L78Qj61P4
$$ -15 78 -163 36 80 150 -34 -155 49 -37 -115 -189 -234 -120 -92 -98 3 100 413 -72 -439 -212 166 174 13 87
7400H7j76J76j23RQ5l06K44K68k82nr2R9P0k42J55K65k06M4J31l18J51j41K31
$$ 87 -89 87 -36 -27 58 -248 -4 264 -18 -23 -115 -16 54 -188 -33 232 26 70 201 -117 34 -107 124
7423A24j74l3J90lj62J34j97L20k72J30K24l27L2J00j64J63n6j16J09Q6j88K27
$$ 124 -50 -83 107 104 -58 76 -121 199 -73 57 281 -46 -14 86 -78 85 29 -87 22 108 -80 147
7445A47k38m1K13M3R1n08N0M09L9k96J11m08M27l0k03J38N7J0J45k16k2l01L78
$$ 147 -91 -132 81 124 215 -293 -243 166 205 -91 20 -388 39 9 -194 -56 1 11 156 -60 -82 -383 -5
7468eK25j02N7q0o0j50o2J9K58o4m2K03r4l01K19j13m9J26K73l32J18j75J05r1
$$ -5 220 118 175 95 35 -115 -177 -158 100 36 -6 197 103 -198 21 -92 -141 -15 258 -74 44 -131 -26 -117
7492a17L43l32J17M1j71K10m7J9k33L85n54M97J6N3l45K12j41Q8Q9j46j94r0L71
$$ -117 226 -106 11 52 -119 91 44 63 -170 215 -339 158 174 227 -118 94 -47 41 130 -16 -210 -300 71
7515G1k46K04j3L2J06l32J99L7N6n3j33Qr6o1M35m7l21J19j97K54j83K77j42l42
$$ 71 -175 29 16 48 154 -178 21 58 114 61 -72 -64 -160 -221 214 167 -154 -35 -232 22 -161 116 -26 -368
7539c68K67J84P2k97O9L5R7O1m4k09J84m4k0j98K98K39n32p3L57k04n3J72J4K08
$$ -368 -101 83 155 -142 -73 -38 59 120 76 -133 51 7 -13 -211 87 326 -206 -279 78 -126 -179 -7 7 215
7563B15o3l46J98Q5j81J38j44L29j09j99J13R1l12L62m52L67k01Q2LMJ1q2L14
$$ 215 152 -194 4 89 -92 46 -98 231 122 -77 36 127 -185 177 -275 92 -109 -27 -24 -20 -9 -91 223
7586B23nj48o9K95k47k00J19j2K34j12k06J17L0M0K3j55OJ76j10k06J71j24N0
$$ 223 218 70 1 296 49 -151 -32 -44 190 78 -128 -11 19 59 82 -73 -67 109 -1 -207 -36 -160 -110
7609a10j4K40j53o4m8J9l1L8J52R9k27L3j25O7j16J64P0J6L0m0K33k41J05k11
$$ -110 -124 116 -37 -101 -149 -130 -161 -123 29 128 -99 -66 -191 -124 -240 -76 -6 10 40 0 233 -8 97 -114
7633a14K23j15J7K6OJ50k24L6j19L3K13k19M3O9J52k97oL1J06L0j0j57J33N4r6
$$ -114 109 -6 11 37 43 193 -31 5 -114 -81 132 -87 -44 25 177 -120 -126 -95 11 41 31 -126 7 61 -35
7658c5N4q7K32m33K33J19j2l36p5J80L32j66J23L3j10o2J33j44L0k54K11j86M63
$$ -35 19 -68 164 -269 -36 83 71 -265 -340 -160 172 6 129 162 52 -10 123 -21 9 -245 -34 -220 243
7681B43j50j5r3n5O3r5J95j51Q3J72k94OK0J37rR7j28j50Q3J02j42K32l5l27O2
$$ 243 93 78 -15 -70 -7 -102 93 -58 25 197 -97 -91 -71 66 57 154 26 -124 -41 61 -81 151 116 -211 -149
7706a49J53om1J16oJ00n3j03p0k3K35j28k03N25k53j4j27L6J62J35J3l01J27k43
$$ -149 4 -2 -43 73 67 167 114 11 -59 -82 153 25 -178 347 94 80 -47 -11 151 286 299 -2 125 -118
7730a18N2J40n3J34m4j4Ol25K11j39j93L56j43M0K2L85l84j87K07J78k43J23L80
$$ -118 -66 74 21 155 111 97 103 -222 -11 -150 -343 13 -130 -90 -68 317 -67 -254 -47 131 -112 11 391
7753C91k59k91L91j98n1Q3J83k62k17L6J68K21k79j3J01j74K23r9K39j31j22L13
$$ 391 132 -159 232 34 -17 66 249 -13 -230 -194 -26 195 -84 -97 4 -170 53 -46 193 62 -60 253
7775B53k20j11J22l98K45K15j43L39m51J68P9k89M97k26m3Q2l76J69L2J22j2J12
$$ 253 33 -78 44 -354 -109 106 -37 302 -149 19 98 -191 306 80 37 119 -257 -88 -56 66 54 166
7797A66p1k61L81l39J23K31k03j63K5QJ08R0n4j2N9n7R0J3j33K20j31j38P4j00
$$ 166 95 -166 215 -124 -1 230 27 -136 -111 -103 5 95 41 29 88 31 121 134 1 221 90 -48 26 -74
7821g4K84l16j17R3J13l5j3O3nK03k63K3N80l03j66l7qq4K0O3l11J99J84k88L5
$$ -74 210 -106 -223 -130 -17 -52 -65 -2 -7 196 -67 -44 536 233 67 30 22 -62 -42 21 -290 -91 93 -195 -160
7846a60J56O7R8j17j6O2j02J41j54J90j85j25J50p5L03j24j79J10j0Q5N0k74K7
$$ -160 -4 63 161 44 28 90 -12 129 -25 165 -20 -145 5 -70 233 109 -70 40 30 115 165 -109 -82
7869h2J04M2j08Q9r1L35m23LL92m90K00L3k63K19J11q1j13K62j84Q8l2O6k4K3
$$ -82 22 64 -44 45 -46 289 -134 -131 261 -229 -29 4 -259 -40 71 -10 -123 139 -45 43 11 77 53 76
7893G6N9j61J79l29J80J02j31K32p8q4J03l10J55k32N41m06K44j57J03k9k52J16
$$ 76 135 -26 153 -176 4 106 -25 207 129 45 148 -162 -7 -239 302 -104 140 -17 86 57 -195 -79
7915g9P7J5N1j17j46J62Q3J7n8J61l20K37k68K97j78J03ql26L15Pj94J32j73m9
$$ -79 -2 13 64 -53 -199 -37 46 63 5 166 -154 83 -185 112 -66 37 29 -297 18 25 -169 -37 -210 -259
7939b59R8Q8Q9M01m93j19J21K26j80J20j39j05J31O1j42J01o6j45K41r1N6l6N9
$$ -259 -161 -73 16 417 -76 -195 -74 152 -28 92 -47 -152 -21 40 -102 -1 -67 -212 29 -62 -6 -42 17
7962A7k56L89j56M1m6l1L1l6j6K80k16J57Q3j53r5J3K94k87J88r7j9p1n0J26j05
$$ 17 -239 150 -6 35 -11 -42 -11 -47 -63 217 1 158 241 88 -7 6 300 13 201 104 85 14 -36 90 -15
7987a5N1N7p6j71M4p1N00k61l0n7p7j1L5K82r9j97K01p6j61K41j88M26k69j15
$$ -15 36 93 17 -154 -110 -181 319 58 28 -29 -106 -117 -82 200 101 -96 105 29 -132 109 -79 347 78 -37
8011c7J78k14L3J91j65m9N8J12j69l7J07J07J38p8j63l9j08N0J97k00K08j82j76
$$ -37 141 -73 -40 151 -14 -63 -5 107 -62 -99 8 115 253 175 12 -27 -135 -85 112 -88 120 -62 -238
8034b38J97J8p8p4Q4K38l6j7m8j1K32k17R1p9P4j44K08l30J83k59J68j65o2K15
$$ -238 -41 -23 -101 -175 -91 147 111 94 46 35 267 50 141 62 136 -8 200 -130 53 -206 -38 -203 -265 -50
8058e0m2j72M00N1j42q4l4K40k15M18m57L17k59K04l49K23n9J79k56L36j61j16
$$ -50 -92 -264 136 187 45 -39 -73 167 -48 370 -87 230 -29 175 -174 49 -10 169 -87 249 88 -28
8080b8K0R5NK57n69J81k7j46L59j38Pj95N0K2O1j99mK47K46o6k5r8n4m1J94J41
$$ -28 -8 87 92 349 -220 -39 -66 -212 147 9 16 -179 -129 -107 -46 -245 -249 -2 244 178 153 55 1 -40 154 295
8106B95l29L5k13M25m52L01j37Q7Lj95J33J75k05J04j85Q6k0L99l21L37l11k46
$$ 295 -34 1 -212 213 -239 62 -75 12 15 -180 -47 128 -77 27 -158 -72 -92 307 -14 323 12 -234
8128b34M71k38M5K0K07k53J13q2p9K98q0j46j29J19K53m47n0J00R5k0J12k06K87
$$ -234 237 -1 44 64 271 18 131 49 -30 268 188 42 -87 32 285 -162 -212 -112 -17 -37 75 -131 156
8151A56m96L19Jj39K40l9j52J92k35Q4J72l0j73L16k47j68K91J80l82K21J61k38
$$ 156 -340 -21 -20 -159 81 42 -110 82 -153 -69 103 73 -100 216 -31 -199 92 272 -110 111 272 34
8173C4K34k87m8M0K2k14L70P6k81j23K20j64O4J31J01k23k7p6
$$ 34 268 -19 -67 -27 -5 -219 151 227 -54 -177 43 -121 -57 74 175 -48 -75 -151
8191a51
$$ Imaginary data points
##PAGE= N=2
##DATA TABLE= (X++(I..I)), XYDATA
0@%%%%%%%%%%qJ6j6J6k4L2m0M8n6P2q8J04j20J42j66J92k24K59k99L44l95M51
$$ 0 0 0 0 0 0 0 0 0 0 0 -8 8 -8 8 -16 16 -24 24 -32 40 -48 56 -64 78 -88 104 -120 139 -160 184 -211 240
32B40n12N83o61P44q37R38j049J172j306J451j611J786j976K184k411K660k932
$$ 240 -272 311 -350 394 -443 495 -554 618 -688 763 -848 938 -1038 1146 -1265 1395 -1537
49a537L230l557L920m320M764n262N820o454P180q017R000j0173J1596j3374J5664
$$ -1537 1693 -1864 2056 -2264 2500 -2762 3058 -3396 3784 -4233 4767 -5406 6190 -7184 8480
64H480j8736K3102k9847M1739o8834K44448K4270m02276J24805J26670N808p8077
$$ 8480 -10256 12846 -17001 24738 -44096 200352 224622 -177654 -52849 73821 79629 1552
76A552n4616p3805N1278R8828J7110j12592k2593N2973M8751J6563l1785o3813
$$ 1552 -53064 -126869 -75591 23237 40347 -72245 -94838 -41865 6886 23449 -8336 -72149
88g2149N1668Q1134J217m8863k4165J1328M1207J6651j2387n1037l6609L2586
$$ -72149 -20481 60653 61870 13007 -11158 170 41377 58028 45641 -5396 -42005 -9419
100i419M2439k1882l5366j1168J4866K1785P904p955j8919j1725K3836J7821j2982
$$ -9419 33020 11138 -24228 -35396 -20530 1255 9159 1204 -17715 -29440 -5604 12217 -765
113g65p921M570R005J2135n125j3907Q34P697L288m156o792m210o86Q805Q246
$$ -765 -8686 -4116 4889 17024 11899 -2008 -1174 6523 9811 5655 -1137 -5347 -6033 2772 11018
128A1018j2004j1810O781Q572K431k804o810j890K777N083L459m429n494L059
$$ 11018 -986 -12796 -6015 2557 4988 2184 -4626 -6516 -3739 1344 4803 374 -5120 -2061
142b061M572J192k148l273N79Q89M86R78j297p41J402N72J50q43k526J616L088
$$ -2061 2511 3703 1555 -1718 -1139 -250 236 1214 -83 -824 578 1150 1300 457 -2069 -453 2635
159B635j791k011P0M94O78K74J64j476j892K357K602j383k131r3Q94J265l3n29
$$ 2635 844 -1167 -1097 -603 75 349 513 -963 -2855 -498 2104 721 -1410 -1503 -609 656 623 94
177I4J42l97M18O63k46m36n21Q1J006m72q27L59K91n6m56m6L7L26k39Q58r37m27
$$ 94 236 -161 257 920 674 238 -283 -202 804 332 -495 -136 155 99 -357 -403 -366 -40 -279 579 -358 -785
199g85O27P15n04K23l43j33L72J57K98n23n00M33J29K0O9n89l4M95k69k36O07
$$ -785 -158 557 53 276 -67 -200 172 329 627 104 -396 37 166 186 255 -334 -368 127 -142 -378 229
220B29k82%k93M31j13P7J15Q6l71O3k5K67k86J79j8j70J27J7o6R3k18k77N36k73
$$ 229 -53 -53 -346 85 -28 49 164 250 -121 -58 -83 184 -102 77 59 -111 16 33 -33 60 -158 -435 101 -172
244a72J49J8k05Q5O9nL80l32o3L4Q5P6k15J56n9l5k17J26n4J50Q7k06Q5j19n9
$$ -172 -23 -5 -210 -125 -56 -61 319 -13 -76 -42 43 119 -96 60 1 -34 -251 -125 -179 -29 58 -148 -63 -182 -241
269b41K55P1k62L1Q4n4P1J29j87p8M98k92L2q8L94n18J41l03L32p2Q4m83M76K34
$$ -241 14 85 -177 -146 -62 -116 -45 84 -103 -181 317 25 57 -31 363 -155 -14 -317 15 -57 27 -456 20 254
293B54l16K18k29K51k72K9L72k14l4l66K28QJ55l00K76j41K38k83L05m01L83k00
$$ 254 -62 156 -73 178 -94 -65 307 93 59 -307 -79 -71 84 -216 60 -81 157 -126 179 -222 161 -39
315c9J26r3O9K03n73M26k15o2L02O5k56j6j5J40pj6l70M59j4j27J42j4n1Pj88
$$ -39 87 -6 63 266 -307 119 -96 -158 144 209 -47 -63 -78 62 55 39 -331 128 114 -13 129 115 64 71 -117
340a17n8L01n1JJ01l33K88l13j63L21J81k05l6J34q5K25K8l99K53j43k42L19l7
$$ -117 -175 126 75 76 177 -156 132 -181 -344 -23 158 -47 -83 51 -34 191 219 -180 73 -70 -312 7 -30
363c0J37j28J06o7J8l6j43J08L8L6o1j47K49l55J88j3L2K6m4J30j43M21j16l02
$$ -30 107 -21 85 18 36 0 -143 -35 3 39 -22 -169 80 -275 -87 -100 -68 -42 -86 44 -99 322 206 -96
387i6L94l86R5J44l81M74k14N0J96m04qK66j35J4j3r1J66p0j45L33k22Lj03L11
$$ -96 298 -88 7 151 -230 244 30 80 276 -128 -136 130 -5 9 -4 -95 71 1 -144 189 -33 -30 -133 178
411A78k08O8m9r4J71j33K32q1k9j99L00j36j79K79n7l09L50K00j85k09j05J70
$$ 178 -30 38 -11 -105 66 -67 165 84 55 -144 156 20 -159 120 63 -246 104 304 119 -90 -195 -25
433b5J56k4k2j79J52j15k5j10L05o3J47k61K67k11K11N6n5k36L7O6j12L12r1k99
$$ -25 131 107 85 -94 58 -57 -82 -192 113 50 197 -64 203 -8 203 259 204 -32 5 71 -41 271 180 -119
457a19K26l01Q2L24l27L43l86K58ml35J92J93l9p8KRl3j9J74L4J4j83l4J05k62
$$ -119 107 -194 -112 212 -115 228 -158 100 96 -239 -47 146 107 29 31 40 7 -12 162 196 210 27 -7 98 -164
482a64L9p4K54j30J58k4P3l17J49k05J81j8l6K25P3k17J54k4m00L66l02M59m8
$$ -164 -125 -199 55 -75 83 59 132 -185 -36 -241 -60 -78 -114 111 184 -33 121 97 -303 63 -239 220 172
505A72j73j30N85k18l03j06j4K47J38l95M76m9j77R8k74J13p6O7K83j65M0l61
$$ 172 -1 -131 454 236 -67 -173 -187 60 198 -197 279 230 53 151 -123 -10 -86 -19 264 99 139 -222
527b22M1J17k40L91j60J67J47k42j91L08o5j95J60rJ34o9q7m1K84j23q3j69J08
$$ -222 -181 -64 -304 87 -73 94 241 -1 -192 116 51 -144 16 7 141 72 -15 -56 228 105 22 -147 -39
550c9j01L74p6o6Q7k44k81O6L39l1q9L10l04r1j6Q6m5J40m9k77K86j74J73j16
$$ -39 -140 234 158 92 179 -65 -346 -280 59 28 -61 249 -55 -146 -162 -76 -121 19 -30 -307 -21 -195 -22 -138
574a38K64Pk16p5K44p1j35p8Q3j17j6K13Q3R1k23M4J18R8k95N8k15L37n3j5p3
$$ -138 126 133 -83 -158 86 15 -120 -198 -115 -232 -248 -35 48 139 -84 -40 78 176 -119 -61 -276 61 8 -7 -80
599h0j19K96j31o2q9L88k44J59l08J61L89k87J48k25m3k22K27K81j80j65J35p5
$$ -80 -199 97 -34 -96 -185 203 -41 118 -190 -29 360 73 221 -4 -47 -269 -42 239 59 -106 29 -46
621d6J9J16n1o3n8N1L8j19Q1L28l09N2m0l81L60p2J00j41J38J22qP9j02j61j3
$$ -46 -27 89 38 -25 -83 -32 6 -113 -32 296 -13 39 -1 -382 -22 -94 6 -135 3 125 117 196 94 -67 -80
646h0nN7L06m24K02k32j4q9M7J11K52k1l80M83k0k14O7N8J11m12L04o9k08o3L89
$$ -80 -85 -28 278 -146 56 -176 -190 -279 -232 -121 131 110 -270 213 193 -21 46 104 215 -197 107 38 -170 -233 156
671A56j12o3K4R9kL5Q9n35L13r8N2J20J58k50p8R3K53k36J45m30J96J29J29j62
$$ 156 44 -19 5 104 102 137 226 -309 4 -94 -42 78 236 -14 -92 1 254 18 163 -267 -71 58 187 25
695B5J39l13n9K52K4k08m2N9L16k61Q7K29l71q5N06k42l0k9j30J08n7j22L93m88
$$ 25 164 -149 -208 44 68 -140 -182 -123 193 -68 19 248 -123 -208 298 56 26 -3 -133 -25 -82 -204 189 -299
719b99M50k21K0N6O4J2m8K5j45J56m4K07l37M19m10J0O4K35N2j26pk6j43q2N5
$$ -299 151 -70 -50 6 70 82 34 59 -86 70 26 233 -104 315 -95 -85 -21 214 266 140 133 107 -36 -118 -63
744f3q6L06k52k5K35J11j17j18l9J95k48R2J34k33Q9j6RO6o6KM6m0r0L72j83j56
$$ -63 -149 157 -95 -120 115 226 109 -9 -48 147 -101 -9 125 -108 -19 -35 -26 40 -26 -24 22 -18 -108 264 81 -75
770g5K43o6j41L56k61j7K10l26K24p7k32L56j04j64J59j24J3QK87k45J4OM7l65
$$ -75 168 102 -39 317 56 39 249 -77 147 70 -162 194 90 -74 85 -39 -26 -18 269 24 38 44 91 -274
794b74M42o3j23J10p4Q8m42L88j53RR5k02j1L60k28J61m8K3J4L0Q7L0k38q6L14
$$ -274 168 105 -18 92 18 106 -336 52 -101 -92 3 -199 -210 150 -78 83 35 58 72 102 189 219 -19 -105 209
819B09j04l1j07J40o8k6n2J74j50K48k00j19K09l68M04j17J52k3j45K3O7k65l7
$$ 209 105 74 -33 107 39 13 -39 135 -15 233 33 -86 123 -245 159 42 194 171 26 49 116 -149 -186
842a86L21N1l31N63j57M6m70L61k58J98k45J01N2J49k90Q5p0j13k3K52L2j85L
$$ -186 135 186 -145 418 261 307 -163 198 -60 138 -107 -6 46 195 -95 -10 -80 -193 -216 36 68 -117 -114
865a14K79l16J70L7j70K00J04o7j19j81M18n21J11lM07k01O2o2j91L35l80K80
$$ -114 165 -151 19 56 -114 86 190 123 4 -177 241 -280 -169 -172 235 34 96 34 -157 178 -202 78
887G8j30J37l29L21j07L00m94L26l16L15o2l7LJ74j45k72L39q0KR0k84K9nj32
$$ 78 -52 85 -244 77 -30 270 -224 102 -214 101 39 2 5 179 34 -238 101 21 23 113 -171 -142 -147 -279
911b79J08K62r9K84l93L06n3k21j27M33k20J3K38m74M47k98J79J09K5m18Q2M7
$$ -279 -171 91 -8 276 -117 189 136 -85 -212 221 1 14 252 -222 225 -73 106 215 240 -178 -96 -49
933d9M1R1j72k23L87L7%K4K5j6k22k9L4J22J1O4j32k99K01j7MO9M1L20j98k80
$$ -49 -8 83 -89 -312 75 112 112 136 161 145 -77 -106 -72 50 61 125 -7 -306 -105 -122 -118 -49 -8 312 114 -166
959a66K56j00j14L28k62o6J62J0j20J04j41K21k36r2J96J51l66K57l0l6K9L3k53
$$ -166 90 -10 -124 204 -58 -124 38 48 -72 32 -109 112 -124 -216 -20 131 -235 22 -8 -44 -15 18 -235
982b35L46o0l03L07N6l26J95M2r2J73R6j07o1J29r2L0NK34n76K38q3K74j46m6
$$ -235 111 51 -252 55 111 -215 -20 22 -70 103 199 92 31 160 68 98 103 337 -239 -1 -84 190 44 -2
1006bk7L03m62J63K46j66j18J31j49K4P2k6M4j81K45J36m32J46J11m29K45j31
$$ -2 -29 274 -188 -25 221 55 -63 68 -81 -57 15 -11 33 -148 97 233 -199 -53 58 -371 -126 -257
1028b57K77O2J4J49m24mK7o7K26k0L4j49J5l8RJ99R6j97N1k11J35K45j82K45l53
$$ -257 20 82 96 245 -179 -183 -156 -223 3 -17 17 -132 -117 -155 -146 53 149 -48 3 -208 -73 172 -10 235 -118
1053a18k0K38m7n1J09j8rq3j97l0P7K26N8j61j43L77m80K99m2j79L01N3m41O6
$$ -118 -138 100 53 2 111 93 84 1 -196 -226 -149 77 135 -26 -169 208 -272 27 -15 -194 107 160 -281 -215
1077b15M67k74P0j36J9J77j47m33M83K13m00L51j57q4J70j29J08l67K58j42K01
$$ -215 252 -22 48 -88 -69 108 -39 -472 11 224 -176 175 18 -66 104 -25 83 -284 -26 -168 33
1098C3N1J12p8l50L93k37J95l61L07j48P7p0J04Nk35K07J8m6J79j05J9J92k62
$$ 33 84 196 118 -232 161 -76 119 -242 65 -83 -6 -76 28 33 -202 5 23 -23 156 51 70 262 0
1121@J56L3J46k26j91K56k50P6L08r8j08j74N8r4J96m1k90O55q7k13j17rL78m60
$$ 0 156 189 335 109 -82 174 -76 0 308 210 102 -72 -14 -108 88 47 -243 412 325 112 -5 -14 364 -96
1145i6K30l80L88m10K49Q3j45k6K55k2K2j84J11j29K76l39K14jM2k08J38K70k84
$$ -96 134 -246 142 -268 -19 64 -81 -107 148 126 148 -36 75 -54 222 -117 97 96 138 -70 68 338 54
1168E4j00l04J85K06N4j92m5N6K02j88k5J93rj97R8J45J11l4n2j67m7j65K66L7
$$ 54 -46 -350 -165 41 95 -97 -142 -86 116 -72 -97 96 87 -110 -12 133 244 210 158 -9 -56 -221 45 82
1192H2j49Pn3J78lj16Q0j72j62J11K14J46k71K87j38J47j42j23J32k10J70n4j48
$$ 82 -67 -60 -113 65 62 -54 26 -146 -308 -197 17 163 -108 179 41 188 46 -77 55 -155 15 -39 -187
1215a87P1J73n8K23n71K51m7K56j50q1L57l75M7o4K3K84j42O1J45m08L94m72K40
$$ -187 -116 57 -1 222 -349 -98 -145 111 -39 -120 237 -138 -91 -155 -132 152 10 71 216 -192 202 -270 -30
1238c0j60R5J32l48K85J51r1n6o1P2K56q24M66K19L41k67j29pN0j34k12K93n0
$$ -30 -190 -95 37 -311 -26 125 34 -22 -83 -11 245 -579 -113 106 447 180 51 44 94 -40 -252 41 -9
1261iO5j14p3L16l79J38K50k87K74l45K51M5k18Q1n7J93q1N7NM9j36R4p2k00J23
$$ -9 56 -58 -131 185 -194 -56 194 -93 181 -164 87 132 -86 -5 -62 131 50 107 112 161 25 119 47 -153 -30
1286c0j40K23l22K07J32k54k9K05K01l59J37j6j73K53k24N7L8ko0K29j74m9q1
$$ -30 -170 53 -269 -62 70 -184 -213 -8 193 -166 -29 -45 -218 35 -189 -132 -94 -96 -156 73 -101 -150 -231
1309b31K03R1L9J06k85J8L04j20j89K83k37K49k74J74m73M70r3j38L1P0n3J56
$$ -231 -28 63 102 208 -77 -59 245 125 -64 219 -18 231 -43 131 -342 128 35 -103 -72 -2 -55 101
1331A01n0k37K49j42jj24L80k55J25n8j6J23Kk9j84J41j63J22k12M83l05Ll12
$$ 101 51 -186 63 -79 -80 -204 176 -79 46 -12 -28 95 97 68 -116 25 -138 -16 -228 255 -50 -47 -359
1354c59K67M31Jj71j33K2j01R1J26k92L79m67M0K32k35M9K66nj58m6o8K92L4L0
$$ -359 -92 339 340 169 36 58 -43 48 174 -118 261 -206 -166 66 -169 -120 146 141 -17 -63 -131 161 195 225
1378B25l47L67j75k3J15r4n2k11K19J75jj06J09l62K37p9r2J08q6n1l4R4J05l0
$$ 225 -122 245 70 47 162 68 16 -195 24 199 198 92 201 -161 76 -3 -95 13 -73 -124 -158 -64 41 11
1402A1K01j8rJ17m28j75N59l22k8K00j4lL8o9j9l3L2q0J11k24J28K16j55p9J11
$$ 11 212 194 185 302 -126 -301 258 -64 -92 108 94 91 129 60 41 8 40 -40 71 -153 -25 191 36 -43 68
1427F8P6R3O6m06K61j66q5P4Q1j54j07Q3P6n0J52J49k97K55r3j21O4o8R5j20K0
$$ 68 144 237 303 -103 158 -8 -93 -19 62 -92 -199 -116 -40 -90 62 211 -86 169 76 -45 19 -49 46 -74 -54
1452e4J86l34M03l97J27J85k37o4J37k13O4J00J34r6j81J36J82j5l51K05L19m08
$$ -54 132 -202 201 -196 -69 116 -121 -185 -48 -261 -197 -97 37 -59 -240 -104 78 63 -288 -83 236 -172
1474a72L81%k65J14o7p8o7K15j7q8L05k54J20o9Q7q7l7o0K49k12k20L85k6k68
$$ -172 209 209 -56 58 -9 -87 -154 61 44 -44 261 7 127 58 145 58 21 -39 210 -2 -222 163 137 -131
1498a31K47m50M57Kn5k79J03O4J46o1j87K08j74M60j92j72o1p7J07K80j80p0J9
$$ -131 116 -334 123 125 70 -209 -106 -42 104 43 -144 64 -110 350 158 -14 -75 -152 -45 235 55 -15 4
1521DJ66l32j4K33j18O3K77k30j8P7L3j15k3l4J41k03K50O3m91J49J39k64M80
$$ 4 170 -162 -176 57 -61 2 279 49 31 108 141 26 3 -31 110 -93 157 220 -271 -122 17 -247 233
1544B33n1j12j10J0j51R8J85j72o3k42K89J74j39j06k7M12m88J88K99l04K47j70
$$ 233 182 70 -40 -30 -181 -83 102 -70 -133 -375 -86 88 -51 -157 -184 228 -260 -72 227 -77 170 0
1566@J4p1Q5j19J46j37L81m36qL37l39K08Oq4m9M3j25J62q8J81J34k80m1K42l42
$$ 0 14 -57 28 -91 55 -82 299 -137 -145 192 -147 61 67 -17 -66 -23 -148 14 -74 107 241 -39 -80 162 -180
1591a80%K90j96N3R7N7j71j18K38k2mj01K58R0k14k13J53j79J98K9j58k6K30k07
$$ -180 -180 110 -86 -33 64 121 -50 -168 70 48 44 -57 201 291 77 -136 17 -162 36 65 -93 -119 111 -96
1615i6J93k02M47No46L29k76M28l79L21n2Q2j30K84l72r3K00P0n7j39n7J2p9J23
$$ -96 97 -105 342 347 -299 30 -246 182 -197 124 72 154 24 308 -64 -157 43 113 56 -83 -140 -128 -207 -84
1639h4L7j15K52l06N09l18K70j51k62M86m18J51k23M22j67K7j17j51J61pJ11k18
$$ -84 -47 -162 90 -216 293 -25 245 94 -168 318 -100 51 -172 250 83 110 -7 -158 3 -4 107 -111
1661a11N5k10K44J86j39J61j94L8O4lr4J39K7j86O2K05k59M67n05K44k92R7P6
$$ -111 -56 -266 -22 164 25 186 -8 30 94 91 -3 136 163 -23 39 244 -15 452 -53 191 -101 -4 72
1684G2j54J20j46j05L28j36K30l01p8K90j86L07l77J51k92K98r2P6P3j08K55j94
$$ 72 -82 38 -108 -213 115 -21 209 -92 -170 120 -66 241 -136 15 -277 21 -71 5 78 -30 225 31
1706C1L2k47n5J03K69J53Q6j44k89J28n1K88k32k1%l30J21L71p3pj46O2p5J39
$$ 31 63 -184 -239 -136 133 286 372 228 -61 67 16 304 72 51 51 -279 -158 213 140 133 -13 49 -26 113
1730A13j01l7j49L85k34RK04k94kJ11J23K6K5L8k63o5M5k5l3n5K17n5p7J43j61
$$ 113 12 -25 -174 211 -23 -14 190 -104 -106 5 128 154 179 217 -46 -111 -66 -91 -124 -179 38 -17 -94 49 -112
1755a12J95J42j61k81J33N6R6k82j78M06q2k03J57k7L59k11L8k5m89N51j23k8
$$ -112 83 225 64 -217 -84 -28 68 -214 -392 14 -68 -271 -114 -141 218 7 45 20 -469 82 -41 -69
1777f9J77k26J73J70j88K05m28K47j24p9n7K87J97m94J91J49j65O8PJ37n6k18
$$ -69 108 -118 55 225 37 242 -186 61 -63 -142 -199 88 285 -209 -18 131 -34 34 41 178 122 -96
1799i6m3Q3M5o4Op4J95o6P5j73K68j21L1oO9r6J95k12j22O2K66k32j25K18n5K
$$ -96 -139 -56 -11 -75 -69 -143 52 -14 61 -112 156 35 66 60 129 33 228 16 -106 -44 222 -10 -135 83 28 30
1825C0m10M59k01J67m5L6j53K93j30j47k54N25o0m3l5JJ93k72K03j52J7L23n08
$$ 30 -380 79 -122 45 0 36 -117 176 46 -101 -355 170 110 67 32 33 226 -46 157 5 22 345 -163
1848a63P5K61j26l1R8n5J11k99J86K13l00J02j89K72j48M8o0J22m3m3j72k6J92
$$ -163 -88 173 47 16 114 59 170 -129 57 270 -30 72 -117 155 7 55 -5 117 74 31 -141 -167 25
1871B5R6o1j72k09K58P5j93L32l60K57o5L2l27M35k0m10L84J39k89K3r9P1n7K05
$$ 25 121 60 -112 -321 -63 12 -181 151 -209 48 -17 15 -312 123 103 -307 77 216 -73 -50 -149 -78 -135 70
1895G0O9l32J98M5k0L6k5J72j68N6N9J12r6j90j41L25J41j36o8q1m32K97K51j66
$$ 70 139 -193 5 50 30 66 41 213 45 101 160 272 176 -14 -155 170 311 175 107 26 -406 -109 142 -24
1919b4J30j48J74j61P2j2j80Q9L39j43m1k38J61J03J62m20K65O0l52K15J55k72
$$ -24 106 -42 132 -29 43 31 -149 -60 279 136 95 -143 18 121 283 -137 128 188 -164 51 206 -66
1941f6M8J45k9K61m54K9J76j36j82K24JP2K70m93J03Q4o6O0j68J57K85l46Pj15
$$ -66 -18 127 98 359 -95 -66 110 -26 -208 16 17 89 359 -134 -31 53 -13 47 -121 36 321 -25 -18 -133
1965a33Q6M5K24Ml50J22p3J43L45l42l78K38K1l7O0l4P5M4L2j86K5J73j50j19
$$ -133 -47 -2 222 226 -124 -2 -75 68 413 71 -307 -69 -48 -85 -25 -59 16 60 92 -94 -69 104 -46 -165
1989a65O2p2J24n1j37L16k79J49J21Q4n4K2j57K51J70m91L1K27j64j10K30Oj33
$$ -165 -103 -175 -51 -102 -239 77 -202 -53 68 152 98 120 -37 214 384 -107 -76 151 -13 -123 107 113 -20
2012b0J00k81K83j10J88j93O4O9K2j34J87l21L10m65M83m5j50j16J7N9L11l06
$$ -20 80 -201 82 -28 160 -33 31 100 122 -12 175 -146 164 -301 182 137 -13 -129 -112 -53 258 -48
2034d8j90L08n6o2J41r4M1j98K97q7M0L0j55Q7o7N4k31L3PJ73J24k1j02J39j76
$$ -48 -238 70 14 -48 93 -1 40 -158 139 52 92 122 -33 54 -13 41 -190 -157 -150 23 147 126 24 163 -13
2059a3J06M0j07O1q2k27K10j53K3J63K53l40k54N70n38M04j41P7l2k7j9K64k84
$$ -13 93 133 26 87 5 -222 -12 -165 -142 21 274 -66 -320 250 -288 116 -25 52 20 -7 -26 238 -46
2082d6j44L93j37J07l33Mk3K70l2K7l47J99N3p9J48j62M8p8K67J56m49Q4R3j30
$$ -46 -190 203 66 173 -160 -156 -179 91 59 86 -261 -62 -9 -88 60 -102 -54 -132 135 291 -158 -74 19 -111
2106a11J34j85K19R6k93K72j87K54j54M8Q9p8m8o1r4l9j24J21p8J18R7N5m2L1
$$ -111 23 -162 57 153 -140 132 -55 199 45 93 182 104 56 -5 -99 -138 -262 -141 -219 -101 -4 51 9 40
2130D0q5L8j85N53k05j94J71l45L63j76k4M8P0j10K48k29k60L03J76k03j06J60
$$ 40 -45 -7 -192 361 156 -38 133 -212 151 -25 -49 -1 69 -41 207 -22 -282 21 197 -6 -112 48
2152D8Q1K7j50j14J00L2k44K90k18J79j61J97j55pJ37j75L4K19j60K09k30J04
$$ 48 129 156 6 -108 -8 24 -220 70 -148 31 -130 67 -88 -95 42 -133 -99 120 -40 169 -61 43
2174D3M7R6l82L92q9m0j06K9N1j83K07m3J23l93K61L4j05j36K95n8O9L7nN5k95
$$ 43 90 186 -196 196 107 67 -39 -10 41 -142 65 22 145 -248 13 47 -58 -194 101 43 112 149 144 199 -96
2199i6K87k33J68L6J1j92p4J13j55K93l47J35j13K87k00L0J20l53M12J98k45k60
$$ -96 191 -42 126 162 173 -19 -93 20 -135 158 -189 -54 -167 120 -80 -50 70 -283 129 327 82 -178
2221a78M86j53n7J03j21mK00l57K36M2M7j50q0J8j94L09o4j06J15M8Pl3j55N8
$$ -178 308 155 98 201 80 76 276 -81 155 197 244 94 14 32 -162 147 83 -23 92 140 147 114 -41 17
2245A7J1J04L9k55K40k7J5j75J54m4j00kJ61R8k59J32M3pj10ol7oo6m2k1L81m39
$$ 17 28 132 171 -84 156 129 144 -31 123 79 -21 -23 138 236 -23 109 152 145 35 29 -8 -14 -80 -122 -143 238 -201
2272b01K94m7J60J9l14J27J01l57K40j39J32J31l27J24J1J42K7j38j09O2QO5k68
$$ -201 93 46 206 225 -89 38 139 -218 22 -117 15 146 -181 -57 -46 96 123 -15 -124 -62 -54 11 -257
2295b57L80K1j15n8r6K5N8j58J34Q1j40J82J12k69j6K9Q2O2l2M2r5K38k67M29
$$ -257 123 144 29 -29 -125 -100 -42 -200 -66 15 -125 57 169 -100 -116 -87 -5 57 25 67 -28 210 -57 372
2319C72l83K5J52j16j06L5J07M4k0j37J55L7k98M04k40J63l46J62O5J31J54m34
$$ 372 -11 14 166 50 -56 -21 86 130 110 -27 128 165 -133 271 31 194 -152 10 75 206 360 -74
2341g4K82j10Nj17k35J99q8J32k0Q9O1l68J83r8k6P2J45m3rk48P7L80l21m9p2
$$ -74 208 98 103 -14 -249 -50 -138 -6 -26 63 124 -244 -61 -159 -185 -113 32 -11 -20 -268 -191 189 -132 -181 -253
2366b53K44P5k68J95j97q6K28L79m60k4L60j94J87p4j83K98m10K5l8K98q9Mj56
$$ -253 -9 66 -202 -7 -204 -290 -62 317 -143 -167 193 -1 186 112 -71 227 -183 -158 -196 102 13 17 -139
2389a39P4J9J10l16L90J52j56jj81J10m0o3K52ol42O6r5K19k78L36J08k89j10
$$ -139 -65 -46 64 -252 138 290 134 133 -48 62 22 -41 211 205 -137 -71 -166 53 -225 111 219 -70 -180
2412a80p1M15j53k7q4J7J25j51N2J00J73j73r8l0J92l73L20J6ok51KK42k80J9
$$ -180 -251 164 11 -16 -100 -83 42 -109 -57 43 216 43 -55 -85 107 -266 54 70 64 -187 -185 57 -223 -204
2436b04N00k61m4rj32j30l2M40j39j22r4M57j01k50L27l22J08M9j20J26k06Q3
$$ -204 296 35 -9 -18 -150 -280 -312 128 -11 -133 -227 230 129 -121 206 -116 -8 41 -79 47 -159 -76
2458g6n2J32k3K38j84j50m8l5J19Q3l5J25j5rj34oK0j2j64K21m8J85k19J47l24
$$ -76 -128 4 -19 219 35 -115 -163 -198 -79 4 -31 94 79 70 -64 -70 -50 -62 -226 -5 -53 132 -87 60 -264
2483b64J52J85j85M44l86m9M2J05K23k93N9k29j03K30N1Jj78J99O4J61k76j42
$$ -264 -112 73 -112 332 -54 -103 -61 44 267 -26 33 -196 -299 -69 -18 -17 -195 4 68 229 -47 -189
2505a89L53j73J86l85J58J98ml25J01q2M24k24J31k21m1J27l1k2l20M21l7J26
$$ -189 164 -9 177 -208 -50 148 144 -181 -80 -162 262 38 169 -52 -93 34 3 -19 -339 82 45 171
2527A71j26k19M06J08m80O0J13r3q8j3P1J37j49r8l0K71o6j69J31n4R0k9r2L16
$$ 171 45 -174 232 340 -140 -80 33 -60 -148 -161 -90 47 -102 -200 -230 41 -25 -194 -63 -117 -27 -56 -148 168
2551A68n9kK8Rl1l5P6k02J87n6m1j4n23P53k32jK77l64J75L5j87L7O9K04m9k67
$$ 168 109 107 135 144 113 78 154 -48 139 83 42 28 -495 258 26 25 302 -62 113 148 -39 -2 67 271 222 -45
2577d5K03K70l79K0j52R8j04K8R7j18j16K56l42J75J41l48K59L12l74J99L52m21
$$ -45 158 428 49 69 -83 15 -89 -61 36 -82 -198 58 -284 -109 32 -316 -57 255 -119 80 432 11
2599A1j20K72j13r5O5K55q4m05M85k66J01m29L38k1J95j23j11R6Oj50J05j56k3
$$ 11 -109 163 50 -45 20 275 191 -214 271 5 106 -323 15 -6 189 66 -45 51 57 -93 12 -144 -167
2622a67L0K81l9l08L09k95O5K19L4j63n5K28m58K88k5P7j65mJ57l4L2L1k8j46
$$ -167 -137 144 105 -203 106 -189 -124 95 129 -34 -89 139 -319 -31 -56 21 -144 -148 9 -25 7 38 10 -136
2646a36K0Q4j29J40k32L35p7kn1J51j35L8k51K48J23j35l2J8K36l13J57nr6K01
$$ -136 -116 -32 -161 -21 -253 82 5 3 -48 103 -32 6 -245 3 126 -9 -41 -23 213 -100 57 52 -44 157
2670A57l2J65n27K1K61J58k33qk0n8j73k3N13m31J53J24o8N7L74m25k68k0K81
$$ 157 125 290 -237 -216 45 203 -30 -38 -58 -116 -289 -312 201 -230 -77 47 -21 36 410 -15 -283 -303 -22
2693b2p7J24p0K00k56L04l53Q6j09J47J41R2l65o2M37j1m60M01j75K70j65l95
$$ -22 -99 25 -45 155 -101 203 -150 -64 -173 -26 115 207 -158 -220 217 206 -254 147 -28 242 77 -318
2715c18M41l2N8Q6k69p3J65j56lK6J20m6K8j47J90l44L03j94J43O8q9K77p3j52
$$ -318 123 91 149 235 -34 -107 58 -98 -101 -75 45 -1 27 -120 70 -274 29 -165 -22 46 -43 234 161 9
2739Im2P7n3j9kL83m75K1J29P9j50O3j69N2M07m31J81L3m0K1J48l57K58J38l19
$$ 9 -33 44 -9 -28 -30 353 -122 -101 28 107 -43 20 -149 -97 310 -121 60 93 53 74 222 -135 123 261 -58
2764e8l23J93L30k14K64j82N6r0j23j5N15r94K14N34j47K34l29K88R1n12L20k02
$$ -58 -381 -188 142 -72 192 10 66 -24 -147 -162 353 -641 -427 107 -40 194 -135 153 244 -268 52 -150
2786a50K27j8j87r2L11n5J26j7o5J4l33K75O2l16p8l9O09l58O0JJ63l35l7J33
$$ -150 77 59 -128 -220 91 36 162 145 80 94 -239 36 98 -218 -296 -335 274 -84 -24 -23 140 -195 -232 -99
2810i9j75M09p4k88K15K72p8j24J07j26P7k06j64M99k66r8M25p64M38q2K5k48
$$ -99 -274 135 61 -227 -12 260 182 58 165 39 116 -90 -254 245 -21 -119 306 -458 -20 -102 -77 -325
2832c25M67L9j68q2J21O4k92J17j54J88n5O1j20N4J10J52j11j22o4J9M76o35K37
$$ -325 142 181 13 -69 52 116 -176 -59 -213 -25 -80 -19 -139 -85 25 177 66 -56 -120 -101 375 -260 -23
2855b3j7J84k86O8om0K86j93J8J6Q6O5j73p3L5L4J31k9j23o7P5p4k19M76l31Q9
$$ -23 -40 144 -142 -74 -80 -120 166 -27 -9 7 93 158 -15 -88 -53 -19 112 83 -40 -107 -32 -106 -325 151 -180 -91
2881i1L5J03j90Q0k8k57N40k74l8M49m57N72p24K3j3J60J46K7r1M9l15K71J10
$$ -91 -56 47 -143 -63 -91 -348 192 -82 -120 329 -128 444 -280 -257 -270 -110 36 63 -28 21 -294 -23 87
2904H7P8k44j39J68N5N3j56J75o1J62k05k41K98m9k30K68Q9j2K6Q8k27j25J76
$$ 87 165 -79 -218 -50 5 58 -98 77 16 178 -27 -268 30 -19 -249 19 108 96 122 210 -17 -142 34
2927C4K8k58J65K4K39l23K78j77N1l7rN3K82m48K68l51K37m4k97M77l03k95L60
$$ 34 62 -196 -31 -7 232 -91 187 10 61 24 15 68 350 -98 170 -181 56 12 -285 192 -111 -406 -46
2950d6N5j38j04L6K78Q4k66J18n2K6L01o17L11N4O6j20m1PK96m11m1K12J8J03
$$ -46 9 -129 -233 -197 81 165 -101 17 -35 -9 292 -325 -14 40 106 -14 -55 -48 248 -163 -204 8 26 129
2974A29k27L29l11p6M30j59p1J03l29J95J09n4j19J67j95K40l15R3J00K90m40
$$ 129 -98 231 -80 -156 274 115 44 147 -182 13 122 68 -51 116 -79 161 -154 -61 39 329 -111
2995a11K98j21J36j65n2k7j04M38l00J07o0L8O0J85l05K6j69pJ7M4j43L34k57
$$ -111 187 66 202 37 -15 -42 -146 292 -8 99 39 77 137 322 17 43 -126 -133 -116 -72 -215 119 -138
3018a38j04N0K77J18k12m0j51L8J9J04K36k4k79M4J29N1j00L77m53k94M51o3o3
$$ -138 -242 -192 85 203 -9 -49 -200 -162 -143 -39 197 173 -106 -62 67 118 18 395 -58 -352 99 36 -27
3041b7K2J68j22J1Mk11J6L31k55p2J25R3Q6k81Q3O6k93M05Mj00j3M9k45J13J71
$$ -27 -5 163 41 52 56 -155 -139 192 -63 -135 -10 83 169 -112 -29 37 -256 149 153 53 40 89 -156 -43 128
3066A28k8j22j89K38k3J58j93j55K73k48J03P5K01n2j13r7L88n89J00J80R0M3
$$ 128 100 -22 -211 27 4 162 -31 -186 87 -161 -58 17 218 166 53 -44 344 -245 -145 35 125 168
3088A68k98M3l4J44q4L19k84j48K61k5r6j10K43m7j73K67j62n5n1m7P6R9k78M9
$$ 168 -130 -87 -121 23 -61 258 -26 -174 87 62 -34 -144 99 52 -121 146 -16 -71 -122 -169 -93 6 -272 -223
3112b23K68N8m2M7Q2k27M6Rq0K76k91p0L19q4j06K66k47j73J12M7j81L36k28j6
$$ -223 45 103 61 108 190 -37 9 18 -62 214 -77 -147 172 88 -18 248 1 -172 -60 -13 -194 142 -86 -102
3136a02O4Q2L2l17K88k29K07j95K9q1K50j96L3J21j20K77J06j62k0k0J68K0k92
$$ -102 -38 44 76 -241 47 -182 25 -170 -141 -222 28 -168 -135 -14 -134 143 249 87 67 47 215 235 -57
3159e7L33m30M62n57M20j69q9K01j51L58k49q2L57k96j99L54j99j4p9K08k70L02
$$ -57 276 -154 308 -249 171 2 -87 114 -37 321 72 -10 347 51 -148 206 7 -7 -86 122 -148 154
3181A54l28K76lpj78M6j0k4N3l3J84R3r1j55L66j16m46K62K28n74L18p3j0Q3j05
$$ 154 -174 102 99 92 -86 -40 -50 -74 -21 -54 130 223 132 -23 343 227 -219 43 271 -303 15 -58 -68 15 -90
3206i0J60L7N1l10J99o6q3Oj2R5O1j18k5J98k4p0J79p0Nk54L51k59K1J00j86q3
$$ -90 70 107 158 -152 47 -19 -102 -96 -108 -13 48 -70 -95 103 79 9 188 118 123 -131 220 -39 -18 82 -104 -187
3232a87K84k03Q8l4Q8j53J29J82j16l46L43n3q8K31k66Q8M1l4o6m4J11K8J60j44
$$ -187 97 -106 -18 -52 36 -117 12 194 78 -268 75 22 -66 165 -101 -13 28 -6 -72 -116 -5 23 183 39
3256C9j33O56p02K20r6R2k29K37k29J98k40K8J90k32L07r6l88M57k02M2J6M29
$$ 39 -94 562 -140 80 -16 76 -153 84 -145 53 -187 -159 31 -201 106 10 -378 79 -123 -81 -65 364
3278C64k70o8K81j46k07p1J26l24N0J54J17k03L14m74K27MM6j57K37J10j24j05
$$ 364 94 26 307 161 -46 -117 9 -315 -265 -111 6 -197 117 -357 -130 -126 -80 -237 0 110 -14 -119
3300a19O0R6j52K55j04p8M2J73m04K31k28K26j2K29m52J94M1mo5K06k83K28J4
$$ -119 -59 37 -115 140 36 -42 0 173 -231 0 -228 -2 -14 215 -237 -43 -2 -6 -71 135 -148 80 94
3323I4J85K2n07K66p4j51M97l36pP2R8j25j40K32m80J96M3J78J52k30j46N10l14
$$ 94 279 301 -206 60 -14 -165 332 -4 -11 61 159 34 -106 126 -354 -158 -115 63 215 -15 -161 349 35
3346C5l12M54k42J15M7J08l01K27k83J45J49k42J95j34J63k34J15j28K18j54m5
$$ 35 -277 177 -65 50 97 205 -96 131 -152 -7 142 -100 95 -39 124 -110 5 -123 95 -59 -104
3367a04l6J13L00l31K0K80l14K66J95m60l8J32n9QQj45M49k36j31K05o0j63L04
$$ -104 -140 -27 273 -58 -38 242 -72 194 389 -71 -109 23 -36 -28 -20 -165 284 48 -83 122 62 -101 203
3390B03j45j21j39J42J08R1J60k14k7J03j04l04M50k08J21l1k16P8K33j96N0q
$$ 203 58 -63 -202 -60 48 139 299 85 58 161 57 -247 203 -5 116 85 -131 -53 180 -16 34 26
3412B6k76L82n3J03k14l6J77j36P2o5N6J70n2l10N8j21J67N7M0Mj26J67m6J1P1
$$ 26 -250 132 79 182 -32 -68 109 -27 45 -20 36 206 154 -156 -98 -219 -52 5 45 49 -77 90 44 55 126
3437A26j90L5J44n7J08l79J58L12k17k29N35q4l54J41P2l3k09L25J10l92j20L28
$$ 126 -64 -29 115 58 166 -213 -55 257 40 -189 346 262 -92 49 121 88 -121 204 314 -78 -198 130
3459A30j80K9J8k45M36k6p8k8J42j14r4j93J45K22N0j11m37L89p0J04j98J83q6
$$ 130 -50 -21 -3 -248 188 162 84 56 198 84 -10 -203 -58 164 214 103 -334 55 -15 89 -109 74 -12
3482a2JR7j57M0o9L35k24J3k14J4J39J8J03j96J77j28RR9J89k53n5j09L34J55
$$ -12 -11 86 -71 -31 -100 235 11 24 -190 -176 -37 -19 84 -112 65 -63 -54 45 234 -19 -74 -183 151 306
3506C06m57L79k87Q2K04m5k53K09j52p5j36K06O3L4J56k05j3O6j33m1M45k60k13
$$ 306 -151 228 -59 23 227 182 -71 138 -14 -89 -225 -19 44 78 234 29 16 82 -51 -92 353 93 -120
3529a20R6L1P1j1j19J16j21J9k37K76n8J46j77M30j85l86J56J4K38k05KJ59j31
$$ -120 -24 7 78 67 -52 64 -57 -38 -275 1 -57 89 -88 342 157 -229 -73 -59 179 -26 -24 135 4
3552Dl13M14l07K93J31n1O9p2j24N1k24L37k20J60k54o1M35o6j50q9K79k46LJ08
$$ 4 -309 105 -202 91 222 171 240 168 44 95 -129 208 -12 148 -106 -167 268 202 52 -37 242 -4 -1 107
3576A07m3q2J72l68J20K59j57j6J15J42k02m0rK03k93J83l18L0L35l03J34J62
$$ 107 64 -18 154 -214 -94 165 8 -8 107 249 47 7 -2 201 -92 91 -227 -197 138 -165 -31 131
3598A31n0j07K28n62N26q9p1J31P4j48pk23R5J52N6l99J68o2L09j28j67J79k41
$$ 131 81 -26 202 -360 166 77 6 137 211 63 56 -167 -72 80 136 -263 -95 -157 152 24 -143 36 -205
3621b05J67o0J22P6j21k56K76m0K40m8k94K08j09J57j48r6M4MO4J0J26K09n18
$$ -205 -38 -98 24 100 -21 -277 -1 -41 199 151 -143 65 -44 113 -35 -131 -87 -83 -19 -9 117 326 -192
3644a92J05J00K97j88j22J07J7l2j53J72ok08K37k25K79p1p08R07k12K07q95P76
$$ -192 -87 13 310 122 0 107 124 92 -61 111 105 -103 134 -91 188 117 -591 316 104 311 -584 192
3666A92r49Q00l01l20N15j98L74N8j25p1K68j35k01J33K3p3j02j09K92mQ5L8k50
$$ 192 -757 43 -258 -578 -63 -261 113 171 46 -25 243 108 -93 40 63 -10 -112 -221 71 67 152 190 -60
3689f0R9p4p1J35k12R1l0K43p8k25L32J6l83J07R4l4R7j49L06k22mk77L16K97
$$ -60 39 -35 -106 29 -183 -92 -122 121 43 -182 150 166 -217 -110 -16 -50 47 -102 204 -18 -22 -299 17 314
3713C14k09j88M00n18K27R5j51l5j91J30%R0J42k73oJ06J62P9o49N71k10K38p0
$$ 314 105 -83 317 -201 26 121 -30 -65 -256 -126 -126 -36 106 -167 -173 -67 95 174 -475 96 -114 124 54
3736E4o7J55j26k29O4M63n43M66j01k60j93J02N15n06O07n7m93L61k20J55R8l30
$$ 54 -13 142 16 -213 -149 314 -229 237 136 -124 -317 -215 300 -206 401 344 -149 212 -8 147 245 -85
3758h5N1k03M6K3J8qM08m06K29j00k35J69K89p0l83M99l45L68l11K66r5j42j31
$$ -85 -34 -237 -191 -168 -150 -158 250 -156 73 -27 -262 -93 196 126 -257 242 -103 265 -46 220 125 -17 -148
3781a48P5R8p5M1K81m10L9j89J28K81L36o52M55L0j74m03N26l82J81j39L70l8
$$ -148 -73 25 -50 -9 272 -138 -99 -288 -160 121 457 -195 260 290 116 -287 239 -143 38 -101 269 231
3803B31k2j82l54N40k44M59m24P52j232R20n07n48N14k93P07o49J72L48j30r25
$$ 231 209 27 -327 213 -31 428 4 756 -476 444 -63 -611 -97 -390 317 -332 -160 188 58 -867
3823h67P33R50j249L77p53K33pJ464j63R3q48L38p3q27M86K76L20j341J94N58
$$ -867 -134 816 -433 -56 -809 -576 -583 881 718 811 -37 301 228 -599 -113 163 483 -858 -664 -106
3843a06l21j42M08O26J212k210J140r69L96l37J588j112n76Q40j302P20j66R30
$$ -106 -427 -569 -161 465 1677 -533 607 -362 34 -303 1285 173 -403 437 -865 -145 -311 619
3861F19J83j49J65j344r9O7R92l34q21R01o16J79J038j332J222r87J31P79n18
$$ 619 802 653 818 -526 -625 -558 434 100 -721 180 -436 -257 781 -551 671 -316 -185 594 76
3880G6K42J94l55l20M75j38l66j90Q56o27O95j090Q13o30L51j11O5N60m34k55
$$ 76 318 512 157 -163 312 174 -192 -382 474 -153 542 -548 265 -365 -14 -125 -60 500 66 -189
3900a89k11K14j67P75p33J52j31Q61r66N10M3n76kR76L5j429Q79l62O3L57o50
$$ -189 -400 -186 -353 422 -311 -159 -290 571 -395 115 158 -418 -420 556 591 -838 41 -321 -258 99 -551
3921e51N0N7J11K90k05k14K65M13p1j42Q3L80n14L40r32N85L53n82K7P47q08K25
$$ -551 -501 -444 -333 -43 -248 -462 -197 216 145 3 86 466 -48 292 -640 -55 298 -284 -257 490 -318 -93
3943i3r4M81j49j16l81R62J1jo15m90J39J26M88M44p05M95J77n17l41K70M84o76
$$ -93 -187 294 145 29 -352 610 621 620 5 -485 -346 -220 268 712 7 502 679 162 -179 91 575 -101
3965a01O80O2j337J227n14J14k02L74l44O00k90j51m24N11m3k83M43o77J47P24
$$ -101 579 641 -696 531 17 131 -71 303 -41 559 269 118 -306 205 162 -121 322 -355 -208 516
3985E16p43k81J363j223L71j64p0j98l2O58L96m47j173J169l01l77J520n95q71
$$ 516 -227 -508 855 -368 3 -161 -231 -429 -461 197 593 146 -1027 142 -159 -536 984 389 -482
4004d82R87P9r54J146r74J28J099m2l93l05m40j153J696K14o50J85j277J294p9
$$ -482 505 584 -370 776 -198 -70 1029 987 594 289 -151 -1304 392 606 -44 141 -1136 158 79
4023G9K81m43J80M72j381P37J0l1k23L09l77J47J101n30o32o24J408l24N03j150
$$ 79 360 -83 97 569 -812 -75 -65 -96 -319 -10 -387 -240 861 331 -301 -925 483 159 662 -488
4043d88R57p09K88M16j313J087L20J15l41n99N6N66l54n0k09j08k41K244j851
$$ -488 469 -240 48 464 -849 238 558 673 332 -267 -211 355 1 -49 -258 -366 -607 1637 -214
4062b14Q9M05R8Q43j275j07k01P53L20p53R4J90m75Q6j99P26n16L10rj34l91K22
$$ -214 -125 280 378 1221 -54 -161 -362 391 711 -42 52 242 -233 -147 -346 380 -136 174 165 31 -360 -138
4084a38Q65j575R33j02Q84r73O61r30K80j31L06p7K09K09m65R5P97j055o81P78
$$ -138 727 -848 85 -17 867 -106 555 -375 -95 -226 80 3 212 421 -44 51 848 -207 -888 -110
4104a10O11n41r10J528M8n64L54N52p14n00o5M62K79p91J152q22K7K33L41n39
$$ -110 501 -40 -950 578 626 62 416 968 254 -246 -311 151 430 -361 791 -31 -4 229 570 31
4124C1J3n43N05J77j12M47j65j035N46J86k53O70K89k48J58j479P55k49N36K8
$$ 31 44 -499 6 183 71 518 353 -682 -136 50 -203 467 756 508 666 -813 -58 -307 229 257
4144B57K98j88m95k29l15J587l22L29k6o51q61J42J428j765Q84j79Q78j251J790
$$ 257 555 367 -128 -357 -672 915 593 922 896 245 -616 -474 954 -811 73 -106 772 -479 1311
4163A311j499j14Q51j0Q67j538J025j542N73o3M1l55N8j55K34PRK79k25J064j014
$$ 1311 -188 -302 549 539 1406 -132 893 -649 -76 -139 -98 -453 -395 -550 -316 -309 -300 -21 -246 818 -196
4184a96K87n8J64k07J6k7R9N5o9j28K3j9Qk56K10P2P9k09L21k39o3J91j62P4J91
$$ -196 91 33 197 -10 6 -21 78 133 64 -64 -41 -60 -52 -308 -98 -26 53 -156 165 -74 -137 54 -108 -34 157
4209A57j87j21M12j37R%j46J5n2N6n5j49P3N9J12kJ23k51J67L3k26J3j80o0J76
$$ 157 -30 -151 261 124 133 133 -13 2 -50 6 -49 -198 -125 -66 46 44 167 -84 83 116 -110 -97 -277 -337 -161
4234a61P8K11J6j46K8k81J92j13P0P9J32Nl47J93j42J80L00k99l03O22l6l42o2
$$ -161 -83 128 144 -2 26 -255 -63 -176 -106 -27 105 110 -237 -44 -186 -6 294 -5 -308 314 278 -64 -126
4257a26M30k66Qp8Q1j35P4Q0l38K41J80k1q6j50K07J23k74j3j30K19o7j81L85
$$ -126 304 38 46 -32 49 -86 -12 68 -270 -29 151 130 44 -106 101 224 -50 -63 -193 26 -41 -222 163
4280A63j28k05N7J63l6j53J73o6r0J82j23P6l1l9K2L6p1J03o2p8n3m4J78j67j11
$$ 163 35 -170 -113 50 14 -139 34 -32 -122 60 -63 13 -18 -57 -35 1 -70 33 -29 -107 -160 -204 -26 -193 -304
4305c04L93n5k41J3Q6J84p4j32J51J38k55K40j5j47r1J04q1O0j68L33j91l0J01
$$ -304 89 34 -207 -194 -108 76 2 -130 21 159 -96 144 129 -18 -109 -5 -86 -26 -194 139 -52 -82 19
4328A9R8J73m88L12j60k2K99k49j09J94l4K61k82J15j47L12j15j13j23PJ73j29
$$ 19 117 290 -198 114 -46 -68 231 -18 -127 67 33 294 12 127 -20 292 177 64 -59 -52 121 -8
4350hj09J1J09J12N0l17J79K47m04J90J74k94L2k14L77k35k33K11K05l00J48j4
$$ -8 -117 -106 3 115 165 -152 27 274 -130 60 234 -60 -28 -242 135 -100 -333 -122 83 -217 -69 -83
4372h3K85k57q7Mq5L19Kk89L19J56Ok83n1N9l8M7J6J68j93j68K95n1l44M71k67
$$ -83 202 -55 -142 -138 -223 96 98 -191 128 284 290 7 -44 15 -23 24 40 208 15 -153 142 91 -253 218 -49
4397d9L09l90R0K41k94o5J38mJ98j04j67K04o5j24J66k89J85m4L04j03j22j17
$$ -49 260 -130 -40 201 -93 -158 -20 -24 174 70 -97 107 42 -82 84 -205 -20 -64 240 137 15 -102
4419a02m7K95k00J76N7k58K9J13N6Qj6j67J78j2k87r8M78k27j48J04J34ok04J40
$$ -102 -149 146 -54 122 179 -79 -50 63 119 127 111 -56 122 110 -177 -275 203 -24 -172 -68 66 60 -144 -4
4443dJ30k29L2J8n6PJ64k03K94q1J4j47R9k76K70M2j32M1N3J18l69M22j91k8P
$$ -4 126 -103 -71 -53 -109 -102 62 -141 153 72 86 -61 38 -238 32 74 -58 -17 36 154 -215 207 16 -12 -5
4468ek52L47k27J52n9K79j91k4R8k81L20j09J87k4O0l66J46k20K57j56Q2j25j
$$ -5 -257 90 -137 15 -44 235 44 20 118 -163 157 48 235 211 271 -95 51 -169 88 -68 14 -111 -112
4491a12J87J12k39K16l48J92N0O1J92k14l27%M23k00Q7l8o4k17M17l66L21o7q1
$$ -112 75 187 -52 164 -184 8 58 119 311 97 -230 -230 193 -7 80 42 -22 -239 178 -188 133 66 -15
4514a5o5q1J37J17k36j35M36p7K6j79J22K47l64J62j1o7M0Q9j05k36K44K8P9k11
$$ -15 -80 -161 -24 93 -143 -278 158 81 107 -72 50 297 -67 95 84 17 57 146 41 -195 49 77 156 -55
4538e5p4M08l34m00M73L8j57J98n5l15M21m69M01j51N1K07k29O2M9l2nj37L30
$$ -55 -129 279 -55 -455 18 56 -101 97 42 -273 148 -321 80 -71 -20 187 -42 20 69 37 32 -105 225
4561B25k8q5j00J14j70R1J11k23n3K00q7k34L24p0j90L29j81J06K12j61n0j44
$$ 225 197 112 12 126 -44 47 158 -65 -118 82 -5 -239 85 15 -175 154 -27 79 291 130 80 -64
4583f4m8L25k72K5J28o9m6R3k29J68k9Rp2K36k60Mo3k20J88L62J42l23L4K65k53
$$ -64 -112 213 -59 -34 94 25 -21 72 -157 11 -18 -9 -81 155 -105 -101 -164 -384 -196 166 308 -15 19 284 31
4608C1J9N4j69j4K61k26m1J47j15j64L46k64K36k67k0k0J63m7K9j48L24lp0j67
$$ 31 50 104 -65 -79 182 -44 -85 62 -53 -217 129 -135 101 -166 -186 -206 -43 -90 -61 -209 115 112 42 -125
4632a25M9j85K97m6J82Kl85K30O9j04L2N5P7l6n0j32O9J6J91o8P1J14l51o5N7
$$ -125 -76 -261 36 -10 172 174 -211 19 88 -16 16 71 148 112 62 -70 -1 15 206 138 209 323 -28 -93 -36
4657c6K15l93K54J98k79K34l21j0r7M7K64j27NJ00j52K14q1K9j54lj04L66L9n8
$$ -36 179 -214 40 238 -41 193 -128 -138 -235 -188 76 -51 -46 54 -98 116 35 64 -90 -93 -197 169 208 150
4681A50m9j63P0j63J77K71k59O1j1n5j93J79J88k72J92K7j92j12L58j85K05k41
$$ 150 101 -62 8 -155 22 293 34 95 84 29 -164 15 203 -69 123 150 -42 -154 204 19 224 -17
4703a7j68O7L34l50R1R3k30J86o2n4k84N34m8l14J59j04J37J62r5J17n7k76lK70
$$ -17 -185 -118 216 -134 -43 50 -180 6 -56 -110 -394 140 92 -222 -63 -167 -30 132 37 154 97 -179 -182 88
4727H8l5n5O3m9qm0j91K10J21K45m79R7L75l90J96j54K1l3Q0O3k1j03m9l4M4J27
$$ 88 53 -2 61 12 4 -36 -227 -17 104 349 -130 -33 342 -48 148 -6 15 -18 62 125 104 1 -48 -82 -38 89
4753H9k33K22k09K05l84L03J99j45j65L72j50j98J1K37j68J47j78Q6r4K80l23
$$ 89 -144 78 -131 74 -310 -7 192 47 -118 254 104 -94 -83 154 -14 133 -45 41 -53 227 -96
4774i6J41m6p0J57J33k83j36L63j7o9j06j3K3j77K92k35L5k8k1K72l47O7N3J04
$$ -96 45 -1 -71 86 219 -64 -200 163 146 77 -29 -42 -19 -196 96 -139 -104 -132 -153 119 -228 -161 -108 -4
4798dn1J10p1J10l01M79k13J43k63K5n9P5j91J80N9j76J81M7k06L60k50l1k77
$$ -4 -55 55 -16 94 -207 272 59 202 -61 -36 -95 -20 -211 -31 28 -148 33 80 -126 234 -16 -47 -324
4821c24L09Oj4j33j21M03r7j17p4J00N4J7L6n8R6j52N7P4l05Q8M46m15J56J59
$$ -324 -15 -9 -23 -156 -277 126 29 -88 -162 -62 -8 9 45 -13 83 -69 -12 62 -243 -155 291 -124 32 191
4845A91l27J00K91j84j08k78L63k05K63j40K94k51J11o7r4R6P7j13O2Qr4J29k96
$$ 191 -136 -36 255 71 -37 -315 48 -157 106 -34 260 9 120 53 -41 55 132 19 81 89 -5 124 -172
4868a72K19j39J54J31k77j13J57K9m0J02ml28M83j11j75k5J06p4K24j32j83J71
$$ -172 47 -92 62 193 -84 -197 -40 -11 -51 51 47 -281 202 91 -84 -109 -3 -77 147 15 -168 3
4890CJ26J5R7l35J44K28l05K20L9k08j52j12L44p6J0q5nJ03k01K56J51k17j13
$$ 3 129 144 241 -94 50 278 -27 193 232 24 -128 -240 104 28 38 -47 -52 51 -150 106 257 40 -73
4913g3jj30L12l37j3L42r6J12j17j43p6M69k64o7K18k9j62P8K92l4l76m1J99q3
$$ -73 -74 -204 108 -229 -242 100 4 116 -1 -144 -220 249 -15 -82 136 107 -55 23 315 281 -95 -136 63 -20
4937b0j64J75R5j24j28L80l19J66o3j48N4rK46j5mn42M54k11L47j57q3jj4J10
$$ -20 -184 -9 86 -38 -166 214 -105 61 -2 -150 -96 -105 141 126 122 -420 34 -177 170 13 -70 -71 -85 25
4961B5k40L22k08R0J66j27l01L90n7j86J01Lq8P9jK47r6p9N3j63J48pp7j52J31
$$ 25 -215 107 -101 -11 155 28 -273 117 60 -126 -25 -22 -110 -31 -32 215 119 40 93 -70 78 71 -6 -158 -27
4986b7J62k86K89n0M0Lk23K62L0k12J68l37K25M1m8K31j84r2M0K2m3k3J26k76
$$ -27 135 -151 138 88 128 131 -92 170 200 -12 156 -181 44 85 37 268 84 -8 32 54 11 -12 114 -162
5010a62J13j71J92l6P2j32j24K28K4J3L03m10p0P5Q0q1J50j19L9n2P4J67l35J21
$$ -162 -49 -220 -28 -64 8 -124 -248 -20 4 17 320 -90 -160 -85 -5 -86 64 -55 -16 -68 6 173 -162 -41
5034d1l1K62j26j30N6Q4j10j0j4r0M71k12j36J83l91K6M37k31R0Ro1J27q6r1r6
$$ -41 -72 190 64 -66 -10 74 -36 -46 -60 -150 321 109 -27 156 -235 -209 228 -3 87 96 35 162 76 -15 -111
5059a11r9K72P7k7L8j7j90j10K49R1k55L13k21r4J4Q9N1k47O7L12l65m6j18J34
$$ -111 -210 62 139 112 150 133 -57 -167 82 173 -82 231 10 -84 -70 19 70 -177 -110 202 -163 -209 -327 -193
5083a93J16K1J42j94j92J44O2k13L47j81P6j91O27m79l1J23k5j33K79l32L66o6
$$ -193 -77 -56 86 -108 -300 -156 -94 -307 40 -141 -65 -256 371 -108 -139 -16 -41 -174 105 -227 139 73
5105G3r9jj55r2J16o3K11J57j68R3j77K22o1J70j31j54L9q7J50n2N2j06J77k54
$$ 73 -26 -27 -182 -274 -158 -221 -10 147 -21 72 -105 117 56 226 95 -59 -20 -107 43 -9 43 -63 114 -140
5129a40J57K94l90L05n3j8k80J72k8n5R9lmj20Q9k30K72M4n2o5K60k77J98q9j48
$$ -140 17 311 -79 226 173 155 -125 47 19 -36 63 60 56 -64 25 -205 67 111 59 -6 254 -23 175 86 -62
5154f2J75j08N2Q6q0N0j18J94j44J05Rn4j26j18J25j12K83m86L25M4j30M7K9J0
$$ -62 113 5 57 143 63 113 -5 189 45 150 159 105 -21 -139 -14 -126 157 -329 -4 40 -90 -43 -14 -4
5178dJ02j41P0j78J94Q5m5P6k26Oq2K98j07RJ01k46N7J31k07Q9K13q0j16p1Rj79
$$ -4 98 -43 27 -151 43 128 83 159 -67 -61 -143 155 48 57 158 -88 -31 100 -107 -18 195 115 -1 -72 -63 -242
5204b42K26m0k10L08J46J40l03j42M0o1P3mj33J45j89L00R2k00J8K1j12K19k62
$$ -242 -16 -56 -266 42 188 328 25 -117 -77 -138 -65 -69 -202 -57 -246 54 146 -54 -36 -15 -127 92 -170
5227a70q2K78J17j80j28J15j94L06k10J50o5m1j05J97P8K4L3p7p4J81k84J68K58
$$ -170 -252 26 143 -37 -165 -50 -244 62 -148 2 -63 -104 -209 -12 66 90 123 46 -28 153 -131 37 295
5250B95j39j75J3M7r3O8j62J96J0j97L69m8l0j63Q9K81m64M9P1m8J01j54j12Q1
$$ 295 156 -19 -6 41 -52 16 -146 50 60 -137 232 184 154 -9 80 361 -103 -54 17 -31 70 -84 -196 -115
5274a15K41J1j64j55J7K89N5l40M32n70K69R7NN9qk20J48K6L0l9l34J73J41j86
$$ -115 126 137 -27 -182 -165 124 179 -161 271 -299 -30 67 72 131 123 -97 51 77 107 68 -266 -93 48 -138
5298a38J77j75J40M5k23J41P1J96l38J93j57m4J44K02l21R3R2k10p0N0P2Q7n4
$$ -138 39 -136 4 49 -174 -33 38 234 -104 89 -68 -112 32 234 -87 6 98 -112 -182 -132 -60 27 -27
5321b7R0J33n02J64K21l1R5j34O6j0m2j3K75j73k24M70m35q5K88l49K96J13r6
$$ -27 63 196 -306 -142 79 48 143 9 75 65 23 10 285 112 -112 358 -77 -162 126 -223 73 186 90
5344I0j04o0K65k43J47l8k4M2j06j23L1M74m24M27l18J37k35J40k80R8MNJ00k37
$$ 90 -14 -74 191 -52 95 57 33 75 -31 -154 -123 351 -73 354 36 173 -62 78 -202 -104 -100 -95 5 -232
5368b32J61n3J22J60j30Q1j68O4q3O1J03j86L06l96J43K22j9mk24o4K81l51K54
$$ -232 -71 -124 -2 158 28 109 -59 5 -78 -17 86 -100 206 -190 -47 175 156 152 -72 -136 145 -206 48
5391D8j64K17R4l90JK86j39Kl1j97L94l15J81J07j86J92qJ7l4n5l38J55K80j06
$$ 48 -116 101 195 -195 -194 92 -47 -45 -76 -273 121 -194 -13 94 -92 100 92 109 75 20 -318 -163 117 11
5415A1J23l36K04k01L40j82k54L40k85J42L27k87j9j02K08j09O0O7KM0j33K62
$$ 11 134 -202 2 -199 141 -41 -295 45 -240 -98 229 -58 -77 -179 29 -80 -20 47 49 89 -44 218
5437B18j33J29n44O68k93L43m04p8o9L4N3P2P5L5N2J07n2j46l83L70J57j46l79
$$ 218 85 214 -330 338 45 388 -16 -94 -163 -129 -76 -4 71 106 158 265 213 67 -316 54 211 65 -314
5460c14K17J36m1k39L54j52J80k43M07l50Q6K1j52J93J8Q6k21O0k09lK37J33j39
$$ -314 -97 39 -2 -241 113 -39 141 -102 305 -45 41 62 -90 103 121 207 -14 46 -163 -166 71 204 65
5483F5N6j57J16j51K19j69K23j32n6q1l8Q1O8n5J45j21J70n9J26Lk84Q4J57k74
$$ 65 121 -36 80 -71 148 -21 202 70 14 -67 -105 -24 44 -11 134 13 183 124 250 253 -31 53 210 -64
5507f4j2%K7J72j80L54k89L6m8k15J28L02k85J40j4J28K7r4J1k0J56q3l9l72K26
$$ -64 -76 -76 -49 123 -57 297 8 44 -4 -219 -91 211 -74 66 52 180 207 113 124 104 260 177 138 -234 -8
5532hJ05N0j25k77M70l58N1K33j61P2j70j32K23Q0o7J8k39QM31p6l02L13j95o0
$$ -8 97 147 22 -255 215 -143 -92 141 -20 52 -118 -250 -27 53 -14 4 -235 -227 204 128 -174 139 -56 -116
5556a16k05M64o9M9J9o5m9n9J43j81J38O5l11L10q6J35l21L41j95k00K04M3K8
$$ -116 -321 143 74 123 142 77 28 -31 112 -69 69 134 -177 133 47 182 -139 202 7 -193 11 54 82
5579H2J04k83R3M3k34MJ11L03k87R1l2r6j85O06l90n7P0l15K83Q2K0k3o1K74l25
$$ 82 186 -97 -4 39 -195 -191 -80 223 -64 27 -5 -101 -286 320 -70 -127 -57 -372 -89 -7 13 -10 -71 203 -122
5604a22L9l0O1q3j6KJ08o9K34n6n3Kj37J55m1K38m85L82k89J74N0p5n2M93j62
$$ -122 -83 -113 -52 -135 -151 -149 -41 -110 124 68 15 17 -120 35 -6 232 -253 129 -160 14 64 -11 -63 430 268
5629B68N92q23j65J88j10P5m5p6J22m2P7j99J70OM6O4J28l28R8q3Q2O8j39r2J73
$$ 268 860 37 -128 60 -50 25 -20 -96 26 -16 61 -138 32 38 84 148 276 -52 46 -37 45 113 -26 -118 55
5654E5j4l8j74K01K7Nj96j30L56j71j84M10j2k93M91n20L67J55j5k11l45O40p21
$$ 55 41 3 -171 30 57 62 -134 -264 92 -79 -263 147 135 -158 333 -187 180 335 320 109 -236 404 -317
5677c17J2K20j08J91M79q27J35K03J58j097J201j16O4k81L86J30P65p23r9k22
$$ -317 -305 -85 -193 -2 477 -350 -215 -12 146 -951 250 134 198 -83 303 433 1198 475 376 154
5697A54l42m46P86p94R33P42o07L64K07j587L88O44k79k70l03R4J86J94pJ2J28
$$ 154 -188 -634 152 -642 291 1033 426 790 997 -590 -202 442 163 -107 -410 -316 -130 64 57 69 197
5718A97l64L06M0k04J23j57Q7j5K94l20%N8j14j20J21nr3J42L70k75R6m55L73
$$ 197 -167 139 179 -25 98 -59 28 13 307 -13 -13 45 -69 -189 -68 -73 -166 -24 346 71 167 -288 85
5741H5l82K81J43m4j62o3M7L96l45m3j31J37K05k49J34m3K01k75J76o5k08J25
$$ 85 -297 -16 127 83 -79 -142 -95 301 -44 -87 -218 -81 124 -125 9 -34 167 -108 68 3 -205 -80
5763h0o6K66k86P0J29q7r3J20K05j13k15L36j49rj16j26K42Q1j98J04K70j42J22
$$ -80 -146 120 -166 -96 33 -54 -147 -27 178 65 -150 186 37 28 -88 -214 28 109 -89 15 285 143 265
5786B65r2k65L6L10n23R8K4K25L24m63P4O3p0K39j60p1q2O5J85j09j91mJ98Ml40
$$ 265 173 -92 -56 254 -269 -171 -147 78 402 -61 13 76 6 245 85 14 -68 -3 182 73 -118 -122 76 80 -260
5811b60K66m6k17L62m7J22j67k01N9k93N21j74k33L56J59j12P7k26j90K8O4j6
$$ -260 6 -40 -257 105 58 180 13 -188 -129 -422 99 -75 -308 48 207 95 172 -54 -244 -216 -152 -168
5833a68L82l82L7J07k07J27LQn39J208p15J48j08K76q9k41J54o0J41j66L0R6j18
$$ -168 214 -168 -131 -24 -231 -104 -101 -93 -632 576 -139 9 -99 177 88 -153 1 -59 82 -84 -54 42 -76
5856g6P3qq5J28j84J5K51k09O6J17O8r5k38J48P8%p9j25J24J72l07J44K97j95
$$ -76 -3 -11 -96 32 -152 -137 114 -95 -29 88 156 61 -177 -29 49 49 -30 -155 -31 141 -166 -22 275 80
5880H0j14K8N4m2j6j15P3K20J18j10J30l51j17n8M00k50K45k36N7m5j7P8K49j69
$$ 80 -34 -6 48 6 -10 -125 -52 168 286 176 306 -45 -162 -220 180 -70 175 -61 -4 -49 -66 12 261 92
5904I2K8j39j06K45n68O45k52j20J55j66L48k12O3p0j30K46Qj08K82j42j01p8
$$ 92 120 -19 -125 120 -448 197 -55 -175 -20 -186 162 -50 13 -57 -187 59 67 -41 241 99 -2 -80
5926h0K9j72L93Rm45N61m04j25q5J46j7Q3J03M1j75J29k18m7J86J35J66J1j01
$$ -80 -51 -223 170 179 -266 295 -109 -234 -319 -173 -190 -107 -4 37 -138 -9 -227 -274 -88 47 213 224 123
5949A23k92J80J84l30J99J24k9k75L73n26M10j29m2K03l83L69j82l5K1p5J56q7
$$ 123 -169 11 195 -135 64 188 159 -116 257 -269 141 12 -30 173 -210 159 -23 -58 -37 -112 44 -43
5971d3p0L29Pk42kQL14l91J58j9R8l12K74k92L09j18p2N2p7L21o48J73L41j95
$$ -43 -113 216 223 -19 -21 -13 301 -90 68 49 147 -165 109 -183 126 8 -64 -12 -89 232 -416 -243 98 -97
5995i7n6J07k42J64k4Q5p4P2K59k43J35o4K8M5j23l2J49N2k01q9M6J07J78k22
$$ -97 -153 -46 -288 -124 -148 -63 -137 -65 194 -49 86 22 50 95 -28 -60 89 141 -60 -149 -103 4 182 -40
6019d0O6J64l08J53qK5j13L8j48J42l50K08K15M5k35L44l0Rj10o0J85j29L4l03
$$ -40 26 190 -118 35 27 52 -61 -23 -171 -29 -379 -171 44 89 -146 198 168 177 67 7 192 63 97 -206
6043b06J36J53k18N9J98k36K31R1l3l18J54k8K19k45k29N82n7k49k44K74q5n1
$$ -206 -70 83 -135 -76 122 -114 117 208 175 -143 11 -17 202 -43 -272 310 253 4 -240 34 -51 -102
6065a02J60n6L4J93l53m5K76L1l9N5p9K8j66L3n2J19j5j16J44jj10j26N23l83
$$ -102 58 2 36 229 -124 -169 107 138 99 154 75 103 -63 -30 -82 37 22 -94 50 49 -61 -187 336 -47
6089d7q9O3J17j20j91K73m3j02O4K21j28l8N1j52N0L24m19K15J48o8l69K66N3
$$ -47 -136 -73 44 -76 -267 6 -37 -139 -75 146 18 -20 31 -121 -71 253 -166 49 197 129 -240 26 79
6112G9J85l05O5j97K3J85K46k76j57Q4k4o5L72k19J22n8j45J31J76n9j04j3M2
$$ 79 264 -41 24 -173 -150 35 281 5 -152 -68 -92 -157 215 -4 118 60 -85 46 222 163 59 46 88
6135H8K86m80N7j6L7l4N0K92R5j45l29N3l8J62L1L9L4K03k38j37KO9rj37pq8J58
$$ 88 374 -106 -49 -65 -28 -62 -12 280 375 230 -99 -46 -84 78 109 148 182 385 147 10 12 81 72 -65 -72 -160 -2
6162bk86K75k38L64l7J42O8j34k37P8j38P0K45l4k11J62k70L10j95J72j49M15
$$ -2 -288 -13 -251 113 76 218 286 152 -85 -7 -145 -75 170 136 -75 87 -183 127 -68 104 -45 370
6184C70l49k08L74k83j39L38j83J19k17J08j6n4J16j28L07l72K1J91M5J0K14l81
$$ 370 21 -187 187 -96 -235 103 -80 39 -178 -70 -86 -140 -24 -152 155 -217 -196 -5 40 50 264 -117
6206a17K26J05q1K54j42l93J61pj56K49l62K14K21k3k19m3j0L01j71K00j81k81
$$ -117 109 214 133 387 245 -148 13 6 -150 99 -263 -49 172 149 -70 -113 -123 178 7 207 26 -255
6228b55M15j17J30o8j7l04J88r5J79k45j76K02l06N69rk41J96j4k4j13m5LL16
$$ -255 160 43 173 105 88 -216 -28 -123 56 -189 -365 -163 -469 100 91 -150 46 32 8 -105 -150 -147 169
6251A69k54K2m1n4J71j48o1L58j74J55K9k99K03J97l16J83k96Q4J21j21L3k8O3
$$ 169 -85 -63 -104 -158 13 -135 -196 162 -12 143 172 -127 76 273 -43 140 -156 -72 49 -72 -39 -67 -4
6274dm4o7L3j5Q2q1nJ72j61K08J55m28mJ47Q4R6j28j06p9O5K5Mk04J15J19J15
$$ -4 -48 -115 -82 -97 -15 -96 -101 71 -90 118 273 -155 -159 -12 72 168 40 -66 -145 -80 -55 -51 -255 -140 -21 94
6300I4J54l18K6j82N17n67K90QP4kJ62m03QN9J45j28k29K36n5J49j50o0M88q7
$$ 94 248 -70 -44 -226 291 -276 14 22 96 94 256 -147 -139 -80 65 -63 -292 -56 -111 38 -112 -172 316 229
6324B29l24L71j26M8k51M2k2J5j65J36O7k1l5j76J77j20L82k33j40K74r1p9q7
$$ 229 -95 276 150 198 -53 -11 -33 -18 -183 -47 20 -1 -36 -212 -35 -155 227 -6 -146 128 37 -42 -129
6347a29R4r8J75j86K68j30L8P5q0J25k40O6K38j53O1J40l40L9j06L27Q5k31n3
$$ -129 -35 -133 42 -144 124 -6 32 107 27 152 -88 -22 216 63 124 264 -76 -37 -143 184 269 38 -15
6370a5m7j90L93l30K58R7L5Pk18p5L43k88O8m8J36m7q3Q1k17J14J87k16m7p3K58
$$ -15 -62 -252 141 -189 69 166 201 208 -10 -85 258 -30 38 -10 126 79 -4 77 -140 -26 161 -55 -102 -175 83
6395H3K25l57K01j80N6N3J87l30q4L25n37L57k1K03j80k46L38j07j28K78r1J87
$$ 83 308 -49 152 -28 28 81 268 -62 -146 179 -358 -1 -22 181 1 -245 93 -14 -142 136 45 232
6417B32ql18l4K68p5o1j00J10K17k35p0K82j81j35J32k51J44n9J47J14l1L01j30
$$ 232 224 -94 -128 140 65 4 -96 14 231 -4 -74 208 27 -108 24 -227 -83 -142 5 119 88 389 259
6440B59j45J39l82M3k75L77j1KJ02k38J92K02m59K28j0j35O1J13N8k19J51j4j21
$$ 259 114 253 -129 -86 -361 16 5 7 109 -129 63 265 -194 34 24 -111 -50 63 121 -98 53 39 -82
6463h2K57k36J37L05l75J50k17m2P8j2PlL12k71J27J1l5k13j00L04o8L6P2j42
$$ -82 175 -61 76 381 6 156 -61 -103 -25 -37 -30 -33 279 8 135 146 111 -102 -202 102 34 70 142 0
6487@O6n6j63J79J68k34J03N2k99L60l12J08m9j42K75q7J76J1J72l21Q0K76j54
$$ 0 66 10 -153 26 194 -40 63 115 -184 176 -136 -28 -77 -219 56 -31 145 156 328 7 87 363 209
6510B09l26K26r2J32l13m9J51j64M73l09N6j21N5N5j4n9J89k39J80J74l69J0J58
$$ 209 -117 109 17 149 -164 -213 -62 -226 247 -62 -6 -127 -72 -17 -31 -90 99 -140 40 214 -155 -145 13
6533A3Kj82R1K09l7j7J45j17n3m7J54o8k87J98k81L83l07L43o1m27K83P8N0o5
$$ 13 15 -167 -76 133 96 79 224 107 54 7 161 93 -194 4 -277 106 -201 142 81 -346 -63 15 65 0
6557@j03J2K53j49nK9j4n2K53m30K75q2J29j11L02k83Q7q1R4k1j39J71m1K9J14
$$ 0 -103 -91 162 13 8 37 23 -29 224 -206 69 -13 116 5 307 24 111 30 124 103 -36 135 94 123 237
$$ [...]
8191A40
##END NTUPLES=NMR FID
##END=
