##TITLE=1H_DE-155_DEP_TFA
 200.13Hz, DMSO-d6.
 8 sc
 29.6.2026
##JCAMPDX= 6.0         $$ Bruker NMR JCAMP-DX V2.0
##DATA TYPE= NMR FID
##DATA CLASS= NTUPLES
##ORIGIN= UXNMR, Bruker Analytische Messtechnik GmbH
##OWNER= pz
$$ XWIN-NMR		Version 3.5
$$ Mon Jun 29 14:09:40 2026 Russian Standard Time (UT+4h)  she@DPX200
##.OBSERVE FREQUENCY= 200.1313
##.OBSERVE NUCLEUS= ^1H
##.DELAY= (6, 6)
##.ACQUISITION MODE= SIMULTANEOUS
##.ACQUISITION SCHEME= undefined
##.AVERAGES= 8
##.DIGITISER RES= 18
##SPECTROMETER/DATA SYSTEM= spect
##.PULSE SEQUENCE= zg30
##.SOLVENT NAME= D2O
##.SHIFT REFERENCE= (INTERNAL, D2O, 0, 14.3821)
##AUDIT TRAIL= $$ (NUMBER, WHEN, WHO, WHERE, WHAT)
$$ ##TITLE= Audit trail, XWIN-NMR		Version 3.5
$$ ##JCAMPDX= 5.01
$$ ##ORIGIN= Bruker BioSpin GmbH
$$ ##OWNER= she
$$ F:/spectra/data/she/nmr/H-C/1/audita.txt
$$ ##AUDIT TRAIL=  $$ (NUMBER, WHEN, WHO, WHERE, WHAT)
(   1,<2026-06-29 14:08:08.21 +0400>,<she>,<DPX200>,
      <created by zg, POWCHK disabled, PULCHK disabled
       configuration hash MD5:
       00 E9 B6 7A A2 85 ED C7 34 08 36 98 17 FE 4E 26
       data hash MD5: 16K
       75 8B BF 31 56 24 26 EE EA 70 58 F3 79 E5 5C 00>)
$$ ##END=
$$ 
$$ hash MD5
$$ 0A 90 24 01 CE 43 74 59 D7 33 9D 6E 2D AD 6B C4
##$RELAX= 
##$RELAX= 
##$RELAX= 
##$RELAX= 
##$RELAX= 
##$RELAX= 
$$ Bruker specific parameters
$$ --------------------------
##$DU= <F:/spectra>
##$EXPNO= 1
##$NAME= <H-C>
##$PROCNO= 1
##$TYPE= <nmr>
##$USER= <she>
##$AMP= (0..31)
100 100 100 100 100 100 100 100 100 100 100 100 100 100 100 100 100 100 
100 100 100 100 100 100 100 100 100 100 100 100 100 100 
##$AQSEQ= 0
##$AQ_mod= 1
##$AUNM= <au_zg>
##$AUTOPOS= <>
##$BF1= 200.13
##$BF2= 200.13
##$BF3= 200.13
##$BF4= 200.13
##$BF5= 200.13
##$BF6= 200.13
##$BF7= 200.13
##$BF8= 200.13
##$BYTORDA= 1
##$CFDGTYP= 0
##$CFRGTYP= 5
##$CHEMSTR= <none>
##$CNST= (0..31)
1 1 145 1 1 1 1 1 1 1 1 1 1 1 1 1 1 1 1 1 1 1 1 1 1 1 1 1 1 1 1 1 
##$CPDPRG= <>
##$CPDPRG1= <>
##$CPDPRG2= <>
##$CPDPRG3= <>
##$CPDPRG4= <mlev>
##$CPDPRG5= <mlev>
##$CPDPRG6= <mlev>
##$CPDPRG7= <mlev>
##$CPDPRG8= <mlev>
##$CPDPRGB= <>
##$CPDPRGT= <>
##$D= (0..31)
0 0.7 0 0 0 0 0 0 0 0 0 0.03 0 0 0 0 0 0 0 0 0 0 0 0 0 0 0 0 0 0 0 0 
##$DATE= 1782727687
##$DBL= (0..7)
120 120 120 120 120 120 120 120 
##$DBP= (0..7)
150 150 150 150 150 150 150 150 
##$DBP07= 0
##$DBPNAM0= <>
##$DBPNAM1= <>
##$DBPNAM2= <>
##$DBPNAM3= <>
##$DBPNAM4= <>
##$DBPNAM5= <>
##$DBPNAM6= <>
##$DBPNAM7= <>
##$DBPOAL= (0..7)
0.5 0.5 0.5 0.5 0.5 0.5 0.5 0.5 
##$DBPOFFS= (0..7)
0 0 0 0 0 0 0 0 
##$DE= 6
##$DECBNUC= <off>
##$DECIM= 32
##$DECNUC= <off>
##$DECSTAT= 4
##$DIGMOD= 1
##$DIGTYP= 9
##$DL= (0..7)
0 120 120 120 120 120 120 120 
##$DP= (0..7)
150 150 150 150 150 150 150 150 
##$DP07= 0
##$DPNAME0= <>
##$DPNAME1= <>
##$DPNAME2= <>
##$DPNAME3= <>
##$DPNAME4= <>
##$DPNAME5= <>
##$DPNAME6= <>
##$DPNAME7= <>
##$DPOAL= (0..7)
0.5 0.5 0.5 0.5 0.5 0.5 0.5 0.5 
##$DPOFFS= (0..7)
0 0 0 0 0 0 0 0 
##$DQDMODE= 0
##$DR= 18
##$DS= 0
##$DSLIST= <SSSSSSSSSSSSSSS>
$$ [...]
##$SUBNAM0= <"">
##$SUBNAM1= <"">
##$SUBNAM2= <"">
##$SUBNAM3= <"">
##$SUBNAM4= <"">
##$SUBNAM5= <"">
##$SUBNAM6= <"">
##$SUBNAM7= <"">
##$SUBNAM8= <"">
##$SUBNAM9= <"">
##$SW= 18.0517328524113
##$SWIBOX= (0..15)
0 0 2 0 0 0 0 0 0 0 0 0 0 0 0 0 
##$SW_h= 3612.71676300578
##$TD= 16384
##$TD0= 1
##$TE= 0
##$TE2= 300
##$TE3= 300
##$TEG= 300
##$TL= (0..7)
0 120 120 120 120 120 120 120 
##$TP= (0..7)
150 150 150 150 150 150 150 150 
##$TP07= 0
##$TPNAME0= <>
##$TPNAME1= <>
##$TPNAME2= <>
##$TPNAME3= <>
##$TPNAME4= <>
##$TPNAME5= <>
##$TPNAME6= <>
##$TPNAME7= <>
##$TPOAL= (0..7)
0.5 0.5 0.5 0.5 0.5 0.5 0.5 0.5 
##$TPOFFS= (0..7)
0 0 0 0 0 0 0 0 
##$TUNHIN= 0
##$TUNHOUT= 0
##$TUNXOUT= 0
##$USERA1= <user>
##$USERA2= <user>
##$USERA3= <user>
##$USERA4= <user>
##$USERA5= <user>
##$V9= 5
##$VALIST= <valist>
##$VCLIST= <CCCCCCCCCCCCCCC>
##$VD= 0
##$VDLIST= <DDDDDDDDDDDDDDD>
##$VPLIST= <PPPPPPPPPPPPPPP>
##$VTLIST= <TTTTTTTTTTTTTTT>
##$WBST= 1024
##$WBSW= 4
##$XGAIN= (0..3)
0 0 0 0 
##$XL= 0
##$YL= 0
##$YMAX_a= 130787
##$YMIN_a= -119571
##$ZGOPTNS= <>
##$ZL1= 120
##$ZL2= 120
##$ZL3= 120
##$ZL4= 120
##$ABSF1= 10
##$ABSF2= 0
##$ABSG= 5
##$ABSL= 3
##$ALPHA= 0
##$AQORDER= 0
##$ASSFAC= 0
##$ASSFACI= 0
##$ASSFACX= 0
##$ASSWID= 0
##$AUNMP= <proc_1d>
##$AZFE= 0.1
##$AZFW= 0.1
##$BCFW= 1
##$BC_mod= 2
##$BYTORDP= 1
##$COROFFS= 0
##$CY= -3
##$DATMOD= 1
##$DC= 2
##$DFILT= <>
##$DTYPP= 0
##$F1P= 0
##$F2P= 0
##$FCOR= 0.5
##$FTSIZE= 0
##$FT_mod= 4
##$GAMMA= 1
##$GB= 0.15
##$INTBC= 1
##$INTSCL= 1
##$ISEN= 128
##$LB= 0.25
##$LEV0= 0
##$LPBIN= 0
##$MAXI= 10000
##$MC2= 0
##$MEAN= 0
##$ME_mod= 0
##$MI= 1.114404
##$NCOEF= 0
##$NC_proc= 0
##$NLEV= 6
##$NOISF1= 3.799351
##$NOISF2= 2.8
##$NSP= 1
##$NTH_PI= 0
##$NZP= 0
##$OFFSET= 14.38212
##$PC= 1
##$PHC0= -4221.786
##$PHC1= 13.9923
##$PH_mod= 1
##$PKNL= yes
##$PPARMOD= 0
##$PSCAL= 0
##$PSIGN= 0
##$REVERSE= no
##$SF= 200.129724274929
##$SI= 16384
##$SIGF1= 3
##$SIGF2= 2
##$SINO= 400
##$SIOLD= 16384
##$SREGLST= <1H.CDCl3>
##$SSB= 0
##$STSI= 0
##$STSR= 0
##$SW_p= 3205.1282051282
##$SYMM= 0
##$S_DEV= 0
##$TDeff= 0
##$TDoff= 0
##$TI= <>
##$TILT= no
##$TM1= 0
##$TM2= 0
##$TOPLEV= 0
##$USERP1= <user>
##$USERP2= <user>
##$USERP3= <user>
##$USERP4= <user>
##$USERP5= <user>
##$WDW= 1
##$XDIM= 8192
##$YMAX_p= 0
##$YMIN_p= 0
$$ End of Bruker specific parameters
$$ ---------------------------------
##NTUPLES= NMR FID
##VAR_NAME=  TIME,          FID/REAL,        FID/IMAG
##SYMBOL=    X,             R,               I
##VAR_TYPE=  INDEPENDENT,   DEPENDENT,       DEPENDENT
##VAR_FORM=  AFFN,          ASDF,            ASDF
##VAR_DIM=   8192,          8192,            8192
##UNITS=     SECONDS,       ARBITRARY UNITS, ARBITRARY UNITS
##FACTOR=    0.0002768,     1,               1
##FIRST=     0,             0,               0
##LAST=      2.2672688,     0,               0
##MIN=       0,             -119571,         0
##MAX=       2.2672688,     130787,          0
$$ Real data points
##PAGE= N=1
##DATA TABLE= (X++(R..R)), XYDATA
0@%%%%%%%%%%%%%%%%%%Qj6J6j6J6j6K4l2L2l8M6n1N9o9P7q6R9j13J28j44J61j78
$$ 0 0 0 0 0 0 0 0 0 0 0 0 0 0 0 0 0 0 0 8 -8 8 -8 8 -8 16 -16 16 -22 24 -27 32 -37 40 -46 53 -60 68 -76 85 -93
40i3J98k22K46k73L03l34L71m10M50m96N47o03O63p31Q08q92R88j098J223j366
$$ -93 105 -117 129 -144 159 -175 196 -214 236 -260 287 -316 347 -384 424 -468 520 -578 645 -721
60g21J533j738J989k302K713l273M093n444Q222k5190J5821o3864n1410Q8471
$$ -721 812 -926 1063 -1239 1474 -1799 2294 -3150 5072 -20118 -4297 -68161 -119571 -31100
74c1100L0051P193K4737L303n0214n4117Q229K8260M676O4352M7130j8889q83
$$ -31100 -1049 6144 30881 34184 -16030 -70147 -61918 -33658 -28982 35370 82500 63611 62728
87F2728l5723o9191J4068J9023j2311K0191K2299J4322n559l7684j1212l0555
$$ 62728 27005 -42186 -28118 -9095 -21406 -1215 21084 35406 29847 -7837 -19049 -49604
99d9604n1097L6797O2752J7143K1043R443j5755l5939m0619J6679K2342q996M0701
$$ -49604 -100701 -63904 -1152 15991 37034 46477 30722 -5217 -45836 -29157 -6815 -15811 24890
112B4890L3615k0015K277j3592m1522j3460j6658p61M3630L3814Q741j4218k3454
$$ 24890 58505 38490 40767 27175 -14347 -27807 -44465 -45226 -1596 32218 40959 26741 3287
125C287j3646l7470j0457M9721J1080n035L7048R265k1944k0401k3358l444m890
$$ 3287 -10359 -47829 -58286 -8565 2515 -2520 34528 43793 21849 1448 -21910 -25354 -30244
138c0244N384M8997K2519j0880M198k1374m0819j8108K137K7953K2373J334J3647
$$ -30244 -24860 24137 46656 35776 39974 18600 -22219 -40327 -38190 -10237 12136 13470 27117
151B7117J429j4665j4937l6610j1343K6142L681J9663M2142n607k5086j0741j4971
$$ 27117 28546 13881 -1056 -37666 -49009 -22867 -19186 477 42619 37012 11926 1185 -13786
164a3786j7998l550L6223L4191j4597N02J7499k7770k7127q452j2709J1944K3614
$$ -13786 -31784 -35334 889 35080 20483 20985 38484 10714 -16413 -24865 -37574 -25630 -2016
177b016J6472J9503n235k3930k3108k0537N129J0737Q118L6907J4993k1561J685
$$ -2016 14456 33959 28724 4794 -18314 -38851 -33722 -22985 -14867 22040 37033 15472 17157
190A7157k184k7033j7142J000K0480J7201O531K4120m655m2703j6243l028n637
$$ 17157 14973 -12060 -29202 -28202 -7722 9479 16010 40130 35475 -7228 -23471 -26499 -32136
203c2136J5710J8349J6873J0260j7276j1693m300j4915n041j306J2342L5150Q893
$$ -32136 -16426 1923 18796 29056 11780 87 -4213 -19128 -24169 -25475 -13133 22017 30910
216C0910m094K165k9121l0764J924R855J6069J3920J2091J3377k2204k7215P591
$$ 30910 26816 28981 -140 -30904 -28980 -19125 -3056 10864 22955 36332 14128 -13087 -5496
229e496n416j3982P526J2280K0033J3461p510p003k2809k4815P784J1223J4310
$$ -5496 -10912 -24894 -17368 -5088 14945 28406 20896 13893 -8916 -33731 -25947 -14724 -414
242d14K4463J519l505p558k8510n654J2131k236R71R426J8716J3297j9209j1668
$$ -414 24049 25568 22063 14505 -14005 -19659 -7528 -9764 -8793 633 19349 32646 13437 1769
256A769m252k9544m126K9306J3338J0585N673r113j2189j9736m064J4772J87M651
$$ 1769 -2483 -32027 -36153 -6847 6491 17076 22749 13636 1447 -18289 -22353 -7581 -7394 -2743
270b743J5146R23P847k909k3728n982o221r623J8976K2978Q998m814j5402m226
$$ -2743 12403 13326 21173 18264 -5464 -11446 -17667 -27290 -8314 14664 23662 18848 3446 -780
284g80j4292j7992K1739J8109r557P498J0291k300n262j4126n662k173m544K0440
$$ -780 -15072 -33064 -11325 6784 -2773 4725 15016 12716 7454 -6672 -12334 -14507 -19051 1389
298A389J8851k391M9j1710j5894k837r981N935K5569K149o245J843J079N09j6630
$$ 1389 20240 17849 17898 6188 -9706 -12543 -22524 -16589 8980 11129 4884 6727 7806 8315 -8315
313h315j2533J3086m94L605K5429J152j3701o648q529l214n637L869K4744K459
$$ -8315 -20848 -7762 -8256 -4651 20778 21930 8229 1581 -6948 -10162 -15799 -11930 12814 15273
327A5273j1920N567l419o525k754j3180M480J3002R07J1703N593j1499q597j1003
$$ 15273 3353 8920 5501 -1024 -3778 -16958 -12478 524 1431 13134 18727 7228 -1369 -12372
341a2372J036P757o445J3302J8240j4862p878O738n675o691p574L973J4465j508
$$ -12372 -11336 -3579 -10024 3278 21518 6656 -1222 5516 -159 -6850 -14424 -10451 4014 2506
355B506O667J2590j7621j2983N27l920Q019M223o30J2541k770j0790K069m344
$$ 2506 9173 21763 4142 -8841 -8314 -12234 -4215 8 -622 11919 9149 -1641 428 -3916
369c916j797j693o929J5241J0517p732R154l207k1983j825O534O898M354l517
$$ -3916 -5713 -7406 -14335 906 11423 3691 12845 9638 -12345 -14170 -7636 -738 3616 99
383I9J1194J367j8948L482M709j1536L04K76M616J5594k038k354l03j6256m132
$$ 99 11293 12660 -6288 -2806 1903 -9633 -9329 -9053 -4437 11157 9119 6765 6462 -9794 -13926
398a3926O267L619J1905j018m544R886j0794j1775J2199m77q133j025M562J6287
$$ -13926 -7659 -4040 7865 6847 2303 12189 1395 -10380 1819 1342 -6791 -7816 -3254 13033
412A3033k85j1463M113j1747j4307J4616Q429J695O623m372m12m210j2332O950
$$ 13033 12748 1285 5398 -6349 -20656 -6040 2389 4084 10707 6335 5923 1713 -10619 -3669
426c669M836n836K721j091Q655J3623j3615q837K004j3871K118J7500O131J95
$$ -3669 1167 -4669 -1948 -3039 5616 19239 5624 -3213 -1209 -15080 -12962 4538 10669 10864
440A0864p892j959M260j4532j754J6165n138l985O718m1O098k669j2014j138o027
$$ 10864 2972 1013 5273 -9259 -11013 5152 14 -3971 2747 2706 8804 6135 -5879 -7017 -13044
455a3044l10J7155P335P09m125j2448L099M94j0817J0395R517o590l33K534L904
$$ -13044 -13354 3801 11136 11845 7720 -4728 -1629 -1135 -11952 -1557 7960 1370 1037 3571 7475
470G475k062j4667k09L597p392J2122J4166n278m893p260l576L530m375N482J2933
$$ 7475 5413 -9254 -9463 -5866 -13258 -1136 13030 7752 2859 -4401 -7977 -4447 -8822 -3340 9593
485I593n017k822K541q95K543r647r088R407K370K96J0988j425p462p097n609
$$ 9593 4576 1754 4295 3400 5943 -3704 -12792 -3385 -1015 -719 10269 8844 1382 -5715 -11324
500a1324P280j80k868J5589L412j2267L74L133j442m572p094P185N625j336R341
$$ -11324 -4044 -4224 -7092 8497 11909 -358 16 3149 1707 -2865 -9959 -2774 2851 1515 10856
515A0856l24j2785j849k775J401P143l659L429R371o888p403L76L123Q33q993
$$ 10856 10532 -2253 -4102 -6877 -5476 1667 -1992 1437 10808 3920 -3483 -3107 16 849 -8144
530h144L366J4239m574k133Q179j1200j1256L037N939N568k223k75Q311m672o709
$$ -8144 -4778 9461 4887 2754 10933 -267 -11523 -8486 -2547 3021 798 523 8834 4162 -2547
545b547K234j406J545j173m546J0153N568p780M77k851q636k25N589R156q71r828
$$ -2547 -313 -1719 -174 -1347 -5893 4260 9828 2048 2525 -326 -8962 -9187 -3598 5558 4687 -5141
561e141O337M058j1729N54O542q84j906j064P569O288o940j819l49q900P62O641
$$ -5141 1196 5254 -6475 -5921 621 -263 -2169 -3233 4336 10624 3684 1865 1516 -7384 -6622 19
577A9M677K943r539l928P981m813m937M847J654j454k515K909J0352m047p416
$$ 19 4696 7639 -1900 -5828 2153 -2660 -7597 -2750 -1096 -2550 -5065 -2156 8196 4149 -3267
592c267M299l371l401P191O221L277o882r235O513R41p086N489J971n303j430
$$ -3267 1032 -2339 -5740 1451 7672 10949 4067 -5168 1345 2286 -4800 689 2660 -2643 -4073
607d073N72O849J244r048l48Q86l021O350M776K341K41j0054J176Q291o396j47
$$ -4073 -3501 3348 4592 -4456 -4804 -3918 -6939 -589 4187 6528 6769 -3285 -2109 6182 -214 -361
623c61P651k745o350j871P059O382r818n435L882n700K635R515j365l005m709
$$ -361 7290 4545 -1805 -3676 3383 9765 -53 -5488 -1606 -7306 -4671 4844 3479 474 -4235
638d235k325P346p04l822O394R82k692j378p38R292R1j1802K028Q72m041Q225
$$ -4235 -6560 786 82 -3740 2654 3636 944 -434 -1172 8120 8211 -3591 -1563 -691 -4732 3493
654C493M251m368p175m855P485K720q392N043L800n755K055Q77J545M180p224
$$ 3493 7744 3376 -3799 -8654 -1169 1551 -6841 -1798 2002 -3753 -1698 -821 724 4904 -2320
669b320k484N619k991L710O533l145l094o598Q9R448n210m116P691k862k979K356
$$ -2320 -4804 815 -2176 1534 8067 4922 1828 -4770 -4681 4767 -443 -4559 3132 270 -2709 -353
685c53j011K851l915o705Q066J357j805P783j306n242j109k087O128O58o631O838
$$ -353 -1364 1487 -2428 -9133 -1067 290 -1515 6268 4962 -280 -1389 -3476 2652 3310 -3321 3517
701C517K065o593K897j006j563J571p014J855Q703l756J090J492n624j080j402
$$ 3517 5582 -1011 1886 880 -683 888 -6126 -4271 4432 676 1766 3258 -2366 -3446 -4848
716d848L790O458p928K33J0636n242l932L537l175Q36j874j453Q043p27k943K936
$$ -4848 -1058 5400 -2528 -2295 8341 3099 -833 2704 -471 365 -1509 -2962 5081 4354 1411 4347
732D347p821k600M584j117N329M66q360O237K887o354P28j057M75J976l411P944
$$ 4347 -3474 -6074 -1490 -2607 2722 3188 -5172 1065 3952 -2402 -1674 -2731 -2256 -280 -3691 4253
748D253N074r761J573P36q489L831N356N82J180o900J56N450n056m86J337l808
$$ 4253 9327 -434 1139 1875 -6614 -2783 2573 3155 4335 -2565 -2409 3041 -2015 -2501 -1164 -4972
764d972M235n05o45R258n235p899L943k807N16O815J506J816n157n585P437k17
$$ -4972 -737 -1242 -1887 7371 2136 -5763 -1820 -4627 -4111 2704 4210 6026 869 -4716 2721 2504
780B504o290M515p89j501K301k256N035Q21j0079Q65J393j777P860K731k485j856
$$ 2504 -3786 729 -60 -1561 740 -1516 3519 4340 -5739 -4874 -3481 -5258 2602 5333 2848 992
796I92o541K977P178n446N55L387k656K163j439k27N192p040n184N642j550J422
$$ 992 -5549 -2572 4606 -840 -285 3102 446 2609 1170 943 6135 -905 -6089 -447 -1997 -575
812e75O288k281l203o586o75R736l15m871M903j898r42L279k567K276j78o151
$$ -575 5713 3432 229 -6357 -7032 2704 2389 -2482 2421 523 -419 2860 293 2569 2391 -3760
828c760L352J789r07M374j340l308k689n109O211O861o719L74K644m070M87J388
$$ -3760 -408 1381 474 4848 3508 200 -2489 -7598 -1387 5474 -1245 -871 1773 -2297 -1810 -422
844d22J723N51o119J767N935l173J453K610n296q88j428Q00O730k545l925L853
$$ -422 1301 1852 -4267 -2500 3435 262 1715 4325 -971 -1859 -3287 -2487 4243 1698 -2227 1626
860A626k040j842Q13N22L930m017n007P162J075l196L256k174l520R57R56N094
$$ 1626 -414 -2256 -1443 -921 3009 -1008 -6015 1147 2222 -974 2282 108 -3412 -2455 -1499 3595
876C595q62o672M024K104l539J061n3R60J852n342K060L961l538J219M57l607
$$ 3595 2733 -3939 85 2189 -1350 -289 -342 618 2470 -2872 -812 3149 -389 830 1287 -2320
892b320J12L47L459K870p306j049O374j523j574O68m58K029l022n97O045k621
$$ -2320 -2208 -1861 1598 4468 -2838 -3887 2487 964 -610 58 -400 1629 -1393 -1990 4055 1434
908A434k136L338k202j488J331P16K915l936m622N513J421k315J6k327J416J133
$$ 1434 -702 2636 434 -1054 277 993 3908 -28 -4650 863 2284 -31 -15 -2342 -926 207
924B07l204N119K182n667J280J181k075J398k17K409l67o556L477N188l541j264
$$ 207 -2997 2122 4304 -1363 -83 1098 -977 421 204 2613 2246 -4310 -833 4355 814 -450
940d50m34j976K278n44J413L661m870k017K199j562J745J387p59K512m346j887
$$ -450 -884 -2860 -582 -1126 287 3948 -922 -2939 -740 -2302 -557 830 71 2583 -1763 -3650
956c650P287l66m167n58j542K614K76n85N034k948o373L386J90k38L838j020K15
$$ -3650 3637 3271 -896 -1454 -2996 -382 -106 -691 4343 1395 -4978 -1592 -1402 -1640 2198 1178 1393
973A393j702l891N366K603n263L08r70P56L875k092J276K374p104q45L259m16
$$ 1393 -309 -4200 1166 3769 -1494 -1186 -2156 -1400 2475 383 1659 4033 -3071 -3916 -657 -1073
989a073K433P97j718M17m995J689P505l539l941K142l95K693N1j904K586l611
$$ -1073 1360 2157 439 856 -4139 -2450 5055 1516 -2425 -283 -678 2015 2066 162 2748 -863
1005h63l814M289K24J652K527l402k96j705l415O480K365n751M96R82J058J729
$$ -863 -4677 -388 -164 1488 4015 613 317 -1388 -4803 1677 4042 -1709 -1213 -231 827 2556
1021B556k896J422N36n926K875M215k393K151q70l047P01l341K762O217m940k122
$$ 2556 -340 1082 1618 -4308 -1433 2782 389 2540 1670 -1377 -676 -4017 -1255 4962 22 -2100
1037b100K561q29J950j287k141L177l504j610O465r56j095R29l650J053l60j721
$$ -2100 461 -368 1582 295 -1846 1331 -2173 -3783 2682 1726 631 1560 -2090 -1037 -1397 -3118
1053c118O414k88o219L130R79j103P13l128K765O99m099M104K307m475J397j388
$$ -3118 3296 3008 -3211 -81 898 -205 508 -2620 145 844 -3255 849 3156 -1319 78 -1310
1069a310j734K884j134K357L015o073lL582j237L53k111k31M824l328j374N279
$$ -1310 -3044 -160 -1294 1063 4078 -1995 -1998 1584 347 700 -1411 -1642 3182 -146 -1520 3759
1085C759l415k581K524j246N27K67K50L906m574l856N178K05j539R70k280K406
$$ 3759 344 -2237 287 -959 -432 -165 85 3991 -583 -4439 739 944 -595 375 -1905 501
1101E01K174l348K457K65l989J728N25P26Q88k497K431M06o590K842N225m070
$$ 501 2675 -673 1784 2049 -1940 -212 313 1039 1927 -570 1861 2267 -4323 -1481 3744 -326
1117c26L11o16k12J758j717P09K059m479q0L486j071J973o05j891K496l350j505
$$ -326 -15 -631 -843 915 -802 -93 1966 -2513 -2593 893 -178 1795 1190 -701 1795 -1555 -3060
1134c060P008j013l720j64l95K171n2k273L335j873l417L607N06j230J571k676
$$ -3060 3948 2935 -785 -949 -1344 827 775 -1498 1837 -36 -3453 154 660 -570 1001 -1675
1150a675P93j84k904N249L025n338p22K37J188K652k309R85R00m537J550L139
$$ -1675 -882 -1066 -3970 1279 4304 -1034 -1756 -1519 -331 2321 12 997 1897 -2640 -1090 2049
1166B049k513R32q43r19J253k132J400M716l415l403N66L66L587k95j578K592
$$ 2049 -464 468 -375 -1294 -41 -2173 -773 3943 528 -2875 -2309 -1943 1644 1349 -229 2363
1182B363l455j918M983j01k079J345q89J41p94p82M237j412m289O29P42J235K540
$$ 2363 -1092 -3010 1973 1872 -207 1138 249 390 -404 -1186 3051 1639 -2650 -2021 -1279 -44 2496
1199B496k840K70P27l160J657L387j681l21o0m6Q2k073L035K016n353k35L124
$$ 2496 -344 -74 653 -2507 -850 2537 856 535 475 429 511 -1562 1473 3489 -1864 -2099 1025
1216A025o81J501n44k142N49j586K1L142p21j27j22r88Q99j043m82M804k566m680
$$ 1025 344 1845 1301 -841 -292 -1878 -1857 1285 564 437 315 -673 226 -817 -1299 3505 939 -3741
1234c741L429J807p20m4k148Q50m70o57L021K82k268Q88p88n92J014j531K314
$$ -3741 -312 1495 775 731 -1417 -567 -1037 -1694 1327 1609 -659 229 -559 -1151 -137 -1668 646
1251F46J208l769N31K386l82m77j672J69J790j223J355J641k921k15R21q60J132
$$ 646 1854 -1915 -1384 1002 620 143 -1529 -1360 430 -793 562 2203 -718 -933 -12 -872 260
1268B60p13K59K403k298j615K773j35j169r39p95K689l29l84K223k475k136J999
$$ 260 -453 -194 2209 -89 -1704 1069 934 -235 -1174 -1969 720 391 7 2230 -245 -2381 -382
1285c82J68L82O29r34J373k74k025J662O08q74p26j221J932K255k511O06J49l672
$$ -382 -214 168 797 -137 1236 962 -1063 599 1207 333 -393 -1614 318 2573 62 668 817 -2855
1303b855J216K296J4M21j309P09L52k387J143K687k039k90m87n99L739q69k497
$$ -2855 -1639 657 671 1092 -217 492 844 -1543 -400 2287 248 -42 -529 -1128 2611 1742 -755
1320g55J234j774o35K426P17M94j811j480K356j592j917M580m27k123P2m84J920
$$ -755 479 -1295 -1930 496 1213 1707 -104 -1584 772 -820 -2737 1843 1416 -707 -635 -1119 801
1337H01J412k489j0l13j505K744R27m52L2l129P21J554k398K644K261l190p78
$$ 801 2213 -276 -286 -599 -2104 640 1567 1115 1147 -1982 -1261 293 -2105 539 2800 -390 -1168
1354a168l24J143K374k430o39J271k100J132K907j298j29j524j131K542j334L8
$$ -1168 -1492 -349 2025 -405 -1044 227 -1873 -741 2166 868 739 -785 -1916 626 -708 -670
1370f70L635k004k764N73J41K519J8k944J610l13j086L062m09j569o2j385J409
$$ -670 2965 961 -1803 -1230 -1089 1430 1448 -1496 114 -199 -1285 1777 1368 -201 -263 -1648 -239
1387b39J335j987K260R38l372O7O3J330J770k874K85J412k244J609K067k670o09
$$ -239 1096 -891 1369 2307 -1065 -998 -935 395 2165 -709 -424 988 -1256 353 2420 -250 -859
1404h59J92m4K137j226l93J793k280j340J365K0K032j49k613K177p12j731K939
$$ -859 -667 -711 1426 200 -193 1600 -680 -2020 -655 -635 1397 1248 -1365 812 100 -1631 1308
1421A308l31j841M53N0J394O4k040J754m41l024K185Q04l7R01k302J60J823k246
$$ 1308 977 -864 -411 -361 1033 1097 -943 811 370 -2654 -469 335 298 1199 -1103 -943 880 -1366
1439a366J148J502j930N98M07k51J207j750j67J835j843r69K402j79k53j320j090
$$ -1366 -218 1284 -646 -48 359 108 1315 -435 -602 1233 -610 -1579 823 644 391 -929 -2019
1456b019K434l14j035J787j260o04J867k15K30p11j747K462L9j586J651K28j195
$$ -2019 415 101 -934 853 -407 -1011 856 641 871 160 -1587 875 914 -672 979 1207 12
1473A2n4j799J233J725j769Q23l05j338J363R34q03M53j451Q16J979j683L0J519
$$ 12 -42 -1841 -608 1117 -652 171 -134 -1472 -109 825 22 475 -976 -160 1819 136 166 1685
1491A685j289n85k06j53K281q00j199O49j773J76J742m34K25o88j335K678j84
$$ 1685 396 -189 -395 -548 1733 933 -266 383 -1390 -1214 528 94 319 -369 -1704 974 790
1508G90j604J506l15r13J92nJ915O54k399O3k58j090J638O65p48j44j295O33J783
$$ 790 -814 692 377 -536 -344 -349 1566 2220 -179 -116 -374 -1464 174 839 91 -53 -1348 -715 1068
1527A068j675L60Q34j368K76M3O70J815k023j036O37q60J102J650n29o68j497
$$ 1068 -607 -247 587 -781 -505 -462 208 2023 0 -1036 -399 -1259 -157 1493 964 296 -1201
1544a201j43K112p57r39J432q35n72M73M41J459j133j537L31M02K21J550o1j345
$$ -1201 -1344 768 11 -928 504 -331 -903 -430 11 1470 337 -1200 -869 -467 -246 1304 1243 -102
1562a02k18j000J167R28j235N23L99o82j27o6P86Q42k128k28J304l35Q50P71j419
$$ -102 -320 -1320 -153 775 -460 63 462 -220 -347 -413 373 1215 -913 -1141 163 -172 678 1449 30
1581C0n92k64M03J380q81P0Q87j185m76P72J23R61j123j355J449K38l66R99q43
$$ 30 -562 -826 -423 957 76 146 1033 -152 -628 144 267 1228 105 -1250 199 437 71 1070 227
1600B27n52m86O4J935n00j609J588k70j218N42L48N73K51j769P46P70q51P65k98
$$ 227 -325 -811 -747 1188 688 -921 667 397 -821 -279 69 642 893 -876 -130 640 -211 554 256
1619B56j381P01j07R03R51k220N14R99j273r4O81Q1M96j205m6J576q17m16R79
$$ 256 -1125 -424 -531 372 1323 -897 -383 616 -657 -751 -70 11 507 -698 -744 832 15 -401 578
1638E78j195k8O39L16J027j557j379J971l47j018J128L9o7k30q63J797j22j135
$$ 578 -617 -645 -6 310 1337 -220 -1599 372 25 -993 135 174 107 -123 -986 811 689 -446
1656d46J014n83m59Q93j21K77k4j901R92J417j271L63L07l10j81o57N79J095j702
$$ -446 568 -15 -474 419 298 575 551 -1350 -358 1059 -212 151 458 148 -33 -690 -111 984 -718
1675g18L73J057j478N48J361q97r3j069p7J890j07q22N72q23K59l15n10K101l61
$$ -718 -345 712 -766 -218 1143 246 153 -916 -993 897 790 -32 540 -283 -24 -339 -849 1252 891
1694H91j675J180l15o92J311j2o95n50o71J904M04j351P00n80p90O36J64M46Q66
$$ 891 -784 396 81 -611 700 688 -7 -557 -1228 676 1080 -271 429 -151 -941 -305 -141 305 1171
1713A171j973M76P52q44Q26N22p73k50p98M62K032j430q82J344j422LN15L19R95
$$ 1171 -802 -326 426 -418 408 930 157 -93 -891 -429 1603 173 -709 635 -787 -784 -269 50 1045
1732A045r89j456J146k39n5J469o72o63Q1l79J868k23j537J005m51o79J046OJ57
$$ 1045 56 -1400 -254 -493 -548 921 249 -414 -333 -712 1156 933 -604 401 -50 -729 317 323 480
1751D80K39j840L89O64n48R04K04r12O5o84R55J445j572m10J113p50J90N35k97
$$ 480 719 -1121 -732 -68 -616 288 492 -420 -355 -1039 -84 1361 -211 -621 492 -258 -68 467 170
1770A70M12j134m52J530n08J65P10j054o34P12k73J073j97j462R30K34n92Q57
$$ 170 582 -552 -1004 526 18 183 893 -161 -795 -83 -356 717 520 -942 -12 222 -370 487
1788D87m51N39k26j546J237Q75j219Q42j44r50L99l55O61O97j095kP03n57R5J16
$$ 487 36 575 349 -1197 40 915 -304 538 394 -556 -157 -512 149 846 -249 -251 452 -105 -10 106
1808A06n55Q73p97l34J577o89k28O86j036k51Q66j22N65j005m34J380o16l10N13
$$ 106 -449 424 -373 -707 870 181 -47 639 -397 -648 218 96 661 -344 -778 602 -14 -324 189
1827A89n19L11L25n60M06M02j171P41j43o11O18L5L75j2j445P70R08q95L42J50
$$ 189 -330 -19 306 -254 152 554 -617 124 -19 -630 -12 23 398 386 -1059 -289 619 -276 66 216
1847B16n74Q55l97q6P05r05k08R11o38L73L4j80K97j311o4J572k06r81R28l75
$$ 216 -358 497 100 14 719 -186 -394 517 -121 252 286 106 403 -908 -972 600 394 -587 341 -34
1867c4m1M46o93Q51m77o38M02L84l9N71q11J40j43p97J250N18j340L73J73m19
$$ -34 -75 371 -322 529 52 -586 -184 200 161 732 -79 61 -82 -879 371 889 -451 -78 95 -324
1887c24M26n09O35L44r99K16J40Q0P86j63q12O3l70N46Q13p02m33J65k0k7j6J74
$$ -324 102 -407 228 572 -427 -211 -71 9 795 632 -180 -117 -487 59 872 170 -263 -98 -118 -145 -161 13
1909A3L86n18n29Q57r0K6K41n51O0n95M17R68J24j396K26r5M53K8j31M77J62j108
$$ 13 399 -119 -648 209 119 145 386 -165 -105 -700 -283 685 809 -587 -361 -456 -3 25 -106 371 533 -575
1931e75M53L53l63M13q1n00R0j26P22M46p07p34L85j05L45l91M28O30p65m77Q76
$$ -575 -122 231 -132 281 200 -300 -210 -336 386 832 125 -609 -224 -329 16 -375 53 683 -82 -559 317
1952C17j91j15L11l06P3k98M02O67p48r65Q22j50N1L98l57M55l03m18M63Q2lJ7
$$ 317 126 11 322 16 89 -209 193 860 112 -853 -31 -181 -130 268 -89 366 63 -355 108 190 187 204
1974B04k35K3M24n56O15J52j127L96L98m21K69l2k04n9P3J3L37l41J08J71m55
$$ 204 -31 -8 416 -140 475 627 -500 -104 294 -127 142 110 -94 -153 -80 -67 270 -71 37 208 -247
1995b47J63J2l17Q38m63l75Q93M6n57J18k89K48j62k15P93n32M7K00j85l79O57
$$ -247 -84 -72 -389 449 -14 -389 504 550 -7 111 -178 70 -92 -307 486 -46 1 201 16 -363 294
2016B94o39N08j46n96Q94L65n41k86k41K92L17n35L52O22o93%L03o72N39j17j55
$$ 294 -345 163 17 -579 315 680 139 -147 -388 -96 221 -314 38 660 -33 -33 270 -402 137 20 -135
2037a35L56o73M42N37n55l08k5l37R80J44m96K64k74p09R83k94J51L70n11NJ61
$$ -135 221 -452 -10 527 -28 -336 -361 -698 282 426 -70 194 -80 -789 194 -100 51 421 -90 -85 76
2058G6n07Q40R9o75Pj16K30M30j79k12R6n86L34j5K28K41m86qL66j59J65M28r49
$$ 76 -431 409 508 -167 -160 -276 -46 384 205 -7 89 -497 -163 -178 50 291 -195 -203 163 4 169 597 -352
2081c52N2O79p60Q29O1o28K18n91l2N89p4r0J46k08M28o15K7J008n01k65J31p1
$$ -352 -300 379 -381 448 509 -119 99 -492 -524 65 -9 -99 47 -161 267 -348 -321 687 186 -79 52 -19
2103a9L17N2n96K97j09l61O73j22m20K72m56J34M06m70P32J75p53R2l57K48L95
$$ -19 298 350 -246 51 -58 -419 254 132 -288 -16 -472 -338 68 -402 330 505 -248 -156 -513 -265 130
2124A30k40K00O7m18M9L15j91J85Kl99L13p2j99P12l38n44M55q3J85K08n53M03
$$ 130 -110 90 157 -261 -212 103 -88 97 99 -300 13 -59 -258 454 116 -428 27 -56 129 337 -216 187
2146A87r7k62M32p5k93Q6O3l52O47o59Q14j01p81J16L84nJ59k82l11O49m20R9
$$ 187 90 -172 260 185 -108 -22 41 -311 336 -323 491 390 -391 -275 109 104 263 -19 -330 319 -101 -2
2168bL42m98J67Jp6K94l50K29M63m86o09P85J04l52J01o64R32j57o29L37J56n13
$$ -2 340 -158 9 10 -66 228 -122 107 570 84 -525 260 364 12 113 -551 381 224 -405 -68 88 -425
2190d25P37l05j42K19k05K38J62o68J51P09k95j94k59L45L45r69M48K48m64L61
$$ -425 312 7 -135 84 -121 117 279 -389 -238 471 176 -18 -277 68 413 -556 -108 140 -324 37
2210C7J14l52M19j52k77M57n33J72P41o95r1J15j34L16l4j42M84l68l31J55K02
$$ 37 151 -201 218 66 -211 246 -287 -115 626 -69 -160 -45 -179 137 103 -39 445 77 -254 -99 103
2231A03Qm55K23P9J7j62M47O8o54L56k64J53K23k18l0J61j10k11N51N2n39O1P3
$$ 103 111 -344 -121 -42 -25 -187 260 328 -326 30 -234 -81 142 -76 -106 55 -55 -266 285 337 -202 -141 -68
2254f8N6l12M36K31o95J66k3K94L04k02j58N7l39L15K9K03j85n2J50J02k75j93
$$ -68 -12 -324 112 343 -352 -186 -209 85 389 187 29 86 -253 62 91 294 109 57 207 309 34 -159
2276a59M92k34l35J55K10J20q2l77o2J1k45N45J04l58K93l08L08k06L4M00j17
$$ -159 333 99 -236 -81 129 249 167 -210 -272 -261 -506 39 143 -215 78 -230 78 -128 -94 306 189
2297A89p50J86L01J42K60m13j42K01j03p4N75m80L31k07r9Q8k62L34l2L3m16J46
$$ 189 -561 -375 -74 68 328 -85 -227 -26 -129 -203 372 -108 223 16 -83 5 -257 77 45 78 -338 -192
2319a92K4J06j01k73L18J42k54P00m94j86K94l39L04J74l88J98K10k88j05J92
$$ -192 -168 -62 -163 -436 -118 24 -230 470 -24 -210 84 -255 49 223 -165 33 243 -45 -150 42
2339D2j55L42m82k1L22k52J85L08o2j29M1l63L96k61J08L13k84j85J20O7R7l29
$$ 42 -113 229 -253 -274 48 -204 -19 289 227 98 139 -224 172 -89 19 332 48 -137 -17 50 147 -182
2361a82K72O2R9k47K21p7k08J16j90M40l97J5P8k19m2M54l09R0J74k75O6L89k74
$$ -182 90 152 251 4 225 148 -60 56 -134 306 -91 -76 2 -217 -259 195 -114 -24 150 -125 -59 330 56
2384E6p7J45k37J19K3J64L2j55q6K22m97J11J54JP1k45qL67l7k56K56m61L13K15
$$ 56 -21 124 -113 6 29 193 225 70 -16 206 -291 -180 -26 -25 46 -199 -207 160 123 -133 123 -338 -25 190
2408A90k70K53p9k95K93J86m82K73n5k3j68j36N11j58n2Ro3J59J72N8l19J39k26
$$ 190 -80 173 94 -201 92 278 -204 69 14 -9 -177 -313 198 40 -12 -3 -66 93 265 323 4 143 -83
2431h3j64N02m38L39p9O9O4P1j52n4J1k34o9K9L71J47j48k31k0l8J00R5n6o1K26
$$ -83 -247 255 -183 156 77 146 210 281 129 75 86 -148 -217 -188 183 330 182 -49 -69 -107 -7 88 32 -29 197
2456A97l55L7k7L48Pm04K04L5J35K4K62o13R8j96J59K29l94M01j04q0L0k0r3R0
$$ 197 -158 -121 -148 200 207 -197 7 42 177 201 463 -150 -52 -248 -89 140 -254 147 43 -37 -7 -27 -120 -30
2480c0k6L1m8j47L84J84l02j83k53L39N4j32J15j01m4j56L01j24J24L2j88J12
$$ -30 -56 -25 -73 -220 164 348 46 -137 -390 -51 3 -129 -14 -115 -159 -315 -14 -138 -14 18 -170 -58
2502e8J31k05L58r5l79K59j89J20J38k49K65l9o9p5M7J37q7l4N0n2l76L32J96
$$ -58 73 -132 226 131 -248 11 -178 -58 80 -169 96 57 -12 -87 -40 97 10 -24 26 -26 -402 -70 126
2525A26j67R9q1k5Q9r6K3O1k63l1L21N2J47j92j32N2J03r5K70j82k18N7J63j43
$$ 126 -41 58 -23 -48 41 -55 -32 29 -234 -265 56 108 255 63 -69 -17 86 -9 261 79 -139 -82 81 -62
2549f2K52k70P3J25k43j34j24K67K14m14j19M69j31j75K02j63P4K17j90K02ol85
$$ -62 190 -80 -7 118 -125 -259 -383 -116 98 -316 -435 34 -97 -272 -70 -233 -159 58 -132 70 64 -321
2571c21l9K96L3K5k70J65K18k70K25j39J21j45J09j25J07L47j90nj81j53K66j13
$$ -321 -360 -64 -31 -6 -276 -111 107 -163 62 -77 44 -101 8 -117 -10 337 147 142 -39 -192 74 -39
2593c9p3K43k28K17j38J07J55m56j56M86l33M18o2p0o6J2m7K08j46q4K11l36J47
$$ -39 -112 131 -97 120 -18 89 244 -212 -368 118 -215 203 141 71 5 17 -30 178 32 -52 159 -177 -30
2616c0Q9J4N6o4Q8k93J94j01N38n29J29k4l78N47k28j50L2jM08k37J16j04l99
$$ -30 59 73 129 65 153 -140 54 -47 491 -38 91 67 -311 236 8 -142 -110 -111 297 60 176 72 -327
2639c27M32k92J58j19l19M54j10O06p24P5O55m33R4k79r2M02K67q10M72j18J91
$$ -327 105 -187 -29 -148 -467 -13 -123 483 -241 -166 489 56 150 -129 -221 181 448 -362 110 -8 183
2660A83n15R5O87m92K69o20N96r83J144J17p87P90n97q0p55O78P63o80n91r3R96
$$ 183 -332 -237 450 -42 227 -393 203 -780 364 481 -306 484 -113 -193 -948 -270 493 -187 -778 -871 125
2681A25j45J7J71m87J84q3J53K9N56l00q99J049m09j79j73J55o6J395q05n55J129
$$ 125 -20 -3 168 -319 -135 -218 -65 -36 520 220 -679 370 -39 -218 -391 -236 -302 1093 288 -267 862
2702H62q40n6Q09r33R2J22J11m68P76j217M77J25RL84R6l20o04J278o96L11j165
$$ 862 22 -34 775 -158 -66 56 167 -301 475 -742 -265 -140 -131 253 349 29 -575 703 7 318 -847
2723h47J39O25o3J39J38kNL20q36J02p6J08j53R06l51J4m2L31m21l23mj5N99r2
$$ -847 -708 -83 -146 -7 131 129 134 454 -382 -280 -356 -248 -401 505 154 168 126 457 36 -287 -291 -306 293 201
2747B01k76o56R64m62L13o6q9J9O2o7N11m7l60l63O37o23J55K4L06j14j90L0L74
$$ 201 -75 -731 233 -229 84 18 -71 -52 10 -57 454 407 47 -316 321 -302 -147 -123 183 69 -121 -91 283
2770B83l67M6K2J1J21p9nN0L9j16J22j40M5K71l07J18l8o33P39Q4m01J24J79k49
$$ 283 -84 -38 -16 -5 116 37 32 82 121 5 127 -13 32 303 -4 114 76 -557 182 266 -135 -11 168 -81
2794h1k7r3L14L6p4R0j75O2qP5M3L1l40J85J90l73p8N3M12k59p2K88n8N7j22j19
$$ -81 -108 -201 113 149 75 165 -10 52 44 119 162 193 -147 38 228 -145 -223 -170 242 -17 -89 199 141 198 76 -43
2820d3O1N5K12k20l7l04O4N07r4k60R5j0q0J41l5J64k52p7J55j09M5K19q7l10
$$ -43 18 73 285 65 28 -276 -212 295 201 -59 36 26 -54 87 52 216 -36 -113 42 -67 -22 197 110 -200
2844b00mN0J12K10l60j45L72j26K5O7J81q8j77m2L92n42M66nl13K61l02J03M53
$$ -200 -204 -154 -42 168 -192 -337 35 -91 -66 1 182 94 -83 -125 267 -275 191 186 -127 134 -168 -65 388
2867C88l63N5l4k86j47L23j26K26k95m3J66J20M3M1N6q1j56k7L4K15j46K56j77
$$ 388 25 80 46 -240 -387 -64 -190 36 -259 -302 -136 -16 27 68 124 43 -113 -140 -106 109 -37 219 42
2890D2j68M16j41o7j82l7R8K09q7J07r5l20J77l0L4N79n33L12l61j17K91P3k56
$$ 42 -126 290 149 82 -100 -137 -39 170 83 190 95 -225 -48 -78 -44 535 2 314 -47 -164 127 200 -56
2913e6J50j46j56K87N2J4o7K27l82J90pJ73k4l81JJ56l04L24j51j04L20J6O2k60
$$ -56 94 -52 -208 79 131 145 78 305 -77 113 106 279 255 -126 -125 31 -273 51 -100 -204 116 132 194 -66
2937f6l03K63L1o3K12l8O4Jj47k46O0K27o0J38k69K08m6MJ40j67m2J15K18o2n2
$$ -66 -369 -106 -75 -138 74 36 100 101 -46 -292 -232 -5 -65 73 -196 12 -34 -30 110 -57 -99 16 234 172 120
2962A20k51K07Pk34L79j72L6k09Q3j53K46k47K27k82p9K55Q0k2J26p5p4J7k25
$$ 120 -131 76 83 -151 228 56 92 -117 -34 -187 59 -188 39 -243 -322 -67 13 -9 117 42 -32 -15 -240
2985b40K94Q1K49l94Pj46L20m12R3K49k60K84N7k93K59l3l66M83l04j03K86O4
$$ -240 54 135 384 -10 -3 -149 171 -241 -148 101 -159 125 182 -111 148 115 -251 232 -72 -175 111 175
3007A75p7k11J48K47o1k05J61l8m11N68l62L14ll05P0j43q4N96l29m09K74J14
$$ 175 98 -113 35 282 221 16 177 139 -272 296 -66 248 245 -60 10 -133 -217 379 50 -359 -85 29
3029B9j48K15j57n4l9K84k08N2K45j53n8j44R2j28J07L06k76l93M41m6J89k10
$$ 29 -119 96 -61 -115 -154 130 -78 -26 219 66 8 -136 -44 -172 -65 241 -35 -428 13 -33 156 -54
3051e4k98N61o7j76K95l55j33M54l24K19j11j67K64k44m4L58k6k54L36k07M2J15
$$ -54 -352 209 142 -34 261 -94 -227 227 -97 122 11 -156 108 -136 -180 178 152 -102 234 27 69 184
3073A84o96O99l1J00k26J63k55K25m28N97M1m43p2J15j91M20jj89N0k66K2J29
$$ 184 -512 187 156 256 30 193 -62 163 -265 332 373 -70 -142 -27 -218 202 201 12 62 -204 -182 -53
3095e3J81Q8j65N2R0l14J2L94r3k86L38m11L23M6m43P2L98l22K12j32o6N1J04
$$ -53 128 216 51 103 193 -121 -109 285 192 -94 244 -167 156 202 -241 -169 229 -93 119 -13 -79 -28 76
3118G6l08K60k55J45K53n89L01R7O4Q1j02j68R9Q8k37J22KJ74l2k38J97n2k27
$$ 76 -232 28 -227 -82 171 -418 -117 -20 44 125 23 -145 -46 42 -195 -73 -71 103 71 -167 30 -22 -249
3141b49L13j90q1L88j32M2Qn08K01N97n62L81l03k11M36n6j03O5j40j82N49o12
$$ -249 64 -126 -207 181 49 91 99 -409 -208 389 -173 208 -95 -306 130 74 -29 36 -104 -286 263 -349
3163c49K33K29j7l16K24q0o8m1K69k25j1J04M16m55L21k82k28L17P5k11J43L54
$$ -349 -116 113 96 -220 4 -76 -144 -185 84 -141 -152 -48 368 -87 234 -48 -276 41 116 -95 48 402
3185D02j50m35K8K01J18j76o4K28k40K90k05K79k96l7K32k50j6N61n13J63j51
$$ 402 252 -183 -155 46 164 -12 -76 152 -88 202 -3 276 -20 -57 175 -75 -91 470 -43 120 -31
3206c1j63L03J59m32L05J8l05j14M94j40k04j11j17L59j24R2M33n70P9J68m67
$$ -31 -194 109 268 -164 141 159 -146 -260 234 94 -110 -221 -338 21 -103 -11 422 -148 -69 99 -368
3227c68O94k90l1J20Q6k23J00n8J33J51k22K12k92m40P92j48n03N00m49K2K07
$$ -368 326 36 5 125 211 -12 88 30 163 314 92 304 12 -428 364 216 -287 213 -236 -214 -7
3248gj20M6J82l55J93n3j03L94n1P2k30l62K43K04l15J10K26r7L88k10k14K28
$$ -7 -127 -81 101 -254 -61 -114 -217 177 126 198 -32 -394 -151 53 -262 -152 74 -23 365 155 -59 169
3270A69k20Q4J02j71p0K25j39m7M5J0K42k87K25M2k20n5L03l30J07r2J09K57j15
$$ 169 -51 33 135 -36 -106 119 -20 -67 -22 -12 230 -57 168 210 -10 -65 238 -92 15 -77 32 289 174
3293A74l27K74N2k87J98k92J63M8j10J27r9mJ44l57L55L27l44M2j15k79K11K44
$$ 174 -153 121 173 -114 84 -208 -45 3 -107 20 -79 -83 61 -296 59 386 42 84 -31 -310 -99 145
3315A45j99L71m60P8K61j42k27M63j28j9j39J50l0k04K07%j3l27J86J74k4k92
$$ 145 -54 317 -143 -65 196 54 -173 290 162 143 4 154 124 -80 127 127 114 -213 -27 147 123 -169
3337a69n1K02J3j2k63L27j44J87k59K55j97J8J66j84j59L16m7p8K82k26kJ06j41
$$ -169 -220 -18 -5 -17 -280 47 -97 90 -169 86 -111 -93 73 -111 -270 46 -1 -79 203 -23 -25 81 -60
3360f0n3M19k10j96m11L73J89J48l61L00n00P5O80l99n2R5m21M44j22j86M86n3
$$ -60 -113 306 96 -100 -511 -138 51 199 -162 138 -362 -287 393 -6 -58 37 -384 60 -62 -248 238 185
3382A85j13j47R1J38L58m06k87K9j4L29j46Q7M9l25J07J99j83j6K84n24L76k53
$$ 185 72 -75 16 154 512 106 -181 -152 -166 163 17 104 153 -172 -65 134 -49 -65 219 -305 71 -182
3404a82j05N59l01l46N13J28k64L36l57Q0Jp5j9j95L2L40j95rj6l67N38m1l14
$$ -182 -287 272 -29 -375 138 266 2 338 -19 61 62 -13 -32 -227 -195 145 -50 -59 -75 -442 96 55 -259
3427b59J13Q1j97N62l46o1K84l93K81o2m29M82J82n87K54R0O7L1k31k6K08n30
$$ -259 -146 -65 -262 300 -46 -107 177 -216 65 3 -426 56 238 -349 -95 -5 62 93 -138 -164 44 -486
3449d86Q69o28k56M83p3k97L50L39j67L25j38mk62j87N58j06o12N37m21j37j94
$$ -486 383 -245 -501 -18 -91 -388 -38 301 134 459 321 317 55 -132 426 320 -292 245 -176 -313 -507
3470e07P24j46m27N25l58Q8L29j67N8j27K8l3L41k86r92L18p3L39L65J5l00J19
$$ -507 217 71 -356 169 -189 -101 228 61 119 -8 20 -13 328 42 -950 -632 -705 -366 -1 14 -286 -167
3492a67K32o4O6m11N26Q9k38L6L09l11J35J84m04L61l76k29J49pk3N9O2j10m7
$$ -167 65 1 67 -344 182 271 33 69 378 67 202 386 -18 343 -33 -262 -113 -120 -143 -84 -22 -132 -179
3515a79j14L33L14p04M10k77K33K10m71L83q2j15J23p0N0o8J51j67P0j72j7M96
$$ -179 -293 40 354 -350 60 -217 16 226 -245 138 56 -59 64 -6 44 -24 127 -40 30 -142 -159 337
3537C37n46K31j6m3o2r2pL54k03j23J5k90O25K8j81l04K57k9J4L38l47N2o4k18
$$ 337 -209 22 6 -37 -99 -191 -198 156 -47 -170 -155 -445 180 208 27 -277 -20 -49 -35 303 -44 8 -56 -274
3561b74L21j9J0M53l41r4R4j91J00J81l41q0k28L88M34o75J34J74j36K19rk07
$$ -274 47 28 38 491 150 56 150 -41 59 240 -101 -181 -409 -21 413 -262 -128 46 -90 129 120 -87
3583h7k6k2O9J81m45J5L77J7j42L41m65L56o0j61Q3j05n5k05J30M16m11k36M84
$$ -87 -113 -135 -66 115 -330 -315 62 79 -63 278 -187 169 109 -52 31 -74 -129 -334 -204 212 -199 -435 49
3606D9l3l57K14J13p9o8K25r7j6L37N4l69PK5k33K63j35J72l56M91k80m7K84k39
$$ 49 16 -341 -127 -14 -93 -161 64 -33 -49 288 342 -27 -20 5 -228 35 -100 72 -284 207 -73 -120 164 -75
3630g5j46J7J89J17l17rL39j70j26K47j43J92J36p5k50M67m50K15N5r2l7j91Q2
$$ -75 -221 -204 -15 102 -215 -224 115 -55 -181 66 -77 115 251 176 -74 393 -57 158 213 121 84 -107 -25
3653b5o5L32k3j14m37L72N1J58j96k24m2M54k70J85j71mn2P2j53M28j89j00P5
$$ -25 -90 242 219 105 -332 40 91 249 53 -171 -213 241 -29 156 -15 -19 -71 1 -152 276 87 -13 62
3676F2j75K99n3l05m0K96j57J74r4jR1k10J19j12J23K23k02m7M2N5j69J26j13
$$ 62 -113 186 133 -172 -212 84 -73 101 7 6 97 -113 6 -106 17 240 38 -9 33 88 -81 45 -68
3699f8K72k10j25L78k39p7p6M9k03K09j29M1M25m65K12K31k07j60j41J71K02k06
$$ -68 204 -6 -131 247 8 -69 -145 -96 -299 -90 -219 -178 247 -218 -6 225 18 -142 -283 -112 90 -116
3721a16k57O46k76pJ99m15K67J43q9Q9j43k18l7L60j26k6l85O76R8l87R4l08R2
$$ -116 -373 273 -3 -10 189 -226 41 184 95 184 41 -177 -214 146 20 -6 -391 285 383 -4 90 -218 -126
3744a26J06J81k46L29q9k52J70n3K30l08O5j19L65j29j58J28R2q7k09j79L40K2
$$ -126 -20 161 -85 244 155 -97 73 20 250 -58 7 -112 253 124 -34 94 186 99 -110 -289 51 73
3766G3j7M0qk64K69p5J09p1k22J52j21J66N6mjK56m51m7K27j20J40q6k84R3L9
$$ 73 56 96 88 -176 93 18 127 56 -166 -14 -135 31 87 83 82 338 -113 -160 67 -53 87 1 -283 -190 -151
3791a51M34Nj16j38J03j43K9Q7j05J58j88j1j49o1K32m9K9k7Nj26L73k87j43j01
$$ -151 283 288 172 34 137 -6 23 110 5 163 -25 -36 -185 -246 -14 -63 -34 -61 -56 -182 191 -96 -239 -340
3815c40K02K75j71J50J18l05j74L47J52q0k19j39K29j58Q0J36m3j57L35j47n5
$$ -340 -138 137 -34 116 234 -71 -245 102 254 174 -45 -184 45 -113 -33 103 60 -97 238 91 36
3836C6J90k12K1j37K02l5k31J6M32l07o7K2J9J79j70kR9Mk17K84j45P9o8q4J26
$$ 36 226 14 35 -102 100 65 -166 -150 282 -25 -92 -70 -51 128 -42 -44 55 59 -158 126 -19 60 -8 -92 34
3861C4J85j25j72J73J39k45j56O1PL2r2N84l96k8L9K08n57N83j55O3j49j45K47
$$ 34 219 94 -78 95 234 -11 -167 -106 -99 -67 -159 425 29 1 40 248 -309 274 119 182 33 -112 135
3884A35L4j00K19m41J18J24k75j07N42j55m6K51j37n55L91K87j74l77L87m5n71
$$ 135 169 69 288 -153 -35 89 -186 -293 249 94 48 299 162 -393 -2 285 111 -266 121 76 -495
3905d95M03j84L12J07k81k16N20J87o88o9Q39m12l19q4j2q1N8K82L17K91j222
$$ -495 -92 -276 36 143 -138 -354 166 353 -335 -404 435 23 -296 -380 -392 -473 -415 -133 184 475 -747
3926g47J186q40k9K02Q52j317P09L61o54j4M55l8j09P7o48j27M76m16Q66M2J1
$$ -747 439 -401 -430 -228 624 -693 16 377 -277 -291 164 126 17 94 -554 -681 -205 -621 245 287 298
3947B98j1k89o50L81J82M01l64l82R49n39M56o75J35J54J90o98L66L33l43M38
$$ 298 287 -2 -652 -271 -89 312 -52 -434 515 -24 432 -243 -108 46 236 -462 -96 237 -106 332
3967C32l34J53K79k50j28l59J71R4j00j8K05Q4k54K50q4j23J05j21K2J15j89J56
$$ 332 -2 151 430 180 52 -307 -136 -42 -142 -160 45 129 -125 125 41 -82 23 -98 -76 39 -150 6
3989FK6%R5j90Q6l1K00M8j12k30M28j51l56K45n8k24J16o3O4m7K92k03m5K44j47
$$ 6 32 32 127 -63 23 -8 192 240 128 -102 326 175 -181 64 6 -218 -102 -165 -101 -148 144 -59 -104 140 -7
4014gL65n27L06Qj54N2l6j25J78l24M15k76k5K78j43k8j2N7o7kJ74r4R2l38K62
$$ -7 358 -169 137 145 -9 43 7 -118 60 -264 151 -125 -150 128 -15 -43 -55 2 -65 -67 107 13 105 -233 29
4039B9L88l07l11M50m25K86q2j38J60j89j49R5K51K00j47k22M0n1K28L5l55L47
$$ 29 417 110 -201 249 -176 110 28 -110 50 -139 -288 -193 58 258 111 -111 -71 -122 106 141 -214 133
4061A33j96j14L08j07q7P8J19l22K38J06j41n0Lk02L26k17j63K98L32l07p0K04
$$ 133 -63 -177 131 24 -63 15 134 -188 50 156 15 -35 -32 -234 92 -125 -288 10 342 35 -35 169
4083A69M1j61k67K12j25N15k16l51o4N89n17K98k03J66n7l3J73J30m49L31k16
$$ 169 210 49 -218 -6 -131 384 168 -183 -247 342 -175 123 -80 86 29 -4 169 299 -150 181 -35
4104c5m3J3Q4j2r3K39l89K51j50J58K74k22r4O0r5J16l12j39M93q7Q3j56r9n3
$$ -35 -78 -65 19 7 -86 153 -236 15 -135 23 297 75 -19 41 -54 62 -250 -389 104 17 100 -56 -155 -208
4128b08M80m37j41K54M1NK22j83k15k05L84J82j83J24Oj6o9q4J6O9m7m6m3k1J28
$$ -208 272 -165 -306 -52 -11 -6 216 33 -182 -387 -3 179 -4 120 126 110 41 -43 -27 42 -5 -51 -94 -115 13
4153A3O8j33K13J29k44j33J13k41N21l56O3j41O2M65l66j25K80k59J64j19J64
$$ 13 81 -52 161 290 46 -87 26 -215 306 -50 13 -128 -66 399 33 -92 188 -71 93 -26 138
4174A38j93J06k71J59L25k30j58J65l35m3j0L58M32m13o62N11K06j34J60J53j66
$$ 138 -55 51 -220 -61 264 34 -124 41 -294 -337 -347 11 443 30 -632 -121 85 -49 111 264 98
4195I8k94K74L45n14j88K60rL2L7j63j2K73l47k0L65m7l35J40j28M83j97k21J73
$$ 98 -196 78 423 -91 -279 -19 -28 4 41 -122 -134 139 -208 -228 137 90 -245 -105 -233 250 53 -168 5
4218Ek6l4J00q4J56k31J77j20m7M4M62n28rK55j3j83j33J05J76R5k34Q6j7l2R3
$$ 5 -21 -55 45 -39 117 -114 63 -57 -104 -60 402 -126 -135 120 107 -76 -209 -104 72 167 -67 19 2 -30 63
4243F3J09j47P9k13R4J16k00q8K80j63K27j44J05n7N8N9j6k47j03K92k62q7K43
$$ 63 172 25 104 -109 -15 101 -99 -187 93 -70 157 13 118 61 119 178 162 -85 -188 104 -158 -245 -2
4266bk66L47j60L26j4l07M7qn5L6r1N2M09k29q9j57mJ41L78m62J77k47J43J13
$$ -2 -268 79 -81 245 231 -76 -29 -37 -92 -56 -147 -95 314 85 -4 -161 -165 -24 354 -108 69 -178 -35 78
4290G8j75k4L17k71NJ89n6o2j99N8J37m08L14Q1M8J00j24N0j45J62k19K30j93
$$ 78 -97 -121 196 -75 -70 119 63 1 -198 -140 -3 -411 -97 -16 32 132 8 58 -87 75 -144 86 -107
4313a07N4j34K55n1j04LK13m1j97k71J70K09j02P5M0K8j54P1J90j2p1k24J82M4
$$ -107 -53 -187 68 17 -87 -84 129 88 -109 -380 -210 -1 -103 -28 12 40 -114 -43 147 135 64 -160 22 66
4337F6j29j3K48j08o8q0o0L75j02k85N94k61J84l45m9N1k13j3M07N8k02J78j4
$$ 66 -63 -76 172 64 -4 -84 -144 231 129 -156 438 177 361 16 -33 18 -195 -208 199 257 55 233 219
4360B19k39J11M2Q6m7m28M06k20L0J6J39l83K10K84k72J73k18Mk7p0K44O1j31
$$ 219 -20 91 133 219 172 -256 150 -70 -40 -24 115 -268 -58 226 -46 127 -91 -87 -114 -184 60 121 -10
4383a0J20m4l03L86J4l51J36p4L37l39O8J35L8m65L51ok5J81p7k3O3k51J25O1
$$ -10 110 66 -237 149 163 -188 -52 -126 211 -128 -60 75 113 -352 -1 -7 -32 149 72 49 112 -139 -14 47
4407D7j04j45K87k01j3J67j93J63K22j39k53J93O0J16j46Ml18j15K84K01k42J13
$$ 47 -57 -202 85 -116 -129 38 -155 8 230 91 -162 31 91 207 61 65 -253 -368 -84 117 -125 -12
4429a2L4p6l0Q6K08l53qN68l30qLk05Q2L01l26J93j98J1Q0j89N4J13l47L20J27
$$ -12 22 -54 -84 2 210 -143 -151 417 87 79 82 -123 -41 260 -66 127 -71 -60 20 -169 -115 -2 -349 -29 98
4454I8J2l5j6J36j64J74m04J93J30k20kpL32Q3l96J84j37O6K42j90ml8J7k44L93
$$ 98 110 75 59 195 31 205 -199 -6 124 -96 -98 -105 227 310 -86 98 -39 27 269 79 75 37 54 -190 203
4479B03l13L10k17l45O9J63q1K05OK96j48j36j29k04J43Q7L32N4j45n1l13L8L01
$$ 203 -110 200 -17 -362 -293 -130 -211 -6 0 296 148 12 -117 -321 -178 -91 241 295 150 99 -214 -176 125
4502A25j19P4J43k80J46J88Q9n86j0M31j97k46N13j05k83Q3j90L73j75n1j37p
$$ 125 6 80 223 -57 89 277 366 -220 -230 201 4 -242 271 166 -117 -34 -224 149 -26 -77 -214 -221
4524b21K8N5j5J28ooR4r6j83M23l86P0J03K93l24Q5k76P7L58p6r6m9J27J22l05
$$ -221 -193 -138 -153 -25 -31 -37 57 -39 -222 201 -185 -115 -12 281 -43 42 -234 -157 201 125 29 -20 107 229 -76
4549g6K13j31J5oK00k75J22J30j49j67k6K06N0k4k79N52m78o1K80j21j55J55k6
$$ -76 137 6 21 15 215 -60 62 192 43 -124 -150 56 106 82 -197 355 -123 -184 96 -25 -180 -25 -51
4572e1J18p2J23J23J37p45J41j14L14j01J0k8K35K47j11M1k77J8J26m19J79J34
$$ -51 67 -5 118 241 378 -367 -226 -340 -26 -127 -117 -145 90 337 226 267 -10 8 134 -285 -106 28
4594B8J70l81J61r8q0M32l42j5K1J73q8J46l01K38l40K55j55J39j90K96r4K60
$$ 28 198 -183 -22 -120 -200 232 -110 -125 -104 69 -19 127 -174 64 -276 -21 -176 -37 -227 69 -25 235
4616B35m90K79j74J79J8o6L12l23J28p1J62q3J65l11L25m16O2j75J11p7L13k0
$$ 235 -255 24 -150 29 47 -19 293 -30 98 27 189 106 271 -40 285 -131 -69 -244 -133 -210 103 83
4638H3k02K35j14Qm9J88j0j07k08N5J38k28O1n6K47j66K10j8P7k52K82l14K51
$$ 83 -119 116 2 10 -39 149 139 32 -176 -121 17 -211 -150 -206 41 -125 85 67 144 -108 174 -140 111
4661A11J20m16R4J99%M7j25M6k77J23K20j06l2j72J27K92k19k5J02j95K03j0j98
$$ 111 231 -185 -91 108 108 155 30 76 -201 -78 142 36 4 -168 -41 251 32 7 109 -86 117 107 -91
4684i1L0NJ45J8J4j59M7l40M42k48N7l9J16L0j59J78J36k64K82j42k51K78J7j09
$$ -91 -61 -56 89 107 121 -38 9 -331 111 -137 -80 -119 -3 27 -132 46 182 -82 200 58 -193 85 102 -7
4708gn0k92M84n0P0k17l46M06j77M12k40J70k02J29p1J49l24n8L6K14R9k59J52
$$ -7 -57 -349 135 85 155 -62 -408 -2 -179 233 -7 163 -39 90 19 168 -156 -214 -178 36 135 -124 28
4731B8J28o4M6k67o2J58K1q8j17J39J99Q0l01Q7j02k59K94J27l59K18J11j98M31
$$ 28 156 92 138 -129 -191 -33 -12 -100 -217 -78 121 201 -100 -13 -115 -374 -80 47 -312 -94 17 -181 250
4754B50m19M17j28k65J1J49N9J63j41r6Q2r0L30k28k68M17j78l2N6m3o6L42l38
$$ 250 -169 248 120 -145 -134 15 74 237 96 0 82 -8 322 94 -174 243 65 33 89 46 -20 322 -16
4777a6K29j1m33k1M49k94K54j5l79L24q7j22J88q6p2m3J0M8j50J37J39J87j86
$$ -16 213 202 -231 -252 197 -97 157 142 -237 87 0 -122 66 -20 -92 -135 -125 -77 -227 -90 49 236 50
4800E0j36o2K65p9J31j1l15J06K11l5l6k03J37j43J92M0Q1j49j8J06mj28k7j56
$$ 50 -86 -148 117 38 169 158 -157 -51 160 125 89 -114 23 -120 72 112 193 44 26 132 128 0 -27 -183
4824a83J30J79j42L6q1p3J06J30j14k34J66p4K96N9l01M0j51J04N53n80J85m4
$$ -183 -53 126 -16 20 -61 -134 -28 102 -12 -246 -80 -154 142 201 -100 -60 -211 -107 446 -134 51 7
4846Go1L33n03M13k51R3j25J1K03R7l73j2J59j40L20k26l8P1J8rJ76q4o7J52J18
$$ 7 -54 279 -224 189 -62 31 -94 -83 120 217 -156 -168 -9 -149 171 -55 -93 -22 -4 -13 163 79 12 164 282
4871B82j28j61kKP3q4K50l88l9L0J68N9l37K58l8J35k02J23K31j60J42j03j22
$$ 282 154 -7 -9 -7 66 -18 232 -156 -195 -165 3 62 -275 -17 -55 80 -122 1 232 72 214 111 -11
4894a1j75J41N9K7j07K77m04J49j98L22j49j20M04j73N8j30J96J81j62k22jQ3
$$ -11 -186 -45 14 41 -66 211 -193 -44 -242 80 -69 -189 215 42 100 -30 166 347 185 -37 -38 45
4916D5o8J25l36K86j72j9L48J20k04K03l72O6Q5j49K12k42K66J7l18J97P7P0k23
$$ 45 -23 102 -234 52 -120 -139 209 329 125 328 -44 22 107 -42 170 -72 194 211 -107 90 167 237 14
4939A4j9J73n5k93K28j84Q0K08r1j17j66J62j72K71q5j51K30J1J14j77O5n3rR5
$$ 14 -5 168 113 -180 48 -136 -56 152 61 -56 -222 -60 -232 39 -46 -197 33 44 158 -19 46 -7 -16 79
4963G9r7K3K12l38PL21k08o2m6L33k07J78j37n0l78L42M15l10l69J10L71n2j46
$$ 79 -18 5 217 -121 -114 207 -1 -63 -109 224 17 195 58 8 -370 -28 387 77 -292 -182 189 137 -9
4986ij71J15l4L87l5j25j11O7J81k77n9J75n3p1J28m6k76J98m6K23k28J61k31
$$ -9 -180 -65 -99 288 253 128 17 84 265 -12 -71 104 51 -20 108 62 -214 -16 -62 161 -67 94 -137
5009a37Q7K79k03j20N2l8K45k31J8J71k03K45n5J46l94j18J42K21l07K43m3r6
$$ -137 -50 229 26 -94 -42 -80 165 -66 -48 123 -80 165 110 256 -138 -256 -114 107 -200 43 0 -96
5031i6kr3J46J20j4p3N6o3J04j95r8O7J16j63L86k06rQ6J1j0j31J64k61J85K0
$$ -96 -98 -191 -45 75 61 -12 44 -19 85 -110 -208 -141 -25 -188 198 -8 -17 69 80 70 -61 103 -158 27 47
5056D7k24M19l15J72k1p6J29k77J77R5n4j56oJ02j51M9K48j79m7L1K4J00m01M19
$$ 47 -177 242 -73 99 78 2 131 -146 31 126 72 -84 -90 12 -139 -90 158 -21 -68 -37 -13 87 -314 105
5080A05j7k01M61l78P9m02K54L5k6K06p8l6J14j29PK1j18K65j61R4j18n4jmJ11
$$ 105 88 -113 348 -30 49 -353 -99 -64 -90 116 38 2 116 -13 -6 15 -103 162 1 95 -23 -77 -78 -82 29
5105B9J02l38L23K1m1l13K14M7J6k4P4nj38k02M32k37l5j26M2K97Ll21L08J49
$$ 29 131 -207 116 137 96 -217 -3 44 60 36 110 105 -33 -235 197 -40 -75 -201 -159 138 141 -180 128 277
5129B77k04J69j95j01J83PL9j7k97K73l9k50K05L4j60j59L21l67K14O0j3O7k80
$$ 277 73 242 47 -54 129 136 175 158 -139 134 95 -155 50 84 -76 -235 86 -281 -67 -7 -20 47 -233
5152b33K10J85k20J42N7m8R7k83n9L06l96O2K33j21K35k01q4L39j05j57J57j15
$$ -233 -23 162 -58 84 141 93 190 -93 -152 154 -242 -180 53 -68 167 -34 -118 221 116 -41 116 1
5174Aj52M15m82J10Q1q8K65L4j49q0j62Q6L49j64j13J67j34J37j13K34j91P4j96
$$ 1 -151 264 -218 -108 -27 -115 150 184 35 -45 -207 -121 228 64 -49 118 -16 121 8 242 51 125 -71
5197g1M0K28j70J4L3k4j49J5K38k69k0lJ49k05J29L9mK57n02L35j07L4j22J69
$$ -71 -31 197 27 41 74 50 -99 -84 154 -115 -135 -138 11 -194 -65 -26 -30 227 -275 60 -47 -13 -135 34
5221C4j71J59K66l59l6J48J74m33K13k1O8j39RJ34j52L1K37q4m7n5j03K52l6r7
$$ 34 -137 22 288 -71 -107 41 215 -218 -5 -26 42 -97 -88 46 -106 -75 162 78 31 -24 -127 125 89 -8
5245hP4k66K19K0M6nj26M38k96k85K27N3j83K2M7m0o2L8O4n8K03k89j21J40L70
$$ -8 66 -200 19 39 85 80 -46 392 96 -189 38 91 -92 -70 -23 -63 -125 -87 -23 -81 122 -167 -288 -148 222
5270B22m16k0J80N4L8K6Nr7j53K03k51J41J7O3j18J58l53L57R4l50L98k86o7Q9
$$ 222 -194 -214 -34 20 58 84 89 -8 -161 42 -209 -68 -51 12 -106 52 -301 56 150 -200 198 -88 -155 -66
5294f6J56j93R4J42L9n2P8j47l5nk30K37k2j07P1R8j87L02k3k32P3J54j08l62
$$ -66 90 -103 -9 133 172 120 198 51 16 11 -219 18 -4 -111 -40 58 -129 173 150 -82 -9 145 37 -325
5318c25M27l4l3j33m0N8R9m6j62L65lj79j77L8R4j8p2N8R1Ko2p1K28j31j31Q6
$$ -325 102 68 35 -98 -138 -80 19 -27 -189 176 173 -6 -183 -145 -51 -69 -141 -83 8 10 -52 -123 105 -26 -157 -71
5344g1K01o0j3Q2m92N70p3p4Q3j61j7J08K7r9K22m39L17Ok63K54J63k38j56K43
$$ -71 130 70 57 139 -353 217 144 70 153 -8 -25 83 110 11 233 -206 111 117 -146 108 271 33 -123 120
5368A20o6k51J43j04L25j95p8j40J03KO7R1J18r3m36J79J57j06J02k15K38K49
$$ 120 54 -197 -54 -158 167 -28 -106 -246 -143 -141 -74 17 135 42 -394 -215 -58 -164 -62 -277 -39 210
5390B10m46J14K48j24k49K07j7M5j7l2J85k78J64k86J56K85l12L00j50oJ06pK4
$$ 210 -236 -122 126 2 -247 -40 -57 -12 -29 -61 124 -154 10 -276 -120 165 -147 153 3 -3 103 96 120
5413A20l20J34r6J29R3k3j33R1n1K73k79J56J30m22J89j6kJ29P1j54J04l64m1
$$ 120 -200 -66 -162 -33 60 37 -96 -5 -56 217 -62 94 224 -198 -9 -25 -27 102 173 19 123 -241 -282
5436b82L14J3J93M9l63P6L4j31R2R9j15L41k28k3j28O6m3J09o9k48J89J93P6l52
$$ -282 32 45 238 287 -76 0 34 -97 -5 94 -21 320 92 69 -59 7 -36 73 4 -244 -55 138 214 -138
5460a38K01l32Q3L03q2j23J74k02J50j82K33m8K27k69l1k33K80J34n7j77J67p
$$ -138 63 -269 -186 117 35 -88 86 -116 34 -148 85 37 264 -5 -36 -269 11 145 88 -89 78 71
5482G1j84J64j07k0k17K86P7N5j36J7Pq2J90j72K5J07o4q1O2M0j74K69k20l6J89
$$ 71 -113 51 -56 -76 -293 -7 70 125 -11 6 13 -69 121 -51 -26 81 17 -64 -2 38 -136 133 -87 -123 66
5507F6n8o2R9N3k03J54K72o40K11m9r1J13O0M7jK89j44j78J06k16J2j42J79O5
$$ 66 8 -54 45 98 -105 49 321 -319 -108 -157 -248 -135 -75 -28 -29 260 116 -62 44 -172 -160 -302 -123 -58
5531e8J46k73j80M94m4L6j62nj41J56k5p0J04Nr3j01L75m19L38J5J9K6k03j6o
$$ -58 88 -185 -365 129 85 121 -41 -46 -187 -31 -56 -126 -22 -17 -110 -211 164 -255 83 98 117 143 -60 -76 -82
5556h2J69J72k67l45K32K70j40K61j97k0k20J34OJ53k33J16k36K1J21L77n40M65
$$ -82 87 259 -8 -353 -121 149 9 270 73 53 -167 -33 -27 126 -107 9 -227 -206 -85 292 -248 217
5578B17n08R7n5J39K28Q9j87qMj55M8mL28k88R0p4j21J74m6J48k76R1P4j04N4
$$ 217 -291 -194 -249 -110 118 207 20 12 16 -139 -91 -95 233 -55 35 -39 -160 14 -32 116 -160 -69 5 -99 -45
5603d5K3j4O0j21L6q3K2N9J54k09K39n3j92R8l45L88L1%j21N9K42k48j25K53J02
$$ -45 -22 -36 24 -97 -61 -144 -122 -63 91 -118 121 68 -124 -26 -371 17 48 48 -73 -14 228 -20 -145 108 210
5628B10j54l69J80p7L36j35j13L65l05r8l1K53k07K23J47k00j45j8K69J05l20
$$ 210 56 -313 -133 -210 126 -9 -122 243 -62 -160 -191 62 -145 78 225 25 -120 -138 131 236 -84
5649h4L14k38j48K22n6J94Ok81L1L9L5K0Nm8R2m1k79K35j04K57j75J08N9l12M57
$$ -84 230 -8 -156 66 10 204 210 -71 -40 -1 34 54 59 11 103 62 -217 18 -86 171 -4 104 163 -149 308
5674C08k66m1J48k24J74m70L13L03l60n7K11l25K56j96M69j99J44l23J84k56M74
$$ 308 42 1 149 -75 99 -371 -58 245 -115 -172 39 -286 -30 -226 243 44 188 -135 49 -207 267
5695B67k14pQ4p9J00R9j35J2j56q4L41k64J44k1j75j4K91l85L44k10K3L6j54K85
$$ 267 53 46 130 51 151 250 115 127 -29 -113 228 -36 108 87 -88 -102 189 -196 148 -62 -39 -3 -157 128
5719A28k04J06J22j79M0j02P8L1p6L46k92M8j52K70k8R4l78J7k2J7J7L5L74o6
$$ 128 -76 30 152 -27 13 -89 -11 20 -56 290 -2 46 -106 164 136 230 -148 -131 -153 -136 -119 -84 290 224
5743B24j79k40Q7J2J17k37l0M74l65j4J61P9l4j45J97q5J46k52K63k34J75L7k07
$$ 224 45 -195 -108 -96 21 -216 -246 228 -137 -151 10 89 55 -90 107 22 168 -84 179 -55 120 157 -50
5766e0k0J5M6r1L0J61p4j43J57J27j48k06M15l15O8jK8n2j96M28k04K24j32m0
$$ -50 -70 -55 -9 -100 -70 91 17 -126 31 158 10 -196 219 -96 -28 -29 -1 -53 -249 179 -25 199 67 27
5790B7R7j78N0J72j17j05J61k03J54k3k61J56j20J15K25j15q3J61N2M7j33j46
$$ 27 124 -54 -4 168 51 -54 107 -96 58 35 -226 -70 -190 -75 150 35 -48 113 165 212 79 -67
5812f7Kl1k4J84j60K62k58K80k23r8J57R8K26l53R7K16k67k82J40J29j24J03K12
$$ -67 -65 -96 -120 64 -96 166 -92 188 -35 -133 24 122 348 -5 92 308 41 -241 -101 28 -96 7 219
5835B19m08j58K96J23j48JO1O%K31l03J1R2k12J35J30r3R9K7R1k48K8J86j44N7
$$ 219 -189 -347 -51 72 -76 -75 -14 -8 -8 223 -80 -69 23 -189 -54 76 -17 82 109 200 -48 -20 166 22 79
5860G9n0p9K50n15L36n4N5K65l93K22J28k54j37J4K48k02J3Q9k6N1Q8k83Q9j20
$$ 79 29 -50 200 -315 21 -33 22 287 -106 116 244 -10 -147 -133 115 -87 -74 15 -11 40 128 -155 -66 -186
5884a86J03K55j76k44J91N6j93K89j31J35j08k89L06l83L93K38m05K26j93K67
$$ -186 -83 172 -4 -248 -57 -1 -194 95 -36 99 -9 -298 8 -375 18 256 -149 77 -116 151
5904A51k56L23j50k01K50K0j30j29J29J6Pj3j43J04P0j13j09k5N22m94J40K6o5
$$ 151 -105 218 68 -133 117 137 7 -122 7 23 30 17 -126 -22 48 -65 -174 -199 323 -171 -31 -5 -70
5927g0K27Kk83J5K43r2K33m34Q4Q7k3J14Ok29r3M18j7m23L52nj76j11K94q0mJ87
$$ -70 157 159 -124 -109 134 42 275 -159 -75 12 -11 103 109 -120 -213 205 188 -235 117 112 -64 -175 119 39 35 222
5953B22P5k11k67M09j93j71J12l0j62K35j09Q7R9k4k4K67k83L5l1J76mk25R1j66
$$ 222 297 86 -181 228 35 -136 -24 -54 -216 19 -90 -3 96 72 48 315 32 67 36 212 208 -17 74 -92
5977i2K13k17l9j15J89j2J75N8N0k43K1rP7l30kL76l09K11q5L90l46K49j57p5
$$ -92 121 -96 -135 -250 -61 -73 102 160 210 -33 -12 -21 56 -274 -276 100 -209 2 -83 307 -39 210 53 -22
6001b2j66J79k13K84k59P4Q9O7j86K13l53K34L93k66J70k63j30oK82m2OK4j13
$$ -22 -188 -9 -222 62 -197 -123 -34 33 -153 60 -293 -59 334 68 238 -25 -155 -161 121 79 85 109 -4
6024dj62K28j23M9k21K7J84J78j23j08K80j97J17k35J12j12J90k53J03K01r9k1
$$ -4 -166 62 -61 -12 -233 -206 -22 156 33 -75 205 8 125 -110 2 -110 80 -173 -70 131 32 11
6046A1K88l84p7M5M8J41k78M22j2n4j1k40J8K20j57r3J24K20n3m00M58k12J83
$$ 11 299 -85 -162 -117 -69 72 -206 216 204 150 139 -101 -83 137 -20 -113 11 231 178 -222 236 24 207
6069B07k14R2J8m13J72O9R4j00n4k8N3m5N72p05L89k45K44J25k81O2o9j19K99
$$ 207 -7 85 103 -310 -138 -69 25 -75 -129 -157 -104 -149 423 -282 107 -138 106 231 -50 12 -57 -176 123
6092A23J36m04K1K48o5m16K84r7P0RK87k92J7J64j47J96j1Lrj19o0o7J91l13J91
$$ 123 259 -145 -124 124 59 -357 -73 -170 -100 -91 196 -96 -79 85 -62 134 123 126 117 -2 -62 -129 62 -251 -60
6117f0L1r4Q2k13Q6N8M9K07k05J47K51j98j40j17J06N3j67J28J07j81j40K97j81
$$ -60 -29 -123 -41 -254 -168 -110 -61 146 -59 88 339 141 1 -116 -10 43 -124 4 111 -70 -210 87 -94
6140i4J19R4j10m8J80j77J22M8m1J71k84k8L41k16L1j78K4j81L20j34M88o17M0
$$ -94 25 119 9 -39 141 -36 86 134 93 264 -20 -48 293 77 108 -70 -46 -227 93 -41 447 -170 -130
6163a30lQJ08K36j16J06j07j30m9r9L2PJ44j58K52n4j65P1q1L3J6K47j20MN6o0
$$ -130 -133 -125 -17 219 103 209 102 -28 -77 -176 -144 -137 7 -151 101 47 -118 -47 -128 -95 -79 168 48 52 108 48
6189D8K59j66l22O6Q3K61l29J03j24q0K03k03J79K0m8j17M26k56k73J85J60j46
$$ 48 307 141 -181 -115 -32 229 -100 3 -121 -201 2 -201 -22 -2 -50 -167 259 3 -270 -85 75 -71
6211g1j21K97k98J21P1J60m5k21no1P2J09j5j70J65j0N1rj87M42k05j58k0P1O
$$ -71 -192 105 -193 -72 -1 159 114 -107 -112 -173 -101 8 -7 -177 -12 -22 29 20 -167 275 70 -88 -108 -37 -31
6236c1L32m74K04O0j46J08O9j05r2j18O4K04K22m19L08m48J43K47L6k77k2K76
$$ -31 301 -173 31 91 -55 53 122 17 -75 -193 -129 75 297 -122 186 -262 -119 128 164 -113 -135 141
6258A41r6j47J91k65M43j46j2k25J7J10j02jl8l2L24j66p5P2K08l88M31q7J04
$$ 141 45 -102 89 -176 267 121 109 -116 -99 11 -91 -92 -130 -162 162 -4 -79 -7 201 -187 244 157 261
6281B61n2k42k5QK03l44P7J33o9J60N6M4j14Qr7n4q6J32j42L53j15n9k06K79l69
$$ 261 209 -33 -58 -50 153 -191 -114 19 -50 110 166 210 96 104 7 -47 -133 -1 -143 210 95 36 -170 109 -260
6306b60L96p0j53L35j03J13j9l73L20n77J33J03P1J22q7K48M7k85P9Q1l36L12
$$ -260 136 66 -87 248 145 258 239 -134 186 -391 -258 -155 -84 38 -49 199 246 -39 40 121 -215 97
6328I7k77L27l44L23k89RQ1K0K08Q9j52Ql56L61j6j35j10nK56m11L89Q8k14K15
$$ 97 -180 147 -197 126 -163 -154 -73 -53 155 244 92 100 -256 105 89 -46 -156 -161 95 -316 73 161 -53 162
6352A62m49L31j38q8L3J31K23l16l49L68J07K36l17J69k46K15j52q1K25k62K05
$$ 162 -287 44 -94 -182 -149 -18 205 -111 -460 -92 15 251 -66 103 -143 72 -80 -161 64 -198 7
6373Gj00O1Q5l32K10J26j66J78j30L93l13j81K84o6K23k8k27j4OQ4m29K19K39
$$ 7 -93 -32 53 -279 -69 57 -109 69 -61 332 19 -162 122 56 279 251 24 10 16 100 -329 -110 129
6396A29q2j95J06k6R7j87K43j15N2m8np2K28j15kj36j23L97k28j17J54k2J13l39
$$ 129 47 -148 -42 -68 29 -158 85 -30 22 -26 -31 -103 125 10 8 -128 -251 146 -82 -199 -45 -67 46 -293
6420b93K59J2L6M6j49l5K7L55k21k88K38L34l59J95m13J99O5k69K05J62j23j83
$$ -293 -34 -22 14 60 -89 -124 -97 258 37 -251 -13 321 -38 157 -256 -57 8 -261 -56 106 -17 -200
6442b00L61l58M48j03ok62O6L26l81L0j38K90j31ML22j30R6l12L16j2k54j36J10
$$ -200 161 -197 251 148 142 -120 -54 272 -109 -79 -217 73 -58 -54 268 138 234 -78 238 226 -28 -164 -54
6465e4k1L4J81j98O9j76K68q3k2O7K9j43k12J83m3q6K61j45P2J4J41J13k09N9
$$ -54 -75 -41 140 -58 11 -165 103 20 -2 65 94 -49 -261 -78 -121 -207 54 -91 -19 -5 136 249 40 99
6489I9m1k80J43J70Q0k38L6j5L9J43k65K90j44J05j55O0j8P1qk26K33j6Q1J03
$$ 99 58 -222 -79 91 171 -67 -31 -46 -7 136 -129 161 17 122 -33 27 9 80 72 -154 79 63 144 247
6513B47m37K40P0Q2k80L9n0O5L8O0%l9J09k53J92q1j87J50p9j57L13J04j76m7
$$ 247 -190 50 120 202 -78 -39 -89 -24 14 74 74 35 144 -109 83 2 -185 -35 -114 -271 42 146 -30 -77
6537g7k6J96K8k46K60j8l75L42j74J26j12J9j08J93k4L97j08l21Q6j02K88k95
$$ -77 -103 93 121 -125 135 117 -258 84 -90 36 -76 -57 -165 28 4 401 293 -28 58 -44 244 -51
6559e1J02j90K4j49K77j78j38J73k1K28p7r1J09J42m56N00l64K9K05r8K22o6k38
$$ -51 51 -139 -115 -264 13 -165 -303 -130 -151 77 0 -91 18 160 -296 204 -160 -131 74 -24 198 132 -106
6582a06p1J39J37k42J99q0K4R6k23J40m1J32k52K18r3N6k72J08K91o8l16K44n0
$$ -106 -177 -38 99 -143 56 -24 0 96 -127 13 -28 104 -148 70 -23 33 -239 -131 160 92 -224 20 -30
6605c0j89M56j75j62j19J82J48j23JK60l24J11l17J68m2K11L4J26R8l91J51P0
$$ -30 -219 237 62 -100 -219 -37 111 -12 -11 249 -75 36 -281 -113 -155 56 90 216 314 -77 74 144
6627A44j85L08k73J52p2q4q7p9K28P8m9o4L68k76k75M29k78q2K96k51k01J98j31
$$ 144 -41 267 -6 146 74 -10 -97 -176 52 130 81 17 385 109 -166 263 -15 -97 199 -52 -253 -55 -186
6650a86QK50ok69J45O8k93N71k47o3jJ97j74m9J51o0qo7l1L13%l83L74j87l0k17
$$ -186 -178 72 66 -203 -58 10 -283 288 41 -22 -23 174 0 -49 102 42 34 -33 -64 249 249 -134 240 53 23 -194
6676a94J91P8k29J45J54k46j25M09q8p0q2l0J31L7n7O7j63K6J75l89K20j08L03
$$ -194 -3 75 -154 -9 145 -101 -226 183 95 25 -57 -87 44 81 24 91 -72 -46 129 -260 -40 -148 155
6699A55l05J15J49K74k07qK6j38k26M25k29j2M8o5j07J25M3J90k84n8K6K0O9J95
$$ 155 -150 -35 114 388 181 173 199 61 -165 260 31 19 67 2 -105 20 63 253 -31 -89 -63 -43 26 221
6723B21j66j11J61l4k46J46j87K45j3mj17J17O4q8k38K57j68QK88k97L51j12k84
$$ 221 55 -56 105 71 -175 -29 -216 29 16 12 -105 12 76 -12 -250 7 -161 -153 135 -162 189 77 -207
6746b07J40K96k9j24k5J0j64K06m28K71J60J73n83L14o3M50l65P6j31k99J62N5
$$ -207 -67 229 200 76 51 61 -103 103 -325 -54 106 279 -304 10 -53 397 32 108 -23 -322 -160 -105
6768a05L1jJ44j68J20J25k48J19j96p8L29k9m3k18J14o9N02n56K16K54j46M3r8
$$ -105 -74 -75 69 -99 21 146 -102 17 -179 -257 72 43 0 -218 -104 -173 329 -227 -11 243 97 140 42
6791D2J08j0O2Jok33J87J8l41K41j89K86j37L90n04j03o2J51J04k35K80l21P9
$$ 42 150 140 202 203 197 -36 151 169 -172 69 -120 166 29 419 -85 -188 -250 -99 5 -230 50 -271 -192
6814a92l6M02k87J36l6o7J21J40Q2m27K40m62J46L87j30Q5k33n4K52j30L8R4l9
$$ -192 -228 174 -113 23 -13 -80 41 181 263 -164 76 -386 -240 147 17 102 -131 -185 67 -63 -25 69 30
6837C0k95L72J77k36O1p4K19j23j08j36Q5j51L76j55j90n4J84j17K68j88nr4J01
$$ 30 -265 107 284 48 109 35 254 131 23 -113 -28 -179 197 42 -148 -202 -18 -135 133 -55 -60 -154 -53
6860e3r1J00rk25M10l15J12r3J6K0J55j69K31j73J69N9k41J1Q2l5K35k46J62P9
$$ -53 -144 -44 -53 -278 132 -183 -71 -164 -148 -128 27 -142 89 -84 85 144 -97 -86 -4 -39 196 -50 112 191
6884A91l41J93q0n4J62j55M0J05K2J81k70P6r2K2N5n2jQ9j8n1j02K11o7k35L71
$$ 191 -150 43 -37 -91 71 -84 -44 61 83 264 -6 70 -22 0 55 3 2 91 73 22 -80 131 64 -171 200
6909B00l58j54M12j25n5R1j98L75l45j1J87j41q9K54j38p5J55J23j95J34J5J08
$$ 200 -158 -312 100 -25 -80 11 -187 188 -157 -168 19 -122 -211 43 -95 -170 -15 108 -87 47 62 170
6931A70k71NJ86k41J03j87L99j68j30J93nl20J19K57k27m2L7N9m8J78k67Q0J50
$$ 170 -101 -96 90 -151 -48 -235 164 -4 -134 59 54 -266 -147 110 -117 -159 -122 -63 -111 67 -200 -120 30
6954C0j00O9N7k96K77j25k16J75K1J79L4R7l57K41N6j85n2K52m4m1J35j00k47
$$ 30 -70 -1 56 -240 37 -88 -304 -129 -108 71 105 202 -155 86 142 -43 -95 157 113 72 207 107 -140
6977a40K2J99R2qj24k08J94j34K13q7k26K06K01j55k53L41j53K4j43J59r3M4k61
$$ -140 -118 81 173 165 41 -167 27 -107 106 19 -207 -1 200 45 -208 133 -20 4 -139 20 -73 -29 -290
7000b90L26j08L26j47q7l84N64l42K45p6k91K96J20qj79R0l8j53O8J41j66J15
$$ -290 36 -72 254 107 20 -364 200 -142 103 27 -264 32 152 144 -35 55 17 -136 -68 73 -93 22
7022B2l0k25L08L9J55k80J12r3j65K54k39J30K84j57j10p2j0l3N6J25J45o9k77
$$ 22 -8 -233 75 114 269 -11 101 8 -157 97 -142 -12 272 115 5 -67 -77 -110 -54 71 216 147 -130
7045a30J56j32J63J05j81KJ12j82O6o6J76n3j18M7j7K16j93j65j03K54J30j57
$$ -130 26 -106 57 162 -19 -17 95 -87 -21 -87 89 36 -82 -35 -52 164 -29 -194 -297 -43 87 -70
7067g0J58P1k28J6jR5J22q6q3K00k43K05q0j7k05j50M9L49O6j45K2R5n5k66K80
$$ -70 88 159 -69 -53 -54 41 163 77 -6 194 -49 156 76 59 -146 -296 -247 102 168 23 45 140 85 -181 99
7092I9k13J92m1K36m67PJ25J4K8l8J6J00k62K55k77J62M4j87O8j5J57L81l63p4
$$ 99 -114 78 37 273 -194 -187 -62 -48 -20 -58 -42 58 -204 51 -226 -64 -20 -207 -139 -154 3 384 21 -53
7116e3j58O5L84l27J79l12P6j10K10J97j59m5J34k2j0j81K12L47n56K7K17j72
$$ -53 -211 -146 238 -89 90 -222 -146 -256 -46 151 -8 -53 81 59 49 -132 80 427 -129 -102 115 -57
7138e7j40J46M2J75j53o5M1J50r6O0K0j25k76L92R6l13K66M1j00j40K07l46L38
$$ -57 -197 -51 -9 166 13 -52 -11 139 43 103 123 -2 -278 114 210 -103 163 204 104 -36 171 -175 163
7161A63m18L70j39K18l78J18J87k87K31j42R3j29L63j67k29J03K34m05J32K01
$$ 163 -255 115 -24 194 -184 -66 121 -166 65 -77 16 -113 250 83 -146 -43 191 -214 -82 119
7181A19J26k71J41m46K02K58k23K95l77L13r7P2N6J00l73Q9o3Q7q3L69l62r8Q8
$$ 119 245 -26 115 -331 -129 129 -94 201 -176 137 40 112 168 268 -105 -16 -79 8 -75 294 -68 -166 -78
7204g8J03k6j59J75j50K49k11j39k2L61K8j19j65J80p4j87K93j2M8o4j6K84l2
$$ -78 25 -1 -160 15 -135 114 -97 -236 -258 103 131 12 -153 27 -47 -234 59 47 95 31 15 299 267
7227B67m54L19j57j45N2J6J89l68L85j62RK70k52o0K75R8j00J22Jl30K07L8r3
$$ 267 -187 132 -25 -170 -118 -102 87 -281 104 -58 -49 221 -31 -91 184 282 182 304 305 -25 182 220 127
7250A27L3l79K4K14j23J50j19K03J5J36k62K03l62R1m6j6L76m57O2K37k07J71
$$ 127 160 -219 -195 19 -104 46 -73 130 145 281 19 222 -140 -49 -95 -111 265 -192 -130 107 -100 71
7272G1J50o2j65K1J80j04k43Q9L14m17m4K56k16P9P4J38j55k0K8j90K17r9lr0
$$ 71 221 159 -6 15 195 91 -152 -63 251 -166 -210 46 -170 -91 -17 121 -34 -54 -26 -216 1 -98 -101 -191
7296a91L91J3k34J55k2k04J13J46l54q5J57O6J76k14k3J24r7j3K88j97N8j1j82
$$ -191 200 213 -21 134 112 -92 21 167 -187 -272 -115 -49 127 -87 -110 14 -83 -96 192 -5 53 42 -140
7319a40N73m54J27l21P8J28k8J57j65J04J5Kk5n3k%j7P1j40j14M64k92j33M85
$$ -140 433 -21 106 -215 -137 -9 -37 120 -45 59 74 76 51 -2 -4 -4 -21 50 -90 -204 260 -32 -165 320
7343C20m05O7J61j60q2J97j87L40m08J96l9Q9N9k11j9K42r9j32J86k86K46r1l6
$$ 320 -85 -18 143 -17 -99 98 -89 251 -157 39 0 89 148 -63 -82 160 61 -71 115 -171 75 -16 -52
7366e2K82J74m44j37N7j4J40K15q4k56J24n2o1j14L78o9j02N0K4k1j44j87Q6M3
$$ -52 230 404 -40 -177 -120 -134 6 221 137 -119 5 -47 -108 -222 156 87 -15 35 59 38 -106 -293 -207 -164
7390a64L32k71r6J4K08J68l02K76m5j06k19J63l2J16o8j6O0Q9n2J18l70K90L7
$$ -164 168 -103 -199 -185 23 191 -111 165 120 14 -205 -42 -74 42 -26 -42 18 107 55 173 -197 93 130
7413A30l0n7J40J68l80j19K11mj26p6L3J93m5K98n09j3K44J01j37j6L35n0l88
$$ 130 100 43 183 351 -29 -148 63 59 -67 -143 -110 83 38 336 -173 -186 58 159 22 6 341 291 -97
7436i7Q7J65J4k82k7O2O0L31k49K6k39J82J32k51K69j24k2J6J6J03j08K22l84
$$ -97 -10 155 169 -113 -140 -78 -18 313 64 90 -149 33 165 -86 183 59 37 53 69 172 64 286 -98
7459i8L1m5J65j80J78r0l4K5Q6J13k85J79J4m4J15m4l8j64j22OJ02K57k44J06
$$ -98 -67 -112 53 -127 51 -39 -73 -48 38 151 -134 45 59 15 130 86 48 -116 -238 -232 -130 127 -117 -11
7483a1j16K13J4l51R8J99l63L92j57k0p9J99O1o8k07J43Q8M13l63j94M9J3L19
$$ -11 -127 86 100 -251 -153 46 -317 75 -82 -102 -181 18 79 11 -196 -53 35 448 85 -109 -60 -47 272
7506B72l71K70O6l95K52r5k1p7L19k03q0K83q6j36n1j63J35Q4L3k98L73j38l1
$$ 272 -99 171 237 -158 94 -1 -22 -99 220 17 -63 220 134 -2 -53 -216 -81 3 36 -262 111 -27 -58
7529e8%j12K67M9l48J87n3j03K47k0jR1K2lo6l1J76j53k71j28K77O1q3J17j46
$$ -58 -58 -170 97 146 -202 -15 -68 -171 76 56 55 146 168 165 99 68 244 91 -180 -308 -31 30 -53 64 -82
7554h2O3Q2p7K07j51kj30L85j69j82L12l46J05j80J5J06o8L2J00q1K8%J87l80
$$ -82 -19 63 -14 193 42 40 -90 295 126 -56 256 -90 15 -165 -150 -44 -112 -80 20 -61 -33 -33 154 -226
7578b26K13L2Q7j32Q0J51l58R8J10J47k29J54Q5k08K96l21l1J59k3k06Q4m9L17
$$ -226 -13 19 106 -26 54 205 -153 -55 55 202 -27 127 212 4 300 -21 -52 107 84 -122 -38 -87 230
7601B30Om24K75j02k5p1m9J34L81l97n1n3M3J4K4J12j89N8L10j13k59K38p5J60
$$ 230 236 -188 87 -15 -40 -111 -160 -26 355 -42 -93 -146 -103 -89 -65 47 -142 -84 226 113 -146 92 17 177
7625A77j6k05NJ09j04M2j95K29K45j43%k25LO2r4O2J4K81j75l02Q4p3M20l84P4
$$ 177 161 -44 -39 70 -34 8 -187 42 287 144 144 -81 -78 -16 -110 -48 -34 247 72 -230 -146 -219 201 -183 -109
7650a09K55k05K66j73J00j24j66J45q3KO4K4J3r2J47K1J29j42QK8J1j80n9J76
$$ -109 146 -59 207 34 134 10 -156 -11 -94 -92 -28 -4 9 -83 64 85 214 72 80 108 119 -61 -120 56
7674E6k06K96j3k8m2k35J61K6N9k15J23Q8j1j5j06j25L90l13M5J65k50j37L09
$$ 56 -150 146 133 105 63 -172 -11 15 74 -141 -18 70 59 44 -62 -187 203 -110 -65 100 -150 -287 22
7697B2o0K08l87M39J14k47K95l01J22l07L0K59j09r8jp9P2J83j07J32P4l77J78
$$ 22 -38 170 -217 222 336 89 384 83 205 -102 -72 187 78 -20 -21 -100 -28 155 48 180 254 -123 55
7720E5J97l13m6R9J96j99J14R0J6j75q3L9r8K20m2j9J8P1j42O1J0q8Mj02M01j71
$$ 55 252 -61 -107 -8 188 -11 103 193 209 34 -49 -10 -108 112 70 51 69 140 -2 59 69 -19 -15 -117 284 113
7746A13j72J41k83L34k10p5L70j47r6K61r3j41n5Q0j78K0L71n85K90K7j78J81
$$ 113 -59 82 -201 133 -77 -152 218 71 -25 236 143 2 -53 27 -151 -131 240 -345 -55 -28 -206 -25
7768b5K10k78J73k38J0J10k6K49m01K10J24O9k31kJ77l21K95l95M73k10o7P7m1
$$ -25 185 -93 80 -158 -148 -38 -64 185 -216 -6 118 187 -44 -46 131 -190 105 -290 183 -27 -94 -17 -58
7791e8K02k34R7jQ7m4k2P1j34J83k30m5M7K11k53J89M4j66r9K97mj45P4n3M4k25
$$ -58 144 -90 7 6 93 49 27 98 -36 147 -83 -128 -81 130 -123 66 110 -56 -155 142 138 -7 67 14 58 -167
7817a67Q8R0r9p8J40j7M5J35j72P9j62mP6K11k80O7O5J29j95j07J18J07j96K85
$$ -167 -79 11 -88 -166 -26 -43 2 137 -35 44 -118 -122 -46 165 -115 -48 17 146 -49 -156 -38 69 -127 158
7841A58k7L0m5k03K95k82R0j39L11l44J12J06k73M3J80J12k86L35m9O0k42J07
$$ 158 131 161 116 -87 208 -74 16 -123 188 -156 -44 62 -211 -168 12 124 -162 173 124 184 -58 49
7863D9j27k8M6J37k08K27M0j96J26k31Q3L1J8J92r4M0P9j57j09J19p0J8R9K6j15
$$ 49 -78 -106 -60 77 -131 96 136 -60 66 -165 -82 -51 -33 159 65 105 184 27 -82 37 -33 -15 84 110 -5
7888em22M08J26j57p8P3J2j29K53j18Q5k3J05l53K76j17km9K31R9k66J75k41K25
$$ -5 -427 -19 107 -50 -128 -55 -43 -172 81 -37 48 25 130 -223 53 -64 -66 -115 116 215 -51 124 -117 108
7912A08j58K12n5k09J73k2j72k18N42o3J25n26M12J5p3k55K03k88K86j58KK53
$$ 108 -50 162 107 -102 71 49 -123 -341 201 138 263 -263 149 164 91 -164 39 -249 37 -121 -119 134
7934A34l46K58o1r4R0O5j59K42mj17j3j08J73mk68K38J39l49J07J5N0K26q1J16
$$ 134 -212 46 -15 -109 -19 46 -113 129 125 8 -5 -113 60 56 -212 26 165 -184 -77 -62 -12 214 133 249
7958B49j37k7l50P1K27lj00%K21j74n1k1J17K90n18Q0J23J8K86l57J87j38j26
$$ 249 112 85 -265 -194 33 30 -70 -70 151 -23 -74 -95 22 312 -206 -126 -3 15 301 -56 131 -7 -133
7981a33N8m1J07j9j11j21K08L48k86J23k47k90M26K83k17n3J7k89K77j01m9O5
$$ -133 -75 -116 -9 -28 -139 -260 -52 296 10 133 -114 -404 22 305 88 35 52 -237 40 -61 -110 -45
8003d5K13k90K27o8J10l48K82j05j07J60k5j6J45r2j40L03k05K88r8l76L58j18
$$ -45 168 -122 105 37 147 -201 81 -24 -131 29 4 -12 133 41 -99 204 -1 287 189 -187 171 53
8025E3k28K70j98j0O5l84M11j57K93Q6J90m38K50l60K93k33J09J02n5NJ09j65
$$ 53 -175 95 -103 -113 -48 -432 -21 -178 115 201 391 -47 203 -157 136 -97 12 114 59 64 173 8
8047HO9j51L6K47k94J77k67J76j36M25m14K06j24J55j47J90j88L87l63K29j72
$$ 8 77 -74 -38 209 -85 92 -175 1 -135 290 -124 82 -42 113 -34 156 -32 355 -8 221 49
8068D9J56k50nK3J80k15r2Q8kN4m0J78j40R8j46K3M2L6j15k2o5K79j18K17k75
$$ 49 205 -45 -50 -27 153 -62 -154 -66 -68 -14 -54 124 -16 82 -64 -41 1 37 -78 -100 -165 114 -4 213 -62
8093f2J02K02m3k57J54j30K6P4l8m3m7j31N8K93m52J27M55k25Q2m36M45r8J5M2
$$ -62 40 242 199 -58 96 -34 -8 66 28 -15 -62 -193 -135 158 -294 -167 288 63 145 -291 154 56 71 113
8117A13j98J3L46k59j71P7Q5j41K71j06N6L0j00Q4k87K20j0K5q4J21p6j65nk8
$$ 113 -85 -72 274 15 -156 -79 6 -135 136 30 86 116 16 100 -187 33 23 48 -36 85 9 -156 -161 -189
8141a89J0J22r1L90k72O9q6m8J54o2p0J32K74k03q4n0J05k7j18P4Q0j83L18l17
$$ -189 -179 -57 -148 242 -30 39 -47 -95 59 -3 -73 59 333 130 46 -4 101 74 -44 30 110 -73 245 -72
8165g2lRk6o7N5K53l89K79M8n5k29M39l45J8J15o6k4J16k05Q5N1p4L25j34j44
$$ -72 -75 -66 -92 -159 -104 149 -240 39 87 32 -197 242 -103 -85 30 -36 -60 56 -149 -64 -13 -87 238 104 -40
8190d0k02
$$ -40 -242
8191b42
$$ Imaginary data points
##PAGE= N=2
##DATA TABLE= (X++(I..I)), XYDATA
0@%%%%%%%%%%%%kJ0j6J6j6K4l2L2m0M8n6O8p6Q8j04J22j45J67j91K17k44K76l13
$$ 0 0 0 0 0 0 0 0 0 0 0 0 0 -2 8 -8 8 -8 16 -16 16 -24 24 -32 36 -40 48 -56 66 -79 88 -103 114 -130 146 -167
35a67L53l96M45n00N61o25O93p67Q50r41J041j150J267j397J540j696J867k058
$$ -167 186 -210 235 -265 296 -329 364 -403 447 -494 547 -603 664 -733 807 -889 978 -1080
53a080K272k508K775l078L424l824M294m855N536o387P483q957J1056j4303K0053
$$ -1080 1192 -1316 1459 -1619 1805 -2019 2275 -2580 2956 -3431 4052 -4905 6151 -8152 11901
68A1901l3257J22027L0116j78463K3764k4768k6099L7618O5964O637r016p252
$$ 11901 -21356 100671 130787 -47676 -23912 -48680 -74779 -37161 28803 35440 26424 19172
80A9172j1214p1187j9840K3866L65M2544O3722l374K4436J322p6232m6242N513
$$ 19172 7958 -63229 -83069 -59203 -58838 -16294 47428 44054 68490 69812 -6420 -52662 -47149
93d7149K1057M5850K8508K8434j390o8197l1980J885m3664r332M0411L6325K7238
$$ -47149 -26092 19758 48266 76700 75310 7113 -24867 -22982 -66646 -75978 -35567 758 27996
106B7996L322L119j2895o9689k4103K6513M137M3228N8436P35q873k7617m8832
$$ 27996 31318 34437 21542 -48147 -72250 -45737 -41600 1628 60064 60799 51926 24309 -24523
119b4523p782M003Q33K0496K6806K9546o014l2372l068l3426n2273K6888M5375
$$ -24523 -32305 -28302 -27469 -6973 19833 49379 43365 10993 7925 -25501 -77774 -50886 -5511
132e511J6389K4889P357j3533l0954m1721J691J2887j958L8588L6117n774n225
$$ -5511 10878 35767 43124 29591 -1363 -43084 -41393 -28506 -30464 8124 44241 38467 33242
145C3242j3004k1832k2535k5243J5028M1029K5146J8356j2190k8509p908l0802
$$ 33242 20238 -1594 -24129 -49372 -34344 6685 31831 50187 37997 9488 1580 -29222
157b9222k3177K9836J6479L338K7959J1474j9383k6615q946l07k3452R057N6834
$$ -29222 -52399 -22563 -6084 -2746 25213 36687 17304 -9311 -18257 -18564 -42016 -32959 23875
170B3875J8526q003K115k5394k6605p356o243J5989K0602Q710J1572j888j0486
$$ 23875 42401 34398 36513 11119 -15486 -22842 -29085 -13096 7506 16216 27788 25900 15414
183A5414j7612l2151k070J2847l486K9512L7354q568k0334j4608j2134p779n283
$$ 15414 -2198 -34349 -36419 -23572 -27058 2454 39808 31240 10906 -3702 -15836 -23615 -28898
196b8898K4182K6557q904O110J2994k1373j9102j0921p852J0224Q972J6327K4850
$$ -28898 -4716 21841 12937 19047 32041 10668 -8434 -19355 -27207 -16983 -8011 8316 33166
209C3166n584k1283k1309j8338J0275Q392K466K6660Q344j2948M752m910j9260
$$ 33166 27582 6299 -15010 -33348 -23073 -14681 -12215 14445 22789 9841 14593 9683 -9577
222i577j2699l348J7258J0315K616K7946M435l4000j8486p489J555J5276P616
$$ -9577 -22276 -25624 -8366 1949 4565 32511 36946 2946 -15540 -23029 -21474 -6198 1418
235A418J2091O703j3086K74m911j9335o83n76L599K1823N191N331J1393k1978
$$ 1418 13509 20212 7126 7400 2489 -16846 -17529 -18105 -14506 7317 12508 17839 29232 7254
249G254k8303o078R988J9352M795N881J7275j6700j8935R275q855j4227N856P625
$$ 7254 -21049 -27127 -17139 2213 7008 12889 30164 13464 -5471 3804 -5051 -19278 -13422 -5797
263e797J0793Q267K214N296j9910k5668K012L052J4978K0912j566K032K5k1594
$$ -5797 4996 13263 15477 20773 863 -24805 -22793 -19741 -4763 16149 14583 16615 16640 -4954
277d954m656N203n297r7N356J6098R838j2981K013q12l2817q897J9651J1571J1897
$$ -4954 -9610 -4407 -9704 -9801 -4445 11653 21491 8510 10523 9711 -23106 -32003 -12352 -781 11116
292A1116M664k791n124j7984m267P650p704O479J3939L693R631m857j3926J486
$$ 11116 15780 12989 7865 -10119 -14386 -6736 -14440 -7961 5978 9671 19302 14445 519 2005
306B005j3852j6994J2480J9739J5706j668j3699J645r970j8176J2219P036o009
$$ 2005 -11847 -28841 -16361 3378 19084 17416 3717 5362 -4608 -22784 -10565 -3529 -9538
319i538J3272J1217Q91p043j3818J522o286j5598J6094K0524M736M632j2416j2539
$$ -9538 3734 14951 15842 8799 -5019 -3497 -9783 -25381 -9287 11237 15973 20605 8189 -4350
333d350j78j1524P32J3621J559O595O357j72r72j9043r001J1839q104M30K6457
$$ -4350 -4528 -16052 -15320 -1699 -140 6455 12812 12640 11668 -7375 -16376 -4537 -12641 -12211 14246
348A4246P751p739j0607j0811R2p244k06K0326P25l568J3088l223q554p788j3968
$$ 14246 21997 14258 3651 -7160 -7068 -14312 -14518 5808 6533 2965 16053 12830 4276 -3512 -17480
363a7480N869Q403n08J5808P403p604q068j7124n59R222o347J1325J4187j1255
$$ -17480 -11611 -3208 -3716 12092 19495 11891 3823 -13301 -13860 -4638 -10985 340 14527 3272
377C272M40O776q672r784j0086O703J5100l910J0229J4947j6593j4059n186n339
$$ 3272 3712 10488 1816 -7968 -18054 -11351 3749 -161 10068 25015 8422 -5637 -10823 -16162
391a6162J0052N130J023J1421m958n656M190q552m540k937n117J7270P994n893
$$ -16162 -6110 -980 43 11464 6506 850 5040 -3512 -8052 -10989 -16106 1164 9158 3265
405C265J2183k379k2105p907L110J3203P926n758Q456L16j6736N444K607j2632
$$ 3265 15448 13069 -9036 -16943 -13833 -630 7296 1538 9994 10310 -6426 -982 1625 -11007
419a1007J746L077O208J0325l570K512Q68j8622p477K239P643J8697k939q377
$$ -11007 -9261 -6184 24 10349 6779 9291 10159 -8463 -15940 -13701 -6058 12639 9700 1323
433A323Q109r831r086J0644j655o260Q42N621J3354m803q667Q956j0473j5108
$$ 1323 9432 -399 -9485 1159 -496 -6756 -5914 -293 13061 8258 -409 8547 -1926 -17034
447a7034R568P629Q506O171r847l084m030q777P870L231m916K931o4P711P833
$$ -17034 -7466 163 8669 14840 4993 1909 -2121 -10898 -3028 203 -4713 -1782 -1846 5865 13698
462A3698j3537k608M905j2697r12J2337R077L814r391n197L304j1148O82J2771
$$ 13698 161 -2447 2458 -10239 -11151 1186 10263 14077 4686 -511 2793 -8355 -7673 5098
476E098n837l469M924J181M023n844o420M891o344m195J2251P033M181m392j2576
$$ 5098 -739 -4208 716 1897 5920 76 -6344 -1453 -7797 -11992 259 7292 11473 7081 -5495
491e495M476Q43p307P965M017m451J911J37L112k042j2707M927L947j0759O177
$$ -5495 -1019 -176 -7483 482 4499 48 1959 2096 5208 3166 -9541 -4614 -667 -11426 -5249
506e249J3576P10m895q806k80M163n869N486O217p290L036N078k987J050p168
$$ -5249 8327 9037 4142 -4664 -4944 -781 -6650 -1164 5053 -2237 799 5877 2890 3940 -3228
521c228m975Q635j270l060Q041N316k719j1202m585R838k601m568J2924r25q465
$$ -3228 -8203 432 -838 -3898 4143 9459 6740 -4462 -9047 791 -1810 -6378 6546 5621 -2844
536b844O381L148m027p940n429P732L289k941P912K124l589l679p754M548P771
$$ -2844 3537 6685 2658 -5282 -10711 -2979 310 -2631 5281 7405 3816 137 -7617 -3069 4702
551D702n924K296O120m849k29L194r99n699j0257O273J1948o098L10Q075o752
$$ 4702 -1222 1074 7194 2345 2116 5310 4311 -1388 -11645 -5372 6576 478 788 8863 2111
566B111r050l308L844Q204k849l9P302m490r17M846k545l596o074q12J3955K999
$$ 2111 -6939 -10247 -6403 1801 -1048 -1087 6215 1725 808 5654 3109 -487 -6561 -7373 6582 9581
582I581o862K416j977q255m553R57R951R85o758O039O79o898K699K236k548l273
$$ 9581 2719 5135 3158 -5097 -9650 -8693 1258 2243 -4515 1524 2203 -4695 -1996 240 -2308 -5581
598e581l068J1783Q795p140k02M42j0325k516M066O967M888o919j394K772o137
$$ -5581 -8649 3134 11929 4789 4587 5029 -5296 -7812 -3746 3221 8109 1190 -204 2568 -3569
613c569l78J682k888J080k193L505J2528m592p489M840m836p167M086J0302Q538
$$ -3569 -3947 -2265 -5153 -4073 -6266 -2761 9767 5175 -2314 2526 -2310 -9477 -5391 4911 13449
628A3449o740p588M595m181l729P385k833m361J629J718O576n69j0052R70L98
$$ 13449 6709 -879 3716 -465 -4194 3191 358 -4003 -2374 -656 5920 5351 -4701 -3731 -3333
643c333m718K901M375R259K541j2593j798M328n145M982O065m491k179O58O091
$$ -3333 -8051 -5150 -775 8484 11025 -1568 -3366 962 -4183 799 6864 2373 194 852 6943
658F943K285j2342k640N254n661J462P001N82K642o035p143N085j533q9Q489j643
$$ 6943 9228 -3114 -5754 -500 -6161 -4699 2302 2884 5526 -509 -7652 -2567 -4100 -4189 4300 2657
674B657k205j20M85O353n013r343P167J735l580O236R63q82l590r400L866L988
$$ 2657 452 332 817 7170 2157 -7186 -19 1716 -1864 4372 5335 4453 863 -8537 -4671 -683
690f83n415O070K732n118J441N0J259Q08q480M450P062n778L639L810m238L04
$$ -683 -6098 -28 2704 -2414 -973 -923 336 1144 -7336 -2886 4176 -1602 2037 5847 1609 1913
706A913n232k079Q808j846k104M838m260j439R75j377L555o853l863J2854j006
$$ 1913 -3319 -5398 3410 1564 -540 4298 38 -1401 -426 -1803 1752 -5101 -8964 3890 2884
721B884n936O160j589l202r7k091N843K631m657L863k161m158N782j242j408J115
$$ 2884 -3052 3108 1519 -1683 -1780 -3871 1972 4603 -54 3809 1648 -2510 3272 2030 622 1737
737A737p285M626Q200o744j181J086l025J120l097L478P201q052n51O424o751
$$ 1737 -5548 -922 7278 534 -647 439 -2586 -1466 -4563 -1085 6116 -1936 -2487 3937 -2814
752b814J551O574m223p40k847Q7Q658k276m040K510m906M91J845k230O696j044
$$ -2814 -1263 5311 1088 348 -2499 -2412 6246 3970 -70 2440 -2466 -1975 -130 -2360 4336 3292
768C292r406M787J817l538M646m94l077j011k870Q530L991q224K032J221m824
$$ 3292 -6114 -1327 490 -3048 1598 1104 -1973 -2984 -5854 2676 6667 -1557 475 1696 -3128
783c128L256M34J708L590q467r63N151l272K439K137o170r72q02K991Q696n957
$$ -3128 128 562 2270 5860 -2607 -3570 1581 -1691 748 2885 -3285 -4257 -5059 -2068 6628 671
799F71m514L988k814N40K704n90N288l487o414O355Q19l386M391k006m368r83
$$ 671 -3843 145 -2669 -2129 575 -15 5273 1786 -4628 1727 2546 -840 3551 1545 -2823 -3806
815c806J172Q747q79r930K317O49k970N045L68N36J571n920J735M060k998J959
$$ -3806 -2634 6113 5234 -4696 -2379 -1730 -4700 345 713 1249 2820 -3100 -1365 2695 -303 1656
831A656O72l598P64q31M568O006r547m562N295k843N62M264K81k47n035j226O212
$$ 1656 2328 -1270 -506 -1337 3231 9237 -310 -4872 423 -2420 -1858 2406 2687 2440 -2595 -3821 2391
848B391k431k391M387l092l03K599k67L766k889o686L884J607j946L381P28J206
$$ 2391 -40 -2431 1956 -1136 -1439 1160 893 4659 1770 -4916 -1032 575 -1371 2010 2738 3944
864C944l008o684N227L260n193K574R06l192K019J377J111j323o932K910N332
$$ 3944 936 -5748 -521 2739 -2454 120 1026 -2166 -147 1230 2341 1018 -5914 -3004 2328
879B328l045P43J779q68Jm453j78N938k228m96L335l146JJ649o34P96n841j837
$$ 2328 -717 26 1805 937 938 -3515 -3693 2245 17 -479 2856 -290 -289 1360 726 1522 -4319 -6156
897f156Q803L57l595J294j105p6j519k134N316k63l664M576l70k872J846Q2L69
$$ -6156 2647 3004 -591 703 -402 -478 -1997 -4131 1185 922 -2742 1834 1464 -1408 438 520 889
914H89j320l943O273M009m362q98j798p20J946k620K233L650m785L41L188k638
$$ 889 -431 -4374 1899 5908 1546 648 -1150 -1870 76 -2544 -311 3339 -1446 -1105 2083 -555
930e55J16M60k3P38m107K724P408m183l679R35j748J584J248j15L143l586l170
$$ -555 -439 21 -2 736 -3371 -647 6761 2578 -1101 -166 -1914 -330 918 803 3946 360 -2810
947b810L680j052o49J607k415J214m51k006P237N17o728n41O26J492K119j515
$$ -2810 870 -182 -831 776 -1639 -425 -876 -2882 4355 4872 -1856 -2397 -1771 -279 1840 325
963C25K814p81o777K919L075k854K264o19k020J106j455L130L751o412j937J889
$$ 325 3139 2358 -4419 -1500 1575 -1279 985 366 -1654 -548 -2003 1127 4878 -1534 -3471 -1582
979a582J7L813p02j584L090m704k713N447j05m13Q59k754M15j526R0P049l539
$$ -1582 -1565 2248 1546 -38 3052 -1652 -4365 1082 977 564 1423 -1331 -916 -2442 -2352 4697 1158
996A158o362L196J597J256J886l007J495p21m840M508K331j784J667k863j380
$$ 1158 -5204 -2008 -411 845 2731 -276 1219 498 -4342 166 2497 713 2380 -483 -1863
1011a863J737k014M141L057p663j165L846L60J519j929p81J952m413J285O031
$$ -1863 -126 -2140 2001 5058 -2605 -3770 76 436 1955 26 -755 1197 -3216 -1931 4100
1026D100l091p35J228k947J284j14M40M949m515m799M716N0N47O35l273K227l81
$$ 4100 1009 274 1502 -1445 -161 -275 165 5114 599 -4200 516 566 1113 1748 -1525 702 321
1043C21l741N727N91m380J442j426N01J959k012L606J93p294K735L961k028P51
$$ 321 -3420 2307 2898 -1482 -40 -1466 -965 994 -1018 2588 2781 -4513 -1778 2183 155 906
1059I06j341J39K340m254J716M298n500M54K018k592K767Q2j462K607m846j405
$$ 906 -435 -296 2044 -2210 -494 3804 -1696 -1242 776 -1816 951 1033 -429 2178 -2668 -4073
1075d073N839j141r92l4j522L528j494l328N207r37l853L709l2p59Q25j530J970
$$ -4073 1766 625 -367 -401 -1923 1605 111 -3217 1990 1053 -2800 909 877 118 943 -587 1383
1092A383k016m466O215K438m428J217j463J13K693l321N17K661l612J303K512
$$ 1383 -633 -5099 1116 3554 -874 343 -1120 -1007 1686 -1635 -1118 1543 -2069 -766 1746
1107A746j304R18k198J71K342m856J757O723l934k964J476j125J908l19j189K800
$$ 1746 442 1360 -838 -667 1675 -3181 -1424 5299 1365 -1599 -123 -1248 660 341 -848 1952
1123A952k582j321M148j196j216N02k802K075k30j505O360k95n939L64J291J367
$$ 1952 -630 -1951 2197 1001 -215 287 -2515 -440 -670 -2175 4185 3890 -2049 -1685 -394 973
1139I73Q01k733K278L20m393L414J687k887P05j238l28K101j916K834K877o612
$$ 973 1774 -959 1319 1639 -2754 660 2347 -540 165 -1073 -1401 700 -1216 1618 4495 -2117
1155b117k153K455J125K524j391q02J812k871L26M564k946j414R58j243J733l14
$$ -2117 -4270 -1815 -690 1834 443 -359 1453 -1418 -1092 3472 526 -888 70 -1173 560 246
1171B46m19L542k995n168K417J901J940L46l125J114o49l117M967Q94l902J581
$$ 246 -173 3369 374 -4794 -2377 -476 1464 1810 -1315 -201 -850 -3967 1000 1894 -2008 -427
1187d27N00l9R90r36K212l14n322J517K741O5J571k582j770J853k434O95L878
$$ -427 73 34 1024 88 2300 1986 -3336 -1819 922 987 2558 -24 -1794 59 -2375 -1680 2198
1204B198k110j556J387j67N05r39J206K055m699j019N182q7m68J92k939R49J72
$$ 2198 88 -1468 -81 -248 257 -682 524 2579 -2120 -3139 2043 1956 1488 1680 -1259 -310 -138
1221a38n63K523k17k125N31q25N54J46o82J950l65m212K971K479j467q0j652K67
$$ -138 -701 1822 1605 -520 11 -814 -260 -114 -796 1154 789 -3423 -452 2027 560 480 -1172 -905
1239i05R73p77K053Q08l121R31J81o05Q93o99N50J561l313k29L758j166j568o50
$$ -905 68 -709 1344 2152 -969 -38 143 -462 431 -268 282 1843 -1470 -1699 2059 893 -675 -1325
1257a325QK062o35k43J932k604j221K669p62P7K47r27K530j422k518L061P33k306
$$ -1325 -1317 745 110 -133 1799 -805 -2026 643 -119 -42 205 -722 1808 386 -2132 929 1662 -644
1275f44m01j74K297J01j893J442q71k493K226J284r69M78j150N28O46j928J428
$$ -644 -1045 -1219 1078 1179 -714 728 -143 -2636 -410 874 -95 383 -767 -239 407 -1521 -93
1292i3J627j921p9n54J425K437k744j234J654k361N42K907m82p33j283j91J362
$$ -93 1534 -387 -466 -1020 405 2842 98 -1136 518 -1843 -1301 1606 1124 391 -892 -1083 279
1309B79j535K38L168k027j101N56K7K419q4l341J012J20o94K551K28q86j101j872
$$ 279 -1256 -1018 2150 123 -978 -422 -395 2024 1940 -1401 -389 -269 -963 1588 1816 930 -171 -2043
1327b043K054L34j690K889P82l730K01Q87P40J301k385k80J184r71J885J388k364
$$ -2043 11 345 -1345 1544 2326 -1404 -1203 -316 424 1725 -660 -940 244 -727 1158 2546 182
1344A82l99j415J41K519j126L51K508l048j933J537P83J458j431j951K436j097
$$ 182 -217 -1632 -1491 1028 -98 253 2761 -287 -2220 -683 100 1558 127 -1824 612 -485
1360d85M4K670j735j912L23n48K092R13j761K605j359l544J011J499J495qk842
$$ -485 -441 2229 494 -1418 -1095 -1643 449 1362 -399 2206 847 -2697 -1686 -187 1308 1300 -1542
1377a542Q75J121j468K083J51k743M24O31L21K058j923j38J724l491m77K207J199
$$ -1542 -667 454 -1014 1069 1220 -1523 -1099 -468 -147 1911 -12 -150 1574 -1917 -2394 -187 1012
1394A012J001k092j135K044j339l27K971k653j288J767K75J475p70j891J773j107
$$ 1012 2013 -79 -1214 830 -509 -836 2135 -518 -1806 -39 236 1711 941 -950 823 -284
1410b84j855K403O17L87k24k653J404R10k343K072J018k639R67R71J01L19k002
$$ -284 -2139 264 881 1268 1044 -1609 -205 705 -1638 434 1452 -1187 -220 751 852 1171 -831
1427h31J015P46k543J306K513j832K36j364p80K355j423l14K065j662NJ351j047
$$ -831 184 930 -1613 -307 2206 374 610 -754 -1534 821 -602 -916 1149 -513 -508 843 -204
1444b04N77j132q78K730j064j195K915j43k057Q7j134J810M51j982J650o43j641
$$ -204 373 -759 -1637 1093 29 -1166 1749 1606 -451 -364 -1498 312 763 -1219 431 -212 -1853
1461a853K202m15o57M94j185J500J493k467J437J007k182K12k06L92K159j799
$$ -1853 349 -66 -723 -229 -1414 86 1579 -888 549 1556 -626 -414 -620 -228 1931 132
1477A32q57J262j316L04J124j441K12p31L35K511j667q01J743r85j200J288J4
$$ 132 -725 537 -779 -475 649 -792 -580 -1311 -976 1535 -132 -933 810 -175 -1375 -87 -73
1494g3J984l08k275R48m44o79K233n85r57j17q74J903M34j978L76N38j387R04
$$ -73 1911 1603 -672 276 -168 -847 1386 801 -156 -273 -1147 756 1190 -788 -412 126 -1261 -357
1512c57M17J265M57k654o6J360j001J503J066j814j81o10N39J286j197o04R36
$$ -357 60 1325 1782 -872 -938 422 -579 924 1990 176 -5 -615 -76 1210 13 -591 345
1529C45r85m84J317K99J015j433k260J861L08K87J359j338q69r6J12J595K0j700
$$ 345 -640 -1124 193 492 1507 74 -2186 -325 -17 270 1629 291 -578 -674 -562 1033 1053 -647
1547f47J344k29j427O65N07N76n55k017O52J361o0Q55l91j541m6J23Q19J153j403
$$ -647 697 468 -959 -294 213 789 234 -1783 -1131 230 170 1025 634 -907 -953 -830 -11 1142 -261
1566b61j71Q75r75o8O86K63N08j747o79K212j25m30R68j662o08O23M45J272p71
$$ -261 -432 443 -532 -600 86 349 857 -890 -1569 643 518 88 1056 -606 -1214 -591 -146 1126 355
1585C55j169J124k76j139R91N15J52j74j535J258N21p26N96m66j001M28L65J390
$$ 355 -814 310 34 -1105 -114 401 553 379 -1156 102 623 -103 493 27 -974 -546 -181 1209
1603A209K2k188R58N86j784N12J171rJ6j116O06R05q27j18O29j213M21P47q5O97
$$ 1209 1231 -957 1 587 -1197 -685 486 477 493 -623 -17 888 61 -57 572 -641 -220 527 442 1139
1623A139j730k68J599r50n19J195N5k04p30m80J642n38r56R44n92r4J035j41j19
$$ 1139 -591 -859 740 -210 -729 466 521 317 -413 -893 749 211 -745 199 -393 -487 548 407 288
1642B88l45j501K098M68j287N57J72r93M19q83J086N08j448M09Q20q63M31N89
$$ 288 -57 -1558 540 1008 -279 278 450 -543 -124 -1007 79 587 -861 -452 368 -495 -64 525
1660E25p24K6j238R27J798j380j97O12p73J36K7J40J311j385o57J679p70l02R36
$$ 525 -199 -173 -1411 -484 1314 -66 -263 349 -424 -288 -261 -121 1190 -195 -852 827 57 -245 691
1679F91q83l98k13R3J833K0j612O25m21j00L64m91J306K17k077Q07O78q14R94
$$ 691 -192 -590 -803 -710 1123 1143 -469 156 -265 -365 -1 -492 814 1031 -1046 -239 439 -375 619
1698F19K42j240j88O6J233J116k255k12R17j000L92P30q3Q86j588o78J281j80
$$ 619 861 -379 -567 -501 732 1848 -407 -619 298 -702 -310 420 337 1223 -365 -1043 238 58
1716E8k80J019j141o20N09N21J501j142j518J482n45k87J028k26K00k50j542Q21
$$ 58 -222 797 -344 -964 -455 66 1567 425 -1093 389 -156 -443 585 359 559 309 -1233 -412
1734d12J064j140J210n37j187N49n4J258K37k235M97J220j102J224M4j96j72j087
$$ -412 652 -488 722 185 -1002 -453 -507 751 988 -1247 -750 470 -632 592 636 440 268 -819
1752h19J74J327o17o1P23j605J21L73L07J236j539p82J600n75k75J205o22l22
$$ -819 -645 682 65 4 727 -878 -757 -384 -77 1159 -380 -1162 438 -137 -412 793 171 -151
1770a51k31q72J821k15m21J140j230q81J019r3N09p4j468P94Q29j044N58K30k64
$$ -151 -382 -1254 567 352 -69 1071 -159 -1040 -21 -114 395 321 -1147 -353 476 -568 -10 220 -44
1789d4Q7p89M98J306j154K45K86r45K52Q97l80L53o62n31J096o16l0M51m83M10
$$ -44 43 -746 -248 1058 -96 149 435 -510 -258 639 259 612 -50 -581 515 -101 -131 320 -163 247
1809B47j81p86J548m59j126R00m26n6R53m33M93r24m03O91M71j023L49O1m37Q74
$$ 247 66 -720 828 369 -757 143 -283 -339 614 181 674 -250 -653 38 509 -514 -165 -104 -541 333
1829C33p51M89P92j439L6Q51p49M42M03m13r5p21N29R41q38l36N21k35M27O2o46
$$ 333 -418 71 863 -576 -540 311 -438 4 407 -6 -101 -822 -293 648 -190 -526 -5 -240 187 249 -397
1850c97N40l50n81Q99j51p9P61p78o1Kl77J328j88j075M48k45l13Q84m70L7K06
$$ -397 143 -207 -788 111 -40 -119 642 -136 -197 -195 -572 756 568 -507 -59 -304 -617 267 -203 -166 40
1871D0r84J081J54M1M93n03o76J18m11J117O67j483k05O31j36J98j10l3L04q46
$$ 40 -944 137 291 332 825 322 -354 -236 -647 470 1137 -346 -551 80 -56 142 32 -1 303 -543
1891e43N6J029l25K05j00q43J13K54m5J081k42j403M75L91M6l8j76L16k57j037
$$ -543 -487 542 217 422 322 -521 -408 -154 -199 882 640 -763 -288 103 149 111 -65 251 -6 -1043
1911a043J321L26q19L20j70l75M65J0P57J78j514l53J003RJ35r9j82L7n00l6J032
$$ -1043 278 604 -215 105 -65 -440 25 35 792 970 -544 -897 106 115 250 151 -31 6 -494 -530 502
1932E02n32K24j95j69K81j23M00N0q56l75R38q5N8J08k61J05k89n18J100l57m1
$$ 502 -30 194 -1 -170 111 -12 388 438 -418 -793 145 60 118 226 -35 70 -219 -737 363 6 -35
1953c5Nl26n7O24j03O42n91q10N13L20k2K36l52j16R3q34P00O16n63J09o0l93
$$ -35 -30 -356 -413 211 108 750 159 -651 -138 182 160 396 44 -72 21 -813 -113 503 -60 49 -11 -404
1975d04K65R2L17M12j261L11J015m53k98J50l32K91J06o64R23p34j1K56j17n8
$$ -404 -139 -47 270 682 -579 -268 747 294 -4 146 -186 105 211 -453 470 -264 -275 -19 -136 -194
1995a94J83m46Q68n16n97R61J15n77N6M0k6N70p84O02M24r43L01K09l47L88k50
$$ -194 -11 -457 411 -105 -702 259 374 -203 -147 -107 -133 437 -347 255 679 -264 37 246 -101 287 37
2016C7j90M10n66N13K69m86k72J29j09Q52n67n0M19o70j36N77l09K78j05j18J31
$$ 37 -153 257 -309 204 473 -13 -285 -156 -265 587 20 -30 389 -281 -417 160 -149 129 24 -94 37
2037C7j25J9O38n31q53N80K71K01ko37M97p0n87N42J17o8O9k17n8N01p47P10j71
$$ 37 -88 -69 569 38 -815 -235 36 237 235 -402 95 25 -562 -20 97 29 98 -119 -177 324 -423 287 116
2060A16l59P6J39K32N51p47l75M99o06J77J093p17J16l53r6o1J23K25N22p26l38
$$ 116 -243 -167 -28 204 755 8 -367 132 -474 -297 796 79 195 -158 -254 -315 -192 33 555 -171 -509
2081e09L03L08J75K30p75K62k6r9N43o9n2N9o81K17L81k73L16M7p51J63L08j82
$$ -509 -206 102 277 507 -268 -6 -32 -131 412 343 291 350 -331 -114 267 -6 310 357 -394 -231 77 -105
2103a05M00l95l4L08k76J21N88o99J1j66l78O53k44M41L74o89q50Q63J67J76k68
$$ -105 295 -100 -134 174 -102 19 607 -92 -81 -247 -625 28 -216 225 599 -90 -940 -77 90 266 -2
2124bn42Q53m65j46O28k38j33q0o4l20O71j49N56o30m93N62M69l93J88p27k3P07
$$ -2 -544 309 -156 -302 326 88 -45 -125 -189 -509 162 13 569 -61 -554 8 477 84 272 -455 -478 229
2146B29n88M74L49n93N3J46j68L64j12m4O7o91K56L09J12r6qn87M49l07L43K05
$$ 229 -359 115 464 -129 -76 70 -98 266 154 110 177 -514 -258 51 163 67 59 -528 -79 -386 -43 162
2168A62n3m67K58L08l6j23k89L31j34m03N33M95o49L04k80k55N70l16N9L86m35
$$ 162 109 -358 -100 208 172 49 -240 91 -43 -446 87 582 -67 237 -43 -298 272 -44 15 401 -34
2189c4r7K40j94K29k15K26L2n12K13O30p23J49j93m8M16j12j8K11l80KM10j83
$$ -34 -131 109 -85 144 -71 155 187 -325 -112 518 -205 -56 -249 -297 119 7 -11 200 -180 -178 232 49
2211D9j49k2j4L83l76q0M10P1m61mJ41K96J20m47L0M9l13L90P3l78M22k70O1K14
$$ 49 -100 -122 -136 247 -129 -209 201 272 -189 -193 -52 244 364 -83 -53 -4 -317 73 146 -232 190 -80 -19 195
2235A95l40N50k54k66q0j20O19K84o05l26M25K3l46L06j63%J28k8J58Rk63M55
$$ 195 -145 405 151 -115 -195 -315 304 588 -17 -343 82 105 -241 65 -98 -98 30 2 160 169 -94 361
2257C61m21k50J71OK79J55m47K39N1j61J77p1j6k81R2K85k56k6L94l83l23K71
$$ 361 -60 -310 -139 -133 146 301 -146 93 144 -17 160 89 73 -208 -116 169 -87 -113 281 -102 -425 -154
2279a54M20j05j22p9j83R9R8M6J74j20k43J67j72J32p3K9J88k67J30M45q3j41
$$ -154 266 161 39 -40 -223 -124 -26 20 194 74 -169 -2 -174 -42 -115 -86 102 -165 -35 410 327 186
2301A86j99r1Q5k8J38K20l85L1K02k01J0R5k09M65p3l80K01Q2J97l64j15j16K84
$$ 186 -13 -104 -19 -47 91 311 -74 -43 159 -42 -32 63 -146 319 246 -134 67 149 346 -18 -133 -249 35
2324C5p5K16Mm02L8N0l23M01j41K36j2k30J06L0n6M02l40j86L83j43K11J69l09
$$ 35 -40 176 180 -222 -184 -134 -457 -56 -197 39 27 -203 -97 -67 -123 279 -61 -247 136 -7 204 373 64
2347F4k16J16J42Q0j31J82j85j37m7J09L91m30q6J45q7L25j59l4M9k03L10j16
$$ 64 -152 -36 106 186 55 237 52 -85 -132 -23 368 -62 -148 -3 -90 235 76 42 91 -112 198 82
2369H2j08l6n9J99o5J9l84N63r8Rk60J17L89m69k5J17j20K77k22j61J01J31p6
$$ 82 -26 -62 -121 78 13 32 -352 211 113 122 -138 -21 368 -101 -126 -9 -129 148 -74 -235 -134 -3 -79
2392g9K74k14j50N13k37j53J45j04j17L85k02J21n33K7L72n4J85k01j88R6M70
$$ -79 195 -19 -169 344 107 -46 99 -5 -122 263 61 182 -351 -324 48 -6 179 -22 -210 -114 356
2413C56o38K38L44o45L57J19j06M9l17Q4L88j50p9K81n26J57J48m02M20K7p8J35
$$ 356 -282 -44 300 -345 12 131 25 74 -243 -159 229 79 0 281 -245 -88 60 -342 78 105 27 162
2435A62j40j16L60k61J77K8m68M53j32k14L77N5l99M3p0K35j71N8k01J60Rn7J3
$$ 162 22 -94 266 5 182 210 -258 195 63 -151 226 281 -118 -75 -145 90 -81 -23 -224 -64 -55 -112 -99
2458i9J58J33k39j90R3L2kL9J76k5j9j19J11%qK19j47Pp5j52L28j98j40J58o6
$$ -99 59 192 -47 -237 -144 -112 -114 -75 101 76 57 -62 49 49 41 260 113 120 45 -107 221 23 -117 41 -25
2483b5l0J40j52J12k4P5L0k0j47K83j27m49L13K82j80j70K63l08p1N78m28R2k98
$$ -25 -55 85 -67 45 21 96 126 106 -41 242 115 -334 -21 261 81 -89 174 -134 -205 373 -55 37 -261
2506b61J68K73l94K72m6N4J98l99O8K3K33l85J96ok77L10NK3J2k33L07l6K9o7
$$ -261 -93 180 -214 58 12 66 264 -135 -67 -44 189 -196 0 -6 -283 27 32 55 67 -166 141 105 134 67
2530F7r8K91k07j80J20J23k97K42l96L43J99j24p1K20k10r0J1J71k20J09K3L38
$$ 67 -31 260 53 -127 -7 116 -181 61 -335 8 207 83 12 232 22 -68 -57 114 -106 3 26 364
2552C64l45M3J70j16J51k50J49k52J94l99M83l23J76K25j68j03k27K87K8j30n
$$ 364 19 62 232 116 267 17 166 -86 108 -291 192 -131 45 270 102 -1 -228 59 87 -43 -48
2573d8J03r1J2r2K9J30J45k29Q1j11k23J42K60j44j32L1K0L25k87m3J5Q6m1J50
$$ -48 55 -36 -24 -116 -87 43 188 -41 40 -71 -294 -152 108 -36 -168 -137 -117 208 -79 -122 -107 -21 -62 88
2597H8j51J04O2m44L72o8J48Mj55kK78l81L70r7k43L65j77j62J84k58N1L22o17
$$ 88 -63 41 103 -341 31 -37 111 115 -40 -42 236 -145 225 128 -115 250 73 -89 95 -163 -112 210 -407
2620d07K93J81j70Q0j15K77k88r1N03P8n32J16J98k74K28J49k06M1L45o08q7M08
$$ -407 -114 67 -103 -23 -138 139 -149 -240 263 341 -191 -75 123 -151 77 226 20 61 406 -202 -289 119
2642A19j4l67J57m22M55m42M61J1r1N12o57l8j30J020n05P7n67Q92l65L58l58
$$ 119 105 -262 -105 -527 -72 -514 -53 -42 -133 379 -278 -316 -446 574 69 146 -421 471 106 464 106
2663A06K19o13k30J06J251n91K62N93k387J237j49L51o43O60n9q8k12L16K32j82
$$ 106 325 -288 -518 -412 839 248 510 1103 -1284 -47 -196 155 -488 172 113 25 -187 129 361 179
2683A79J12o86k84N09L83m27q03J152Rm50L77N4q31N35lN58P41j243j09j94j10
$$ 179 291 -395 -679 -170 213 -214 -1017 135 144 -306 71 125 -706 -171 -174 384 1125 -118 -227 -421 -531
2704e31L99O40q14j44Q20m69N28J91o44K68o51K85J09n53P44m90L69N0J08L89
$$ -531 -132 508 -306 -450 370 -99 429 620 -24 244 -407 -122 -13 -566 178 -312 57 107 215 604
2724F04n06k4k49k36K27K38L74o02N45o22J58Q65j278k1N29m6N7r0l31K48m7L03
$$ 604 98 74 -175 -411 -184 54 428 -174 371 -251 -93 772 -506 -527 2 -44 13 -77 -408 -160 -207 96
2746I6K10l86r2K07j76K92J0j25j25j99L98M07m24J14j39j42J15k2j00K13j36
$$ 96 306 -80 -172 35 -141 151 161 36 -89 -288 110 517 93 207 68 -74 41 19 -81 132 -4
2767dL6K76k46m6j02LM08k72MK13r0j69L0j32l3P1J86l28j34R1K01K28l92J75
$$ -4 32 308 62 16 -86 -83 325 53 57 270 180 11 41 -91 -124 -53 133 -195 -329 -238 -37 191 -201 -26
2791b6m6N4Qj10L40Rl08J6K68j42k8K38l96L73n96K37J84jM6o1j79K64p1l26L40
$$ -26 -72 -18 -10 -120 220 229 -79 -63 205 63 35 273 -123 250 -346 -109 75 74 120 59 -120 144 73 -253 87
2816H7R8l84L47j58n7K07r4j11N9j98M45o1k68J75pq4j42l7K08Q0k56J07J82j52
$$ 87 185 -199 148 -10 -67 140 46 -65 -6 -204 241 180 -88 87 80 -4 -146 -183 25 105 -151 -44 138 -14
2840a4J00Q9m16J28o0K75J24l27PJ90j31M8o0N4N4pq4l9M1k79M91k66J1J44rJ77
$$ -14 86 175 -241 -113 -173 102 226 -101 -94 96 -35 13 -47 7 61 54 -30 -69 -28 -307 184 -82 -71 73 64 241
2866B41r3q2k01J03K36l31K0J75K0j22K00L9m58K94j43o1K14P5p5L48m22l1O0
$$ 241 148 66 -135 -32 204 -127 -107 68 88 -34 166 205 -253 41 -102 -163 51 126 51 399 -23 -54 6
2889Fj31J87J31k25J49p5k51N65k96rk60N7r0J69P2K62l22j74M34j04oN7j47j22
$$ 6 -125 62 193 -32 117 42 -209 356 60 51 -209 -152 -242 -73 -1 261 -61 -235 199 95 89 146 -1 -123
2913a23J31K78p2k81R2Kk28J09K99j82L00L3m03K97j39r3R5k05J57J25k84j2j52
$$ -123 8 286 214 -67 25 27 -201 -92 207 25 325 358 -45 252 113 20 115 -90 67 192 -92 -104 -256
2936b56L4O3P2L7J80L6j93L95m55q7L26j43Q2j03O5J24k38L18ol34j3J04OL3p4
$$ -256 -222 -159 -87 -50 130 166 -27 368 -87 -174 152 9 91 -12 53 177 -61 257 251 -83 -96 8 14 47 -27
2961b7j14nj57N8J01J6J12q8j63L69J87l40P9J5j23j28L53l02N36j99L2m62K77
$$ -27 -141 -146 -303 -245 -144 -128 -16 -104 -267 102 289 -51 28 43 -80 -208 145 -157 379 180 212 -250 27
2984B7k21O11k96k19M54o41M71l08J87j62K96n06K00j7K37j89j67J15j04R1L34
$$ 27 -194 417 121 -98 356 -285 186 -122 65 -97 199 -307 -107 -124 113 -76 -243 -128 -232 -141 193
3005A93k29k13J86K8k7K61Pj63l1j69m5K59J36j40q8j70N6j53M62J92n53K31J8
$$ 193 -36 -249 -63 -35 -62 199 206 43 12 -157 -202 57 193 53 -35 -205 -149 -302 160 352 -201 30 48
3028D8j99K75M6p3L9j60J20o4J25l55K78Ll0j19j12O37m39l54K82n0j2K6n5K50
$$ 48 -151 124 170 97 136 -24 96 32 157 -198 80 83 53 -66 -178 459 20 -334 -52 -102 -114 -88 -143 107
3052A07m61L95ML7k91J20k24M5O01m58M45J16m96j82J29M19p8m16M33p2l85j17
$$ 107 -354 41 45 82 -209 -89 -313 -268 333 -125 320 436 -60 -242 -113 306 228 -188 245 173 -212 -329
3074c29L94J68k75K13l93L53j02j35L78m27nP2P6K01j69p4L55l20m70O12J47j67
$$ -329 65 233 -42 171 -222 131 29 -106 272 -155 -160 -88 -12 189 20 -54 301 -19 -489 123 270 103
3096A03l91M74rj94K79k96L04n06L47J47k71K73l27j36L92m52K32M83k92j00L09
$$ 103 -288 186 177 -17 262 -34 270 -236 111 258 -13 260 -67 -203 189 -263 -31 452 160 60 369
3117C69l23n3K63j55R7k93O9L74l15M9N2n45O38M6m11M78l56m4r9M94j34k1j09
$$ 369 46 -7 256 101 198 -95 -26 348 33 82 134 -411 227 273 -138 340 -16 -60 -159 335 201 180 71
3140G1J07J11m00K53j31l9J98l64K50L13o85K09L31m97J12K06j32J92j74P5M2
$$ 71 178 289 -111 142 11 -28 170 -194 56 369 -316 -107 224 -273 -161 45 -87 105 -69 6 48
3161D8k41P7L00n7k65K03k43L17j18j81J36j4M9K2N5K63l49n9m8K37k93K13J20
$$ 48 -193 -116 184 127 -138 65 -178 139 21 -160 -24 -38 11 33 88 351 2 -57 -105 132 -161 52 172
3184A72m85J53L53O7m8l21J58J57m52L15M02l47k24k23J63J29J3K3L50q1k73k36
$$ 172 -313 -160 193 260 212 -109 49 206 -246 69 471 124 -100 -323 -160 -31 -18 5 355 274 1 -235
3206b35J75L7j51K1K82o1k41N40n7m00L22l86P7p8r7M96k25j40J11o5K61j0m74
$$ -235 -60 -23 -174 -153 129 68 -173 367 310 -90 232 -154 -77 -155 -252 244 19 -121 -10 -75 186 176 -298
$$ [...]
8191B41
##END NTUPLES=NMR FID
##END=
