##TITLE=1H_DE-155_CCl4_TFAp
 200.13Hz,CCl4.
 8 sc
 10.6.2026
##JCAMPDX= 6.0         $$ Bruker NMR JCAMP-DX V2.0
##DATA TYPE= NMR FID
##DATA CLASS= NTUPLES
##ORIGIN= UXNMR, Bruker Analytische Messtechnik GmbH
##OWNER= pz
$$ XWIN-NMR		Version 3.5
$$ Wed Jun 10 13:58:19 2026 Russian Standard Time (UT+4h)  she@DPX200
##.OBSERVE FREQUENCY= 200.131
##.OBSERVE NUCLEUS= ^1H
##.DELAY= (6, 6)
##.ACQUISITION MODE= SIMULTANEOUS
##.ACQUISITION SCHEME= undefined
##.AVERAGES= 8
##.DIGITISER RES= 18
##SPECTROMETER/DATA SYSTEM= spect
##.PULSE SEQUENCE= zg30
##.SOLVENT NAME= CDCl3
##.SHIFT REFERENCE= (INTERNAL, CDCl3, 0, 14.3821)
##AUDIT TRAIL= $$ (NUMBER, WHEN, WHO, WHERE, WHAT)
$$ ##TITLE= Audit trail, XWIN-NMR		Version 3.5
$$ ##JCAMPDX= 5.01
$$ ##ORIGIN= Bruker BioSpin GmbH
$$ ##OWNER= she
$$ F:/spectra/data/she/nmr/H-C/1/audita.txt
$$ ##AUDIT TRAIL=  $$ (NUMBER, WHEN, WHO, WHERE, WHAT)
(   1,<2026-06-10 13:56:16.26 +0400>,<she>,<DPX200>,
      <created by zg, POWCHK disabled, PULCHK disabled
       configuration hash MD5:
       00 E9 B6 7A A2 85 ED C7 34 08 36 98 17 FE 4E 26
       data hash MD5: 16K
       BF 73 C5 A5 D4 97 D2 55 0C CA BF A1 01 40 76 EA>)
$$ ##END=
$$ 
$$ hash MD5
$$ F4 80 4D 14 C2 B2 B9 C1 25 6D B9 2A 74 C6 35 63
##$RELAX= 
##$RELAX= 
##$RELAX= 
##$RELAX= 
##$RELAX= 
##$RELAX= 
$$ Bruker specific parameters
$$ --------------------------
##$DU= <F:/spectra>
##$EXPNO= 1
##$NAME= <H-C>
##$PROCNO= 1
##$TYPE= <nmr>
##$USER= <she>
##$AMP= (0..31)
100 100 100 100 100 100 100 100 100 100 100 100 100 100 100 100 100 100 
100 100 100 100 100 100 100 100 100 100 100 100 100 100 
##$AQSEQ= 0
##$AQ_mod= 1
##$AUNM= <au_zg>
##$AUTOPOS= <>
##$BF1= 200.13
##$BF2= 200.13
##$BF3= 200.13
##$BF4= 200.13
##$BF5= 200.13
##$BF6= 200.13
##$BF7= 200.13
##$BF8= 200.13
##$BYTORDA= 1
##$CFDGTYP= 0
##$CFRGTYP= 5
##$CHEMSTR= <none>
##$CNST= (0..31)
1 1 145 1 1 1 1 1 1 1 1 1 1 1 1 1 1 1 1 1 1 1 1 1 1 1 1 1 1 1 1 1 
##$CPDPRG= <>
##$CPDPRG1= <>
##$CPDPRG2= <>
##$CPDPRG3= <>
##$CPDPRG4= <mlev>
##$CPDPRG5= <mlev>
##$CPDPRG6= <mlev>
##$CPDPRG7= <mlev>
##$CPDPRG8= <mlev>
##$CPDPRGB= <>
##$CPDPRGT= <>
##$D= (0..31)
0 0.7 0 0 0 0 0 0 0 0 0 0.03 0 0 0 0 0 0 0 0 0 0 0 0 0 0 0 0 0 0 0 0 
##$DATE= 1781085375
##$DBL= (0..7)
120 120 120 120 120 120 120 120 
##$DBP= (0..7)
150 150 150 150 150 150 150 150 
##$DBP07= 0
##$DBPNAM0= <>
##$DBPNAM1= <>
##$DBPNAM2= <>
##$DBPNAM3= <>
##$DBPNAM4= <>
##$DBPNAM5= <>
##$DBPNAM6= <>
##$DBPNAM7= <>
##$DBPOAL= (0..7)
0.5 0.5 0.5 0.5 0.5 0.5 0.5 0.5 
##$DBPOFFS= (0..7)
0 0 0 0 0 0 0 0 
##$DE= 6
##$DECBNUC= <off>
##$DECIM= 32
##$DECNUC= <off>
##$DECSTAT= 4
##$DIGMOD= 1
##$DIGTYP= 9
##$DL= (0..7)
0 120 120 120 120 120 120 120 
##$DP= (0..7)
150 150 150 150 150 150 150 150 
##$DP07= 0
##$DPNAME0= <>
##$DPNAME1= <>
##$DPNAME2= <>
##$DPNAME3= <>
##$DPNAME4= <>
##$DPNAME5= <>
##$DPNAME6= <>
##$DPNAME7= <>
##$DPOAL= (0..7)
0.5 0.5 0.5 0.5 0.5 0.5 0.5 0.5 
##$DPOFFS= (0..7)
0 0 0 0 0 0 0 0 
##$DQDMODE= 0
##$DR= 18
##$DS= 0
##$DSLIST= <SSSSSSSSSSSSSSS>
$$ [...]
##$SUBNAM0= <"">
##$SUBNAM1= <"">
##$SUBNAM2= <"">
##$SUBNAM3= <"">
##$SUBNAM4= <"">
##$SUBNAM5= <"">
##$SUBNAM6= <"">
##$SUBNAM7= <"">
##$SUBNAM8= <"">
##$SUBNAM9= <"">
##$SW= 18.0517599122864
##$SWIBOX= (0..15)
0 0 2 0 0 0 0 0 0 0 0 0 0 0 0 0 
##$SW_h= 3612.71676300578
##$TD= 16384
##$TD0= 1
##$TE= 0
##$TE2= 300
##$TE3= 300
##$TEG= 300
##$TL= (0..7)
0 120 120 120 120 120 120 120 
##$TP= (0..7)
150 150 150 150 150 150 150 150 
##$TP07= 0
##$TPNAME0= <>
##$TPNAME1= <>
##$TPNAME2= <>
##$TPNAME3= <>
##$TPNAME4= <>
##$TPNAME5= <>
##$TPNAME6= <>
##$TPNAME7= <>
##$TPOAL= (0..7)
0.5 0.5 0.5 0.5 0.5 0.5 0.5 0.5 
##$TPOFFS= (0..7)
0 0 0 0 0 0 0 0 
##$TUNHIN= 0
##$TUNHOUT= 0
##$TUNXOUT= 0
##$USERA1= <user>
##$USERA2= <user>
##$USERA3= <user>
##$USERA4= <user>
##$USERA5= <user>
##$V9= 5
##$VALIST= <valist>
##$VCLIST= <CCCCCCCCCCCCCCC>
##$VD= 0
##$VDLIST= <DDDDDDDDDDDDDDD>
##$VPLIST= <PPPPPPPPPPPPPPP>
##$VTLIST= <TTTTTTTTTTTTTTT>
##$WBST= 1024
##$WBSW= 4
##$XGAIN= (0..3)
0 0 0 0 
##$XL= 0
##$YL= 0
##$YMAX_a= 144689
##$YMIN_a= -72792
##$ZGOPTNS= <>
##$ZL1= 120
##$ZL2= 120
##$ZL3= 120
##$ZL4= 120
##$ABSF1= 10
##$ABSF2= 0
##$ABSG= 5
##$ABSL= 3
##$ALPHA= 0
##$AQORDER= 0
##$ASSFAC= 0
##$ASSFACI= 0
##$ASSFACX= 0
##$ASSWID= 0
##$AUNMP= <proc_1d>
##$AZFE= 0.1
##$AZFW= 0.1
##$BCFW= 1
##$BC_mod= 2
##$BYTORDP= 1
##$COROFFS= 0
##$CY= -3
##$DATMOD= 1
##$DC= 2
##$DFILT= <>
##$DTYPP= 0
##$F1P= 0
##$F2P= 0
##$FCOR= 0.5
##$FTSIZE= 0
##$FT_mod= 4
##$GAMMA= 1
##$GB= 0.15
##$INTBC= 1
##$INTSCL= 1
##$ISEN= 128
##$LB= 0.25
##$LEV0= 0
##$LPBIN= 0
##$MAXI= 10000
##$MC2= 0
##$MEAN= 0
##$ME_mod= 0
##$MI= 1.114404
##$NCOEF= 0
##$NC_proc= 0
##$NLEV= 6
##$NOISF1= 3.799351
##$NOISF2= 2.8
##$NSP= 1
##$NTH_PI= 0
##$NZP= 0
##$OFFSET= 14.38212
##$PC= 1
##$PHC0= -4220.395
##$PHC1= 16.19229
##$PH_mod= 1
##$PKNL= yes
##$PPARMOD= 0
##$PSCAL= 0
##$PSIGN= 0
##$REVERSE= no
##$SF= 200.129724274929
##$SI= 16384
##$SIGF1= 3
##$SIGF2= 2
##$SINO= 400
##$SIOLD= 16384
##$SREGLST= <1H.CDCl3>
##$SSB= 0
##$STSI= 0
##$STSR= 0
##$SW_p= 3205.1282051282
##$SYMM= 0
##$S_DEV= 0
##$TDeff= 0
##$TDoff= 0
##$TI= <>
##$TILT= no
##$TM1= 0
##$TM2= 0
##$TOPLEV= 0
##$USERP1= <user>
##$USERP2= <user>
##$USERP3= <user>
##$USERP4= <user>
##$USERP5= <user>
##$WDW= 1
##$XDIM= 8192
##$YMAX_p= 0
##$YMIN_p= 0
$$ End of Bruker specific parameters
$$ ---------------------------------
##NTUPLES= NMR FID
##VAR_NAME=  TIME,          FID/REAL,        FID/IMAG
##SYMBOL=    X,             R,               I
##VAR_TYPE=  INDEPENDENT,   DEPENDENT,       DEPENDENT
##VAR_FORM=  AFFN,          ASDF,            ASDF
##VAR_DIM=   8192,          8192,            8192
##UNITS=     SECONDS,       ARBITRARY UNITS, ARBITRARY UNITS
##FACTOR=    0.0002768,     1,               1
##FIRST=     0,             0,               0
##LAST=      2.2672688,     0,               0
##MIN=       0,             -72792,          0
##MAX=       2.2672688,     144689,          0
$$ Real data points
##PAGE= N=1
##DATA TABLE= (X++(R..R)), XYDATA
0@%%%%%%%%%%%%%%%%Qj6J6j6J6j8K6l2L4m2N0n8P0q0R0j04J20j37J55j76K00k25
$$ 0 0 0 0 0 0 0 0 0 0 0 0 0 0 0 0 0 8 -8 8 -8 8 -10 16 -16 18 -24 26 -32 38 -42 48 -56 64 -73 82 -94 106 -119
38a19K50k78L12l49L88m30M77n31N87o46P13p87Q66r54J052j159J278j411J561
$$ -119 131 -147 165 -184 204 -226 251 -280 307 -339 374 -413 453 -501 551 -608 670 -741 820
57H20j728J916k136K394k696L058l504M072m821N866p464J0416k8835N4682j04832
$$ 820 -908 1008 -1128 1266 -1430 1628 -1876 2196 -2625 3241 -4223 6193 -22642 32040 -72792
72g2792M205R8110k7508N9548O181m2536l056J743l7875L1927j0140J3104P2843
$$ -72792 -68587 29523 2015 61563 67744 25208 22152 23895 -13980 17947 7807 20911 93754
85I3754l6868N183j5736p0111L3471J2767j1477k721M2243l14l0857n12m8736
$$ 93754 56886 62069 46333 -23778 9693 22460 10983 8262 50505 50191 19334 18822 -29914
98b9914J5634K2650j5806J0391l331K3987m599k8461j1788J8564p276j5184M8849
$$ -29914 -14280 8370 -7436 2955 -376 23611 19012 -9449 -21237 -2673 -9949 -25133 23716
111B3716m1225j855M6496m9115Q407J423k2608K2116R366j9019n085K4266l726
$$ 23716 -17509 -19364 27132 -21983 -13576 -12153 -34761 -12645 -3279 -22298 -27383 -3117 -6843
124f843j466k9696L445L5294m2920K5404J9945k7175K0401L83j3759p533K0846
$$ -6843 -8309 -38005 -34560 734 -42186 -16782 3163 -24012 -3611 -3228 -16987 -24520 -3674
137c674K291P040J5934k8240J5219R68l491P967j3532J9857J292o797p304N213
$$ -3674 -1383 5657 21591 -6649 8570 9538 6047 14014 482 20339 21631 14834 7530 12743
151A2743J706Q43J9823m0945R406K4384l0602J4001R24n998l927J849P64j5383
$$ 12743 14449 15292 35115 -5830 3576 27960 -2642 11359 12283 6285 2358 4207 4971 -10412
165a0412N440P395J9920k6172r336K5217k2619J8291m439j9329K3099L255j0628
$$ -10412 -4972 2423 22343 -3829 -13165 12052 -10567 7724 3285 -16044 7055 10310 -318
178c18j3671J5914o995J294J3035k1942R118k802J1009r48k4703J9231N40o70
$$ -318 -13989 1925 -5070 -3776 9259 -12683 -3565 -6367 4642 3694 -21009 -1778 -1238 -1908
192a908n749l634j593N612J9829l3085R587J4241j3315J6640j7029R60J2245N097
$$ -1908 -7657 -11291 -12884 -7272 12557 -20528 -10941 3300 -10015 6625 -10404 -9444 2801 7898
206G898m611j3792J0076J76R943j3550K647J2323k2796K6137p435k2467J9281
$$ 7898 3287 -10505 -429 -253 9690 -3860 -1213 11110 -11686 14451 7016 -15451 3830
219C830R872l126j9908R154J187K791K050j5888J4757o498O641l246j4612K1497
$$ 3830 13702 10576 -9332 -178 1009 3800 5850 -10038 4719 -1779 4862 1616 -12996 8501
233H501m840J263J9n670l850R284J2813k8339J4256Q947j4938J0464j1548L118
$$ 8501 3661 4924 4943 -727 -4577 4707 17520 -10819 3437 12384 -2554 7910 -3638 -520
247e20L668O338J33j6204O825L282O196j6630N031J1186j8581J7028j3013q822
$$ -520 3148 9486 9619 -6585 240 3522 9718 -6912 -1881 9305 -9276 7752 -5261 -14083
261a4083J6632j889j583n237P570r486M515P766j2151O146n609J5734r359j8485
$$ -14083 2549 660 -923 -6160 1410 -8076 -3561 4205 -7946 -1800 -7409 8325 -1034 -19519
275a9519K1676l818k146K301J525p560K759J1031j6918J2218p15n765J2575j3794
$$ -19519 2157 -1661 -3807 -1506 19 -7541 -4782 6249 -10669 1549 834 -4931 7644 -6150
289f150J818j776P324M869j0517M344j068M989q115J0024j40j3907K6527j0752
$$ -6150 -4332 -6108 1216 6085 -4432 -88 -1156 3833 -4282 5742 5602 -8305 18222 7470
303G470j4315Q795M000K557p240Q190q756J225N054n303M812j1479J8245k645
$$ 7470 -6845 1950 5950 8507 1267 9457 701 1926 6980 1677 6489 -4990 13255 10610
317A0610j4774R334j0065P065N277m589j0819O928R857j9869Q785p53q41J0349
$$ 10610 -4164 5170 -4895 2170 7447 2858 -7961 -1033 8824 -11045 -2260 -3013 -3854 6495
331F495r190J886j0200O448R335r658j568J784R199j3793M162l44o932K1680j0254
$$ 6495 -2695 -809 -11009 -4561 4774 -4884 -6452 -4668 4531 -9262 -5100 -5444 -12376 9304 -950
346i50n674L582j91M310l747M816o990P374M256r264l004n297K3223q160j1977
$$ -950 -6624 -3042 -3233 1077 -2670 2146 -4844 2530 6786 -2478 -5482 -10779 12444 4284 -7693
361g693J4279p098J322K397M57p136N834J1540j4887J660n485P324Q226j1795
$$ -7693 6586 -512 810 3207 3664 -3472 2362 13902 -985 675 -4810 2514 10740 -1055
375a055N080n391N129K630r209K077L420O775r104M010o534p446K0318j0165m193
$$ -1055 4025 -1366 3763 6393 -2816 -739 2681 9456 352 4362 -2172 -9618 10700 535 -3658
390c658K307K048K628r601M481k439N922Q09k050k312j0180J6239n445n049Q301
$$ -3658 -1351 697 3325 -6276 -1795 -4234 1688 2497 447 -1865 -12045 4194 -1251 -6300 2001
405B001q212O063j329k038n107O944Q671j1838O650n149J965J220k996R414j1743
$$ 2001 -6211 -148 -1477 -3515 -8622 -1678 6993 -4845 1805 -3344 -1379 -159 -3155 6259 -5484
420e484N487N636p584j899J994P896p596P292m279o744J1827q885M980p25k651
$$ -5484 3 5639 -1945 -3844 -1850 6046 -1550 5742 1463 -5281 6546 -2339 2641 1916 -735
435g35L682k521K348r470O651L716k05j190p232J2142r546R25P778r069M034J893
$$ -735 2947 426 2774 -6696 -45 3671 3466 2276 -4956 7186 -2360 -1435 6343 -2726 1308 3201
451C201R35r412J723O757l266N008j0978P242R78o615Q027q409M837M049m900
$$ 3201 4136 -5276 -3553 3204 -62 4946 -6032 1210 2188 -4427 3600 -4809 28 4077 -823
466h23j256k413L270j862Q123q500n728J3453n414P09m422K846O024m308K877
$$ -823 -2079 -4492 -1222 -3084 5039 -3461 -9189 4264 -1150 -441 -4863 -2017 4007 -301 2576
481B576p449K377L500K635l299p626J1874m867J999q0r027J0699K548k215r110
$$ 2576 -4873 -2496 1004 3639 340 -7286 4588 -279 1720 1640 -7387 3312 5860 3645 -5465
496e465M607M573n584O376q065K316J819J85K485j3143R470O782m437m570J51
$$ -5465 -858 3715 -1869 4507 -3558 -1242 577 762 3247 -9896 -426 6356 1919 -2651 -2500
511b500N633m805O962o587j763P912n893M527p618J508P522k503J964p523L061
$$ -2500 3133 -1672 5290 -1297 -3060 4852 -1041 3486 -4132 -2624 4898 2395 4359 -3164 -103
526a03K609J979n588k241J1578j0833K707J888q121O096J686J304q459K685M837
$$ -103 2506 4485 -1103 -3344 8234 -2599 108 1996 -6125 -29 1657 2961 -5498 -2813 2024
541B024m478L427m337M727j479n76J512q693Q423j79j502J37r92J830l562Q347
$$ 2024 -2454 973 -3364 1363 -116 -692 820 -7873 550 371 -1131 -994 -1986 -156 -3718 4629
557D629p389p58Q340n391J975n314L939J678m253N185k981l77k152O299l464m592
$$ 4629 -2760 -3518 4822 -569 1406 -3908 31 1709 -2544 2641 -340 -717 -2869 3430 -34 -4626
573d626R847o018M655j303o195N564j281L326m955K519J358m231L726k589K359
$$ -4626 5221 -797 3858 2555 -3640 1924 643 3969 -986 1533 2891 -1340 2386 -203 2156
588B156l580O954J523j3012O973O82j195O76K00j03n567P886n405k667L861M1
$$ 2156 -1424 5530 7053 -5959 1014 1696 501 1177 1377 1274 -4293 3593 -1812 -4479 -618 -577
604e77N685q561j23J328P98M133n760J698o75K908l677k810O419n912Q009m68
$$ -577 5108 -3453 -3576 -2248 -1450 2683 -3077 -1379 -2054 854 -2823 -5633 786 -5126 2883 2415
620B415o817J509j59Q029n733j646K781J577L01o122L944l288N573K764r422N277
$$ 2415 -4402 -2893 -3052 4977 -756 -2402 379 1956 2257 -3865 79 -3209 2364 5128 -4294 983
636I83j023J654K37q58p3j320Q342p573l474L400J466K848n721L495k002o05M902
$$ 983 -40 1614 1851 993 920 -400 7942 369 -3105 295 1761 4609 -1112 2383 381 -224 4678
653D678n473J41O68O869n080n248M650k895N891m801j866M486l940L056m317J509
$$ 4678 -795 -654 14 6883 1803 -3445 1205 -1690 4201 -600 -2466 2020 -1920 1136 -3181 -1672
669a672P12J063L030n286N90l838O916J66q062O906j556P59l158o68L255j583
$$ -1672 -960 103 3133 -2153 -1563 -5401 1515 1681 -6381 525 -1031 -272 -3430 -4098 -843 -2426
685b426N598m649n77k09J078L740o026M828j460n88K764n342K016L53M747l473
$$ -2426 3172 -1477 -2054 -2263 -1185 2555 -3471 1357 -103 -691 2073 -3269 -1253 -900 3847 374
701C74k09K970o290O593j156k155J428k69L614n779O51J184O99R66k130L150n395
$$ 374 165 3135 -3155 3438 2282 127 1555 1286 4900 -879 -228 956 1655 2621 491 3641 -1754
718a754L925l19k178M366n413L495N60k640j979n97N786m359J006p41l70J971
$$ -1754 2171 1852 -326 4040 -1373 2122 2682 42 -1937 -2534 3252 -1107 -101 -842 -1212 759
734G59m070O087m957K73M696k924j670k256N115k238o8J620n194N131j751Q68
$$ 759 -3311 2776 -2181 -1908 2788 -136 -1806 -4062 1053 -1185 -1253 367 -4827 304 -1447 -579
750e79r05j516N247k798N10k573K52L710j138m17m751P447j551m646N046l097
$$ -579 -1484 -3000 2247 -551 -41 -2614 -2362 1348 210 -207 -4958 2489 938 -3708 1338 -1759
766a759K969K80K04k211j987N691k201R33l547J399L565m136K117m508L956M065
$$ -1759 1210 1490 1694 -517 -2504 3187 986 1919 -1628 -229 3336 -800 1317 -3191 765 4830
782D830m883j18o94L715k607J081N33m526N951j979r06k887J211N988n067M92
$$ 4830 -53 -171 -865 2850 243 1324 1857 -2669 3282 1303 397 -2490 -1279 4709 -358 134
798A34o30J033O84k19J061n651O320j87l985J060k912N361o54j523j914k35M958
$$ 134 -496 537 1221 1002 2063 -3588 2732 2545 -1440 -380 -3292 2069 1415 -108 -2022 -2257 2701
815B701m206Q09n84J787Mk658M179o873K484M548k804j656j558M889k689L25P78
$$ 2701 -1505 -696 -1280 507 511 -2147 2032 -4841 -2357 2191 -613 -2269 -3827 1062 -1627 -1302 -524
832e24j671M288k772J026k124j77M414l905J960j242N8L67M83J145m409N967j562
$$ -524 -2195 2093 -679 347 -1777 -1954 2460 -1445 515 -727 -669 -302 181 1326 -3083 2884 1322
849A322k259K728k573K003j299K736j631k752L238j542J157k512K842J028k890
$$ 1322 -937 1791 -782 1221 -78 2658 1027 -1725 1513 -29 1128 -1384 1458 2486 -404
864d04L638m255J710J123j389J834j818J315l115K686M4l666L183n0J903m743
$$ -404 3234 -1021 689 1812 423 2257 439 1754 -1361 1325 1369 -2297 886 836 2739 -2004
880b004O04L633l984K818j081l16j054J188J256n431L824L36k6K73l418L256j531
$$ -2004 -1400 2233 -1751 1067 -14 -330 -1384 -196 1060 -4371 -547 -211 -237 36 -3382 -126 -1657
897a657K630j542j653K945j553J554l076Q95N90N4M013o698J544K126L69m50k259
$$ -1657 973 -569 -2222 723 -830 724 -2352 -1457 -867 -813 3200 -3498 -1954 172 541 91 -2168
914b168L971j640J355j561j962K484r15L804m146p91K774j707K788l153Q98J362
$$ -2168 1803 163 1518 -43 -2005 479 -436 3368 -778 -1569 1205 -502 2286 -867 31 1393
930A393J631q27m577M163m34L84k9j923J428j976L231k233k140L694J47N72m556
$$ 1393 3024 2197 -2380 1783 1349 1733 1704 -219 1209 -767 2464 231 -1909 1785 1932 2504 -2052
947b052K228N55p74K197l901K179m43n32L04j988K197j120K959k611k251L154
$$ -2052 176 731 -43 2154 -1747 432 -11 -543 -239 -2227 -30 -1150 1809 -802 -3053 101
963A01r96K013l888K282J752l468K115j927Q73J36J381N95l199K719j365J459
$$ 101 -895 1118 -2770 -488 1264 -2204 -89 -2016 -1143 -1007 374 969 -2230 489 -876 583
979E83j152p13L337k960J829k080l75J809q34J415j773K004j637J17K779m067
$$ 583 -569 -1282 2055 -905 924 -1156 -1531 278 -556 859 -914 1090 -547 -430 2349 -1718
995a718K556K19K37p58j686K877k569K206n65p84Q90j722K867k569J305J20j109
$$ -1718 838 1057 1294 536 -1150 1727 -842 1364 799 15 905 -817 2050 -519 786 906 -203
1012b03K868l095J09Q4J318o81j816L006l050J388N69r10N45j878M399k376j743
$$ -203 2665 -430 -321 -237 1081 400 -1416 1590 -1460 -72 497 -413 132 -1746 2653 277 -1466
1029a466R68Q4J444k237K026k079j47K709k940J616j622K020O62j944P78k486
$$ -1466 -498 -414 1030 -1207 819 -1260 -1407 1302 -1638 -22 -1644 376 1038 -906 -128 -2614
1045b614L979q26j383L35l04K234l770J962J9j423L406j524o17j423K957M07k550
$$ -2614 1365 539 -844 -509 -813 1421 -2349 -387 -368 -1791 1615 91 -526 -1949 1008 1415 -1135
1062a135J928j959K339q04r61M23j001L641k151l99L71n11J968j471J110k231
$$ -1135 793 -1166 1173 369 -592 -169 -1170 2471 320 -79 292 -219 1749 278 1388 -843
1078h43J806J701l551P91l66K159j212j300J948j911J774o38M14j397L02L317
$$ -843 963 2664 -887 -96 -462 1697 485 -815 1133 -778 996 358 772 -625 -323 2994
1094B994l895K18M72J92J383k675J081q99J748p94j704K297j539J749q41R1m17
$$ 2994 -901 -683 -211 -19 1364 -1311 -230 -1129 619 -175 -1879 418 -1121 628 -213 -122 -539
1111e39j205M185l121o23O93M72J75j786K175j305J020Q32k080J411j948K157
$$ -539 -1744 2441 -680 -1303 -610 -138 37 -1749 426 -879 141 973 -1107 304 -1644 513
1127E13k14j026J258j730K210j406j31J42K70J481k376J889p82o21J672q32J375
$$ 513 299 -727 531 -1199 1011 -395 -526 -384 -114 1367 -1009 880 98 -523 1149 317 1692
1144A692k913J857N7j377Q67q78J782j328R71J59k241K537j278Q82k75p17N62
$$ 1692 -1221 636 693 -684 183 -695 1087 -241 730 889 -1352 1185 -93 789 514 -203 359
1161C59q13J590k711J464J206j561Q93j655J738j119O32J454k582J480j30N60
$$ 359 -454 1136 -1575 -111 1095 -466 427 -1228 510 -609 23 1477 -1105 375 245 805
1177H05j607m07K288j584J217j822L88R55j432J760j569J062k3K7K47j952J901
$$ 805 -802 -1209 1079 -505 712 -1110 -722 233 -1199 561 -1008 54 31 58 305 -1647 254
1194B54q2O05j043j729K836j574Q53p74O03P39r13J360k370J016J209n37J82k067
$$ 254 172 777 -266 -1995 841 -733 120 -654 -51 688 -225 1135 -1235 -219 990 453 635 -1432
1212a432K171n64k99K90j413K714p94q7j245K54J654j534K149k165l24J579p04
$$ -1432 739 175 -124 166 -1247 1467 673 586 -659 -405 1249 -285 1864 -301 -625 954 250
1229B50l3k060K409K60l69m21j079K154j345J028o83r11J956j378R73j723J51
$$ 250 217 -1843 566 826 457 36 -1043 1111 -234 794 111 -800 1156 -222 751 -972 -821
1246h21J817n41Rk310J970M45j082P40j133K211j763K91M50k150K328m93M48j488
$$ -821 996 455 464 -1846 124 569 -513 227 -906 1305 -458 -167 283 -1867 461 -32 416 -1072
1264a072L98J284j705J593j321J038K17m91O27j787J718q61O62N29j663Q02m15
$$ -1072 -674 610 -1095 498 -823 215 432 -59 568 -1219 499 -362 300 829 -834 -32 -447
1281d47J033j032l9K219k202P45k09J50k04k82J234j456P57l04M0M63j287J778
$$ -447 586 -446 -485 1734 -468 277 68 218 14 -268 966 -490 267 -37 3 466 -821 957
1299I57j027P12j18j275J613j026Q70n69K11j21j318K256j638Q6J54O30L46j859
$$ 957 -70 642 524 -751 862 -164 706 137 348 227 -1091 1165 -473 -387 -233 397 743 -1116
1317a116J605p16j22O74o00R07j821J735r68o54R74m57J397j546K8R5L35J210
$$ -1116 489 -227 -349 325 -275 632 -1189 546 -422 -1076 -102 -559 838 -708 -680 -585 -250 960
1335I60k221J493k21K25K89j481J009j078J972k58j710Q30m8J355j843O99M01
$$ 960 -1261 232 11 236 525 -956 53 -1025 947 689 -1021 -191 -239 1116 -727 -28 373
1352C73l24J207j833P17k65L48R30j656O76l38N66J09j333J189l31J339j595l55
$$ 373 49 1256 -577 140 -125 223 1153 -503 173 -165 401 510 -823 366 35 1374 -221 -576
1370e76J010q69J119j235M87l41j88J480j815O64k26J214m66j647J953q29R16
$$ -576 434 -435 684 -551 -64 -405 -593 887 -928 -264 -490 724 258 -1389 564 -265 651
1387F51o48m31N53m36Q23j132P56j72l72J371j512L96n1R80j21j575J540q20J63
$$ 651 3 -428 125 -311 512 -620 136 -36 -408 963 -549 -153 -204 776 655 -920 620 -200 -37
1406c7r8P7L28j030J611j159m7M97l86J446j615P52P5k90R1j080J318o85N33J71
$$ -37 -135 -58 270 -760 851 -308 -355 142 -244 1202 -413 339 414 124 215 -865 453 -232 301 472
1426D72r02R68j654J844m88o23R04p98J033j600R30M2k48N12j179J147j371P07
$$ 472 -430 538 -1116 728 240 -383 521 -277 756 -844 86 128 -120 392 -787 360 -1011 -304
1444c04N72p03R72j255R63j11l60o6l07J487j241K34K75r48R08m07P38p55J57
$$ -304 268 -435 537 -718 245 134 -226 -292 -599 888 -353 -119 156 -792 116 -291 447 -308 -151
1463a51J149q70j9j156J728k20n86N46r18P82m85K02L1k72Q45o82L39j182O59
$$ -151 998 128 109 -1047 681 461 -125 421 -497 285 -200 2 33 -239 606 -76 263 -919 -260
1482b60J413j161N62j214R62L28j013Q45j104P99K70l00l37p12J510l05j85j97
$$ -260 1153 -8 554 -660 302 630 -383 462 -642 157 427 127 -210 -922 588 283 98 -99
1500i9l30R00r75L81l90J35Q91r31N55n96M88J0Q7K03j218J632n03p69J11M60
$$ -99 -429 471 -504 -123 -513 -378 513 -418 137 -459 29 39 126 329 -889 743 240 -529 -418 42
1520D2J089j582O20n94L3P21m89P72q95O13n9n24K05n36J044n2o50m3m74J608
$$ 42 1131 -451 169 -425 -392 329 -160 612 -283 330 271 -253 -48 -584 460 408 -242 -285 -759 849
1540H49j241N36j6o17J253j033K77o91N43Q23j009J10k89Q76o98k56Q75n97P07
$$ 849 -392 144 128 -489 764 -269 8 -683 -140 683 -326 -216 -505 371 -327 -583 292 -305 402
1559D02l96n8J11l73P63m12K82m99J88K78m15R5n11J099n17k92R00r47M62k76
$$ 402 6 -52 59 -314 449 37 319 -180 8 286 -129 -34 -545 554 37 -255 645 -302 160 -116
1579a16M71j36q78J293r26Q19o06k54P80p02N44m58K6J12Q7P70j140L08k89N25
$$ -116 355 219 -659 634 -292 527 -79 -333 447 -255 289 -169 -143 -31 56 826 -314 -6 -295 230
1599B30k5j362J327k67L23l78j28L80r33J295p00J16p0N6N93j434Q86J89o9L04
$$ 230 205 -1157 170 -97 226 -152 -280 100 -833 462 -238 -122 -192 -136 457 -977 -91 98 29 333
1619C33q40P57m25L53j43j29Q61r66O45m31k34L10R0P06j649O85N43m63K97n06
$$ 333 -507 250 -175 178 35 -94 767 -199 446 15 -219 91 181 887 -762 -77 466 3 300 -206
1639b06P17m82L7J03l23N26m14R12p59o10J128o92K56p26M42L91m9L2j038Q99
$$ -206 511 29 66 169 -154 372 -42 870 111 -499 629 -63 193 -533 -91 300 251 283 -755 144
1659A44j71R5K45n95J69k06N29n14n98J024M8J02p70K84K75l57N67p68K22L40
$$ 144 -27 68 313 -282 -113 -319 210 -304 -902 122 170 272 -498 -214 61 -296 271 -497 -275 65
1679F5k29K31m51K41k26Q98n74n42P15l50M81n46K73K80o36N10l69K88l11K72
$$ 65 -164 67 -384 -143 -369 529 -45 -587 128 -222 259 -287 -14 266 -370 140 -229 59 -252 20
1699B0L77q21Q96m58J03p1j33Q42p86K75k66N7J49m78O49o76L67R2j20K41o60
$$ 20 397 -424 472 14 117 46 -87 755 -31 244 -22 35 184 -294 355 -321 46 138 18 259 -401
1720d01P36k03j67K36l83O99q67K94L60n34K69l75O00j98m16M68l53O12p22K31
$$ -401 335 132 -35 201 -182 517 -350 -56 304 -230 39 -336 264 66 -350 118 -235 377 -345 -114
1740a14q9J88K59m50O14r16K85O67p00J78l02R69m81l82N35l99O64p13L04Ml25
$$ -114 -203 -15 244 -206 408 -508 -223 444 -256 -78 -380 589 108 -274 261 -138 526 -187 117 121 -204
1761b04M85m71J29j72L2P79j119K86k91P09Ok13L08n18O81m41M7j73m6O94n93
$$ -204 281 -190 -61 -233 -201 578 -541 -255 -546 163 169 -44 264 -254 427 -14 33 -140 -186 508 -85
1782h5q7j85N37L62p15L44j27L5J76n53L15l09N57k00k57L24o77Q12k54j8j16
$$ -85 -172 -357 180 542 -173 171 44 79 255 -298 17 -292 265 65 -192 132 -545 267 13 -5 -121
1803a21L30K70n98K16k59K00Q1l93N06o59O87j18q0j20j9K87m69j6M97k35L23
$$ -121 209 479 -119 97 -162 38 119 -274 232 -427 260 142 62 -58 -77 210 -259 -275 222 -13 310
1824C10q07P01m34J83k91k0O29m85K62p5q3M1j30N10n62r3N91n14L06k09N73n39
$$ 310 -497 204 -230 -47 -338 -358 271 -214 48 -27 -110 -69 -199 311 -251 -344 247 -267 39 -170 403 -136
1846a36K06J64l40M35n77M42J90n65M32l76M45k68j6kk1J12l46M82j30k35L87
$$ -136 70 234 -106 329 -248 194 384 -181 251 -125 320 52 36 34 13 125 -221 261 131 -104 283
1867B83k52L07k51M65n78j69J03j62K57J27m86L80m20M09o2J26m4k50K66l19K59
$$ 283 31 338 87 552 -26 -195 -92 -254 3 130 -356 24 -396 13 -49 77 33 -217 49 -270 -11
1888a1j44J95J78o10N76m54P0j9P8N15p69L41O0K80n01k11Q41l76K84j92m75N08
$$ -11 -155 40 218 -392 184 -270 -200 -219 -141 374 -395 -54 6 286 -215 -426 415 39 323 131 -344 164
1910A64k30K97n57L85j53k18P09p12M03K75k13K74r90J046m38r4N4k28L41k78
$$ 164 -66 231 -326 59 -94 -312 397 -315 88 363 150 424 -566 480 42 -52 2 -226 115 -163
1930a63N10m28m1L03k3ml35L65r0R6j43k68M69k86M46l51m11N60j67J52m46j3
$$ -163 347 -81 -122 181 158 154 -181 184 94 190 47 -221 248 -38 408 57 -354 206 39 191 -255 -268
1952b68M07j37J47l98J57J43r1J18l91L99j46p0M43o39N17l06K06j73j30M72l03
$$ -268 139 2 149 -249 -92 51 -40 78 -313 86 -60 -130 313 -326 191 -115 91 -82 -212 260 -43
1973d3l8q9K86M77p87J53j16M84k44j29K59l03K99j92M4m1R1P1m77L21j61J79
$$ -43 -81 -170 116 593 -194 -41 -157 327 83 -46 213 -90 209 17 61 20 111 182 -295 26 -135 44
1995D4nk85L68n3j58j7M4J93j23j7j52j64M16k58K17k84L09k0L6r2k47N53l71
$$ 44 39 -246 122 69 -89 -106 -62 131 8 -9 -161 -325 91 -167 50 -234 75 55 91 -1 -248 305 -66
2018f6j3J53k82K18j78K77K47l01N8l03N88p42N46J2k39k1l43O85k46j79K25j75
$$ -66 -79 74 -208 10 -168 109 356 55 113 -190 398 -344 202 214 -25 -46 -389 296 50 -129 96 -79
2040g9J96k54K16l10L77o6k06J41m42N02J19m34Q7O7L44m61p5L82j67K03j71k08
$$ -79 117 -137 79 -231 146 80 -126 15 -427 75 194 -240 -153 -86 258 -203 -278 104 -63 140 -31 -239
2062b39LK33Q9k94J89l02L52J27j5l94J19K71l49J80J00j8L57n10O5J59k7J52
$$ -239 -236 -3 86 -208 -19 -321 31 158 143 -251 -132 139 -210 -30 70 52 409 -101 -36 123 96 248
2084B48n16K73j2P4K0k82M22m60O57l16j2J84l05Q3K26k30o3j86M77n49O2N00
$$ 248 -268 5 -7 67 87 -195 227 -233 424 108 96 280 -25 58 284 54 -9 -195 282 -267 -205 295
2106B95n07M36l51J69M6k4R4l70L81r0j90P9j48K82k72N78m69M5N8j5pr7J34j40
$$ 295 -212 224 -127 42 88 64 158 -212 169 79 -111 -32 -180 102 -170 408 -61 -16 42 27 20 -77 57 -83
2130h3n4J14n8K42j42m5K88m73L32k05l3K67l37L37o43M29n61P91r8j28l1R1J0
$$ -83 -137 -23 -81 161 19 -26 262 -211 121 -84 -117 150 -187 150 -493 -64 -625 166 68 -60 -91 0 10
2153A0p7Q0j4k37O42k28k45l9k0J86k33M29k01K29k54NL03k85P0j28k12M47l79
$$ 10 -67 13 -1 -238 404 176 -69 -108 -128 58 -175 254 53 282 28 33 336 51 121 -7 -219 228 -151
2176a51J62j96K38q0j80j43R5L03k87M50m14k0M44n44M86l31L48p1l51L12m28
$$ -151 11 -185 53 -27 -207 -350 -255 48 -239 211 -203 -223 221 -323 163 -168 180 109 -242 70 -358
2197c58M62r5o3L08m08N3m1M10l24j77L63k94J73R5j3j29j44K51k53K8K77j92
$$ -358 104 9 -54 254 -154 -101 -142 268 -56 -233 130 -164 9 104 91 -38 -182 69 -184 -156 121 -71
2219g1k09O3N34j95J97j06l91L13j09J88k83lK51lr9j13J16Rk45J49j49K52Mj35
$$ -71 -280 -217 317 122 319 213 -178 135 26 214 -69 -72 179 176 77 -36 80 89 -156 -7 -156 96 100 -35
2243c5K4J55L0m0j62M46l08kq3K01j05j29k9N1L28l29Q3J8j82K06k77J63j98p6
$$ -35 -11 144 174 134 -28 418 110 108 25 226 121 -8 -37 14 342 13 96 114 -68 138 -139 24 -174 -250
2267b50M07k48M56l08j58K66q3n6q9N5R0l6J25k59J48p9o2k8j79O0q4M92j90K06
$$ -250 157 -91 365 57 -101 165 82 26 -63 -8 82 46 171 -88 60 -19 -81 -109 -288 -228 -312 180 -10 196
2291A96j73j07J27l22L95N0j39j21j46K86o6J8m4q2K14r2M45n53L22j40J3J57
$$ 196 23 -84 43 -279 116 166 27 -94 -240 46 -20 -2 -46 -128 86 -6 439 -114 208 68 81 238
2313B38l08L9k09J19J08K95L6j0ml87J88j47j66K82j4l3J76k38j24J04N5J3N0
$$ 238 -70 -31 -240 -121 -13 282 318 308 304 -83 105 -42 -208 74 60 27 203 -35 -159 -55 0 13 63
2336F3J03k9J8l28L16l41J32K58k93K59j05k64M93n32N6j33P18l84j33J76n8L61
$$ 63 166 137 155 -173 143 -198 -66 192 -101 158 53 -211 282 -250 -194 -327 391 7 -126 50 -8 353
2358C53q82O31m6k7q4p0L32k38J07p0o7n2K7K19j76k78K42K30k72J90%M4m51M31
$$ 353 -529 102 56 29 -55 -125 207 -31 76 6 -61 -113 -86 133 -43 -321 -79 151 -121 69 69 113 -338 93
2382I3J68k74j27K5J21L9J10k6k04k72J90P4l37M3K64q5L78n28M29j2j67j68O8
$$ 93 261 -13 -140 -115 6 45 155 129 -75 -347 -157 -83 -420 -377 -113 -198 180 -348 81 69 -98 -266 -198
2405a98K84m8l4m6o3K3J02L4o6L1J62k55l6J31J61N7m06J28J50j02j18K28Rl37
$$ -198 86 38 4 -42 -105 -82 20 54 -12 19 181 -74 -110 21 182 239 -167 -39 111 9 -109 119 128 -209
2429b09J92j41K23J10k51K42k51O4j14L28j97P6n5R0o8l42L70J0j43k9j4K01J76
$$ -209 -17 -158 65 175 -76 166 -85 -21 -135 193 -4 72 17 107 39 -303 67 77 -66 -95 -109 92 268
2452B68n51M76n7M2j96Q2q0j80lJ60j20N1K88k73Q5j54Q9J25j6N2K11m04K81j76
$$ 268 -283 193 136 178 -18 64 -16 -196 -199 -39 -159 -108 180 -93 -8 -162 -73 52 36 88 299 -105 176 0
2476@P4l22p5O23l04J67k27M9j77Q5K02k25K7J63n8j19j42k9K72L85l17l46O57
$$ 0 74 -248 -323 300 -4 163 -64 -15 -192 -107 95 -130 -103 60 2 -117 -259 -288 -16 369 52 -294 363
2499C63k11l6O7j89M1k7K18k59k09K21n4l9Ql3J16J27n6j64lJ75j44L45l11J24
$$ 363 152 116 183 -6 35 8 226 -33 -242 -21 -75 -114 -106 -139 -23 104 48 -116 -119 56 -88 257 -54 70
2523G0k2J96m01R5M5k96J86j02K86j80K73j8j2M7r1K8M7M3j3K8J7j81k76M07j09
$$ 70 48 244 -157 -62 -17 -313 -127 -229 57 -123 150 132 120 167 76 104 151 194 181 209 226 45 -231 176 67
2548F7J06j00J39j94p5Q6j86K34k04Q1K6j08K47k09K38j97J43K9p5j85j07K02
$$ 67 173 73 212 18 -57 29 -157 77 -127 -46 -20 -128 119 -90 148 -49 94 123 48 -137 -244 -42
2570d2o7k52M34l01j29K40J29J52j54m04N81j09o7J02L61o02K70k77j53K39J11
$$ -42 -109 -361 73 -228 -357 -117 12 164 10 -394 187 78 11 113 474 -128 142 -135 -288 -49 62
2591F2N7n9P1l51J17J73q4R4l9k0J38j88O1l46M19k26J61o4M1K77n02K76j00O7
$$ 62 119 60 131 -220 -103 70 -14 80 41 21 159 -29 32 -314 105 -121 40 -24 17 294 -208 68 -32 35
2615C5K47k01J84l36n2M9OK76j89j46l6J43K25k44o5M1J36L7k07K99j81K77n56
$$ 35 282 81 265 -71 -123 -74 -68 208 19 -127 -163 -20 205 -39 -104 -63 73 110 -97 202 21 298 -258
2638b58j3J59K32O1m28J46O7o4j14K46L2q5J56J05k01J18j43O5k39J30K20Q8J21
$$ -258 -271 -112 120 181 -247 -101 -34 -98 -212 34 66 -19 137 242 41 159 16 81 -158 -28 192 280 401
2661D01l09j16L37m14L36k34o8o7J38l0M09m21Q9J39m60J44Q2K1J85k80j15K91
$$ 401 92 -24 313 -101 235 1 -67 -134 4 -26 383 -38 51 190 -270 -126 -44 -23 162 -118 -233 58
2683E8k03O1k61M13p1L6j8K7J02l41l2L43k52K26k00J29p3q6RR4J63lM6j66q4
$$ 58 -145 -84 -345 68 -3 33 15 42 144 -197 -229 114 -138 88 -112 17 -56 -142 -133 -39 124 121 167 1 -83
2708h3k4j21J30K07k73R9j76L27k11K82p2j96l6o3K26J37j14L6M4j77r3J49K70
$$ -83 -107 -228 -98 109 -164 -65 -241 86 -125 157 85 -111 -147 -210 16 153 39 75 119 -58 -151 -2 268
2731B68l31J01m39K81J49K07r5k99L03mp9j53j49M98l16j00J05M2K85l54K45q1
$$ 268 -63 38 -401 -120 29 236 141 -158 145 141 62 -91 -240 258 -58 -158 -53 -11 274 -80 165 84
2753H4j85J6j29J13K19j7R4j11j34j38K15k8p7J38j45K64r7R0l01K77q6l44M34
$$ 84 -101 -85 -214 -101 118 101 195 84 -50 -188 27 -1 -78 60 -85 179 82 172 -129 148 62 -282 152
2776A52l52M19q5k53L44k56J0q4K01K2o27J050l30l00K85k10j0Q9K59k43k29M28
$$ 152 -200 219 134 -119 225 -31 -21 -105 96 118 -509 541 211 -89 196 -14 -24 65 324 81 -148 280
2798B80K94j99k30j76J62O33J01n66k58K95L27o64L24l21l55L89PJ00j17l95L01
$$ 280 574 375 145 -31 131 764 865 299 41 336 663 -1 323 2 -353 36 43 143 26 -369 -68
2819f8j61L54o23R55l66m13M33l12N74K02q02J06Q6J95K5n5n12K96N48m89N8O83
$$ -68 -229 125 -498 457 91 -322 111 -201 373 575 -227 -121 -35 160 185 130 -382 -86 462 -27 31 714
2841G14q23j77K90M76K9r7M8j72m01k02Q64j03j79Q5p88Q14q2j64k65L27j6j32
$$ 714 -109 -286 4 480 509 412 460 288 -113 -315 549 446 267 352 -436 378 296 132 -133 194 178 46
2863D6K86l45M03p06K34K3J17j4j53M3R1j61M52l45j13J33rj99P0J91l3k40L28
$$ 46 332 -13 390 -316 -82 -59 58 44 -109 -66 25 -136 316 -29 -142 -9 -18 -217 -147 44 11 -229 99
2886I9l59K38N8L5j03J0j25J17P8k03r0P7K92k61q4L82p5Q6m4k29l1L7L12j04
$$ 99 -260 -22 36 71 -32 -22 -147 -30 48 -155 -245 -168 124 -137 -221 161 86 172 128 -101 -132 -95 217 113
2910A13l37J60m9K16o7n2N3J22j70K68r6n39P49j37Mk76KK00k6Q8l10K24o0j50
$$ 113 -224 -64 -113 103 36 -16 37 159 -11 257 161 -378 371 234 238 -38 -36 164 138 226 -84 140 80 -70
2934g0J16j60k2J34P9J61l93J21j7n8Rm7L01r6M62l91k10k1J34j3J71m86M34l5
$$ -70 46 -114 -136 -2 77 238 -155 -34 -51 -109 -100 -147 154 58 520 129 -81 -102 32 19 190 -296 138 103
2958A03k02L2m8L%K56k17J52l01K51r7j70L36k1J31k24j34M8J02j76J71j81R8
$$ 103 -99 -67 -115 -112 -112 144 -73 79 -222 29 -68 -238 98 77 208 -16 -150 -102 0 -176 -5 -186 -88
2981h8r7L45j75M6k4j67J80k14L51o54O09Pk50R5K60l02J63O0k88R6j11O9L11
$$ -88 -185 160 -15 31 7 -160 20 -194 157 -497 112 119 -131 -36 224 -78 85 145 -143 -47 -158 -89 222
3004B22l17L9K85m74O7N61n51L64p1J11l56L01m4l56K91j98J45l8k13K78j23P7
$$ 222 -95 -56 229 -245 -178 383 -168 196 125 236 -120 181 137 -219 72 -126 19 -19 -232 46 -77 0
3026@j57k0N7J91J67k65K4N2j33J38K06j75j65J04N8K47j69k55M2j27l3Q4J05
$$ 0 -157 -177 -120 71 238 -27 -3 49 -84 54 260 85 -80 24 82 329 160 -95 -53 -180 -213 -129 -24
3049b4k49J77J33L0J81k73L1k07L20j34L47k51j71J00P2k39J63j53k35K27q6J10
$$ -24 -273 -96 37 67 248 -25 6 -201 119 -15 332 81 -90 10 82 -157 6 -147 -382 -155 -241 -131
3071a31K00j06q6L5l7J8K95J03j53j69J70j42j08K04k06K56Q2m06K83l49nJ73
$$ -131 69 -37 -123 -88 -125 -107 188 291 138 -31 139 -3 -111 93 -113 143 225 -181 102 -247 -252 -79
3093g9k8j9J10R1K9L3j92J64k09Q8k47K56o8K35k49j30K21J11j20J23j5Q6j62
$$ -79 -107 -126 -16 75 104 137 -55 109 -100 -12 -259 -3 -71 164 -85 -215 6 117 -3 120 105 191 29
3116B9k3l6J51j39L2r7L17K25l99J32j73j13J26l16K16J70kk16O7L59o16K21Q5
$$ 29 6 -30 121 -18 14 -83 234 459 60 192 19 -94 32 -284 -68 102 100 -116 -49 310 -306 -85 0
3139@l15K36L28k26m4m6J24K7N3k36M14m39J4L49k80K25k49N7m02K53K98j81k8
$$ 0 -315 -79 249 23 -21 -67 57 84 137 -99 315 -124 -110 239 -41 184 -65 -8 -410 -157 141 -40 -68
3162f8K25jj51j9j83J45J57p3Rj50J70k16L11k64J97Oj80PK31k44K16l64K68K4
$$ -68 157 156 5 -14 -197 -52 105 32 41 -109 61 -155 156 -108 89 95 -85 -78 153 -91 125 -239 29 53
3186E3pm19M01j58K91Qj68j31o6L77j74o5N6J53l44K59j38N2r4j57K48K19m05
$$ 53 46 -373 28 -130 161 169 1 -130 -196 181 7 -58 -2 151 -193 66 -72 -20 -114 -271 -23 196 -209
3209b09J82J11k08J63o1L3J37k39j32J18K4J4N7K36q2j96J48j61j7p1K27m7K6
$$ -209 -27 84 -124 39 -22 11 148 -91 -223 -105 -81 -67 -10 226 144 -52 96 -65 -82 -153 74 27 53
3232E3k4m11N53k7j52j69j8Q9J11j37P2l60N54k27J38N9k90J63q2J36j82J76p8
$$ 53 29 -382 171 144 -8 -177 -195 -106 5 -132 -60 -420 134 -93 45 104 -186 -23 -105 31 -151 25 -53
3255e3j04M1NK33qP3n36O81k03o3J17j62j44K12l36J30k4p9J32L69l24J7o5J26
$$ -53 -157 -116 -111 122 114 187 -349 332 129 66 183 21 -123 89 -247 -117 -141 -220 -88 281 -43 -26 -91 35
3279C5n6K28q4j12j71RJ87j94K38l66K83K47l13j73J96RJ44l31L54K2mj21j28
$$ 35 -21 207 123 11 -160 -151 36 -158 80 -286 -3 244 -69 -242 -46 -37 107 -224 130 152 148 27 -101
3302a01L34l17k19M13j63L1L4NM7K27k89J5Qk7L5lJ58L7l13k8n0l3J30M01l57
$$ -101 233 -84 -303 110 -53 -22 12 17 64 291 2 17 25 -2 33 30 188 225 -88 -116 -166 -199 -69 332 -25
3327b5L85k28j33J33j45j01J87Rk72L64l69N2K4P8O2j25R9m5K12j40p2n1J70P0
$$ -25 360 132 -1 132 -13 -114 73 82 -190 174 -195 -143 -119 -41 21 -104 -5 -50 162 22 -50 -101 69 139
3351A39q5n2l72J41L4J92j08O0J3k50J59Q9N2J00j16K7Q2j8n9j19M0j61P2L03
$$ 139 54 2 -370 -229 -195 -3 -111 -51 -38 -288 -129 -40 12 112 -4 23 105 87 28 -91 -51 -212 -140 163
3375A63p8j1k55J18P1M2j58J1K38p1J3J18r7j81K25j07l42L14J22k72n3k6L28
$$ 163 85 74 -181 -63 8 50 -108 -97 141 70 83 201 104 -77 148 41 -301 13 135 -137 -190 -216 112
3398A12L03l29m8J47k41M2J59m31J98J03j16m9j55K23J50k46L03j78l2L49k13
$$ 112 415 86 38 185 -56 -14 145 -286 -88 15 -101 -150 -305 -82 68 -178 125 -53 -85 264 51
3419E1R8j06k78M36k81J29j6J55l82J97j15K72k18M4J24O9j77J92m3r2p9m2L0
$$ 51 149 43 -235 201 -80 49 33 188 -194 3 -112 160 -58 -14 110 179 2 194 151 59 -20 -62 -32
3442c2l5o9L4J14K50l60N8K13l71K40j32L19m45K35r7K5j50o7M18J88k70r5K03
$$ -32 -67 -136 -102 12 262 -98 -40 173 -198 42 -90 229 -216 19 -78 -53 -203 -270 148 336 66 -29 174
3465A74j57R4k03L32j27j47K9K9K39k14j72L9K80l24Q1K56n38J78KJ37l54M89
$$ 174 17 111 -92 240 113 -34 -5 24 263 49 -123 -84 196 -128 -47 209 -329 -151 -149 -12 -366 123
3487A23j53j77L75k35K6J93k78J82J03j65J73j52l04K94J82j38k6j89K92J8k4
$$ 123 -30 -207 168 -67 -41 152 -126 56 159 -6 167 15 -289 5 187 49 23 -166 126 144 120
3508A20o2N9j71L5N8M1o5l14L26K8J30k23r6K31j2j28J86l76K21r2K10q2q6J48
$$ 120 58 117 -54 -19 39 80 15 -299 27 55 185 -38 -134 97 85 -43 143 -233 -12 -104 106 24 -62 86
3532H6k31J92Nm6k60K34j61Qm0K17N3o9j25K36l6k76J31o9J83K4l20L34l62J85
$$ 86 -145 47 52 6 -254 -20 -181 -173 -213 4 57 -12 -137 99 63 -213 -82 -151 32 56 -264 70 -292 -107
3556a07P7K0K03k8j51l6j38j0K75k33J46L3k24M51j71k43K61j9j02N2k51J60K00
$$ -107 -30 -10 193 165 14 -22 -160 -170 105 -128 18 51 -173 278 107 -136 125 106 4 56 -195 -35 165
3579A65k40J62p1J78k0m81J84L8J19j30K16j26J11N3l86L43qm4r1N1m0N2O0j27
$$ 165 -75 87 16 194 174 -307 -123 -85 34 -96 120 -6 105 158 -228 115 107 63 -28 23 -17 35 95 -32
3603c2L67n17K31r6kO1P0l8j45J01J13p7K7j13j34K73j56J50n9J12l90K35K85
$$ -32 335 -182 49 -47 -49 12 82 44 -101 0 113 36 63 -50 -184 89 -67 83 24 136 -254 -19 266
3626B66j97P3j91n7Q4N7k9j90K49o5N0k19K81n0q8p3K08j41k3L3j93K48J96j50
$$ 266 69 142 -49 -106 -22 35 6 -184 65 0 50 -169 112 62 -26 -99 109 -32 -55 -22 -215 33 229 79
3650G9q8n9j09J1K63k01K02k47J05J50j54k00K3K90j00p1k39K21J73j92J58j02
$$ 79 -9 -68 -177 -166 97 -104 98 -149 -44 106 -48 -248 -225 65 -35 -106 -345 -124 49 -143 15 -87
3672h7J33j01L7j9R0M1j59J93j85n8K06j0j00l8K72Lm86K26O1J82k94O6Kj21K41
$$ -87 46 -55 -18 -37 53 94 -65 128 -57 -115 91 81 -19 -57 215 218 -268 -42 19 201 -93 -27 -25 -146 95
3697I5j3p8j6j46Q3j8l0p2r0M15K7m00K30R2K2k58J77p9M75m54j59J18P6j9M6
$$ 95 82 4 -12 -158 -75 -93 -123 -195 -285 130 157 -243 -13 79 101 -157 20 -59 416 -38 -197 -79 -3 -22 24
3722B4q1J29Q3o8N5k78J54J26l26K12o3R5Q9k11L7L58j19k69nJ29M8j20k30L00
$$ 24 -57 72 155 87 142 -136 18 144 -182 30 -33 62 151 -60 -23 335 216 -53 -58 71 119 -1 -231 69
3746F9r5J29p1j78K0J24n1L7n9L13n03L70k86K22J50n9j1L6k51K9o7M5j38k9K88
$$ 69 -26 103 32 -146 -126 -2 -53 -16 -75 238 -265 105 -181 41 191 132 121 157 -94 -65 -132 -87 -225 -254 34
3771C4j58J55j86M15n55J56R3R1m6j83K1M75l72K93k04O7j17J9L8O7o9l56K92
$$ 34 -124 31 -155 260 -295 -139 -46 45 -1 -184 -163 312 -60 233 29 96 -21 -2 36 103 34 -322 -30
3794c0j5K6j72L86p7m9p9M03j85m18J23j3k4J63o8J65j15J6K15l96J80k07J97
$$ -30 -45 -19 -191 195 118 69 -10 393 208 -210 -87 -100 -124 39 -29 136 21 37 252 -144 36 -171 26
3817B6L78k76k15M7j0J00r9n0K32R4k66J04k8p8o9J64n1n7m7J27J86l40j21N6
$$ 26 404 128 -87 -40 -50 50 -49 -99 133 227 -39 65 37 -41 -110 54 3 -54 -101 26 212 -128 -249 -193
3841a93O5J21o6j6J59K8o2r8K9K80j99M0n7K9k1j2j40K4Qm9J63o9p9k2J30Q8j05
$$ -193 -128 -7 -73 -89 70 98 36 -62 -33 247 48 88 31 60 39 27 -113 -89 -81 -130 33 -36 -115 -137 -7 81 -24
3868b4qJ5K5k6q9M07k74LK80J3l29K03j56J03k66j48M93Ok59r8J19m3L1P0rk26
$$ -24 -32 -17 8 -18 -107 300 26 29 309 322 -7 196 40 143 -123 -271 222 228 -31 -129 -10 -53 -22 48 39 -187
3894a87N49m77N6J41k1n5JK31k96j15J51L4J02j47k76K10pK06R4j99j05m6J28
$$ -187 362 -115 -59 82 61 6 7 238 -58 -173 -22 12 114 -33 -309 -99 -106 100 194 -5 -110 -156 -28
3917b8K3l4K63j94q9J0O3J22j49p2m7K76l41K40L9pJ8j89L63m41O4j02N50m36
$$ -28 -5 -39 224 30 -59 -49 14 136 -13 -85 -132 144 -197 43 82 75 93 -96 267 -174 -110 -212 338 -98
3941i8K78l19J42J36r9J6K48o1j82k67L19k42j70J83P6k6J22k5j72M1p0q9P8J83
$$ -98 180 -139 3 139 40 56 304 243 61 -206 113 -129 -299 -116 -40 -66 56 31 -141 -100 -170 -259 -181 2
3965Bj44L92n77L60%q4J44k00J84q5l5m0O8J70o0r0K30k39l0J33r2k80K42k85
$$ 2 -142 250 -327 33 33 -51 93 -107 77 -8 -43 -83 -15 155 95 5 235 -4 -34 99 7 -273 -31 -316
3989c16M73l04M62j78k22K30k02Q6J11r0J39j31j32L73l16K62k46m2K27j63K00
$$ -316 157 -147 315 137 -85 145 -57 29 140 50 189 58 -74 299 -17 245 -1 -43 184 21 221
4010B21k36K7q4J56k5L0nl48M43j19Q8j62K43k67l8J98l57J74n8J56J8r2J10K51
$$ 221 -15 12 -72 84 59 89 84 -264 179 60 148 -14 229 -38 -76 122 -235 -61 -119 37 55 -37 73 324
4034C24m49l1J99q6n5l2J91L2k44K3J91j80o3K51k58J28N9J13p0J6J9M6o1k8j35
$$ 324 -125 -156 43 -43 -98 -130 61 93 -151 -128 63 -117 -180 71 -187 -59 0 113 43 59 78 124 63 35 -100
4059a00J88J84l84K93j31o4J19l5K84m85o9L52m01L78l53K08L6Nk20M17j31r0
$$ -100 88 272 -112 181 50 -14 105 70 354 -131 -200 152 -249 129 -224 -16 20 25 -195 222 91 1
4081Al24M25L5n4r5KR3k56kJ41K1r5J60m6q3m3J28m8M0m3j29J30J39M5Q2j66j8
$$ 1 -323 102 137 83 -12 -10 83 -173 -175 -34 -13 -108 52 6 -77 -120 8 -40 0 -43 -172 -42 97 142 224 58 40
4108D0j85J64q0N4O2nj24q9K84j24L50o09L53K8p5m6J03j46K86o2k01k86J04L27
$$ 40 -145 19 -61 -7 55 50 -74 -163 121 -3 347 -262 91 119 44 -2 101 -45 241 179 -22 -308 -204 123
4132A23l65J85J72l09K47j62J13j01j58l0L47K16j39j14J08l75J72P0k4l1J15
$$ 123 -242 -57 115 -194 53 -109 4 -97 -255 -285 62 278 139 25 133 -242 -70 0 -24 -55 60
4153F0l9J76J49m70K44j33R6kk30J92j11J3O1L7K1m11L55J13m7k09q2K84k29J50
$$ 60 21 197 346 -124 120 -13 83 81 -149 43 -68 -55 6 43 64 -347 8 121 74 -135 -217 67 -162 -12
4177a2j98J84j14J65p4M9j34J33j80L29j37j68K38o9J53j45J01n3k73K37K00m69
$$ -12 -210 -26 -140 25 -49 0 -134 -1 -181 148 11 -157 81 12 165 20 121 68 -205 32 232 -237
4199b37L24q9m4K62m09L55j21J51k05J73k41M1K70k45j42J30o2J71m5J53j37P3
$$ -237 87 -2 -46 216 -193 162 41 192 -13 160 -81 -40 230 -15 -157 -27 -89 82 37 190 53 126
4221A26p2k62J31k6J30k56M21j31k97K10K29k6k62L51j83o9j08K06J24j09J81
$$ 126 54 -208 -77 -103 27 -229 192 61 -236 -26 203 177 -85 266 83 14 -94 112 236 127 308
4242C08n44J99K15j41n3N3J13j41j33l7J71j08j9J65k03K3K86k86l7J58K20l64
$$ 308 -236 -37 178 37 -16 37 150 9 -124 -161 10 -98 -117 48 -155 -132 154 -132 -169 -11 209 -155
4264a55J02J71K16k85M9l26L22j14J65j78J46k12K62K5k73n4K10p8K4Q0r4j71
$$ -155 -53 118 334 49 98 -228 94 -20 145 -33 113 -99 163 188 -85 -139 71 -7 17 97 3 -168
4286a68j8J96J31l9j17j5J8j51n0J87M6J20jj19J91l81K19j9J1J71k81J55k54
$$ -168 -186 10 141 102 -15 -30 -12 -163 -213 -26 20 140 139 20 211 -170 49 30 41 212 -69 86 -168
4309a68K31R0j93J46j97j81L23j24R8q6Q1m8j51L49l09o4O8L55j26k06m9L28l6
$$ -168 63 153 -40 106 -91 -272 51 -73 25 -61 20 -28 -179 170 -139 -203 -135 220 94 -112 -161 167 131
4332A31J00l49QJ43j26L05k56J75p5J62k59j25J71j24M6J43k10K40m5m6j38R9
$$ 131 231 -118 -110 33 -93 212 -44 131 56 218 -41 -166 5 -119 -73 70 -140 100 55 9 -129 -30
4354c0j91K54p3q3K70rm01M89j45J6m8l36L10o6r5J02J5%J71j23j25K37j01J65
$$ -30 -221 33 -40 -123 147 138 -263 226 81 97 49 -287 23 -43 -138 -36 -21 -21 150 27 -98 139 38 203
4378B03j24k16J98j29J04j46M0o8R9p3J60j05K83k4l08J91k00j3j13L09J46l51
$$ 203 79 -137 61 -68 36 -110 -70 -138 -39 -112 48 -57 226 202 -106 85 -115 -128 -241 68 214 -137
4400a37j52J00J9J37J52n6m6j17J52k9j07k22M46j36O7o5k24M04k18k5J33j59
$$ -137 -289 -189 -170 -33 119 63 17 -100 52 23 -84 -306 140 4 71 6 -218 186 -32 -57 76 -83
4422h3J22p6Q0Q9M2k40K34k74K49k02n3J95l15L19j22K03l2P4M7j60J33j07L3
$$ -83 39 -37 43 132 174 -66 168 -106 143 -59 -112 83 -232 87 -35 168 136 210 257 97 230 123 156
4445A56m39M48j67J4j85J14J86o6j2J03p2N9j14j67K35P1j42j6J54j00M9l8k77
$$ 156 -283 165 -2 12 -173 -59 127 61 49 152 80 139 25 -142 93 164 22 6 160 60 109 71 -206
4468b06R9R7K8Pk7M2P6j86J3l0j00M38l10J92m1k28N5L67m41J53J5l1J88j65l2
$$ -206 -107 -10 18 25 -2 40 116 -70 -57 -87 -187 251 -59 133 92 -136 -81 286 -155 -2 13 -18 170 5 -27
4493b7j10J63Q8j9j91O3j25L17j50r2J83k47o7J62P3o0R4k4K3N0k38K84j41l06
$$ -27 -137 26 114 95 -96 -33 -158 159 9 -83 100 -147 -214 -52 21 -39 55 31 54 104 -134 150 9 -297
4517b97Q7K21ok58J68L28l58k1J64J07J19j50n2j16K28O9m18J91j10J75N3m70
$$ -297 -210 11 5 -253 -85 243 -115 -136 28 135 254 104 52 -64 164 233 -185 6 -104 71 124 -346
4539c46M06pJj81j5J39J85O3k60N7k41J32J9L4L75n59L33K07j98k59nP5r4J18
$$ -346 60 53 54 -127 -142 -3 182 245 -15 42 -199 -67 -48 -14 361 -198 135 342 144 -115 -120 -45 -139 -21
4563b1j3L30k19m7l57K79J57j7J43l59K29m0j03R1n5J03R9o2O7r1k37l4K47%R6
$$ -21 -34 296 77 30 -327 -48 109 92 235 -124 105 65 -38 53 -2 101 200 138 205 114 -123 -157 90 90 186
4588A86k59J79j23j54O2J18J88k01K2K19j9m96J86j5p5L11J0m4K32k22r7j11J99
$$ 186 -73 106 -17 -171 -109 9 197 -4 18 237 218 -278 -92 -107 -182 129 139 95 327 105 8 -103 96
4611I6j19P0O9j09k4n7M5J32L5o4Q9k39K71o9N4m27q6L93Mrj92n8L21j52r4L13
$$ 96 -23 47 116 7 -17 -74 -29 103 138 74 163 -76 195 126 180 -247 -333 60 64 55 -137 -195 126 -26 -120 193
4637A93k97L60l16m4K3L1j9k9M09j61j92J74m7o0n6k03K9K43O2k64K85j30j05
$$ 193 -104 256 -60 -104 -81 -50 -69 -98 311 150 -42 132 85 25 -31 -234 -205 38 100 -164 121 -9 -114
4660a14j1L5P6M4j37NK14p1k3q3r0K93m25M51j77j67J18p2k75K68J85P3j46M5
$$ -114 -125 -90 -14 30 -107 -102 112 41 18 -65 -155 138 -287 164 -13 -180 -62 -134 -409 -141 44 117 -29 16
4684A6n6J01j52J98m7k42K23J6l69M47lJ6j09j24nR1O5j92J60m1j9J92l2p5O2
$$ 16 -40 61 -91 107 60 -182 41 57 -312 135 132 148 39 -85 -90 1 66 -126 34 -7 -26 166 134 59 121
4709A21K4k11J51Q2k20R9q4L0j10L34m95J60J83pQ0j01J5j07K3J49k53l7K23N7
$$ 121 145 -66 85 167 -53 46 -38 -8 -118 216 -279 -119 64 57 137 36 51 -56 -33 116 -137 -174 49 106
4733A06j55J94k52M46j59j11m26L65k5K99k06o8O6L3p6J60k64J47j55r3J51k30
$$ 106 -49 145 -107 339 180 69 -357 8 -17 282 76 8 74 107 31 191 -73 74 -81 -174 -23 -253
4755b53J62L03l18K6j6om7J11m2J04J2j31or5k3K42j06r6N07l17P2p5k5Q1K6J00
$$ -253 -91 212 -106 -80 -96 -102 -149 -38 -80 24 36 -95 -101 -196 -219 23 -83 -179 328 11 83 8 -17 64 90 190
4781A90l84k16M05K2L4k84J69r3Q7l6R3K0j11m2O9PK5q3J87j67MNK8R8m20L81
$$ 190 -194 -410 -5 17 51 -233 -64 -157 -70 -106 -13 7 -104 -146 -77 -70 -45 -128 59 -108 -104 -99 -71 27 -393 -12
4807a2q1K11l4j28j4K53j6m19K56n5J85j14k62R7K88l27J08L44l79J86l71j9L41
$$ -12 -93 118 84 -44 -58 195 179 -240 16 -39 146 32 -230 -133 155 -172 -64 280 -99 87 -284 -303 38
4830C8k44L24k93O2o8J51K28k43k01M04Lj64R9J08j05n0q5J0m8M5lj51K66l0Q
$$ 38 -206 118 -175 -113 -181 -30 198 -45 -246 158 161 -3 96 204 99 49 -36 -26 -74 -29 -32 -183 83 53 61
4855F1j98K17r8J7j50j06M71l62N32k10l68J73O7q1L21l83J11K21M2m04j13J51
$$ 61 -137 80 -18 -1 -151 -257 214 -148 384 174 -194 -21 46 -35 286 -97 14 235 277 -127 -240 -89
4877h9J23LK8k27NL97k64n3P6j47j79L82j84L54l18j11L01k73J04R7j13lrJ65
$$ -89 34 37 65 -162 -157 240 -24 -77 -1 -148 -327 55 -129 225 -93 -204 97 -176 -72 25 -88 -91 -100 65
4901F5j71J71J09n8j79L36j09J8j71P4r3l0L2j37j01M43j18k34L61j13j56R0j34
$$ 65 -106 65 174 116 -63 273 164 182 11 85 -8 -38 -6 -143 -244 199 81 -153 208 95 -61 29 -105
4924a05j17L45j92j93K71K1Pj35K29l2j33k69J29J37l3J89j9j57j7q3L15j77K9
$$ -105 -222 123 -69 -262 9 30 37 -98 131 99 -34 -303 -174 -37 -70 119 100 -57 -74 -157 158 -19 10
4947A0q1j00L32k93j2L2J42Q0j03r3J9J00j26J47j68J17j74QJ68J80m37L02j7
$$ 10 -71 -171 161 -132 -144 -112 30 110 7 -86 -67 33 -93 54 -114 3 -171 -163 5 185 -252 50 33
4970C3m04K83n1J26j34M02q2r5k4k7M7k42k1L49j33m7o3J07J58q0n8K6l29L92
$$ 33 -371 -88 -139 -13 -147 255 173 78 54 27 74 -168 -189 160 27 -20 -83 24 182 102 44 70 -259 133
4994A33k08p5k7k6jK57N1J21j24k59L04j65p1P2n0J10O9q6k34J1J9poK29k5M1
$$ 133 -75 -150 -177 -203 -204 53 104 225 101 -158 146 -19 -90 -18 -68 42 111 25 -209 -198 -179 -186 -192 37 12 53
5020E3K70k37m56M23K77o61J36J98R2j37O9r9M3j4J4K19k4k4j09k7l27L81k14
$$ 53 323 86 -370 53 330 -331 -195 3 95 -42 27 -72 -29 -43 -29 190 166 142 33 6 -321 60 -154
5043a54J05K11j86j46j7M3%J24m2J73r6j57J51L2K0j38L5R9k11K28J25k55l4L13
$$ -154 -49 162 -24 -170 -187 -144 -144 -20 -62 111 15 -142 9 41 61 -77 -42 57 -154 74 199 -56 -90 223
5067B23j68o5J54k33L3n0K82l24N7j05J53J08R2j16k9n3j80K18jj18ko9L14j05
$$ 223 55 -10 144 -89 -56 -106 176 -148 -91 -196 -43 65 157 41 12 -41 -221 -3 -4 -122 -124 -193 121 16
5091A6l01L36j6Oj95L38l44K08k43P1J54J04J27j65j72N3j37K81j32M5o9N6k1
$$ 16 -285 51 35 41 -154 184 -160 48 -195 -124 30 134 261 96 -76 -23 -160 121 -11 34 -35 21 0
5114@K75l75m5L96k06j0j52K02k41L14J60j78j27K0J19j84k55K01K4J75j97o9
$$ 0 275 -100 -145 251 45 35 -117 85 -156 158 318 140 13 33 152 -32 -287 -86 -62 113 -84 -153
5136a53J41j35R4j93M64k68J6q5l4R6j6J93P5j20Kr8m0j90N39n3k13J79m25J78
$$ -153 -12 -147 -53 -246 218 -50 -34 -119 -153 -57 -73 120 195 75 77 -21 -61 -251 288 235 22 201 -224 -46
5160d6j9j22K00k16O0J89k03L6M69m66k0j09K34L5p5Jj06L9K3K11J09k8n39M04
$$ -46 -65 -187 13 -203 -143 46 -157 -121 348 -118 -138 -247 -13 22 -53 -52 -158 -119 -96 115 224 196 -343 61
5184F1k01J50K26l87J83J18j48J16j12l2J75j30J5N1p1j29R0L6m0K07m21L13j32
$$ 61 -140 10 236 -151 32 150 2 118 6 -26 149 19 34 85 14 -115 -25 11 -29 178 -243 70 -62
5207f2J92l26J09L57k06R6j15j05K42l33J03Q3J5K70l45n71M92O6Q5k82J46J12
$$ -62 130 -196 -87 270 64 160 45 -60 182 -151 -48 35 50 320 -25 -596 -104 -38 47 -235 -89 23
5229B3j44j53M25J60m04P2J07M8m23K39k35J49R1j32L73j43L2m4l09K67j69L07
$$ 23 -121 -274 151 311 -93 -21 86 134 -289 -50 -285 -136 -45 -177 196 53 85 41 -268 -1 -170 137
5251A37j19j77J46p6K42l04L11j90N1q1L7J5N9J7j55O6l48K66M17k88m8j18L66
$$ 137 18 -159 -13 -89 153 -151 160 -30 21 -60 -23 -8 51 68 -87 -21 -369 -103 314 26 -22 -140 226
5274B26k17J07l46J36n4L52k03OO1k26J5J42N7N9k46J89j86RK04j57Q0K31j56
$$ 226 9 116 -230 -94 -148 204 1 7 68 -158 -143 -1 56 115 -131 58 -128 -119 85 -72 8 239 83
5297H3J89k27j05L7m7O9j32J5j32M66k15k36J99K1M0j17K23j57j26J13m2K42k57
$$ 83 272 45 -60 -23 -70 -1 -133 -118 -250 216 1 -235 -36 -15 25 -92 131 -26 -152 -39 -81 161 -96
5320i6OL65l25q3J96P2l87K56N1j38J08l80J02M86l10L28l71J28J58l50L17k5
$$ -96 -90 275 -50 -133 63 135 -252 4 55 -83 25 -355 -253 233 -77 251 -120 8 166 -184 133 108
5342A08l3k00M20k54j8l09ok6J18Q2N2k83L06J50K2j69R6P1j92Q5l24K78K95n29
$$ 108 75 -125 295 41 23 -286 -292 -318 -200 -118 -66 -349 -43 107 129 -40 56 127 -65 20 -304 -26 269 -260
5366b60J47J88N8j23O9j82j27L31k81K97j55J14j46K28q1j14j51R7R1J26O0l08
$$ -260 -113 75 133 10 79 -103 -230 101 -180 117 -38 76 -70 158 77 -37 -188 -91 0 126 186 -122
5388a22J65l63K78k0j4K39m2k09K36o7k1j87M05q8j01j81p1p2J33l66M24j21K88
$$ -122 43 -320 -42 -62 -76 163 121 -88 148 81 60 -127 278 190 89 -92 -163 -235 -102 -468 -44 -165 123
5411A23P1j40r7J48p3k94K09j20K38k22J32n4J05o2J2k5J85N6k60P6p7J76k88
$$ 123 194 54 -43 105 32 -262 -53 -173 65 -157 -25 -79 26 -36 -24 -49 136 192 -68 8 -69 107 -181
5434a81m3L51l1J23l97N0J90J44l16l7L2LqJ98J90m39P9J00M0NJ77l01L77k53
$$ -181 -224 127 96 219 -178 -128 62 206 -110 -147 -115 -112 -120 78 268 -171 -92 8 48 53 230 -71 306 53
5458E3m6mj81K03k64L57k33K2L6j42j18L86j10K20j49j93L14L2k05K76l51K92
$$ 53 7 3 -178 25 -239 118 -115 -93 -57 -199 -317 69 -41 179 30 -163 151 183 -22 254 -97 195
5480A95j93Q6N5j82K91l03k01N1K95R5l27N3J88j62m3j7P2q8L45k71rK25l91J90
$$ 195 2 88 143 -39 252 -51 -252 -201 94 189 -138 -85 103 -59 -102 -119 -47 -135 210 -61 -70 155 -236 -46
5504d6L1K96o42L57K4J38k49P6J27k08J61j75l0J62R6m84M00nK20l44O0L9j0j44
$$ -46 -15 281 -361 -4 20 158 -91 -15 112 -96 65 -110 -140 22 118 -366 34 29 249 -95 -35 4 -6 -150
5528a50L88j88q3k8Rj13K7J18o1j20K52J35k19K42l31J35J75j00j04k4kO8k50
$$ -150 238 50 -33 -61 -52 -165 -138 -20 -81 -201 51 186 -33 209 -122 13 188 88 -16 -40 -42 26 -224
5551b24J39j71J67J33k32K98j02p7PlR4l6j16n9j93L30K40j69K01j38o5j10L54
$$ -224 -85 -256 -89 44 -188 110 8 -69 -62 -65 29 -7 -123 -182 -375 -45 195 26 227 89 24 -86 268
5574B68l98J5k10J80R2K45l54M4J54k15L2K22j93l8K07j66N24p16M18j01NJ65
$$ 268 -130 -115 -325 -145 -53 192 -162 -118 36 -179 -147 75 -118 -156 51 -115 409 -307 111 10 15 180
5596A80l75K03j8l11K57O0JJ32K39j33l52J2J60R6l32r0N4J42k00L20J04q8J14
$$ 180 -195 8 -10 -321 -64 -4 -3 129 368 235 -117 -105 55 151 -181 -271 -217 -75 -275 45 149 61 175
5619A75k87K8j31K00p5n3j05K42O1j92P2J02j0j51q9K35k9k0K39l0k12o9J26J64
$$ 175 -112 -84 -215 -15 -90 -143 -248 -6 55 -137 -65 37 27 -124 -213 22 -7 -27 212 182 -30 -99 27 191
5643A91l72l4J34J47k07r4M24j51m08M28L9M6j17j11N8PNn8Q8M2l47L79l08p5
$$ 191 -181 -215 -81 66 -141 -235 189 38 -370 58 97 143 26 -85 -27 -20 -15 -73 15 57 -290 89 -219 -294
5667b94N0M83j40Op3J19j19j60R3j30j15K98J62n24L64O4r6K54k67j35K69k97
$$ -294 -244 239 99 105 32 151 32 -128 -35 -165 -280 18 180 -344 20 84 -12 242 -25 -160 109 -188
5689a88K07K92k43R2k12J34J76m03N5J67k50J93rk9J6j85J35K61J75k33j31j70
$$ -188 19 311 68 160 -52 82 258 -145 -90 77 -173 20 11 -18 -2 -187 -52 209 384 151 20 -150
5711a50J47j45J43J43k20K31j96J27O9n4l20K76r3j1K00j35p0J6R7J82j16M9l06
$$ -150 -3 -148 -5 138 -82 149 -47 80 149 95 -225 51 -42 -53 147 12 -58 -42 55 237 121 170 -136
5734a36J11L25l0L4n36L7K49j12m9K0m8J10jj44J98J8k4m9R1p1j3k47J88K47r2
$$ -136 -25 300 270 304 -232 -195 54 -58 -107 -87 -135 -25 -26 -170 28 46 22 -27 64 -7 -20 -267 -79 168 76
5759G6j4j8k63L88l01j05J77J73J8l52M18n2q8j26q2L88k52M1n3J94p6K2l0K30
$$ 76 62 44 -219 169 -132 -237 -60 113 131 -221 197 145 57 -69 -151 237 -15 26 -27 167 91 113 83 313
5783C13k09q9k52J73N6J35j79J74j21P2k2N7P4p5m7k01Q8P1l83K54L30n73N00
$$ 313 104 15 -237 -64 -8 127 -52 122 1 73 51 108 182 107 60 -141 -53 18 -365 -111 219 -354 146
5806A46j53k9J88l42L97L4l02K39k48K04m0j2l21K91j14L46k53j44L7J04l2r9
$$ 146 -7 -36 152 -190 207 241 -61 178 -70 134 94 82 -239 52 -62 284 31 -113 -76 28 -4 -103
5828a03j95K95k1N5j13j9R3j33J35q1K55k70qk63N5K29J16k67K04k4J50k17o4
$$ -103 -298 -3 -24 31 -82 -101 -8 -141 -6 -87 168 -102 -110 -373 -318 -89 27 -240 -36 -60 90 -127 -191
5851a91N46k87k2j17J13K7k63K99j88k4K4N5j19J25M22k21l25J35Kj31K53R6j03
$$ -191 355 68 46 -71 42 69 -194 105 -83 -107 -83 -28 -147 -22 400 179 -146 -11 -9 -140 113 209 106
5874A06n5n5J86l50QK52m6L4k52J28J4J02j79r7K27J4k8n8j11j31L25N1Q3p0p8
$$ 106 51 -4 182 -168 -160 92 46 80 -172 -44 -30 72 -107 -204 23 37 9 -49 -160 -291 34 85 168 98 20
5899B0J13j01N7J18j96J13m4j58K89l38K85j92J72k22K66m30O1K02J67m07J14
$$ 20 133 32 89 207 11 124 80 -78 211 -127 158 -34 138 -84 182 -248 -187 15 182 -225 -111
5920a11M19j70L6k84L1J10K49l85P5J23k3rj17J53J41j68K0j79M7P9L0O9j50P0
$$ -111 308 138 174 -110 -79 31 280 -105 -30 93 70 61 -56 97 238 70 90 -89 -42 37 67 136 -14 56
5944E6l04J46L14l58J57j32J0m0R7L92j95j72k06K71j89K71j99O9r7m6J53j15
$$ 56 -248 -102 212 -146 11 -121 -111 -151 -54 338 143 -29 -235 36 -153 118 -81 -12 -109 -155 -2 -117
5966a17L46l30M62m35jN9J2j7rJ11Q4N7j14j84n8m2R2K54k27m1J01q1L0q7J38
$$ -117 229 -101 361 -74 -75 -16 -4 -21 -30 81 165 222 108 -76 -134 -176 -84 170 -57 -98 3 -78 -48 -135 3
5991CK5l3J84j14Lj54j07J33M2J79M0Kl10p6K12l55N86l07O9m0K83J11n54QK35
$$ 3 28 -5 179 65 68 -86 -193 -60 -18 161 201 203 -107 -183 29 -326 260 -47 22 -18 265 376 -178 -170 65
6016F5j24R5P5k1k78n0K63m10M44j10L27l48o9L63n25J33Q6j14j3P1O3K4K76n62
$$ 65 -59 36 111 90 -188 -238 25 -385 59 -51 276 -72 -141 222 -303 -170 -84 -198 -211 -140 -77 -53 223 -339
6040c39K14J70%Pr0J54j39m23L65o1K75j43l7J23j57J28m70L48o0nJ39o6l2J32
$$ -339 -125 45 45 52 -38 116 -23 -446 -81 -142 133 -10 -47 76 -81 47 -423 -75 -135 -140 -1 -67 -99 33
6064C3l1j91P9K90j02k4J65k01j78J24pM8J12k92L59j55L3j1j84L55o5l56J69
$$ 33 2 -189 -110 180 78 54 219 18 -160 -36 -43 5 117 -175 184 29 62 51 -133 222 157 -199 -30
6087c0O9Nj09m9L10l23J35j01J69m0j71J63k99L72lk64K3p5J38K16j58K47l07
$$ -30 39 44 -65 -114 196 -127 8 -93 76 36 -135 28 -271 101 98 -166 -143 -218 -80 136 -22 225 -82
6110h2J12j25J13j65J17J21j38Q1k7r9L09j62o6J22K0Nk86n0J92N9P8j14j8J39
$$ -82 30 -95 18 -147 -30 91 -47 34 7 -92 217 55 -11 111 131 136 -150 -200 -8 51 129 15 -3 136
6134A36o6o8J6l2o4K3r0J37o9Q0j72l05L39K26j79K58M6n9O2j28n9Nj84K56p6
$$ 136 70 2 18 -14 -78 -55 -145 -8 -77 3 -169 -474 -135 91 -88 170 216 157 219 91 32 37 -147 109 33
6159C3j37J03j96K35k37M00j68K6o5j85J99Q8m64K80K73j11r5j57K93l0p4k7J5
$$ 33 -104 -1 -197 38 -199 201 33 59 -6 -191 8 96 -368 -88 185 74 -21 -178 115 85 11 -16 -1
6182aJ21K68k80j78K56l99L56K80m98P7r7n3K33k09J05K27j28n5J53k9qj34jJ5
$$ -1 120 388 108 -70 186 -213 143 423 -75 2 -95 -148 85 -124 -19 208 80 25 178 149 141 7 6 21
6206B1J48j15j49L0J40MK6n42M51J07P4m97K53K34l49L11j21j92K17r1K90j74
$$ 21 169 54 -95 -65 75 79 105 -437 14 121 195 -302 -49 185 -164 147 26 -166 51 -40 250 76
6228G6J4k25R6L59l26j43J25K1J8K5j32l5p5J51N5R5Q7r4n5n4j21K8K96j57n1
$$ 76 90 -135 -39 320 -6 -149 -24 -3 15 40 -92 -127 -202 -51 4 99 186 92 37 -17 -138 -110 186 29 -22
6253b2k48M21l4J3J05l96j00L58K6k13J37J37m2j81J45M3k50K61k98K18rQ4j97
$$ -22 -270 151 117 130 235 -161 -261 97 123 -90 47 184 142 -39 106 149 -101 160 -138 80 71 155 -42
6276d2J22r0Q0j72K21J68l58R8J42l71L67j67J97l34K22J15j49j34NJ0L0K52k99
$$ -42 80 -10 70 -102 119 287 -71 27 169 -202 165 -2 195 -139 83 198 49 -85 -80 -70 -40 212 -87
6299h7K69j51j22J11K26N4k21L9p2j25L34l26J51k51J47Q0k8k28J61M8j3J93j87
$$ -87 182 31 -91 20 246 300 79 118 46 -79 255 -71 80 -171 -24 56 28 -200 -39 9 -4 189 2
6322Bk21J22K76l39J63n6L3J71j75k13K19J96l23K27l02K52J78m22M3O3N8Q7k39
$$ 2 -219 -97 179 -160 3 -53 -20 151 -24 -237 -18 178 -145 82 -220 32 210 -212 -169 -106 -48 39 -200
6345b00L34k49J33n2J73k07o1J92k6R7m39M76l62J91q8K75j76j9j46K05J31l03
$$ -200 134 -115 18 -34 139 -68 -129 63 37 134 -305 171 -191 0 -88 187 11 -8 -154 51 182 -121
6367a21O8P8K7k8J3o2m2k3J25Q1o6j23Kj01j75L28q7K21m28J58J09j42R1J88q7
$$ -121 -53 25 52 24 37 -25 -67 -90 35 116 50 -73 -71 -172 -347 -19 -106 115 -313 -155 -46 -188 -97 91 4
6392DK07k61l52K94J26J84k76r6kJ05L15j74J82n14K43j83J80l4k4L0L6o3j26
$$ 4 211 -50 -402 -108 18 202 -74 -170 -172 -67 248 74 256 -258 -15 -198 -18 -52 -76 -46 -10 -73 -199
6415a99K35j03J32K98k66j39J01M6M4Q6n18L86j05J56k33m5J11L5k05L95l65J28
$$ -199 36 -67 65 363 97 -42 59 105 149 235 -283 103 -2 154 -79 -124 -13 22 -183 212 -153 -25
6437b5r0L49j04k28J42J2k47K44N9M2p5j57L2qK15l54O7K77O1l34Q0m3J03j02
$$ -25 -115 234 130 -98 44 56 -191 53 112 154 79 -78 -46 -54 161 -193 -126 151 212 -122 -42 -85 18 -84
6461h4J7n0J28o7J11J0j96j28N6K2J68J44R3k46M4J35l98K43k18L45j52k27K76
$$ -84 -67 -117 11 -56 55 65 -131 -259 -203 -181 -13 131 224 -22 22 157 -241 2 -216 129 -23 -250 26
6484B6k40L40k1j0l8K31l34K5j31Q3K04O4k37r4L5j87M02J31k04j44q4j39K70
$$ 26 -214 126 105 95 57 288 -46 -21 -152 -69 135 199 -38 -132 -97 -284 118 249 45 -99 -183 -322 -52
6507e2Jp7L46J8p8j71k15K32Q5j00J09R1k23j85J83lk94K9M47j05J27k99J78k08
$$ -52 -51 -128 218 236 158 -13 -228 4 89 -11 98 189 -34 -219 -36 -39 -333 -304 143 38 165 -134 44 -164
6531a64K57m2j47K11K22m73L39m78M28J6l57M9J79k74L41l5j78J7J13k8k01L25
$$ -164 93 51 -96 115 337 -136 203 -275 153 169 -188 -139 40 -234 107 72 -106 -89 24 -4 -205 120
6553A20m18L32o2P6Rj22K20k94r8K63p9rL7O7q5l6L1P9k54L53m8rj84K22j48n6
$$ 120 -298 34 -28 48 57 -65 155 -139 -237 26 -53 -62 -25 42 -43 -79 -48 31 -223 130 82 73 -111 111 -37 -93
6579i3L26r6k03j1j60K02j37q3K98j72K2L23l37Q6L20l20P8J42q5M4k02r5L22
$$ -93 233 137 -66 -77 -237 -35 -172 -255 43 -129 -107 216 -121 -35 285 -35 43 185 100 144 -58 -153 169
6602A69k7k78J03M8m9J88j08J74r3j01J05j69k25M13k15M1J06k6K8j01K54k15
$$ 169 142 -136 -33 15 -34 154 46 220 127 26 131 -38 -263 150 -65 -24 82 56 84 -17 237 22
6624B2j39J21r1O7Q6k99j0K59r2K7j16K81q6qp8M7N9n9J0J10N0k06k40K98M0q7
$$ 22 -117 4 -87 -20 66 -233 -243 16 -76 -49 -165 116 30 22 -56 -9 50 -9 1 111 161 -45 -285 13 53 -34
6650c4j1l5K35j77J00j4p6l7mK43k75J46j01n2K85k13K66k29q9L2J49k74P5K24
$$ -34 -45 -80 155 -22 78 64 -12 -49 -53 190 -85 61 -40 -92 193 -20 246 17 -72 -40 109 -165 -90 134
6674A34r8Q6n0J42o4l32P7J11O1l1o7J44k8j58R8m9k16K59j09L21k40q1J69k69
$$ 134 36 122 72 214 150 -182 -105 6 67 36 -31 113 85 -73 25 -24 -240 19 -90 231 -9 -90 79 -190
6698a90K94j98j7J95j98j75M87l38L68k7j81p9J05K51l21J50lkN0o1J19j20Q8
$$ -190 104 -94 -111 84 -114 -289 198 -140 228 201 20 -59 46 297 -24 126 123 121 171 110 229 109 197
6721A97j20k17L52o7K07q0m03N9n7J06J64L9m37K41o9J73J14k63K6K96m2k56N9
$$ 197 77 -140 212 145 352 272 -131 -72 -129 -23 141 180 -257 -16 -85 88 202 -61 -35 261 219 -37 22
6744B2j58k28N56j50k4L1L7n2q0L2K19j38j76Mo9j29K06r1K78j26o1RJ63N8o3
$$ 22 -136 -364 192 42 18 49 86 34 -46 -14 205 67 -109 -105 -174 -303 -97 -188 90 -36 -97 -88 75 133 70
6769G0j17k4L60k58j27K68j09o1P5l3J02j10k5K31m14lQ9j60K88q1O0j49P7p3
$$ 70 -47 -71 289 31 -96 172 63 2 77 44 146 36 11 242 -172 -175 -86 -246 42 -39 21 -128 -51 -124
6793a24N4J91K56k59j11P5k48K19q3j21K41j88J54j13K51l09K34m0k26Q3J29J37
$$ -124 -70 121 377 118 7 82 -166 53 -30 -151 90 -98 56 -57 194 -115 119 79 -147 -64 65 202
6815B02k6J06l44L08k37L29m87L40j21j81M9J94M8p7k56J6J02P6j87K00l2P9j77
$$ 202 176 282 -62 246 9 338 -149 191 70 -111 -62 132 180 103 -153 -137 -35 41 -146 54 22 101 -76
6838g6J38K37l60j17J23j27p6J97J28k2J0k9j94J11Q4pJ76j04p7M2r3J44k94M87
$$ -76 62 299 -61 -178 -55 -182 -258 -61 67 45 55 26 -168 -57 27 20 196 92 15 57 -36 108 -186 301
6862C01j35j83m6j01K65J05j05r3j73M2J59o8J51k28j22L60l13j22J69J74J25
$$ 301 166 -17 -63 -164 101 206 101 8 -165 -123 36 -32 119 -109 -231 129 -184 -306 -137 37 162
6883A62k58K33k39J3K45j55j52K27l37M47ro2k67K33k63J14jk5L30j6n24K20L42
$$ 162 -96 137 -102 -89 156 1 -151 76 -261 186 177 115 -152 81 -182 -68 -69 -94 236 220 -304 -84 258
6906B58k39K59Q6j66k98L9L9K64j47l97M66l6j28n4J38j48Q0J24q1J20j7k67j78
$$ 258 19 278 364 198 -100 -61 -22 242 95 -302 164 128 0 -54 84 -64 16 140 59 179 162 -105 -283
6929b83J94Mp4K73k03K05J82j15Q1k29L6k34J63j81R4RJ62lq7L4J8j96J3N2Jj00
$$ -283 -89 -85 -159 114 -89 116 298 183 264 35 71 -163 0 -181 -87 -78 84 81 -6 28 46 -150 -137 -85 -84 -184
6955a84j43L46J00l46J83kj17K71k30J41j17K70k34J45P0j69m0q0L41j61j4K23
$$ -184 -327 19 119 -227 -44 -46 -163 108 -122 19 -98 172 -62 83 153 -16 -56 -136 205 44 30 253
6977B53j85K11l02n8K0J94j43l38K78O0J31k00k6J6P0J2k1L4J33k49k6L04j34
$$ 253 68 279 -23 -81 -61 133 -10 -348 -70 -10 121 -79 -105 -89 -19 -7 -28 6 139 -110 -136 168 34
7000C4j5O3j96q8L16J51j97j76L36J52k12p2l04K23OJ7Q2k02R9jL08j90l21K09
$$ 34 19 82 -114 -202 114 265 68 -108 228 380 168 96 -208 15 21 38 120 -82 17 16 324 134 -187 22
7024B2j69KJ84K9j02j3J37m16L68j24J4q1L8l6K01r4j15L68l69L04n07J30K97
$$ 22 -147 -145 39 68 -34 -47 90 -326 42 -82 -68 -149 -111 -147 54 -40 -155 213 -156 148 -359 -229 68
7047F8k78J47P9K4j50j5Q7J72k20M14n44O16k56l07J60L9j44J41r2r5M13m5n79
$$ 68 -210 -63 16 40 -110 -125 -38 134 -86 328 -216 400 144 -163 -3 36 -108 33 -59 -154 259 214 -365
7070c65J7N20j95Rq7J08K4M7j17J07M5r1q4J22j06J95k84J05L69j36k20J01K6
$$ -365 -348 172 -23 -14 -101 7 31 78 -39 68 113 22 -62 60 -46 149 -135 -30 339 203 -17 84 110
7093A10m0j89J75j85J14k9K15k02j2j30K46J44l22J58j05l4O5N09m35pl3O1J43
$$ 110 70 -119 56 -129 -15 -44 171 -31 -43 -173 73 217 -105 53 -52 -86 -21 488 53 46 13 74 217
7116B17l43J00j67J85o9K67k94J02l53J71J24J11l0RK16l72K16j59j4Q0k9OR6
$$ 217 -126 -26 -193 -8 -77 190 -104 -2 -355 -184 -60 51 21 30 246 -126 90 -69 -83 -3 -32 -26 70
7139G0k87J91j82J55J56k60J99p4k88L52m9J39j02L35m23L8J16K4P2l77K36j34
$$ 70 -217 -26 -208 -53 103 -157 42 -32 -320 32 -17 122 20 355 -68 -30 86 110 182 -195 41 -93
7161i3K48k41K19J84n79R3Q7P4k26K04j15M23j60k10K57j33j38O3L5J33k42L8
$$ -93 155 -86 133 317 -262 -169 -82 -8 -234 -30 -145 278 118 -92 165 32 -106 -43 -8 125 -117 -79
7183g9j08J80J29k40J77q2k76M41l22J62L3Om31M50%k69K58j9j50J10J82j51p1
$$ -79 -187 -7 122 -118 59 -23 -299 142 -180 -18 15 21 -410 40 40 -229 29 10 -140 -30 152 1 -70
7206g0P2P8j36n8K69k50k36L13Oj10L05J0j92J18n4j36k9j39N29l58K89j48rK69
$$ -70 2 80 -56 -114 155 -95 -331 -18 -12 -122 183 193 1 119 65 -71 -100 -239 290 -68 221 73 64 333
7230C33j39j07k2L31l66N5L7j09J68j17o5lj56K24j8N4M5m4q8j4P1j73J16m2k8
$$ 333 194 87 65 396 30 85 122 13 181 64 -1 -4 -160 64 46 100 145 101 13 -1 70 -103 13 -29 -57
7255e7J37k96J09m7J33nj87J91l6m6J78k09K37m68M75p9P7j0q7k09J38M2k44L56
$$ -57 80 -216 -107 -154 -21 -26 -213 -22 -58 -104 74 -135 102 -366 109 30 107 97 10 -199 -61 -19 -263 93
7279I3r5p2q5K67j46NK75l07q4l9k9K12J57j47o7jM07k64k5R5l26N73l38j3M9
$$ 93 -2 -74 -159 108 -38 -33 242 -65 -149 -188 -217 -5 152 5 -62 -63 344 80 55 150 -176 397 59 46 95
7304I5j04m8Q8j53L7J64L49n80J73j07K64j6j90l8j0Qk51L95m4K66k71j55J06
$$ 95 -9 -57 31 -122 -85 79 428 -152 21 -86 178 162 -28 -66 -76 -68 -319 76 32 298 27 -128 -22
7327b2J80p0j41L52l57K14k90N4j56K79j81L36p7Q0j31j42n4J03l2KK7J30k37
$$ -22 158 88 -53 299 -58 156 -134 -80 -236 43 -138 198 121 201 70 -72 -126 -23 -55 -53 -26 104 -133
7350a33p4j33K46J73J2k56m7M30k28R1k11M88n04r5J99l0K83j84k7j38L73l25
$$ -133 -207 -340 -94 79 91 -165 -212 218 -10 81 -130 358 -146 -241 -42 -72 211 27 0 -138 235 -90
7372i0P4k2K47k20k00K59R7O8m43M55k14j0K6k7MM3j99K72qM7o1q0j85K60QJ64
$$ -90 -16 -38 209 -11 -211 48 145 213 -230 225 11 1 27 0 4 47 -152 120 112 159 98 18 -167 93 101 265
7398B65m69K90J15ll05l4K60O4j65j09R4J3L45n36O5j4J81k14NK33O3k80o5l0
$$ 265 -204 86 201 198 -107 -141 119 183 18 -91 3 16 361 -175 -110 -124 57 -157 -152 81 144 -136 -201 -231
7422b31L61l55J37M1j73M35j93j94K2J00K66j19k52K35o7J92j3m73J71j92N62
$$ -231 130 -225 -88 -47 -220 215 22 -172 -150 -50 216 97 -155 80 13 205 192 -281 -110 -302 260
7443B60Rj04k03m7R9j19K6j6j46Q1M98q1l23Q2q4r5K28p8O2K8j82J52Q2l20J39
$$ 260 269 165 -38 -85 14 -105 -79 -95 -241 -160 338 257 -66 16 -68 -163 65 -13 49 77 -105 47 129 -191 -52
7468e2KJ19j65j41K66J02r7M9k60K44q9l3R7l2m5J42J0k31K18j99J1j8j66K69
$$ -52 -50 69 -96 -237 29 131 34 83 -177 67 -22 -55 42 10 -35 107 117 -114 104 -95 -84 -102 -268 1
7492AK0r4r4K55O6k39J96Q0k22k37L08Q9J93l18N4n7M33o50K35m1k07J29J47j51
$$ 1 21 -73 -167 88 154 -85 111 191 -31 -268 40 129 322 4 58 1 434 -216 19 -22 -229 -100 47 -104
7516a04J04m7J62l28Q6K9j1m1j02L1M73k83l4P4k15R5O2r1L85r2m07K87J52l45
$$ -104 0 -47 115 -213 -127 -98 -109 -150 -252 -221 252 -31 -65 9 -206 -111 -49 -140 245 153 -254 33 185 -160
7540a60L49j05J28l36k7J66Q6k62K70k42K72l95K01J38j08j84J67J65k86J31J85
$$ -160 189 84 212 -124 -151 15 101 -161 109 -133 139 -256 -55 83 -25 -209 -42 123 -163 -32 153
7561A53k34J97j1J05l15N2O7k4l4M08l99j28L0J30M07n52mk2J62K1p0j83M0L2
$$ 153 -81 116 105 210 -105 -53 14 -10 -44 364 -35 -163 -133 -3 404 -148 -152 -174 -12 9 -61 -244 -204 -172
7585a72J19k43M56j39l7K4j05J33j99Q6J96k11J8j04r0K21RN4N2l8M8p6J23r6
$$ -172 -53 -296 160 21 -16 8 -97 36 -163 -77 119 -92 -74 -178 -268 -47 -38 16 68 30 78 2 125 29
7609B9L8K4o9P4k78r1K71P0m0K15k31J1r4K58l9k29L29k28k74J76k2R0j37k37
$$ 29 67 91 22 96 -182 -273 -2 68 28 243 12 23 -71 187 148 -81 248 20 -254 -78 -100 -10 -147 -384
7633c84M52l6j86J41J27K04l96K17L1Q0j17L8k2j87k25K59J05r4K21q3m03K75
$$ -384 68 32 -154 -13 114 318 -78 139 170 250 133 171 149 -38 -263 -4 101 7 228 145 -258 17
7655A7Q0j93K85k51j58K97l53J42J01M2L0J38m7q8Qk01K10j31J76j45l8K04j60
$$ 17 97 -96 189 -62 -220 77 -276 -134 -33 9 39 177 130 42 50 -151 59 -72 104 -41 -79 125 -35
7678c5J07J00k87K06O5j4m77J24k3L57J2k42o8m1R2M30j29l74J50j87J05M07k56
$$ -35 72 172 -115 91 156 142 -335 -211 -234 123 135 -107 -175 -216 -124 306 177 -197 -47 -234 -129 278 22
7701B2j73O7K43q4j80M0j4L04j50j19J64K14j82j65n4K79l86L4L57k08J98k14
$$ 22 -151 -84 159 75 -105 -65 -79 225 75 -44 120 334 152 -13 -67 212 -174 -140 217 9 207 -7
7723gj56M08j44j43J21j64K51J1m14J75j49R6k5J96J27k12o8P5J44r9k44Q0L82
$$ -7 -163 245 101 -42 79 -85 166 177 -237 -62 -211 -115 -140 56 183 -29 -97 -22 122 23 -221 -141 241
7746B41l32KJ22J03k74O1rM0K27r4p3j98K27Nk27J44o1R7k49q4M02j49L21l42
$$ 241 -91 -89 33 136 -138 -77 -86 -46 181 87 14 -184 43 48 -179 -35 -96 1 -248 -332 70 -79 242 -100
7770a00k2K8K20k9r9j24L46L0l99P2j0l5J44mR4j90k3L36l18R8l6j83J00pj31
$$ -100 -122 -94 126 97 -2 -126 220 250 -149 -77 -87 -122 22 18 112 -78 -101 235 -83 15 -21 -204 -104 -111 -242
7795b42K79j73m5J12j92J72k8P6J03l70K80R3nm6j7Q8l15L35j5R6j17j72J49J88
$$ -242 37 -136 -181 -69 -261 -89 -117 -41 62 -308 -28 65 60 14 -3 85 -230 105 90 186 69 -103 46 234
7819B34k73L96%m22R4k6L8P1J12l75K38j27J1K4k62L72R0j03MK6k39K03Jp4k0
$$ 234 -39 357 357 -65 29 3 41 112 224 -151 87 -40 -29 -5 -267 105 195 92 96 122 -117 86 87 13 -7
7844gl9L5K4P8k02q3J25%J26k5Q7k09L9L15k31j81K93k33K50oj07l14L34j76N5
$$ -7 -46 -11 13 91 -111 -194 -69 -69 57 32 119 -90 -51 264 33 -148 145 -88 162 156 49 -265 69 -107 -52
7869e2J71%j39K20k51R3J18j18K15l15M3R3j85KJ16N5r8o5K80l41P3k05M95j2
$$ -52 119 119 -20 200 -51 42 160 42 257 -58 -15 78 -107 -105 11 66 -32 -97 183 -158 -85 -290 205 193
7893A93j21l5o8n5PK93j51J9k39M7Q8j94N25n47MQ2M0N2j8J77l68K63r8J74q1
$$ 193 72 37 -31 -86 -79 214 63 82 -157 -110 -22 -216 309 -238 -234 -152 -112 -60 -78 99 -269 -6 -104 70 -11
7918a1K6j40R2m6k34L03j0r5N6j02Q1o2Q6j01K03j9k50J83J42l10R7j0K64l20
$$ -11 15 -125 -33 -79 -313 -10 -20 -115 -59 -161 -80 -142 -56 -157 46 27 -223 -40 102 -208 -111 -121 143 -177
7942a77L8j00L55o2j69J05Q1o4L6q4J33m28M48q6m38Q24k38k35J79l99M44j62
$$ -177 -139 -239 116 54 -115 -10 71 7 43 -41 92 -336 112 26 -412 412 174 -61 118 -281 163 1
7964Ak37L13j69j22J83Q4jj23J52K19m0k63J77j41j70K28j45P1j21M3J75j7k9
$$ 1 -236 77 -92 -214 -31 53 52 -71 81 300 260 -3 174 33 -137 91 -54 17 -104 -61 114 97 68
7987F8j34K71n01K8L90k18N6J75r4r8J53j94K69k68L41k57J09m8j35p7J24j39
$$ 68 -66 205 -296 -268 122 -96 -40 135 41 -57 96 -98 171 -97 244 -13 96 48 -87 -164 -40 -179
8009a79L51p9k04L66k22p1L00k73k12K44K12j52j31j50K96j49N5r5l6L35k86J34
$$ -179 172 93 -111 255 33 -38 262 -11 -223 21 233 81 -50 -200 96 -53 2 -93 -129 206 -80 54
8031E4Kk07j3K43k27J18n0K1l2R4J56k95k12L77K28j64q0J57l30J97j59j77O0
$$ 54 56 -151 -164 79 -148 -30 -80 -59 -91 3 159 -136 -348 29 257 93 13 170 -160 37 -122 -299 -239
8054b39n5J55K35j65J24j50J73q4O8m3L0k27K16J29j7l1K3k97J2K68k0R3l74O5
$$ -239 -294 -139 96 -69 55 -95 78 -6 62 19 49 -178 38 167 150 119 142 -155 -143 125 105 198 -176 -111
8078a11O9J08O7j24P9J49j90J9j08m4Q5Jk1r1L00j13j24kJ88j89J32J2j52O2l12
$$ -111 -42 66 133 9 88 237 47 66 -42 -86 -1 0 -21 -112 188 75 -49 -51 137 -52 80 92 -60 2 -310
8103c10Q7K55q5J52q0M6l12J65L95m84N9J04J9l9K74m13K90l6J7K4l36L33k00
$$ -310 -223 32 -53 99 19 65 -247 -82 313 -171 -112 -8 11 -28 246 -167 123 87 104 128 -208 125 -75
8126g5J62Qm1k04K73J0k30j9J53Q2l22N3j6L44J1k97qL49k04Q6k02p6R8Q2J40
$$ -75 87 95 54 -150 123 133 -97 -116 37 119 -203 -150 -166 178 189 -108 -116 233 29 115 -87 -163 -65 17 157
8151A57j14l02J78J86k23L09k43M0j56J31L5q0rJ56j08kO1J36j20K6n4J55j0j46
$$ 157 43 -259 -81 105 -118 191 -52 -12 -168 -37 -2 -82 -91 65 -43 -45 16 152 32 58 4 159 149 3
8175CN5J40j68r9J4P6N3O0r5Q6m2J16j07n7lO6
$$ 3 58 198 30 -69 -55 21 74 134 39 125 83 199 92 35 32 98
8191I8
$$ Imaginary data points
##PAGE= N=2
##DATA TABLE= (X++(I..I)), XYDATA
0@%%%%%%%%%%%Qj6J6j6J6k4L2m0M8n6P2q8J03j19J36j53J77k08K40k72L11l55
$$ 0 0 0 0 0 0 0 0 0 0 0 0 8 -8 8 -8 8 -16 16 -24 24 -32 40 -48 55 -64 72 -81 96 -112 128 -144 167 -188
33a88M01m54N12n75O44p20Q04q96R97j106J225j355J498j655J825k011K215k439
$$ -188 213 -241 271 -304 340 -380 424 -472 525 -581 644 -711 787 -868 957 -1054 1161 -1278
51a278K687k960L263l605L988m422M919n494O167o967P942r158J0720j2812J5777
$$ -1278 1409 -1551 1712 -1893 2095 -2327 2592 -2902 3265 -3702 4240 -4918 5802 -7010 8767
66H767k0333K8296m6189J61283J2865j82644R4523q1822K4330M5784m42J7307
$$ 8767 -11566 16730 -29459 131824 144689 -37955 56568 -25254 -924 44860 44418 61725
78F1725L2590n7388k1988k3933l7663N4739k756j5137M7920n1967K1028J0571
$$ 61725 94315 36927 14939 -8994 -46657 8082 5326 -9811 38109 -13858 7170 17741
90A7741m9492k1900K3579K1193k2716K3151l246k122K9832m4167j0165J689J6112
$$ 17741 -31751 -53651 -30072 -8879 -31595 -8444 -11690 -13812 16020 -28147 -38312 -36623 -20511
103b0511J7821j5427O274J6485k040l7126K1975j2612l0104P0274k2512j1056
$$ -20511 -2690 -18117 -11843 4642 2602 -34524 -12549 -25161 -55265 15009 -7503 -18559
115a8559L1305l0977Q094N933k0808l584L3187Q790q563o578j0047L7111l1399
$$ -18559 12746 -18231 -10137 -4204 -25012 -28596 4591 13381 4818 -1760 -11807 25304 -6095
128f095p866M3935l0230J4216J6723j6186k775J2163N790j5773J2570k1152K765
$$ -6095 -13961 29974 -256 13960 30683 14497 11722 23885 29675 13902 26472 5320 8085
141H085K1690j5384R040j3875L038M122j8429r53L528J1400p816J0800k5394j4880
$$ 8085 29775 14391 23431 9556 12594 16716 -1713 -2666 862 12262 4446 15246 -10148 -25028
155b5028M0130l0115Q4J7762j3241L261j619M833j2928N130J1067O975j1324k1257
$$ -25028 15102 -15013 -14929 2833 -10408 -7147 -8766 -3933 -16861 -11731 -664 6311 -5013 -26270
169b6270L4679j1893m368J3986k7881K0005P765j5036p320J2936P570j3598J6259
$$ -26270 8409 -3484 -7852 6134 -21747 -1742 6023 -9013 -16333 -3397 4173 -9425 6834
182F834j8186p91J2716l835R040k3743J4597J2205j2848K9n574P735J111J6227
$$ 6834 -11352 -12143 573 -3262 5778 -17965 -3368 8837 -4011 -3982 -9556 -1821 -710 15517
196A5517j8976q229L1843j9767O920l256j0148K0003k644m730j3299J0081N530
$$ 15517 -3459 -11688 20155 388 7308 4052 -6096 13907 11263 6533 -6766 3315 8845
209H845j170l712r782J9927j8133P543J1445l1303J9885J1530j0511j5988M677
$$ 8845 7675 3963 -5819 14108 -4025 3518 14963 -16340 3545 15075 4564 -11424 -6747
222f747J3694p440O144j4386R249N305q556Q517j6471J7211M868j2607N426q176
$$ -6747 6947 -493 5651 -8735 514 5819 -2737 5780 -10691 6520 11388 -1219 4207 -3969
236c969J753L082J2469k0534k551K4538k2113O382j185m402J0898l070J934j5626
$$ -3969 -2216 866 13335 -7199 -9750 14788 -7325 -943 -2128 -6530 4368 1298 3232 -12394
250a2394N634Q384j116p168n808J9804j6714M335M811j7520K1204k18n966k948
$$ -12394 -6760 1624 508 -6660 -12468 7336 -9378 -5043 -232 -17752 3452 3234 -2732 -5680
264e680L854Q3m308J3828j2811K382K679J922L374k3109K0673O891j2362N664
$$ -5680 -1826 -1743 -6051 7777 -5034 -2652 27 1949 5323 -17786 2887 9778 -2584 3080
278C080j922j381k575J3508j2205p9J2833j5131J1747p733m306Q073J09P746j2724
$$ 3080 1158 -223 -2798 10710 -1495 -1574 11259 -3872 7875 142 -4164 3909 4018 11764 -960
293i60K216L507P72k250o96R533j8178J6443J830k5416J4079N178R1p640K541
$$ -960 1256 4763 5535 3285 2589 12122 -6056 10387 12217 -13199 880 6058 6149 -1491 1050
308A050j71o667J0795q113L479m762M762P914k2847R681j72r31J0119q870n961
$$ 1050 879 -5788 5007 -3106 373 -4389 373 8287 -14560 -4879 -5051 -5982 4137 -4733 -10694
323a0694K058J4443j6190k57J3605r286J1132r479k36q23j594J6121j1329m145
$$ -10694 -8636 5807 -10383 -10640 2965 -6321 4811 -4668 -4904 -5727 -7321 8800 -2529 -6674
337f674N993N825p681m108J0671r359J6102j534j7833J1223j395N137m940J009
$$ -6674 -681 5144 -2537 -6645 4026 -5333 10769 9235 -8598 2625 1230 6367 1427 2436
351B436K32k195R088j2251J052j119J4232J736k2498J4313k31n576N794j436l611
$$ 2436 2668 473 9561 -2690 -1638 -2757 11475 13211 -9287 5026 4795 -781 5013 3577 -34
366c4r57J2596j4065n181O958l74J1869j4262Q99K700k332P098j1328L102L363
$$ -34 -991 11605 -2460 -7641 -683 -1057 10812 -3450 -2551 149 -2183 4915 -6413 -3311 52
381E2M244p323l048M547j0842J8123k186j4182R059q8K856p821K064M822o77L575
$$ 52 4296 -3027 -6075 -1528 -12370 5753 3567 -10615 -1556 -1644 1212 -6609 -4545 277 -400 3175
397C175p802K413o532R738M980j4742J1879m298j26M269n020Q9K968J0658j2640
$$ 3175 -4627 -2214 -8746 992 5972 -8770 3109 -1189 -1315 2954 -2066 -1977 991 11649 -991
412i91K53L627m830P383o581O635m845l707J1414r925p13L095O600n174j964M491
$$ -991 -738 2889 -1941 5442 -1139 5496 651 -3056 8358 -1567 -2280 815 7415 2241 277 4768
428D768j1554J0889k690l660O623p439N021l224Q72k768Q40Q848o415L90n333
$$ 4768 -6786 4103 1413 -2247 4376 -3063 1958 -1266 -394 -3162 -2322 6526 111 501 -4832
443d832P129J86r575J3784r535M39N824m251l093k932J1317l606m83l326o33P892
$$ -4832 2297 2483 -7092 6692 -2843 -2404 3420 -831 -3924 -6856 4461 855 372 -2954 -3587 4305
459D305r688O515l191j823R128p485j022j365N180r20K207j040r702J4277k482
$$ 4305 -5383 1132 -2059 -3882 5246 -2239 -3261 -4626 554 -366 1841 801 -8901 5376 2894
474B894n479K728j653Q432o687L42k393j100P507j818r33q081R878J230o977N758
$$ 2894 -2585 143 -1510 6922 235 577 -1816 -2916 4591 2773 1840 -6241 3637 4867 -2110 3648
490C648r012P946N053p877m577J399R574q062K586j570l119P870m848L404q248
$$ 3648 -5364 2582 7635 -242 -4819 -3420 6154 -1908 678 -892 -4011 3859 -989 2415 -5833
505e833M080J1845r056l722k13O824l109K16P13p334J0647m987j149M40l097J0237
$$ -5833 -1753 10092 1036 -2686 -2899 3925 816 1032 1745 -5589 5058 71 -1078 -638 -3735 6502
521F502n002j115l519j68O476k307j878m989J0557n346o188R215q441N205L467
$$ 6502 1500 385 -3134 -3302 3174 867 -1011 -6000 4557 -789 -6977 2238 -6203 -998 2469
536B469k099m200j234R529o164J184o83K54K977n105M682o352M561N236o774K957
$$ 2469 370 -3830 -5064 4465 -1699 -515 -1198 -944 2033 -3072 1610 -4742 -181 5055 -1719 1238
552A238k037K462k141L772j126p113J1175n199j829P5p01O259o387L164j95k468
$$ 1238 -799 1663 -478 3294 2168 -4945 6230 1031 -798 -723 -1424 4835 -1552 1612 1417 -1051
568a051J008J951J846p924Q977j889l479M382q981O168J286j231j052k133N221
$$ -1051 -43 1908 3754 -4170 4807 2918 -561 3821 -5160 1008 2294 1063 11 -2122 3099
583C099n429K609n5p20O14l4N122j2922L895O948n430J964j669J109m113M364
$$ 3099 -2330 279 224 -496 118 84 5206 -7716 -3821 3127 -2303 -339 -2008 -899 -5012 -648
599f48N14p040Q100l97K050m750l969P041j648L820m606p59K127RQ26n531P986
$$ -648 -134 -7174 926 529 2579 -2171 -6140 901 -747 3073 -1533 -2292 -165 -156 670 -4861 3125
616C125k084N95M152j0028L558J690M252k323o108N904n65L01m962K484J938m67
$$ 3125 1041 1636 5788 -4240 -682 1008 5260 2937 -3171 2733 2168 2469 -2493 -9 1929 1462
632A462N700j0497K581M133k556K574l680J857k056M409k795p634Q127m11J530
$$ 1462 7162 -3335 -754 3379 823 3397 -283 1574 -482 3927 1132 -6502 1625 1214 2744
647B744m455k77L576m543N453l721k054L390K726k337q279P021j6O28M10o284
$$ 2744 -1711 -1988 1588 -2955 2498 -1223 -3277 113 2839 502 -7777 -756 -772 -144 266 -6018
663f018P101l148K71l74j008M303j710K588n155K28O42K059M726j0257N442K568
$$ -6018 1083 -2065 -1794 -2168 -3176 1127 -583 2005 -3150 -2922 -2280 -221 4505 -5752 -310 2258
679B258l221L33k182N596j821K215j456m104L869j164L624m533J157L419n021
$$ 2258 -963 -630 -2812 2784 963 3178 1722 -2382 1487 323 3947 -586 571 3990 -1031
694a031M072l754L71K950J330n79m989N492n053K569L229o175L040j437K484l783
$$ -1031 3041 -713 -342 2608 3938 3359 -1630 3862 -1191 1378 4607 -1568 1472 35 2519 -1264
710a264j773M726j607J495k922J943j829r08M692n412L780k530n67M213n410J98
$$ -1264 -3037 1689 82 1577 -1345 598 -1231 -2139 2553 -2859 921 -1609 -2176 2037 -3373 -3175
726c175o9M896j544l596L177k212L185l131K738M9m282O614l255k743M44L578
$$ -3175 -3244 1652 108 -3488 -311 -2523 662 -2469 269 318 -3964 2650 -605 -3348 -2904 674
742F74J198m187L604m130K837K186l345K303k745M752j644k899J174j515N103
$$ 674 1872 -2315 1289 -2841 -4 2182 -1163 1140 -1605 3147 1503 -1396 -222 -1737 3366
757C366j742j268k594L537L321p825N292k26j018K789k867O1k873N067m59l062
$$ 3366 1624 356 -2238 1299 4620 -3205 2087 1861 843 3632 765 826 -2047 3020 2561 -501
773e01J29j165N229m204J97k92j81O107o091j185J103K317k53l049L522m415L194
$$ -501 -372 -1537 3692 -512 -315 -607 -788 5319 -772 -1957 -854 1463 1210 -1839 1683 -2732 462
790D62J306m179R43l35N939m191k785K875r35K509k277J225l693K680L697p290
$$ 462 1768 -2411 -1468 -1803 4136 -55 -2840 35 -900 1609 -668 557 -3136 -456 3241 -4049
806d049K656q11K638J539m654R62m70M667l286j690K554o55J447l751L155j524
$$ -4049 -1393 -2204 434 1973 -2681 -1719 -2189 2478 -808 -2498 56 -599 848 -2903 252 -1272
822a272j662O690l714j664j06L752l70l063L232k600L076j059j719J086j968M929
$$ -1272 -2934 3756 42 -1622 -1728 2024 1654 -1409 1823 -777 2299 1240 -479 607 -1361 3568
838C568l187q27J720k011K277j194J966l227K669J846n450L623j867O90K73j36
$$ 3568 381 -446 1274 -737 1540 346 2312 -915 1754 3600 -1850 1773 -94 596 869 733
854G33J333m772L730l16r32k43K71L469n010K803j480j469L884l161J562j538
$$ 733 2066 -2706 1024 708 -224 -467 -196 3273 -1737 1066 -414 -1883 2001 -1160 402 -1136
870a136M31n78o17L259m830L023J197p44j653k285N697l247K16J861k651P20m14
$$ -1136 -705 -1283 -1900 1359 -3471 -448 749 5 -1648 -3933 1764 -1483 -1267 594 -2057 -1337 -1751
887a751K673m321K117L426l002J294l169K622R74o63J408l604L335j091J8j057
$$ -1751 922 -3399 -1282 2144 -858 436 -2733 -111 863 200 1608 -1996 1339 248 266 -791
903g91p15L606j903K989m650r94N614j864l6k269K932J8j973J150l061L464k24
$$ -791 -1506 2100 197 3186 -1464 -2458 3156 1292 1256 -1013 1919 1937 -36 1114 -1947 1517 1293
920A293Q25j261l496N070j939Q68j014r01L142j248R1m730L381K272k998J231
$$ 1293 2118 857 -2639 2431 492 1360 346 -555 2587 1339 1430 -3300 81 2353 -645 586
936E86k570J897k71M13M02l846M518J75j293k654L93L400k971K478k562n4K418
$$ 586 -1984 -87 -358 55 457 -3389 1129 1304 11 -2643 -2250 1150 -1821 657 -1905 -1959 459
953D59k686J487j424J967N99n1l43l268L869n25L69r19j138M088m359J270Q15
$$ 459 -2227 -740 -2164 -197 402 351 8 -3260 609 84 453 -466 -1604 2484 -1875 -605 210
970B10r53J859m94J234l430J610J236j144J227k468L129j523j060J465k381L329
$$ 210 -743 1116 622 1856 -1574 36 1272 128 1355 -1113 2016 493 -567 898 -1483 1846
986A846j247M54n64m27J236k148L432l046M46K314j999J65j860K467o03p06J674
$$ 1846 599 1053 489 62 1298 -850 2582 -464 -18 2296 297 462 -1398 1069 466 -240 1434
1003A434k521J512j324J828n49j199K660k726K174j914j825K343j78R52k834K416
$$ 1434 -1087 425 -899 929 380 -819 1841 -885 1289 -625 -2450 -107 -285 667 -2167 249
1019B49r45j030L134k914J457j122K079N64m438K784k48J374j628M5O23k108L505
$$ 249 -696 -1726 1408 -1506 -49 -1171 908 1472 -2966 -182 -430 944 -684 -639 -16 -2124 1381
1036A381k409M23Q72l39K341l361R05m92J436J167l442J539m53J769k242k46K802
$$ 1381 -1028 -605 267 -72 2269 -1092 -187 -679 757 1924 -1518 21 -432 1337 -905 -1151 1651
1053A651k892L098m64k295J67J768J604l649J549k04J53J153k863J725n58J853
$$ 1651 -1241 1857 1393 -902 -735 1033 2637 -1012 537 333 486 1639 -1224 501 -57 1796
1069A796n46k636K292p47R81p49l91J68o98K834l886J78J323L21O04l020K363
$$ 1796 1250 -1386 906 159 1140 391 0 168 -530 2304 -1582 -1404 -81 240 844 -2176 187
1086A87p91J03R52j270O44j182K952k401j544K700q81J424k088l9R60K17Q19k839
$$ 187 -604 -501 451 -819 -175 -1357 1595 -806 -2350 350 -531 893 -1195 -1234 -274 -57 762 -2077
1104b077K744n86j30Q41j747J128j578L005p54k941K617m87M13j528J577L79j175
$$ -2077 667 81 -49 792 -955 173 -1405 1600 846 -2095 522 35 448 -1080 497 876 -299
1121b99K202k751Q30kM13J304k791J833j145Q95r2j171J777j210J863j706j98
$$ -299 1903 -848 -18 -20 393 1697 -1094 739 -406 489 397 -774 1003 -207 1656 -50 -248
1138b48J441k305K485q64J84j438K37J962k472J216m81J006l53j459K291k680
$$ -248 1193 -1112 1373 509 693 -745 -508 1454 -1018 198 -283 723 370 -1089 1202 -1478
1154a478J840L86j453J416j688R33n36P94q35n05K879k502L65k13L90R43j713
$$ -1478 362 748 -705 711 -977 -44 -580 214 -621 -1126 1753 -749 -384 -597 -207 736 -977
1171i77K358k322K48J303q44m02r33K641j102j94j45o86K221j534P94l37q26J757
$$ -977 1381 -941 -693 610 -234 -636 -1569 1072 -30 -224 -369 -1055 1166 -368 426 89 -737 1020
1189A020j563Q34j540J343J293j271K24k301K933j22j475J360r37J747j545K84
$$ 1020 -543 291 -1249 94 1387 116 340 -1961 972 850 -625 735 -202 1545 0 284
1205B84m88o51K669j593L36j753J176J304k007J124j239J825K23j751M21o77K090
$$ 284 -204 -855 1814 221 557 -1196 -20 1284 -723 401 -838 987 1210 -541 -120 -797 1293
1222A293j734Q42l57j730K573j217P5r60J093J868k589P18q66J935m46q52J064
$$ 1293 -441 401 44 -1686 887 -330 -255 -1215 -122 1746 -843 -125 -991 944 498 -354 710
1239G10j902J914q73n60M69q43K359r96j36j261N31J630j971J264o64L59L68j818
$$ 710 -1192 722 -151 -711 -242 -1085 1274 278 142 -1119 -588 1042 -929 335 -329 30 398 -1420
1257a420J760j071P00O60m13j40j120J850j502J289p61j42J398k503J460n38O22
$$ -1420 340 -731 -31 629 216 76 -1044 806 -696 593 -168 -310 1088 -1415 45 -493 129
1274A29O13j051J376j879J091J14l01O78j395K422j624n85Q98r01P93q83J645
$$ 129 742 -309 1067 -812 279 393 92 770 -625 1797 173 -412 486 -415 378 -505 1140
1291A140j218m31J011j141J442j452Q90M64r56R59j745J491o99K55L77r96P82
$$ 1140 -78 -509 502 -639 803 -649 241 705 -251 708 -1037 454 -245 10 387 -609 173
1308A73j554J945l22j627K083l66J74j714K67J988j025L53q09O59q72O89N76j789
$$ 173 -1381 564 242 -1385 698 332 506 -1208 -941 1047 22 375 -434 225 -647 42 618 -1171
1326a171J369j0M38k18j348J417m71J100j621L32Q31q33R57j525J028K4L59O24
$$ -1171 198 188 626 408 -940 477 6 1106 -515 -183 648 -185 772 -753 275 299 658 1282
1344A282k436J185O76J07p21p24J583j451J179p44q06J139l47J182j872J35P79
$$ 1282 -1154 31 707 814 93 -631 952 -499 680 -64 -870 269 -78 1104 -768 -633 146
1361A46o8N85j578P95J00N60n11j603J950m97j60J50o71R47o56J188j050n22J222
$$ 146 78 663 -915 -120 -20 540 29 -1574 376 -121 -281 -131 -802 145 -511 677 -373 -895 327
1380C27j36L48j647J089J90k27M38j324J313m73L88l03j61R24r90P44p68l20J217
$$ 327 191 539 -1108 -19 171 -56 382 -942 371 -102 286 -17 -178 746 -244 500 -268 -588 629
1399F29m97O87j665O65O92r59P32l85M65o36O79l8j306J431n15P37j076M2Q97
$$ 629 132 819 -846 -181 511 -448 284 -101 364 -272 407 369 -937 494 -21 716 -360 -318 579
1418E79j068O40p11N68L36m83K47o11P72q27M94P26j303P58m52L95k69n19J140
$$ 579 -489 151 -560 8 344 -139 108 -503 269 -558 -64 662 -641 117 -335 60 -209 -728 412
1437D12j088J084p67K08J63o85J671j400P27m15j92R29j333P27l33Q10j96r37
$$ 412 -676 408 -359 -151 12 -673 998 -402 325 -90 -282 647 -686 41 -292 518 322 -615
1455f15Q46r75J050K82n13L36p08J104j011K45m64L92P26j226N88p34N17Q18j068
$$ -615 231 -744 306 588 75 411 -297 807 -204 41 -423 -31 695 -531 57 -677 -160 658 -410
1474d10P33n68N03M25n86j03m65J769j439m08N29l69Q06r70N10l20J17O43p06
$$ -410 323 -245 258 683 97 -6 -471 1298 -141 -549 -20 -389 417 -553 -43 -363 -246 397 -309
1493c09K21p11J226O5j037L82k94J059r13k90M03j36R73r45O2J4K04O98q65N88
$$ -309 -88 -799 427 492 -545 -163 -457 602 -311 -601 -198 -334 639 -306 -244 -230 -26 672 -193 395
1513C95p97Q25M36j664P04K12Q10j151k08N74l26P45n24J09j1n0L49j238P75j88
$$ 395 -402 423 859 -805 -101 111 921 -230 -438 136 -190 555 31 140 129 79 428 -810 -35 -223
1533b23K83N56j051K38k15P42l80m38J026j046Q93m41O2j47m60J686j475J4J95
$$ -223 60 616 -435 -197 -412 330 -50 -488 538 -508 385 -56 6 -141 -601 1085 -390 -376 -181
1552a81K06K47p99J156p57K61M01j068O58n17R17l33k03J00p47J117p88L71J19
$$ -181 25 272 -527 629 -128 133 534 -534 124 -393 524 191 -12 88 -659 458 -330 41 160
1571A60J65L12j275J098m05k65Q05n91M64j174Q96l03m13Q53o17R26q73K21nl62
$$ 160 325 637 -638 460 55 -210 595 4 468 -706 190 -113 -526 327 -290 636 -237 -16 -21 -383
1591c83R11r23N70o24J08L34o6M74j315Q81M66o60M96r24Q37l01J73M02p76N67
$$ -383 528 -395 175 -449 -341 -7 -73 401 -914 -33 433 -227 269 -655 182 -119 54 456 -320 247
1611B47m01O44p67n3Q59m63L04m62J26L62j84K18n36M58j90j80K43q93R66r9L92
$$ 247 -154 490 -277 -330 529 66 370 -92 34 396 212 430 -106 352 162 -18 225 -668 298 199 591
1632E91j037p5J231q22J43o56P23K26l25L53j155R46K82j22k83p89Q83j25K26
$$ 591 -446 -521 710 -112 31 -625 98 324 -1 352 -803 143 425 303 20 -769 114 -11 215
1651B15p55j53J357m76j86o42M78O88p02L42q99M64L55j78J21q06R06P0k68n16
$$ 215 -540 -693 664 188 2 -640 -162 526 -176 166 -733 -269 86 -92 29 -777 129 199 -69 -585
1671e85L39O66m61N48m90l50P19r05Q55o24N08K80m12J70p11R39k7k20m04O2N38
$$ -585 -246 420 -41 507 17 -333 386 -519 336 -288 220 500 88 258 -453 486 459 239 -165 -103 435
1692D35n56J96Q3m01N01l47L42o32M4O49n30N52r34Q54j49l90N15l05L48n36K02
$$ 435 -121 75 158 -243 258 -89 253 -379 -335 314 -216 336 -598 256 107 -283 232 -73 275 -261 -59
1713e9K12l78K87o30R20l86j03O95p03P8j88L62J6m19M45m11L14l64M18J77m82
$$ -59 153 -225 62 -568 352 -34 -137 558 -145 -67 -255 107 123 -296 149 -262 52 -312 106 283 -199
1734a99N02q19N26K08l83K68j38L90n21K76l77j47J096q47K26n4K77j76m67L45
$$ -199 303 -516 10 218 -165 103 -35 355 -166 110 -267 -414 682 -165 61 7 284 108 -359 -14
1754a4j48M28j10m17J68m73Q38l18N9O7l39Q21n99r2J71K36j01r36J119l63P1
$$ -14 -162 266 156 -261 -93 -566 272 -46 13 80 -259 562 -37 -129 42 278 177 -759 360 -3 68
1775F8K79p33L23p3M36j43l83K26J16L36q72M17O5j03N07p95L43P6j40K64p95
$$ 68 347 -386 -63 -136 300 157 -226 0 116 452 -420 -3 62 -41 466 -329 14 90 -50 214 -581
1796e81N27j72O52j41m83K08q1M71q28M65K19p01Q54p77L19o8j45N95l95K65k50
$$ -581 -54 -226 426 285 -198 10 -71 400 -428 37 256 -445 409 -368 -49 -117 -262 333 -62 203 -47
1817d7L78k84n65N89J06m5l85j48K87k92L80l7L51j91j69M94o94K29m9M77l04
$$ -47 331 47 -518 71 177 132 -253 -401 -114 -406 -26 -63 288 97 -72 422 -272 -43 -92 385 81
1838H1k70N69p56M63j64K34l3j56M39j83k73J21K7J38l18J62k93p4L20m43L45
$$ 81 -189 380 -376 87 -77 157 124 -32 407 224 -49 72 99 237 -81 81 -212 -286 34 -409 -64
1859f4K37l62P9k22M26m04N34k57P8J13l71J52m52P05k67q5M38m80Q2j30L52J41
$$ -64 173 -189 -110 -332 94 -310 224 -33 45 158 -213 -61 -513 192 -75 -160 278 -202 -120 -250 102 243
1881B43k91k2m55Q75n5l25mk33P78p54L36k05k19M20j81O80r76L16N12m65j18
$$ 243 -48 -70 -525 350 295 -30 -34 -267 511 -243 93 -112 -331 89 -92 588 -388 -72 440 -25 -143
1902a43K60L48l6m15j25m54R59j78P0j23k67L18k87L4m20L50M43k82k82QK61N7
$$ -143 117 465 429 14 -111 -565 394 216 286 163 -104 214 -73 -39 -459 -109 334 52 -230 -222 39 96
1924I6k58K8K47l6m11M91K2o73P67l55N5n1k49N05l84L40k25j20K53k88M55l45
$$ 96 -162 -134 113 77 -334 157 179 -494 273 -82 -27 -78 -327 178 -206 134 -91 -211 42 -246 209 -136
1946a36M84m53J6p6k82O55N6l84P5o0O39p37J22J62On6k45N55o22L68Q0k91M25
$$ -136 348 -105 -89 -165 -447 208 264 -120 -45 -105 534 -203 -81 81 87 31 -214 341 -281 87 167 -124 301
1969C01n53P45n68Mq3O3L29l72P1j6R0qp9Q2k44M30j56j85J55j65M94m59q3L75
$$ 301 -252 493 -75 -71 -154 -91 238 -134 -63 -79 11 3 -76 6 -238 192 36 -149 6 -159 335 -124 -207 168
1993A68l59N04m10L08j57R3J26k88J49l26l5Q8pL80l60J59K22m97N16j48k9l9
$$ 168 -191 313 -97 211 54 147 273 -15 134 -192 -227 -139 -146 234 -126 33 255 -242 274 126 97 58
2015E8J93j46k71L39O4j80j32m3K43l00K55m31M81J9k82M56m91M10n33N51k55
$$ 58 251 105 -166 173 237 57 -75 -118 125 -175 80 -351 130 149 -133 323 -168 242 -291 260 5
2036En74Q86j81j54M8l6K49m14M16k49J31o3j25J87l23M58l94L52j77n27N42J92
$$ 5 -569 317 136 -18 30 -6 243 -171 245 -4 127 64 -61 126 -197 261 -133 219 42 -485 57 249
2058B49Rk46K3m8k51M74l0j36J08k69L44n88J0P73k16l03l8L73j96o5Q7k79K64
$$ 249 258 12 35 -13 -264 210 180 44 152 -117 227 -361 -351 422 206 -97 -135 238 42 -23 64 -215 49
2081D9j76K82n02L40J92j99J10m33J58J45j37J43k27M26j66j20L26n07J16%K88
$$ 49 -127 155 -347 -7 185 -14 96 -337 -179 -34 -171 -28 -255 171 5 -115 211 -296 -180 -180 108
2102A08k16K6J52j0k4k21L35j84K55p7l55M1J6O6J45n16O26n72N07k88L01N3P2
$$ 108 -108 -82 70 60 36 -185 150 -34 221 144 -211 -170 -154 -88 57 -459 167 -405 102 -186 115 168 240
2125B40j00k57Q7L99m38N0QJ45j85P8J74q9n4k05M0L82n74M32k04j73L37n4J43
$$ 240 140 -117 -30 369 -69 -19 -11 134 -51 27 201 112 58 -147 -107 275 -299 133 -71 -244 93 39 182
2148A82l69K55L7p4o0J02L43n04N6Rj55K13k7J92m25J78K63m15J19l24M42P4k78
$$ 182 -187 68 105 31 -29 73 416 -88 -32 -23 -178 35 8 200 -225 -47 216 -199 -80 -404 38 112 -166
2171a66P7Pj4k12J31M5k3K37M9r5j30J9L28l59K85l89O27m61l76N85k36J94m49
$$ -166 -89 -82 -96 -308 -177 -132 -155 82 131 36 -94 -75 253 -106 179 -210 417 -44 -420 165 -71 123 -326
2194c26N55j11l5J71m47K32k7p3K79l36L59l63M65o05J84M6o6J6M27j73l58J84
$$ -326 229 118 83 254 -193 39 12 -61 218 -118 241 -122 343 -262 -78 -32 -98 -82 345 172 -186 -2
2216bN3R3j75r7J95K10l45l2n8L12j91L51j12k27J44j57j92J13J74J42j45P0n1
$$ -2 51 144 -31 -128 67 277 -68 -100 -158 154 -37 314 202 -25 119 -38 -230 -117 57 199 54 124 73
2239G3k34M07o58L77l5L29m41r2K60K7R9j2l5J50l79K98k06q4K26pK45p15L93
$$ 73 -161 246 -412 -35 -70 259 -182 -274 -14 13 112 100 65 215 -164 134 -72 -156 70 63 308 -407 -14
2262a4j38K56j47N9K00k98L1p4j55M26n10N05j44J09m0n7O1k75M90j1l21J45j22
$$ -14 -152 104 -43 16 216 -82 -51 -125 -280 146 -364 141 -3 106 66 9 70 -205 285 274 -47 98 -24
2285b4O5j86L98j71p5J47k16Q6L6j88L90m01M73l01n6l3L72k17l6l4k5j13j3k82
$$ -24 41 -145 253 82 7 154 -62 24 60 -128 262 -139 334 33 -23 -56 316 99 63 29 4 -109 -122 -404
2309d04P06m40P7J39k9L01n98K37K37j51J63l32P5K9j08J25o1P6k31K00l59K17
$$ -404 302 -138 -61 78 49 350 -248 -11 226 75 238 -94 -19 10 -98 27 -34 42 -189 11 -348 -131
2331a31J46R6l7l54J53K42l23M6R6N30l72Nl16JN19n37J46o5K76j89J7K11l63
$$ -131 15 111 74 -280 -127 115 -208 -162 -66 464 92 97 -219 -218 301 -236 -90 -155 121 -68 -51 160 -203
2354b03J79p4J53p4k9K05m37M96n39K48L40j65K87p53PN35k63jK00l58L76k24
$$ -203 -24 -98 55 -19 -48 157 -280 216 -323 -75 265 100 387 -366 -359 176 -87 -88 112 -246 130 -94
2376i4K01l04L54o6l9k23R4M43l17K71l93q2J8OJ25k72J75L59l09K58k65J10j82
$$ -94 107 -197 157 91 52 -171 -77 366 49 320 -73 -155 -137 -131 -6 -278 -103 256 -53 205 -60 50 -132
2399a32R9l2j63K94k00J29l5L8P6M2k61k5J11mM0j18J11J96k79L04ok05K06k67
$$ -132 -33 -65 -228 66 -134 -5 -40 -2 74 116 -145 -170 -59 -63 -23 -141 -30 166 -113 191 185 -20 186 -81
2423h1J9Q9oK59k03on32M10P7o4j12o1M08l26K46q7j45K46k85J79L0l40M26m34
$$ -81 -62 27 21 280 77 71 -461 -51 26 -38 -150 -211 197 -129 117 30 -115 131 -154 25 55 -285 141 -293
2447b93L39O3j4k33r3N69l44j15J30J9L43l35j82l3J81J28j91k3k2L43j05J93
$$ -293 46 109 95 -138 -231 338 -6 -121 9 28 371 36 -146 -179 2 130 -61 -84 -106 237 132 325
2469C25k82l18N16j96k62N3J25K48j34R9k25K40j14j10L64l60J28k72k14L51L6
$$ 325 43 -275 241 45 -217 -164 -39 209 75 174 -51 189 75 -35 329 -31 97 -175 -389 -38 -2
2490bP1j31l4R6P0j13k00J09Q4k2J8j04J26J79q2k27j22O04l66j04O6J81l05K84
$$ -2 69 -62 -96 0 70 -43 -243 -134 -50 -72 -54 -158 -32 147 65 -162 -284 320 -46 -150 -84 97 -208 76
2514G6L55n84Nr5J87K77n01J44L5L54j99j91M4J12L36n35J21K81Oj75j82R9m9
$$ 76 431 -153 -148 -243 -56 221 -280 -136 -101 253 54 -137 -93 19 355 -180 -59 222 228 53 -129 -30 -79
2537g9j06N31m93J89p7j80QJ59Q2J16P8r2l03J74J35k12K7L84n72J44J99l11L29
$$ -79 -185 346 -147 42 -35 -215 -207 -48 34 150 228 136 -167 7 142 -70 -43 341 -231 -87 112 -199 130
2560A30l14K02R9m44L62r5oo3j19K03r7j9j42J23K96j42J13j86q7J58m9O4j80
$$ 130 -184 18 117 -327 35 -60 -66 -129 -248 -45 -142 -161 -303 -180 116 -26 87 -99 -186 -28 -77 -13 -193
2583a93L04J61j70k95N8L86o63P10l23L0J21m40M20j46N6J32k28K73m43L70k53
$$ -193 111 272 102 -193 -135 251 -412 298 -25 5 126 -314 106 -40 16 148 -80 193 -250 120 -133
2604a33K24j92l4L12l10K03k27M25l56Q1J05k56K57j73q2L22j16K76m01k33M74
$$ -133 91 -101 -135 177 -133 70 -157 268 -88 -7 98 -158 99 -74 -156 166 50 326 -75 -308 166
2625A66j05O2k05O0J22j85M0O6j02K07j98J98k00J85j28j19J58o6pL01r3k63L5
$$ 166 61 123 -82 -22 100 -85 -45 21 -81 126 -72 126 -74 111 -17 -136 22 -44 -51 250 157 -106 -71
2648g1L11l05J73l15J24L8O1j15J50L61m34K03j94K6J21j16P7J18k75J20j05J34
$$ -71 240 -65 108 -207 -83 -45 16 -99 51 412 -22 181 -13 13 134 18 95 213 -62 58 -47 87
2670H7k53L29m7l03J75R6K9l27J84j3%K81k17O3q8n6L1q6M74m36P5J28j78K2r9
$$ 87 -166 163 116 -187 -12 84 113 -214 -30 -43 -43 238 21 84 -4 -60 -29 -115 359 -77 -2 126 -52 -30 -129
2695a29J62k26M65k88O7J84l54n5J91l82M24j53K11r2l3n3r3K41N4m2k4J88j93
$$ -129 33 -193 272 -16 51 235 -119 -174 17 -365 59 -94 117 25 -8 -61 -154 87 141 99 75 263 70
2718G0k61J13Q0K09k78j53J77J48l13K51p0r3N12o76J91J66j46p0M13l18P0j03
$$ 70 -191 -78 2 211 -67 -220 -43 105 -208 43 -27 -120 392 -284 -93 73 -73 -143 270 -48 22 -81
2740h1L43m30j04J82r6L77q1l00J48J20p4r7n6o2L87l6l49L81k77J59l3j86Q2
$$ -81 262 -168 -272 -90 -186 191 110 -190 -42 78 4 -93 -149 -211 176 140 -209 172 -105 54 21 -165 -83
2763h3r5N1K07m20M13j39L44n9l69L19r2j92N9L52k73J03J77n89K09O2K27k30
$$ -83 -178 -127 80 -340 73 -66 278 219 -150 169 77 -115 -56 296 23 126 303 -286 -77 -15 212 -18
2785a8p0j36N47o7q5k60J59j20k20O38l35j05j27M50j26kJ16L62M24J64j094o61
$$ -18 -88 -224 323 256 171 -89 70 -50 -270 368 33 -72 -199 251 125 123 239 601 1025 1189 95 -566
2807e66J118K8J69m58J15m09M57K35l27m85K75M02j078P97P3k01q09O56J31K44
$$ -566 552 580 749 291 406 -3 454 689 362 -123 152 554 -524 273 346 145 -664 -8 123 367
2827C67n34M76j33r57Q05NR2J86R6l48J4K89n62K18J87l67M64m12l63N13P9Q5
$$ 367 -167 309 176 -781 24 29 121 307 403 55 69 358 -204 14 201 -166 298 -114 -477 36 115 200
2849B00o27M1M17j19J99m18M44o25K67N0J18j34k45K60k15N80m40j87L89j42K72
$$ 200 -427 -386 31 -88 111 -307 137 -488 -221 -171 -53 -187 -432 -172 -387 193 -247 -434 -45 -187 85
2870H5j9j19K77j63J49l84n5K31j33J77J16k54K36k14k07M62n26L79m4J3J03j21
$$ 85 66 -53 224 61 210 -174 -229 2 -131 46 162 -92 144 -70 -277 185 -341 38 -6 7 110 -11
2892a1R5j91J45l0J47R6q0j08j14j27K24r8mQ7r5P5J41j44N7j1r5j54K41k24K09
$$ -11 84 -107 38 8 155 251 171 63 -51 -178 46 -52 -56 31 -64 11 152 8 65 54 -41 -195 46 -178 31
2917C1j46j81J0M98n28L21J79J12o47J48L45k39K05l6m2j88R5M1O1q0R3j01Q2
$$ 31 -115 -296 -286 212 -316 5 184 296 -351 -203 142 -97 108 72 30 -158 -63 -22 39 -41 52 -49 33
2940C3J53o7j34K43n12J33J1J40o7n1L0L48l22K10l49K84J55k64o7nK50P9l34
$$ 33 186 119 -15 228 -284 -151 -140 0 -67 -118 -88 260 -62 148 -201 83 238 -26 -93 -98 152 231 -103
2963a03L89m51L23l02k3M28l03J5J81j7K21l93J00j41J87j0K5j09j92jK98M2j25
$$ -103 286 -165 158 -144 -167 261 -42 -27 154 137 358 -35 65 -76 111 101 126 17 -175 -176 122 164 39
2986C9L8nl22P20l96J2j50J29l28J51J57k24K92j8k32J06k22K63j12J47K0j16
$$ 39 77 72 -250 470 74 86 -64 65 -263 -112 45 -179 113 95 -137 -31 -253 10 -102 45 65 -51
3008e1J06o7k0j28J85l0j34L29P8l61j61JK90j01q2P3J46l38Q3M0K22P0l26J87
$$ -51 55 -12 -32 -160 25 -5 -139 190 268 -93 -254 -253 37 -64 -146 -73 73 -265 -182 -142 80 150 -176 11
3032A1J42k42J45k55L65k31J73p1m2Q6j36M9K18k31N0k44J19K69j91j04N13k59
$$ 11 153 -89 56 -199 166 -65 108 37 -5 81 -55 -6 212 -19 31 -213 -94 175 -16 -120 393 134
3054A34j45J82j0l42N04m54K46j01J70k41k82N73j43m3k06N3l5M3K15N4j16k96
$$ 134 -11 171 161 -181 323 -131 115 14 184 -57 -339 234 91 48 -158 -105 -140 -97 118 172 56 -240
3076b40K55K2k19K73k33K24k00J66R4p1l02J97R9k78q8J81L25j91O6j9J45j89
$$ -240 15 37 -182 91 -142 82 -118 48 142 71 -231 -34 65 -213 -301 -120 205 14 80 61 206 17
3098A7O5j0Rj60R9L4k22J61QO8j07J31k09M21l31J37k91K14m9P3K37l35J66J8
$$ 17 82 72 81 -79 20 54 -168 -7 1 69 -38 93 -116 305 -26 111 -180 34 -15 58 295 -40 126 144
3122A44j25R4j75j40L40j23m9J46j69j10M9L06q4j23n0n8nP1L2J87k00j47J88
$$ 144 19 113 -62 -202 138 15 -34 112 -57 -167 -118 188 104 -19 -69 -127 -132 -61 -29 158 -42 -189 -1
3145aJ74k19j4K00k44Q1j68L15q8m6K02l40J10R4L4j51N6P9k06L32k81J2L02k36
$$ -1 173 -46 -60 140 -104 -23 -191 124 36 -10 192 -148 -38 56 90 -61 -5 74 -132 200 -81 -69 233 -3
3169cq4J32j19K49k04j58J39j82K28KJ5j3M2k84L24j2j12Nm4k9J4q8l8M91k61
$$ -3 -87 45 -74 175 -29 -187 -48 -230 -2 0 15 2 44 -240 84 72 -40 -35 -79 -108 -94 -182 -220 271 10
3194A0r3j36K47Q3l65K97M37m22j51j21K72r3K45l04oL02l98J04l2O8R1m0J32
$$ 10 -83 -219 28 111 -254 43 480 58 -93 -214 58 -35 210 -94 -100 202 -196 -92 -124 -56 35 -5 127
3217A27K51k55k7l1k60K57j14r6J16J82n20K85n9J52J02r4j8J82j19J9J59m41
$$ 127 378 123 96 65 -195 62 -52 -148 -32 150 -370 -85 -144 8 110 16 -2 180 61 80 239 -202
3239b02J19k61N35l48K96m7J43k04kN8l2R6j44J44j68J4j44K21J69j3l18j57K68
$$ -202 -83 -344 191 -157 139 92 235 31 29 87 55 151 7 151 -17 -3 -147 74 243 230 -88 -245 23
3262B3OR1k18L07N9k88J09j87J8J38J37k53j39L81j01j72K75j64K11k63m9m9j53
$$ 23 29 120 -98 209 268 -20 89 -98 -80 58 195 -58 -197 184 83 -89 186 22 233 -30 -79 -128 -281
3285b81J47L60l23l2K00J48k20J15m5rp4O3k42L13Mj08oj63R8R3j06j89J53L29
$$ -281 -134 226 -97 -129 71 219 -1 114 69 60 -14 49 -193 120 124 16 10 -153 -55 38 -68 -257 -104 225
3309B25j27m1R0k52J70J56j19Kj86m8p1K43K8j95L0J42n9k50M20J55k90n3m19
$$ 225 98 57 147 -105 65 221 102 104 -82 -130 -201 42 70 -125 -95 47 -12 -262 158 313 23 -30 -449
3332d49L59k72N44j70j18l5K26k98J08k12L70k60R3J72j14j82J89R3m8k4j26j61
$$ -449 -90 -362 182 12 -106 -141 85 -213 -105 -317 53 -207 -114 58 -56 -238 -49 44 -4 -28 -154 -315
3354c15K46O8j35J40j71K37j07J19J27k04J00k84R9J31j52N8p2J84Q4k6k38j42
$$ -315 -69 -1 -136 4 -167 70 -37 82 209 5 105 -179 -80 51 -101 -43 -115 69 153 127 -111 -253
3376b53M59k38j0l36M07Q9M2j12Q9J16l74J9p9J33L83k71k04K53o1P7j19m5pJ51
$$ -253 206 -32 -42 -378 29 118 160 48 137 253 -121 -102 -181 -48 335 64 -140 113 52 129 10 -35 -42 109
3400A09l29J35O8J65r1R1n6O1m1j51j17K19N8j34OJ63l5p9p1K51l63o0J24J27
$$ 109 -220 -85 -17 148 57 148 92 153 112 -39 -156 63 121 -13 -7 156 121 42 -29 222 -141 -201 -77 50
3424E0N6j03J85o5j91j14L10k96Q9j14M0P1j02M10k34K22j82K0k4j21O0RJ24p0
$$ 50 106 3 188 123 -68 -182 128 -168 -79 -193 -153 -82 -184 226 -8 214 32 52 28 -93 -33 -24 100 30
3448C0m9Oj63K44nN4m9q0K17m7o7k15N9j8K04P3k93J87l9J4r9R6LRk18J44K88
$$ 30 -19 -13 -176 68 63 117 68 -12 205 158 91 -124 -65 -83 121 194 -99 88 49 63 -36 60 63 72 -146 -2 286
3475B86k52j00Q3J08rKl16lp8L22k11K69jl06L20j75K2r9J40k9k39M62k24K26
$$ 286 34 -66 17 125 116 118 -198 -201 -279 43 -168 101 100 -206 114 -61 -39 -138 2 -27 -266 196 -28 198
3499A98m3pk6k20N7P5m3q2pJ73Q8k32o0L80l69K73k17N8n8j6P7J05J4q5j96L16
$$ 198 155 148 122 -98 -41 34 -9 -91 -98 75 163 -69 -129 251 -118 155 -62 -4 -62 -78 -1 104 118 33 -163 153
3525A53O5Ol45J05j12O9J45L7j74j45J59P0J2j18J94R3J3n00J73J91J14k56M6
$$ 153 218 224 -121 -16 -128 -59 86 123 -51 -196 -37 33 45 -73 121 214 227 -273 -100 91 205 -51 -5
3548ej10J36j00K8j10J90J40n4%pj59m7k7Q6J4K39l14J64j12n20N07M0l8k03R4
$$ -5 -115 21 -79 -51 -161 29 169 115 115 108 -51 -98 -125 -39 -25 214 -100 64 -48 -568 -61 -21 -59 -262 -168
$$ [...]
8191i0
##END NTUPLES=NMR FID
##END=
