##TITLE=1H_DE-154_d6_TFA2
 200.13Hz,DMSO.
 8 sc
 3.6.2026
##JCAMPDX= 6.0         $$ Bruker NMR JCAMP-DX V2.0
##DATA TYPE= NMR FID
##DATA CLASS= NTUPLES
##ORIGIN= UXNMR, Bruker Analytische Messtechnik GmbH
##OWNER= pz
$$ XWIN-NMR		Version 3.5
$$ Wed Jun  3 15:54:27 2026 Russian Standard Time (UT+4h)  she@DPX200
##.OBSERVE FREQUENCY= 200.131
##.OBSERVE NUCLEUS= ^1H
##.DELAY= (6, 6)
##.ACQUISITION MODE= SIMULTANEOUS
##.ACQUISITION SCHEME= undefined
##.AVERAGES= 8
##.DIGITISER RES= 18
##SPECTROMETER/DATA SYSTEM= spect
##.PULSE SEQUENCE= zg30
##.SOLVENT NAME= DMSO
##.SHIFT REFERENCE= (INTERNAL, DMSO, 0, 14.3821)
##AUDIT TRAIL= $$ (NUMBER, WHEN, WHO, WHERE, WHAT)
$$ ##TITLE= Audit trail, XWIN-NMR		Version 3.5
$$ ##JCAMPDX= 5.01
$$ ##ORIGIN= Bruker BioSpin GmbH
$$ ##OWNER= she
$$ F:/spectra/data/she/nmr/H-C/1/audita.txt
$$ ##AUDIT TRAIL=  $$ (NUMBER, WHEN, WHO, WHERE, WHAT)
(   1,<2026-06-03 15:53:26.34 +0400>,<she>,<DPX200>,
      <created by zg, POWCHK disabled, PULCHK disabled
       configuration hash MD5:
       00 E9 B6 7A A2 85 ED C7 34 08 36 98 17 FE 4E 26
       data hash MD5: 16K
       C3 19 79 24 FC AE B5 68 73 72 58 18 66 6C C1 9C>)
$$ ##END=
$$ 
$$ hash MD5
$$ C6 CA 90 38 09 B6 F6 33 8E A1 63 01 5C 3B 42 EF
##$RELAX= 
##$RELAX= 
##$RELAX= 
##$RELAX= 
##$RELAX= 
##$RELAX= 
$$ Bruker specific parameters
$$ --------------------------
##$DU= <F:/spectra>
##$EXPNO= 1
##$NAME= <H-C>
##$PROCNO= 1
##$TYPE= <nmr>
##$USER= <she>
##$AMP= (0..31)
100 100 100 100 100 100 100 100 100 100 100 100 100 100 100 100 100 100 
100 100 100 100 100 100 100 100 100 100 100 100 100 100 
##$AQSEQ= 0
##$AQ_mod= 1
##$AUNM= <au_zg>
##$AUTOPOS= <>
##$BF1= 200.13
##$BF2= 200.13
##$BF3= 200.13
##$BF4= 200.13
##$BF5= 200.13
##$BF6= 200.13
##$BF7= 200.13
##$BF8= 200.13
##$BYTORDA= 1
##$CFDGTYP= 0
##$CFRGTYP= 5
##$CHEMSTR= <none>
##$CNST= (0..31)
1 1 145 1 1 1 1 1 1 1 1 1 1 1 1 1 1 1 1 1 1 1 1 1 1 1 1 1 1 1 1 1 
##$CPDPRG= <>
##$CPDPRG1= <>
##$CPDPRG2= <>
##$CPDPRG3= <>
##$CPDPRG4= <mlev>
##$CPDPRG5= <mlev>
##$CPDPRG6= <mlev>
##$CPDPRG7= <mlev>
##$CPDPRG8= <mlev>
##$CPDPRGB= <>
##$CPDPRGT= <>
##$D= (0..31)
0 0.7 0 0 0 0 0 0 0 0 0 0.03 0 0 0 0 0 0 0 0 0 0 0 0 0 0 0 0 0 0 0 0 
##$DATE= 1780487605
##$DBL= (0..7)
120 120 120 120 120 120 120 120 
##$DBP= (0..7)
150 150 150 150 150 150 150 150 
##$DBP07= 0
##$DBPNAM0= <>
##$DBPNAM1= <>
##$DBPNAM2= <>
##$DBPNAM3= <>
##$DBPNAM4= <>
##$DBPNAM5= <>
##$DBPNAM6= <>
##$DBPNAM7= <>
##$DBPOAL= (0..7)
0.5 0.5 0.5 0.5 0.5 0.5 0.5 0.5 
##$DBPOFFS= (0..7)
0 0 0 0 0 0 0 0 
##$DE= 6
##$DECBNUC= <off>
##$DECIM= 32
##$DECNUC= <off>
##$DECSTAT= 4
##$DIGMOD= 1
##$DIGTYP= 9
##$DL= (0..7)
0 120 120 120 120 120 120 120 
##$DP= (0..7)
150 150 150 150 150 150 150 150 
##$DP07= 0
##$DPNAME0= <>
##$DPNAME1= <>
##$DPNAME2= <>
##$DPNAME3= <>
##$DPNAME4= <>
##$DPNAME5= <>
##$DPNAME6= <>
##$DPNAME7= <>
##$DPOAL= (0..7)
0.5 0.5 0.5 0.5 0.5 0.5 0.5 0.5 
##$DPOFFS= (0..7)
0 0 0 0 0 0 0 0 
##$DQDMODE= 0
##$DR= 18
##$DS= 0
##$DSLIST= <SSSSSSSSSSSSSSS>
$$ [...]
##$SUBNAM0= <"">
##$SUBNAM1= <"">
##$SUBNAM2= <"">
##$SUBNAM3= <"">
##$SUBNAM4= <"">
##$SUBNAM5= <"">
##$SUBNAM6= <"">
##$SUBNAM7= <"">
##$SUBNAM8= <"">
##$SUBNAM9= <"">
##$SW= 18.0517599122864
##$SWIBOX= (0..15)
0 0 2 0 0 0 0 0 0 0 0 0 0 0 0 0 
##$SW_h= 3612.71676300578
##$TD= 16384
##$TD0= 1
##$TE= 0
##$TE2= 300
##$TE3= 300
##$TEG= 300
##$TL= (0..7)
0 120 120 120 120 120 120 120 
##$TP= (0..7)
150 150 150 150 150 150 150 150 
##$TP07= 0
##$TPNAME0= <>
##$TPNAME1= <>
##$TPNAME2= <>
##$TPNAME3= <>
##$TPNAME4= <>
##$TPNAME5= <>
##$TPNAME6= <>
##$TPNAME7= <>
##$TPOAL= (0..7)
0.5 0.5 0.5 0.5 0.5 0.5 0.5 0.5 
##$TPOFFS= (0..7)
0 0 0 0 0 0 0 0 
##$TUNHIN= 0
##$TUNHOUT= 0
##$TUNXOUT= 0
##$USERA1= <user>
##$USERA2= <user>
##$USERA3= <user>
##$USERA4= <user>
##$USERA5= <user>
##$V9= 5
##$VALIST= <valist>
##$VCLIST= <CCCCCCCCCCCCCCC>
##$VD= 0
##$VDLIST= <DDDDDDDDDDDDDDD>
##$VPLIST= <PPPPPPPPPPPPPPP>
##$VTLIST= <TTTTTTTTTTTTTTT>
##$WBST= 1024
##$WBSW= 4
##$XGAIN= (0..3)
0 0 0 0 
##$XL= 0
##$YL= 0
##$YMAX_a= 298738
##$YMIN_a= -310610
##$ZGOPTNS= <>
##$ZL1= 120
##$ZL2= 120
##$ZL3= 120
##$ZL4= 120
##$ABSF1= 10
##$ABSF2= 0
##$ABSG= 5
##$ABSL= 3
##$ALPHA= 0
##$AQORDER= 0
##$ASSFAC= 0
##$ASSFACI= 0
##$ASSFACX= 0
##$ASSWID= 0
##$AUNMP= <proc_1d>
##$AZFE= 0.1
##$AZFW= 0.1
##$BCFW= 1
##$BC_mod= 2
##$BYTORDP= 1
##$COROFFS= 0
##$CY= -3
##$DATMOD= 1
##$DC= 2
##$DFILT= <>
##$DTYPP= 0
##$F1P= 0
##$F2P= 0
##$FCOR= 0.5
##$FTSIZE= 0
##$FT_mod= 4
##$GAMMA= 1
##$GB= 0.15
##$INTBC= 1
##$INTSCL= 1
##$ISEN= 128
##$LB= 0.25
##$LEV0= 0
##$LPBIN= 0
##$MAXI= 10000
##$MC2= 0
##$MEAN= 0
##$ME_mod= 0
##$MI= 1.114404
##$NCOEF= 0
##$NC_proc= 0
##$NLEV= 6
##$NOISF1= 3.799351
##$NOISF2= 2.8
##$NSP= 1
##$NTH_PI= 0
##$NZP= 0
##$OFFSET= 14.38212
##$PC= 1
##$PHC0= -4221.832
##$PHC1= 9.39229
##$PH_mod= 1
##$PKNL= yes
##$PPARMOD= 0
##$PSCAL= 0
##$PSIGN= 0
##$REVERSE= no
##$SF= 200.129724274929
##$SI= 16384
##$SIGF1= 3
##$SIGF2= 2
##$SINO= 400
##$SIOLD= 16384
##$SREGLST= <1H.CDCl3>
##$SSB= 0
##$STSI= 0
##$STSR= 0
##$SW_p= 3205.1282051282
##$SYMM= 0
##$S_DEV= 0
##$TDeff= 0
##$TDoff= 0
##$TI= <>
##$TILT= no
##$TM1= 0
##$TM2= 0
##$TOPLEV= 0
##$USERP1= <user>
##$USERP2= <user>
##$USERP3= <user>
##$USERP4= <user>
##$USERP5= <user>
##$WDW= 1
##$XDIM= 8192
##$YMAX_p= 0
##$YMIN_p= 0
$$ End of Bruker specific parameters
$$ ---------------------------------
##NTUPLES= NMR FID
##VAR_NAME=  TIME,          FID/REAL,        FID/IMAG
##SYMBOL=    X,             R,               I
##VAR_TYPE=  INDEPENDENT,   DEPENDENT,       DEPENDENT
##VAR_FORM=  AFFN,          ASDF,            ASDF
##VAR_DIM=   8192,          8192,            8192
##UNITS=     SECONDS,       ARBITRARY UNITS, ARBITRARY UNITS
##FACTOR=    0.0002768,     1,               1
##FIRST=     0,             0,               0
##LAST=      2.2672688,     0,               0
##MIN=       0,             -310610,         0
##MAX=       2.2672688,     298738,          0
$$ Real data points
##PAGE= N=1
##DATA TABLE= (X++(R..R)), XYDATA
$$ [...]
$$ plain form
1904 184 -66 251 -76 83 -88 -132 -229 -264 87 -77 93 192 175 53 154 -194 45 29 -81 -240 -53 220
1926 220 154 -110 130 95 4 -100 91 89 -40 142 34 139 10 -1 -83 82 204 26 218 -44 -19 65 -34
1949 -34 -13 324 -289 68 34 241 177 86 -18 -8 73 -80 241 184 -150 166 -224 -334 -129 242 16 -296 142
1972 142 48 149 113 -214 -73 -117 96 11 182 -118 272 -183 -28 -4 -49 -224 -27 -43 -112 120 -162 -145 -179
1995 -179 70 -62 -145 80 87 62 168 -163 125 -85 -34 -24 -62 100 -202 33 -58 -17 279 54 83 -24 -59 130
2019 130 0 -82 -157 71 192 -227 99 -152 -128 158 -245 -53 222 -63 99 -16 35 79 94 33 -280 243
2041 243 210 131 -187 -55 186 -339 -107 324 -172 -27 52 50 122 -185 -125 -114 -132 12 -115 164 131 246 -16
2064 -16 65 83 -129 -139 -240 33 -93 49 -13 41 87 -5 -69 138 -89 153 -31 57 201 112 119 -60 -97 -36 36
$$ packed form
1904A84k50L17l27J59j71m4r7l5L51j64J70R9j7j22J01l48K39j6j10j59J87K73
1926B20o6k64K40l5r1j04J91kj29J82j08J05j29j1q2J65J22j78J92k62K5Q4r9
1949c4K1L37o13L57l4K07o4r1j04J0Q1j53L21n7l34L16l90j10K05L71k26l12M38
1972A42r4J01l6l27J41m4K13q5J71l00L90m55J55K4m5j75J97j6o9K32k82J7l4
1995a79K49j32q3K25Pk5J06l31K88k10N1J0l8J62l02K35r1M1K96k25K9j07l5J89
2019A30j30q2p5K28J21m19L26k51K4K86m03J92K75k85J62j15N1M4J5o1l13N23
2041B43l3p9l18J32K41n25K32M31m96J45P9kP2l07O0J1j8J44j27K79l3J15k62
2064a6Q1J8k12j0j01K73j26J42o2N4M6r2o4K07k27K42j84Q8J44q9Pj79l7O1P2
$$ plain form
2089 36 -450 16 -33 -292 -58 -2 1 -65 -46 16 204 -216 -118 -194 61 54 -92 282 -53 -187 112 12 288 -34
2113 -34 -75 127 90 156 -61 157 109 -72 -177 -36 133 -154 -67 266 -84 91 -135 90 -289 69 46 117 -206
2136 -206 16 -88 74 16 150 17 -93 290 262 -4 44 6 -250 -155 45 -9 -209 -15 -4 32 -12 -79 11 -358
2160 -358 39 292 -217 -72 113 61 -240 -37 -156 210 -194 -166 -59 132 280 179 172 103 -4 104 219 -44
2182 -44 -137 203 -273 -27 -124 51 -272 -47 -63 -280 -10 -29 -160 -63 107 -176 -39 -120 -279 56 -134 110
2204 110 212 67 -330 162 -24 105 -50 12 -204 -115 -54 -306 -42 56 212 114 -180 141 -163 -46 53 -17
2226 -17 150 -254 17 15 90 -146 33 -104 -357 -100 85 46 11 -83 211 93 71 45 -173 -212 -130 -32 -167 -57
2250 -57 72 -198 190 39 -129 107 66 -5 -213 117 -27 21 -303 170 -127 -26 54 203 -106 -47 68 -144
$$ packed form
2089C6m86M66m9k59K34N6Lo6J9O2J88m20R8p6K55pj46L74l35j34K99j00K76l22
2113c4m1K02l7O6k17K18m8j81j05J41J69k87Q7L33l50J75k26K25l79L58k3P1l23
2136b06K22j04J62n8J34j33j10L83k8k66M8l8k56R5K00n4k00J94J1L6m4o7R0l69
2160c58L97K53n09J45J85n2l01K03j19L66m04K8J07J91J48j01po9j07J08J15k63
2182d4r3L40m76K46r7J75l23K25j6k17K70j9j31R7J70k83J37q1j59L35j90K44
2204A10J02j45l97M92j86J29j55O2k16Q9O1k52K64R8J56r8k94L21l04J17R9p0
2226a7J67m04K71kP5k36J79j37k53K57J85l9l5r4K94j18k2k6k18l9Q2R8j35J10
2250e7J29k70L88j51j68K36m1p1k08L30j44M8l24M73k97J01Q0J49l09N9J15k12
$$ plain form
2272 -144 21 -164 17 -183 46 -186 -254 -27 -150 172 99 -18 -19 15 -29 225 -76 139 35 -79 48 -160
2294 -160 54 -169 -58 17 -243 55 102 -58 -54 64 1 -53 -33 -145 -29 -81 -29 -359 -287 -62 -106 -117 -97 53
2318 53 2 137 -7 167 -92 106 47 131 -44 41 343 -285 -70 -31 -31 -79 -272 428 -60 -4 -61 -71 -150 -21
2342 -21 -19 -144 138 -205 7 32 22 -13 2 120 146 104 298 -81 25 136 -131 -95 -139 100 107 158 -29 -48 -11
2367 -11 -26 77 87 176 310 -21 -45 27 20 207 -144 9 -159 -164 -139 35 -136 11 -82 -372 177 -49 -161 105
2391 105 144 -384 -81 -129 -103 -248 65 65 -82 -134 -129 -68 -302 -21 -184 -224 8 8 230 -3 223 423 102 -81
2415 -81 28 181 26 -216 133 8 175 -50 40 -176 44 184 15 47 -32 4 -138 -60 117 28 -233 -193 -70
2438 -70 29 142 167 -118 -115 -162 -210 -169 -303 -2 -222 -72 106 24 142 -100 51 189 -215 52 -45 29 -166 83
$$ packed form
2272a44J65j85J81k00K29k32o8K27j23L22p3j17jL4m4K54l01K15j04j14J27k08
2294a60K14k23J11P5k60K98M7j60MJ18o3n4K0j12J16n2N2l30P2K25m4j1K0J50
2318E3n1J35j44J74k59J98n9Q4j75Q5L02o28K15L9%m8j93P00m88N6n7j0p9J29
2342b1Kj25K82l43K12K5j0l5J5J18K6m2J94l79J06J11k67L6m4K39PN1j87j9L7
2367a1j5J03J0Q9J34l31k4P2pJ87l51J53j68nK5J74j71J47r3k90N49k26j12K66
2391A05L9n28L03m8K6j45L13%j47n2NO1k34K81j63m0K32%K22k33K26K00l21j83
2415h1J09J53j55k42L49j25J67k25R0k16K20J40j69L2p9L6j42P8J77q9k61M0J23
2438g0R9J13K5k85Lm7m8M1j34L01k20J50J78q2J18k42J51J38m04K67r7P4j95K49
$$ plain form
2462 83 143 35 -234 2 -217 -63 45 66 -138 -65 280 -71 -101 -27 26 -375 -115 146 45 185 27 264
2484 264 -213 173 -40 -110 -27 -34 253 -255 -35 -35 2 -247 187 99 8 -83 32 -35 -276 176 10 -98 2 13
2508 13 254 -152 -43 -27 22 32 135 30 99 43 149 -12 54 -18 -40 -161 -67 164 257 -36 -110 -13 84 -8 -33
2533 -33 52 311 100 150 -61 -124 -50 -207 -42 286 168 45 28 86 -157 -9 30 -8 -184 77 36 -71 -48 86
2557 86 -74 145 -188 75 -82 -157 -84 96 -49 36 -153 177 -31 -14 91 -101 0 27 36 -273 -97 -114 95
2580 95 3 -146 -16 -40 -127 61 -1 -61 167 51 54 152 -151 95 -162 -117 -259 2 -50 -89 -74 -232 24 -34 178
2605 178 0 -107 76 61 -85 133 255 1 26 7 -125 -154 70 -84 -83 -243 125 -37 -5 -59 -35 -67 135
2628 135 173 159 -20 -290 -129 320 206 47 -303 -100 -182 -76 135 181 200 -2 -216 -202 76 -170 -149 131
$$ packed form
2462H3O0j08k69K36k19J54J08K1k04P3L45l51l0P4N3m01K60K61j01J40j58K37
2484B64m77L86k13p0Q3pK87n08K20%L7k49M34q8r1r1J15o7k41M52j66j08J00J1
2508A3K41m06J09J6M9J0J03j05O9n6J06j61O6p2k2j21R4K31R3k93p4R7R7r2k5
2533c3Q5K59k11N0k11o3P4j57J65L28j18j23j7N8k43J48L9l8j76K61m1j07K3J34
2557H6j60K19l33K63j57p5P3J80j45Q5j89L30k08J7J05j92J01K7Rl09J76j7K09
2580I5r2j49J30k4q7J88o2o0K28j16LR8l03K46k57M5j42K61n2l9J5j58K56n8K12
2605A78j78j07J83j5j46K18J22k54K5j9j32k9K24j54Jj60L68j62L2n4K4l2K02
2628A35L8j4j79k70J61M49j14j59l50K03q2J06K11M6J9k02k14J4K78k46K1K80
$$ plain form
2650 131 97 7 74 113 129 -236 138 -95 238 204 -109 58 -17 41 164 -219 -217 -131 2 258 77 -29 89 -68
2674 -68 99 29 -229 26 48 201 -4 31 -150 86 -179 120 -101 180 -161 52 65 -104 53 14 42 -67
2696 -67 22 57 151 -182 128 22 41 70 -166 165 -155 -146 115 -195 99 15 -291 -37 -58 -93 -28 -38 -148 -168 74
2721 74 160 143 -74 -36 -33 57 52 100 -149 101 132 130 12 -47 10 74 49 -18 84 103 -116 -111 134 -44 130 26 -30
2748 -30 7 137 152 -2 5 164 39 194 -272 -130 -299 -74 160 -3 76 -152 15 33 65 349 33 96 42
2771 42 -266 1 -86 -130 75 118 -237 69 -183 -232 -161 67 -36 -183 56 -153 56 -121 -150 170 0 -181
2793 -181 181 -189 -154 243 102 -118 -55 -105 -82 -320 3 224 -299 37 152 -185 -340 -97 212 366 18
2814 18 553 -35 80 -5 -116 -35 -71 46 88 10 44 -181 3 -255 58 127 -124 31 52 -62 310 72 101
$$ packed form
2650A31l4r0O7L9J6l65L74k33L33l4l13J67p5N8J23l83KQ6J33K56j81j06J18j57
2674f8J67p0k58K55K2J53k05L5j81K36k65K99k21K81l41K13J3j69J57l9K8j09
2696f7Q9L5R4l33L10j06J9K9k36L31l20RK61l10K94q4l06K54k1l5O5j0j10k0K42
2721G4Q6j7k17L8LR0nM8k49K50L1kj18n9N7O4k5o7J02J9k19NK45j78J74j04n6
2748c0L7J30J5j54PJ59j25J55m66J42j69K25K34j63P9k28J67J8L2K84l16O3n4
2771D2l08K67q7m4K05M3l55L06k52m9P1K28j03j47K39k09K09j77k9L20j70j81
2793a81L62l70L5L97j41k20O3n0K3k38L23K21n23L36J15l37j55K43L09J54l48
2814A8N35n88J15q5j11Q1l6J17M2p8L4k25J84k58L13O9k51J55K1j14L72k38K9
$$ plain form
2837 101 50 -44 -93 66 -115 -121 71 -43 19 -318 -147 -239 -209 32 103 42 28 -123 -155 13 29 121 -138 -273 180
2862 180 -117 -203 18 -212 -18 -239 -41 -25 81 -170 -157 -53 118 -217 -144 95 -43 -10 286 -50 -187 -296
2884 -296 314 319 35 74 143 76 160 250 -106 191 -60 53 167 281 129 -114 36 81 1 100 -12 204 149 -102
2908 -102 -90 -270 -337 -182 -127 14 176 -311 -7 -31 -296 82 -222 -93 148 -72 -197 -105 -141 163 294 12
2930 12 97 -166 -37 173 57 30 37 -94 -82 -69 4 -101 -18 16 -307 88 -45 70 82 193 225 -238 -137 -111
2954 -111 -52 -80 89 -219 -161 -2 324 76 -279 -79 99 72 8 116 199 -78 -22 -83 202 19 -165 -298 60
2977 60 9 -85 -72 -109 -38 -59 -57 70 -68 2 258 66 -208 -95 -158 -45 -74 66 -176 -47 3 -135 -21 218
3001 218 -65 -10 -225 244 -154 191 -186 -53 143 163 6 206 -159 -48 -144 246 -23 25 -7 -25 13 104 57
$$ packed form
2837A01n1r4m9J59j81oJ92j14O2l37J71r2L0K41P1o1j4j51l2J68J6R2k59j35M53
2862A80k97q6K21k30J94k21J98J6J06k51J3J04J71l35P3K39j38L3K96l36j37j09
2884b96O10Nk84L9O9o7Q4R0l56K97k51J13J14J14j52k43J50M5q0R9j12K16n5k51
2908a02J2j80o7J55N5J41J62m87L04k4k65L78l04J29K41k20j25R2l6L04J31k82
2930A2Q5k63J29K10j16k7Pj31J2J3P3j05Q3L4l23L95j33J15J2J11L2m63J01K6
2954a11N9k8J69l08N8J59L26k48l55K00J78k7o4J08Q3k77N6o1K85j83j84j33L58
2977F0n1r4J3l7P1k1KJ27j38P0K56j92k74J13o3J13k9J40k42J29N0j38J14K39
3001B18k83N5k15M69l98L45l77J33J96K0j57K00l65J11r6L90k69M8l2j8L8R1m7
$$ plain form
3024 57 -230 -195 7 82 86 120 -239 -5 -153 -110 -23 393 -251 11 -72 37 -57 50 -133 -397 133 -302 -361 -107
3048 -107 -191 262 168 -180 18 21 -230 151 -116 -115 -207 29 386 187 -182 -146 132 497 -192 -154 -34 -616 -409
3071 -409 -83 203 -11 134 -152 631 619 991 -216 -195 -127 -696 -232 139 810 -207 510 777 -784 347
3091 347 -203 269 811 136 -747 685 265 -339 723 571 -339 123 172 119 -293 -272 57 -437 605 690
3111 690 -18 73 -334 78 427 -460 -177 250 457 -300 -12 -669 567 758 -572 -1245 -267 -825 244
3130 244 163 340 414 172 -491 -27 -227 279 466 -269 522 553 633 -484 -544 -136 -678 541 814 369 -194
3151 -194 6 -11 -1143 -23 155 391 -6 191 946 -136 860 -375 -54 376 371 -137 -973 241 -307
3170 -307 -698 238 -218 368 -37 -133 264 -123 -38 -194 210 222 165 333 -223 306 -193 -304 -162 85 8 -521
$$ packed form
3024E7k87L5K02P5ML4l59K34j48M3Q7M16o44K62q3J09r4J07j83k64N30m35n9K54
3048a07q4M53r4l48J98Lk51L81k67Jr2K36L57j99l69L6K78L65o89L8J20n82K07
3071d09L26K86k14J45k86P83j2L72j207K1O8n69M64L71O71j017P17K67j561J131
3091C47n50M72N42o75q83J432m20o04J062j52r10M62M9n3m12K1L29m94J042Q5
3111F90p08R1m07M12L49q87K83M27K07p57K88o57J236J91j330o73R78n58J069
3130B44q1J77P4k42o63M64k00N06J87p35P91L1Q0j117o0M08n42J219K73m45n63
3151a94K00j7j132J120J78K36l97J97P55j082R96j235L21M30nn08q36J214n48
3170c07l91R36m56N86m05r6L97l87Q5j56M04J2n7J68n56N29m99j11J42K47p7n29
$$ plain form
3192 -521 130 -440 174 67 29 -151 132 -204 151 -89 -101 86 329 282 -16 -166 -247 184 78 -235 361
3213 361 -30 -324 -57 475 -242 -604 144 39 -140 -17 375 -39 -249 -293 -112 404 -74 -111 -124 12 161
3234 161 94 185 -113 -143 180 160 -10 7 159 -253 -127 -21 12 -499 -204 401 605 -67 650 152 173 283
3256 283 460 -21 55 574 373 362 -324 308 709 895 582 533 -477 374 -202 105 -360 -64 61 -254 442
3277 442 372 7 262 224 -169 11 370 563 658 265 -515 292 -592 -422 -277 -32 95 221 -36 -94 141
3298 141 247 -406 -359 795 -144 -107 127 471 -47 96 -93 300 87 457 267 -793 398 387 886 264
3318 264 762 -374 -444 1050 303 28 -303 100 675 -82 108 610 192 -213 862 136 -1054 31 378
3337 378 -347 -484 321 485 -68 417 222 -530 -195 -240 263 548 -288 447 -346 386 -136 420 -221 -76
$$ packed form
3192e21O51n70O14j07l8j80K83l36L55k40j2J87K43m7k98j50q1M31j06l13N96
3213C61l91k94K67N32p17l62P48j05j79J23L92m14k10m4J81N16m78l7j3J36J49
3234A61o7R1k98l0L23k0j70J7J52m12J26J06L3n11K95O05K04o72P17m98K1J10
3256B83J77m81P6N19k01j1o86O32M01J86l13m9j010Q51n76L07m65K96J25l15O96
3277D42p0l65K55l8l93J80L59J93R5l93p80Q07q84J70J45K45J27J26k57n8K35
3298A41J06o53M7J154r39L7K34L44n18J43j89L93k13L70j90j060J191j1M99o22
3318B64M98j136p0J494p47k75l31M03N75p57J90N02m18m05J075p26j190J085L47
3337C78p25j37Q05J64n53M85j95p52L35m5N03K85q36P35p93P32n22N56o41J45
$$ plain form
3357 -76 -125 559 -273 -332 96 164 233 61 -84 -73 -519 318 -158 234 -46 28 324 -37 102 -304 389 406 -215
3380 -215 -155 735 -112 2 445 -35 26 -199 -185 -84 -27 -66 127 372 -53 80 -395 -842 -440 143 -160 221
3402 221 -23 -509 578 -92 303 82 350 -664 -149 228 -336 -199 -166 -302 -245 -251 -160 150 -3 -496 -93
3423 -93 167 119 -445 -220 -342 -7 -65 -135 426 698 159 -28 75 -338 105 -248 42 -159 199 4 252
3444 252 -425 -525 189 412 526 35 526 451 180 149 -133 -80 -720 308 -289 52 -357 -239 169 18 148
3465 148 -50 358 207 162 -187 -171 223 84 5 -68 -323 4 -172 304 -69 -40 590 443 42 -144 -46 -41 171
3488 171 -279 -293 -25 134 98 -398 411 -289 14 220 -29 393 199 374 257 -255 -187 -69 73 -14 -20 -167
3510 -167 261 16 142 293 4 -48 11 -4 -282 90 124 79 20 48 -71 365 60 -112 69 152 136 -14 -285
$$ packed form
3357g6m9O84q32n9M28O8O9j72j45J1m46Q37m76L92k80P4K96l61J39m06O93J7o21
3380b15O0Q90q47J14M43m80O1k25J4J01N7l9J93K45m25J33m75m47M02N83l03L81
3402B21k44m86J087o70L95k21K68j014N15L77n64J37L3j36N7oR1L10j53m93M03
3423i3K60m8n64K25j22L35n8p0N61K72n39j87J03m13M43l53K90k01L58j95K48
3444B52o77j00P14K23J14m91M91p5k71l1k82N3o40J028n97L41m09J18M08j51J30
3465A48j98M08j51m5l49J6L94j39p9p3k55L27j76M76l73K9O30j47m01j86R8NK12
3488A71m50j4K68J59l6m96Q09p00L03K06k49M22j94J75j17n12O8J18J42q7oj47
3510a67M28k45J26J51k89n2N9j5k78L72L4m5n9K8j19M36l05j72J81Q3j6j50k71
$$ plain form
3533 -285 161 -138 -43 264 -88 186 170 -396 -113 61 189 2 -119 17 -181 249 170 -76 131 183 44
3554 44 69 -43 -25 -113 -121 91 -91 164 263 -97 42 134 363 42 -66 183 141 11 -27 72 22 -139 44 92
3578 92 -119 -187 247 30 -172 173 32 106 -59 -38 134 -139 -40 248 -141 68 -95 50 -130 141 -89 -132
3600 -132 147 262 307 -148 90 -328 78 23 5 235 154 131 -50 -20 45 70 164 -153 -397 191 294 -26 -86
3623 -86 -235 -338 -519 -738 128 -283 -544 142 -26 -128 172 -339 -259 -202 -35 -187 201 49 136 -734 350
3644 350 84 -172 38 550 -48 15 142 -113 -51 62 -64 -143 -13 -132 41 -48 -3 -17 37 -326 -42 -261
3666 -261 53 94 -5 80 -231 -282 -60 30 237 129 429 -72 -29 63 -145 -81 -274 -18 317 -93 176 -245 -60
3689 -60 91 -174 -190 13 234 -273 -237 19 -62 -176 -54 -23 163 62 75 -14 -131 -76 55 -37 -14 -119 -38 116
$$ packed form
3533b85M46k99R5L07l52K74j6n66K83J74J28j87j21J36j98M30p9k46K07N2j39
3554D4K5j12J8q8qK12j82K55R9l60J39R2K29l21j08K49m2j30l8R9n0j61J83M8
3578I2k11o8M34k17k02L45j41P4j65K1J72k73R9K88l89K09j63J45j80K71k30m3
3600a32K79J15M5m55K38m18M06n5j8K30q1k3j81L0O5K5R4l17k44N88J03l20o0
3623h6j49j03j81k19Q66m11k61O86j68j02L00n11Q0N7J67j52L88j52Q7q70J084
3644C50k66k56K10N12n98O3J27k55O2J13j26p9J30j19J73q9M5j4N4l63K84k19
3666b61L14M1r9Q5l11n1K22R0K07j08L00n01M3R2k08O4j93K56L35m10K69m21J85
3689f0J51k65j6K03K21n07L6K56q1j14J22L1J86j01J3q9j17N5J31r2K3j05Q1J54
$$ plain form
3713 116 45 -122 -123 -185 289 -157 -210 11 118 -19 61 21 -79 71 -158 235 58 70 247 92 -8 -84 -127
3736 -127 86 -79 42 -71 111 -35 -139 -250 159 213 -10 257 79 -18 6 123 -41 -181 77 -304 -4
3757 -4 14 85 224 205 94 116 62 -161 -147 41 438 36 112 129 177 48 -292 319 -77 -264 45 189 -1 -35
3781 -35 -13 -84 21 -47 178 -94 -284 223 -212 -316 101 303 -110 171 42 284 156 -72 61 -162 12
3802 12 -179 -59 -1 -274 58 73 -214 240 61 -37 104 -122 -43 -202 150 -89 -40 151 -164 -79 98 65 259
3825 259 234 -81 205 107 26 92 -68 246 -127 17 264 -68 -15 31 112 60 -80 261 -158 337 199 -44 -259
3848 -259 -132 68 60 124 163 -181 50 -260 -53 -81 -145 -188 -38 -287 21 153 11 -14 98 -25 -87 90 -26
3871 -26 126 154 -98 120 -59 -112 229 52 66 -212 16 -82 215 -174 -257 -159 39 285 -23 -26 127 -169 -278
$$ packed form
3713A16p1j67jo2M74m46n3K21J07j37Q0m0j00J50k29L93j77J2J77j55j00p6m3
3736a27K13j65J21j13J82j46j04j11M09N4k23K67j78r7K4J17j64j40K58l81L00
3757dJ8P1J39j9j11K2n4k23J4J88L97m02P6J7M8j29l40O11l96j87L09J44j90l4
3781c5K2p1J05o8K25k72j90N07m35j04M17K02m13K81j29K42j28k28J33k23J74
3802A2j91J20N8k73L32J5k87M54j79r8J41k26P9j59L52k39M9J91l15Q5J77l3J94
3825B59k5l15K86r8q1O6j60L14l73J44K47l32N3M6Q1n2j40L41m19M95j38k43k15
3848b59J27K00qO4L9l44K31l10K07k8o4m3J50k49L08J32j42k5J12j23o2J77j16
3871b6J52K8k52K18j79n3L41j77J4k78K28r8K97l89q3R8J98K46l08lJ53k96j09
$$ plain form
3894 -278 146 -220 109 -53 151 61 -368 126 147 -16 50 200 -39 55 0 -65 63 200 -91 -54 151 -50
3916 -50 153 -74 -240 142 189 -102 71 -65 -120 27 29 -100 10 -337 51 -30 -85 5 118 -104 -212 -112 314
3939 314 50 -71 151 -92 -41 38 -61 118 -2 -67 -146 33 -100 175 -20 81 8 -209 -10 -78 -172 175 145
3962 145 -135 128 -106 -117 -106 189 1 81 57 -15 -70 120 -30 -4 -47 -151 190 -134 44 117 247 -63 35
3985 35 76 51 -162 202 -193 60 -10 -92 118 -69 4 -104 197 52 105 -207 91 -189 -80 183 53 50 150
4008 150 164 -1 -220 -237 -100 -159 -347 -12 -270 157 -1 -152 87 -61 -13 68 43 -98 123 231 -38 82
4030 82 76 148 214 -9 166 254 115 -122 203 -109 25 42 -1 226 -21 150 106 48 1 -54 39 -77 180 -52
4054 -52 85 66 71 -153 -125 -34 37 199 105 231 156 43 195 253 62 73 205 224 319 109 -42 -71 -157 109 -89
$$ packed form
3894b78M24l66L29j62K04r0m29M94K1j63O6J50k39R4n5o5J28J37k91L7K05k01
3916e0K03k27j66L82M7k91J73j36n5J47Kj29J10l47L88q1n5R0J13k22j08J00M26
3939C14k64j21K22k43N1P9r9J79j20o5p9J79j33K75j95J01p3k17J99o8r4L47l0
3962A45k80K63k34j1J1K95j88Q0k4p2n5J90j50K6m3j04L41l24J78P3J30l10R8
3985C5M1k5k13L64l95K53p0q2K10j87P3j08L01j45N3l12K98k80J09K63j30lJ00
4008A50J4j65k19j7J37n9j88L35k58M27j58j51K39j48M8Q1k5j41K21J08k69J20
4030H2oP2O6k23J75Q8j39k37L25l12J34J7m3K27k47J71m4n8m7n5R3j16K57k32
4054e2J37j9Nk24K8R1P1J62r4J26p5j13J52N8j91J1J32J9R5k10j51k9q6K66j98
$$ plain form
4079 -89 -189 18 -123 -103 229 179 259 36 21 -117 225 -88 318 357 -72 10 231 169 5 12 -108 40 -149
4102 -149 445 98 -4 -128 261 117 92 -121 40 63 20 178 4 87 -9 -74 -123 -67 -60 -77 -185 111 -104 -214
4126 -214 -204 325 139 -4 -145 -2 -83 -85 65 -58 86 -78 216 110 3 -24 -119 -115 -88 20 -164 109 -121
4149 -121 110 462 285 134 -179 -169 44 -285 -14 -30 -56 -164 -161 71 126 48 18 -20 -7 -38 -172 -27 94 -44
4173 -44 -110 45 -224 -164 -147 -87 254 -58 212 168 240 63 42 21 190 -86 -231 267 312 31 138 -66 -158 252
4197 252 9 -65 57 -209 -72 28 -76 111 31 137 -71 403 -261 -155 341 -80 134 -63 -16 -16 139 214
4219 214 53 -109 34 -240 43 -60 -13 -32 52 20 316 374 -150 -88 -160 21 53 -205 -210 -84 -155 34 268 -64
4243 -64 -35 -366 221 7 83 -138 -91 96 338 236 57 193 -98 93 4 163 94 104 -138 163 -94 -159 -48
$$ packed form
4079h9j00K07j41K0L32n0Q0k23j5j38L42l13M06L9m29Q2K21o2j64Pj20J48j89
4102a49N94l47j02j24L89j44k5k13J61K3m3J58j74Q3r6o5m9N6Pj7j08K96k15j10
4126b14J0N29j86j43j41J43q1kJ50j23J44j64K94j06j07k7r5MK7J08j84K73k30
4149a21K31L52j77j51l13J0K13l29K71j6k6j08LK32N5p8l0l8J3l1j34J45J21j38
4173d4o6J55k69O0J7O0L41l12K70m4P2j77k1k1J69k76j45M98M5k81J07k04r2M10
4197B52k43p4J22k66J37J00j04J87q0J06k08M74o64J06M96m21K14j97M7%J55P5
4219B14j61j62J43k74K83j03M7j9Q4l2K96N8n24O2p2J81L2k58nJ26p1J89K34l32
4243f4K9l31N87k14P6k21M7J87K42j02j79J36k91J91q9J59o9J0k42L01k57o5J11
$$ plain form
4266 -48 126 -112 318 73 -136 -202 11 -61 168 -90 -62 140 51 115 -110 -212 196 257 -234 202 13 -59 201
4289 201 -108 70 -24 3 145 170 -65 -205 30 -209 -144 295 -90 -240 -146 42 228 -127 71 -105 74 118
4311 118 -57 26 69 178 130 44 -36 5 -177 180 -9 -201 -18 129 99 190 64 96 51 -207 154 44 21 32
4335 32 135 249 -86 -196 -86 42 -37 -36 -55 -9 -98 109 -249 25 51 -147 1 -113 125 -11 80 -167 -159 65
4359 65 -165 -329 -131 197 -159 -142 -93 180 123 103 228 -60 -151 204 -120 51 6 -25 184 -93 244 -170 4
4382 4 109 -30 -30 -264 4 -125 -76 -28 11 70 194 -22 -112 91 181 227 -24 161 51 213 -144 -189 -78 43
4406 43 -58 138 10 -17 -275 -16 120 64 24 -168 -195 -59 -95 -204 -198 -168 118 -13 141 -38 29 27 141 5
4430 5 -83 -232 54 -74 -23 -87 -4 -230 382 242 33 117 57 -45 233 -139 -452 -150 -49 696 -216 -425 -185
$$ packed form
4266d8J74k38M30k45k09o6K13p2K29k58K8K02q9O4k25j02M08O1m91M36j89p2K60
4289B01l09J78r4K7J42K5k35j40K35k39O5M39l85j50R4J88J86l55J98j76J79M4
4311A18j75Q3M3J09m8q6q0M1j82L57j89j92J83J47l0R1j26L2m5k58L61j10k3J1
4335C2J03J14l35j10J10J28p9Jj9M6q9K07l58K74K6j98J48j14K38j36R1k47QK24
4359F5k30j64J98L28l56J7M9K73n7k0J25k88r1L55l24J71m5l1K09k77L37m14J74
4382DJ05j39%k34K68j29M9M8L9N9J24k16r0K03R0M6k51J85j10J62l57m5J11J21
4406D3j01J96j28k7k58K59J36n6m0j92k7J36l6j09OL0K86j31J54j79O7kJ14j36
4430Eq8j49K86j28N1o4Q3k26O12j40k09Q4o0j02K78l72l13L02J01P45r12k09K40
$$ plain form
4453 -185 -482 85 185 -777 722 -189 -558 285 232 -187 270 -246 265 -1 325 350 361 -146 -553 419 198
4474 198 -333 48 -185 -384 -203 -220 0 -147 106 383 102 -204 -66 47 -119 -86 116 -69 163 -129 -103
4495 -103 -4 144 -56 -30 57 94 155 -23 -175 -124 47 180 -150 -24 15 -172 -177 53 26 18 -20 -86 -36 -67 59
4520 59 -25 26 252 -188 16 -17 -37 -36 -97 -38 252 94 350 30 139 -56 127 -48 -181 -69 147 -266 250
4543 250 43 -256 89 157 -341 -29 -8 -132 -114 286 40 124 -184 -12 175 144 -73 -42 -2 114 58 -81 213
4566 213 -44 27 -45 -228 50 -74 -265 -3 -29 -28 -101 -10 28 195 163 30 -61 155 156 183 150 -358 -289 244 -86
4591 -86 114 -240 4 -1 484 28 -196 52 -23 58 144 4 118 -488 74 -77 -223 425 1087 1437 482 77
4613 77 -178 126 -62 178 -46 497 55 347 532 -934 -9 663 174 -174 259 371 23 -75 265 336 -44
$$ packed form
4453a85k97N67J00r62J499r11l69Q43n3m19M57n16N11k66L26K5J1n07m07R72k21
4474A98n31L81k33j99J81j7K20j47K53K77k81l06J38J13j66L3K02j85K32k92K6
4495a03R9J48k00K6Q7L7O1j78j52N1J71J33l30J26L9j87nK30k7ql8o6N0l1J26
4520E9q4N1K26m40K04l3k0Jo1N9K90j58K56l20J09j95J83j75j33J12K16m13N16
4543B50k07k99L45O8m98L12K1j24J8M00k46Q4l08J72J87l1k17L1M0J16n6j39K94
4566B13k57P1p2j83K78j24j91K62k6Jp3R1L8J67l2j33r1K16JK7l3n08O9N33l30
4591h6K00l54K44nM85m56k24K48p5Q1Q6j40J14o06N62j51j46O48O62L50r55m05
4613G7k55L04j88K40k24N43m42K92J85j466R25O72m89l48M33J12l48r8L40P1l80
$$ plain form
4634 -44 -130 712 690 50 99 566 -162 380 -167 23 704 -189 203 -218 -113 265 -215 100 -162 68 179
4655 179 45 189 224 -45 74 66 87 -5 -55 197 -24 251 216 241 -99 83 32 135 61 -24 -212 59 -27 -171
4679 -171 -18 -60 -96 146 127 -243 61 -52 -62 1 20 85 -54 -30 30 -200 -43 -3 106 40 -324 -233 -193 -80
4703 -80 181 -254 -111 -8 -251 -173 241 105 172 -42 97 9 -165 51 4 -2 31 -10 -99 86 -22 16 -127 24
4727 24 -49 132 109 38 284 -93 -16 7 -13 169 66 81 63 -75 240 39 -47 -19 9 60 -213 -70 5 -205 -71
4752 -71 228 -51 -380 -205 -66 6 -73 -96 -170 -160 156 145 -148 -124 -158 144 67 -364 -141 137 -105 -62 80 98
4776 98 -31 -308 -81 260 -63 -54 -166 -26 242 -82 124 -178 227 4 -87 248 192 151 123 -194 -114 -103 -65
4799 -65 -48 295 79 125 11 162 -38 -113 -244 80 -73 -378 -124 -38 2 89 7 -281 27 -400 -106 -205 -67
$$ packed form
4634d4q6Q42k2o40M9M67p28N42n47J90O81q93L92m21J05L78m80L15k62K30J11
4655A79j34J44L5k69J19qK1r2n0K52k21K75l5K5l40J82n1J03p4q5j88K71q6j44
4679a71J53m2l6K42j9l70L04j13j0O3J9O5j39K4O0k30J57M0J09o6l64R1M0J13
4703h0K61m35J43J03k43P8M14j36O7k14J39q8j74K16m7oL3m1q9J85j08L8j43J51
4727B4p3J81k3p1K46l77P7K3k0J82j03J5j8j38L15k01q6K8K8N1k73J43P5k10J34
4752g1K99k79l29J75J39P2p9k3p4J0L16j1k93K4l4L02p7m31K23K78k42M3J42J8
4776I8j29k77K27L41l23Rj12J40K68l24K06l02M05k23r1L35n6m1k8l17Q0J1L8
4799f5J7L43k16M6j14J51k00p5j31L24j53l05K54Q6M0Q7q2k88L08m27K94r9J38
$$ plain form
4822 -67 106 -46 54 23 89 -1 262 77 79 66 83 -76 -14 20 159 121 -16 132 -168 119 -175 -38 64 -188
4846 -188 -225 79 -18 -7 -169 53 -204 39 68 -140 -206 24 133 -147 144 -196 -89 72 235 -452 374 219
4868 219 108 -224 -538 476 761 617 122 95 -336 497 613 -21 497 -98 -612 34 285 82 357 61
4888 61 -650 31 462 -117 -64 -26 -33 425 18 -196 -215 233 -74 21 182 188 20 351 -42 -66 219 31 -272
4911 -272 132 64 119 192 -16 -260 10 -286 110 -207 -76 187 142 157 96 11 186 59 -71 -40 -77 280 175
4934 175 -296 189 194 -78 385 47 169 -70 -104 163 -86 -77 97 -37 244 10 -27 147 163 -53 90 -148
4956 -148 -217 14 -182 -15 221 -89 -209 -161 -296 167 198 -12 -141 76 -85 283 132 176 47 40 18 -398
4978 -398 208 -106 -28 77 94 -18 17 -147 -220 -48 -173 -13 -33 196 383 -181 -120 -77 147 241 -46 -1 103
$$ packed form
4822f7J73j52J00l1O6r0K63j85Kj3J7j59O2L4J39l8j37J48l00K87k94J37J02k52
4846a88l7L04r7J1j62K22k57K43K9k08o6K30J09k80K91l40J07J61J63o87Q26j55
4868B19j11l32l14J014K85j44m95k7m31Q33J16o34N18n95n14O46K51k03K75k96
4888F1p11O81M31n79N3L8pM58m07k14j9M48l07R5J61Oj68L31l93k4K85j88l03
4911b72M04o8N5P3k08k44K70k96L96l17J31K63m5J5o1q5J75j27j30L1l7L57j05
4934A75m71M85Nk72M63l38J22k39l4K67k49RJ74j34K81k34l7J74J6k16J43k38
4956a48o9K31j96J67K36l10j20M8j35M63L1k10j29K17j61L68j51M4j29pk2m16
4978c98O06l14P8J05J7j12L5j64p3J72j25J60k0K29J87n64O1M3K24R4k87M5J04
$$ plain form
5001 103 162 150 16 -32 -226 -9 204 16 50 270 62 -37 -73 158 -75 -167 -242 -135 31 -113 -22 63 -109
5024 -109 -156 132 17 -11 71 113 2 -145 48 165 6 -79 26 175 93 -82 -165 -13 -60 38 -181 -191 -221 314
5048 314 -80 34 -95 -83 -194 46 32 -126 125 303 273 -6 135 125 -72 -117 -15 133 48 186 54 92
5070 92 -143 62 225 -242 -168 -21 151 108 56 230 96 184 146 -293 -31 122 -41 117 -125 11 2 -147 -48
5093 -48 11 -88 16 65 24 -96 166 42 -72 87 -107 49 113 -211 -130 -128 99 -52 -31 -63 -49 -126 26 -124
5117 -124 -281 13 145 61 101 -54 119 26 75 -26 143 66 -249 -37 178 74 -1 173 34 -75 270 -313
5139 -313 -100 167 -39 -204 256 -189 84 -200 30 126 -188 -128 -43 155 13 -229 12 -77 103 54 108 297
5161 297 -5 41 -46 -74 7 -67 55 207 -29 31 195 -129 96 51 110 104 57 -309 -53 225 -199 -24 44 112
$$ packed form
5001A03N9j2j34m8j94K17K13j88L4K20k08r9l6K31k33r2p5J07J66j44R1Q5j72
5024a09m7K88j15k8Q2M2j11j47J93J17j59q5J05J49q2j75q3J52m7R8k19j0l0N35
5048C14l94J14j29J2j11K40j4j58K51J78l0k79J41j0j97m5J02J48q5J38j32L8
5070I2k35K05J63m67P4J47J72m3n2J74j34Q8l8m39K62J53j63J58k42J36rj49R9
5093d8N9r9J04M9m1j20K62j24j14J59j94J56O4l24Q1KK27j51K1l2J4p7J52j50
5117a24j57K94J32q4M0j55J73r3M9j01J69p7l15K12K15j04p5J74j39j09L45n83
5139c13K13K67k06j65M60m45K73k84K30R6l14O0Q5J98j42k42K41q9J80m9N4J89
5161B97l02M6q7k8Q1p4J22J52k36O0J64l24K25m5N9om7l66K56K78m24J75O8O8
$$ plain form
5185 112 -149 150 205 -8 209 -271 223 -73 87 52 250 -113 120 134 -67 122 125 343 -8 -58 -66 -48 -328
5208 -328 -4 137 224 -164 -128 -202 101 -150 103 125 129 58 -109 -116 220 -13 -102 -353 -161 221 -85 11 -89 -109
5232 -109 113 -118 82 -2 180 -97 -121 162 -96 -4 121 -128 217 -47 180 200 -70 144 79 -105 99 220
5254 220 -116 -225 5 -84 -180 -149 50 55 153 39 -288 -44 61 -102 -11 -109 -50 -189 277 -108 -182 -169 -18 -51
5278 -51 -138 -75 -48 -118 -33 117 -40 14 -103 105 86 -214 -76 22 -114 65 -90 -12 164 -84 -162 224 -162 -28
5302 -28 117 -10 39 0 -72 71 -124 107 103 79 13 84 17 231 38 91 -218 -68 204 -62 204 -5 86 131
5326 131 148 -19 31 151 -227 53 -94 -7 12 206 -5 -47 69 -239 -42 -59 29 1 119 30 74 185 54
5349 54 -31 159 30 -74 -260 -134 -120 -146 -108 -79 -90 -74 -167 154 -39 148 -60 77 -271 187 80 -135 118
$$ packed form
5185A12k61K99N5k13K17m80M94k96J60l5J98l63K33J4k01J89LK18l51n0qJ8k80
5208c28L24J41Q7l88L6p4L03k51K53K2Mp1j67pL36k33q9k51J92L82l06R6j00k0
5232a09K22k31K00q4J82k77k4K83k58R2J25k49L45k64K27K0k70K14o5j84K04J21
5254B20l36j09K30q9r6L1J99NR8j14l27K44J05j63R1r8N9j39M66l85p4J3J51l3
5278e1q7O3K7p0Q5J50j57N4j17K08j9l00J38R8j36J79j55P8J76k48p8L86l86J34
5302b8J45j27M9l9p2J43j95K31mk4o6P1o7K14j93N3l09J50K72k66K66k09R1M5
5326A31J7j67N0J20l78K80j47Q7J9J94k11m2J16l08J97j7Q8k8J18q9M4J11j31
5349E4q5J90j29j04j86J26J4k6L8K9j1J6r3L21j93J87k08J37l48M58j07k15K53
$$ plain form
5372 118 221 314 148 122 -251 253 -100 -112 3 -157 249 -179 64 210 -208 19 235 156 40 148 -30
5393 -30 23 -26 -88 167 -200 -46 -140 -129 -25 -5 -142 126 26 37 -99 -51 -34 255 -157 3 -32 -104 -40 47 178
5418 178 71 -153 153 -37 11 85 -91 206 -178 -232 203 141 -59 309 -142 35 -20 -88 -89 72 -136 -192 -134
5441 -134 -213 105 92 -179 -158 -130 30 -2 -89 179 80 -54 -129 179 -115 59 -335 -176 -54 -34 192 143 32
5464 32 -17 193 99 122 -246 -266 -5 -210 -54 50 -5 -114 -67 -14 25 -70 53 -72 -57 33 -40 -180 -17 -14 -50
5489 -50 60 244 161 67 -49 112 22 -18 -378 90 -52 45 86 -117 70 180 99 170 -51 -274 -159 223 -270
5512 -270 -20 -9 -61 86 82 227 -74 -158 -154 106 116 -46 -41 128 -5 297 281 64 21 -12 -86 -139 -107 -81 323 159
5538 159 529 -70 81 -214 229 -99 -233 178 153 -90 -15 -52 144 -152 -114 114 121 96 -244 137 -121 158
$$ packed form
5372A18J03R3j66k6l73N04l53j2J15j60M06m28K43J46m18K27K16p9j16J08j78
5393c0N3m9o2K55l67J54r4J1J04K0j37K68j00J1j36M8J7K89m12J60l5p2O4Q7J31
5418A78j07k24L06j90M8P4j76K97l84n4M35o2k00L68m51J77n5o8jJ61k08n6N8
5441a34p9L18j3k71K1K8J60l2q7K68r9j34p5L08k94J74l94J59J22K0K26m9j11
5464C2m9K10r4K3l68k0K61k05J56J04n5j09M7N3L9r5J23j25J5R0p3j40J63Ll6
5489e0J10J84q3r4j16J61r0m0l60M68j42R7M1k03J87J10q1P1k21k23J15L82m93
5512b70K50J1n2J47mJ45l01q4MK60J0j62NJ69j33L02j6k17m3l3p4n3L2K6M04j64
5538A59L70n99J51k95M43l28j34M11k5k43P5l7J96k96L8K28Pk5l40L81k58K79
$$ plain form
5560 158 76 37 -82 113 -89 56 110 142 56 151 3 -141 205 -243 -52 38 40 -3 54 -104 -138 92 -33 -63
5584 -63 91 251 91 -158 3 2 104 -146 185 -56 126 48 37 66 58 99 49 -92 171 131 96 1 259 -28
5608 -28 9 216 -46 -291 -9 -148 -155 -17 73 -44 -42 118 18 38 -3 -115 29 207 142 31 -133 138 -164
5631 -164 307 202 -290 8 -366 -15 -254 -23 86 -26 248 -35 420 289 -39 -126 -20 -157 -77 -386 -181
5652 -181 -278 -41 98 -30 101 160 -159 430 -141 234 92 -198 -78 -49 287 -94 122 -96 47 -131 77
5673 77 -21 -96 156 74 11 115 -123 138 163 -78 144 99 23 -98 119 -97 164 -54 -43 20 -17 126 -230 126
5697 126 -23 -227 -88 145 185 -148 270 107 -184 23 -94 -7 -22 138 -226 -115 193 -138 148 -178 -63
5718 -63 69 55 -123 199 96 -17 232 233 39 -170 -94 20 91 -22 161 -142 44 178 68 138 66 -69 130
$$ packed form
5560A58q2l9j19J95k02J45N4L2q6R5j48j44L46m48J91R0Km3N7j58l4K30j25l0
5584f3J54J60j60k49J61jJ02k50L31k41J82p8j1K9qM1n0j41K63m0l5r5K58k87
5608b8L7K07k62k45K82j39pJ38R0j17KJ60j00K0m1j12J44J78o5j11j64K71l02
5631a64M71j05m92K98l74L51k39K31J09j12K74k83M55j31l28q7J06j37Q0l09K05
5652a81r7K37J39j28J31N9l19N89n71L75j42k90J20K9L36l81K16k18J43j78K08
5673G7r8p5K52q2o3J04k38K61K5k41K22m5p6j21K17k16K61k18J1O3l7J43l56L56
5697A26j49k04J39K33M0l33M18j63k91K07j17Q7j5J60l64J11L08l31K86l26J15
5718f3J32j4j78L22j03j13K49Jj94k09P6J14P1j13J83l03J86J34j10P0p2j35J99
$$ plain form
5741 130 213 -174 142 -135 158 -48 -109 31 -16 188 -20 -2 19 -169 202 -83 51 99 -61 56 91 73 -114
5764 -114 -41 -274 28 150 10 -13 -4 -363 116 160 -43 119 67 17 63 -55 169 132 -195 174 -160 178 -177
5787 -177 -103 169 113 115 72 126 -17 -187 98 6 -60 68 95 -148 111 -55 230 215 -117 -225 34 -264 75
5810 75 112 -102 6 44 -6 -266 202 124 15 -141 -31 -176 -260 248 45 239 178 -30 10 -129 -125 -31 84 204
5834 204 -37 52 -38 22 224 86 -5 52 -3 -131 57 173 203 95 -33 -133 -8 439 3 -328 50 -303
5856 -303 -49 468 393 -61 550 137 87 -178 -125 -34 10 124 -99 140 47 187 13 -6 -33 -151 -129 -3 -80
5879 -80 176 101 25 -18 -13 -96 101 -151 -63 223 8 127 -56 72 -106 -291 -182 135 189 11 -106 35 -218
5902 -218 -214 -245 20 72 -181 -193 90 260 153 118 71 -173 17 123 -209 203 -158 -222 -92 140 -134 -275 159
$$ packed form
5741A30Q3l87L16k77K93k06o1J40m7K04k08J8K1j88L71k85J34M8j60J17L5j8j87
5764a14P3k33L02J22j40k3Rl59M79M4k03J62n2n0M6j18K24l7l27L69l34L38l55
5787a77P4K72n6Km3N4j43j70K85r2o6J28K7k43K59j66K85j5l32j08K59k98L39
5810G5L7k14J08L8n0k60M68p8j09j56J10j45q4N08k03J94o1k08M0j39MR4J15J20
5834B04k41Q9r0O0K02j38r1N7n5j28J88J16L0j08j28j00J25M47m36l31L78l53
5856c03K54N17p5m54O11m13n0k65N3R1M4J14k23K39r3J40j74j9k7j18K2J26p7
5879h0K56p5p6m3Nq3J97k52Q8K86k15J19j83J28j78j85J09L17N4j78j17J41k53
5902b18Ml1K65N2k53j2K83J70j07l5m7k44J90J06l32M12l61o4J30K32k74j41M34
$$ plain form
5925 159 -43 160 124 -81 -111 38 383 2 -47 21 -134 -314 -22 133 51 -115 -104 -112 -106 289 -193 -113 14 -66
5949 -66 164 -26 -6 -115 87 58 83 42 -91 -1 0 89 119 7 -145 -151 -14 -22 15 242 -229 129 11 102 -43
5974 -43 -231 146 52 -112 80 200 -72 126 -144 -96 -44 21 -91 -273 -46 120 -210 -44 263 328 -57 -241
5996 -241 76 17 37 -34 -27 -5 -92 -125 -66 -28 -201 96 12 -127 -152 -16 235 -291 -240 -162 -158 -81 76 -54 203 1
6022 1 18 -149 101 403 -44 -24 -49 74 -60 -166 144 -132 1 -40 -51 -134 93 -146 293 -230 -125 45 143
6045 143 287 -243 -198 157 185 -34 49 45 -141 11 -103 -173 -56 10 -53 -209 29 -83 59 173 -129 145 -50
6068 -50 86 -122 198 242 8 -95 8 -230 -58 -120 -43 -58 -77 -108 16 67 163 -111 -250 -212 72 150 102 -71
6092 -71 19 44 225 -76 110 -95 40 42 -122 48 -18 -115 134 -29 -151 100 160 57 143 83 249 -177 -223 17
$$ packed form
5925A59k02K03l6k05l0J49L45l81m9O8j55j80K92J55q2j66J1qOL95m82Q0J27q0
5949f6K30j90K0j09K02k9K5m1j33R0JQ9L0j12j52oJ37qL7K27m71L58j18R1j45
5974d3j88L77r4j64J92J20k72J98k70M8N2O5j12j82K27J66l30J66L07O5l85j84
5996b41L17n9K0p1PK2q7l3N9L8j73K97q4j39k5J36K51n26N1P8MP7J57j30K57k02
6022AJ7j67K50L02m47K0k5J23j34j06L10k76J33m1j1q3K27k39M39n23J05J70R8
6045A43J44n30M5L55K8k19Q3mj86J52j14p0J17O6o3j56K38j12J42J14l02K74j95
6068e0J36k08L20M4k34j03J03k38J72o2P7j5j9l1J24N1R6k74j39L8K84P8m8j73
6092g1R0K5J81l01J86k05J35Kj64J70o6r7K49j63j22K51O0j03Q6o0J66m26m6K40
$$ plain form
6116 17 85 -11 -220 37 288 101 61 158 -28 159 -37 -42 -152 -112 70 -158 -15 -96 97 202 -301 92 -5
6139 -5 219 -148 -22 4 -46 77 -200 40 -111 -224 -69 16 128 228 -30 47 73 117 97 -111 2 -103 -56
6162 -56 77 -37 -67 -22 41 177 -4 145 -15 132 -20 -86 123 -13 -161 -10 -161 51 -37 233 -208 80
6184 80 161 -196 119 56 -96 73 -23 54 -107 -12 -81 -171 -68 -9 25 -179 123 7 89 49 29 -260 69 -70
6208 -70 -115 -4 -58 -190 -62 -11 -58 -48 -1 221 -80 -3 -8 -259 -260 -88 -279 273 -60 69 196 125 -31 32 -199
6233 -199 -79 310 80 47 135 -200 -2 -255 -107 -107 29 -80 73 -138 -91 -6 -212 -79 -58 195 -83 101
6255 101 65 212 112 68 -66 339 -275 -36 -19 -4 165 15 -223 99 -24 122 169 -54 -14 -109 251 -30
6277 -30 -100 -134 26 3 -64 -45 -114 133 26 -129 -21 69 -107 47 7 210 17 -31 40 -197 21 122 212 -1
$$ packed form
6116A7O8r6k09K57K51j87m0R7j86J87j96nj10M0J82k28J43q1J93J05n03L93r7
6139eK24l67J26K6n0J23k77K40j51j13J55Q5J12J00k58P7K6M4k0k08J13j05M7
6162e6J33j14l0M5O3J36j81J49j60J47j52o6K09j36j48J51j51K12q8K70m41K88
6184H0Q1l57L15o3j52J69r6P7j61R5o9r0J03N9L4k04L02j16Q2m0k0k89L29j39
6208g0m5J11n4j32J28N1m7J0M7K22l01P7nk51jJ72j91N52l33J29J27p1j56O3k31
6233a99J20L89k30l3Q8l35J98k53J48%J36j09J53k11M7Q5k06J33K1K53k78J84
6255A01l6J47j00m4j34M05o14K39J7J5J69j50k38L22j23J46M7k23M0r5L60k81
6277c0p0l4J60k3o7J9o9K47j07j55J08R0j76J54m0K03j93m8P1k37K18J01R0k13
$$ plain form
6301 -1 -35 -102 -175 -10 -142 -145 -26 -85 121 105 -72 -151 -34 6 -103 -5 -208 -173 12 119 -57 -24 -96 -170 -17
6326 -17 172 33 156 -111 -283 -337 -159 -22 222 -83 -222 169 53 -19 -20 112 -114 -197 163 163 -155 -70 153
6349 153 -337 -79 -200 -58 -105 -119 -58 -241 18 67 52 109 -2 0 152 -2 189 2 -83 -27 -145 250 -129
6372 -129 -22 256 67 104 -117 -102 13 -127 256 204 -21 -174 18 79 -62 257 229 -115 -83 141 159 57
6394 57 -193 41 72 75 -168 372 154 -39 26 8 203 -26 -171 313 -84 55 -87 -16 148 74 240 -64 -53
6417 -53 -44 -116 112 60 500 -16 -9 -123 168 -77 154 -187 -150 221 29 224 253 42 -2 -20 -3 185 -359 -134
6441 -134 45 133 -229 -200 -165 76 -295 49 -175 -279 -201 -38 97 -51 -1 -124 -77 -35 -255 185 -105 55
6463 55 124 166 36 72 113 78 90 -205 121 91 112 -66 257 94 49 -103 13 -35 127 135 -15 95 60 -22 -104
$$ packed form
6301al4o7p3J65j32lJ19n9K06j6j77p9J17M0j09R8k03L5J85J07j76L3p2p4J53
6326a7J89j39J23k67j72n4J78J37K44l05j39L91j16p2jJ32k26q3L60%l18Q5K23
6349A53m90K58j21J42m7j4O1j83K59M9j5N7j11KJ52j54J91j87q5N6j18L95l79
6372a29J07K78j89L7k21J5J15j40L83n2k25j53J92O1j41L19k8l44L2K24J8j02
6394E7k50K34L1Lk43N40k18j93O5j8J95k29j45M84l97J39j42P1J64p4J66l04J1
6417e3Rp2K28n2M40n16Pj14K91k45K31l41L7L71j92J95K9k11m4j8J7J88n44K25
6441a34J79Q8l62K9L5K41l71L44k24j04P8J63J35j48N0j23M7M2k20M40k90J60
6463E5O9M2j30L6M1l5J2k95L26l0K1j78L23j63m5j52J16m8J62Qj50J10l5q2q2
$$ plain form
6488 -104 183 -109 32 -76 32 134 -155 84 272 -80 42 120 153 -173 -186 0 327 -185 92 -293 -22
6509 -22 -310 35 77 -81 221 151 -30 -212 39 211 -160 -116 220 129 -246 -38 -129 -115 -218 -88 -45 111 66
6532 66 -65 326 -21 -361 -202 -40 4 136 -313 -64 174 77 -208 -103 -80 102 -294 79 -212 -86 -64 -95
6554 -95 -44 -44 -52 -69 -120 -16 190 -24 23 -92 292 301 -165 28 -154 -170 278 -63 86 78 213 261 31 -10 175
6579 175 8 16 -36 -1 203 83 155 -35 -7 187 193 -86 -51 -186 -106 -138 -28 -87 -366 31 -2 115 -159 98
6603 98 1 79 92 -176 93 29 -126 -76 -229 136 94 140 -1 23 244 255 53 224 154 -164 52 125 -85 22
6627 22 -67 -120 -159 -16 -115 176 -174 -31 31 38 -47 -353 23 -290 -43 -177 53 297 87 -117 277 47 193
6650 193 -41 -43 247 24 75 128 -172 76 -330 -19 97 83 184 -126 -195 301 506 127 76 -62 170 42
$$ packed form
6488a04K87k92J41j08J08J02k89K39J88l52J22P8L3l26j3J86L27n12K77l85K71
6509b2k88L45M2j58L02p0j81j82K51J72l71M4L36r1l75K08r1J4j03J30M3J56m5
6532F6j31L91l47l40J59J62M4J32m49K49K38r7k85J05K3J82l96L73k91J26K2l1
6554i5N1%qj7n1J04K06k14M7j15L84Rm66J93j82j6M48l41J49qJ35M8k30m1J85
6579A75j67Qn2L5K04j20P2j90K8J94Ok79L5j35Q0l2J10n9k79L97l3J17k74K57
6603I8r7P8J3k68K69o4j55N0j53L65m2M6j41K4K21J1k02J71p0l18K16P3k10J07
6627B2q9n3l9J43r9K91l50J43O2Pq5l06L76l13K47j34K30K44k10k04L94k30J46
6650A93k34kK90k23N1N3l00K48m06L11J16j4J01l10o9M96K05l79n1j38K32j28
$$ plain form
6672 42 262 -226 180 -81 109 -28 -61 15 148 -140 -146 57 253 -186 -65 76 -122 28 94 178 -32 -31 -89
6695 -89 -85 -197 77 101 133 145 145 132 -138 -55 106 -54 -294 -321 -218 37 17 71 -192 -302 -59 -39 8 -55 -70 -58
6721 -58 122 24 16 174 75 90 -88 -14 -5 196 -71 -146 154 -120 -73 16 85 -97 375 -138 19 -141 29 -56 70
6746 70 82 30 81 -1 167 81 37 -73 -201 55 75 50 5 -124 -23 70 -81 -65 72 -63 -15 128 2 54 101
6771 101 210 -186 257 239 -38 174 -318 -116 116 -145 193 -19 232 -259 6 162 -20 51 -202 72 -45
6792 -45 178 222 -8 37 149 -68 20 18 187 -123 90 89 -209 -65 -125 -21 -12 -45 119 138 -134 -104 -205 49 138
6817 138 -125 59 21 -44 119 192 116 -104 11 -90 129 74 -81 -67 163 92 298 62 103 -20 168 81 -162
6840 -162 -165 -7 127 -159 107 -66 48 -89 -216 -219 -100 -2 49 74 -33 -70 143 86 -24 -231 -174 -15 -28 47
$$ packed form
6672D2K20m88M06k61J90j37l3P6J33k88oK03J96m39J21J41j98J50O6Q4k10Jn8
6695h9Mj12K74K4L2J2%j3k70Q3J61j60k40k7J03K55k0N4k63j10K43K0M7o3j5J2
6721e8J80r8qJ58r9J5j78P4RK01k67p5L00k74M7Q9O9j82M72n13J57j60J70q5J26
6746G0J2n2N1q2J68q6m4j10j28K56K0k5m5j29J01R3j51J6J37j35M8J43j26N2M7
6771A01J09l96M43j8k77K12m92K02K32k61L38k12K51m91K65J56j82P1k53K74j17
6792d5K23M4k30M5J12k17Q8kJ69l10K13jk98J44o0J04Rl3J64J9k72L0j01K54Q9
6817A38k63J84l8o5J63P3p6k20J15j01K19n5j55J4K30p1K06k36M1j23J88q7k43
6840a62lJ58J34k86K66j73J14j37j27lJ19R8N1K5j07l7K13n7j10k07N7J59j3P5
$$ plain form
6864 47 45 234 -326 -154 106 -119 243 -15 87 109 -128 -88 -67 109 70 136 259 164 -204 2 -49 146 102 12
6888 12 -139 -173 -69 35 58 -412 305 -212 -256 47 141 77 -214 -201 -35 -184 96 -19 62 89 42 193 69
6911 69 -22 218 106 -156 7 159 181 -105 -4 50 432 -86 -162 50 -121 -155 -32 -95 163 142 -77 -215 0
6934 0 85 -74 86 -84 -153 139 -15 -135 108 10 -66 28 -115 170 42 119 44 -59 -33 -169 -130 -125 -202 -60 -145
6959 -145 -36 104 -156 294 130 -211 249 -229 78 53 213 -226 40 16 -309 -103 -29 -100 -127 -60 97 319
6981 319 25 121 -92 -271 19 -367 -17 132 -8 -159 -94 -2 86 91 59 206 121 45 244 236 -267 -125 85 -13
7005 -13 138 100 -33 -236 100 233 -35 -69 104 243 -239 -80 181 -69 28 289 -61 -123 175 -417 -363 -87
7027 -87 -154 -27 108 41 165 -157 19 47 -289 154 137 18 301 -154 181 19 -58 41 113 -38 93 474 -166
$$ packed form
6864D7kJ89n60J72K60k25L62k58J02K2k37M0K1J76l9O6J23r5l68K06n1J95m4r0
6888A2j51l4J04J04K3m70P17n17m4L03R4o4k91J3J66j49K80j15Q1K7m7J51j24
6911F9r1K40j12k62J63J52K2k86J01N4L82n18p6K12j71l4J23o3K58k1k19j38K15
6934@Q5j59J60j70o9K92j54j20K43r8p6R4j43K85j28P7p5j03K6j36L9Np7J42q5
6959a45J09J40k60M50j64l41M60m78L07k5J60m39K66k4l25K06P4p1k7O7J57K22
6981C19k94R6k13j79K90l86L50J49j40j51O5R2Q8Nl2J47q5p6J99qn03J42K10r8
7005a3J51l8j33k03L36J33k68l4J73J39m82J59K61k50R7K61l50o2K98n92N4K76
7027h7o7J27J35o7J24l22J76K8l36M43j7j19K83m55L35j62p7R9P2j51J31L81o40
$$ plain form
7050 -166 -328 -42 194 -238 158 160 -116 -244 38 -273 72 72 -153 24 -22 -3 105 -44 97 -149 143 -64
7072 -64 -36 -161 47 -368 92 -9 239 35 -237 47 7 79 -240 49 127 50 248 -55 195 0 81 -220
7094 -220 51 -247 -346 33 -16 -315 38 -131 -293 253 -42 136 123 68 -120 -172 -382 13 -234 72 -41 53
7116 53 111 -11 -4 -1 44 -263 91 -157 -304 13 -186 -1 45 -196 97 186 66 -131 -73 -133 -180 117 -60 98
7140 98 129 51 -53 165 -188 -14 -80 41 -24 -145 -48 97 247 -209 15 157 29 108 38 52 291 -243 -92
7163 -92 -109 204 50 32 157 -25 -66 -152 57 47 17 -3 58 105 -35 292 -130 -34 -228 -45 152 -95 -130 -20
7187 -20 -190 126 60 -48 170 -226 16 -75 80 -105 51 -38 99 -10 134 123 -102 -37 79 -210 -233 -51
7209 -51 230 -12 -47 -106 40 22 -111 28 -130 -173 -26 12 14 166 14 21 41 -143 231 -213 2 -77 -19 0 -35
$$ packed form
7050a66j62K86K36m32L96Kk76j28K82l11L45%k25J77m6J9J08j49J41k46K92k07
7072f4K8j25K08m15M60j01K48k04k72K84m0P2l19K89P8p7J98l03K50j95Q1l01
7094b20K71k98r9L79m9k99L53j69j62N46k95J78j3n5j88n2k10L95k47L06j13R4
7116E3N8j22PLM5l07L54k48j47L17j99J85M6k41K93Q9j20j97N8o0m7K97j77J58
7140I8L1p8j04K18l53J74o6J21o5j21R7J45J50m56K24J42j28P9p0J4K39n34J51
7163i2j7L13j54j8J25j82m1q6K09j0l0k0O1M7j40L27m22R6j94J83J97k47l5J10
7187b0j70L16o6j08K18l96K42r1J55j85J56q9J37j09J44j1k25O5J16k89k3J82
7209e1K81k42l5n9J46j8j33J39j58m3J47L8KJ52j52PK0j84L74m44K15p9N8J9l5
$$ plain form
7234 -35 140 -116 227 -123 -58 56 -56 -1 71 67 -141 -137 36 56 296 -35 -125 -280 -59 -115 -29 -144 228 78
7258 78 -177 -167 -176 -127 -28 -236 88 -83 -219 192 -24 137 23 -43 126 -93 -127 54 150 58 -249 3 24 -82
7282 -82 -50 -317 -192 110 -288 34 -3 -88 -40 -40 -24 281 89 -28 -107 -58 -63 -284 -264 9 1 130 145 152 -105 -11
7308 -11 1 -14 -28 -76 -107 -142 -108 -65 -8 139 61 -176 1 68 71 25 -174 -3 36 316 173 -77 -83 327 161 208
7334 208 -49 -103 -193 119 77 -68 257 -246 -63 172 324 -221 -182 57 -67 27 0 -235 24 -137 -38 168
7356 168 -125 -25 -301 135 40 19 -108 86 191 -107 128 84 106 -49 138 228 56 166 -3 128 28 384
7378 384 -8 -22 4 -248 22 32 -152 -118 -27 -216 -56 -152 -96 -153 -229 134 -262 -95 -92 103 -216 210 215 51
7402 51 24 -191 -243 -148 203 -239 253 264 -105 220 13 -74 134 -118 2 -149 34 154 130 -99 65 -94
$$ packed form
7234c5J75k56L43l50O5J14j12N5P2mk08MJ73K0K40l31r0j55K21n6Q6j15L72j50
7258G8k55J0rM9R9k08L24j71j36M11k16J61j14o6J69k19l4J81R6r2l07K52K1j06
7282h2L2k67J25L02l98L22l7q5M8%J6L05j92j17p9M9nk21K0K73qJ29J5Pk57R4
7308a1J2j5j4m8l1l5L4M3N7J47p8k37J77O7Lm6j99J71L9K80j43k50oM10j66M7
7334B08k57n4r0L12m2j45L25n03J83K35J52n45L9K39j24R4k7k35K59j61R9K06
7356A68k93J00k76M36r5k1j27J94J05k98K35m4K2j55J87R0j72J10j69J31j00L56
7378C84l92j4K6k52K70J0j84L4R1j89J60r6N6n7p6L63l96J67LJ95l19M26Nj64
7402E1k7k15n2R5L51m42M92J1l69L25k07q7K08k52J20j51J83J20k4k29J64j59
$$ plain form
7424 -94 92 -126 -90 11 66 85 -7 197 -142 147 19 32 -9 -60 -42 -161 -165 -404 -262 -21 -67 23 209 47
7448 47 51 -92 93 -309 -131 21 -168 -175 -87 52 147 115 -281 52 2 -98 380 106 81 51 6 159 -175 -73
7472 -73 -220 108 -130 -157 -71 -136 64 -46 30 51 -261 -55 -63 -80 -23 -119 -53 134 209 -81 86 59 -38 -15 64 -92
7498 -92 -2 -327 218 38 58 -107 -71 156 -184 -17 -91 147 -139 90 166 299 147 -32 -181 191 10 174
7520 174 -59 73 146 -294 -23 -141 167 119 99 30 -133 -134 47 -3 74 105 75 -98 164 1 177 -158 -10
7543 -10 -490 -37 -80 2 -1 9 204 125 -92 11 -38 -4 -24 -77 78 59 316 193 44 106 120 -278 -217 -69 -130
7568 -130 129 27 93 -170 28 246 -19 127 204 -88 -192 -125 4 213 208 -107 -80 137 -248 -36 -242 42
7590 42 -21 -191 -215 97 298 42 164 -189 -46 -39 -79 -101 17 -294 -14 16 189 117 91 175 118 -112 56 -191
$$ packed form
7424i4J86k18L6J01N5J9r2K04l39K89j28J3m1n1J8j19mk39J42K41m6R0J86j62
7448D7Mj43J85m02J78J52j89pQ8J39R5l2l96L33n0j00M78k74k5l0m5J53l34J02
7472g3j47L28k38k7Q6o5K00j10P6K1l12K06qj7N7r6O6J87P5k90J67k7r7K3P9j56
7498i2R0l25N45j80K0j65L6K27l40J67p4K38k86K29P6J33j52j79j49L72j81J64
7520A74k33J32P3m40K71j18L08m8k0o9j63jJ81n0P7L1l0j73K62j63J76l35J48
7543a0m80M53m3Q2lJ0J95p9k17J03m9L4k0n3J55j9K57j23j49O2J4l98O1J48o1
7568a30K59j02O6k63J98K18k65J46P7k92j04O7J29K09nl15K7K17l85K12k06K84
7590D2o3j70k4L12K01k56J22l53J43Pm0k2J18l11K80L0J73p2k6Q4n7k30J68k47
$$ plain form
7614 -191 -33 -46 -172 133 109 140 -197 191 -163 160 49 79 31 119 -23 98 160 -341 -3 -29 30 -7 204
7637 204 129 -65 -81 37 286 -127 82 76 -105 -142 257 -108 -104 56 -200 13 79 26 24 205 59 13 -116 127
7661 127 158 61 -138 72 261 154 -358 -55 245 -65 45 -264 -256 30 152 1 14 76 34 -100 -57 -19 23
7684 23 -50 -280 -8 184 -25 -105 16 105 -88 -294 -166 -47 75 137 116 -360 87 35 -269 60 3 447 44
7707 44 116 186 124 -190 72 -165 106 146 95 -193 175 72 257 236 39 180 77 117 127 52 -170 25 208
7730 208 -49 -49 71 -107 3 49 157 -203 -37 63 41 -186 121 -140 -31 141 -252 -154 42 -91 187 103
7752 103 -51 -74 390 219 -70 -27 203 32 -287 168 -61 -6 -22 -41 -57 -40 102 -49 -170 -59 33 -8 43
7775 43 417 -3 -121 -58 -132 80 198 -154 92 182 -74 -87 -31 84 -83 -129 -87 -73 57 -46 -42 81 -50 172
$$ packed form
7614a91J58j3j26L05k4L1l37L88l54L23j11L0m8Q8j42J21O2n01L38k6N9l7K11
7637B04p5j94j6J18K49m13K09oj81l7L99l65MJ60k56K13O6n3kJ81j46m6j29K43
7661A27L1r7j99K10J89j07n12L03L00l10J10l09QK86J22j51J3O2m2j34M3L8M2
7684B3p3k30K72J92k09q0J21Q9j93k06J28J19J22O2k1m76M47n2l04L29n7M44m03
7707D4P2P0o2l14K62k37K71M0n1k88L68j03J85k1j97J41j03M0J0p5k22J95J83
7730B08k57%J20j78J10M6J08l60J66J00k2k27L07k61J09J72l93R8J96j33K78q4
7752A03j54k3M64j71k89M3K30j71l19M55k29N5j6j9j6J7J42j51j21J11R2m1N1
7775D3L74m20j18O3p4K12J18l52K46R0k56j3N6J15j67m6M2J4J30j03MJ23j31K22
$$ plain form
7799 172 77 -4 -119 -111 150 219 -246 80 -45 -101 -99 -29 52 -145 -47 175 219 -332 88 68 -64 -51 48 100 170 -10
7825 -10 -7 -6 55 -44 148 217 -157 59 -217 49 -101 -1 -5 -246 -156 116 -61 -61 -186 109 110 1 -227 -217 -35
7850 -35 81 52 -27 114 26 -147 123 126 -80 -115 181 -60 -32 205 318 -85 7 31 49 211 82 -352 130 186
7874 186 -79 97 187 27 -17 115 77 -61 -69 -189 -257 169 208 81 16 88 -114 -27 206 -99 108 -415 216
7897 216 -131 -90 142 114 191 110 -12 -365 278 319 -5 35 -3 -83 -179 -38 -146 -28 -16 -58 172 -66 192 -106
7921 -106 -7 40 203 48 135 127 51 73 3 -100 116 -111 -99 212 -145 22 -86 -17 -194 -373 28 -255 194
7944 194 19 -248 -110 92 -132 71 165 83 -34 200 51 70 132 -88 145 -130 55 -55 -88 22 146 7
7966 7 35 -88 -93 -98 194 -37 -318 4 -76 -44 -11 154 -281 -69 -52 -77 18 -66 272 55 12 -139 -170 -237 -173 -70
$$ packed form
7799A72r5q1j15QK61O9m65L26j25n6KP0Q1j97R8K22M4n51M20k0j32J3R9N2P0j80
7825a0LJO1r9J92O9l74K16k76K66j50J00mk41R0K72j77%j25K95Jj09k28J0J82
7850c5J16k9p9J41q8j73K70Lk06l5K96k41K8K37J13m03R2K4J8J62j29m34M82N6
7874A86k65J76R0j60m4J32l8j38qj20o8M26L9j27o5P2k02Q7K33l05K07n23O31
7897B16l47M1K32k8P7q1j22l53O43M1l24M0l8q0r6J41j08J18J2m2K30k38K58k98
7921a06R9M7J63j55Q7qp6K2p0j03K16k27J2L11l57J67j08O9j77j79M01k83M49
7944A94j75k67J38K02k24K03R4q2j17K34j49J9O2k20K33k75J85j10l3J10J24j39
7966GK8j23nnK92k31k81L22q0L2L3J65m35K12J7k5R5q4L38k17m3j51l1o7O4J03
$$ plain form
7992 -70 -5 -47 -130 -24 16 91 -74 181 -16 -37 -39 -161 -55 -60 419 206 -32 -152 -29 135 32 23 -132 18
8016 18 -154 -217 -317 -178 64 66 -18 -85 36 -79 13 -61 14 -196 -28 9 -176 301 -229 -24 -117 101 36 -164
8040 -164 -144 3 -113 141 131 -200 -174 -201 244 -107 188 72 -117 -235 63 -80 -90 158 59 84 70 -223 -70
8063 -70 -36 55 172 -82 34 32 56 54 -80 -394 292 -264 -65 -78 -137 -258 26 -136 176 116 -103 199 -130 129
8087 129 108 22 -50 -239 125 -75 210 260 195 -93 27 -152 -366 45 -70 -90 111 -9 43 -220 -128 128 -124
8110 -124 113 -59 148 -144 152 6 57 -21 -149 -89 42 78 -167 48 120 103 75 -88 78 -259 56 -143
8132 -143 38 72 -111 390 -26 -15 60 -52 29 137 48 -61 377 -264 302 -216 -75 -62 -180 -48 -364 -135
8154 -135 -14 187 -72 -153 -60 -158 -88 180 -59 53 108 5 129 202 14 171 144 -29 227 -40 -64 -164 105
$$ packed form
7992g0O5m2q3J06M0P5j65K55j97k1kj22J06nM79k13k38j20J23J64j03rj55J50
8016A8j72o3j00J39K42Kq4o7J21j15R2p4P5k10J68L7j85M77n30K05r3K18o5k00
8040a64K0J47j16K54j0l31K6k7M45l51K95j16j89j18K98j43j0K48r9K5j4k93J53
8063g0L4R1J17k54J16kK4kj34l14O86n56J99j3n9j21K84j62L12o0k19L02l29K59
8087A29k1q6p2j89L64k00K85N0o5k88J20j79k14M11j15k0K01j20N2k63R2K56k52
8110a24K37j72K07k92K96j46N1p8j28O0J31L6k45K15P2j7k8j63J66l37L15j99
8132a43J81L4j83N01m16J1P5j12Q1J08q9j09M38o41N66n18J41J3j18J32l16K29
8154a35J21K01k59q1R3r8P0K68k39J12N5j03J24P3j88J57k7j73K56k67k4j00K69
$$ plain form
8177 105 -67 -87 89 -92 -208 -4 54 -35 -68 -6 121 -54 -134 73
$$ packed form
8177A05j72k0J76j81j16K04N8q9l3O2J27j75q0K07
8191G3
$$ Imaginary data points
##PAGE= N=2
##DATA TABLE= (X++(I..I)), XYDATA
$$ plain form
0 0 0 0 0 0 0 0 0 0 0 8 -8 8 -8 16 -16 24 -24 32 -40 48 -56 64 -80 96 -112 128 -152 172 -200 228 -262 298
32 298 -339 386 -434 489 -547 614 -686 765 -853 947 -1050 1162 -1285 1421 -1566 1727 -1904
49 -1904 2098 -2310 2546 -2806 3097 -3422 3790 -4207 4685 -5245 5904 -6695 7667 -8893
63 -8893 10496 -12694 15904 -21053 30681 -54945 254593 298738 -274104 -310610 -58455 213284
75 213284 129994 -44346 -102526 39647 107042 31729 -112863 -117971 1563 143193 136800
86 136800 9845 -122250 -113484 1455 107900 87360 -9203 -71243 -32253 25272 27706 -19419
98 -19419 -33132 7357 53238 35145 -24737 -60426 -29885 28184 55568 27459 -21369 -42393
110 -42393 -19733 15326 25368 6272 -13067 -9188 7797 9260 -7997 -18703 -5055 17727
$$ packed form
0@%%%%%%%%%Qj6J6j6K4l2M0m8N6p2Q8j04J20j44J76k08K40k80L24l72M28m90N60
32B98o37P25q20R23j036J161j300J451j618J800j997K212k447K706k987L293l631
49a904M002m408M856n352N903o519P212p997Q892r930J1149j2599J4362j6560
63h893J9389k3190K8598l6957N1734q5626L09538M4145n72842l6506K52155K71739
75B13284q3290j74340n8180J42173O7395p5313j44592n108J19534J41630o393
86A36800j26955j32095Q766J14939J06445k0540r6563o2040L8990N7525K434m7125
98a9419j3713M0489M5881j8093n9882l5689L0541N8069K7384k8109m8828k1024
110d2393K2660L5059J0042j9096j9339L879J6985J463j7257j0706J3648K2782
$$ plain form
122 17727 21656 544 -20183 -19148 1184 16344 12284 -2091 -11157 -7632 1903 5343 1231 -3433
136 -3433 -2330 2599 4565 -459 -6664 -5476 2342 7941 4705 -3923 -7658 -3435 3133 5171 1183
151 1183 -2674 -2841 -399 1209 343 -1159 -1089 1259 1883 133 -2485 -2739 -331 2758 2545 -386 -2639
168 -2639 -2158 632 2179 914 -565 -691 -174 613 196 -517 -428 410 993 346 -363 -933 -174 872 915
187 915 436 -665 -796 -296 186 257 246 -46 422 288 -510 -274 15 507 524 477 -356 -518 -344 304 316 543
209 543 -45 -322 -102 77 128 59 -46 16 151 44 -117 -170 -82 20 358 -6 -189 -206 -97 67 0 232 -280
232 -280 -91 -47 -5 193 -21 103 178 99 -44 -12 124 117 243 38 -122 182 4 -30 -153 -8 -162 -299 463
255 463 -84 90 -196 -31 28 200 705 -347 -606 239 189 -398 109 -632 -48 555 -605 -13 25 -13 520
$$ packed form
122A7727L929k1112k0727J035K0332J5160m060j4375r066L525R535L440m112m664
136c433J103M929J966n024o205J188P818N599l236q628l735M223O568K038l988
151A183l857j67K442J608q66j502P0K348O24j750k618k54K408L089k13k931k253
168b639M81K790J547j265j479j26N17P87m17p13Q9Q38N83o47p09n70P59J046M3
187I15m79j101j31N00M82P1j1k92M68j34p98K36K89M92J7m7q33j62J74O48J2K27
209E43n88k77K20J79N1o9j05O2J35j07j61n3Q8J02L38l64j83j7J09J64o7K32n12
232b80J89M4M2J98k14J24P5p9j43L2J36pJ26k05j60L04j78l4j23J45j54j37P62
255D63n47J74k86J65N9J72N05j052k59Q45n0n87N07p41N84O03j160N92L8l8N33
$$ plain form
276 520 -180 -135 -553 651 -217 -95 -40 811 476 -370 -539 -103 -544 182 -96 -822 209 111 338 607 126
297 126 -98 744 160 904 261 668 518 -415 -156 1325 304 -462 -632 430 340 400 6 274 -319 -63
317 -63 459 -264 -92 -292 51 47 26 -368 2 257 168 -60 255 87 134 -33 141 -190 -22 63 -127 65 143
340 143 -82 109 330 -82 -167 77 -157 -96 104 -43 -175 -129 253 263 20 -95 -11 125 -8 -273 33 -175
362 -175 -211 -173 -148 24 126 -259 -7 -35 -74 -203 88 29 -97 76 -31 -95 144 -115 -36 -200 71 41 105 -106
386 -106 164 -316 149 2 -306 -38 -65 40 150 -276 117 200 -226 177 74 25 36 -212 -50 -21 -39 107
408 107 -256 2 1 -264 106 -14 -108 -256 -7 -73 -162 46 -394 25 25 428 -72 -222 177 111 38 69 76 145 -65
433 -65 221 6 55 16 57 -49 -239 -68 175 -104 296 -130 -96 294 -234 -317 53 123 -216 -82 103 88 9
$$ packed form
276E20p00M5m18J204q68J22N5Q51l35q46j69M36m41P26k78p26J031r8K27K69m81
297A26k24Q42n84P44o43M07j50r33K59J481j021p66j70J062r0O0l94K68n93K56
317f3N22p23J72k00L43mk1l94L70K55q9k28L15j68M7j67J74l31J68Q5j90J92P8
340A43k25J91K21m12q5K44k34O1K00j47j32M6L82J0k43j15Q4J36j33k65L06k08
362a75l6L8K5J72J02l85K52k8l9j29K91n9j26J73j07o4K39k59P9j64K71l0O4k11
386a06K70m80M65j47l08K68k7J05J10m26L93Q3m26M03j03m9J1k48J62K9j8J46
408A07l63K58jk65L70j20r4j48K49o6q9K08m40M19%M03n00j50L99o6p3L1PO9k10
433f5K86k15M9l9M1j06j90J71K43k79M00m26L4L90n28q3L70P0l39J34J85j5p9
$$ plain form
456 9 -68 -262 -75 91 69 1 78 -149 -11 4 24 -147 -53 114 -105 71 -76 133 209 -27 36 -166 129 -104
480 -104 4 -93 -151 30 159 34 131 -301 204 8 -170 -4 62 -104 44 39 117 -19 121 152 22 -98 33
503 33 32 122 -67 31 109 31 -88 -30 42 224 55 -61 163 48 -258 246 138 -141 207 354 149 -94 -211
526 -211 -165 -7 114 -163 116 30 151 122 25 -43 -83 3 -144 83 80 -42 -81 -390 -108 -34 161 -36 102 77
550 77 84 37 -43 -173 161 161 -96 68 -9 -128 244 50 117 -2 81 20 235 161 -107 115 145 -338 60 -109 132
575 132 -146 -30 105 -175 222 -142 -124 -111 -27 -45 185 208 -1 -172 4 89 157 301 -28 -114 -34 18 -47 72
599 72 -45 -78 241 -219 114 -123 15 -19 -218 -147 -5 -294 -81 350 -32 -7 -115 -3 51 -33 132 43 147
622 147 -28 -118 82 -25 -133 7 322 -54 147 -115 116 22 121 -121 250 144 162 24 51 -110 37 149
$$ packed form
456Ip7j94J87J66k2o8P7k27J38J5K0j71R4J67k19J76j47K09P6k36O3k02K95k33
480a04J08r7n8J81J29j25R7m32N05j96j78J66O6j66J48nP8j36J40L1j30j20J31
503C3jR0j89R8P8p8j19N8P2J82j69j16K24j15l06N04j08k79L48J47k05k43j17
526b11M6J58J21k77K79q6J21k9r7o8m0Q6j47K27lj22l9l09K82P4J95j97J38k5
550G7Pm7q0j30L34%k57J64p7j19L72j94O7j19Q3o1K15p4k68K22L0m83L98j69K41
575A32k78J16J35k80L97l64J8J3Q4j8K30K3k09j71J76Q5O8J44l29q6Q0N2o5J19
599G2j17l3L19m60L33k37J38l4j99P1J42k89K13M31l82K5j08J12N4q4J65q9J04
622A47j75r0K00j07j08J40L15l76K01k62K31r4R9k42L71j06J8j38K7j61J47J12
$$ plain form
644 149 65 106 178 -193 288 127 -145 104 74 8 -74 178 4 -86 69 -94 -112 207 -26 -13 -46 -37 273 72
668 72 -191 -157 90 -195 170 184 -124 49 63 -58 158 17 56 -52 -160 103 106 -66 -6 -37 257 -112 -83 -113
692 -113 -144 212 -127 -18 -50 -96 -194 270 66 -132 34 11 -34 241 -196 -360 -60 43 163 -185 -125 196 94
715 94 262 176 -17 43 -143 25 -98 -34 -39 -123 -43 15 186 63 195 -53 90 -170 252 -81 -76 212 58 55 -121
740 -121 -13 -59 -41 271 -26 -148 26 -131 -59 -178 35 26 196 -175 -179 31 -226 -16 240 99 -278 10 -123
763 -123 26 -90 -61 244 56 22 -109 173 61 127 33 94 -85 326 -72 -79 256 6 -227 -159 -46 -101 53
786 53 133 193 -108 77 129 82 -17 29 30 50 -4 7 -36 -65 121 280 264 160 32 -52 139 -40 -5 -28 166 10
812 10 13 -94 -147 61 22 14 -309 47 -483 -1 -203 -38 27 293 89 -94 158 54 -66 264 181 163 252 29
$$ packed form
644A49q4M1P2l71M81j61k72K49l0o6q2K52j74r0J55j63j8L19k33J3l3RL10k01
668G2k63L4K47k85L65J4l08J73J4j21K16j41L9j08j08K63Lj72O0l1K94l69K9l0
692a13l1L56l39J09l2m6r8M64k04j98J66k3m5K75m37j64L00J03J20l48O0L21j02
715I4J68q6j93O0j86J68j23O4nq4Q0N8J71j23J32k48J43k60M22l33NK88j54lj76
740a21J08m6J8L12k97j22J74j57P2j19K13rJ70l71mK10k57K10K56j41l77K88j33
763a23J49j16K9L05j88l4j31K82j12O6r4O1j79M11l98pL35k50k33O8J13n5J54
786E3Q0O0l01J85N2m7r9M6JK0n4J1m3k9J86J59j6j04j28q4J91j79L5k3J94j56
812A0Lj07n3K08l9ql23L56n30M82k02J65O5K66k04j83K52j04j20L30q3j8Q9k23
$$ plain form
836 29 17 -72 49 -33 -211 -4 154 -128 -49 -168 -158 -27 160 -210 50 49 -114 192 -65 -108 423 116 -152
859 -152 -140 80 -171 179 57 220 -8 124 -82 116 82 85 -142 -14 -240 -29 324 44 442 -168 174 -104
881 -104 148 -32 150 -41 5 -107 -60 145 -123 59 151 -95 56 94 -132 174 191 -200 282 29 -178 185
903 185 33 -45 191 -76 -201 60 290 5 -163 -159 231 -180 -85 -47 74 35 -115 -7 -275 24 -6 -69 28
926 28 28 169 54 122 147 186 193 49 -100 34 44 -69 25 44 124 -88 -86 68 -43 38 -335 -22 -405 32 258
951 258 -40 66 -45 -77 -221 -91 -2 135 -85 -128 17 -109 -98 -213 -171 141 -63 149 82 125 140 -29 -70
974 -70 -365 94 -152 49 88 -147 -222 -2 -4 74 51 219 -108 73 -91 -119 -162 -74 97 -145 -190 -193 191 -89 127
999 127 -322 -72 6 -66 -138 -151 9 20 163 66 -79 -112 85 127 109 -43 -108 -24 -168 -118 -222 291 -69 213
$$ packed form
836B9j2q9J21q2j78K07J58k82P9j19J0J31J87l70K60jj63L06k57m3N31l07k68
859a52J2K20k51L50j22J63k28J32k06J98l4Lk27J28k26K11L53k80L98o10L42k78
881a04K52j80J82j91M6j12M7K05k68J82R2k46J51L8k26L06J7l91M82k53k07L63
903A85j52p8K36k67j25K61K30k85j68ML90m11R5L8J21l9j50J08k68K99l0o3R7
926B8%J41j15O8K5L9Pj44j49J34J0j13R4J9Q0k12KJ54j11Q1l73L13l83M37K26
951B58k98J06j11l2j44J30Q9J37k20m3J45j26J1j15M2L12k04K12o7M3J5j69m1
974g0k95M59k46K01L9k35p5K20kP8k3J68l27J81j64k8m3Q8J71k42m5lL84k80K16
999A27m49K50P8p2p2j3J60J1J43r7j45l3J97M2j8j52o5Q4j44N0j04N13l60K82
$$ plain form
1023 213 22 -116 -53 50 12 241 197 134 -21 -288 216 -32 -130 -13 112 118 -199 -233 -136 228 -110 337 -2
1046 -2 226 -298 -262 52 282 -29 201 213 97 160 82 -81 -30 -108 -8 -187 -175 -76 68 -90 -203 212 -108
1069 -108 109 154 68 114 287 -29 57 222 -126 265 -7 258 -49 139 -161 98 -65 153 38 -136 -59 67
1091 67 -211 42 -88 26 -179 80 -80 205 48 45 -171 -287 -53 11 -66 -172 132 -40 -138 138 -172 -87
1113 -87 142 80 -51 30 -231 67 166 2 -8 -139 88 -197 -55 -62 55 92 208 46 -265 36 239 -189 -222
1136 -222 162 123 19 -259 -40 65 73 49 -20 131 12 -91 328 211 46 235 63 -233 96 -6 7 260
1158 260 202 -48 -187 -81 -26 118 185 -31 208 1 32 25 -28 -105 71 -193 -67 -67 -182 56 201 82 59 -38
1182 -38 243 -86 93 204 48 36 -3 314 -111 127 -30 -95 -42 -62 232 186 164 394 93 -209 21 -226 39
$$ packed form
1023B13j91j38O3J03l8K29m4o3j55k67N04k48r8J17J25Ol17l4R7L64l38M47l39
1046bK28n24L6L14K30l11K30J2j16O3p8j63N1p8J00j79J2R9J44j58j13M15l20
1069a08K17M5q6M6J73l16Q6J65l48L91k72K65l07J88l00K59j63K18j15j74P7J26
1091F7k78K53j30J14k05K59j60K85j57lk16j16K34O4p7j06L04j72r8K76l10Q5
1113h7K29o2j31Q1k61K98R9j64j0j31K27k85J42pJ17L7J16j62l11L01K03m28l3
1136b22L84l9j04k78K19J05Qk4o9J51j19j03M19j17j65J89j72k96L29j02J3K53
1158B60n8k50j39J06N5J44O7k16K39k07L1pn3p7J76k64J26%j15K38J45j19k3r7
1182c8K81l29J79J11j56j2l9L17m25K38j57o5N3k0K94m6k2K30l01l02K30k47K65
$$ plain form
1205 39 -180 165 191 -49 115 -26 -85 -213 122 191 190 275 70 78 32 52 -61 12 166 196 -204 91 78 32 23 -108
1231 -108 -23 26 42 -211 -11 -58 -2 -157 51 172 -19 -102 -59 167 74 38 -186 -57 56 107 -392 396 -79
1254 -79 -116 293 286 35 2 51 -6 -22 381 145 -117 28 118 -346 7 335 127 13 150 152 -62 -173 229 27
1278 27 159 -42 -291 -399 -133 -86 -133 134 112 9 84 232 10 252 -130 14 193 -148 -26 64 -153 347
1300 347 -90 61 72 56 -14 -87 22 49 26 -65 -190 69 -26 -175 -147 72 -92 105 68 260 11 -1 -83 73
1324 73 -107 127 -164 36 -67 97 55 31 50 -112 70 -240 -154 -299 -104 -117 130 27 -43 98 -181 -97 164
1347 164 124 -190 219 -289 -202 195 -62 54 -137 152 162 -78 293 11 254 127 129 -97 16 -257 -49 132
1369 132 -21 110 -69 364 -136 -115 -10 80 286 38 -63 17 50 -50 -198 114 -362 208 -162 -167 6 13 0
$$ packed form
1205C9k19L45K6k40J64j41n9j28L35O9jQ5k05Qm6K0j13P3J54L0m00K95j3m6rj31
1231a08Q5M9J6k53K00m7N6j55K08J21j91q3M3K26r3l6k24J29J13N1m99P88m75
1254g9l7M09pk51l3M9n7j6M03k36k62J45R0m64L53L28k08j14J37Kk14j11M02k02
1278B7J32k01k49j08K66M7m7K67k2j03P5J48k22K42l82J44J79l41J22R0k17N00
1300C47m37J51J1j6p0p3J09K7k3r1j25K59r5j49K8K19j64J97l7J92k49j2q2J56
1324G3j80K34k91K00j03J64m2k4J9j62J82l10Q6j45J95j3K47j03p0J41k79Q4K61
1347A64m0l14M09n08Q7L97k57J16j91K89J0k40L71k82K43j27Kk26J13k73K08J81
1369A32j53J31j79M33n00K1J05R0K06k48j01Q0L3j00j48L12m76N70l70nJ73Pj3
$$ plain form
1392 0 -192 -139 -162 214 -198 90 -142 -98 -98 123 31 -156 117 -1 -60 6 27 -179 211 -192 -251 117 164 -148
1416 -148 -15 76 -151 44 -103 -30 -99 49 -38 -53 313 217 63 15 132 -51 -26 -182 -73 235 -12 3 -139
1439 -139 244 -76 77 -166 21 -106 223 271 169 -9 -139 281 -24 63 110 6 -18 125 -53 92 -119
1460 -119 -39 71 -143 124 74 -394 159 -142 163 62 133 14 142 387 -147 -83 -152 180 68 70 -220 -143 215
1483 215 -31 39 18 40 -116 -227 165 -107 131 -98 21 -117 110 -98 -65 -39 -141 -22 263 67 184 114
1505 114 91 -26 -18 -245 -328 45 193 166 315 -134 -87 -118 -18 -69 17 94 -187 56 214 215 216 -77 -108 184 362
1530 362 3 -14 -107 -47 386 -291 -256 71 235 38 -131 196 -10 -102 15 219 -10 159 -212 -285 -81 -67
1552 -67 13 46 234 183 26 -79 57 69 -78 -173 76 12 45 294 32 242 33 -70 -98 260 315 136 -62
$$ packed form
1392@j92N3k3L76m12K88k32M4%K21r2j87K73j18n9O6K1k06L90m03n9L68M7l12
1416a48J33R1k27J95j47P3o9J48q7j5L66r6j54m8J17j83K5j56J09L08k47J5j42
1439a39L83l20J53k43J87j27L29M8j02j78j30M20l05Q7M7j04k4J43j78J45k11
1460a19Q0J10k14K67n0m68N53l01L05j01P1j19J28K45n34O4o9L32j12Kk90P7L58
1483B15k46P0k1K2j56j11L92k72K38k29J19j38K27k08L3K6j02J19K85j96J17p0
1505A14k3j17Qk27q3L73J48k7J49m49M7l1J00n1Q6P7k81K43J58JJk93l1K92J78
1530C62l59j7r3O0M33o77L5L27J64j97j69L27k06r2J17K04k29J69l71p3K04J4
1552f7Q0L3J88n1j57j05J36J2j47r5K49o4L3K49k62K10k09j03k8L58N5j79j98
$$ plain form
1575 -62 -159 60 -31 -28 -94 67 -73 87 -94 47 -106 -161 114 366 -17 168 80 -84 -56 -41 -196 135 -133
1598 -133 -51 115 249 -9 -79 39 -124 146 377 151 34 -8 1 -22 -172 -56 -95 25 84 336 537 -37 98
1621 98 -115 158 -17 243 -23 -172 -24 -15 -84 -189 156 -3 94 -214 98 434 -186 183 -110 -218 -51 15
1643 15 127 129 -155 182 23 83 89 -40 41 81 -26 -121 -118 126 47 -8 7 -148 -1 9 -20 19 145 -168 -59 -79
1669 -79 -271 -254 -272 -41 35 -33 -246 -90 68 40 228 87 -90 36 145 114 -103 -100 294 112 -115 62 -87
1692 -87 -62 -32 -388 161 266 -18 191 22 -271 -15 10 -161 85 112 200 -133 -63 29 20 -360 -58 158 -228
1715 -228 -16 -27 -87 158 191 -25 34 218 -230 202 -146 -124 -49 3 240 -88 67 -18 -146 -116 65 235 -54
1738 -54 -79 145 2 -46 -18 -216 264 -113 -61 165 -48 -21 -332 65 -95 -53 169 -85 -203 104 -284 168
$$ packed form
1575f2r7K19r1Lo6J61j40J60j81J41j53n5K75K52l83J85q8j64K8J5j55L31k68
1598a33Q2J66J34k58p0J18j63K70K31k26j17m2Rk3j50J16l9J20N9K52K01n74J35
1621I8k13K73j75K60k66j49J48Ro9j05L45j59R7l08L12L36o20L69k93j08J67O6
1643A5J12Kk84L37j59O0Oj29Q1M0j07r5LK44p9n5J5j55J47J0k9L9J26l13J09k0
1669g9j92J7j8K31P6o8k13J56J58k8J88j41j77J26J09l1k17LL94j82k27J77j49
1692h7K5L0l56N49J05k84K09j69k93K56K5j71K46K7Q8l33P0R2rl80L02K16l86
1715b28K12j1o0K45L3k16N9J84m48M32l48K2P5N2K37l28J55q5j28L0J81J70k89
1738e4k5K24j43m8K8j98M80l77N2K26k13K7l11L97j60M2K22k54j18L07l88M52
$$ plain form
1760 168 -240 89 108 -188 -37 -53 223 -28 129 73 15 -128 117 -4 -99 -127 263 118 45 -235 128 -20
1782 -20 150 32 -77 278 81 65 12 -25 -132 -47 87 36 -193 -98 -349 -35 80 -31 -67 23 -43 -103 -118 -95
1806 -95 -88 167 -257 192 111 70 106 -110 145 138 205 -19 -20 100 31 153 122 34 58 -37 207 59 25 -123 245 -11
1832 -11 -33 -73 -190 119 -22 103 154 29 -88 -54 39 10 175 -181 -70 177 167 193 125 -53 -116 81 -4 52
1856 52 -137 86 53 -36 225 -47 256 280 115 -80 -203 -60 -42 198 85 -61 20 -81 -17 -215 21 -47 -29
1879 -29 102 -23 145 54 -51 -192 -60 -46 38 71 269 19 -203 -263 46 17 197 -25 -32 -57 -50 -139 -218 170 -224
1904 -224 80 57 -138 40 -74 256 -11 5 -145 93 -1 -37 25 -130 78 70 -68 32 -83 -92 -94 -207 -108 -41
1928 -41 -214 121 48 -71 59 -179 -169 -66 -33 -5 41 -261 214 67 51 -115 64 158 -14 311 115 -196 -200
$$ packed form
1760A68m08L29J9k96J51j6K76k51J57n6n8j43K45j21r5k8L90j45p3k80L63j48
1782b0J70j18j09L55j97j6n3l7j07Q5J34n1k29R5k51L14J15j11l6R0o6o0j5K3
1806i5PK55m24M49q1m1L6k16K55pO7k24jJ20o9J22l1q8K4r5K44j48l4j48L68k56
1832a1k2m0j17L09j41J25N1j25j17L4R3k9J65l56J11K47j0K6o8j78o3J97q5N6
1856E2j89K23l3q9K61k72L03K4j65j95j23J43J8K40j13j46Q1j01O4j98K36o8J8
1879b9J31j25J68r1j05j41J32J4Q4L3J98k50k22o0L09k9J80k22pk5Pq9p9L88l94
1904b24L04k3j95J78j14L30k67J6j50K38r4l6O2j55K08qj38J00j15rkj13R9O7
1928d1j73L35p3j19J30k38J0J03L3K8M6l02M75j47j6j66J79R4j72L25j96l11m
$$ plain form
1951 -200 -104 -163 0 196 -250 144 -68 -17 201 -195 -54 -105 -163 -108 -146 157 317 -163 -34 -60 61 305 -66
1974 -66 75 -220 29 -70 34 -64 107 149 -322 -237 -104 -130 -55 216 19 94 259 57 53 -166 75 66 186 277
1998 277 -17 -160 8 1 115 -100 -53 -138 -44 -227 103 -73 -204 67 226 242 -66 -112 -47 -415 -318 -323 38 65
2022 65 104 -42 85 -15 -62 -82 -1 32 -182 337 224 122 -61 275 110 8 -190 -321 140 -74 -13 -365
2044 -365 -39 -311 93 155 234 -33 15 -166 51 -19 291 -380 -283 -74 121 -76 -24 -95 -189 -144 69 -239 75
2067 75 -78 39 180 1 31 -43 33 84 -24 -190 -250 247 196 141 46 -8 -157 -94 134 359 166 -29 -121 -71
2091 -71 -403 -41 52 -50 108 -311 -22 -74 -73 -204 -91 108 -137 -353 17 240 -37 -285 -341 -139 57 -22
2113 -22 -63 -169 -6 170 0 107 25 -13 299 33 54 238 126 0 -8 -120 -27 -180 -37 231 -108 -260 -27
$$ packed form
1951b00R6n9J63J96m46L94k12N1K18l96J41n1n8N5l8L03J60m80J29k6J21K44l71
1974f6J41k95K49r9J04r8J71M2m71Q5J33k6P5K71j97P5J65k02mk19K41rJ20R1
1998B77k94j43J68pJ14k15M7q5R4j83L30j76j31K71J59J6l08m6O5l68R7nL61K7
2022F5L9j46J27j00m7k0Q1L3k14N19j13j02j83L36j65j02j98j31M61k14O1l52
2044c65L26k72M04O2P9k67M8j81K17p0L10o71R7K09J95j97N2p1r4M5K13l08L14
2067G5j53J17J41j79L0p4P6N1j08j66o0M97n1n5r5n4j49O3K28K25j93j95r2N0
2091g1l32L62R3j02J58m19K89n2Jj31J13J99k45k16L70K23k77k48n6K02J96p9
2113b2m1j06J63J76j70J07q2l8L12k66K1J84j12j26qj12R3j53J43K68l39j52K33
$$ plain form
2136 -27 83 -85 240 -39 110 -65 -78 -3 245 -226 85 -63 -137 -252 175 -35 -41 -170 -75 287 -180 -52
2158 -52 -121 -280 24 -261 -161 -82 -166 30 76 -134 -91 152 -9 145 173 133 -219 -18 231 199 -268 -62 -61 -21
2182 -21 201 -1 -18 -60 -55 52 32 -162 88 -186 59 48 139 -22 -109 -140 -146 -55 -64 302 77 -111 -72 230 93
2207 93 24 -87 16 50 -135 77 -448 -22 349 -9 177 141 -128 -46 -105 177 -29 -180 -16 40 60 350 181
2230 181 86 125 -275 139 57 317 -64 -218 -3 75 22 -119 74 253 251 1 144 24 -103 -331 28 -134
2252 -134 -168 118 -1 36 71 219 125 -201 -134 -18 28 -25 121 -82 -165 -11 261 -141 51 228 22 156 57
2275 57 157 -151 49 -247 191 265 108 219 -74 15 120 233 122 -24 1 -43 -82 241 -112 -188 -109 -209 -155
2298 -155 -91 0 43 -186 -113 -57 152 -4 33 -260 -30 49 -41 119 -38 19 101 132 -38 -86 -186 67 -204 -9
$$ packed form
2136b7J10j68L25k79J49j75j3P5K48m71L11j48p4j15M27k10oj29R5L62m67J28
2158e2o9j59L04k85J00P9q4J96M6k10M3K43j61J54K8m0l52K01K49l2m67K06JM0
2182b1K22k02j7m2NJ07k0j94K50k74K45j1R1j61q7l1oR1rL66k25j88L9L02j37
2207I3o9j11J03L4j85K12n25M26L71l58J86l6k69Q2n9K82k06j51J64N6K0K90j69
2230A81r5L9m00M14q2K60l81j54K15P8n3j41J93J79kk50J43j20j27k28L59j62
2252a34l4K86j19L7L5J48r4l26O7J16M6n3J46k03q3J54K72m02J92J77k06J34r9
2275E7J00l08K00k96M38P4j57J11k93Q9J05J13j11j46K5m4l9L23l53p6P9j00N4
2298a55O4R1M3k29P3N6K09j56L7k93K30P9r0J60j57N7Q2L1j70m8j00K53k71J95
$$ plain form
2322 -9 -18 -158 175 11 -301 31 -29 85 -48 -87 223 -1 93 31 52 -201 205 -152 17 62 88 92 -5 27 -50
2347 -50 -175 80 -140 317 -62 34 -114 -108 57 -70 158 95 -8 -23 80 -14 -22 -53 204 209 13 -168 -105 160
2371 160 -116 -136 -152 107 73 118 15 91 -50 30 -91 -12 -212 160 89 -159 9 -383 213 -194 -26 -6 -306
2394 -306 159 -243 91 -13 121 168 -45 78 -92 -86 -6 107 12 -276 -137 -252 71 -137 -109 -178 304 105
2416 105 -45 92 6 -59 -189 -165 -38 -228 234 35 -106 94 54 78 -227 -79 110 -181 133 49 -163 -194
2438 -194 -191 158 -168 -212 281 -219 102 -86 -66 176 -85 17 -11 76 47 98 -93 -84 -153 -49 120 -120 -88 200
2462 200 -79 -25 -72 -77 69 -144 276 -233 -93 100 116 -43 81 -12 100 27 198 182 -22 2 -84 -83 -1 346
2486 346 -186 -6 96 -129 -67 3 -168 -26 225 214 51 -14 -168 62 -1 69 97 155 223 252 18 -38 188 50
$$ packed form
2322irj40L33j64l12L32o0J14j33l9L10k24R4o2K1k53M06l57J69M5K6Mr7L2p7
2347e0j25K55k20M57l79R6j48OJ65j27K28o3j03j5J03r4ql1K57Nj96j81O3K65
2371A60k76k0j6K59l4M5j03P6j41Q0j21P9k00L72p1k48J68l92N96m07J68K0l00
2394c06M65m02L34j04J34M7k13J23j70OQ0J13r5k88J39j15L23k08K8o9M82j99
2416A05j50J37q6o5j30K4J27j90M62j99j41K00m0K4l05J48J89k91L14q4k12l1
2438a94LL49l26m4M93n00L21j88K0K42k61J02k8Q7k9N1j91Ro9J04J69k40L2K88
2462B00k79N4m7nJ46k13M20n09J40J93J6j59J24r3J12p3J71j6k04K4q6JQ2L47
2486C46n32J80J02k25O2P0j71J42K51j1j63o5j54K30o3P0K8N8O8K9k34n6K26j38
$$ plain form
2510 50 -121 -66 98 -53 92 66 -226 -138 -84 203 83 20 249 -99 -253 119 -16 168 -328 11 -237 42
2532 42 140 -339 34 -140 121 -28 -93 55 136 56 202 -43 -1 -35 195 66 -250 166 55 -16 24 -32 16 -52
2556 -52 -52 -33 219 88 13 69 184 206 -59 -84 25 -17 302 97 -255 -155 -29 -63 -216 181 178 -84 57 -162
2580 -162 237 47 37 10 304 53 -80 -71 -120 -160 -136 -61 -81 123 37 -217 37 68 31 -37 -155 207 -155 -181 93
2605 93 248 -5 332 16 6 173 55 24 -385 213 -287 23 35 -119 197 -261 -46 -55 245 -126 3 -126
2627 -126 37 180 95 -341 107 137 29 50 -149 -92 0 246 221 -102 -398 -99 -149 -103 -6 -49 13 6 -114 87
2651 87 -84 208 141 15 -112 220 -31 161 -100 267 -17 28 -10 -40 94 92 -143 126 36 225 292 203 -48
2674 -48 84 194 33 32 -17 410 -18 -25 -273 69 -28 56 -78 -41 -96 -105 69 22 -133 121 -233 -63 -40 -63 -13
$$ packed form
2510E0j71N5J64j51J45k6k92Q8N4K87j20o3K29l48j54L72j35J84m96L39k48K79
2532D2R8m79L73j74K61j49o5J48Q1q0J46k45M2l4K30j29l16M16j11p1M0n6M8o8
2556e2%J9K52j31p5N6J15K2k65k5J09m2L19k05l52J00J26l4j53L97lk62J41k19
2580a62L99j90j0k7K94k51j33Rm9m0K4P5k0K04q6k54K54L1l7o8j18L62l62k6K74
2605I3J55k53L37l16j0J67j18l1m09N98n00L10J2j54L16m58K15rL00l71J29j29
2627a26J63J43q5m36M48L0j08K1j99N7R2K46k5l23k96K99n0M6R7m3O2pj20K01
2651H7j71K92o7j26j27L32k51J92k61L67k84M5l8l0J34kk35K69r0J89O7q9k51
2674d8J32J10j61jm9M27m28pk48L42r7Q4j34L7n5rJ74m7j55K54l54J70K3k3N0
$$ plain form
2699 -13 48 87 108 103 110 9 43 3 -85 110 -12 177 102 153 -113 -143 -34 16 -237 -58 -38 -251 145 -21 -82 200
2725 200 295 8 -111 -85 97 62 138 137 -5 -16 115 284 159 -212 143 -194 52 -292 -7 29 172 34 -119
2748 -119 54 -54 24 -50 -65 -89 -13 7 -55 78 28 168 38 -75 285 211 -9 -123 -143 -59 -186 -82 -5 -17
2772 -17 30 -108 -122 135 -205 -200 157 -48 223 -73 -151 10 44 44 12 172 128 24 53 54 146 -390 84 79 116 -137
2798 -137 -214 -313 -4 -182 46 255 105 -95 5 257 69 112 319 -146 44 -9 154 -41 90 -194 -95 24
2820 24 18 45 63 75 -98 -82 -26 188 20 -49 -173 -13 -182 99 -163 75 27 78 -64 -163 73 78 0 183 -22
2845 -22 -7 -61 215 -203 -38 116 -24 182 65 -32 -265 99 -160 -13 94 143 92 80 57 55 -288 163 -8
2868 -8 -138 -62 -112 -341 84 73 -29 -91 63 -10 6 -168 172 -73 110 156 -290 276 -22 54 25 -57 22 0 -237
$$ packed form
2699a3O1L9K1nPj01L4m0q8J95j22J89p5N1k66l0J09N0k53J79K0k13L96j66o1K82
2725B00R5k87j19K6J82l5P6jj42j1J31J69j25l71L55l37K46l44K85L6J43j38j53
2748a19J73j08P8p4j5k4P6K0o2J33n0J40j30j13L60p4k20j14k0Q4j27J04P7j2
2772a7M7j38j4K57l40NL57k05K71k96p8J61L4%l2J60m4j04K9JR2n36M74nL7k53
2798a37p7r9L09j78K28K09j50k00J00K52j88M3K07m65J90n3J63j95J31k84R9J19
2820B4oK7J8J2j73J6N6K14j68o9j24J60j69K81k62K38m8N1j42r9K36Np8J83k05
2845b2J5n4K76m18J65J54j40K06j17r7k33L64k59J47J07M9n1j2k3kl43M51j71
2868hj30P6n0k29M25j1j02o2J54p3J6j74L40k45J83M6m46N66k98P6k9q2P9k2k37
$$ plain form
2893 -237 148 24 -97 -100 0 108 -73 -82 51 80 -73 22 32 -93 46 202 38 -6 -276 121 -79 27 54
2916 54 238 84 61 -225 160 18 -107 -30 -120 331 -100 79 -39 75 125 -95 109 -113 -86 -42 -50 -85 108
2939 108 -2 -194 -71 -320 -199 37 -23 -216 156 -417 194 283 100 -6 -25 72 92 135 -152 -174 -261 -69 11
2962 11 4 -181 -113 82 -69 148 -78 -66 -324 56 34 46 -58 -18 -172 180 176 -235 28 -168 -42 105 95 -134
2986 -134 252 -2 55 -125 67 231 -225 73 71 -147 -76 49 -25 17 83 7 122 71 -30 -2 169 -103 -8 217
3010 217 215 143 150 -68 30 146 322 12 40 -73 72 108 232 -70 -155 -164 38 170 -96 102 -27 1 27 175
3034 175 -4 -58 -78 225 -85 -110 -37 83 90 -152 -79 55 121 26 99 116 -34 65 -163 -23 -6 112 109 -50 22
3059 22 3 -176 262 12 3 -2 275 -310 -56 -769 -96 303 -879 -664 -255 253 -290 -105 -480 279 -388 89
$$ packed form
2893b37L85j24j21lJ00J08j81rJ33K9j53R5J0j25J39J56j64m4k70L97k00J06K7
2916E4J84j54k3k86L85j42j25P7r0M51m31J79j18J14N0k20K04k22K7M4ql5J93
2939A08j10j92J23k49J21K36o0j93L72n73O11Q9j83j06j9R7K0M3k87k2q7J92Q0
2962A1pj85O8J95j51K17k26J2k58L80k2J2j04M0j54L52mm11K63j96J26J47j0k29
2986a34L86k54N7j80J92J64m56K98kk18P1J25p4M2O6p6J15n1j01K8J71k72R5K25
3010B17kp2Pk18R8J16J76l10K8j13J45L6J24l02q5rK02J32k66J98j29K8K6J48
3034A75j79n4k0L03l10k5P3J20Pk42P3J34O6r5P3J7j50R9k28J40J7J18lj59P2
3059B2j9j79M38k50rnK77n85K54p13O73L99j182K15M09N08n43J85l75P59o67M77
$$ plain form
3081 89 -378 -90 462 -636 -165 -663 493 167 -176 -543 -976 -601 -597 -194 251 -116 167 -108 -536 -110
3101 -110 -405 -151 468 -154 -52 16 -169 208 494 -287 -130 -94 -103 186 -922 589 463 -450 662 310
3121 310 -685 -471 105 -379 446 -147 -699 -175 289 304 -340 -609 597 -549 -751 928 -640 711 -378
3140 -378 -162 -449 80 760 644 -284 -73 384 -14 -798 -1197 490 333 5 -221 -571 469 -551 436
3159 436 -1 263 386 16 -142 -305 -134 -415 139 -561 -484 413 -471 -897 527 -594 -660 243 580 -85
3179 -85 320 89 723 124 88 -479 -338 -285 -11 -11 287 -104 -187 -613 -514 241 -111 -241 -65 384 224 274 -249
3202 -249 -255 -122 -151 -90 -21 128 12 -22 -301 -236 0 283 -291 -51 -71 -386 65 -100 126 370 335 200 271
3225 271 -371 296 199 140 36 104 -275 194 374 -11 166 91 122 191 365 -22 -250 -55 328 114 313 203
$$ packed form
3081H9m67K88N52j098M71m98J156l26l43l67m33L75MM03M45l67K83k75m28M26
3101a10k95K54O19o22J02O8j85L77K86p81J57L6rK89j108J511j26r13J112l52
3121C10r95K14N76m84Q25n93n52N24M64J5o44k69J206j146k02J679j568J351j089
3140c78K16k87N29O80j16r28K11M57l98p84l99J687j57l28k26l50J040j020R87
3159D36m37K64J23l70j58j63J71k81N54p00P7Q97q84m26J424j121o6R03L37o65
3179h5M05k31O34n99l6n67J41N3K74%K98l91q3m26R9P55l52j30J76M49j60N0n23
3202b49oJ33k9O1O9J49j16l4k79O5K36K83n74K40k0l15M51j65K26K44l5j35P1
3225B71o42O67r7n9j04O8l79M69J80l85J77p5L1O9J74l87k28J95L83k14J99j10
$$ plain form
3247 203 139 6 143 -91 -63 -866 -984 76 49 -468 -59 -222 -57 116 -525 -70 450 -409 -76 -166 -398
3268 -398 -161 15 -33 -277 78 210 -746 -111 74 -207 593 501 -294 -4 289 125 229 -317 156 -34 -384
3289 -384 -527 -355 179 -255 428 -317 702 31 299 212 -536 25 257 577 -50 -47 105 5 -442 -141 275
3310 275 452 -863 -54 -316 -544 -467 105 680 -12 -949 482 -171 49 -320 974 77 -1305 -129 -720
3329 -720 256 84 256 -154 268 -1102 360 -27 505 -571 9 -499 -344 133 -131 416 213 -894 -283
3348 -283 -165 16 316 -268 4 -566 -315 525 -634 -483 44 192 -131 -69 71 -180 -638 72 216 -389
3368 -389 -488 277 219 -97 363 -241 -578 -88 99 11 -119 325 -49 53 195 326 -50 -154 -97 283 120
3389 120 -356 -270 -176 356 -354 188 420 122 200 -308 236 -352 -30 576 -293 420 -164 -515 -184 383 313
$$ packed form
3247B03o4j33J37k34K8q03j18J060k7n17M09j63J65J73o41M55N20q59L33r0k32
3268c98K37J76m8k44L55J32r56O35J85k81Q00r2p95K90K93j64J04n46M73j90l50
3289c84j43J72N34m34O83p45J019o71K68q7p48N61K32L20o27LJ52j00m47L01M16
3310B75J77j315Q09k62k28P7N72N75o92r37J431o53K20l69J294q97j382J176n91
3329g20R76j72J72m10M22j370J462l87N32j076N80n08J55M77k64N47k03j107O11
3348b83J18J81L00n84K72n70K51Q40j159J51N27J48l23O2J40k51m58P10J44o05
3368c89r9P65n8l16M60o04l37M90J87q8j30M44l74J02J42J31l76j04N7L80j63
3389A20m76Q6R4N32p10N42K32k98P8n08N44n88L22O06q69P13n84l51L31N67p0
$$ plain form
3410 313 106 512 -107 -296 -350 -32 470 -105 -125 -259 -325 -804 -57 -559 -11 161 495 -132 -351 -127 -535
3431 -535 -218 210 471 246 -152 -81 -471 -433 9 63 47 -343 -82 -13 -28 -449 -86 -277 -44 736 -456 -302
3453 -302 -630 218 85 -203 -353 251 -165 180 -161 29 87 -203 18 472 176 -91 -240 122 198 -247 -41
3474 -41 -351 -6 42 466 68 -364 53 -53 15 -215 65 46 -702 -926 -30 -381 79 -669 -407 370 93
3495 93 28 -180 147 -18 692 3 -259 -40 73 36 -118 382 84 -6 14 -61 94 -194 61 23 -63 100 33
3518 33 -11 265 105 -70 73 -48 95 -166 1 108 368 -132 99 53 -37 152 -1 -23 111 -132 -342 -13
3540 -13 -123 -30 195 98 16 146 -76 -12 -100 -199 101 26 102 428 45 357 332 -52 -116 -361 -34 97 166 -77
3564 -77 -53 -12 -199 -206 -1 -300 -127 -57 -122 4 12 -5 -41 -91 -14 -99 127 54 63 49 79 160 62 192 -18 -56 -110 -13
$$ packed form
3410C13k07M06o19j89n4L18N02n75k0j34o6m79P47n02N48J72L34o27k19K24m08
3431e35L17M28K61k25l98P1l90L8M42N4j6l90K61O9j5m21L63j91K33P80j192J54
3453c02l28Q48j33k88j50O04m16L45l41J90N8k90K21M54k96k67j49L62P6m45K06
3474d1l10L45M8M24l98m32M17j06O8k30K80j9p48k24Q96l51M60p48K62P77k77
3495I3o5k08L27j65P10o89k62K19J13l7j54N00k98r0K0p5J55k88K55l8q6J63o7
3518C3m4K76j60j75J43j21J43k61J67J07K60n00K31m6r0J89j53k2J34k43k10L29
3540a3j10R3K25r7q2J30k22O4q8r9L00p5P6L26l83L12k5l84o4k45L27J31O9k43
3564g7K4M1j87pK05k99J73P0o5J26Qj7l6n0P7q5K26p3Rj4L0Q1r8J30k10l8n4R7
$$ plain form
3592 -13 139 -148 229 -3 -66 2 77 -27 -3 63 100 -84 -117 125 402 191 -160 117 86 -37 -95 -210 58
3615 58 -413 -11 -449 -556 218 -57 -135 -410 -298 134 -193 199 -47 96 -155 670 -616 -262 9 54 -817
3636 -817 -299 -452 -709 -229 -130 -175 177 -79 -419 486 180 25 14 -290 -9 -61 -136 90 -87 165 -197 -128
3658 -128 164 89 181 -158 160 103 -157 -137 42 -6 9 4 30 -167 82 -123 -22 -84 280 116 -186 -107 112 -114
3682 -114 118 97 227 -305 -131 -109 -167 -137 213 -154 -144 271 178 50 260 -95 -102 16 41 -171 -170 -40 -36 -426
3706 -426 -18 -85 163 164 -77 158 -147 277 -74 40 -7 146 292 -85 -269 -113 -27 189 -4 135 -2 81
3728 81 -223 7 317 -82 -17 26 -176 -8 -77 115 -125 -51 -180 -61 15 -252 151 -104 24 -295 -103 42
3750 42 -9 -122 49 -44 -117 -7 -141 293 22 -108 125 93 50 -40 108 -176 -91 228 208 -191 -75 -238 55
$$ packed form
3592a3J52k87L77k32o3O8P5j04K4O6L7j84l3K42K77k11l51K77l1j23n8j15K68
3615E8m71M02m38j07P74k75p8k75J12M32l27L92k46J43k51Q25j286L54K71M5q71
3636h17N18j53k57M80R9m5L52k56l40R05l06j55j1l04K81n2p5K26j77K52l62O9
3658a28K92p5R2l39L18n7k60K0J79m8J5nK6j97K49k05J01o2L64j64l02P9K19k26
3682a14K32k1J30n32J74K2n8L0L50l67J0M15r3j28K10l55pJ18K5k12JJ30Ml90
3706d26M08o7K48Jk41K35l05M24l51J14m7J53J46l77j84J56Q6K16j93J39j37Q3
3728H1l04K30L10l99O5M3k02J68o9J92k40P4j29J19P6k67M03k55J28l19J92J45
3750D2n1j13J71r3p3J10j34M34k71j30K33l2m3r0J48k84Q5L19k0l99J16j63K93
$$ plain form
3773 55 -197 -101 300 -104 58 162 101 -250 -52 -202 -29 369 489 -90 95 -68 166 125 130 269 -43 94
3795 94 171 76 -44 -108 88 -221 -140 123 -52 132 -108 46 -76 177 -114 303 -201 113 165 1 113 55
3817 55 -158 -159 41 -155 65 78 168 4 -12 -49 288 11 43 -36 -35 -135 16 -180 -54 99 15 -219 -191 -40
3841 -40 131 87 -257 -174 97 117 -183 168 -123 -55 67 81 -25 211 87 -4 -7 -89 -297 78 -174 44 0 64
3865 64 199 20 -65 -245 65 -31 -125 -155 -209 -46 -34 -8 -47 -29 20 -253 268 -67 83 278 -20 -86 25 60
3889 60 123 44 -5 -145 -105 23 -8 -138 99 -8 -186 -150 -243 -187 77 -138 37 -94 71 -191 43 -3 -6 103
3913 103 -53 340 -125 -155 51 68 324 212 -320 -30 -109 139 86 79 92 -102 244 -110 -52 -158 7 190 482
3936 482 -9 23 -36 102 109 -69 -122 -68 -207 306 -1 6 -5 -113 79 62 -162 62 47 -1 -178 182 -3 -314
$$ packed form
3773E5k52R6M01m04J62J04o1l51J98j50J73L98J20n79J85j63K34m1NJ39l12J37
3795I4P7r5j20o4J96l09Q1K63j75J84k40J54j22K53k91M17n04L14N2j64J12n8
3817E5k13jK00j96K20J3R0j64j6l7L37k77L2p9Jj00J51j96J26J53q4k34K8J51
3841d0J71m4l44Q3K71K0l00L51k91O8J22J4j06K36j24r1lq2k08L75k52K18m4O4
3865F4J35j79q5j80L10r6r4l0n4J63J2K6l9J8M9k73N21l35J50J95k98o6J11L5
3889F0O3p9m9j40M0J28l1j30K37j07j78L6r3N6K64k15J75j31J65k62K34m6lJ09
3913A03j56L93m65l0K06J7K56j12n32K90p9K48n3pJ3j94L46l54N8j06J65J83K92
3936D82m91L2n9J38Pj78n3N4j39N13l07Pj1j08J92j7k24K24j5m8j77L60j85l11
$$ plain form
3960 -314 194 84 -1 -112 89 3 43 52 150 -128 14 107 51 -59 151 47 116 24 149 96 -253 -182 267 -179
3984 -179 -189 19 4 67 70 -283 123 -44 171 53 102 -7 -135 25 -77 178 -66 38 -52 -158 73 32 80
4007 80 -57 -148 -134 -59 -200 -20 -42 -55 -33 90 49 105 -71 -88 106 -124 51 152 96 136 23 238 -164 -121
4031 -121 -111 60 -218 -28 20 -7 -156 -405 113 -123 21 -84 13 -12 -24 227 88 492 74 -9 -91 44 -116
4054 -116 69 -25 11 112 -188 -9 -53 -134 -83 -171 225 -104 102 -29 115 98 98 45 -10 -36 -29 54 113 -32 -180
4079 -180 172 21 32 -15 -110 -176 158 -79 213 -2 -183 -207 -60 -137 141 -139 46 303 26 5 -42 33 15
4102 15 -15 -49 100 147 31 -36 -92 20 -38 -41 210 -233 -148 40 -75 284 -134 -46 -15 -9 205 30 88 -212 -116
4127 -116 -269 -142 -239 206 124 63 91 -128 23 298 83 -194 -126 -44 89 -96 -48 262 225 -144 -70 -94 24
$$ packed form
3960c14N08j10q5j11K01q6M0RR8k78J42R3n6j10K10j04O9r2J25n3l49P1M49m46
3984a79j0K08j5O3Ll53M06j67K15j18M9j09j28J60j02K55k44J04r0j06K31m1M8
4007H0j37r1J4P5j41J80k2j3K2J23m1N6j76j7J94k30J75J01n6M0j13K15m02M3
4031a21J0J71k78J90M8k7j49k49N18k36J44j05R7k5j2K51j39M04m18q3q2J35j60
4054a16J85r4L6J01l00J79m4q1N1q8L96l29K06j31J44j7%n3n5k6PQ3N9j45j48
4079a80L52j51J1m7r5o6L34k37K92k15j81k4J47p7K78k80J85K57k77k1m7P5j8
4102A5l0l4J49M7j16o7n6J12n8lK51m43Q5J88j15L59m18Q8L1OK14j75N8l00R6
4127a16j53J27r7M45q2o1K8k19J51K75k15k77O8Q2J33j85M8L10l7l69P4k4J18
$$ plain form
4150 24 -21 36 -276 88 89 71 -92 -32 -210 -103 78 -57 196 -151 315 129 14 -213 94 84 -31 200 -13
4173 -13 53 -163 -70 69 180 -160 -36 273 64 -14 38 -98 80 250 131 -83 36 -42 -148 -135 -290 -308 -38
4196 -38 -120 -158 70 -21 -163 -138 -257 132 61 -62 275 101 -71 141 -48 -33 131 145 332 59 166 71 -41
4219 -41 153 171 42 -126 83 -256 -68 248 118 155 -96 -149 60 32 11 189 3 -30 253 -218 234 95
4241 95 180 0 83 168 -126 182 166 -266 -264 -3 -141 449 67 49 -153 -195 194 41 -78 -48 0 -50 245 -27
4265 -27 -45 101 -102 -15 -23 -36 -10 207 -37 -22 -343 -20 104 -295 382 -308 193 -119 -87 -121 161 100 -145 8
4289 8 56 -328 -68 146 -186 -37 20 -70 102 16 -264 -360 80 31 -158 -169 78 -106 160 -8 271 -24 16
4312 16 254 140 0 -130 111 115 -36 -38 92 -71 80 290 87 100 253 39 -17 8 272 -6 38 318 41
$$ packed form
4150B4m5N7l12L64Jj8j63O0j78J07J81j35K53l47M66j86j15k27L07j0j15K31k13
4173a3O6k16R3J39J11l40J24L09k09p8N2j36J78J70j19k14J19p8j06J3j55j8K70
4196c8q2l8K28r1j42K5j19L89p1j23L37j74j72K12j89J5J64J4J87k73J07r5j12
4219d1J94J8j29j68K09l39J88L16j30L7k51n3K09k8k1J78j86l3K83m71M52j39
4241I5Q5j80Q3Q5k94L08j6m32KK61j38N90l82j8k02m2L89j53j19L0M8n0K95k72
4265b7j8J46k03Q7qj3K6K17k44J5l21L23J24l99O77o90N01l12L2l4K82o1k45J53
4289HM8l84K60K14l32J49N7r0J72q6k80r6M40m9j89j1K47j84K66j68K79k95M0
4312A6K38j14j40j30K41Mj51kJ30j63J51K10k03J3J53k14n6K5K64k78M4K80k77
$$ plain form
4335 41 34 162 31 186 -170 97 -236 324 -75 129 -328 30 -44 -61 222 -186 25 21 173 -240 99 90 -43
4358 -43 125 119 -112 -233 -120 -182 81 118 -38 126 -200 -16 -213 -49 -67 85 -15 0 -45 127 -141 76 -28
4381 -28 27 236 187 216 146 42 -49 -218 -68 222 69 -73 -122 -43 -60 236 -100 -17 -234 -29 12 66 94 -182
4405 -182 135 -40 13 75 -92 -199 29 160 -202 173 -72 -82 -76 87 -133 145 144 -358 -40 27 104 -16 120
4428 120 -20 134 104 71 209 77 -97 -117 -64 -46 -129 -6 54 194 -9 -53 34 -36 578 168 -230 170 253 134
4452 134 -31 80 175 27 68 -960 -23 176 -1004 -38 74 79 -350 36 -462 -93 54 -262 -476 54 126
4473 126 -151 -442 -112 780 -63 -556 -457 -264 300 141 2 -215 138 126 -449 -51 93 38 6 -161 145
4494 145 53 162 -50 103 -55 -67 -179 16 64 -117 -26 -19 -37 190 107 -11 78 7 13 2 -23 -39 -54 158 -32
$$ packed form
4335D1pJ28j31J55l56K67l33N60l99K04m57L58p4j7K83m08K11mJ52m13L39rj33
4358d3J68ok31j21J13o2K63L7j56J64l26J84j97J64j8J52j00J5m5J72k68K17j04
4381b8N5K09m9K9p0j04r1j69J50K90j53j42m9P9j7K96l36Q3k17K05M1N4K8k76
4405a82L17j75N3O2j67j07K28J31l62L75k45j0OJ63k20K78jn02L18O7P7j20J36
4428A20j40J54l0l3J38j32j74k0N3J8q3J23O0J40k03m4Q7p0O14m10l98M00Q3j19
4452A34j65J11R5j48M1j028R37J99j180R66J12Nm29L86m98L69J47l16k14N30P2
4473A26k77k91L30Q92q43m93R9J93N64j59j39k17L53j2n75L98J44n5l2j67L06
4494A45r2J09k12J53j58j2j12J95M8j81R1Pj8K27q3j18Q9p1Oj1k5j6j5K12j90
$$ plain form
4519 -32 -99 347 35 76 97 115 28 42 204 90 -66 -79 132 -386 -86 -52 11 12 44 272 -48 -3 -68 -262 -89
4544 -89 -37 29 15 123 62 54 -165 -86 203 106 7 -11 29 128 -115 -30 220 -92 -52 -23 -169 335 -141 -108 -83 148
4570 148 -42 23 -101 -11 222 173 -6 -148 -50 -136 -8 85 -44 204 -61 -163 -263 -5 -17 -52 71 165 50
4593 50 -214 -100 -95 -44 -147 165 317 -15 -162 207 -414 -482 697 -894 -49 132 315 342 -473 -61 -861
4614 -861 -481 111 -623 235 -1436 -123 -91 -157 789 -114 -547 -232 -406 -386 -376 -367 63 316 -310 457 -24
4635 -24 329 -92 742 930 78 -8 -71 -383 -307 194 -310 -224 -273 -27 217 -501 -35 -10 -299 -120 -142 374 -202
4658 -202 181 113 -95 127 236 -66 3 -16 191 93 -190 118 -26 -56 5 148 113 -47 88 -90 95 -59
4680 -59 92 -121 142 4 -6 -53 -111 -103 -69 227 101 -141 -255 21 -147 -12 -137 -120 -120 -124 74 282 151 -244
$$ packed form
4519c2o7M46l12M1K1J8q7J4J62j14j56j3K11n18L00L4O3JL2K28l20M5o5j94J73
4544h9N2O6j4J08o1qk19P9K89r7r9j8M0R9k43Q5K50l12M0K9j46N04m76L3K5K31
4570A48j90O5j24R0K33m9j79j42R8q6J28R3j29K48k65j02j00K58j2l5J23R4j15
4593E0k64J14NN1j03L12J52l32j47L69o21o8J179j591Q45J81J83K7q15M12q00
4614h61L80N92p34Q58j671J313L2o6R46r03m33L15j74K0J0RM30K53o26P67m81
4635b4L53m21Q34J88q52q6o3l12P6N01n04Q6m9K46K44p18M66K5k89J79k2N16n76
4658b02L83o8k08K22J09l02O9j9K07r8k83L08j44l0O1J43l5j60J35j78J85j54
4680e9J51k13K63j38j0m7n8QL4K96j26k42j14K76j68J35j25J7%mJ98K08j31l95
$$ plain form
4704 -244 256 85 -53 -72 222 191 178 -176 18 9 -118 227 5 -51 95 -19 -180 11 -39 157 -38 2 19
4727 19 135 -335 -217 -90 -118 -41 153 13 -219 -17 163 -199 25 211 -3 -12 234 161 150 -57 -90 62 41
4750 41 101 -36 -36 -182 -15 62 11 120 22 -219 30 -8 112 -89 30 -71 -153 -114 292 -195 170 204 -42 47
4774 47 171 -66 -67 -24 139 47 195 140 170 -148 -32 -42 4 235 -232 64 114 -326 113 -41 51 -200 81 254
4798 254 -144 81 -37 -61 266 -18 135 -49 43 28 -245 25 -14 30 143 97 -156 138 101 82 26 251 -54
4821 -54 19 -96 52 -96 71 104 -82 78 -78 67 121 -18 312 -32 -49 -96 157 -158 -143 -102 120 -75 104
4844 104 61 -110 138 24 62 64 226 3 245 94 239 88 181 107 55 173 -152 -4 -28 32 -418 -356 -125
4867 -125 11 264 101 371 10 414 -3 288 -71 743 219 -278 -512 206 -247 373 -55 -207 111 -561
$$ packed form
4704b44N00j71j38j9K94l1j3l54J94rj27L45k22n6J46j14j61J91n0J96j95M0J7
4727A9J16m70J18J27k8P7J94j40k32K02J80l62K24J86k14rK46p3j1k07l3J52k1
4750D1O0j37%j46J67P7n1J09r8k41K49l8J20k01J19j01q2L9M06m87L65L4k46Q9
4774D7J24k37jM3J63r2J48n5L0l18J16j0M6K31m67K96N0m40M39j54R2k51K81J73
4798B54l98K25j18k4L27k84J53j84R2j5k73K70l9M4J13m6k53K94l7j9n6K25l05
4821e4P3j15J48j48J67L3j86J60j56J45N4j39L30l44j7m7K53l15J5M1K22j95J79
4844A04m3j71K48j14L8KJ62k23K42j51J45j51R3p4n2J18l25J48k4O0m50O2K31
4867a25J36K53j63K70l61M04m17K91l59Q14n24m97k34P18m53O20m28j52L18o72
$$ plain form
4887 -561 222 21 -8 -74 -24 52 -143 39 -245 200 185 281 13 -76 -258 165 32 -112 16 106 -99 118 -122
4910 -122 72 300 298 -280 -255 -7 -19 -73 273 169 -52 340 -150 111 50 171 -78 -142 412 389 -260 -455 -9
4933 -9 -32 -280 1 146 91 136 413 -69 205 -190 200 -48 296 130 -129 234 44 47 -51 279 -86 -164 -2
4956 -2 197 108 193 222 -60 -173 -206 24 -195 -170 -279 127 198 -27 -62 84 -107 -92 -154 -68 -34 -34 -45 -45 -190 -12
4982 -12 87 59 -77 157 32 -5 -293 125 -43 -77 29 94 192 -26 239 -165 146 149 46 116 -134 93 -50
5005 -50 -180 89 -5 -32 141 192 -30 18 -108 -169 42 67 195 -75 74 -30 63 -7 175 -177 -78 391 -36
5028 -36 222 97 15 -70 14 -55 -44 225 14 -182 49 69 -206 -313 201 92 -11 77 -226 -44 -137 28 56
5051 56 59 136 -407 -88 -298 -27 58 54 -89 77 143 177 -180 -144 73 -121 -40 -121 129 41 -57 62 -60 40 238
$$ packed form
4887e61P83k01k9o6N0P6j95J82k84M45j5R6k68q9j82M23j33j44J28R0k05K17k40
4910a22J94K28kn78K5K48j2n4L46j04k21L92m90K61o1J21k49o4N54k3o49j95M46
4933ik3k48K81J45n5M5K77m82K74l95L90k48L44j66k59L63j90Lr8L30l65p8J62
4956bJ99q9Q5K9k82j13l3K30k19K5j09M06P1k25l5J46j91J5o2Q6L4%j1%j45J78
4982a2R9k8j36K34j25l7k88M18j68l4J06O5R8k18K65m04L11Lj03P0k50K27j43
5005e0j30K69r4k7J73N1k22M8j26o1K11K5J28k70J49j04R3p0J82l52R9M69m27
5028c6K58j25q2q5Q4o9J1K69k11j96K31K0k75j07N14j09j03Q8l03J82r3J65K8
5051E6LP7n43L19k10K71Q5mj43J66O6L4l57L6K17j94Q1q1K50q8r8J19j22J00J98
$$ plain form
5076 238 -146 -192 99 -21 -63 30 35 103 60 -176 139 169 103 -336 -145 -60 204 116 368 130 398 -269 -91 183
5100 183 -181 331 -226 157 14 -287 10 -84 53 296 -113 30 17 19 -115 10 -136 -33 126 -2 -77 28
5122 28 -131 -255 -2 3 89 330 186 -48 -47 127 100 171 -1 148 63 -231 -304 165 -192 10 137 108 -22 -333
5146 -333 -119 174 -163 -130 255 68 -183 38 304 81 54 174 13 78 -7 157 279 11 -10 -87 135 -61
5168 -61 110 26 34 50 -73 53 98 -285 -146 -112 68 134 42 29 118 -13 -100 200 216 -12 -33 -30 -140 -243 165
5193 165 -94 -164 234 3 -192 -3 194 -5 15 21 82 -108 -33 -279 -49 -162 -78 -45 204 298 -273 -156 -76
5216 -76 -254 -194 2 -35 -49 176 45 68 -17 280 -115 202 -28 47 13 5 87 -178 -30 -188 66 -123 130 -81
5240 -81 -112 20 -43 167 21 -114 -258 -173 345 170 -102 233 -76 82 113 -45 34 66 48 -103 -16 -50 -87 -185
$$ packed form
5076B38l84m6K91j20m2R3NO8m3k36L15L0o6m39J91Q5K64q8K52k38K68o67J78K74
5100A83l64N12n57L83j43l01K97r4J37K43m09J43j3Kj34J25j46J03J59j28p5J05
5122B8j59j24K53NQ6K41j44k34JJ74k7P1j72J49q5k94p3M69l57K02J27k9j30l11
5146c33K14K93l37L3L85j87k51K21K66k23k7J20j61O5q5J64J22k68k1p7K22j96
5168f1J71q4QJ6j23J26M5l83J39L4J80O6r2j3Q9j31q7L00J6k28k1Lj10j03M08
5193A65k59p0L98k31j95J89J97j99K0OO1j90P5k46K30j13Q4L3K49R4n71J17Q0
5216g6j78O0J96l7j4K25j31K3q5K97l95L17k30P5l4qQ2k65J48j58K54j89K53k11
5240h1l1J32o3K10j46j35j44Q5N18j75k72L35l09J58L1j58P9L2j8j51Q7l4l7r8
$$ plain form
5264 -185 100 133 126 -143 6 104 -148 231 -58 14 -105 -105 -108 -86 -94 153 -63 70 85 -192 -111 -119 -200 -92 66 26
5290 26 -173 31 97 -64 -73 -14 62 -16 -82 -34 252 -90 -175 -200 118 -18 29 77 -183 -88 -182 -24 -55 106 -51
5315 -51 -68 -28 33 245 3 -179 293 120 -123 -9 -59 137 29 -181 -46 -104 130 -171 31 100 38 -84 24
5338 24 41 -61 -263 78 353 24 -52 -131 -359 -154 -63 152 -208 -65 138 42 -24 131 76 -43 22 31 16 117
5362 117 109 -74 -168 45 -13 20 -139 106 -374 157 229 -45 70 183 -122 102 -107 114 81 123 24 155 152 -105
5386 -105 -11 -187 101 -131 -84 -102 -95 23 77 -109 -292 250 90 59 -65 211 155 55 250 186 -151 18 -397
5409 -397 -38 -113 123 -136 261 21 -263 -217 109 81 -214 153 -284 -76 -95 -71 -99 -124 -84 -111 -13 -154 -109 107
5433 107 91 137 -126 148 158 -9 207 -17 -235 108 204 -23 -352 -13 114 -4 65 204 -221 42 111 -322
$$ packed form
5264a85K85L3pk69J49R8k52L79k89P2j19%lK2qK47k16J33J5k77Q1qq1J08J58m0
5290B6j99K04O6j61rN9P6p8o6M8K86l42q5k5L18j36M7M8k60R5r4J58l1J61j57
5315e1j7M0O1K12k42j82M72j73k43J14n0J96j08k10J35n8K34l01K02O9o2j22J08
5338B4J7j02k02L41K75l29p6p9k28K05R1K15l60J43K03r6o6J55n5j19O5Rj5J01
5362A17qj83r4K13n8L3j59K45m80N31P2k74J15J13l05K24k09K21l3M2r9J31lk57
5386a05R4j76K88k32M7j8PJ18N4j86j83N42j60l1j24K76n6j00J95o4l37J69m15
5409c97L59p5K36k59L97k40k84M6L26k8k95L67m37K08j9K4k8k5M0k7R8j41M5K16
5433A07j6M6k63K74J0j67K16k24k18L43R6k27l29L39J27j18O9J39m25K63O9m33
$$ plain form
5455 -322 92 -377 164 56 20 44 34 30 38 222 155 32 -6 161 -264 252 102 -83 -60 131 -104 -38 275 147
5479 147 -163 202 34 -486 -118 46 112 34 -61 64 -57 34 129 -55 -136 88 -95 -169 -17 98 -184 69
5501 69 -149 182 -168 48 -277 171 128 196 88 -17 -150 6 165 -191 208 -133 -103 -64 28 117 24 -75 -3
5524 -3 25 24 104 -55 -23 -136 -34 145 -24 98 -229 204 -329 -227 -360 -302 -399 -324 419 -297 -68 -235 -44
5547 -44 -105 35 43 61 -61 -27 -145 63 -183 -45 234 -95 30 -16 -145 149 29 47 100 88 55 -70 1 -47
5571 -47 -12 155 -220 -234 -157 -88 39 -46 -38 -201 59 -85 -45 72 157 93 -9 -89 99 -376 193 142 -87 -106 -27
5596 -27 58 -226 -94 -172 -84 -191 -218 176 -3 53 94 -248 -249 139 21 -75 32 5 233 -34 142 -81 332 3
5620 3 -186 -380 -67 -175 176 -217 -209 -117 201 -37 -221 54 -307 46 -46 -214 -103 -76 91 -38 -115 186 3
$$ packed form
5455c22M14m69N41j08l6K4j0mQJ84o7j23l8J67m25N16j50j85K3J91k35O6L13j28
5479A47l10L65j68n20L68J64O6p8r5J25j21R1R5j84q1K24j83p4J52J15k82K53
5501F9k18L31l50K16l25M48m3O8j08j05j33J56J59l56L99l41L0L9R2Q9r3r9P2
5524cK8jQ0j59L2j13J02J79j69J22l27M33n33J02j33N8r7P5P43p16K29j67J91
5547d4o1J40QJ8j22L4j18K08k46J38K79l29J25m6j29K94j20J8N3j2l3j25P1m8
5571d7L5J67l75j4P7O9J27q5Qj63K60j44M0J17Q5o4j02q0J88m75N69n1k29j9P9
5596b7Q5k84J32p8Q8j07k7L94j79N6M1l42jL88j18r6J07k7K28k67J76k23M13l29
5620Cj89j94L13j08L51l93QR2L18k38j84K75l61L53r2j68J11K7J67j29p7L01j83
$$ plain form
5643 3 187 139 276 -115 -225 -87 71 42 -231 334 -12 -1 48 290 -74 -3 -133 13 199 -128 -3 180
5665 180 84 138 -70 -77 7 -6 80 324 -21 -79 -133 -322 43 132 10 -132 20 -81 -81 -81 -73 -169 -17 143 105 -105
5691 -105 215 -18 20 -30 -302 157 37 255 -7 -142 56 -20 -143 105 -73 -350 220 162 -39 129 14
5712 14 -188 208 -82 -12 -171 -81 -107 -77 127 -85 2 -133 3 179 447 71 58 -109 -85 265 232 45 144
5735 144 206 128 -12 -131 31 179 290 30 30 -59 11 -236 -8 -127 83 61 -10 -108 154 189 180 -64 -73 85 -47
5760 -47 25 194 7 -121 99 -6 -98 52 -29 64 31 144 57 227 184 -170 283 183 -287 165 -58 -32 -332
5783 -332 1 -159 33 69 -119 -263 -161 -19 -85 48 -179 105 -88 123 338 -12 112 4 -128 85 -97
5804 -97 -84 179 -497 199 -68 18 -30 162 -253 -33 152 88 108 90 386 -48 233 -70 249 -141 39 33 -28
$$ packed form
5643CJ84m8J37l91j10J38J58k9k73N65l46J1M9K42l64P1j30J46J86l27J25J83
5665A80r6N4k08pQ4j3Q6K44l45n8n4j89L65Q9j22j42J52j01%%Qr6J52J60l8k10
5691a05L20k33L8n0k72M59j20K18k62j35J98p6j23K48j78k77N70n8k01J68j15
5712A4k02L96k90P0j59R0k6L0K04k12Q7j35J36J76K68l76j3j67K4L50l3j87R9
5735A44O2p8j40j19J62J48J11k60%q9P0k47K28j19K10k2p1r8K62L5rk44rJ58j32
5760d7P2J69j87j28K20j05r2J50q1R3l3J13q7J70m3l54M53j00m70M52k23K6l00
5783c32L33j60J92L6j88j44J02J42o6J33k27K84j93K11K15l50J24j08j32K13j82
5804i7J3K63o76O96k67Q6m8J92m15K20J85o4K0j8K96m34K81l03L19l90J80oo1
$$ plain form
5827 -28 -9 32 -13 -109 33 -229 118 -218 -47 294 -174 40 -18 142 -207 -171 25 110 44 -116 293 -23 -76
5850 -76 -92 -384 50 -413 -53 -512 375 -84 -392 236 -90 -300 212 26 245 -48 21 42 319 -33 -63 -6
5872 -6 159 25 162 43 106 120 -34 101 -148 -96 6 80 -108 33 -67 28 85 179 -55 -413 173 88 -290
5895 -290 -130 128 -87 -76 21 38 -22 86 -11 -135 -173 -40 -214 -50 -94 -44 -229 -39 -28 -180 81 -71 91
5918 91 -191 45 -70 245 -38 119 -114 -157 317 119 81 400 94 -174 -22 80 118 -47 -61 230 -14 -10
5940 -10 48 162 -57 -40 67 28 -39 49 -35 -90 -28 5 223 -88 -188 86 -89 -1 83 -286 46 216 -111 -115 111
5965 111 18 30 50 -24 89 87 80 -255 -67 -130 -126 -126 -100 -24 13 -54 -28 365 -281 -127 40 -57 -6 28 -224 48 28
5992 28 12 -125 151 -123 -106 -36 -297 -64 42 -258 100 -187 -303 -134 46 -123 -24 28 -189 14 -65 -296
$$ packed form
5827b8J9M1m5r6J42k62L47l36J71L41m68K14n8J60l49L6J96Q5o6j60M09l16n3
5850g6j6k92M34m63L60m59Q87m59l08O28l26k10N12j86K19k93O9K1K77l52l0N7
5872fJ65j34J37j19O3J4j54J35k49N2J02P4j88J41j00R5N7R4k34l58N86q5l78
5895b90J60K58k15J1R7J7o0J08r7j24l8J33j74J64m4N0j85J90J1j52K61j52J62
5918I1k82K36j15L15k83J57k33m3M74j98l8L19l06k68J52J02L8j65j4K91k44M
5940a0N8J14k19J7J07l9o7Q8q4n5O2L3K18l11j00K74j75Q8Q4l69L32J70l27mK26
5965A11r3J2K0p4J13kpl35J88o3M%K6P6L7o7K6L93o46J54J67r7N1L4k52K72k0
5992B8j6j37K76k74J7P0k61K33J06l00L58k87j16J69J80j69R9N2k17K03p9k31
$$ plain form
6014 -296 -233 115 174 -75 -77 124 -3 57 66 -292 -92 171 -158 -55 95 -235 -147 -62 -232 -210 -157 -135 -232 -146 -6
6039 -6 -226 160 54 28 -67 -277 57 113 39 171 89 -9 -65 -13 -76 153 201 70 -145 -98 -1 -243 -5 -426 -66
6064 -66 -454 -113 33 -100 -80 -254 -183 -102 168 56 -95 160 252 -209 43 -181 93 85 -53 94 -92 135
6086 135 -152 209 68 -11 186 144 -182 -21 -76 95 177 -29 -73 67 251 -215 41 173 -288 -61 111 109
6108 109 -32 -81 -30 230 1 -140 -107 -105 -76 121 -65 96 96 31 -90 -3 21 234 -31 22 -249 223 337 175
6132 175 41 271 -61 86 -37 -4 166 -54 -67 61 160 -120 90 -20 50 10 128 -15 -102 253 -81 -149
6154 -149 114 -453 -223 49 -198 -209 -2 -88 294 1 116 16 47 64 118 287 -94 -253 -150 293 -138 100
6176 100 -85 -167 -306 -46 32 119 -150 100 243 -128 192 114 -72 107 -41 -64 79 -103 -155 -14 -40 146
$$ packed form
6014b96O3L48N9k49kK01j27O0Rl58K00K63l29J03J50l30Q8Q5j70K2N3K2r7Q6J40
6039fk20L86j06k6r5k10L34N6p4J32q2r8n6N2o3K29M8j31k15M7R7k42K38m21L60
6064f6l88L41J46j33K0j74P1Q1K70j12j51K55R2m61K52k24K74qj38J47j86K27
6086A35k87L61j41p9J97m2l26J61n5J71Q2k06m4J40J84m66K56J32m61K27J72k
6108A09j41m9N1K60k29j41L3KK9J97j86J61%o5j21Q7K4K13k65N3k71M72J14j62
6132A75j34K30l32J47j23L3J70k20j3J28R9k80K10j10P0m0J18j43q7L55l34o8
6154a49K63n67K30K72k47j1K07q6L82k93J15j00L1J7N4J69l81j59J03M43m31K38
6176A00j85q2j39K60P8Q7k69K50J43l71L20p8j86J79j48k3J43j82n2J41k6J86
$$ plain form
6198 146 224 99 177 111 -175 -407 -16 45 -40 231 -207 -160 -154 -152 -13 -190 11 173 -50 -131 214 -41 90 50
6222 50 276 -80 26 -184 108 -135 -98 -259 8 7 229 111 80 -131 7 -24 -19 -30 104 226 -105 34 -145
6245 -145 214 58 88 -224 -116 202 -140 18 209 154 174 -57 102 67 41 213 129 34 -56 156 18 435 -83
6268 -83 312 -181 324 49 228 -91 88 237 -97 39 -61 231 -54 66 2 138 46 -92 -198 174 58
6289 58 164 90 150 -56 139 267 25 -95 -7 149 -63 137 0 59 -4 -282 -91 38 -168 29 -81 104
6311 104 -117 -12 -60 68 -170 15 19 -45 -149 -26 163 -32 -157 160 80 -75 -37 -91 -33 -132 125 129 -133 -59
6335 -59 -142 -203 -297 -26 281 -187 -98 138 -15 -76 13 124 -57 -317 -72 -26 -225 6 -15 -215 278 -172 60
6358 60 40 -140 180 27 -146 -169 -47 91 209 139 -220 -45 282 159 -89 -188 -91 -98 -153 79 -147 18 -155
$$ packed form
6198A46P8j25P8o6k86k32L91O1q5K71m38M7OKJ39j77K01J62k23q1L45k55J31m0
6222E0K26l56J06k10K92k43L7j61K67jK22j18l1k11J38l1Nj1J34J22l31J39j79
6245a45L59j56L0l12J08L18l42J58J91n5K0k31J59l5k6J72q4r5r0K12j38M17n18
6268h3L95m93N05k75J79l19J79J49l34J36j00K92k85J20o4J36r2j38j06L72j16
6289E8J06p4O0k06J95J28k42j20Q8J56k12K00j37N9o3k78J91J29k06J97j10J85
6311A04k21J05m8J28k38J85Mo4j04J23J89j95j25L17q0j55L8n4N8r9K57Mk62P4
6335e9q3o1r4K71L07m68Q9K36j53o1Q9J11j81k60K45M6j99K31k1k00M93m50K32
6358F0k0j80L20j53j73k3J22J38J18p0l59J75L27j23k48r9R7pn5K32k26J65j73
$$ plain form
6381 -155 196 -259 369 -52 -109 85 -21 60 113 108 170 -271 -62 -215 145 -337 -131 -114 -34 -59 -147 -99 -54 245
6405 245 -123 168 -217 -87 68 75 -82 88 -117 -101 -22 180 -79 7 -176 223 67 49 41 251 -28 176 210
6428 210 158 2 -231 105 -8 -212 210 -39 140 -31 50 158 92 215 134 -35 -129 232 66 55 100 -208
6450 -208 39 152 36 -153 -143 69 106 -114 -111 -40 -7 20 -226 -113 -232 -38 72 -37 -137 106 -202 29
6472 29 147 -34 -87 178 217 -112 -28 158 -9 -22 69 -168 146 -192 -75 41 -55 -37 138 -251 -183 14 -261
6495 -261 156 2 -248 25 70 -191 116 162 -106 56 -251 -43 -135 39 254 -129 -64 288 7 -198 219
$$ packed form
6381a55L51m55O28m21n7J94j06Q1N3nO2m41K09j53L60m82K06J7Q0k5q8M8M5K99
6405B45l68K91l85J30J55Pj57J70k05J6P9K02k59Q6j83L99j56j8qK10k79K04L4
6428B10n2j56k33L36j13k04M22k49J79j71Q1J08o6J23q1j69r4L61j66j1M5l08
6450b08K47J13j16j89J0K12L7k20LP1L3K7k46J13j19J94J10j09j00K43l08K31
6472B9J18j81n3K65L9l29Q4J86j67j3R1k37L14l38J17J16r6J8J75l89O8J97k75
6495b61M17j54k50K73M5k61L07M6k68J62l07K08r2J74K15l83O5L52k81k05M17
$$ [...]
8191A27
##END NTUPLES=NMR FID
##END=
