##TITLE=1H_DE-154_TFA_CCl4
 200.13Hz,CCl4.
 8 sc
 4.6.2026
##JCAMPDX= 6.0         $$ Bruker NMR JCAMP-DX V2.0
##DATA TYPE= NMR FID
##DATA CLASS= NTUPLES
##ORIGIN= UXNMR, Bruker Analytische Messtechnik GmbH
##OWNER= pz
$$ XWIN-NMR		Version 3.5
$$ Thu Jun  4 14:25:37 2026 Russian Standard Time (UT+4h)  she@DPX200
##.OBSERVE FREQUENCY= 200.131
##.OBSERVE NUCLEUS= ^1H
##.DELAY= (6, 6)
##.ACQUISITION MODE= SIMULTANEOUS
##.ACQUISITION SCHEME= undefined
##.AVERAGES= 8
##.DIGITISER RES= 18
##SPECTROMETER/DATA SYSTEM= spect
##.PULSE SEQUENCE= zg30
##.SOLVENT NAME= CDCl3
##.SHIFT REFERENCE= (INTERNAL, CDCl3, 0, 14.3821)
##AUDIT TRAIL= $$ (NUMBER, WHEN, WHO, WHERE, WHAT)
$$ ##TITLE= Audit trail, XWIN-NMR		Version 3.5
$$ ##JCAMPDX= 5.01
$$ ##ORIGIN= Bruker BioSpin GmbH
$$ ##OWNER= she
$$ F:/spectra/data/she/nmr/H-C/1/audita.txt
$$ ##AUDIT TRAIL=  $$ (NUMBER, WHEN, WHO, WHERE, WHAT)
(   1,<2026-06-04 14:23:59.15 +0400>,<she>,<DPX200>,
      <created by zg, POWCHK disabled, PULCHK disabled
       configuration hash MD5:
       00 E9 B6 7A A2 85 ED C7 34 08 36 98 17 FE 4E 26
       data hash MD5: 16K
       75 C9 ED CC 98 A4 80 D6 9A 31 67 65 3B AA 2E 86>)
$$ ##END=
$$ 
$$ hash MD5
$$ 01 70 15 7F 7A 20 3B 08 71 7A 44 DD B7 81 B8 6D
##$RELAX= 
##$RELAX= 
##$RELAX= 
##$RELAX= 
##$RELAX= 
##$RELAX= 
$$ Bruker specific parameters
$$ --------------------------
##$DU= <F:/spectra>
##$EXPNO= 1
##$NAME= <H-C>
##$PROCNO= 1
##$TYPE= <nmr>
##$USER= <she>
##$AMP= (0..31)
100 100 100 100 100 100 100 100 100 100 100 100 100 100 100 100 100 100 
100 100 100 100 100 100 100 100 100 100 100 100 100 100 
##$AQSEQ= 0
##$AQ_mod= 1
##$AUNM= <au_zg>
##$AUTOPOS= <>
##$BF1= 200.13
##$BF2= 200.13
##$BF3= 200.13
##$BF4= 200.13
##$BF5= 200.13
##$BF6= 200.13
##$BF7= 200.13
##$BF8= 200.13
##$BYTORDA= 1
##$CFDGTYP= 0
##$CFRGTYP= 5
##$CHEMSTR= <none>
##$CNST= (0..31)
1 1 145 1 1 1 1 1 1 1 1 1 1 1 1 1 1 1 1 1 1 1 1 1 1 1 1 1 1 1 1 1 
##$CPDPRG= <>
##$CPDPRG1= <>
##$CPDPRG2= <>
##$CPDPRG3= <>
##$CPDPRG4= <mlev>
##$CPDPRG5= <mlev>
##$CPDPRG6= <mlev>
##$CPDPRG7= <mlev>
##$CPDPRG8= <mlev>
##$CPDPRGB= <>
##$CPDPRGT= <>
##$D= (0..31)
0 0.7 0 0 0 0 0 0 0 0 0 0.03 0 0 0 0 0 0 0 0 0 0 0 0 0 0 0 0 0 0 0 0 
##$DATE= 1780568638
##$DBL= (0..7)
120 120 120 120 120 120 120 120 
##$DBP= (0..7)
150 150 150 150 150 150 150 150 
##$DBP07= 0
##$DBPNAM0= <>
##$DBPNAM1= <>
##$DBPNAM2= <>
##$DBPNAM3= <>
##$DBPNAM4= <>
##$DBPNAM5= <>
##$DBPNAM6= <>
##$DBPNAM7= <>
##$DBPOAL= (0..7)
0.5 0.5 0.5 0.5 0.5 0.5 0.5 0.5 
##$DBPOFFS= (0..7)
0 0 0 0 0 0 0 0 
##$DE= 6
##$DECBNUC= <off>
##$DECIM= 32
##$DECNUC= <off>
##$DECSTAT= 4
##$DIGMOD= 1
##$DIGTYP= 9
##$DL= (0..7)
0 120 120 120 120 120 120 120 
##$DP= (0..7)
150 150 150 150 150 150 150 150 
##$DP07= 0
##$DPNAME0= <>
##$DPNAME1= <>
##$DPNAME2= <>
##$DPNAME3= <>
##$DPNAME4= <>
##$DPNAME5= <>
##$DPNAME6= <>
##$DPNAME7= <>
##$DPOAL= (0..7)
0.5 0.5 0.5 0.5 0.5 0.5 0.5 0.5 
##$DPOFFS= (0..7)
0 0 0 0 0 0 0 0 
##$DQDMODE= 0
##$DR= 18
##$DS= 0
##$DSLIST= <SSSSSSSSSSSSSSS>
$$ [...]
##$SUBNAM0= <"">
##$SUBNAM1= <"">
##$SUBNAM2= <"">
##$SUBNAM3= <"">
##$SUBNAM4= <"">
##$SUBNAM5= <"">
##$SUBNAM6= <"">
##$SUBNAM7= <"">
##$SUBNAM8= <"">
##$SUBNAM9= <"">
##$SW= 18.0517599122864
##$SWIBOX= (0..15)
0 0 2 0 0 0 0 0 0 0 0 0 0 0 0 0 
##$SW_h= 3612.71676300578
##$TD= 16384
##$TD0= 1
##$TE= 0
##$TE2= 300
##$TE3= 300
##$TEG= 300
##$TL= (0..7)
0 120 120 120 120 120 120 120 
##$TP= (0..7)
150 150 150 150 150 150 150 150 
##$TP07= 0
##$TPNAME0= <>
##$TPNAME1= <>
##$TPNAME2= <>
##$TPNAME3= <>
##$TPNAME4= <>
##$TPNAME5= <>
##$TPNAME6= <>
##$TPNAME7= <>
##$TPOAL= (0..7)
0.5 0.5 0.5 0.5 0.5 0.5 0.5 0.5 
##$TPOFFS= (0..7)
0 0 0 0 0 0 0 0 
##$TUNHIN= 0
##$TUNHOUT= 0
##$TUNXOUT= 0
##$USERA1= <user>
##$USERA2= <user>
##$USERA3= <user>
##$USERA4= <user>
##$USERA5= <user>
##$V9= 5
##$VALIST= <valist>
##$VCLIST= <CCCCCCCCCCCCCCC>
##$VD= 0
##$VDLIST= <DDDDDDDDDDDDDDD>
##$VPLIST= <PPPPPPPPPPPPPPP>
##$VTLIST= <TTTTTTTTTTTTTTT>
##$WBST= 1024
##$WBSW= 4
##$XGAIN= (0..3)
0 0 0 0 
##$XL= 0
##$YL= 0
##$YMAX_a= 152651
##$YMIN_a= -54321
##$ZGOPTNS= <>
##$ZL1= 120
##$ZL2= 120
##$ZL3= 120
##$ZL4= 120
##$ABSF1= 10
##$ABSF2= 0
##$ABSG= 5
##$ABSL= 3
##$ALPHA= 0
##$AQORDER= 0
##$ASSFAC= 0
##$ASSFACI= 0
##$ASSFACX= 0
##$ASSWID= 0
##$AUNMP= <proc_1d>
##$AZFE= 0.1
##$AZFW= 0.1
##$BCFW= 1
##$BC_mod= 2
##$BYTORDP= 1
##$COROFFS= 0
##$CY= -3
##$DATMOD= 1
##$DC= 2
##$DFILT= <>
##$DTYPP= 0
##$F1P= 0
##$F2P= 0
##$FCOR= 0.5
##$FTSIZE= 0
##$FT_mod= 4
##$GAMMA= 1
##$GB= 0.15
##$INTBC= 1
##$INTSCL= 1
##$ISEN= 128
##$LB= 0.25
##$LEV0= 0
##$LPBIN= 0
##$MAXI= 10000
##$MC2= 0
##$MEAN= 0
##$ME_mod= 0
##$MI= 1.114404
##$NCOEF= 0
##$NC_proc= 0
##$NLEV= 6
##$NOISF1= 3.799351
##$NOISF2= 2.8
##$NSP= 1
##$NTH_PI= 0
##$NZP= 0
##$OFFSET= 14.38212
##$PC= 1
##$PHC0= -4218.731
##$PHC1= 12.59229
##$PH_mod= 1
##$PKNL= yes
##$PPARMOD= 0
##$PSCAL= 0
##$PSIGN= 0
##$REVERSE= no
##$SF= 200.129724274929
##$SI= 16384
##$SIGF1= 3
##$SIGF2= 2
##$SINO= 400
##$SIOLD= 16384
##$SREGLST= <1H.CDCl3>
##$SSB= 0
##$STSI= 0
##$STSR= 0
##$SW_p= 3205.1282051282
##$SYMM= 0
##$S_DEV= 0
##$TDeff= 0
##$TDoff= 0
##$TI= <>
##$TILT= no
##$TM1= 0
##$TM2= 0
##$TOPLEV= 0
##$USERP1= <user>
##$USERP2= <user>
##$USERP3= <user>
##$USERP4= <user>
##$USERP5= <user>
##$WDW= 1
##$XDIM= 8192
##$YMAX_p= 0
##$YMIN_p= 0
$$ End of Bruker specific parameters
$$ ---------------------------------
##NTUPLES= NMR FID
##VAR_NAME=  TIME,          FID/REAL,        FID/IMAG
##SYMBOL=    X,             R,               I
##VAR_TYPE=  INDEPENDENT,   DEPENDENT,       DEPENDENT
##VAR_FORM=  AFFN,          ASDF,            ASDF
##VAR_DIM=   8192,          8192,            8192
##UNITS=     SECONDS,       ARBITRARY UNITS, ARBITRARY UNITS
##FACTOR=    0.0002768,     1,               1
##FIRST=     0,             0,               0
##LAST=      2.2672688,     0,               0
##MIN=       0,             -54321,          0
##MAX=       2.2672688,     152651,          0
$$ Real data points
##PAGE= N=1
##DATA TABLE= (X++(R..R)), XYDATA
$$ [...]
1860a12J19L6p1J52N9l45K91k22j24j29N39j41k78N30l21K41j35m4k75K93l5Q
$$ -112 7 43 -28 124 183 -162 129 -93 -217 -346 193 52 -226 304 -17 224 89 45 -230 63 28 36
1882C6L3k43M3k30N77k14K42J65l49m1n9K27k28K8r2K26j76j22K31j2M8j30n1
$$ 36 69 -174 -131 -361 216 2 244 409 60 19 -40 187 -41 -13 -105 121 -55 -177 54 42 90 -40 -91
1905i1jJ83N5l17k35M87j54K04j0k07Q0J7%k34J44K73l47J46k19M05n5J00j37
$$ -91 -92 91 146 -171 -406 81 -73 131 121 -86 -6 11 11 -223 -79 194 -153 -7 -226 179 124 224 87
1928H7l86J19J91k19L03k43K72l72L44J39K7j58mk66N6Q6j80J60r6J10k93J83
$$ 87 -299 -180 11 -208 95 -148 124 -248 96 235 262 104 100 -166 -110 -24 -204 -44 -140 -30 -323 -140
1950a40L21l7k47P5J21k26KJ65L4J79k93Kk64L04r1j76Q5K42k04p0J41J36j86
$$ -140 181 144 -103 -28 93 -133 -131 34 68 247 -46 -44 -308 -4 -95 -271 -186 56 -148 -218 -77 59 -127
1973a27K47l6k7j80p5J83K43r8k43J10KJ25k75R5K07k35n1j0N2p8O2J0L4NJ04
$$ -127 120 84 57 -123 -198 -15 228 130 -113 -3 -1 124 -151 -56 151 -84 -135 -145 -93 -171 -109 -99 -65 -60 44
1998D4J40o8J01k73j99L83j54kJ17j1k7j79l8K13m52N90N6j08m07M03k74K52M8
$$ 44 184 116 217 -56 -255 128 -26 -28 89 78 51 -128 -166 47 -405 185 241 133 -274 129 -145 107 155
2021A55l99L47j40m9J70q6k26j01L50J78l65K01q8o6R3r4L30l56L71l83p2L08
$$ 155 -244 103 -37 -86 84 -2 -228 -329 21 199 -166 35 -53 -119 -26 -120 210 -146 225 -158 -230 78
2043G8k5L9l27K95j24j03L31n25L95K65o6l9k81N3M00j47k97j7J43L74m50J70
$$ 78 53 92 -235 60 -64 -167 164 -361 34 299 233 194 -87 -34 366 219 -78 -95 48 422 -28 142
2065A42j30M08l67P8j89k58L87k1p3j4J68k51P9j07N2K25Pom00J24L11n6l99L66
$$ 142 12 420 53 131 -58 -316 71 50 -23 -37 131 -120 -41 -148 -96 129 136 130 -270 -146 165 109 -290 76
2089G6J28l30Q2J01k90L03j98J16L47j91r2j89J30J66j91J37Rj94Q0L63k12j99
$$ 76 204 -126 -44 57 -233 70 -128 -12 335 144 52 -137 -7 159 -32 105 114 -80 0 363 151 -48
2111d8J90k49n5K27l0O2k8M3k33j31L72j12j17k21L74k49J63m1K54k60J64j38
$$ -48 142 -107 -162 65 35 97 69 112 -121 -252 120 8 -109 -330 44 -205 -42 -83 171 -89 75 -63
2133f3L06l3j86K6k31K03o5K38k46J22J50l87J38k80M78k15K5kR1k38j10N2L97
$$ -63 243 210 24 50 -181 22 -43 195 -51 71 221 -166 -28 -308 170 -45 -20 -22 69 -169 -279 -227 170
2156A70r8m2kP1J4k03k3J68k67J29Q9j37o7J63j62J63K29k14q2M34l01L21l48
$$ 170 72 30 28 99 113 -90 -113 55 -212 -83 6 -131 -198 -35 -197 -34 195 -19 -101 333 32 353 5
2179Ej01j2R6J57j66j23QL85l42K7K06Mj43k8J80j87k36K66k97J61L15k89k37
$$ 5 -96 -108 -12 145 -21 -144 -136 249 -93 -66 140 144 1 -27 153 -34 -270 -4 -301 -140 175 -114 -351
2202c51L33j40R3R9j92j1J69j4r4L86k35l15L91j94O0o7P8j55O1K60l80L44l54
$$ -351 -18 -158 -65 34 -158 -169 0 -14 -108 278 43 -272 119 -75 -15 -82 -4 -159 -98 162 -218 126 -228
2225b28J52J70k56j0P0M5MM5R2L0j81J89j23J66k76p6K39k91K10Q3J4rj78oJ00
$$ -228 -76 94 -162 -172 -102 -57 -53 -8 84 114 -67 122 -1 165 -111 -187 52 -239 -29 54 68 59 -119 -125 -25
2250b5J14k1j77K48l6k71K00k55K18P2J19O6k05J21j06J3J19k60j61J25m9J79
$$ -25 89 68 -109 139 103 -168 32 -223 -5 67 186 252 47 168 62 75 194 -66 -227 -102 -151 28
2272B8k5L2j81J99K72m42L1L85o96L23L60l74J5J9K86m09J97J11l30J52J19Q9
$$ 28 3 35 -146 53 325 -117 -86 299 -397 -74 286 -88 -73 -54 232 -177 20 131 -199 -47 72 161
2294A61p9j31kq0K6K83k72K32j81J03klJ07j43r2J41q3l0K45k97K93k25J00l20
$$ 161 82 -49 -51 -131 -105 178 -94 138 -43 60 58 55 162 19 -73 68 -15 -45 200 -97 196 -29 71 -249
2318b49K42L28l75Q8r2j0n6j2J98l60M14P2J4q3K17l86K4J64J03J7j77M8j64J67
$$ -249 -7 321 -54 34 -58 -68 -124 -136 62 -298 116 188 202 119 336 -50 -26 138 241 258 81 129 -35 132
2342A32l53J05J80j53J00L11k63Qq9LP5j06O6J43k17M9l6J90J98k76n8p5j32J95
$$ 132 -221 -116 64 -89 11 322 59 67 -22 -19 56 -50 16 159 -58 -9 -45 145 343 67 9 -66 -198 -3
2366cj2J19j03K49j05NK17k73O6J34l99K8J07M1j75lJ38j52K04r4K12l30j75L06
$$ -3 -15 104 1 250 145 150 367 94 160 294 -105 -77 30 71 -104 -107 31 -121 83 -11 201 -129 -304 2
2390Bj64J73j5J65j16j84K0k44Q4K61J65j83j35K60j74J21P3j08l8j12R7L43j73
$$ 2 -162 11 -4 161 45 -139 -119 -363 -279 -18 147 -36 -171 89 -85 36 109 1 -37 -149 -52 291 118
2413A18J35o7j27K01k70l08M11l46K89K02o1L9l63l2L81j42j1j11M9j37M0K48
$$ 118 253 186 59 260 -10 -318 93 -253 36 238 177 216 -147 -179 202 60 49 -62 -13 -150 -110 138
2435A38j16J6K04r8k30K8j31l7L92P9k7k27J30n3n3j3p8j50l0K76J08m8J29l50
$$ 138 22 38 242 144 -86 -58 -189 -226 166 245 218 -9 121 68 15 2 -76 -226 -256 20 128 80 209 -141
2459a41J86p9Rr6q6J38k1R1l4M3K83k06k11L85p7k45j27QN8J01M6Q2O3r0j25J08
$$ -141 45 -34 -25 -121 -207 -69 -90 1 -33 10 293 87 -124 261 184 -61 -188 -180 -122 -21 25 107 170 80 -45 63
2485F3r0l2qj50J86m7L08k55K68k82QQ6L6j78K87j08l12j9N79j73k47L50m43J26
$$ 63 -27 -59 -67 -217 -31 -78 230 -25 243 -39 -31 55 91 -87 200 92 -220 -239 340 167 -80 270 -173 -47
2509d7k0N7j83K6P7l3J58o4k4J88j4N9j09j2j77L35n0j99O2j71K08J40q1K9k93
$$ -47 -67 -10 -193 -167 -90 -123 35 -29 -53 135 121 180 71 59 -118 217 167 -32 30 -141 67 207 126 155 -138
2534a38J13k3q0L40k26M3R6k2l7m8k10J53r6L3J59L7q3j21K16k13J56j82M31j72
$$ -138 -25 -48 -128 212 -14 29 125 103 66 18 -192 -39 -135 -102 57 94 11 -110 106 -107 49 -133 298 126
2558A26m5m8j8j31J2K75r9NO5m69L22J5J95l39O8J3N1k01L24j66O2L4rL36l02
$$ 126 81 33 15 -116 -104 171 72 77 142 -327 -5 10 205 -134 -66 -53 -2 -203 121 -45 17 51 42 378 76
2583G6j06K06m45J54Q0J47O2k56K90j15j96n9L38j96m27N12J47j15p2j58J09K6
$$ 76 -30 176 -269 -115 -35 112 174 -82 208 93 -103 -162 176 -20 -447 65 212 97 25 -133 -24 2
2605BL1J88o6j62j31L64k2k15j72J16K02j56Q2P4j08M3J07j35q1j27J20k7J26
$$ 2 33 221 155 -7 -138 226 204 -11 -183 -67 135 -21 61 135 27 70 177 42 -39 -166 -46 -73 53
2628E3j00m7j66K01J53Jj18nj8O6J85j97Q0l19J33JJ01N1J1j03L04k73j95K40
$$ 53 -47 -94 -260 -59 94 95 -23 -28 -46 20 205 8 88 -231 -98 -97 4 55 66 -37 267 -6 -201 39
2652C9J37J7k42k8p3L71n30N55l81J79m2R3O9k05J11O1L5j78m2n0J06j5j91J31
$$ 39 176 193 -49 -77 -150 221 -309 246 -135 44 2 95 164 -41 70 131 166 -12 -54 -104 2 -13 -204 -73
2676g3J04r5J00k35J17K9J98Jk5J5j43K62m79K77r0K38j75r3J13j1O8n2l28J73
$$ -73 31 -64 36 -199 -82 -53 145 146 121 136 -7 255 -224 53 -37 201 26 -67 46 35 103 51 -277 -104
2700a04J71P0j56o0K03j74L08m79K95k91K56J13m06M65k62J03J38l03J74j06o
$$ -104 67 137 -19 -79 124 -50 258 -221 74 -217 39 152 -254 211 -51 52 190 -113 61 -45 -51
2721e1PJ05k56J71O8o2J99k88K18k11K64k74R5K20k78J39k21P8Q4k8j1L42l88
$$ -51 -44 61 -195 -24 44 -18 181 -107 111 -100 164 -110 -15 205 -73 66 -155 -77 7 -21 -32 310 -78
2744g8J46r1J27j56L9j19L26l74L32l48L25k37J56n3N6p0J26n9j51L7K68q0Q2
$$ -78 68 -23 104 -52 -13 -132 194 -180 152 -196 129 -108 48 -5 51 -19 107 48 -103 -66 202 122 204
2767B04k62q4mN2M5j7K76k31L24l97l0M7L3J00j2j2k28K50k95J84R5K04k42K40
$$ 204 -58 -142 -146 -94 -49 -66 210 -21 303 -94 -124 -77 -44 56 44 32 -196 54 -241 -57 38 242 0 240
2791B40p6j91O4J71j97K30k55J66K2n39L37j18K63R0k54l6P7p2K42j41K45L8k72
$$ 240 164 -27 37 208 11 241 -14 152 174 -365 -28 -146 117 207 -47 -83 -6 -78 164 23 268 306 34
2814C4k54L07j91k38K63L06m11K38J17KJ10m37j42K77r3J26j74K59j72l2Q0L5
$$ 34 -220 87 -104 -342 -79 227 -184 54 171 173 283 -154 -296 -19 -112 14 -160 99 -73 -105 -25 10
2836A0j08J5k16L75n2j15K70l56K1K8J34k13J07M1K5P6R5j36J52R9k02Q5k83J07
$$ 10 -98 -83 -299 76 24 -91 179 -177 -156 -128 6 -207 -100 -59 -34 42 137 1 153 252 50 135 -148 -41
2860d1J8M8j53J00Q0o0j65j32K77j70L85k84O5N0j41J67n6k04L74o7j04j74J81
$$ -41 -23 25 -128 -28 52 -8 -173 -305 -28 -198 187 -97 -32 18 -123 44 -12 -216 158 91 -13 -187 -6
2883fj11L9J80j46K76l73L80p9j92j71N02p2j92l94J81N6M64l11k10K08m5k33
$$ -6 -117 -78 102 -44 232 -141 239 160 -32 -203 299 227 35 -359 -178 -122 342 31 -179 29 -16 -249
2905b49M00k8M3l45L19k52j02L82k05J46L1oj65Q1j42l9K53j48k7K24l08J14J70
$$ -249 151 123 166 -179 140 -112 -214 168 -37 109 140 134 -31 50 -92 -131 122 -26 -53 171 -137 -23 147
2928A47k88K72j54J83k44KK21k07n0p1L5J44p8M9J67j14L15m45J42k58K84k67
$$ 147 -141 131 -23 160 -84 -82 139 -68 -118 -189 -154 -10 -88 -39 128 14 329 -116 26 -232 52 -215
2950b15J98J73k17N6L3oJ54l08J28j14K24k13K25k14l33N28L2k89J2J03K58l57
$$ -215 -17 156 -61 -5 28 22 176 -132 -4 -118 106 -107 118 -96 -429 99 131 -158 -146 -43 215 -142
2972a42p7N24k60P9n3j19O8k32J87J30j82J18o2J34J68pl61L12j02j04j12K10
$$ -142 -219 305 45 124 71 -48 20 -212 -25 105 -77 41 -21 113 281 274 -87 225 123 19 -93 117
2994A17j82M9o7Q9j0j36J69Q1k40j8J52j66L92n02J07L57m33L44k06kL16o03K46
$$ 117 -65 -16 -83 6 -4 -140 29 110 -130 -148 4 -162 230 -272 -165 192 -241 103 -103 -105 211 -392 -146
3017a46L92k25P4o0Rn9J51L0l31L60l54J55k75M07k33J42j27n7O00m66j27K50
$$ -146 246 21 95 35 44 -15 136 166 -165 195 -159 -4 -279 128 -105 37 -90 -147 453 -13 -140 110
3039A10k13P0j8M2J5OK91k86Q3k19L30j28j36L20O4l37j05K71k72L53k98L8p6
$$ 110 -103 -33 -51 -9 6 12 303 17 100 -119 211 83 -53 267 331 -6 -111 160 -112 241 -57 -19 -95
3062i5L3J15r5K95l17L4J52l01J13L9O0j12j33J77Pk7O4j34K2L16k71r1K70o3
$$ -95 -62 53 -42 253 -64 -30 122 -179 -66 -27 33 -79 -212 -35 -28 -55 9 -125 -103 213 -58 -149 121 58
3086E8l24L8m9N45p4j77K22m44J96J61j09l9N9m10L00J27R9j73l2J43p2K9K37
$$ 58 -266 -228 -277 268 194 17 239 -205 -9 152 43 4 63 -347 -47 80 179 6 -26 117 45 74 311
3109C11j63J0K0l34L07K8j35K3k27K19l02L59m8j09J27q9R7k20j61K55K03k27
$$ 311 148 158 178 -156 151 179 44 67 -160 59 -243 116 68 -41 86 -3 94 -126 -287 -32 171 -56
3131e6q3k0L19m6j15J7lK8q1J21Km03L90j33K21l62M37k56NJ47j34j46J33L2K59
$$ -56 -139 -159 160 114 -1 16 13 41 -40 81 83 -320 70 -63 158 -204 233 -23 -18 129 -5 -151 -18 14 273
3156B73k60K44k71J9J53l14K01Jk2ok20M72r5o7K1m73M15Q9k26j02ML35l28k4
$$ 273 13 257 -14 5 158 -156 45 46 24 18 -202 270 175 108 129 -344 71 160 -66 -168 -164 171 -157 -181
3180a81K74j82M5q3mL35j72M4k51L31j49K09Jk65L5m6M9K63m37J28J31j63J70
$$ -181 93 -89 -44 -127 -131 204 32 76 -175 156 7 216 217 -48 -13 -59 -10 253 -184 -56 75 -88 82
3203H2m65K43P7n8K78j86Qj0j05j02L45j59J93j92K01k18K30q7j25q2R0l4j34
$$ 82 -383 -140 -63 -121 157 -29 -21 -31 -136 -238 107 -52 141 -51 150 -68 162 75 -50 -132 -42 -76 -210
3226b10J82J09k43J20Q7j4J48k79j3j13J42Q2k99L50J27m9L5j95J37j20r5r3Q2
$$ -210 -28 81 -162 -42 45 31 179 -100 -113 -226 -84 -2 -301 49 176 127 162 -33 104 -16 -111 -204 -122
3249a22rJ79j37M8j38J80L5k94L23j90K52k14K0K41k76n4L68l93K93j49j4L26
$$ -122 -131 48 -89 -41 -179 1 36 -258 65 -125 127 -87 -67 174 -102 -156 212 -181 112 -37 -51 275
3271B75l59J65j05j12K18j69K70J24k09Q6P5k01j25J38L6J78j36m9k54J15j07
$$ 275 -84 81 -24 -136 82 -87 183 307 98 184 259 58 -67 71 107 285 149 100 -154 -39 -146
3292a46N5J82q0p2J94k04L94o02K66Jk31J53J78j01l26L60k55L91Q2j14j97J06
$$ -146 -91 91 11 -61 133 -71 323 -279 -13 -12 -243 -90 88 -13 -339 21 -234 157 239 125 -72 34
3314C4p3J30J03j98J76j90K16l47J1J06k13o4L59L2P8q2l59L71j79K73j15J24
$$ 34 -39 91 194 -4 172 -18 198 -149 -138 -32 -245 -309 50 82 160 78 -281 90 -89 184 69 193
3336A93J84l53j80J65Q3k71L71m00K23J88l08J89nk31N1J0O5K52j54k57Q2N32
$$ 193 377 24 -156 9 92 -179 192 -208 15 203 -105 84 79 -152 -101 -91 -26 226 72 -185 -103 429
3358D29m44l1J93l40J14j08K48j61K54j02n3m7RJ47O6k79K2K49p1k71O2Q7n9Q2
$$ 429 -15 -46 147 -193 -79 -187 61 -100 154 52 -1 -48 -39 108 174 -105 -83 166 95 -176 -114 -27 -86 -4
3382dp5j07R3jj30R2L75j78J49l99L85j85l38N46j62J31j63J2j39J40M9k47K40
$$ -4 -79 -186 -93 -94 -224 -132 243 65 214 -185 200 15 -323 223 61 192 29 41 -98 42 91 -156 84
3405H4j53K91j02l8k26J07j87M53k80p3L3P0J67J59k82P9N8o7j44l7K34j90K22
$$ 84 -69 222 120 82 -144 -37 -224 229 -51 -124 -91 -21 146 305 23 102 160 93 -51 -88 146 -44 178
3428A78k68K1JJ72l0l09K98m1l4p6K42r5n5q4N4P8K04l07j88M7K26j01K54j97
$$ 178 -90 -69 -68 104 74 -235 63 22 -12 -88 154 59 4 -80 -26 52 256 -51 -239 -192 34 -67 187 -10
3452a0l7n5P6M2j61jj11L00J07Lm32L87k91J72j45L27M6l42J28k8m9o5K43k5j99
$$ -10 -47 -102 -26 16 -145 -146 -257 43 150 153 -279 108 -183 -11 -156 171 217 -125 3 -25 -74 -139 104 79 -120
3477a20L13j88Q0m6mk38Q1J70Q9j21j61J18J16j5p5p5k1L8N09n05O5J40n0k6N
$$ -120 193 5 85 39 35 -203 -122 48 137 16 -145 -27 89 74 -1 -76 -97 -59 450 -55 10 150 100 74 79
3502G9j14L4J52j50l67K35J76o5j87L19k37J93Qp0p1j7K02j3j22j21j2j51L68
$$ 79 -35 -1 151 1 -366 -131 45 -20 -207 112 -125 68 76 6 -65 -82 120 107 -15 -136 -148 -299 69
3525F9j72m7K73m16K81Q4j18P0r8J26L2k95K6J25L65k47J0J8j01J08J04j8O3Q
$$ 69 -103 -150 123 -293 -12 72 -46 24 -74 52 84 -211 -185 -60 305 58 68 86 -15 93 197 179 242 250
3549B50n12M13k9k0k24j08P9O2P1r1J92k91J41O4k1M0k5J34r6J32j7q8j8k80l7
$$ 250 -262 151 122 102 -122 -230 -151 -89 -18 -109 83 -208 -67 -3 -24 16 -9 125 29 161 144 56 38 -242 -279
3574b79M58r5j47J68P1m1m03K81J42k87K28p7k6J29l22K36m7J60l49K74K3m2j89
$$ -279 179 84 -63 105 176 135 -268 13 155 -132 96 19 -7 122 -200 36 -11 149 -200 74 97 55 -134
3597a34o5P6J29k59J17K42n6j84L18l13k51K35R9O2n0M0Q8K9l63O9K55q7j29K40
$$ -134 -199 -123 6 -253 -136 106 50 -134 184 -129 -380 -145 -46 16 -34 6 94 123 -240 -171 84 -3 -132 108
3621A08k00M3o7J02j39j13J76R7pj26K08K26k6k64r1R8k27L85l21M7R3j18O8j1
$$ 108 -92 -49 -116 -14 -153 -266 -90 7 0 -126 82 308 282 18 -73 25 -202 183 -138 -91 2 -116 -48 -59
3645e9j9K10k5l88M96j55m29O59j57m2q5J78R6l80K12N8k29J48j35L13k58J06
$$ -59 -78 132 107 -281 215 60 -369 290 133 91 6 184 280 -100 112 170 -59 89 -46 267 9 115
3667A15Rj92r6Q7J21O4j22J20j03j55J34j8r3J35m4m5K77m36K49r1K71R9k83J40
$$ 115 124 -68 -164 -77 44 108 -14 106 3 -152 -18 -36 -129 6 -38 -83 194 -242 7 -84 187 286 3 143
3691A43o9J37l33M07l55J10k0R4m30M69j50j24M29k72rk07J38q1J15k25K32k64
$$ 143 74 211 -122 285 -70 40 20 114 -316 153 3 -121 308 36 27 -180 -42 -123 -8 -233 -1 -265
3713b65K94N9l5jJ80l26R7l8j35J35J63j50J24P0K26k18k02o9Q6L8p3MJ24k34
$$ -265 29 88 53 52 232 -94 3 -35 -170 -35 128 -22 102 172 398 180 -22 -91 -5 33 -40 -36 88 -146
3737a46j92L84p2J13o5q2J04k04M25l43O5K6J15m17K69K3rJ5j3l7J71l68J67N2
$$ -146 -338 46 -26 87 22 -60 44 -160 265 -78 -13 13 128 -289 -20 3 -6 9 -4 -41 130 -238 -71 -19
3761a9k8O0L8k42L44j95J34k52J85K04k00O4l50M30M4j45k25K10l39L99nj42j9
$$ -19 -47 13 51 -191 153 -42 92 -160 25 229 29 93 -257 173 217 72 -153 57 -282 117 112 -30 -49
3784d9K08l07P3J09O8k02J50R2k19j88J78j63Q6K74K27m21O0L0J05J19r7J22j83
$$ -49 159 -148 -75 34 102 -100 50 142 -77 -265 -87 -250 -164 110 337 -84 -24 6 111 230 133 255 72
3807G2m0L5M3j61J9q1l0K85k66Q6L42m98K98l28P0N0J7K37l57L65o4k79l0L60
$$ 72 32 67 110 -51 -32 -113 -143 142 -124 -38 304 -194 104 -224 -154 -104 -87 150 -207 158 94 -185 -215 145
3831A45k7l7jj88j13L03k04K6L73m69k2N5K4q8O8K47j96J17L0k4n3pK38k65J57
$$ 145 118 81 80 -108 -221 82 -122 -96 277 -192 -214 -159 -135 -223 -155 92 -104 13 43 19 -34 -41 197 -68 89
3856H9J13j00j6j89K05k3j92J22l8MK20j05j35l2j51mk62P80m19O1j02J05M0k85
$$ 89 202 102 86 -103 102 79 -113 9 -29 -25 195 90 -45 -77 -228 -232 -494 286 -133 -72 -174 -69 -29 -314
3880c14N70k05l70LM60Q0p3o4q0n1K18k30J34k12L63n1l09L21p3j97J85L9J23
$$ -314 256 51 -319 -316 144 224 151 87 7 -44 174 -56 78 -134 229 178 -131 190 117 -80 105 144 267
3903B67l28L8L1j63j29K34J06J29k39K4k59M11l7j95M58l47O2k53L38M5p3j70
$$ 267 -61 -23 8 -155 -284 -50 56 185 -54 -30 -289 122 85 -110 348 1 63 -190 148 193 120 -50
3925e0j3P3r9K13L4m13K12j14K68k83P4J19m3J4k28K08j82J32m4J93N7l0j84R1
$$ -50 -63 10 -89 124 158 -255 -43 -157 111 -172 -98 21 -22 -8 -236 -28 -210 -78 -122 71 128 98 -86 5
3949Ej82J45J32k32J58J1n7M4K59r2m2k17rj06L03j0j95r7J76k49N38j26j65m7
$$ 5 -177 -32 100 -132 26 37 -20 24 283 191 149 -68 -77 -183 120 110 -85 -182 -6 -255 283 157 -8 -55
3973e5J57J0j56J2l21O47o10L54K09o2k99J74O4J46j67q5n9J49k82K77L5M5j77
$$ -55 102 112 -44 -32 -353 294 -316 38 247 185 -114 60 124 270 103 18 -41 108 -174 103 138 183 6
3996FQ5R6k95J19J09j17J0n7j7j77J10K65j11n8j23L3O3Q0m5l4j52J93j10K63
$$ 6 91 187 -108 11 120 3 13 -44 -61 -238 -128 137 26 -32 -155 -122 -59 21 -24 -58 -210 -17 -127 136
4020A36k09Rj37k23k9P14m38R5n7K60j54k14L64K8Qk64L9j37M17k99L45l27j10
$$ 136 -73 -64 -201 -424 -453 261 -177 -82 -139 121 -33 -247 117 145 153 -111 -72 -209 208 -91 254 -73 -183
4043a83j62L48J67J26m30NJ45R2j40J32j90J83l10J62K09j32j12J31p5j09O19
$$ -183 -345 3 170 296 -134 -129 16 108 -32 100 -90 93 -217 -55 154 22 -90 41 -34 -143 476
4064D76l74p2J00k13J91j38O7k1J15m9j52J35j36p1m9K34j85L96k34K30l40L9
$$ 476 102 30 130 -83 108 -30 37 16 131 82 -70 65 -71 -142 -191 43 -142 254 20 250 -90 -51
4086e1L9L04p6k96J22m0O1J10kk26L35K30m00l45L05m2O7N8k97K38j8j96M5J87
$$ -51 -12 292 216 -80 42 2 63 173 171 -55 280 510 110 -235 70 28 95 153 -144 94 76 -120 -75 112
4110A12j14J50k45J46l5O0j45k00L07j20q1K00K01l94J26j3j07o5K14K22n92L05
$$ 112 -2 148 -97 49 14 74 -71 -271 36 -84 -165 35 236 -158 -32 -45 -152 -217 -3 219 -373 -68
4132f8j45J85l79M53l0o0O3k26L02l4k65J91L76l66j19P5K70j81K23m32J53J70
$$ -68 -213 -28 -407 46 16 -44 19 -207 95 61 -204 -13 363 -3 -122 -47 223 42 265 -167 -14 156
4154A56l5j09J31k25l1J73j20J07Q8n3J02n7n8k4j24J37k64K93N2k26M4k3J81
$$ 156 121 12 143 -82 -113 60 -60 47 135 82 184 127 69 45 -79 58 -206 87 139 -87 -43 -66 115
4177A15j45P1oj18Q9k25R1J21n0k0j60N26pn07L80k55M4k45J42Q0j33K47%M6j30
$$ 115 -30 41 35 -83 6 -219 -128 -7 -57 -77 -237 289 282 -225 155 -100 -56 -301 -159 -79 -212 35 35 81 -49
4202d9K95k69l2l5J57K21l59lJ56j36J63j47N9j7J9NK74k07Q2n2j42K55k50J45
$$ -49 246 -23 -55 -90 67 288 -71 -74 82 -54 109 -38 21 4 23 28 302 95 177 125 -17 238 -12 133
4226A33j18LJ62l26K18J16j19L3r1qJ65j75RL0k47L37j45k59R9O9K72l60L31r6
$$ 133 15 18 180 -146 72 188 69 102 11 3 168 -7 2 32 -215 122 -23 -282 -183 -114 158 -202 129 33
4250C3O8j85o3P5L2K29N9l12L45p2k73j75L29L4m71N22j93l1O1q0j42Q3J15pk27
$$ 33 101 -84 -147 -72 -40 189 248 -64 281 209 -64 -239 90 124 -347 175 -18 -49 12 -68 -210 -127 -12 -19 -246
4275b46L45j45K17Lj5J14k75R6ml00J87Qj1J01l7o8K72n1l81O8q5J57J04k74L38
$$ -246 99 -46 171 174 159 273 -2 94 90 -210 -23 -15 -26 75 38 -30 242 191 -190 -122 -207 -50 54 -220 118
4300A18m11L02m4J07J62k42M2J02j40Q5J35j16p0j85J69o8J10k71L11l7k93L01
$$ 118 -293 9 -35 72 234 -8 34 136 -4 81 216 100 30 -155 14 -54 56 -215 96 59 -234 67
4322F7P3k20M76o62K9J89l3j12J19J0L12j07l1K1j86P6J27J15k60J85m84K45L79
$$ 67 140 -80 396 -266 -237 -48 -81 -193 -74 -64 248 141 110 131 -55 21 148 263 3 188 -296 -51 328
4345C28n67K45P4K18m14n0K35l27K05L77m12K71j22K3L5J22j04q0p6j91L00m9
$$ 328 -239 6 80 298 -116 -166 69 -258 -53 324 -88 183 61 84 119 241 137 57 -19 -210 90 41
4367D1K4P7l74K88j96J54J72j9pJ14n64J67K3k6K03l63K16J61k52J00P2Lk8l16
$$ 41 65 142 -232 56 -140 14 186 167 160 274 -290 -123 -100 -126 77 -286 -70 91 -161 -61 11 14 -14 -330
4391c30L24pJ96p8j60J12q6j74K82k21K25jL5j78r4J13l2pj49M81j02m3k02k9
$$ -330 -6 -13 183 105 -55 57 -29 -203 79 -142 83 82 117 -61 -155 -42 -74 -81 -230 251 149 106 -96 -125
4415a25M14k19J66j07k65L03Q1l81J86j34K87n1k09J58j12j4J63l3l25J85L68
$$ -125 289 70 236 129 -136 167 248 -133 53 -81 206 155 -54 104 -8 -22 141 108 -217 -32 336
4436C36l69l2J32k40L78l23J58j21J70k18L31j52J5q6m5M1k03kM99k73Qj3l74
$$ 336 -33 -65 67 -173 205 -118 40 -81 89 -129 202 50 65 -21 -66 -25 -228 -230 269 -4 4 -9 -383
4459c83L97j65K88k13r5J11J17ol29J12K59m95K13J64j50J78K16j23l60L86o4
$$ -383 14 -151 137 -76 -171 -60 57 51 -278 -166 93 -402 -189 -25 -175 3 219 96 -264 122 58
4480E8l64M54K3j60j05L0m1L67R2k27k6p2J79k21k62M16m37M55k37oK18k54K90
$$ 58 -306 148 171 11 -94 -64 -105 262 354 127 101 29 208 -13 -275 141 -296 159 -78 -84 134 -120 170
4503A70o9j76K08l52J51J05J44K3j78l18M68j00j02r1R3P8j5J10j1j78k6pR2J9
$$ 170 101 -75 133 -219 -68 37 181 204 26 -292 176 76 -26 -117 -24 54 39 149 138 -40 -66 -73 19 38
4527C8j53K43j27J58j55PM4k61N3n1L82j77p0J42O8L2j71mk06J63J07l41K52O2
$$ 38 -115 128 1 159 4 11 55 -206 -153 -204 178 1 -69 73 141 173 2 -2 -208 -45 62 -279 -27 35
4551C5k87K69j12J72j02J47j0o3k72K56j84m0J52J22m0QK68l28J28M5l3k23J80
$$ 35 -252 17 -95 77 -25 122 112 49 -223 33 -151 -191 -39 83 43 51 319 -9 119 164 131 -92 88
4574H8j08R5k27Q7N5k6j29J36K3J13o3Pk10M5J24r5J46J02k26k13N27m25K11k18
$$ 88 -20 75 -152 -65 -10 -36 -165 -29 -6 107 44 51 -159 -114 10 -85 61 163 -63 -276 251 -174 37 -181
4598a81K05Mk2k64L08L5J33k39p4N8J42l1k69L55j17Q4p4p0j27K92l31J71l7K3
$$ -181 24 28 6 -258 50 85 218 -21 -95 -37 105 74 -195 160 43 127 53 -17 -144 148 -183 -12 -49 -26
4622b6N1n1K9P0k84K64J63k82K0J34Q2n1j38J24J5k10M8N6J84k00j07L84k1k58
$$ -26 25 -26 3 73 -211 53 216 -66 -46 88 170 119 -19 105 120 -90 -42 14 198 -2 -109 275 254 -4
4646dR8m5r8J43N2l08J55K44j50q3N9k72J82q2M7J2j81K77k84L27JJ44k12k38
$$ -4 94 49 -49 94 146 -162 -7 237 87 4 63 -209 -27 -109 -62 -50 -231 46 -238 89 90 234 22 -216
4670b16L17j71O9o9r0K08M7J14m01L09j13L8J23j15O0l07l0K26J69j90J87j1k74
$$ -216 101 -70 -1 -70 -160 48 95 209 -192 117 4 42 165 50 110 -197 -227 -1 168 -22 165 154 -120
4693a20J7J89j4p4R7q4j45L36k89orK6K21l67L08l0O3n3N8j51K10M2j41j62j22
$$ -120 -103 86 72 -2 95 11 -134 202 -87 -93 -102 -76 145 -222 86 56 119 66 124 -27 183 225 84 -78 -200
4718b00OJ29N31n35K03m61L51l51O31k66j58K29k09K24r0R3k46J27j56J22r7L1
$$ -200 -194 -65 466 -69 134 -327 24 -327 304 38 -120 109 -100 124 34 127 -119 8 -148 -26 -123 -92
4740i2p8K15o6J60J74l39l26L44j2P1j63K27J18l32O9k29L98j62n8J3o5J65P2
$$ -92 -170 45 -21 139 313 -26 -352 -8 -20 51 -112 115 233 -99 -30 -259 139 -23 -81 -68 -133 32 104
4763A04j14O0j27j38K89j90r8L22Ql09j66P8L91j43j5K18j87k33L87O0l5p8j55
$$ 104 -10 50 -77 -215 74 -116 -214 108 116 -193 -359 -281 110 -33 -48 170 -17 -250 137 197 162 84 -71
4786g1n3K34k48J45K6Nj46J23j13J0n1J49L2J64j19j56R8l56M32p6k96L11j71
$$ -71 -124 110 -138 7 33 38 -108 15 -98 -88 -139 10 42 206 87 -69 29 -327 105 29 -267 44 -127
4809a27J16KQ3m0N3j40r4J19j12K86k89R4p2M77l45o1L9K99k51M9j40J74r6j46
$$ -127 -11 -9 74 34 87 -53 -147 -28 -140 146 -143 -49 -121 356 11 -50 -11 288 37 86 -54 120 24 -122
4833a22L65l20j18J32j05J94R9j93R1l32J65Np8J6L98l65J20p1K58l26N91n08
$$ -122 243 -77 -195 -63 -168 26 125 -68 23 -309 -144 -139 -217 -201 197 -168 -48 -119 139 -187 404 -104
4855a04k05M55k56K2J58k45r9J59K06j2R1j63l02L81j1j85J28K30k75M3m48L25
$$ -104 -309 146 -110 -88 70 -175 -274 -115 91 79 170 7 -295 86 75 -110 18 248 -27 16 -432 -107
4877a07K01K3m25M19j77j24Q5J72N7k5q5K57k64k15J45M1R4L0r1j9j10J66N3q6
$$ -107 94 117 -308 111 -66 -190 -105 67 124 99 14 271 7 -208 -63 -22 72 102 11 -8 -118 48 101 15
4901A5j16J87k1j22q9K2l8P9K87n04K60J40j44J35o04L60K7J64k36K26l89K69
$$ 15 -101 86 65 -57 -146 -124 -162 -83 204 -300 -40 100 -44 91 -513 -153 -126 38 -198 28 -361 -92
4923i2l9K76q9l28M27m7j82K15j2j44j21M2K82j83J93k14P1j48J16l33P5J14M79
$$ -92 -131 145 56 -272 155 108 -74 141 129 -15 -136 -94 188 5 198 -16 55 -93 23 -310 -235 -121 358
4946C58m52r5p1L11j53L60p3m09L24J53l30M69l03l02L40l06K67k65J41M4Q9M6
$$ 358 -94 -189 -260 51 -102 258 185 -224 100 253 -77 392 89 -213 127 -179 88 -177 -36 8 97 143
4968A43J65n61M47p4k97K35K97m17J10Q5R7l97J48pj48K29J72O4l00J7k24M04
$$ 143 308 -253 194 120 -177 58 355 -62 48 133 230 -167 -19 -26 -174 55 227 291 -9 8 -216 188
4990A88M3p1k4j89m4L2J09j32R3j00oL48k67j8J23l97M27j67J41l70L56Q4l58
$$ 188 231 160 136 -53 -97 -65 44 -88 5 -95 -101 247 -20 -38 85 -312 115 -52 89 -281 75 159 -199
5013a99K96Q9l66K32q5N1j05m5j6K33K32m13J33j82q1N39k59J45q6J1k15q2J04
$$ -199 97 186 -180 52 -33 18 -87 -132 -148 85 317 -96 37 -145 -226 313 54 199 113 124 -91 -173 -69
5036f9J26o7J41P4k57n8J26Nj72R2j8K38k93L72k22K50m1j87qO5o1N6n72M55p2
$$ -69 57 -10 131 205 -52 -110 16 21 -151 -59 -77 161 -132 240 18 268 227 40 32 97 36 92 -480 -25 -97
5061i7K26l62J38J27J00k1L2l6k66K31Jk1L9rj41j61K94k11pJ9K77k05rNj33L36
$$ -97 129 -233 -95 32 132 111 143 107 -159 72 73 52 91 82 -59 -220 74 -137 -144 -125 152 -53 -62 -57 -190 146
5087A46l39K90%Jk11M9N6l0K1j84N11l32O4J4k26J95k55K45K7j5j43p0L99k20
$$ 146 -193 97 97 98 -113 -64 -8 -38 -17 -201 310 -22 42 56 -170 25 -230 15 42 27 -116 -186 213 -7
5111gO4rj47K05L45l16J49j88j34NJ18j94k6J90j77K78k49P2J83k8J00j82L1j14
$$ -7 57 48 -99 106 451 135 284 96 -38 -33 85 -109 -135 55 -122 156 -93 -21 162 134 234 52 83 -31
5135c1J19k09J30l1o4L8j35M42k43o4q0L20q0r3j07%K98l04K93o4j46O2M0l95
$$ -31 88 -121 9 -22 -86 -48 -183 259 16 -48 -128 192 112 19 -88 -88 210 -94 199 135 -11 51 91 -304
5159c04J78R2k8j64J29k68L61n8K98n09M56k22M5M2n6O1M9L0K0J17l38J1k32J70
$$ -304 -126 -34 -62 -226 -97 -365 -4 -62 236 -273 183 -39 6 48 -8 53 102 132 152 269 -69 -58 -290 -120
5183a20q0K77m4K0k69L86q9j05k56j3K52p5K95o8p8J75k7nj50K51j97k89M96l50
$$ -120 -200 77 33 53 -216 170 81 -24 -280 -293 -41 -116 179 111 33 208 181 176 26 277 80 -209 287 -63
5207f3P4p0m8p3K19J90m69J09P3J70l24J88j06M1K98J18m08P9J88l72P02m42l03
$$ -63 11 -59 -107 -180 39 229 -240 -131 -58 112 -212 -24 -130 -89 209 327 -81 -2 186 -186 516 74 -229
5230b29K37Q8k4k0J5j60L26j39O5l25L12J2J2j89M15m30q9J9M3R8j37j61K64r8
$$ -229 8 96 72 52 67 -93 233 94 159 -166 146 158 170 -19 396 -34 -123 -104 -61 37 -100 -261 3 -95
5254i5m6J18l3O5P1o9J11o9N5K56l43M9Q1N9j29k79J15J03j20J38j23n7n7M95
$$ -95 -141 -23 -56 9 80 11 122 53 108 364 21 70 151 210 81 -198 -83 20 -100 38 -85 -142 -199 296
5278B96j41m00L08J73j66q7Q3j00m0J04l73M34j85J85k3J75k36M0j59L9j48J84
$$ 296 155 -245 63 236 70 -17 66 -34 -74 30 -343 91 -94 91 68 243 7 47 -112 -73 -221 -37
5300c7p9k7K23k05J49p7rQ6K1J40l27o0J29j23J87j43R1j38J24k9K00l92K25m1
$$ -37 -116 -143 80 -125 24 -53 -62 24 45 185 -142 -202 -73 -196 -9 -152 -61 -199 -75 -104 96 -296 -71 -112
5324a12K34n2p0M6o3J2l7jJ05j73K09K3n8J96j60q1j58J86K37kl73J42K13o70
$$ -112 122 70 0 46 -17 -5 -42 -43 62 -111 98 121 63 259 99 18 -140 46 283 281 -92 50 263 -407
5348d07M62m5J52j85j01O3K05j25l76L87n0P5O3M6l4l0j18K25k1k52K66l17J45
$$ -407 55 10 162 -23 -124 -61 144 19 -357 30 -20 55 118 164 130 100 -18 207 186 -66 200 -117 28
5371B8J0J24j15k08K92j55k02M31n8J7k58K41j09k8J18l44K66L6jk36J85K9Qk44
$$ 28 38 162 47 -161 131 -24 -226 205 147 164 -94 147 38 10 128 -216 50 86 85 -151 34 63 71 -173
5395a73L20P9k15N0j82L12k61j23K68K5k01R5Ro3J37O5j36n9J40k4l4k6j25J92
$$ -173 147 226 11 61 -121 191 -70 -193 75 100 -101 -6 3 -60 77 142 6 -53 87 63 29 3 -122 70
5419G0j44L12k44m8K4L02k36j7M7J92l83M3J44j79L9k0L0KJ4J67l6k14O2p7r5
$$ 70 -74 238 -6 -54 -30 272 36 19 66 258 -125 -82 62 -117 -78 -98 -68 -66 -52 115 79 -135 -73 -150 -245
5444b45O2L77l22M6j16J41J38l43K84k88K61O7j42R5R4k8J15j07l5L4l15L50k92
$$ -245 -183 194 -128 -82 -198 -57 81 -262 22 -266 -5 62 -80 15 109 81 196 89 54 88 -227 123 -169
5467a69p7N58m51J03l5L14l56L7J28l5J07P0k41R5K26q8j47j89p5J75o6K68l10
$$ -169 -246 312 -139 -36 -71 243 -113 -76 52 17 124 194 -47 48 274 186 39 -150 -225 -50 -116 152 -158
5490a58L99k10K24k43k49M53k8l36K72j44j10l3J43P4rK34j68j03J51k22K30n4
$$ -158 241 31 255 12 -237 216 188 -148 124 -20 -130 -163 -20 54 45 279 111 8 159 -63 167 113
5512A13l18K26p6K59k89J17J50j61j8J24k53R4p4M12l35m7J78k27K84k39K03K9
$$ 113 -205 21 -55 204 -85 32 182 21 3 127 -126 -32 -106 306 -29 -76 102 -125 159 -80 123 152
5534A52L1l42J42m0o9j55K64m1J34P7j96LK26J44k61j59j38R4J23k9K18o9j64
$$ 152 183 -159 -17 -57 -126 -281 -17 -58 76 153 -43 -40 186 330 69 -90 -228 -134 -11 -40 178 109 -55
5557e5J1p0J76l3j14L4J79k35K94l39M31l72Q9J76k05J8k5j17Q5k25K99N1J7q3
$$ -55 -44 -114 62 29 -85 -51 128 -107 187 -152 279 -93 -4 172 -33 -15 -40 -157 -72 -297 2 53 70 -13
5581a3j6m3O4J21k96k5k4j61M55K29q9k87J50N0j02j90K90j53j15J40j23J93k08
$$ -13 -29 -72 -8 113 -183 -208 -232 -393 62 291 202 -85 65 115 13 -177 113 -40 -155 -15 -138 55 -153
5604a53K41k02K40n7j5l09K52k2R2k21j19L51N2k60J86r2O7p3J8J45o0k6N2N2
$$ -153 88 -114 126 69 54 -255 -3 -25 67 -154 -273 78 130 -130 56 -36 31 -42 -24 121 61 35 87 139
5628A39k21K54o5n9k74L18k8n98N33j2J56j21l0j00K73m94K94l5j4m7K37k56K03
$$ 139 -82 172 107 48 -226 92 64 -534 -1 -13 143 22 -8 -108 165 -329 -35 -70 -84 -131 106 -150 53
5651E3j81m3L20j89K18j75rj49J25k4Q2j66J48j02J21o6j49N5K24j14J37m1j15
$$ 53 -128 -171 149 -40 178 3 -6 -155 -30 -54 28 -138 10 -92 29 -37 -186 -131 93 -21 116 75 -40
5674d0m3J22%l0j39J45nk11M17j34j07K71l37N22m07k36M21k58K6o1l2r6N8j0
$$ -40 -83 39 39 9 -130 15 10 -201 216 82 -25 246 -91 431 24 -212 209 -49 -23 -84 -116 -212 -154 -164
5698a64p7J01N02l41K33m13j7L10p0mk5J28k39L7K20j19j87J13J31r0K26j74l28
$$ -164 -241 -140 362 21 254 -159 -176 134 64 60 35 163 -76 -39 181 62 -125 -12 119 29 255 81 -247
5721b47R8j89M09k9j85J86j0j50K69m30J23K65k89K14k06lP6J25N4J89k22j47
$$ -247 -149 -338 71 42 -143 43 33 -117 152 -278 -155 110 -179 35 -171 -174 -98 27 81 270 48 -99
5743i9Po7J47P2k01M29l60k0L20j77j1j65J33k49L28r6P2k15M50l23R0R0k90L6
$$ -99 -92 -159 -12 60 -141 288 -72 -92 228 51 40 -125 8 -241 87 -9 63 -152 298 -25 65 155 -135 -99
5767i9P8j63K88j43N6J64l40K10p0q6J97Pj65K30l18J89J32k39j6K40k83K0K65
$$ -99 -21 -184 104 -39 17 181 -159 51 -19 -105 92 99 -66 164 -154 35 167 -72 -88 152 -131 -111 154
5790A54J3m75K68P0%j76N4J41j59J50j79J46J54p5j21j05l9K52J26k75J9o7q2
$$ 154 167 -308 -40 30 30 -146 -92 49 -110 40 -139 7 161 86 -35 -140 -179 73 199 -76 -57 -124 -206
5813b06K56l9K8J26Kj39j53L54l67J11L40l79qK36j83r7J01j41K97J7l59j02K53
$$ -206 50 11 39 165 167 28 -125 229 -138 -27 313 -66 -74 162 -21 -118 -17 -158 139 156 -203 -305 -52
5836e2N82n62J65L0q3j88P3q7N2k11L45j53J50K75j73k45n5M34l14K28j31M9j3
$$ -52 530 -32 133 163 80 -108 -35 -122 -70 -281 64 -89 61 336 163 -82 -137 297 -17 211 80 129 116
5859A16j85J23J09k22K34P5r3j62Ml85M12k2j70rM38m87L12j06l80M39k5QP4L3
$$ 116 -69 54 163 -59 175 250 157 -5 -1 -386 26 4 -166 -175 263 -224 88 -18 -398 41 16 24 98 131
5883A31q9P2j97L17q2p4J29n02L79p6k64K19j29K27j10k8K65k07J45j23o4J07
$$ 131 42 114 -83 234 152 78 207 -295 84 8 -256 -37 -166 61 -49 -77 188 -19 126 3 -61 46
5905D6Q4j28J19J33l49M3N4n3K52j93J6M8k20J88j12L56l91k9L70l60P5l28M10
$$ 46 130 2 121 254 -95 -52 2 -51 201 8 24 72 -148 40 -72 284 -107 -136 234 -126 -51 -379 31
5928C1RJ32l13K45j58R2l3J8p9j24J11K06q8l8K52j29j24K24j15k66L64n57L49
$$ 31 40 172 -141 104 -54 38 5 23 -56 -180 -69 137 49 11 263 134 10 234 119 -147 217 -340 9
5951IR3k73k4j11J86Q4j51O5L90l07k37L99O8j37J2j27J09r1p6L3K54j69k47Q1
$$ 9 102 -171 -195 -306 -120 -36 -187 -122 268 -39 -276 123 191 54 66 -61 48 -43 -119 -86 168 -1 -248 -167
5975a67J62J55n27L85j78J79j02J55r3N8P7p8j13K21j56L74k65m9j16K08jj47
$$ -167 -5 150 -377 8 -170 9 -93 62 -31 27 104 26 -87 134 -22 352 87 38 -78 130 129 -18
5997a8m6J46N0l82K25j01K50k53k2J38q5K33l67J70j7Q5K5M3J18k10K99j77k40
$$ -18 -64 82 132 -250 -25 -126 124 -129 -151 -13 -98 135 -232 -62 -79 6 31 74 192 -18 281 104 -136
6020a36J6J63k32L64k51P2l03k9M28j52j19L02k50R4J82q3o4j91J80j56J71J9
$$ -136 -120 43 -189 175 -76 -4 -307 -336 92 -60 -179 123 -127 -33 149 66 2 -189 -9 -165 6 25
6042B5mJ13n6NK17o8l75J23j3J57k61J66j56L52j69Jj4j17O1p7K94j40j06R4j6
$$ 25 21 134 78 83 300 232 -143 -20 -33 124 -137 29 -127 225 56 57 43 -74 -13 -90 204 64 -42 52 36
6067C6K81m12K36k37n0K6p5K4n0L25r5j12k4J70j59L94k42j49P7J33q6l25L97
$$ 36 317 -95 141 -96 -146 -120 -195 -171 -221 104 9 -103 -127 43 -116 278 36 -113 -36 97 11 -314 83
6090H3j60J88k49K08l32K44j06K61p0nl07J37L9K73k65K98k05r5J29j24L6lJ99
$$ 83 -77 111 -138 70 -262 -18 -124 137 67 62 -245 -108 -69 204 -61 237 32 -63 66 -58 -22 -25 174
6113A74j86j18L49j31M9l39L67l12n6P1PQ2j80j19L10J21j30jr9J63j49R2l5L16
$$ 174 -12 -130 219 88 137 -202 165 -147 -203 -132 -125 -43 -223 -342 -32 89 -41 -42 -141 22 -127 -35 -70 246
6137B46j75L9o2j4q7J37k52j21J18J39J45k70R7K22k90J0O0j16L01l99K94j17
$$ 246 71 110 48 34 -53 84 -168 -289 -171 -32 113 -157 -60 162 -128 -118 -58 -174 127 -272 22 -95
6159i5q3K25j66K2j18J89Q1L8jk03K59k28J28m5j09n7J83K00m89J50K47j98K5
$$ -95 -178 47 -119 -97 -215 -26 55 93 92 -111 148 -80 48 3 -106 -163 20 220 -269 -119 128 -70 -45
6182d5J03nK38j00m39L82k5l47K66m5j89K54j87J49l37N17l58J20j30K03j53J14
$$ -45 58 53 291 191 -248 134 109 -238 28 -17 -206 48 -139 10 -327 190 -168 -48 -178 25 -128 -14
6204a4nm5K96P6j0k52r8J68k5m05K25J35%R3l20Q6q6J08K39j07l7n2J91j97K30
$$ -14 -19 -64 232 308 298 46 -52 116 91 -314 -89 46 46 139 -181 -95 -181 -73 166 59 22 -30 161 -36 194
6229A94j87O9j03K3j64J84P4j36N8mK18l5j77KQ6R0l07J29j50l4L4P7J5N5k2m3
$$ 194 7 76 -27 -4 -168 16 90 -46 12 8 226 191 14 16 102 192 -115 14 -136 -170 -136 -59 -44 11 -11 -54
6255e4P1N3l48K97J7p9L5r6K29r8K36k93J20j0K47k59k51M6k1J31Q9j22K33k77
$$ -54 17 70 -278 19 36 -43 -8 -104 125 27 263 -30 90 80 327 68 -183 -137 -158 -27 62 -60 173 -104
6279a04J7K39k53L64j76k7k27J74L09j53l41J05%K61n16M83k04Q1m5J3K63L7l03
$$ -104 -87 152 -101 263 87 60 -167 7 316 163 -178 -73 -73 188 -328 155 -49 32 -13 0 263 300 -3
6302cO9L3K5j75j41R7J92J07k75J42R7j4l37M9K01Qp3q4K06j42L52m66J26M9k03
$$ -3 66 99 124 -51 -192 -95 97 204 -71 71 168 154 -183 -134 67 75 2 -82 124 -18 334 -132 -6 43 -160
6327a60N50m75J99k81N71m59l8M6J67N7l1j75j99J22J37L1K8k29J63K72l97NK40
$$ -160 390 -85 114 -167 404 -55 -93 -47 120 177 146 -29 -228 -106 31 62 90 -139 24 296 -101 -96 144
6350A44r6J09l69K22K62l29O2k18M31j41j75Q4k75L28p2n8P5J6l86M84n0p9O7
$$ 144 48 157 -212 10 272 -57 5 -213 218 77 -98 -14 -289 39 -33 -91 -16 0 -386 98 48 -31 36
6373C6l1J02N8k1l51J20L24k08k82O25k41q1k62O1J86L7j35j45K19K6q3k4K98
$$ 36 5 107 165 144 -207 -87 237 29 -253 372 131 50 -212 -151 35 72 -63 -208 11 37 -46 -70 228
6396B28n22N24l18J73j41k4Jn4K74m7k84J06J19L5j9j88L14j4L0k88o9L25j29
$$ 228 -294 230 -88 85 -56 -80 -79 -133 141 94 -190 -84 35 70 51 -137 177 163 193 -95 -164 161 32
6419C2l8K96k32o4R0j02J31m65O58k91j48M56m22L4q8L2J6L49j67l6j07n4O1J5
$$ 32 -6 290 58 -6 84 -18 113 -352 306 15 -133 323 -99 -65 -153 -121 -105 244 77 41 -66 -120 -59 -44
6443d4l1J41l2k61J10J74k95M09l74K33n9kj57J87j6J00k06q1L00j33j49K45k
$$ -44 -75 66 34 -227 -117 57 -238 171 -203 30 -29 -31 -188 -1 -17 83 -123 -204 96 -37 -186 59 57
6466E7J25j23r4M0M7l36K91r8K02q5L28j94J04j99R2N0k88M4q0J09p3qK37k15
$$ 57 182 59 -35 5 52 -284 7 -91 111 26 354 160 264 65 157 207 -81 -37 -117 -8 -81 -89 148 -67
6490f7l2P2oj35J94k55K60j86K82l05K05o1q9L2K30P0J9j68J00j13p4OJ5R8r1
$$ -67 -99 -27 -33 -168 26 -229 31 -155 127 -178 27 -34 -123 -91 139 209 228 60 160 47 -27 -21 -6 92 1
6515AP8l0l1o6l1K87k99m0Q5j29J88J46j77J29j3k49J01k62L39j30J53O6k0l75
$$ 1 79 49 18 -48 -79 208 -91 -131 -46 -175 13 159 -18 111 98 -151 -50 -312 27 -103 50 116 96 -279
6539b79L54K4p3j51O0O2L8m99N90l2j87j16L01K2j26M2k06K85j42N0J05q4P3k59
$$ -279 75 99 26 -125 -65 -3 35 -464 126 94 -93 -209 92 114 -12 30 -176 109 -33 17 122 38 111 -148
6563a48L86l45K9m4j29L69m02L84j65L54l05p4R0j17M1q7O2R5R5k82M08l54L70
$$ -148 238 -107 -78 -122 -251 118 -284 100 -65 289 -16 -90 0 -117 -76 -163 -101 -6 89 -193 215 -139 231
6586B31k21j18M7o1K11k54L56k28K0L0J21k38M9K29l13J16P7Q5n7K06p0k65L05
$$ 231 10 -108 -61 -122 89 -165 191 -37 -17 13 134 -104 -55 174 -139 -23 54 139 82 288 218 -47 258
6609B58k86J53r7j95J3K59Q4j35k09j50L43Pj47K52l39K00j22L94O3l97j03L92
$$ 258 -28 125 28 -167 -154 105 189 54 -155 -305 38 45 -102 150 -189 11 -111 283 346 -51 -154 238
6631B38k74N1j12j57K12J7n6K78j27k67K98k9K35k43L0k70J63k16J81l3j85J7
$$ 238 -36 15 -97 -254 -42 -25 -81 197 70 -197 101 72 307 64 94 -176 -13 -229 -48 -81 -266 -249
6653b49Q5J13R2j88j11K09L26j53j48j11Qj0Q6J82j03j14Q9K34j27j37k02K14
$$ -249 -164 -51 41 -147 -258 -49 277 124 -24 -135 -127 -137 -51 131 28 -86 3 237 110 -27 -229 -15
6675a5j94J05J7J72m5k34K73k00J43j86J12k0K09q0J21J9k65RR6p1l27P04k63
$$ -15 -209 -104 -87 85 40 -194 79 -121 22 -164 -52 -72 137 57 178 197 -68 -59 37 -34 -361 343 80
6698H0l24K67p2m0L2M9R1Pk08j24J32J41J05m61K43k18L18Q9q7j84k43K25K66
$$ 80 -244 23 -49 -89 -57 -8 83 90 -118 -242 -110 31 136 -325 -82 -300 18 107 20 -164 -407 -182 84
6721H4j09K00J31j41l79L6L68j66j08J95j40j39K36K12m7o6j00R7m03M6J77%P9
$$ 84 -25 175 306 165 -214 -178 190 24 -84 111 -29 -168 68 280 233 167 67 164 -239 -193 -16 -16 63
6744F3N3L9j84P0o1L01l02J05l20K41K41m04K75K5L9MK19n77K67l8l57L57K8J0
$$ 63 116 155 -29 41 -20 281 -21 84 -236 5 246 -158 117 142 181 185 404 -173 94 56 -301 56 84 94
6768I4k24n3J94j56N9k7K22j51r7J38O7M9l9J70l39qL6q8J83k95K01K62l26m0
$$ 94 -130 -183 11 -145 -86 -113 109 -42 -139 -1 66 115 76 246 -93 -101 -65 -153 30 -265 -64 198 -128 -168
6792a68J87K42m50M7J55j09K08j42J80l33J62Q5J14j5J38j07k51Q7o8j54L59k39
$$ -168 19 261 -189 -142 13 -96 112 -30 150 -183 -21 64 178 163 301 194 -57 30 -38 -192 167 -72
6814g2l2m7K88j79L8o3M21l50k3n3m2N7j37n1N6J64l5K14l73K25k78L56j47q6
$$ -72 -104 -151 137 -42 -4 -67 354 4 -19 -72 -114 -57 -194 -245 -189 -25 -60 154 -219 6 -272 84 -63 -149
6838a49l0L12j6R5Km19K83q6k1K4p1O3k8L47m69L09k5k43Q4k67J52L74l10L6j6
$$ -149 -179 133 117 212 214 -205 78 -8 -29 -5 -76 -13 -41 306 -163 146 121 -122 -38 -305 -153 221 -89 -53 -69
6863f9K88j98m2J13j73N4j29J26R6k78J98k21J52j20l8L88j39N9J24o8k24L38
$$ -69 219 21 -21 92 -81 -27 -156 -30 66 -212 -14 -235 -83 -203 -241 147 8 67 191 123 -101 237
6885B37k74J36R9j47k21k0J24J81N6mj18J13Pj45m7J86l10L58N8m07K10J74k83
$$ 237 -37 99 198 51 -170 -190 -66 115 171 167 49 162 169 24 -23 163 -147 211 269 -138 72 246 -37
6908c7k41L95qK16n24l8O1K62j22j11O9N0j38k00N15j14k13m8J80J19M7o7K20
$$ -37 -278 117 109 325 -199 -237 -176 86 -36 -147 -78 -28 -166 -366 149 35 -178 -226 -46 73 120 53 273
6931B73j87k00J87j59Q1J44j95Q4j71L76o30K92K51K1j60l9k29K36k8k98L78O7
$$ 273 86 -114 73 -86 -5 139 -56 28 -143 233 -397 -105 146 167 7 -32 -261 -25 -53 -351 27 94
6953I4nj23J8j41K51l1k41Q4r6L29L15m00k07j0M06n66Q5N08n26K26m2R9m0j52
$$ 94 89 -34 -16 -157 94 63 -178 -94 -190 139 454 54 -153 -163 243 -323 -238 270 -256 -30 -72 27 -13 -165
6977a65j6K55k36P7L9P1J98k12R7J64r2j40JK22k17K54k51P1QN4j28j9J46l29
$$ -165 -181 74 -162 -85 -46 25 223 11 108 272 180 40 41 263 46 300 49 120 128 182 54 35 181 -148
7001a48L21l00K15j83R7r0N9J32J84k59j02J03j0j55%K05L0j38J85j70K05M3k27
$$ -148 173 -127 88 -95 2 -88 -29 103 287 28 -74 29 19 -136 -136 69 99 -39 146 -24 181 224 -3
7024cJ32m5j79K55j20JJ4l17J17K57j52m6P2j04J02N3j73L34o4l00K16L9l32K54
$$ -3 129 84 -95 160 40 41 55 -262 -145 112 -40 -86 -14 -118 -16 37 -136 198 134 -166 50 89 -243 11
7048A1Nj4M1q0J33r0K30o1j97K33l05N3P3j76J02j58M54l95L10k65K46Q2k88j9
$$ 11 16 2 43 -37 96 6 236 175 -22 211 -94 -41 32 -144 -42 -200 254 -141 169 -96 150 232 -56 -75
7072g5K66j74j15p9K22n1j67N3J73l6m53M88O4k33J53J12J71j12j3r0r6J71m68
$$ -75 191 17 -98 -177 45 -6 -173 -120 53 17 -436 52 116 -117 36 148 319 207 194 104 8 179 -289
7095b89K83oq0J22l4j38M61k07k39L79l35K4J49m21J76J78J99j91q6j75L83p4
$$ -289 -6 -12 -92 30 -4 -142 319 112 -127 252 -83 -59 90 -331 -155 23 222 31 -55 -230 153 79
7117G9j30j28L52k05L17n0k53L8l1J31q8O8r0P2J46l50L15j83L9n6M4J41l41P4
$$ 79 -51 -179 173 -32 285 235 -18 20 -11 120 32 100 10 82 228 -122 193 10 49 -7 37 178 -163 -89
7141h9Mj90K00J14j26J86j03n6j71K22R6r9j00Q7j15L5k24R3M06k89k5L99K4n29
$$ -89 -85 -275 -75 39 -87 99 -4 -60 -231 -9 87 -12 -112 -25 -140 -105 -329 -236 170 -119 -144 255 279 -250
7165b50L04Q8q4j75k9K13n8j41K46r0K36l75M56m54n5L47N4L8l37j52M32m59J92
$$ -250 54 142 58 -117 -146 67 9 -132 114 24 260 -115 341 -113 -168 179 233 271 -66 -218 214 -245 -53
7188e3J02j00K90j54J64r5j43J20j95J68R5k30J28k66J89n5J1K1k77K50P7j44
$$ -53 49 -51 239 85 249 154 11 131 -64 104 199 -31 97 -169 20 -35 -24 -3 -280 -30 47 -97
7210i7J71l74L63K87l79J6r1J59Ql09L33N2j25KL4j75K13k09K41n6r4q0K60l94
$$ -97 74 -300 63 350 -29 -13 -104 55 63 -246 87 139 14 16 50 -125 88 -121 120 64 -30 -110 150 -244
7234b44J66P4k0ol3J19r8k67L86k78R5p9J13J63q7j12k3J72Lj61J60K71q1j82
$$ -244 -78 -4 -24 -30 -63 56 -42 -309 77 -201 -106 -185 -72 91 4 -108 -131 41 44 -117 43 314 233 51
7258E1l88N62l03j61P8K14m6Q2j06J8J26k81L05p7j97K53p7o6K13k70L1K09l64
$$ 51 -337 225 -78 -239 -161 53 7 89 -17 1 127 -154 151 74 -123 130 53 -13 200 -70 -39 170 -194
7281a94L67l66O9J32Qp8K00j61j90L27J36j77k43J18K53k60M06k99l62k1N43n
$$ -194 173 -193 -124 8 16 -62 138 -23 -213 114 250 73 -170 -52 201 -59 347 48 -314 -335 208 203
7303B03j81K8j98L2J19m0k0J07M6j61Mn4J68J3O5j75J97J53k09k45J91n9P1r8
$$ 203 22 50 -148 -116 3 -37 -57 50 96 -65 -61 -115 53 66 131 -44 153 306 97 -148 43 -16 55 -43
7327d3j59K88p6K6j42J30k6J61j11m8j92J4J24M4J42k37L4j03L05j52j06K07j63
$$ -43 -202 86 10 36 -106 24 -2 159 48 0 -192 -178 -54 -10 132 -105 -71 -174 131 -21 -127 80 -83
7350h3J68n8k66L52j82mK44l70L06Ok29J13P8pr7j83L95k91J38o6K23k84J99r8
$$ -83 85 27 -239 113 -69 -73 171 -199 107 113 -116 -3 75 68 -29 -212 183 -108 30 -36 187 -97 102 4
7374DJ69k54J62r0r5j96L13O2j29n0J39l2n3j5r3j83L00PJ49j16P8R7k04o1J98
$$ 4 173 -81 81 -9 -104 -300 13 75 -54 -104 35 3 -50 -65 -158 -341 -41 -34 115 -1 77 174 -30 -91 107
7399A07qj06k33J02p3j88L47K73j82k63J34J4k44M57k67r6K52k31MM05J15o8j61
$$ 107 99 -7 -240 -138 -211 -399 -52 221 39 -224 -90 -76 -320 137 -130 -226 26 -205 -201 204 319 251 90
7422I0K42k73L2K06j95l79J26K29k92J36J33R2r9Q8J12k45o5o7K93j57j7N4j01
$$ 90 332 59 91 297 102 -277 -151 78 -214 -78 55 147 48 136 248 3 -62 -129 164 7 -10 44 -57
7445e7r2J7L30q6j30J59J21k25l9K9j09L45m46L33l8l37K69J92k57L15k17q9K15
$$ -57 -149 -132 198 112 -18 141 262 37 -2 27 -82 263 -183 150 112 -225 44 236 -21 294 77 -12 203
7468B03k44k2n8J85l20L91j24j84J83K28j54j2j99J59j06K61j55r3N1RQ6j11k4
$$ 203 -41 -63 -121 64 -256 135 11 -173 10 238 84 72 -127 32 -74 187 32 -61 -10 -1 85 -26 -50
7491e0L6l4N8N1N3p1J2p0J63l94N12k25k1j45o1kK51J13k03J29k74J87P2l41R2
$$ -50 -14 -48 10 61 114 43 55 -15 148 -246 266 41 20 -125 -186 -188 63 176 -27 102 -172 15 87 -254 -162
7516a62K33J10j55r2J7J50K46l87K10k6k32J53J30J77m58J52J21j98n6L6l42K45
$$ -162 71 181 26 -66 -49 101 347 -40 170 144 -88 65 195 372 -86 66 187 -11 -67 -31 -373 -128
7538a28J10K30j01k94K15N1j98J40j67K91m60L64M3L2l27K78Q9k08m63N15j90
$$ -128 -18 212 111 -183 32 83 -115 25 -142 149 -311 53 96 128 -199 79 168 -40 -503 12 -178
7559a78L0J97Ln9j4R0l27K83k4K2J23l51J29J6n3O6J47K7J1k25L02m19l1J24K1
$$ -178 -148 49 52 -7 -21 69 -258 25 1 23 146 -205 -76 -60 -113 -47 100 127 138 -87 215 -204 -235 -111 -90
7584i0L5J43k25J23L5M7k12N4J85q2q7q4O9L51j6l41K91k55n0K28k17l1K06k59
$$ -90 -55 88 -137 -14 21 68 -144 -90 95 13 -74 -158 -89 262 246 -95 196 -59 -109 119 -98 -129 77 -182
7608a82oO3K82j58Pj42j22N2K13l01J90J18j67K10l97L94J3Kj41P9K38l49J37
$$ -182 -188 -125 157 -1 6 -136 -258 -206 7 -294 -104 14 -153 57 -340 54 67 69 -72 7 245 -104 33
7631C3M0k34O2Q5Pl44L65K14j7k80p5NL12jl42J66k67M07k44K15o5J41k8j02M6
$$ 33 73 -161 -99 -14 -7 -351 14 228 211 -69 -144 -139 173 172 -170 -4 -271 136 -108 107 42 183 155 53 99
7656I9R4n5k57L6K8J59k22J86K4l55K55m8O3r3j03K86q9M85n08Q1J06k79l4M7
$$ 99 193 138 -119 -83 -55 104 -118 68 92 -263 -8 -56 7 -86 -189 97 8 493 -15 66 172 -107 -141 -94
7680i4J59j18J83m35L08J81j58O7l87M95M2l99K1N9NK30J62k95O1m9j44qR9k05
$$ -94 65 -53 130 -305 3 184 26 93 -294 201 243 -156 -135 -76 -71 159 321 26 87 38 -106 -114 -15 -220
7704b20m5J89J69k81J52l4q7K29j80K28j46o3L16k08j32J42j02K89j79K09m2L9
$$ -220 -265 -76 93 -188 -36 -70 -157 72 -108 120 -26 -89 227 19 -113 29 -73 216 37 246 204 243
7726B43m56J18P1M7M2j08K46j97k9K23k09J54l98R0K16K26l72o5J05O8J41o5n5
$$ 243 -213 -95 -24 23 65 -43 203 6 -23 200 -9 145 -253 -163 53 279 -93 -158 -53 15 156 91 36
7749C6J29K64m69l0l1P9K32k67q2O4M3n1k3j11J20%L0N8J22k10l3p8K35R4j80
$$ 36 165 429 -40 -70 -101 -22 210 -57 -139 -75 -32 -83 -106 -217 -97 -97 -67 -9 113 -97 -130 -208 27 121 -59
7774e9O1J79n4J08m72L13mR8k5j44K52l71J4O0q1p8J66j01OQ8J11n2J92k33J20
$$ -59 2 181 127 235 -237 76 72 170 145 1 253 -118 -104 -44 -125 -203 -37 -138 -132 -44 67 15 207 -26 94
7799I4j33K71j67j83J02K68m98P5J93k02K50L5k0j88J32q0Q0N1k01J15j54K54
$$ 94 -39 232 65 -118 -16 252 -246 -171 22 -180 70 105 85 -103 29 -51 29 80 -121 -6 -160 94
7821I4K5l01K92k74P9O1M7o5P7J23k04j8M6N3j54k86M22l6l6L56m39NR3l28M92
$$ 94 119 -182 110 -164 -85 -24 23 -42 35 158 -46 -64 -18 35 -119 -405 17 -19 -55 301 -138 -133 -40 -368 124
7846A24K46k90p4k66J65K55k68O8K21l9j57J30l26Q2o4J12R2N4J49l92K08K1j28
$$ 124 370 80 6 -260 -95 160 -108 -40 181 142 -15 115 -211 -129 -193 -81 11 65 214 -178 30 51 -77
7869g7JN1J74k99K22j53k3L12r9o9j99R6O7k2k64M54k42Nj26K80m7p1K02q1mj34
$$ -77 -76 -25 149 -150 72 -81 -104 208 109 40 -159 -63 4 -18 -282 172 -70 -65 -191 89 42 -29 173 92 88 -46
7895d6J77p1p6J0K9K14N7k16j1j88K35R6l62L9K7k5O0KK14p2K93o69K82Q7n9j9
$$ -46 131 60 -16 -6 23 237 294 78 67 -121 114 210 -152 -113 -86 -111 -51 -49 165 93 386 -283 -1 86 27 8
7921HL5j39O3j03n9K31L2k0j94Q3J06p9K98k0l43J11K42j82k18P2O4l43L89q5
$$ 8 43 -96 -33 -136 -195 36 68 48 -146 -63 43 -36 262 242 -101 10 252 70 -148 -76 -12 -355 34 -51
7945e1L6J63p0j32J21rj27J99j58J99j22j70j97L35Q2k79K28l8P2l18K79j97K1
$$ -51 -15 148 78 -54 67 58 -69 130 -28 171 49 -121 -318 17 99 -180 48 10 82 -236 43 -154 -133
7968a33j17K80r6o4Q1J47j94J9J16j56J82j27L36k31l64M33p3N6l25J0K24l9k0
$$ -133 -250 30 -66 -130 -49 98 -96 -77 39 -117 65 -62 274 43 -321 112 39 95 -230 -220 4 -35 -55
7991e5K4o6L67m62K10k44K72J55k05j17J2J08k3j75K28J87m90M00o6k24Q4K06
$$ -55 -31 -97 270 -192 18 -226 46 201 -4 -121 -109 -1 -24 -199 29 216 -274 126 60 -164 -80 126
8013A26OK0j62P3l68K06o2K22j86kLm1K51L1o5J03o0J91m69J63J80k51k0J48n2
$$ 126 132 152 -10 63 -305 -99 -161 61 -125 -127 -124 -165 86 117 52 155 95 286 -183 -20 160 -91 -111 37 -15
8038a5J10J43k03j28J32j80K77l16J16J33j96J34N3K7k16K44k45J22j25j72K30
$$ -15 95 238 35 -93 39 -141 136 -180 -64 69 -127 7 60 87 -129 115 -130 -8 -133 -305 -75
8059g5J74j51L27l60r1J54M3Nl06L00Jk08K48K25m96K13J08j3j00K26k27j3J9
$$ -75 99 -52 275 -85 -176 -22 21 26 -280 20 21 -187 61 286 -210 3 111 98 -2 224 -3 -16 3
8082CO0k8q2L00l34J87J62l47L01j47Q3l26R0j29J30j76J84j35K84j14J57k35
$$ 3 63 35 -47 253 -81 106 268 -79 222 75 158 -168 -78 -207 -77 -253 -69 -204 80 -34 123 -112
8104a12J67Nk49L97m43J06K13j02J59j55kN2J93o06K71K70M1m82K06n0K71K09
$$ -112 55 60 -189 208 -235 -129 84 -18 141 -14 -16 36 229 -377 -106 164 205 -277 -71 -121 150 359
8126C59k57k0j2k42L63j73n7o3n2J04J03j05Q8l08K71OJ90k40L01k19m3O8j21
$$ 359 102 82 70 -172 191 18 -39 -102 -154 -50 53 -52 36 -272 -1 5 195 -45 256 37 -6 62 -59
8149e9J69m24L55q1Ll8j4j41K25J64j99R1K0Jj43J91l11K86l1L5Q1P2k30o4J62
$$ -59 110 -314 41 -40 -37 -75 -89 -230 -5 159 -40 51 71 72 -71 120 -191 95 64 99 180 252 22 -42 120
8174A20j11K4j85R2P9M8k83M1L5K48k17L21k74LO6j0J34
$$ 120 9 33 -152 -60 19 67 -216 -175 -140 108 -109 212 -62 -59 7 -3 131
8191A31
$$ Imaginary data points
##PAGE= N=2
##DATA TABLE= (X++(I..I)), XYDATA
0@%%%%%%%%%%%%qJ6j6J6k4L2l2M0n6O4p2Q8j04J20j40J64j91K19k49K85l24L65
$$ 0 0 0 0 0 0 0 0 0 0 0 0 0 -8 8 -8 8 -16 16 -16 24 -32 32 -40 48 -56 64 -76 88 -103 116 -133 152 -172 193
34A93m13M67n24N86o57P35q16R06j007J117j234J363j505J659j830K017k220K444
$$ 193 -220 247 -277 309 -348 387 -429 477 -530 587 -647 716 -789 870 -960 1057 -1163 1281
52A281k695K973l284L634m028M481n005N620o353P244q357R788j1713J4449j8670
$$ 1281 -1414 1559 -1725 1909 -2119 2362 -2643 2977 -3376 3868 -4489 5299 -6414 8035 -10635
67a0635K6101m2992J53244K6933j95197Q6546k4401L5255O8585k1583m0544J0093
$$ -10635 15466 -27526 125718 152651 -42546 44000 19599 54854 123439 101856 61312 71405
79G1405m5289j03J8457j296L6347L322o2965J0843j9362j2752N5175J2666n0297
$$ 71405 26116 26013 44470 43174 79521 82843 19878 30721 11359 -1393 53782 66448 16151
92A6151j9819K1323o92r588P988j8109J4113J2160k7141j3885P487K0075O444
$$ 16151 -3668 17655 16963 7375 15363 -2746 11367 23527 -3614 -17499 -10012 10063 16507
105A6507k1505j2943J2605l927o513L5208k2317l2795L7945q363j8926K0088j1759
$$ 16507 -4998 -17941 -5336 -9263 -15776 19432 -2885 -35680 2265 -6098 -25024 -4936 -16695
118a6695j858K2963j0558k5374O83J0230J7591m626k8684J9324N530k5788J7568
$$ -16695 -18553 4410 -6148 -31522 -30839 -20609 -3018 -7644 -36328 -17004 -11474 -37262 -19694
131a9694J293j6389J3524R154j3798n392O021p957R671J3604j1400n624O81J1092
$$ -19694 -18401 -34790 -21266 -12112 -25910 -31302 -25281 -33238 -23567 -9963 -21363 -26987 -26306 -15214
145a5214L399j5506L898J5362R09n658N127r844m631K8269p710j2345J8269n466
$$ -15214 -11815 -27321 -23423 -8061 -7152 -12810 -7683 -17527 -22158 6111 -1599 -13944 4325 -1141
159a141o073J1159J678j0013J016J3607N282q896j4876J2062J1955j1983Q047
$$ -1141 -7214 3945 5623 -4390 -3374 10233 15515 6619 -8257 3805 15760 3777 11824
172A1824m662j1825J8593L422j7549k293J4808n0n025L790q890l28N573M791p9
$$ 11824 7162 -4663 13930 17352 -197 -2490 12318 12268 7243 11033 2143 1815 7388 12179 12100
187A2100j5599N497J1911n186m420k109j555M109J4021j3584j5932J9322K296
$$ 12100 -3499 1998 13909 8723 4303 2194 639 4748 18769 5185 -10747 8575 10871
200A0871o443R7o473K996M593K358o596p552L586O978K98j2340M472J776p584
$$ 10871 4428 4525 -1948 1048 5641 7999 1403 -6149 -2563 4415 4713 -7627 -3155 -1379 -8963
215h963J4329o066j7859R645J2659n454j0991J668K049K430K809p368r83J93P333
$$ -8963 5366 -700 -18559 -8914 3745 -1709 -12700 -11032 -8983 -6553 -3744 -11112 -12095 -11902 -4569
230d569K071j3927K925Q777k970Q29L012n934m555J4088o28r432N103N47L464
$$ -4569 -2498 -16425 -13500 -4723 -7693 -6864 -3852 -9786 -14341 -253 -881 -10313 -5210 -4663 -1199
245a199J933n019j458J424Q118J998p614k470Q318K406q839P187J539q285R904
$$ -1199 734 -4285 -5743 -4319 3799 5797 -1817 -4287 4031 6437 -2402 4785 6324 -1961 7943
260G943J724p978m32M503J064r90L045l245j984K524L032M55r599O196Q770q416
$$ 7943 9667 1689 1257 5760 6824 5834 8879 5634 3650 6174 9206 9661 62 6258 15028 6612
276F612q60L426l689l50O951j733o732N693r67j828K630l831O73O89K852J654
$$ 6612 5752 9178 5489 5139 12090 10357 3625 9318 8351 6523 9153 5322 5995 6684 9536 11190
292A1190p760j504N054K165n401J642N77n452P678j389j0367L725M111j77k630
$$ 11190 3430 1926 6980 9145 3744 5386 5963 511 8189 6800 -3567 158 4269 4092 1462
307A462o31k360j710M414l93k830m546M387O746r729k295K631k014M103K487n920
$$ 1462 831 -1529 -3239 1175 782 -2048 -6594 -2207 4539 -5190 -7485 -4854 -6868 -2765 -278 -6198
323f198n405P536K412o390m0m46L995J743l120p17m417L032O417l114m550K204
$$ -6198 -11603 -4067 -1655 -8045 -8085 -8531 -4536 -2793 -5913 -6630 -11047 -8015 -1598 -4712 -9262 -7058
339g058M071l084J493j631n374Q541M089n020k593L51L516K86k73j521k19L687
$$ -7058 -2987 -6071 -4578 -6209 -11583 -3042 1047 -3973 -6566 -6215 -2699 -2413 -2686 -4207 -4426 -739
355g39J833j48p816K289Q036l619K30J277l340J706M066j273n956M732L736o47
$$ -739 1094 946 -6870 -4581 3455 -164 66 1343 -1997 -291 3775 2502 -3454 1278 5014 4367
371D367j321l652K695P93N98K740m554o14M843k9m436J30L247k166L988j93n682
$$ 4367 3046 -606 2089 2882 3480 6220 1666 1052 5895 5866 1430 1560 4807 2641 6629 6436 754
388G54K204J520J05r95j083J411k04N35j016j413j749K082M283n153j60K310l446
$$ 754 2958 4478 4583 3588 2505 3916 3712 4247 3231 1818 69 2151 6434 1281 1121 3431 -15
405a5J399J724k502j725K924J353l670j51r22R45M91p18J340l583l97M229k207
$$ -15 1384 3108 606 -1119 1805 3158 -512 -663 -1585 -640 -149 -867 473 -3110 -3507 722 -1485
422a485k869J735J362j690J526m7m692K185K207r51k39j890J942Q16j101m26j397
$$ -1485 -4354 -2619 -1257 -2947 -1421 -1468 -6160 -3975 -1768 -2719 -2958 -4848 -2906 -2090 -3191 -3617 -5014
439e014R89K078J869l803j136L616j541J391R88l408J155L145N75l816l90K223
$$ -5014 -4025 -1947 -78 -3881 -5017 -1401 -2942 -1551 -563 -3971 -2816 329 904 -2912 -3302 -1079
455a079J609R25k401J6m2J211L179m004j711M330Q28j664q83L16j035L198J486
$$ -1079 530 1455 -946 -930 -972 239 3418 -586 -2297 2033 2861 1197 314 630 -405 2793 4279
472D279m028pJ469J974o77k495J065O37J618O31k411j950J699L793k510j785J147
$$ 4279 251 244 1713 3687 3010 515 1580 2217 3835 4466 2055 105 1804 5597 3087 1302 2449
489B449n55J797n9k051j136K004K394k338j059k57N04J286q22k1k441O52L377
$$ 2449 1894 3691 3632 1581 445 2449 4843 2505 1446 1189 1693 2979 2157 2136 -305 347 3724
506C724k234k820J085J448n93J37l97k799K000J464j860m49j109K176J83k095
$$ 3724 1490 -1330 -245 1203 610 747 350 -2449 -449 1015 -845 -1294 -2403 -227 -44 -2139
522b139Q18j271r0J631J94k061n68K474j500Q7p2q41R92N88Q32j934n88J737l53
$$ -2139 -1321 -2592 -2682 -1051 -857 -2918 -3486 -1012 -2512 -2425 -2497 -3338 -2346 -1758 -926 -2860 -3448 -1711 -2064
541b064M37o52J62j34L9J391j645o96K037j6r5k3L5j258J246K039k141j7P11P47
$$ -2064 -1627 -2279 -2117 -2251 -2212 -821 -2466 -3162 -1125 -1141 -1236 -1259 -1224 -2482 -1236 803 -1338 -1355 -644 103
561A03K04j499Q13J29J43J657o55j454r9K445q80m87J400j360J333O42j008n03
$$ 103 307 -1192 -379 -250 -107 1550 895 -559 -658 1787 907 420 1820 460 1793 2435 1427 924
579I24j76J802N29j179o07M20O34O8O45j857l80K807m21j201l67l40J025L73K36
$$ 924 748 2550 3079 1900 1293 1713 2347 2415 3060 1203 823 3630 3209 2008 1641 1301 2326 2699 2935
598B935k130nJ817l05r20j481J081J252r46L72j477o57J601L92j453j294K026
$$ 2935 805 800 2617 2312 1392 -89 992 2244 1298 1670 193 -464 1137 1529 76 -1218 808
615H08k29k01k65k061R98Q54R38j433j387Q89O91m81r10L84j1M09J153j787j537
$$ 808 579 378 113 -1948 -950 -96 842 -591 -1978 -1089 -398 -879 -1789 -1405 -1416 -1007 146 -1641 -3178
634c178J680L26J52n16m05J62K77K85r20k89Q44Q26K7j689P38n4j1J083p48p84
$$ -3178 -1498 -1172 -1020 -1536 -1941 -1779 -1502 -1217 -2137 -2426 -1582 -756 -729 -2418 -1680 -1734 -1745 -662 -1410 -2194
654b194R08J175q89j144J085j54P31M67o69l20k30J384J10j030L83O87j9k53P11
$$ -2194 -1286 -111 -1000 -2144 -1059 -1213 -482 -15 -684 -1004 -1234 150 260 -770 -387 300 281 28 739
673G39p33n86J613j91m04J40j3M17k35K04j36j78Q13k12Q4o31K49M46l87O18m22
$$ 739 6 -580 1033 842 438 578 565 982 747 951 815 637 1450 1238 1322 691 940 1386 999 1617 1195
694A195q41P56M53n65n87R45k86o2O64j195J13J82L94K99j270M35N06p10K64j1
$$ 1195 354 1110 1563 998 411 1356 1070 1008 1672 477 590 772 1166 1465 195 630 1136 426 690 679
714F79p79j26J462m79j297K08J55L46N7o86Q1RP00l61r72Q2K66P57o06k25j21
$$ 679 -100 -226 1236 757 -540 -332 -177 169 226 -460 -379 -370 330 -31 -1003 -921 -655 102 -504 -729 -850
735h50l97J165p99n06k0Q96J86n94l4k90L12R52l73o66l48Q44O39r34j93O0N63
$$ -850 -1247 -82 -881 -1387 -1407 -511 -325 -919 -953 -1243 -931 21 -352 -1018 -1366 -522 117 -817 -1010 -950 -387
756c87L77Jq71k33J456O2p03k17J4P91j72j86k9m81Q46N97l52r40O20O35l78R2
$$ -387 -10 -9 -880 -1113 343 405 -298 -515 -501 290 118 -68 -97 -578 268 865 513 -427 193 828 450 542
778E42j92k91O59M15l92o03N72j80L17n3k88j4L79J80N5r78O35O20n30J36k57
$$ 542 350 59 718 1133 741 138 710 530 847 794 506 492 871 1051 1106 128 763 1383 853 989 732
799G32J47j08L50k16p36O38k56l23J17k6L27m29K09K91o12m72N24K4k21J43q2
$$ 732 879 771 1121 905 169 807 551 228 345 319 646 217 426 717 105 -367 157 181 -40 103 21
820B1q60P40Q2m02J6k30O48k96k46j03l92L13P9J46o11o5J023o24m08L91j60M41
$$ 21 -839 -99 -17 -419 -403 -633 15 -281 -527 -630 -1022 -709 -630 -484 -1095 -1160 -137 -761 -1169 -778 -938 -497
842d97O7j86q00M81M49k89J50k79K66P6J67j7r19M31L64L02k72r2M24p89P22J7
$$ -497 -430 -616 -1416 -935 -486 -775 -625 -904 -638 -562 -395 -412 -1331 -900 -536 -234 -506 -598 -174 -963 -241 -224
864b24q30O57K95R9n82%N15O2K23j98j84K48K31J61n29k02O16K99K20n52oj80
$$ -224 -1054 -397 -102 -3 -585 -585 -70 -8 215 17 -167 81 312 473 -56 -258 358 657 877 325 319 139
886A39N42J38o10L42R6m1J59m64J86j61P92O5p39q6L96P4l71k41K78j98N90p0
$$ 139 681 819 209 551 647 606 765 301 487 326 1118 1183 444 358 754 828 457 216 494 296 886 816
908H16q07K79PM43k20k89K48j67L64m52j30r9pP04p06j64o9Q4K77k34kJ28j00
$$ 816 9 288 295 738 518 229 477 310 674 222 92 -7 -14 690 -16 -180 -249 -165 112 -122 -124 4 -96
931i6r0j28OK3M9K10k55l8l26L82J94m40O3J69K80k66K53l65j18M52k65j22o6
$$ -96 -186 -314 -308 -285 -236 -26 -281 -319 -645 -263 -69 -509 -446 -277 3 -263 -10 -375 -493 -41 -306 -428 -494
954d94r0J63J57k20K06n1L0O0K29n1o80O13q4O89n57j2Lj5M02l80J05l1R5L09
$$ -494 -584 -421 -264 -484 -278 -329 -299 -239 -10 -61 -741 -128 -212 477 -80 -92 -89 -104 298 -82 23 -8 87 396
978C96m58J45k44N37J05j35k01q6K60N3l6K7o12O50O92j046K09Rj40K65j75J74
$$ 396 -62 83 -161 376 481 346 145 59 319 372 336 363 -249 401 1093 47 256 265 125 390 215 389
1000C89j42l3L88j38k88j1L91k80k84M7K11j33N5j72N39l51J8J27j68o12L80K27
$$ 389 247 214 602 464 176 165 556 276 -8 39 250 117 172 0 539 188 206 333 165 -447 -67 160
1022A60q2J55n09K35J18k80jJ11O7j41L01j93m72J34K32o4j64q8L49L8p3m2K63
$$ 160 78 233 -276 -41 77 -203 -204 -93 -26 -167 134 -59 -531 -397 -165 -229 -393 -481 -132 -94 -167 -209 54
1045E4j76k97L87k43l14K63P3k30N0q9L20j60n0k7k81N10J23l6k57J4L19k34M30
$$ 54 -122 -419 -32 -275 -589 -326 -253 -483 -433 -522 -202 -362 -412 -439 -720 -210 -87 -123 -380 -366 -47 -281 149
1068A49l65q3N37j98j63j27K09J79j78Q9j2J04m9K33j40j37R2n1l8K43J02k52
$$ 149 -216 -299 238 40 -123 -250 -41 138 -40 49 37 141 92 325 185 48 140 89 51 294 396 144
1090A44N0k6P4Jjj5N0j20L02l54M0J90q9J26j07O5P1l18K80m75J28K83J7J36l54
$$ 144 194 168 242 243 242 227 277 157 459 105 145 335 246 372 265 330 401 83 363 -112 16 299 316 452 98
1115I8J04J78j85M8j8L06l62k5K12m37K03j25O1M1j26r1J30L48l87P4r6K01j9
$$ 98 202 380 195 243 225 531 169 144 356 -81 122 -3 58 99 -27 -118 12 360 -27 47 -49 152 133
1138A33j58Ql61N02k26n4j03J59LN7r8j23K48m62K85O2j87J4J85j9M3l5j03q3
$$ 133 -25 -17 -378 124 -102 -156 -259 -100 -97 -40 -138 -261 -13 -475 -190 -128 -315 -301 -116 -135 -92 -127 -230 -313
1162c13J87J57k78m7K34M6r1j43j0K12J40k09K03o8p7J30Ll8j42P2J72p3l39L30
$$ -313 -126 31 -247 -294 -60 -14 -105 -248 -258 -46 94 -115 88 20 -57 73 76 38 -104 -32 140 67 -272 58
1186E8L36m44M30l20J9K27N1l24k04L34J35q5jk08rL51j10J9r2oj10N1L72n39
$$ 58 394 -50 380 60 79 306 357 33 -171 163 298 213 212 4 -5 346 236 255 163 157 47 98 470 -69
1210f9K69K3k67K08r8JM2o9m3j58M95j73R7m9k71K33j44l5m0o9j06L9J9K54j09
$$ -69 200 223 -44 164 66 67 109 40 -3 -161 334 161 258 209 -62 171 27 -8 -48 -117 -223 -184 -165 89 -20
1235b0p7J38j34J27j44j64J11Q1J23j38K29l36J48n7Q2m51K84J10m04K33K61l70
$$ -20 -97 41 -93 34 -110 -274 -163 -82 41 -97 132 -204 -56 -113 -31 -482 -198 -88 -492 -259 2 -368
1257c68L81n2j78p4q7L60m23L06L1r0N6J32r6p9j81M33m0M6l91M36j7%O9l99K05
$$ -368 13 -39 -217 -291 -378 -18 -441 -135 -104 -194 -138 -6 -102 -181 -362 71 31 77 -314 122 105 105 174 -225 -20
1282b0J91K10m03J0K87j15J46j47k68J96K1R6l24J58R2j36K60k02p5K03r6lm0
$$ -20 171 381 -22 -12 275 160 306 159 -109 87 108 204 -120 38 130 -6 254 52 -23 180 84 81 41
1305D1J91l5M9Q2j40r1J14J28j88j1j65K28L1m9ol6o2O6j2r7Q5K9q5j64K69j13
$$ 41 232 197 246 328 188 97 211 339 151 140 -25 203 234 185 179 143 81 147 135 38 123 152 67 -97 172 59
1331E9j77j66L24k0L7k71J34j59K52j49N7L5k20M57m62J93k9L02n51L19R1K49
$$ 59 -118 -284 40 20 57 -214 -80 -239 13 -136 -79 -44 -264 193 -269 -76 -105 197 -354 -35 56 305
1353C05m99J71j21j15N8J16r8O0J68r4J60j22k87K03K7j23J20m5Q3q0N4%l7N19
$$ 305 -194 -23 -144 -259 -201 -85 -183 -123 45 -49 111 -11 -298 -95 -68 -191 -71 -116 -33 -113 -59 -59 -96 423
1377D23m87K36o9k23K20l56N80m27Q4JJ41k42L33k14J2n3l3l6K49q7k9m2j7K25
$$ 423 -64 172 103 -120 100 -256 324 -103 -19 -18 123 -119 214 0 12 -41 -74 -110 139 52 23 -19 -36 189
1401A89j87J46r3p7k01K95K33k09n8o5J47O3j49J37j16N1J07j64r3j25J6K27L62
$$ 189 2 148 55 -22 -223 72 305 96 38 -27 120 183 34 171 55 106 213 49 -44 -169 -153 74 436
1424D36l60J53k44J65l15J90qj55O9K04Qn20N09j03k00J22J82k05J69j65j43R
$$ 436 76 229 -15 150 -165 25 17 -138 -69 135 143 -377 132 29 -171 -49 133 -72 97 -68 -211 -202
1446b02L07r2j38O9L6k02K34j65K9J56K3p6P6r9k34K55k06Q8K10k1N1k47L14j75
$$ -202 105 13 -125 -56 -20 -222 12 -153 -124 32 55 -21 55 -44 -278 -23 -229 -141 69 48 99 -148 166 -9
1470iK0J54j67j80K29k15k31P24j62q1l4J68l58J83j20n8K56o1k22K04Q8j9j44
$$ -9 11 165 -2 -182 47 -168 -399 325 163 82 48 216 -142 41 -79 -137 119 58 -164 40 128 109 -35
1493c5n8j9L05r5m5qJ5J28l47L53O5m12L07J22l12K96l80J84J48j75k60K49pJ06
$$ -35 -93 -112 193 98 53 45 60 188 -159 194 259 -153 154 276 -36 260 -120 64 212 37 -223 26 19 125
1517A25k5L6N7j86J86l43L26l40J02J67k6J25j72Q2j69K16J78m04K2O6k9K33k70
$$ 125 100 136 193 7 193 -150 176 -164 -62 105 79 204 32 114 -55 161 339 -65 -43 23 -6 227 -43
1540d3K1q8J37J4l03J08o1qL62k94J05l2J17Oj62J17l0J91j5l19Q3O6j9k33n2
$$ -43 -22 -110 27 41 -262 -154 -215 -223 139 -155 -50 -82 35 41 -121 -4 -34 157 142 -177 -94 -28 -47 -280 -332
1565c32L23j42K50k82K89j83PQ8J30l31J26J72k49P3k2L2J0j79K45p3J66j48m6
$$ -332 -9 -151 99 -183 106 -77 -70 18 148 -183 -57 115 -134 -61 -83 -51 -41 -220 25 -48 118 -30 -76
1588g6J86Mk42j11K37K77k23m2J10j13K3o0K1j34J92j3pm5o2K57j68l6J04n8K53
$$ -76 110 114 -128 -239 -2 275 52 10 120 7 30 -30 -9 -143 49 36 29 -16 -78 179 11 -25 79 21 274
1613B74k99J78j40J19j44K08o0j42l6j00L95o3l33J70p5M6J6j07L4p3J20K6J01
$$ 274 -25 153 13 132 -12 196 136 -6 -42 -142 253 190 -143 27 -48 -2 14 -93 -59 -132 -12 14 115
1636A15J9j87K8J76j35Q3j77%J60j13j83J71j32M5j22J35j10Q0j16J96P1J12J56
$$ 115 134 -53 -25 151 16 99 -78 -78 82 -31 -214 -43 -175 -130 -252 -117 -227 -147 -263 -67 4 116 272
1659B72l28J31l2j38M7p8j13J61O9n9nJ3J90pL0l2m7o5j72J38K54q5j50M6p5j25
$$ 272 -56 75 43 -95 -48 -126 -239 -78 -9 -68 -73 -60 130 123 153 121 74 9 -163 -25 229 144 -6 40 -35 -160
1685a60L44j30j67L8L4p2l49L01J62M2L4K2j15k94M41J3L3jj47m7j11L6K54k51
$$ -160 184 54 -113 -75 -41 -113 -462 -161 1 43 77 99 -16 -310 131 144 177 176 29 -18 -129 -93 161 -90
1709i0L53k45j51K09r3PJ9m7j51N9J06q0J25om0n5k4J38p9J5R3j0k94L69q8O2
$$ -90 263 18 -133 76 -17 -10 9 -38 -189 -130 -24 -104 21 15 -25 -80 -104 34 -45 -30 63 53 -241 128 40 102
1735A02pk20K6o7L39k62K60k06o7MK73Rj11K8Q6l40J27r7L34l96L38l06J89j63
$$ 102 95 -125 -99 -166 173 -89 171 -35 -102 -98 175 184 73 101 187 -153 -26 -123 211 -185 153 -153 36 -127
1759a27O0J64k58K55k04J28Q3n7k37K57j17RK97l42R6j45K80j97j42J56J46l34
$$ -127 -67 97 -161 94 -110 18 101 44 -193 64 -53 -44 253 -89 7 -138 142 -55 -197 -41 105 -229
1781b29J89l73M86l6O8K04k43j32k09P1m6L24R0J1O0n33K98j14k0MJ41j77j71
$$ -229 -40 -413 73 37 105 309 66 -66 -275 -204 -250 74 164 175 235 -298 0 -114 -134 -130 11 -166 -337
1804c37Q7L83j26K32j24J2n6j05P8q5j9m7J9J33k38K54l0K00q1j36J64nl25M39
$$ -337 -250 133 7 239 115 127 71 -34 44 -41 -60 -107 -88 45 -193 61 31 231 150 14 178 173 -152 287
1828B87k51j07R1j1M6J2k59j03M31p2P0j54K0P2oJ00k24j13K70k5k5j25lq4lR1
$$ 287 36 -71 20 9 55 67 -192 -295 136 64 134 -20 0 72 66 166 -58 -171 99 74 49 -76 -79 -163 -166 -75
1854g5L10l66N2o3K59K7J66l07k6K04q4p9J69j63l22M37p6j88L3K24k84j8K7M17
$$ -75 235 -131 -79 -142 117 144 310 3 -23 181 97 18 187 24 -298 139 63 -125 -92 132 -152 -170 -143 274
1878B74j5k30j48p7J16K82k22j73M65k35m0k8q3K68j03K4k4O6j96q2l1L59n36
$$ 274 259 29 -119 -196 -80 202 -20 -193 272 37 -3 -31 -114 154 51 75 51 117 -79 -161 -192 167 -369
1901c69K75L32j64k72K67J49k84o0J6M00l40K38j17j0L21m56j02L50l03L8o2K1
$$ -369 -94 238 74 -198 69 218 -66 -126 -110 290 -50 188 71 61 382 -74 -176 174 -129 -91 -153 -132
1923a32M7K00r2o0J65K60k36o01P46K5L9l48P2k14J81p6K6J36j32rjL32k52R3
$$ -132 -85 115 23 -37 128 388 152 -449 297 322 361 13 85 -129 52 -24 2 138 6 -3 -4 328 76 169
1947A69J43m33K54j73L17j27m17L00k92K84R7k90M5K03j80j18O7j9L65q7q8J42
$$ 169 312 -121 133 -40 277 150 -267 33 -259 25 122 -168 -123 80 -100 -218 -151 -170 195 108 20 162
1969A62n0j69J08j18lQ4j46K06k48J10j52J95J71m0M7j87J69j50M3J0l0K38m17
$$ 162 112 -57 51 -67 -70 14 -132 74 -174 -64 -216 -21 150 110 157 -30 139 -11 32 42 12 250 -167
1992a67O5R1k96L75N8N7k49j1L80l83l9q5L59k23K1K56q5j78l6O1J13j2k4j26
$$ -167 -102 -11 -307 68 126 183 -66 -77 303 -80 -119 -204 155 -68 -47 209 124 -54 -90 -29 84 72 48 -78
2016g8L10j50j34j59J98J08k47O2OJ94j00R5Rj58J32P6M8k58Q0j3j48j40K73L
$$ -78 232 82 -52 -211 -13 95 -152 -90 -84 110 10 105 114 -44 88 164 212 -46 34 21 -127 -267 6 9
2040IO2j91k72M56L8j55Q6J27m9l26J78l9M8K86m95o0K3L01m2j7l4N3J8j48K35
$$ 9 71 -120 -392 64 102 -53 33 160 111 -215 -37 -76 -28 258 -237 -297 -274 27 -15 -32 -66 -13 5 -143 92
2065I2k12p7K81j30J09j20J10k10O8L15j97r2k7j34K48p6m9J2j15K92j15L86o11
$$ 92 -120 -197 84 -46 63 -57 53 -157 -89 226 29 -63 -90 -224 24 -52 -101 -89 -204 88 -27 359 -252
2088b52K57J06k0j24r2K19j96k20K87M09k58j76j10j6N0M44k39J41r6k90P5J05
$$ -252 5 111 91 -33 -125 94 -102 -322 -35 374 116 -60 -170 -186 -136 308 69 210 114 -176 -101 4
2110Dn6j64N57k59J1j38j75M39j79j13q3K78J88k63JJ33q9p6j02K59j98r1K8O5
$$ 4 -52 -216 341 82 93 -45 -220 219 40 -73 -156 122 310 47 48 181 92 16 -86 173 -25 -116 -88 -23
2134b3l02N2J66m1J08M9N0j94J9J48K07N1K8k79n6R3k6K39k33K51j68l63K25l1
$$ -23 -325 -273 -107 -148 -40 9 59 -135 -116 32 239 290 318 39 -17 76 50 289 56 307 139 -224 1 -30
2158c0K23j50j03J7R4J11m43L63lk56J51O2j14K37k12m8M7Q8k5K26m76K33m3O3
$$ -30 193 43 -60 -43 51 162 -281 82 79 -177 -26 36 -78 159 -53 -101 -54 34 9 235 -241 -8 -51 12
2182A2j82K53k72L90j61J2Nk4l1L3J6Q7P2r9k08N6r2M3m1K34P4k18J45m3k52J74
$$ 12 -170 83 -189 201 40 52 57 33 2 35 51 138 210 111 -97 -41 -133 -90 -131 103 177 -41 104 61 -191 -17
2208a7K77n18K80l0l05L70j2k6j27J96P4k57J52n1Q9j85m6K56L36n21J3K06k64
$$ -17 260 -258 22 -8 -313 57 45 19 -108 88 162 -95 57 6 95 -90 -136 120 456 -65 -52 154 -110
2231a10k3m9L44l99K05P5j67k8Q1K11j34j6q0J68p8j80J20K8J6k18N77o56Q5K55
$$ -110 -133 -182 162 -237 -32 43 -124 -152 -71 140 6 -10 -90 78 0 -180 -60 -32 -16 -234 343 -313 -228 27
2255B7J18l73l9P5J53J48j05M7k26K76j10P6J61l96J87j17O3Q0j10K15l7J06j86
$$ 27 145 -228 -267 -192 -39 109 4 51 -175 101 -9 67 228 -168 19 -98 -35 45 -65 150 113 219 33
2278C3P8J73k34j12O3J12j80J00K1K59l75L6Q5l12o0M37q7n5J5J9k83L80j84j03
$$ 33 111 284 50 -62 1 113 -67 33 54 313 -62 -26 59 -253 -313 124 37 -18 -3 16 -267 113 -71 -174
2302a74J32lK81j62l47K89k37L35j29j81J47j78L07q7K66k35r9J0K00l51J28K14
$$ -174 -42 -45 236 74 -273 16 -221 114 -15 -196 -49 -227 80 -7 259 24 -75 -65 135 -216 -88 126
2324A26l75L27l06k6J31J72j40J65J01l46J83J58k40p9J70k4k4L19n03K97l33
$$ 126 -249 78 -228 -254 -123 49 -91 74 175 -171 12 170 -70 -149 21 -3 -27 292 -211 86 -247
2345b47J77J0J31k05J25O4j63k37M71J76k90j31J89j19%K19j9j04Q4J2q6Ml6J06
$$ -247 -70 -60 71 -134 -9 55 -108 -345 126 302 12 -119 70 -49 -49 170 151 47 131 143 57 61 25 131
2369A31j05R1K5kl61J87K99k61J99l41J17J36l10J39k35LN57j8k48P4Pj58O0k75
$$ 131 26 117 142 140 -221 -34 265 4 203 -138 -21 115 -195 -56 -291 -288 269 251 3 77 84 -74 -14 -289
2393b89J00P6K8P1j81J48k52L66L04l48J16L57n69J94j66K04p3k32K09k3J0lj77
$$ -289 -189 -113 -85 -14 -195 -47 -299 67 371 23 139 496 -73 121 -45 159 86 -146 63 40 50 47 -130
2416a30J48J20J52j93j74%RN2k94K60J7M1Q2p2m9K41k56j00J83j15r2P8J93r7
$$ -130 18 138 290 97 -77 -77 -68 -16 -310 -50 -33 8 90 18 -31 210 -46 -146 37 -78 -170 -92 101 4
2440DQ3r9J4O6K8j1QPO8k72J83j42K21l57M7M38j14l34J46m6J29M1k42K03j51
$$ 4 87 -12 2 68 96 85 93 100 168 -104 79 -63 158 -199 -152 286 172 -162 -16 -62 67 108 -134 69 -82
2465h2J49j56J11Q9j65k08M70l53J92j07O2k54K19k35J42K02k05J37k22M16l63
$$ -82 67 -89 22 111 -54 -262 208 -145 47 -60 2 -252 -33 -268 -126 76 -129 8 -214 202 -161
2486a61Q0p7P3r9K03K12m7r5P0k72J0J81j43k89M49J16k07n7m6j80j1M28j66J54
$$ -161 -81 -158 -85 -184 19 231 184 89 159 -113 -103 78 -65 -354 95 211 4 -53 -99 -279 -290 138 -28 126
2510A26J7O4j49LmL7r9k71J93m8j09K40l6J20k62J59l4J2N5n9q2K05J0l21L08
$$ 126 143 207 58 61 57 94 -5 -276 -83 -131 -240 0 -36 84 -178 -19 -53 -41 14 -45 -127 78 88 -233 75
2535G5r6k4J60l9p1M3p1J98k85J62J1O5k49J07K05j47j90L72j69r2O2N6k48K56
$$ 75 -21 -45 115 76 5 48 -23 175 -110 52 63 128 -121 -14 191 44 -146 226 57 -35 27 83 -165 91
2559I1ql21J03Q8J77l34K26P6j81j62J07K51l47J70j50M1n7L40k08p0J24J66m0
$$ 91 83 -238 -135 -47 130 -204 22 98 -83 -245 -138 113 -234 -64 -214 -173 -230 110 -98 -168 -44 122 82
2582H2p6K32l82K54j06j32K94o8j49J66j99Q1l4Pk07LJ11K0l17L88k47K08%L4
$$ 82 6 238 -144 110 4 -128 166 98 -51 115 -84 -3 -37 -30 -237 -234 -123 -103 -420 -32 -279 -71 -71 -37
2606c7K2j42J87K63l69j11k7P5L15l99K01j2p9J18L4R6n7j53J66j40m7j1K5L09
$$ -37 -15 -157 30 293 -76 -187 -214 -139 176 -223 -22 -34 -113 5 39 135 78 -75 91 -49 -96 -107 -82 227
2630B27j73J1N9j23K2p1p1O6j85J88k04J36k24K91k7k7O3M2J8j26L7P8K7qL0j07
$$ 227 54 65 124 1 23 -48 -119 -53 -238 -50 -254 -118 -342 -51 -78 -105 -42 0 18 -108 -71 7 34 26 56 -51
2656e1J02j13l8J25k3K56m1k91p4K30j6J5j13j15K5O4n6J43j00oJ96j60o3K29
$$ -51 51 -62 -100 25 2 258 217 -74 -148 82 66 81 -32 -147 -122 -58 -114 29 -71 -77 119 -41 -104 125
2680A25L1j04K12j41P0m27K47j47L59l01p3lJ59j48n4J45O7J49j94J65P3j74j39
$$ 125 156 52 264 123 193 -234 13 -134 225 -76 -149 -152 7 -141 -195 -50 17 166 -28 137 210 36 -103
2703a03K18j46K10j22Pk10J81R4l81M09k37J17j13J63j45J13j67K73k05N4J39
$$ -103 115 -31 179 57 64 -146 35 129 -252 157 -80 37 -76 87 -58 55 -112 161 -44 10 149
2724A49j08lm7o5k4J77j8J26k30K1j77J61Q8ml65N04Kl97K26J35j02K30j88K2
$$ 149 41 38 -9 -74 -98 79 61 187 -43 -22 -199 -38 50 46 -319 185 187 -210 16 151 49 279 91 113
2748A13K3K9j17j08L7j38Q8J45l65M65o2J13n4j13k16K62m4k78K02j16L1R6M6
$$ 113 136 165 48 -60 -23 -161 -73 72 -293 172 110 223 169 56 -160 102 58 -220 -18 -134 -103 -7 39
2771C9r8m2L3M8L38l69j18L18j82J33Q6k98M7j62J28m9L39j11r1k28J82j31L05
$$ 39 -59 -101 -68 -20 318 -51 -169 149 -33 100 186 -112 -65 -227 -99 -148 191 80 -11 -239 -57 -188 117
2794A17j33l79L91R0R2J41l73j3o6j8O6LJ04J01j49l7L23l92K14r3K8K3Mj36j42
$$ 117 -16 -395 -4 86 178 319 -54 -67 -133 -151 -85 -82 22 123 -26 -63 260 -132 82 -11 17 40 44 -92 -234
2819b34J39K42m8q9O5pM3L4j44J30nk60J46l1R9K2O8m24k3K21P0J55l89L4L33
$$ -234 -95 147 99 10 75 68 111 145 1 131 126 -134 12 -19 80 102 170 -254 -277 -56 14 169 -220 -186 147
2844A47j67J96k52q6J01J22j78L6R6p3pL7k1J73L3l24J99n6K62m95L92l30J89
$$ 147 -20 176 -76 -162 -61 61 -117 -81 15 -58 -65 -28 -49 124 157 -167 32 -24 238 -257 135 -195 -6
2867fn9R8m8O0P5l73L02J23J08j53k19OJ21l14P2J86J27k82L73j77Rj2joj5J41
$$ -6 -65 33 -15 45 120 -253 49 172 280 127 -92 -86 35 -279 -207 -21 106 -176 197 20 29 17 16 10 -5 136
2893A36k70J51m2m2L6J78m10L16m9J3O3k49K56k0l37K93m5j99J9J45ok28L46P7
$$ 136 -134 17 -25 -67 -31 147 -263 53 4 17 80 -169 87 67 -270 23 -22 -221 -202 -57 -63 -291 55 132
2917A32m4p6J33P3n20L50k6k73J54J84J40%n18L92j37K36m3j18j41J51Q7l55K65
$$ 132 88 12 145 218 -302 48 22 -251 -97 87 227 227 -291 101 -36 200 157 39 -102 49 136 -219 46
2940D6K47m66K62N2k18P7Q7J24k79R2j09L1Ro1Q9p9J49p2K73k59K27k14l32L43
$$ 46 293 -173 89 141 -77 0 87 211 -68 24 -85 -54 -45 -106 -17 -96 53 -19 254 -5 222 8 -324 19
2964A9q2L1j33J03J49j24j05j70K97J83l68J45Q8J59k79m4L19l54K43J2J74M1
$$ 19 -63 -32 -165 -62 87 -37 -142 -312 -15 168 -200 -55 33 192 -87 -131 188 -166 77 89 263 304
2986C04m17L53l18j7j2r3L90k46j00K04J27l83K14l7j66J33Q0j97K7O4J63m8K04
$$ 304 -113 240 -78 -95 -107 -200 190 -56 -156 48 175 -208 6 -31 -197 -64 16 -181 -154 -90 73 25 229
3009B29p0j95k05M02k51K54n3j23J33j21mk10J51L5j1r4K0J85l10N34l69LN4p3
$$ 229 159 -36 -241 161 -90 164 111 -12 121 0 -4 -214 -63 -28 -39 -133 -113 72 -238 296 -73 -70 -16 -89
3033h9J46J4j00L0J07P4q9j86P4k06J19J46J23J1j05j77P4J4J61k75J84K1m66
$$ -89 57 71 -29 1 108 182 93 -93 -19 -225 -106 40 163 174 69 -108 -34 -20 141 -134 50 71 -395
3056c95K95l01M06OJ7l1P0q2k0M6j71K78%j68Q4K9r1k13J28J24J09j36K00m66
$$ -395 -100 -401 5 11 28 -3 67 -15 -35 11 -160 118 118 -50 34 63 -28 -241 -113 11 120 -16 184 -282
3080b82M14j01M4l48K88R1j3j64j60K31j21j62K32J84j21J14l9q0k00j6J22J75
$$ -282 132 31 75 -273 15 106 93 -71 -231 0 -121 -283 -51 133 12 126 87 7 -193 -209 -87 88
3102H8p2N0J02l40K07L4%J00j69K27n08L71q6O3k17P2R4M5P1j58M0k12K38J24
$$ 88 16 66 168 -172 35 69 69 169 0 227 -281 90 4 67 -150 -78 16 61 132 -26 14 -198 40 164
3126A64m23N14k96N7p7J53j1J02k71j0%J97K63o97L05L63k89j4n01L99n5o6Mo7
$$ 164 -259 255 -41 16 -61 92 81 183 -88 -98 -98 99 362 -335 -30 333 44 30 -471 -72 -127 -193 -189 -256
3150b56L70j14J05j03Q1r3j32J97J06l04J89j10M60k98k60n1K2K4J80K1K64m09
$$ -256 114 0 105 2 83 -10 -142 55 161 -143 46 -64 396 98 -162 -213 -191 -167 13 34 298 -111
3172a11O0K58k28k02L28N3Nj93j43K15p6k01J09O0J41k71L23j16k12J28K19k75
$$ -111 -51 207 -21 -223 105 158 163 -30 -173 42 -34 -235 -126 -66 75 -196 127 11 -201 -73 146 -129
3194a29m2K39K87l57k8J12k97L34j17l4j73N9J93j13o4J32J52m40M88k32L3j24
$$ -129 -171 68 355 -2 -30 82 -215 119 2 -32 -205 -146 47 -66 -130 2 154 -286 202 -30 3 -121
3216a21q3L63Nl35J08K72j47j78J55j70j11L24k17nn0O4J06l3r5J28Q8J07j84
$$ -121 -204 159 164 -171 -63 209 62 -116 39 -131 -242 82 -135 -140 -190 -126 -20 -53 -148 -20 68 175 -9
3239iJ7n8J0K68l56K39Nk23j92L03J89j52r5K00o4O9J6j55K67k77j26K3J66q1
$$ -9 8 -50 -40 228 -128 111 116 -107 -299 4 193 41 -54 146 82 151 167 12 279 2 -124 -101 65 -16
3263a6J58J0j75k32K57J26m5k03O7m5k1J1J93k07O6l1k9L04l1j04o9j03J84k5
$$ -16 142 152 -23 -255 2 128 83 -120 -53 -98 -119 -108 85 -122 -56 -87 -116 188 157 53 -16 -119 65 40
3287D0K34m76R8L68j51K16j15j83j38J03r5J45j80J61k04P2KJ92j93N3J44j06
$$ 40 274 -202 -104 264 113 329 214 31 -107 -4 -99 46 -134 27 -177 -105 -103 89 -104 -51 93 -13
3309a3K0K29j62k05P2j19K60J05l19J15o1K2K0k58K49j41m6J69m4r8K16j90P6
$$ -13 7 236 74 -131 -59 -178 82 187 -132 -17 -78 -56 -36 -294 -45 -186 -232 -63 -107 -205 11 -179 -103
3332a03K92Q8k11J18j38L9k69J06N1K86k02j54m7M87k55lk91L23j75p1M16q6k77
$$ -103 189 277 66 184 46 85 -184 -78 -27 259 57 -97 -144 343 88 85 -206 117 -58 -129 287 201 -76
3355g6K89k76p9Q5O0l7K23l6l10K18J6q7K52m22O6J63j01L71n16K76p8j9j75K9
$$ -76 213 -63 -142 -57 3 -34 189 153 -157 61 77 -10 242 -180 -114 49 -52 319 -197 79 1 -18 -193 -164
3379a64P2n0L12m5N3M8l20rN6O8j34R4Q8r3l4J36MP4l11J99K3J6k39J43P9k84
$$ -164 -92 -142 170 125 178 226 -94 -103 -47 21 -113 -19 69 -24 -58 78 82 156 -155 44 67 83 -156 -13 66 -218
3405b18M89l37k01J25K21l03M22L6n45J48mK94j45k5K95l62j16K63k88K28j3k38
$$ -218 271 -66 -267 -142 79 -224 198 234 -311 -163 -167 127 -18 -43 252 -110 -226 37 -251 -23 -36 -274
3427b74M00M1k44J25K47k26k6Jk3n0J32J54k80M2J37k03PL7q7N5j55K66Nj10K6
$$ -274 126 167 -77 48 295 69 43 44 21 -29 103 257 -23 19 156 -47 -40 -3 -90 -35 -190 76 81 -29 -3
3452cj97K32j60K51M8l25J07J5J29L6k41J14l8K87j94k2r2J46Qk89Q1L27Q6m27
$$ -3 -200 32 -128 123 171 -154 -47 -32 97 133 -108 6 -32 255 61 39 -53 93 101 -188 -107 220 306 -121
3476a21M3j57K94O3j67jj56J56Qj29M46l07K52l17L1j4j24k2K68R3k91P8q0J25
$$ -121 -78 -235 59 122 -45 -46 -202 -46 -38 -167 279 -28 224 -93 -62 -76 -200 -222 46 139 -152 -74 -154 -29
3500b9q5L58j70M2j97j65K43j16J07Q9N1k53L69l68j34J38M81k99j71K7j15K30
$$ -29 -114 244 74 116 -81 -246 -3 -119 -12 77 128 -125 244 -124 -258 -120 361 62 -109 -82 -197 33
3522C3P5p7j61J45J78q2l02P1J09o7K22j22j4%J90j65k32J62j80J45K26k23L16
$$ 33 108 31 -130 15 193 111 -191 -120 -11 -78 144 22 8 8 198 33 -199 -37 -217 -72 154 -69 247
3545B47j26n09N06j50q5M43n56J60K23%l08L2l2o3J9K3K11j12m7K1r5K25o3J3
$$ 247 121 -388 118 -32 -117 326 -230 -70 153 153 -155 -123 -155 -218 -199 -176 35 -77 -124 -103 -198 27 -36 -23
3569b3r2j43M72L9n04J47K7O6M0R4k44K86n29K29K20P1q8j32J2K0R8j97O0J28
$$ -23 -115 -258 214 253 -251 -104 -77 -11 29 123 -121 165 -364 -135 85 156 68 -64 -52 -32 66 -131 -71 57
3593E7M22q79L09L7J43k59Q5K55m27L65r2k05L80k51J18l28M27o0k85J53j57L50
$$ 57 479 -400 -91 -54 89 -170 -85 170 -257 108 16 -189 191 -60 58 -270 157 97 -188 -35 -192 158
3615A58l23JL74k76O0n7l0m5L30j69M8n3J83k58J18P6j10K4J5j13j19J26n8R0
$$ 158 -165 -164 210 -66 -6 -63 -93 -138 192 23 71 18 201 -57 61 137 27 51 66 -47 -166 -40 -98 -8
3639hK92r8j13j11K0jo8J63J12j72K48k67q8K69l43J59j03J5J57l23M2K49j35
$$ -8 284 186 73 -38 -18 -19 -87 76 188 16 264 -3 -91 178 -165 -6 -109 -94 63 -260 -218 31 -104
3662a04Q7p3J34k34J82q8Q0K0k76M53k10r0M30k23k58J62J46k38K63M8n5l7j66
$$ -104 -17 -90 44 -190 -8 -96 -16 4 -272 181 -29 -119 311 88 -170 -8 138 -100 163 211 156 119 -47
3685d7J16J63j44j37L25k72%j37J03J14k0m4N6m9j4J5J44O6m44Q8K86j90K42k58
$$ -47 69 232 88 -49 276 4 4 -133 -30 84 64 20 76 27 13 28 172 238 -206 -118 168 -22 220 -38
3709c8P2J7P9q4k05N0j60P3Q9J68J23l0l49K04L8n1j7j44p7J53P1J19J77j42m94
$$ -38 34 51 130 46 -159 -109 -269 -196 -107 61 184 154 -195 9 47 -4 -21 -165 -242 -89 -18 101 278 136 -358
3734c58O47j80j42J75k60J03J77j41P4J25J7k91M6K43k07p5O3k55j70L81K70l27
$$ -358 289 109 -33 142 -118 -15 162 21 95 220 237 -54 -8 235 28 -47 16 -239 -409 -28 242 -85
3756h5j84M03l03J70l06J76m3K43J3J29p6o9o3K45l09j94J55J83k1j55r6J86R8
$$ -85 -269 134 -169 1 -305 -129 -172 71 84 213 137 68 5 250 -59 -253 -98 85 64 -91 -187 -1 97
3779I7k51j49K40J49J09j6l07r9J89j5R2L3N1p8J6J12r2n9K18j08q5K12j74j97
$$ 97 -154 -303 -63 86 195 179 -128 -227 -38 -53 39 72 123 45 61 173 81 22 240 132 47 259 85 -112
3803a12P8kJ00j91K85km17L01j64K57j36o7J30N4j06o6N9j91J09J51j35J27J69
$$ -112 -34 -36 64 -127 158 156 -261 40 -124 133 -3 -70 60 114 8 -58 1 -190 -81 70 -65 62 231
3826B31l75N6K13n5J15n2k81K07P4m8j08L15n88K39J9N0N2m41K42J5L26k96j2
$$ 231 -144 -88 125 70 185 133 -148 59 133 85 -23 292 -296 -57 -38 12 64 -377 -135 -120 206 -90 -102
3849a02J57m5o9J86k39M19o51O29j38N2p7k09J43k74J38oJ39J35j16J01j83j49
$$ -102 55 10 -59 127 -112 307 -344 285 147 199 122 -87 56 -218 -80 -86 53 188 72 173 -10 -159
3871a59K90n8k36J87J00m4K09k97J70j76k00J41QR8L11j64m59L58%j20L70l41
$$ -159 131 73 -163 24 124 80 289 -8 162 -14 -214 -73 -65 33 344 180 -279 79 79 -41 329 -12
3893a2q0j84L76K5k7j0J99k74O0J26j47r0l4K60j1o5l39J42M8N08n18J16k43K47
$$ -12 -92 -276 100 125 98 88 287 13 73 199 52 -38 -72 188 177 112 -227 -85 -37 471 -47 69 -174 73
3917G3k37j36M27p7P4l57O4j1K8P2J98p7n0P5K4q4O3j94N2j77K66N2Lr2R3L2k48
$$ 73 -164 -300 127 50 124 -233 -169 -180 -152 -80 118 41 -9 66 90 6 69 -125 -73 -250 16 68 71 -21 72 104 -144
3944a44J36j62K17j29j99M67M5j96O9M2m66L90m1j7J6K34j42j08M8o8k27J57K00
$$ -144 -8 -170 47 -82 -281 186 231 35 104 146 -320 70 29 12 28 262 120 12 60 -8 -235 -78 122
3967A22k24R1j77L64l77J21K45j20JJ42m93J87M2M7R8j45J53m1J2J53k1l63K37
$$ 122 -102 -11 -188 176 -201 -80 165 45 46 188 -305 -118 -76 -29 69 -76 77 36 48 201 180 -183 54
3990E4j64N6L43k93J04j36k3K5j90J07J20J06M4p0J07j25k03J60Q0Lq4R9j68J97
$$ 54 -110 -54 289 -4 100 -36 -59 -34 -224 -117 3 109 153 83 190 65 -138 22 102 105 21 120 -48 149
4014A49k13j45L81l64K75K9k0j39l8q7J71j84K53l45KL94k48K42l50L24j22K7
$$ 149 -64 -209 172 -192 83 112 92 -47 -85 -172 -1 -185 68 -277 -275 119 -129 113 -237 87 -35 -8
4036hJ17j91J91j65n1J78j42j08J28J00Q6l8n6j45J37q6J45j41j03N7J49m7k52
$$ -8 109 -82 109 -56 -107 71 -71 -179 -51 49 135 97 41 -104 33 -53 92 -49 -152 -95 54 7 -245
4059b45J08J47k16K61Kj5j94K06K35k40j2k73L29O8n13M36l8l01K44k54L50k9
$$ -245 -137 10 -206 55 57 42 -152 54 289 49 37 -236 93 161 -352 84 46 -255 -11 -265 85 56
4081E6P2l5k35K36k95J36O0R8j43J58L1k8Mj34J46Kj59m6K08q2l12J70J98L1k10
$$ 56 128 93 -142 94 -201 -65 -5 93 -50 108 139 111 115 -19 127 129 -30 -76 132 50 -262 -92 106 137 -73
4106g3K32n0j41K03k65L64m21K54J21k42j14J94l13J45j2K37k46K24J02l32K23
$$ -73 159 109 -32 171 -94 270 -151 103 224 -18 -132 62 -251 -106 -118 119 -127 97 199 -133 90
4127I0j74j65J93J20J2k62L56l01P2L03o63N80k74L85l17M5k18m9K06P2J10L07
$$ 90 -84 -249 -56 64 76 -186 170 -131 -59 244 -419 161 -113 272 -45 0 -218 -267 -61 11 121 428
4149D28l21l06K09j89p4P7M12l09k8K42O8k00J7J21l1o9J30j71l2J65o1j53Q7
$$ 428 107 -199 10 -179 -253 -176 236 -73 -101 141 209 9 26 147 116 47 177 6 -26 139 78 -75 12
4172A2O6k45J4M97l58O7J16j61j3K50j96kJ02q0k58K29jj23N2k54L88p5K13j91
$$ 12 78 -167 -153 344 -14 53 169 8 -5 245 49 47 149 69 -189 40 39 -84 -32 -286 102 27 240 49
4196D9P6j15j49K14l20L9K97o2qj6%J79j41j04K27q0j59J40n0R0k37L43o1k94
$$ 49 125 10 -139 75 -245 -206 91 29 21 5 5 184 43 -61 166 86 -73 67 17 107 -130 213 152 -142
4220a42L10l22J33%j94J78l70J35J21nK68k37J31k25J74j67J88p7L80m73K90p1
$$ -142 168 -154 -21 -21 -215 -37 -407 -272 -151 -156 112 -125 6 -219 -45 -212 -24 -101 279 -194 96 25
4242B5k14j75J17L95j06L3K1k46K10j78KK42l2j61J12P0p6j14jO9O6o1j08K76
$$ 25 -189 -364 -247 148 42 75 96 -150 60 -118 -116 126 94 -67 45 115 39 -75 -76 -7 59 -2 -110 166
4266A66k13L77q3j74L6k53O2k3R7Q4L3k09K27l7%o2K90m22jN5L61q1l1k84mJ79
$$ 166 -47 330 247 73 109 -144 -82 -105 -8 76 109 -100 127 90 90 28 318 -104 -105 -50 311 230 199 -85 -89 90
4292I0l6O6K30n99J68J5on4K96n5j97R2J41r7R3l48J40K15j54p6J2K6j9J04l41
$$ 90 54 120 350 -249 -81 -66 -72 -126 170 115 -82 10 151 54 147 -201 -61 154 0 -76 -64 -38 -57 47 -294
4317b94J76J65m1J82p8r6K36j08O0j09J12k26j61L4O0K61m80L54j51J94P5m40
$$ -294 -118 47 6 188 110 14 250 142 202 93 205 -21 -182 -148 -88 173 -307 47 -104 90 165 -275
4339b75K76O8q9K4j67J13P9L3k12rJ20K33j1k62Q1k23L70l72M45j08k87M17m76
$$ -275 1 69 -20 4 -163 -50 29 62 -150 -159 -39 194 183 -79 2 -221 149 -223 222 114 -173 244 -232
4362b32J44P5j12J47K08l34l8R6l8j86J56M26k53l4O0Q6j59R1k29K02k6P3l19
$$ -232 -88 -13 -125 22 230 -104 -142 -46 -84 -270 -114 312 59 25 85 171 12 103 -126 76 50 123 -196
4385a96K91K69m15L64j28k82N3j7J44j69Q1J22p8p6j33L36j44j57j18L74J90j24
$$ -196 95 364 -51 313 185 -97 -44 -61 83 -86 -5 117 39 -37 -170 166 22 -135 -253 121 311 187
4407A87k4n8q2L18m02j48n2J72j40M05k51M6K09j96J57m90N63l64J55j0k28L48
$$ 187 163 105 23 341 -61 -209 -261 -89 -229 176 -75 -29 180 -16 141 -349 214 -150 5 -5 -233 115
4429A15J25l75L6K94kK8k14J3J04j95J8J81K6j63j46M71l69M5K18k91L94m10L02
$$ 115 240 -135 -99 195 193 221 7 20 124 -71 -53 128 154 -9 -155 316 -53 -8 210 -81 313 -97 205
4452B05k51k03K5K19K56k82r0J7J28k31J64N7K06k36J55N0k97k12N48o7k41n9
$$ 205 -46 -249 -224 -5 251 -31 -121 -104 24 -207 -43 14 220 -16 139 189 -108 -320 228 161 -80 -139
4474a39K12P2l0j74L28j56M4k98J93j04J27J4k99J10OM8k03K70j67J69k10L03
$$ -139 73 145 115 -59 269 113 157 -141 52 -52 75 89 -210 -100 -94 -46 -249 21 -146 23 -187 116
4496A16l92K81q7l8K36k27J39n8k39M5L30N6m10J58J7Q2K48oj82j62J27q2J00
$$ 116 -276 5 -82 -120 116 -111 28 -30 -269 -224 106 162 -248 -90 -73 9 257 251 69 -93 34 -48 52
4519E2j96K31l60M10k12Q4K63l39J14k2q9K52l96N1L69j20k12J79j15r5K20m9
$$ 52 -144 87 -273 137 -75 9 272 -67 47 25 -64 188 -208 -157 212 92 -120 59 -56 -151 69 20
4541B0J74m55M15l16J24j05L83m23J9j56L18M73j74l86M9M5K0M1J77j67p8K83
$$ 20 194 -261 154 -162 -38 -143 240 -183 -164 -320 -2 471 297 -89 -40 5 25 66 243 76 -2 281
4563B81j12j45q4J39j6q4k35J12n0N10j75p5o8J89j47j31k6l4%K14o9k61M29k47
$$ 281 169 24 -60 79 63 -21 -256 -144 -194 316 141 66 -2 187 40 -91 -117 -151 -151 63 -6 -267 162 -85
4587h5L36Mk77J53k81J96J0J27k00J19m78K13Q2L20l58o3K52k26J63%P5N2j99
$$ -85 251 255 -22 131 -150 46 56 183 -17 102 -376 -163 -81 239 -119 -182 70 -156 7 7 82 134 -65
4610f5K18k96P9k01L61k3j06k4j57J52J8J70j52L66k62j16P1k12O5K46j96J39
$$ -65 153 -143 -64 -265 96 73 -33 -57 -214 -62 -44 126 -26 340 78 -38 33 -179 -114 132 -64 75
4632G5Q0o9m03K97p5K01r3k60J72J94j0j78J88j97j08L22j70K53k46mm2j46K18
$$ 75 155 86 -317 -20 -95 106 13 -247 -75 119 109 -69 119 -78 -186 136 -34 219 -27 -31 -73 -219 -1
4655ak0j23O2J89j53L61j61k25r7M0L12j61J12k42J93J08r6O6j70P2m9q4m4J42
$$ -1 -21 -144 -82 107 -46 315 154 -71 -168 -128 184 23 135 -107 86 194 98 164 -6 66 17 -67 -111 31
4679C1oL6N0L1k95R0M0L42l62o8J18K25j90J61j06lj07J38Lm5j99J08k48k2K70
$$ 31 25 61 111 142 -153 -63 -23 319 -43 -111 7 232 42 203 97 94 -13 125 128 83 -116 -8 -256 -278 -8
4704ho2O0Q7j78q5K89j72L4j35R7R8j45L9O7K35j51n2J0l06L77o5k16L48j51q1
$$ -8 -70 -10 77 -101 -186 103 -69 -35 -170 -73 25 -120 -81 -14 221 70 18 28 -278 99 34 -182 166 15 -66
4729f6K42q9K9k98J24J12J08L8l23L83j38k05M5N2J5j71Q3j04L2k06P0K52J97
$$ -66 176 87 116 -182 -58 54 162 200 -123 260 122 -83 -38 14 29 -142 -59 -163 -131 -337 -267 -15 182
4752A82l45K96l86L64r0k24L62j6m14K12j0M1N3L2r7n5j19K68k16K79MR7k4k86
$$ 182 -163 133 -253 111 21 -203 159 143 -271 -59 -69 -28 25 57 -40 -95 -214 54 -162 117 121 218 194 -92
4776i2K28P0j04k23L42m74J65rK45K46m54k0NL64q4j97J36l2j61j17m2M59j61
$$ -92 136 206 102 -121 221 -253 -88 -97 148 394 -60 -80 -75 289 205 8 144 112 -49 -166 -208 251 90
4799I0j21l81K53J50o9J98l03J70K20o8l57L91m44J96K3J76l6l4K5k18rM33k00
$$ 90 -31 -412 -159 -9 -78 120 -183 -13 207 139 -218 173 -271 -75 -52 124 88 54 79 -139 -148 285 85
4822H5q4K64k84k2K59l06J53L35m69K48l72K30J46j98o6Q4L4r7P3Q8j39J3r4J01
$$ 85 1 265 -19 -41 218 -88 65 400 -69 179 -193 37 183 -15 -81 3 37 -60 13 101 -38 -25 -119 -18
4846a8j6j53K29r8K38l38M74m89K7J84m8K08r4J09j84l6m0J08o3Q8Q2r1j97Q2
$$ -18 -34 -187 42 -56 182 -156 318 -171 -144 40 -8 200 106 215 31 -5 -45 63 0 88 170 79 -118 -36
4870c6J02p8n1L05k0j26k55n3J81j46n3L49k71L2L00m01K13j08j81J96K12J79
$$ -36 66 -12 -63 242 222 96 -159 -212 -31 -177 -230 119 -152 -120 180 -221 -8 -116 -297 -101 111 290
4892B90m65P9K5R0p6k05L79l36L11o1k9K26j89k4J62o0p6o0l29K16M40l30J91
$$ 290 -175 -96 -71 19 -57 -262 117 -219 92 31 2 228 39 15 177 117 41 -19 -348 -132 308 -22 169
4915A69l4q0l46M71k85J79k50N27j76l24K88j17J0J00K9j18m2K42n13L32j44J30
$$ 169 135 55 -291 180 -105 74 -176 351 175 -149 139 22 32 132 161 43 1 243 -270 62 -82 48
4937D8M8jr1K79j17p8k15K09j80q2JJ65q4RR9o7n6n6P1J11j60L44M5r2j58k2k07
$$ 48 96 95 4 283 166 88 -127 82 -98 -180 -179 -14 -98 -89 10 -57 -113 -169 -98 13 -147 197 242 150 -8 -30 -237
4964b37L46O2l28M53m53N4J3R4L9q8K26n5j36K4j93o7M06J5k24l6N4n0lr3J7J57
$$ -237 109 171 -157 296 -157 -103 -90 4 43 -45 181 126 -10 14 -179 -246 160 175 -49 -85 -31 -81 -84 -177 -160 -3
4990cq0On8L23l06J8J77j07K26j86j45M72k08n1m7j86K58j87pJ88j23p6J05R1
$$ -3 -83 -77 -135 188 -118 -100 77 -30 196 10 -135 337 129 78 31 -155 103 -84 -91 97 -26 -102 3 94
5014I4j59k8k27L09k0L39k68M1j62L2N2J1M1J34q8l29K03J70j32J72l23K63j77
$$ 94 -65 -93 -320 -11 -31 308 40 81 -81 -49 3 14 55 189 101 -228 -25 145 13 185 -138 125 -52
5037e2O8J75k10o8j2N6m5j53M02k86M1m7K10k43O1K99k26R9Jj24M1m9O6nL70n75
$$ -52 16 191 -19 -87 -99 -43 -88 -241 161 -125 -84 -131 79 -164 -103 196 -30 69 70 -54 -13 -62 4 -1 369 -206
5063b06J29q8k47L97j76L70l14J84r6J62l85J49J57k44M38m66L00r6MM3K8j63
$$ -206 -77 -165 -412 -15 -191 179 -135 49 -47 115 -270 -121 36 -208 230 -236 64 -32 -28 15 43 -120
5085a20j60K60n9J49k5J51k31p7K07j7k34K09n8k27L00J78j1k55k95N88l43kL58
$$ -120 -280 -20 -79 70 45 196 -35 -112 95 78 -156 53 -5 -232 68 246 235 -20 -315 273 -70 -72 286
5108B86j52m93J93J76j32K90p1j47J28J80k04K41j83k50J84j48j9K47j29j82P2
$$ 286 134 -359 -166 10 -122 168 97 -50 78 258 54 295 112 -138 46 -102 -121 126 -3 -185 -113
5129a13K25m9j8M6k35q9L83n2o9O8N1j12mN2k92j03K72L02n74J61K49j77P4R3
$$ -113 112 63 45 91 -144 -233 150 98 29 97 148 36 32 84 -208 -311 -39 263 -311 -150 99 -78 -4 89
5153H9k06J07L00m00K11L5j53k8pj5n4K13J70l58J14L36k20l09K02p2M2pQ1o4
$$ 89 -117 -10 290 -110 101 136 -17 -45 -52 -67 -121 92 262 -96 18 354 134 -175 27 -45 -3 -10 71 7
5177GJ60j37j00r8L30j46J48r9j94K02j11J68j62j02J33J50O0k42K46M7k7j86
$$ 7 167 30 -70 -168 162 16 164 65 -129 73 -38 130 -32 -134 -1 149 209 -33 213 260 233 47
5199D7N7L7l00OL38O4l41p2j36K37P0L2j09J75J76m59L30j62J6k29O4L07p5P5
$$ 47 104 141 -159 -153 185 249 -92 -164 -300 -63 7 39 -70 105 281 -178 152 -10 6 -223 -159 148 73 148
5223A48k45K36j18J6M3l33J55N53l15k28J10j43L14j12j92KJ04j13K25k50J20
$$ 148 -97 139 21 37 80 -253 -98 455 140 -88 22 -121 193 81 -111 -109 -5 -118 107 -143 -23
5244b3n5L14j7k64L09k64r2J87R7J5m32K93j86K52l8l97M85j71Q6k76j48L25J16
$$ -23 -78 236 219 -45 264 0 -92 95 192 207 -225 68 -118 134 96 -301 184 13 99 -177 -325 0 116
5267A16Q5j5j04M9n57N27j87k2K53J29l58M06k28K2k74O7J92k16J69j42jJ68k16
$$ 116 201 186 82 131 -426 101 -86 -108 145 274 -84 322 94 116 -158 -91 101 -115 54 -88 -89 79 -137
5290a37R5o4J00k2j9j3J01j68J38J68j95lj61N1J22j91L04k4R0k5j97j76j6J94
$$ -137 -42 -106 -6 -28 -47 -60 41 -127 11 179 -16 -19 -180 -129 -7 -198 106 82 172 147 -50 -226 -242 -48
5314d8N7j10J2L15k74J7NJ43l9p3L9P3ol06K32J22k7l08j06L44N4J23k87J03j52
$$ -48 9 -101 -89 226 -48 -31 -26 117 78 5 44 117 111 -195 37 159 132 -176 -282 62 116 239 -48 55 -97
5339i7J07k27r1L53k72J47j12k2K94j80j19M55k46j27k5J20K09j14q7jJ01o7r6
$$ -97 10 -217 -308 45 -227 -80 -192 -214 80 -100 -219 236 -10 -137 -162 -42 167 53 -34 -35 66 -1 -97
5362i7M7J87J41k36k20L17k33K22P9r8k35o2K35r9K6j53L48k93L77k83j77J99
$$ -97 -50 137 278 42 -178 139 -94 128 207 109 -126 -188 47 -52 -26 -179 169 -124 253 -30 -207 -8
5384hk92K21L1K5J09j06Q4Nl89J81K67J77j13k01r8J01M1J06k4j25J02N8o0l5
$$ -8 -300 -79 -48 -23 86 -20 64 69 -320 -139 128 305 192 -9 -107 -6 35 141 117 -8 94 152 92 57
5408E7j6R4k32P5k0ql1M9J46j58M1m4q5J79k75K20r0m4J30r7M7Q0m0N2J51j00
$$ 57 41 135 -97 -22 -42 -50 -81 -32 114 -44 -3 -47 -132 47 -228 -8 -98 -142 -12 -109 -62 18 -22 30 181 81
5434H1k32K02J4j40J22K12m02M6j37M07k20J03r6L2J35pj13r8J76j59L6k2K5J29
$$ 81 -151 51 65 -75 47 259 -143 -97 -234 173 -47 56 -40 -8 127 120 7 -91 85 -74 -38 -60 -35 94
5458I4k04K12J06j78%o9j10K1P7J67n4j31j8J28o9K55l49M07k5k90J79m2P1j78
$$ 94 -110 102 208 30 30 -39 -149 -128 -51 116 62 -69 -87 41 -28 227 -122 285 260 -30 149 107 178 0
5482@j30N0K15l49L58n39L80k38K15k04K58Q9j34r5J47q9j19K32j04j8J28J84
$$ 0 -130 -80 135 -214 144 -395 -15 -253 -38 -242 16 105 -29 -124 23 -66 -185 47 -57 -75 53 237
5504B37j98j08r4j53K11n9J53n8J20j96j06K02P0J60m23J50K82j93m8j21J28M0
$$ 237 39 -69 -163 -316 -105 -164 -11 -69 51 -145 -251 -49 21 181 -242 -92 190 -3 -51 -172 -44 -4
5526dJ35j47J8k4Q5j66r7L81l24L59j47k37K01q8R6J60l40L36j06o7j1l0l8k03
$$ -4 131 -16 2 -22 63 -103 -200 181 -143 216 69 -168 33 -55 41 201 -139 197 91 24 13 -17 -55 -258
5550b58J36L02o7j64J17n3Q5j1o6J13k95K25O4mj62Kq6J69j90K08j93J54k49J11
$$ -258 -122 180 113 -51 66 13 98 87 21 134 -161 64 128 124 -38 -36 -122 47 -143 65 -128 26 -223 -112
5574a12P7j89L8Q7K21q1j86L15j45J68j35j12K47l49p7L63j5k3q7K38l06J19k38
$$ -112 -35 -224 -186 -99 122 41 -145 170 25 193 58 -54 193 -156 -233 130 115 92 5 243 -63 56 -182
5597a82J80p7O0p4n3L7j73K81p4L5j00kQ2M27k56k18K55k62J23L5P2nlj30P5K14
$$ -182 -2 -79 -19 -93 -146 -109 -282 -1 -75 -40 -140 -142 -60 367 111 -107 148 -114 9 44 116 111 108 -22 53 267
5623B67j41K11j03k09K6q9k08P3K56p0o1J18p1l15J85M4M7k11J8K81j10J10p5
$$ 267 126 337 234 25 51 -38 -246 -173 83 13 -48 70 -1 -316 -131 -87 -40 -251 -233 48 -62 48 -27
5646b7P1j0N6l25K19K8R8j09Q5j79l5m7L45n5j65K23k36K7K68m00J53R1j3P7J9
$$ -27 44 34 90 -235 -16 12 110 1 86 -93 -128 -175 170 115 -50 173 -63 -36 232 -168 -15 76 63 140 159
5671A59l15P5L83n17J65K03j78L3k86M08j49j04L49k19N2j09l5K06K2l16o8M34
$$ 159 -156 -81 302 -215 -50 153 -25 8 -278 130 -19 -123 226 7 59 -50 -85 121 143 -173 -241 193
5693A93m59K29j1j08K54k74P5K28m4r5J02m8j75J07j3J31J12k58L3J48l49J36
$$ 193 -266 -37 -48 -156 98 -176 -101 127 83 -12 90 42 -133 -26 -39 92 204 -54 -21 127 -222 -86
5715h6K80l39J79K33n8k73J22j31P7r2j10Q4j16KK18R1kk53K46k08K17j32j58
$$ -86 194 -145 34 267 209 -64 58 -73 4 -88 -198 -114 -230 -228 -10 81 79 -174 72 -136 81 -51 -209
5738b09L90k27N3j22K89k40m3N9j00L77k07M1k92K02o5M1N8L7MKm8j47L92m62
$$ -209 181 -46 7 -115 174 -66 -109 -50 -150 227 20 61 -231 -29 -94 -53 5 42 46 48 0 -147 245 -217
5762b17J97n5J41L7k48N0K88P2k6k73K29m76L53j16J46l34K35j60L08k08k14k21
$$ -217 -20 -75 66 103 -145 -95 193 265 239 -34 195 -281 72 -44 102 -232 3 -157 151 -57 -271 -492
5784d92M89j75K39k01m0J75m0O4k79J09J63J3J54o5p0k10j26J64J41K1l6J24j56
$$ -492 -3 -178 61 -140 -180 -5 -45 19 -260 -151 12 25 179 114 44 -166 -292 -128 13 34 -2 122 -34
5807c4j10N08k00Q1l95m2L00j67J77K7j75q3%K43n2Q6K0l13j2J94J6j24J9ml7
$$ -34 -144 364 164 245 -150 -192 108 -59 118 145 -30 -113 -113 130 78 164 184 -129 -141 53 69 -55 -36 -40 -77
5832g7m5MR0J48r0k47r8M59j84l8J14J05K10m88N5q2L89k23j80m6J14K28j14Q5
$$ -77 -122 -118 -28 120 30 -217 -315 144 -40 -78 36 141 351 -137 -82 -164 225 2 -178 -224 -110 118 4 89
5856H9N0M4j65k09J27K83l91L01m8K16l00K98j87j10J79j64J20L8o0k06O8K39
$$ 89 139 183 18 -191 -64 219 -172 129 81 297 -3 295 108 -2 177 13 133 171 111 -95 -27 212
5878B12l33K14k02J62k17L39k28P3j41L16l66K20j27K6L83l25j31mK60Mk20n9
$$ 212 -121 93 -109 53 -164 175 -53 20 -121 195 -171 49 -78 -52 331 6 -125 -129 131 135 -85 -144
5900a44j3J52%m4j58K86j07R6k14l6J41J49o4J36m35R9N86o13J90K07j91j14K58
$$ -144 -157 -5 -5 -49 -207 79 -28 68 -146 -182 -41 108 44 180 -255 -156 430 -183 7 214 23 -91 167
5923A67l6n7j00J92l36K80j61L4k3Q0k32oJ23m5J54j18pQ0j89K14N9l4o0L1K10
$$ 167 131 74 -26 166 -170 110 -51 -17 -40 40 -192 -198 -75 -120 34 -84 -91 -11 -200 14 73 39 -21 10 220
5948B20k68j22M1P6n9L5l0J73j8J04J15k83Rl87L29j17K42J43j58l13K00q0J17
$$ 220 -48 -170 -129 -53 -112 -77 -107 66 48 152 267 -16 -7 -394 -65 -182 60 203 45 -268 -68 -148 -31
5971c1J12j54Nk22K58j70K41j34M3J46k33L20k95J75j33m2K2K94k3k00q6O8J32
$$ -31 81 -73 -68 -290 -32 -202 39 -95 -52 94 -139 181 -114 61 -72 -114 -92 202 179 -21 -107 -39 93
5994I3j84L9j61J24R2Q3j68K02j14O9o0j81J86kp9n1J74j08J68o9j10J88j64N7
$$ 93 -91 -52 -213 -89 3 86 -82 120 6 75 15 -166 20 18 -61 -112 62 -46 122 53 -57 131 -33 24
6018B4K2j85j07L25P1j82Pj28O1n5O4n2L36P5l63J76J8j00J12L1lJ0k89K75j64
$$ 24 46 -139 -246 79 150 -32 -25 -153 -92 -147 -83 -135 201 276 -87 89 107 7 119 150 147 157 -132 143 -21
6043b1mJ61j71j32K83p4L2k07k6j30L68nk08J30L06k20j77K84k57J11j46j02Q0
$$ -21 -25 136 -35 -167 116 42 74 -133 -159 -289 79 74 -134 -4 302 82 -95 189 -68 43 -103 -205 -125
6066a25L28k14j43L57m21K60K34n32J29J28K0r6k11L54l81K05J56k5n1K21l80
$$ -125 203 -11 -154 203 -218 42 276 -256 -127 1 21 -75 -286 68 -313 -108 48 23 -28 193 -187
6087a87L73l34L7J33j35L27j61j90J64Q6l2l3o5J93k38Q5J34j72p2K52o7j35j50
$$ -187 186 -148 -111 22 -113 214 53 -137 27 113 81 48 -17 176 -62 23 157 -15 -87 165 98 -37 -187
6110a87L78k40j00J79N9n6k11K33m6j47R2k09L05j66K53k18K33m03L30J1rK41
$$ -187 191 -49 -149 30 89 33 -178 55 9 -138 -46 -255 50 -116 137 -81 152 -251 79 90 81 322
6132C22k47P6k45J66J08k57L1L1J58j85K07k00J14k31K57r2O9j39K03k43J71J23
$$ 322 75 151 -94 72 180 -77 -46 -15 143 -42 165 -35 79 -152 105 13 82 -57 146 -97 74 197
6154A97n55K53J91q0L0J02j09j16Q0q3r7K2P2o8J27O1k4L9j35L09l32N8L81j09
$$ 197 -358 -105 86 6 36 138 29 -87 -7 -90 -187 -165 -93 -161 -34 27 3 42 -93 216 -116 -58 323 214
6178B14k05j09K03j24j0K25l84K12J93l62j15J89P1J0j09pK8J23j86J00J18K72
$$ 214 9 -100 103 -21 -31 194 -190 22 215 -147 -262 -73 -2 8 -101 -108 -80 43 -143 -43 75 347
6200C47l15j53J01J15j69j09P0J45q9O1j5R4k46J59j4j21L05k93L03l27k7K41
$$ 347 32 -121 -20 95 -74 -183 -113 32 -57 4 -11 83 -163 -4 -18 -139 166 -127 176 -151 -178 63
6222F3j05R6m5j41L46l9j47j95J63J3J46j06L7q4k17K00o5l2K97j50N1L1k0j53
$$ 63 -42 54 9 -132 214 175 28 -167 -4 9 155 49 86 2 -215 -15 -80 -112 185 35 86 117 97 -56
6246e6J19n3J86j79j44K91k66L26l1k43j43J52J4J62k50L08k8j22j6J88j45K7
$$ -56 63 10 196 17 -127 164 -102 224 193 -50 -193 -41 -27 135 -115 193 165 43 27 215 70 97
6268I7l73L80M6j25O6J78k21L0J60l63P4J39%j12j3nj21m7L37k84K90O3k73K12
$$ 97 -276 104 150 25 91 269 48 78 238 -125 -51 88 88 -24 -37 -42 -163 -210 127 -157 133 196 -77 135
6292A35j98J71j16K28o5Q1l57K75m15L60l22L74j49J26J35j6m7l89K47r1K45l34
$$ 135 -63 108 -8 220 155 236 -121 154 -261 99 -223 151 2 128 263 247 200 -189 58 -33 212 -122
6314a22K71k83L33l07K50k71N49k15j80m4n5K70k53P5j59J23K31l54J34K3m5K2
$$ -122 149 -134 199 -108 142 -129 420 205 25 -19 -74 196 -57 18 -141 -18 213 -141 -7 16 -29 -7
6336gj29J58J18m5j5l9j33O2J44r7R8l6j63J27k82N8J61J11j1J3j85K01j40j85
$$ -7 -136 22 140 95 80 41 -92 -30 114 17 115 79 -84 43 -239 -181 -20 91 80 93 -92 109 -31 -216
$$ [...]
8191b0
##END NTUPLES=NMR FID
##END=
