##TITLE=1H_DE-154_N2
 200.13Hz,CCl4.
 8 sc
 10.6.2026
##JCAMPDX= 6.0         $$ Bruker NMR JCAMP-DX V2.0
##DATA TYPE= NMR FID
##DATA CLASS= NTUPLES
##ORIGIN= UXNMR, Bruker Analytische Messtechnik GmbH
##OWNER= pz
$$ XWIN-NMR		Version 3.5
$$ Wed Jun 10 14:17:10 2026 Russian Standard Time (UT+4h)  she@DPX200
##.OBSERVE FREQUENCY= 200.131
##.OBSERVE NUCLEUS= ^1H
##.DELAY= (6, 6)
##.ACQUISITION MODE= SIMULTANEOUS
##.ACQUISITION SCHEME= undefined
##.AVERAGES= 8
##.DIGITISER RES= 18
##SPECTROMETER/DATA SYSTEM= spect
##.PULSE SEQUENCE= zg30
##.SOLVENT NAME= CDCl3
##.SHIFT REFERENCE= (INTERNAL, CDCl3, 0, 14.3821)
##AUDIT TRAIL= $$ (NUMBER, WHEN, WHO, WHERE, WHAT)
$$ ##TITLE= Audit trail, XWIN-NMR		Version 3.5
$$ ##JCAMPDX= 5.01
$$ ##ORIGIN= Bruker BioSpin GmbH
$$ ##OWNER= she
$$ F:/spectra/data/she/nmr/H-C/1/audita.txt
$$ ##AUDIT TRAIL=  $$ (NUMBER, WHEN, WHO, WHERE, WHAT)
(   1,<2026-06-10 14:15:38.04 +0400>,<she>,<DPX200>,
      <created by zg, POWCHK disabled, PULCHK disabled
       configuration hash MD5:
       00 E9 B6 7A A2 85 ED C7 34 08 36 98 17 FE 4E 26
       data hash MD5: 16K
       55 8C 2D 92 D2 4B A4 72 4A 79 D7 92 D6 6F 08 3E>)
$$ ##END=
$$ 
$$ hash MD5
$$ BF 45 17 05 4A 38 DD E2 F8 65 B1 03 A5 4A 5B 10
##$RELAX= 
##$RELAX= 
##$RELAX= 
##$RELAX= 
##$RELAX= 
##$RELAX= 
$$ Bruker specific parameters
$$ --------------------------
##$DU= <F:/spectra>
##$EXPNO= 1
##$NAME= <H-C>
##$PROCNO= 1
##$TYPE= <nmr>
##$USER= <she>
##$AMP= (0..31)
100 100 100 100 100 100 100 100 100 100 100 100 100 100 100 100 100 100 
100 100 100 100 100 100 100 100 100 100 100 100 100 100 
##$AQSEQ= 0
##$AQ_mod= 1
##$AUNM= <au_zg>
##$AUTOPOS= <>
##$BF1= 200.13
##$BF2= 200.13
##$BF3= 200.13
##$BF4= 200.13
##$BF5= 200.13
##$BF6= 200.13
##$BF7= 200.13
##$BF8= 200.13
##$BYTORDA= 1
##$CFDGTYP= 0
##$CFRGTYP= 5
##$CHEMSTR= <none>
##$CNST= (0..31)
1 1 145 1 1 1 1 1 1 1 1 1 1 1 1 1 1 1 1 1 1 1 1 1 1 1 1 1 1 1 1 1 
##$CPDPRG= <>
##$CPDPRG1= <>
##$CPDPRG2= <>
##$CPDPRG3= <>
##$CPDPRG4= <mlev>
##$CPDPRG5= <mlev>
##$CPDPRG6= <mlev>
##$CPDPRG7= <mlev>
##$CPDPRG8= <mlev>
##$CPDPRGB= <>
##$CPDPRGT= <>
##$D= (0..31)
0 0.7 0 0 0 0 0 0 0 0 0 0.03 0 0 0 0 0 0 0 0 0 0 0 0 0 0 0 0 0 0 0 0 
##$DATE= 1781086537
##$DBL= (0..7)
120 120 120 120 120 120 120 120 
##$DBP= (0..7)
150 150 150 150 150 150 150 150 
##$DBP07= 0
##$DBPNAM0= <>
##$DBPNAM1= <>
##$DBPNAM2= <>
##$DBPNAM3= <>
##$DBPNAM4= <>
##$DBPNAM5= <>
##$DBPNAM6= <>
##$DBPNAM7= <>
##$DBPOAL= (0..7)
0.5 0.5 0.5 0.5 0.5 0.5 0.5 0.5 
##$DBPOFFS= (0..7)
0 0 0 0 0 0 0 0 
##$DE= 6
##$DECBNUC= <off>
##$DECIM= 32
##$DECNUC= <off>
##$DECSTAT= 4
##$DIGMOD= 1
##$DIGTYP= 9
##$DL= (0..7)
0 120 120 120 120 120 120 120 
##$DP= (0..7)
150 150 150 150 150 150 150 150 
##$DP07= 0
##$DPNAME0= <>
##$DPNAME1= <>
##$DPNAME2= <>
##$DPNAME3= <>
##$DPNAME4= <>
##$DPNAME5= <>
##$DPNAME6= <>
##$DPNAME7= <>
##$DPOAL= (0..7)
0.5 0.5 0.5 0.5 0.5 0.5 0.5 0.5 
##$DPOFFS= (0..7)
0 0 0 0 0 0 0 0 
##$DQDMODE= 0
##$DR= 18
##$DS= 0
##$DSLIST= <SSSSSSSSSSSSSSS>
##$DSPFIRM= 0
$$ [...]
##$SUBNAM0= <"">
##$SUBNAM1= <"">
##$SUBNAM2= <"">
##$SUBNAM3= <"">
##$SUBNAM4= <"">
##$SUBNAM5= <"">
##$SUBNAM6= <"">
##$SUBNAM7= <"">
##$SUBNAM8= <"">
##$SUBNAM9= <"">
##$SW= 18.0517599122864
##$SWIBOX= (0..15)
0 0 2 0 0 0 0 0 0 0 0 0 0 0 0 0 
##$SW_h= 3612.71676300578
##$TD= 16384
##$TD0= 1
##$TE= 0
##$TE2= 300
##$TE3= 300
##$TEG= 300
##$TL= (0..7)
0 120 120 120 120 120 120 120 
##$TP= (0..7)
150 150 150 150 150 150 150 150 
##$TP07= 0
##$TPNAME0= <>
##$TPNAME1= <>
##$TPNAME2= <>
##$TPNAME3= <>
##$TPNAME4= <>
##$TPNAME5= <>
##$TPNAME6= <>
##$TPNAME7= <>
##$TPOAL= (0..7)
0.5 0.5 0.5 0.5 0.5 0.5 0.5 0.5 
##$TPOFFS= (0..7)
0 0 0 0 0 0 0 0 
##$TUNHIN= 0
##$TUNHOUT= 0
##$TUNXOUT= 0
##$USERA1= <user>
##$USERA2= <user>
##$USERA3= <user>
##$USERA4= <user>
##$USERA5= <user>
##$V9= 5
##$VALIST= <valist>
##$VCLIST= <CCCCCCCCCCCCCCC>
##$VD= 0
##$VDLIST= <DDDDDDDDDDDDDDD>
##$VPLIST= <PPPPPPPPPPPPPPP>
##$VTLIST= <TTTTTTTTTTTTTTT>
##$WBST= 1024
##$WBSW= 4
##$XGAIN= (0..3)
0 0 0 0 
##$XL= 0
##$YL= 0
##$YMAX_a= 146628
##$YMIN_a= -110664
##$ZGOPTNS= <>
##$ZL1= 120
##$ZL2= 120
##$ZL3= 120
##$ZL4= 120
##$ABSF1= 10
##$ABSF2= 0
##$ABSG= 5
##$ABSL= 3
##$ALPHA= 0
##$AQORDER= 0
##$ASSFAC= 0
##$ASSFACI= 0
##$ASSFACX= 0
##$ASSWID= 0
##$AUNMP= <proc_1d>
##$AZFE= 0.1
##$AZFW= 0.1
##$BCFW= 1
##$BC_mod= 2
##$BYTORDP= 1
##$COROFFS= 0
##$CY= -3
##$DATMOD= 1
##$DC= 2
##$DFILT= <>
##$DTYPP= 0
##$F1P= 0
##$F2P= 0
##$FCOR= 0.5
##$FTSIZE= 0
##$FT_mod= 4
##$GAMMA= 1
##$GB= 0.15
##$INTBC= 1
##$INTSCL= 1
##$ISEN= 128
##$LB= 0.25
##$LEV0= 0
##$LPBIN= 0
##$MAXI= 10000
##$MC2= 0
##$MEAN= 0
##$ME_mod= 0
##$MI= 1.114404
##$NCOEF= 0
##$NC_proc= 0
##$NLEV= 6
##$NOISF1= 3.799351
##$NOISF2= 2.8
##$NSP= 1
##$NTH_PI= 0
##$NZP= 0
##$OFFSET= 14.38212
##$PC= 1
##$PHC0= -4226.068
##$PHC1= 22.79229
##$PH_mod= 1
##$PKNL= yes
##$PPARMOD= 0
##$PSCAL= 0
##$PSIGN= 0
##$REVERSE= no
##$SF= 200.129724274929
##$SI= 16384
##$SIGF1= 3
##$SIGF2= 2
##$SINO= 400
##$SIOLD= 16384
##$SREGLST= <1H.CDCl3>
##$SSB= 0
##$STSI= 0
##$STSR= 0
##$SW_p= 3205.1282051282
##$SYMM= 0
##$S_DEV= 0
##$TDeff= 0
##$TDoff= 0
##$TI= <>
##$TILT= no
##$TM1= 0
##$TM2= 0
##$TOPLEV= 0
##$USERP1= <user>
##$USERP2= <user>
##$USERP3= <user>
##$USERP4= <user>
##$USERP5= <user>
##$WDW= 1
##$XDIM= 8192
##$YMAX_p= 0
##$YMIN_p= 0
$$ End of Bruker specific parameters
$$ ---------------------------------
##NTUPLES= NMR FID
##VAR_NAME=  TIME,          FID/REAL,        FID/IMAG
##SYMBOL=    X,             R,               I
##VAR_TYPE=  INDEPENDENT,   DEPENDENT,       DEPENDENT
##VAR_FORM=  AFFN,          ASDF,            ASDF
##VAR_DIM=   8192,          8192,            8192
##UNITS=     SECONDS,       ARBITRARY UNITS, ARBITRARY UNITS
##FACTOR=    0.0002768,     1,               1
##FIRST=     0,             0,               0
##LAST=      2.2672688,     0,               0
##MIN=       0,             -110664,         0
##MAX=       2.2672688,     146628,          0
$$ Real data points
##PAGE= N=1
##DATA TABLE= (X++(R..R)), XYDATA
0@%%%%%%%%%%%%%%%lJ1j6J6j6J7k5L2l6M4n2O0p2Q6r8J12j28J47j69J92k18K47
$$ 0 0 0 0 0 0 0 0 0 0 0 0 0 0 0 0 -3 8 -8 8 -8 9 -16 16 -20 24 -28 32 -40 46 -52 60 -68 79 -90 102 -116 131
37A31k79L13l50L91m36M88n43O01o66P38q16R00r92J091j201J323j456J605j770
$$ 131 -148 165 -185 206 -230 258 -285 316 -350 388 -428 472 -520 571 -630 693 -763 842 -928
56i28J953k157K388k654K957l309L729m229M839n605O588p887R617j8914J01640
$$ -928 1025 -1132 1256 -1398 1559 -1750 1979 -2250 2589 -3016 3572 -4315 5302 -13612 88028
71H8028j98692O9858J22739j30386J01837j4246o5875N3156p328n6649J02596
$$ 88028 -110664 -40806 81933 -48453 53384 39138 -26737 26419 19091 -37558 65038
82F5038n0729m3624J04055p2895L1498J5601n1611N0774n3798L6378L142p685
$$ 65038 14309 -29315 74740 1845 33343 48944 -2667 48107 -5691 30687 33829 26144
94B6144J8414l9267L8993l5926p38K3692k5781K1226m129J384k2515J3738k5546
$$ 26144 44558 5291 44284 8358 7620 31312 5531 26757 22628 24012 1497 15235 -10311
107a0311J5500L8550p2485O7764m0002l9637Q5953q6583K6047L6787m5058K2749
$$ -10311 5189 43739 -28746 39018 -984 -40621 45332 -41251 -15204 21583 -23475 -726
119g26j412k2897K10K8440l6748L5085m934m7525P4140o3960M261M5516m5066
$$ -726 -2138 -25035 -24825 3615 -33133 1952 -2982 -50507 23633 -40327 -36066 9450 -35616
132c5616L1388j8116O622q96n454P254p081K9227l5439L0945j922l7652M0177
$$ -35616 -4228 -22344 -15722 -16618 -22072 -14818 -21899 7328 -28111 2834 912 -36740 3437
145C437j5282J1473j3106R930J0864k2780K6529k8688L0433o644j6273M2801m4310
$$ 3437 -11845 -372 -13478 -3548 7316 -15464 11065 -17623 12810 6166 -10107 32694 -11616
158a1616J8293N637q282P601j0906K1121j8237J4872j8627O899K1153m0523M4747
$$ -11616 6677 12314 4032 11633 727 21848 3611 18483 -144 6755 27908 -12615 32132
171C2132k1957p223K4990k6796J5785j4757J3705o758m00O922k4403L3034l0147
$$ 32132 10175 2952 27942 1146 16931 2174 15879 9121 8721 15643 -8760 24274 -5873
184e873J2136R288k8676L7253k4878J931k40j185P321j7050K2100k4436J7633
$$ -5873 6263 15551 -13125 24128 -750 1181 941 -244 7077 -9973 12127 -12309 5324
197E324p653j5550L1510l9833K8908K880k1751J5579j0088J3981j9829J2889k159
$$ 5324 -2329 -17879 13631 -26202 2706 5586 -16165 -586 -10674 3307 -16522 -3633 -5792
210e792k891J3858l1526L2873k0689m742K8267k5086J4976j1001J3654o721j2100
$$ -5792 -8683 5175 -26351 6522 -14167 -18909 9358 -15728 -752 -11753 1901 -4820 -16920
223a6920K0309j3427K0230k3418J0344J0187k9444L0012j5947P104J212k961J2003
$$ -16920 3389 -10038 10192 -13226 -2882 7305 -22139 7873 -8074 -970 242 -2719 9284
236I284k2236J9017j2270J4968j945j8899L3649l0986J1138L742j2415J6947j0378
$$ 9284 -12952 6065 -6205 8763 6818 -12081 21568 -9418 1720 5462 -6953 9994 -384
249c84J2527j6222R604k601n927K1121k8009K7518j0697j0568K0022k7796K0340
$$ -384 12143 -4079 5525 2924 -3003 18118 -9891 17627 6930 -3638 16384 -11412 8928
262H928l870Q50r25n566J2303j9221J8071j4541R191J1069k6390K7913k2504J234
$$ 8928 5058 5908 4983 -583 11720 -7501 10570 -3971 5220 16289 -10101 17812 -4692 -3458
276c458J0783r126R501j5246J7884j2583j078K896r380K5781k6530J3417L346
$$ -3458 7325 -1801 7700 -7546 10338 -2245 -3323 -427 -9807 15974 -10556 2861 6207
289F207j7419J4811j1920J2782j2956P683N535j5977J2563j9165K3383p655j2001
$$ 6207 -11212 3599 -8321 4461 -8495 -812 4723 -11254 1309 -17856 5527 -2128 -14129
302a4129K4768k0783J0020o944K625J974n808J5799j7553J3361j4169L172J5837
$$ -14129 10639 -10144 -124 -7068 -4443 -2469 -8277 7522 -10031 3330 -10839 -7667 8170
315H170k6765K4665q537l20O011j3201J2844r608J3239r070K994M900j6328K2134
$$ 8170 -18595 6070 -2467 -2787 3224 -9977 2867 -6741 6498 -2572 422 5322 -11006 11128
329A1128k1613R775Q316j3951J7706j5671O945l429M349L219j1613J8470j6715
$$ 11128 -10485 -710 7606 -6345 11361 -4310 2635 -794 3555 6774 -4839 13631 -3084
342c084J1133o340r496K2201j9771J2957k528l678K969o447J3820j7399J3388
$$ -3084 8049 1709 -7787 14414 -5357 7600 5072 1394 4363 -2084 11736 -5663 7725
355G725j961l068Q518k2873K2570r050n403J1195q964Q544j2634J1866p813j875
$$ 7725 5764 2696 11214 -11659 10911 1861 -3542 7653 -1311 7233 -5401 6465 -1348 -3223
369c223J0975j2777J6989k0086O704R960j8761J3380q464Q570n518k268N469j1716
$$ -3223 7752 -5025 11964 -8122 -1418 8542 -10219 3161 -5303 3267 -2251 -4519 950 -10766
383a0766J4889j3530J1517j809j2284K0842j8341O088q94o70P317j0813R654j1881
$$ -10766 4123 -9407 2110 301 -11983 8859 -9482 -3394 -4288 -4958 2359 -8454 1200 -10681
397a0681J0677l940n656J5616j7133J5865o338n241R289r806J1603q819O854m557
$$ -10681 -4 -3944 -9600 6016 -11117 4748 -1590 -6831 2458 -7348 4255 -4564 2290 -2267
411b267j347J0271j6514J4954q628N096O628j6189J6004q948L674r46n26N706
$$ -2267 -3614 6657 -9857 5097 -3531 1565 8193 -7996 8008 -940 2734 1788 1262 6968
425F968j0932J4632j3318M291K619p903J7608j7898P496L253n484L962q689J3746
$$ 6968 -3964 10668 -2650 1641 4260 -3643 13965 -3933 3563 6816 1332 5294 -3395 10351
439A0351j1091N486Q21q401J0268j4260J4632o108o157J2408r776P035j0339P101
$$ 10351 -740 4746 5567 -2834 7434 -6826 7806 1698 -4459 7949 -1827 5208 -5131 1970
453A970J320n253P782j2022J2562j0206j53R554j5263J2884n442J956k296l297
$$ 1970 3290 -1963 5819 -6203 6359 -3847 -4000 5554 -9709 3175 -2267 -311 -2607 -5904
467e904Q459r432J0483j0126N218M685j3167J3395j2411O834K497o980P635r037
$$ -5904 2555 -6877 3606 -6520 -1302 3383 -9784 3611 -8800 -1966 531 -6449 1186 -7851
481g851Q466o136M260L69n914J3253j3011Q666m951l681J3011j3018P597l312
$$ -7851 615 -5521 -1261 -892 -6806 6447 -6564 2102 -2849 -6530 6481 -6537 1060 -2252
495b252L539j162n376J0762j1381J0807l841j313O456j2259J3677p118k36K005
$$ -2252 1287 125 -5251 5511 -5870 4937 1096 -217 6239 -6020 7657 539 303 2308
509B308j245O977j3220R775l999M65N086r235J3109j2031M175M336q707O407m767
$$ 2308 1063 8040 -5180 4595 596 1061 6147 -3088 10021 -2010 2165 6501 -2206 4201 -566
524e66P781p516P48K481n700J0051j3105R478O27p996R725j0084O224l427K523
$$ -566 7215 -301 447 2928 -2772 7279 -5826 3652 4279 -3717 6008 -4076 2148 -1279 1244
539A244J907p547Q203q666O993n084k314R860j0381R662p692R53M659o720P409
$$ 1244 3151 -4396 3807 -4859 2134 -2950 -5264 4596 -5785 3877 -3815 -2862 1797 -4923 2486
554B486q126P789m776n24N121j1103J1735o263K269K767q019Q371n386M490n309
$$ 2486 -5640 2149 -2627 -3151 1970 -9133 2602 -3661 -1392 1375 -6644 1727 -3659 831 -4478
569d478M039M507j0069R902q968M871N09n490R760r812O299q35j204J479m678
$$ -4478 -439 4068 -6001 3901 -5067 -196 313 -5177 4583 -5229 1070 235 -969 510 -4168
584d168J0256p394L214k007j175P421j2011J0175l555j401M913n518N032p825
$$ -4168 6088 -1306 1908 -99 -1274 6147 -5864 4311 756 -645 4268 -1250 3782 -4043
598d043P796j165k901N727q323J0185p203j409N872n807O033o445M829l903R4
$$ -4043 3753 2588 -313 5414 -2909 7276 73 -1336 4536 -1271 4762 -1683 3146 -757 -663
613f63N293p913Q912p860M884J687r254R301o943N274j809k867M018m753N378
$$ -663 4630 -3283 5629 -2231 2653 4340 -4914 4387 -2556 2718 909 -1958 2060 -2693 2685
628B685p669N785l26m083Q460j0102O603k724j087M884p202O452n210M474k735
$$ 2685 -4984 801 475 -3608 4852 -5250 1353 -1371 -2458 2426 -4776 1676 -3534 940 -1795
643a795m255Q609o610N476l961M82L969o960O907m914L444j476j39M080r331Q609
$$ -1795 -6050 2559 -4051 1425 -2536 -2054 1915 -5045 1862 -3052 392 -1084 -1223 2857 -6474 2135
659B135m338J643K072p105J0925p369J179J435j383L151m753P182p258K632J674
$$ 2135 -2203 -560 1512 -5593 5332 -2037 -858 577 -806 2345 -2408 4774 -2484 148 1822
674A822m237O886q590P213p06l585L930n570P814n768K518J202m097N954p147
$$ 1822 -2415 4471 -4119 3094 2388 -1197 2733 -2837 4977 -791 1727 2929 -1168 4786 -2361
689b361N845m025j97N443p010N349m884L621O9l059M649n626P433n809l90M083
$$ -2361 3484 -541 -738 4705 -2305 3044 -1840 1781 1850 -1209 3440 -2186 5247 -562 -952 3131
705C131o648P319n514K026N64l143M581n329N036m565L226J743o459O448n818
$$ 3131 -3517 3802 -1712 314 878 -2265 2316 -3013 2023 -2542 684 2427 -4032 2416 -3402
720c402N212k331l352O703o253M087l512J550Q82l156O730o934M229j838l61M370
$$ -3402 1810 -521 -3873 2830 -3423 664 -2848 -1298 -416 -3572 3158 -3776 453 -1385 -1746 2624
736B624q111O886k240P17p48k463N788o760N766k277p89L937n673P072n877J501
$$ 2624 -5487 1399 -841 -124 -872 -3335 2453 -4307 1459 -818 -1607 2330 -3343 3729 -2148 -647
752f47K461k636L741o104N538k571k24K098m136O961o000L342J82m019N775m913
$$ -647 1814 -822 2919 -3185 2353 -218 -442 1656 -2480 4481 -1519 1823 2005 -2014 3761 -1152
768a152M434l295Q86K155m141M386o159N158j39l395M436n436N648l415K75J943
$$ -1152 3282 -13 873 3028 -1113 3273 -2886 2272 2133 -1262 3174 -2262 3386 -29 246 2189
784B189l383M710n442M199k614j434M979n675M848m269K039J715n054N120l511
$$ 2189 -1194 3516 -1926 2273 -341 -1775 3204 -2471 2377 -1892 147 1862 -3192 1928 -1583
799a583M031l412j09L542o125N617m270K174M05l790O328n791K376j513J784J679
$$ -1583 2448 -964 -1073 2469 -3656 1961 -2309 -135 270 -3520 2808 -2983 -607 -2120 -336 1343
815A343n097O047m665K344n78k258M898n798M788j882j072J871k771N226n284
$$ 1343 -3754 2293 -2372 -28 -606 -2864 2034 -3764 1024 -858 -1930 -59 -2830 2396 -2888
830b888L337j37j316L569n964N255k363M07J961l879M330m161L234j212j316L643
$$ -2888 449 312 -1004 2565 -3399 1856 -507 -100 1861 -2018 2312 -1849 1385 173 -1143 2500
846B500m049N389m637Q64K794l853M324m754L400p77j365K040l962N489m161K354
$$ 2500 -1549 3840 -797 67 2861 -992 3332 -1422 1978 1201 -164 1876 -2086 3403 -758 1596
862A596M47l728M733m643L871k229q45L749m113L049m100L041j16k833M295m672
$$ 1596 2043 -1685 3048 -1595 2276 47 -798 2951 -1162 1887 -2213 828 712 -2121 2174 -2498
878b498M457k812l69K858m519N028k645J314j862o96M251n429L598k366J058J730
$$ -2498 1959 -853 -1222 1636 -2883 2145 -500 814 -1048 -1744 2507 -2922 676 -1690 -632 1098
894A098m327M732l805K288P3j370K708m591N007l228N93P68k551N387n342K660
$$ 1098 -3229 1503 -2302 -14 59 -1311 1397 -3194 1813 -1415 -822 -54 -2605 2782 -2560 100
910A00k11j155K725l807M140k785J537J52k590L857m550M217j317j442K811l179
$$ 100 -111 -1266 1459 -2348 1792 -993 544 696 -1894 1963 -2587 1630 313 -1129 1682 -1497
926a497L543l115J172J056j555L345n063M094j790l09K320l607L999l608J976
$$ -1497 2046 -1069 103 1159 -396 2949 -2114 1980 190 -119 2201 -1406 2593 -1015 961
941I61L24k771L407k651L561l408N65K360l820L898l917K728j74k144K892l516
$$ 961 1285 -1486 1921 -730 2831 -577 -12 2348 -1472 2426 -1491 1237 1063 -1081 1811 -1705
957a705K522k014J654N71l211M604l423K073j522q55L703m253K853k193Q78L86
$$ -1705 817 -1197 457 1028 -2183 2421 -1002 1071 -451 -1306 2397 -1856 997 -1196 -318 68
973F8k419L929l782K759j108m03J630l727N001k524O6P56j738K950l705K434j213
$$ 68 -2351 1578 -2204 555 -553 -956 674 -3053 1948 -576 -510 246 -1492 1458 -2247 187 -1026
990a026K98K010l801M038l223J701P42j900K707l189L492k145m50J469k457L972
$$ -1026 -728 1282 -2519 1519 -1704 -3 739 -1161 1546 -1643 1849 -296 -746 723 -1734 2238
1006B238l783J935j36j351L353m192L532j604J39J487k339K495l433L386j207
$$ 2238 -1545 390 254 -1097 2256 -1936 1596 -8 131 1618 -721 1774 -1659 1727 520
1021E20j652K999l070L338k821P17J286k152K586k748K499j326p83K560l353K796
$$ 520 -1132 1867 -1203 2135 -686 31 1317 -835 1751 -997 1502 176 -607 1953 -1400 1396
1037A396k281J887k90k865L798k556K099j707R9J950k757K778l015J849J91j971
$$ 1396 -885 1002 712 -2153 1645 -911 1188 -519 -420 1530 -1227 1551 -1464 385 576 -1395
1053a395L149l832K256q72L50O88k271L576l006J863r26j006L158l710K628j403
$$ -1395 1754 -2078 178 -694 -344 344 -1927 1649 -1357 506 -420 -1426 1732 -1978 650 -753
1069g53L02J085k617L082k869J732J73o51J584l090L350j768K24Q08j922L061
$$ -753 -451 634 -1983 1099 -1770 -38 135 -516 1068 -2022 1328 -440 -216 592 -1330 1731
1085A731l176J958o27p46J994k649L018k535J155J249k355K096k081K398r28o86
$$ 1731 -1445 513 -114 -860 1134 -1515 1503 -1032 123 1372 -983 1113 -968 1430 502 -184
1101a84J297k179L047k967J397L97j746K620k756K178j338j0K206k854K032j722
$$ -184 1113 -1066 1981 -986 411 808 -938 1682 -1074 1104 -234 -244 1962 -892 1140 -582
1117e82J519o51j492K470k321K456j931J36J536k605K559j683R08j40o02J923
$$ -582 937 286 -1206 1264 -1057 1399 -532 -396 1140 -1465 1094 -589 319 179 -423 1500
1133A500l178K480j339P24K84k147K921k173J518p84r24K306k260K087j631Q14
$$ 1500 -1678 802 -537 187 471 -1676 1245 -928 590 -194 -1118 1188 -1072 1015 -616 198
1149A98Q5j449K393l137K470l90q22J441k292K352j215N55l65q82K443l175K411
$$ 198 283 -1166 1227 -1910 560 170 -652 789 -1503 849 -366 189 -176 -1058 1385 -1790 621
1166F21q53n25J809k258K225k198J074O00j095J429k043K803j723j73J322k233
$$ 621 -232 -757 1052 -1206 1019 -1179 -105 495 -600 829 -1214 1589 -134 -307 1015 -1218
1182a218K932k615J519n7j678K260j706J468j534R04J297k235K052k154J510o7
$$ -1218 1714 -901 618 561 -1117 1143 -563 905 -629 275 1572 -663 1389 -765 745 678
1198F78j245J948k120J652j421K49R12j700K278k057J416r86J07J795k565K066
$$ 678 -567 1381 -739 913 -508 -259 653 -1047 1231 -826 590 -396 -289 1506 -1059 1007
1214A007j512R04J46j971K444k050J956j265k69J429k505K844k144O89K25o23
$$ 1007 -505 399 545 -1426 1018 -1032 924 -341 -610 819 -1686 1158 -986 -297 -72 -695
1230f95J885k508J671p99K10P08k024K566j685K72K16m53J543k002J827r69j63
$$ -695 1190 -1318 353 -446 -236 472 -1552 1014 -671 -399 -183 -636 907 -1095 732 -237 -400
1247d00N45p69J751k262J077L20r47J416k083K032r68K98M61q00J296j592J591
$$ -400 145 -624 1127 -1135 -58 262 -685 731 -1352 680 -288 10 471 -329 967 -625 966
1264I66j001o06J548j554J641j661P26Q15j691J863j689J487o37k19J060j309
$$ 966 -35 -641 907 -647 994 -667 59 874 -817 1046 -643 844 207 -12 1048 -261
1280b61J289j143O85l67r01J656j580J031r50N02J093j998J907j497J125k30q74
$$ -261 1028 -115 570 203 -698 958 -622 409 -541 -39 1054 -944 963 -534 591 361 -513
1297e13J567j856J318q82Q4N49j452K099j608N19L8l57J286j909J555q01K88M61
$$ -513 1054 -802 516 -366 -282 267 -1185 914 -694 -175 -137 -494 792 -1117 438 -363 -75 386
1315C86j714J877j078N18k18n84J117j185J706j235j6Q00j010J735j985R01L08
$$ 386 -1328 549 -529 -11 -229 -813 304 -881 825 -410 -426 374 -636 1099 -886 15 323
1332C23n79M92j228J657j423P24M85j042R93j159J376q28k87J254j123J165j260
$$ 323 -256 236 -992 665 -758 -34 451 -591 402 -757 619 -209 -496 758 -365 800 -460
1349d60O59L38j252J502j489J278o47j67Q81j406J450j120J108m74o96J178j133
$$ -460 199 537 -715 787 -702 576 -71 -238 643 -763 687 -433 675 201 -495 683 -450
1366d50J300j255N01M93r45J109j075O86j99l91J376j893J512q27n8K72q70J427
$$ -450 850 -405 96 589 -356 753 -322 364 165 -226 1150 -743 769 -58 -116 156 -714 713
1384G13j171O35l75q7P21j192J286q15L91J18o31J006j374R57m43l77P31j333
$$ 713 -458 177 -198 -285 436 -756 530 -285 106 224 -407 599 -775 182 -261 -638 93 -1240
1402a240J748q32Q6L06n34R98j284J248q37K71M96j151J534j493O68N9j132J391
$$ -1240 508 -324 -238 68 -466 532 -752 496 -341 -70 426 -725 809 -684 -16 43 -1089 302
1420C02r64J118r51J27R64q54P44j359J288k31m92N83q07J017q61N34J75q26J014
$$ 302 -662 456 -495 -368 596 -258 486 -873 415 184 -308 275 -532 485 -376 158 333 -493 521
1439E21p35P81o36k36J221r28O75q11K82L18r87J163j076P15j36j59O32j344J165
$$ 521 -214 567 -69 -305 916 -12 663 -148 134 452 -535 628 -448 267 131 -28 604 -740 425
1458D25o81M14o7p28J126j047Q50l69j13K90o52J130j090N86O5n88Q95j101J162
$$ 425 -256 158 91 -637 489 -558 292 -77 -190 100 -552 578 -512 74 139 -449 446 -655 507
1477E07k97l79M34j068J349j347J049m44j51N00p28Q24q47J88N44n67J092j247
$$ 507 210 -169 265 -803 546 -801 248 -196 -347 153 -575 249 -598 -410 134 -433 659 -588
1495e88P29J47r99R36q32J288j056J16L87m72R35j055O20j90l09J038j023R63
$$ -588 141 288 -711 225 -607 681 -375 -259 128 -344 591 -464 156 -34 -343 695 -328 635
1513F35j031M71L74q86R38o58N90k53n26Q88r03R81p94L57M3m21J013j139P04
$$ 635 -396 75 449 -437 501 -157 433 180 -346 542 -361 620 -174 183 226 -195 818 -321 383
1532C83m02M0P27j122N15l32N44p12jP35r08R12l49k97N08p33Q99p37K10o2K27
$$ 383 -19 21 748 -374 141 -191 353 -359 -360 375 -533 379 30 -267 241 -492 407 -330 -120 -182 45
1553D5K47r86J163n18j62L04n81R12q10N48%q3J00l19M34m18K17M6j92N46p53
$$ 45 292 -694 469 -49 -211 93 -488 424 -386 162 162 79 179 -140 294 -124 93 139 -53 493 -260
1574b60O92k24m69M56n85J020j278L56J30k21Q66r11O85l95k46O28n25N38o69
$$ -260 432 208 -261 195 -390 630 -648 -292 -162 -383 483 -428 257 -138 -384 244 -281 257 -412
1593d12Q05l94k70N65o31O55r42M95M58p51O71o04L39J44k40M46m78M05n95N57
$$ -412 393 -1 -271 294 -337 318 -624 -129 329 -422 249 -355 -16 128 -112 334 -144 261 -334 223
1613B23L73j181P74o11N90n11K16L59n11O79q25N92M5l74Q12q84K30p4j19N84
$$ 223 596 -585 189 -422 168 -343 -127 232 -279 400 -425 167 212 -162 650 -234 -4 -78 -197 387
1633C87q92P58m99J67J32k48L12j90J79m34j34N85m07P67j025N56j12k58N25l37
$$ 387 -505 253 -246 -79 53 -195 117 -73 106 -328 -462 123 -284 483 -542 14 -98 -356 169 -168
1653a68M78l03K6L10o94P01n12M06l58M3L41n28L13m12L39K43o14M02m16P02r8
$$ -168 310 7 33 343 -351 350 -162 244 -114 -71 270 -258 55 -357 -18 225 -389 13 -403 299 201
1674B01n84N59j19N26o36m2M11p40Q10o01L23m71J86P99o92L80j57K05k30m66
$$ 201 -383 176 57 583 -53 -95 316 -424 386 -215 108 -363 -177 622 -70 310 153 358 128 -338
1694c38P31n34K62O7k41L26m59N76m38N6K09k97L24o35M87l44K33J29m57O30n54
$$ -338 393 -141 121 188 -53 273 -186 390 -48 8 217 -80 244 -391 96 -248 -15 114 -343 287 -267
1715b67L76k75K26J34m23L03j86K44r7q2N09p30L32N7n15N93o20O37m81J98J81
$$ -267 109 -166 60 194 -229 74 -112 132 35 -47 462 -268 64 121 -394 199 -421 216 -265 -67 114
1736A14l87N83l65L06r7j61J06l82O60o89Q2M62k36O0m18O90l54J02M9k17L70
$$ 114 -273 310 -55 251 154 -7 99 -283 377 -312 -230 232 -4 56 -362 328 -26 76 125 -92 278
1757B78n10K81N5l73J50j17M83k24j05L75o73M86k82J99J62k98N49n49N97n93
$$ 278 -232 49 104 -269 -119 -236 247 23 -82 293 -380 106 -176 23 185 -113 436 -113 484 -109
1777a09R4L14m69K38j09P5J96l71M26n65M02k88R7J22m49P66n92M23j54j30N3
$$ -109 -15 299 -170 68 -41 34 230 -141 285 -280 122 -166 -69 53 -396 370 -222 201 47 -83 -30
1798c0r7L37n7J74j30n03P92o57M76j53l00O6r7K24m39M80p2k81M40l27M04rm81
$$ -30 -127 210 153 327 197 -306 486 -171 305 152 -148 -82 -179 45 -394 86 14 -267 173 -154 250 241 -240
1821b40K44j66M17m43J20K14k73M00o38M80k03J33q0j92M85m66J37M9jM8j86O8
$$ -240 4 -162 255 -188 -68 146 -127 273 -365 115 -88 45 -35 -227 258 -208 -71 -22 -23 25 -161 -93
1843i3j73Q7L67k70L21o79N31j1l70N01n52O37m22L45R4n61K87k74K85j98K60
$$ -93 -266 -179 188 -82 239 -440 91 80 -290 211 -341 296 -126 219 313 -248 39 -235 50 -148 112
1864A12l4l51N05l90L37N0l07K95k35K62j02n9p7k41M03n63O56l70K53M9l27K21
$$ 112 78 -273 232 -158 179 229 -78 217 -18 244 142 83 6 -235 168 -395 261 -109 144 193 -134 87
1886H7j81o0j6r9M58k33N7qn8j2m65R60p19J72J73j59M76o63N67m8k09J58n15
$$ 87 -94 -154 -170 -269 189 -44 13 5 -53 -65 -530 430 -289 -117 56 -103 373 -290 277 229 20 178 -337
1909c37M23l31J85M14o01P10o03K50Mk75K72l85N06m06K74k3m37L11j41N53o41
$$ -337 86 -245 -60 354 -247 463 -140 110 114 -161 111 -274 232 -174 100 77 -360 -49 -190 363 -278
1930b78L53R9l52M62n05M55k56l64M61k59K29k10J58j20J63M2k99N48m45L89j51
$$ -278 75 174 -178 284 -221 234 -22 -386 75 -184 45 -165 -7 -127 36 78 -221 327 -118 271 120
1951A20m40N62l40K09j41j22M93k89m9r6j56P78q22M19j22q4L56k68L42n38K19
$$ 120 -320 242 -98 111 -30 -152 341 52 3 -93 -249 529 -293 126 4 -80 276 8 350 -188 31
1972C1l0L8j29j08M71m32K25j64l05M34j86L19J5k57L39j61J17l73O32l60k8J07
$$ 31 1 39 -90 -198 273 -159 66 -98 -403 31 -155 164 179 -78 261 100 217 -156 476 116 88 195
1994A95k23L39m25q1L19j72J43k34J53P8l10K94j44K15l68O24n12K03J96n68L85
$$ 195 -28 311 -114 -195 124 -48 95 -139 14 92 -218 76 -68 147 -221 403 -109 94 290 -278 107
2015A07k47J0K52k31J0J83J21p5n48O88m58L24j29O5L20n17L01k59K62J0o72N93
$$ 107 -140 -130 122 -109 -99 84 205 130 -418 270 -188 136 7 72 392 -125 176 -83 179 189 -483 110
2037A10n6R6l50J62L47k77K80l31K04l41KM51l51L53m37J04K84o94O24l15K78
$$ 110 54 150 -200 -38 309 32 312 -19 185 -156 -154 297 -54 299 -138 -34 250 -444 180 -135 143
2058A43q5o5J52l37L84K4l41K3J28J20k83Q8J02j40J83l88N26l26oJ57l62J90
$$ 143 58 -7 145 -192 192 216 -125 -102 26 146 -137 -49 53 -87 96 -292 234 -92 -98 59 -303 -113
2080a13Q7M4j50j13J95r3N26n81O9lO1L44j56j07K70l61K31m11J90O06l58j71
$$ -113 -26 18 -132 -245 -50 -143 383 -198 -129 -132 -71 273 117 10 280 -81 150 -261 -71 535 177 6
2102Fj31L33k55N4Q5p2l8L3l9m2J58k28L02pm42M76k82M21k39k64N79n79K06M5
$$ 6 -125 208 -47 7 92 20 -18 15 -24 -66 92 -136 166 159 -283 193 -89 332 93 -171 408 -171 35 80
2126H0o7K0k96N02l03O3J1j34Q3j63L70r1K84n20Q3j44N2K43qQKp3J87l48Q4Q8
$$ 80 13 33 -263 239 -64 -1 10 -124 -41 -204 166 75 359 -161 -78 -222 -170 73 65 73 75 2 189 -159 -75 13
2152A3l6j3J13J47j79k36L10k80K68k35Q6k9P6L9j98N09l42j40L39p8J21n30j01
$$ 13 -23 -36 77 224 45 -191 119 -161 107 -128 -42 -71 5 44 -154 355 13 -127 212 134 255 -275 -376
2175c76L09m7J99k49Q0K2J65r5k2K6k66O33j64l9j24lr5j29J53L9m2M13l33j10
$$ -376 -67 -114 85 -164 -84 -62 103 8 -14 12 -254 379 215 176 52 49 -46 -175 -22 17 -25 388 55 -55
2199e5m2k7K48j43M0j84K62j59J0L2n7J66p8q0L02l52rL4K08l04J20K46k59j7
$$ -55 -97 -124 124 -19 21 -163 99 -60 -50 -18 -75 91 13 -67 235 -117 -126 -92 116 -188 -68 178 -81 -98
2223i8P5J08n8j54L11m61L72l20J70N9m4L76n92K6K42j19M33n26L40j16k15J21
$$ -98 -23 85 27 -127 184 -277 95 -225 -55 4 -40 336 -256 -230 12 -107 326 -200 140 24 -191 -70
2245g0j24L07j35P5K7j59K82l46K68J38m26J75j21K02l65K25k16K70J12o05N50
$$ -70 -194 113 -22 53 80 -79 203 -143 125 263 -163 12 -109 93 -272 -47 -263 7 119 -486 64
2266F4K0l91N27o7k30p2K34J28j19K71l62J97j92j87J56R7O9j82L12j96j6J9k78
$$ 64 84 -307 220 153 -77 -149 85 213 94 365 3 200 8 -179 -23 74 143 -39 273 77 61 80 -198
2289a98L10j35k6N8nK8P0j41K33j45l8j31K4k3J28j53j63M08Kj67K60l08J82q0
$$ -198 112 -23 -49 9 4 32 102 -39 194 49 11 -120 -96 -119 9 -144 -307 101 103 -64 196 -112 70 -10
2313a0j48L74o1n48K72M58k26j19n3l0K76j59R0l99J82J65j94k0R9K31l12J23
$$ -10 -158 216 155 -393 -121 337 111 -8 -61 -91 185 26 116 -283 -101 64 -130 -150 -51 180 -132 -9
2335ip3M4J1j37K32M0r9J46k07j46K01J41j28lj67K31j16j10K12R5k48K56l66
$$ -9 -82 -38 -27 -164 68 108 9 155 -52 -198 3 144 16 13 -154 77 -39 -149 63 158 -90 166 -200
2358b00J01J22M04j42j8l15J08L3m96K71K02l00N01j27n5k5K7R5l23K96J99m59
$$ -200 -99 23 427 285 267 -48 60 93 -403 -132 70 -230 271 144 89 64 91 186 -137 159 358 -101
2380a01J98J99k66j22r3M52l65L15k58j12M21l40L78m29L52j67j09K3k21K39j41
$$ -101 97 296 30 -92 -185 267 -98 217 -41 -153 268 -72 306 -123 229 62 -47 -24 -245 -6 -147
2401a47L2J98k20M82k20k56q2L72j39L8l4k32J42J94L9o7l75J82K36j45j66J88
$$ -147 -115 83 -137 345 125 -131 -213 159 20 58 24 -208 -66 128 167 100 -275 -93 143 -2 -168 20
2423B0L7m2J04k12J42N4r7o8J68j25P7l1K23k70K70k97r5q3K32J60k02K09p7j21
$$ 20 57 15 119 -93 49 103 6 -62 106 -19 58 27 250 -20 250 -47 -142 -225 7 167 -35 174 97 -24
2447b4L17l63K95j84j35K84j78j22P1j3L7J88j02r5J60l65K95r9r1J02K5k73O9
$$ -24 293 -70 225 41 -94 190 12 -110 -39 -52 -15 173 71 -24 136 -229 66 -33 -124 -22 3 -270 -201
2470b01n2L71k35N36m60%Q6j20P7j05K18J38l41p8J54M3j66K11J1j87L87l40J96
$$ -201 -253 118 -117 419 -41 -41 45 -75 2 -103 115 253 -88 -166 -12 31 -135 76 87 -100 287 -53 143
2493A43o2k8O3k52M00n4k17J36j14J18m89L19J79N2k92K80k38L60k17J38l44L61
$$ 143 81 53 116 -136 264 210 -7 129 15 133 -356 -37 142 194 -98 182 -56 304 87 225 -119 242
2515B42rk82L00j73o6K10q4Jo1K5K8p1J67q2q7k31K30M4j58L98o00M24k51K56
$$ 242 233 -49 251 78 12 222 138 139 78 103 131 60 227 145 58 -173 57 101 -57 341 -259 165 -86 170
2539A70p8j52L4O9R1l03O04p45K96O6q2J95Lm7m4o9K97m26L9P2Q9J13n2o4k16
$$ 170 92 -60 -26 43 134 -169 435 -310 -14 52 -30 165 168 121 77 8 305 -121 -82 -10 79 192 140 76 -140
2564a40L96l49J20k8L4k13K89J48j93k57L01l04m7K78J17j23l51M09L8Q8k55N63
$$ -140 256 -93 27 -1 33 -180 109 257 64 -193 108 -196 -243 35 152 29 -322 87 125 213 -42 521
2586E21n54J11K28l69j2K75k90K11j12j7q0K55j00k7j01J31JJl40J62q3M43m12
$$ 521 -33 78 306 -63 -75 200 -90 121 9 -8 -88 167 67 40 -61 70 71 72 -268 -106 -189 254 -158
2609a58J87j2k71O72m28J40j40K71k66p0J50p8m0K11m14K51J03q0Jl28L09J19
$$ -158 29 17 -254 418 -10 130 -10 261 -5 -75 75 -3 -43 168 -246 5 108 28 29 -299 10 129
2631A29k35J38k52L87k93L35j93M4j58R0J47l79M34m0j23l13L52K75l35J23k06
$$ 129 -106 32 -220 167 -126 209 16 60 -98 -8 139 -240 194 154 31 -282 70 345 10 133 -73
2652g3L8J3n7J20K5R5k34r0L85k09J1k24R2J47L4n18M49J32j03K05l22M01k71
$$ -73 -35 -22 -79 41 66 161 -73 -163 222 13 24 -200 -108 39 73 -445 4 136 33 238 -84 317 46
2675D6J14j84J67O0j18j14o3j05J08J55k08J18k58L17l15M37J49m65J05J61l5
$$ 46 160 -24 143 203 85 -29 -92 -197 -89 66 -142 -24 -282 35 -280 157 306 -159 -54 107 72
2696G2j1n5j95R2J37l38l0L83l4K6J25k28l8J70k78K24j1n6k4J09J53k15J29J73
$$ 72 61 6 -189 -97 40 -298 -328 55 21 47 172 -56 -94 76 -202 22 11 -45 -69 40 193 -22 107 280
2720B80l72J63N3k3L0l12j0K71j81J02J92m45L34l52L19k06J73J37k58l0K8J20
$$ 280 -92 71 124 101 131 -181 -191 80 -101 1 193 -252 82 -270 49 -157 16 153 -105 -135 -107 13
2742A3L25j75l70j39J97K79j56L47l15j37K05j16R4k58L26k63J73N9O9p9l53J34
$$ 13 338 163 -207 -346 -149 130 -26 321 6 -131 74 -42 52 -206 120 -143 30 89 158 79 -274 -140
2764a40Q4K20q8J3k23K15M1o9J25k56j12K53j22N8j28J96j81K37l28K75k68J40
$$ -140 -56 164 76 89 -134 81 122 53 178 -78 -190 63 -59 -1 -129 67 -114 123 -205 70 -198 -58
2786e8J74j77M4L05k58o4o1m3L26k36M8O0k5K33k55j47O9K27n4k61K99l01L07
$$ -58 116 -61 -17 288 30 -34 -95 -138 188 -48 0 60 35 268 13 -134 -65 162 108 -153 146 -155 152
2809A52k56L33l25P4p7J66m5J14j51L2j11O1o7J86K1j21P8l36K88M7k53L71k17
$$ 152 -104 229 -96 -22 -99 67 22 136 -15 17 -94 -33 -100 86 107 -14 64 -272 16 63 -190 181 -36
2832c6N5P6r0J1k14J21P4L7l86M41J53k8k75o6O6J69j31Ml2N4p9J23Q7k68N5J45
$$ -36 19 95 5 16 -198 -77 -3 34 -352 89 242 214 -61 -127 -61 108 -23 -19 -51 3 -76 47 134 -134 -79 66
2858F6O9J19l86R3j63K44J34k47K20R0l51L6k00J95L74n58K52j3j95M57j44k43
$$ 66 135 254 -132 -39 -202 42 176 -71 149 239 -112 -76 -276 -81 293 -265 -13 -26 -221 236 92 -151
2880a51L55k20kp1J79l33L26p7n06N51r0J52Q5n18M40k85L5L40k86J38J28m11
$$ -151 204 -16 -18 -89 90 -243 83 6 -500 51 -39 113 198 -320 120 -165 -130 210 -76 62 190 -221
2902b21J26K0L62k35m3l27Q3J30M50k29k63L8M6rrR9j26m4J95J09j57N9N1R4k17
$$ -221 -95 -75 287 52 9 -318 -235 -105 345 116 -147 -109 -63 -72 -81 18 -108 -152 43 152 -5 54 105 199 -18
2927a8k16K05n1L19j67N5k11K32k35L71k96j29J82p3k48K69o4J81p3j50K50O1
$$ -18 -234 -29 -80 239 72 127 -84 148 -87 284 -12 -141 41 -32 -280 -11 -75 106 33 -117 133 194
2949A94o9j29J5J35Q7k76j15K83r0p1j24J90j03J23k40L18j97k25K13J3LO3oK04
$$ 194 125 -4 11 146 233 -43 -158 125 35 -36 -160 30 -73 50 -190 128 -69 -294 -81 -68 -65 -2 -8 196
2973A96j71o5Q3L3j86K49j80j75L15q9j68L21r8l6l2J05j39J45j48J98j75Nj92
$$ 196 25 -40 43 76 -110 139 -41 -216 99 10 -158 163 65 29 -3 102 -37 108 -40 158 -17 -12 -204
2996b04J57J96l3m4k26P0k5moL2J35J36l34J27k0l3L29p2rj47M2P1j86J86l7k37
$$ -204 -47 149 116 72 -154 -84 -109 -113 -119 -87 48 184 -150 -23 -43 -76 253 181 172 25 67 138 -48 138 101 -136
3022a36L0N44j63k52M2k12K22j11K7j00Q8J66q9j19J96j47j3M5J21j34r6K28k2
$$ -136 -106 438 275 23 65 -147 75 -36 -9 -109 -21 145 56 -63 133 -14 -27 18 139 5 -91 137 115
3045A15j40j01J62j72K65q8j67%K97Lj10j56J54k61M89n41K61J04j17J36r4N0
$$ 115 -25 -126 36 -136 129 41 -126 -126 171 174 64 -92 62 -199 290 -251 10 114 -3 133 39 89
3067H9n6j84K79m17L97J71l90k42M14l17M38k88p2K51q8J23K17n31L86O1k72q3
$$ 89 33 -151 128 -289 108 279 -111 -353 61 -256 182 -106 -178 73 -15 108 325 -206 180 241 -31 -114
3089a14K38j89PJ48k18J02lj4Q5K94o57K93l96N39r9j39LJ31J8o6k11K23N1J73
$$ -114 124 -65 -58 90 -128 -26 -29 -43 42 336 -321 -28 -424 115 16 -123 -120 11 29 -37 -248 -25 26 199
3113A99r1K8k98K29k45lP2lJ67J14l38J22J54j43J60l05K54l09J12L33j82j38
$$ 199 108 136 -162 67 -178 -181 -109 -112 55 169 -169 -47 107 -36 124 -181 73 -236 -124 209 27 -111
3135a11J91k65J55j5L17m01L40k11o1J84k4l1Rr5K37n8j16l8K15o9o1oq9J36k34
$$ -111 80 -185 -30 -45 272 -129 211 0 -61 123 99 68 77 -18 219 161 45 7 222 153 92 86 -3 133 -101
3160a01J20l31L04k42J10m1K94N4j46p7J71l62P8L29k16K29l4q7j23K05j64J2
$$ -101 19 -312 -8 -250 -140 -181 113 167 21 -56 115 -247 -169 160 -56 173 139 52 -71 134 -30 -18
3182a8j49J92QK8K04r5l65J57j31J84kQ3m00K65P5k01J31LK18k27j36K98j46q2
$$ -18 -167 25 33 61 265 170 -195 -38 -169 15 13 96 -304 -39 36 -165 -34 -31 187 -40 -176 122 -24 -106
3206a06J05l8Q2kJ73rj83j11k07K18O5mK56l54K75j5L7j06m9l3j39Q2j91J62J37
$$ -106 -1 -39 43 41 214 205 22 -89 -296 -78 -13 -17 239 -115 160 145 182 76 27 -6 -145 -63 -254 -92 45
3231D5j16K72l57M00m63K54J08k64J81m6J52j67lk03nL70r6k4K7N4k49J37J49
$$ 45 -71 201 -156 244 -219 35 143 -121 60 14 166 -1 -4 -207 -212 158 62 38 65 119 -130 7 156
3254A56J1k63QO5K79k39J9J17j15L8j20J5J2K86l74J66l4r8J69J83k30k42J15
$$ 156 167 -96 -88 -23 256 17 36 153 38 76 -44 -29 -17 269 -105 61 27 -71 98 281 51 -191 -76
3277g6l8L44k63P4l3J57r2J01k19j51k3J19K16K9j32l8L0N6k27P8K14j46J01l30
$$ -76 -114 230 -33 41 8 165 73 174 -45 -196 -219 -100 116 145 13 -25 5 61 -166 -88 126 -20 81 -249
3301b49M51l67O40p70K66L5j8P4p4L38l30p8K03l54J58L7O7k6K67nk41K07J36
$$ -249 202 -165 475 -295 -29 6 -12 62 -12 326 -4 -82 121 -233 -75 -38 29 3 270 265 24 231 367
3324C67l61K00K2l64Q8j1%J5m6j88L54j76J31j26J18J78o2P1j83k64M73l19j2
$$ 367 6 206 228 -136 -48 -59 -59 -44 -90 -278 76 -100 31 -95 23 201 139 210 27 -237 236 -83 -95
3347i5j36K05K31j47K4k46J38L2j23m1M67j33l20M26j58l18J35M9J07q6K4l53
$$ -95 -231 -26 205 58 82 -164 -26 6 -117 -158 309 176 -144 282 124 -194 -59 -10 97 11 35 -318
3369c18M78k44J49R7k86J51J1l46N16k22J19r4N9k18o7J47j08K94q5k6j14J63
$$ -318 160 -84 65 162 -124 27 38 -308 208 -14 105 11 70 -148 -215 -68 -176 118 33 7 -107 56
3391E6j8J5L04k65L34m52R2j59j10M24q1j98k6M17m01J08J05J05l04j3L81k78
$$ 56 38 53 357 92 426 -26 66 -93 -203 221 140 -58 -84 333 -68 40 145 250 -54 -67 314 36
3413C6J30j74k56L43M9j45l12L93m22L54O1M8l24J23L3K06J1l01J04M8P9k40J87
$$ 36 166 -8 -264 79 128 -17 -329 64 -358 -4 57 105 -219 -96 -63 143 154 -147 -43 5 84 -156 31
3436C1k33L66j99J78qk68K12j43p1N7L1Rj44rK8L9p6K07K70k75k1j15K03k77P9
$$ 31 -202 164 -35 143 135 -133 79 -64 -135 -78 -47 -38 -182 -191 -163 -124 -200 7 277 2 -19 -134 69 -208 -129
3461a29L05l37L2J02j99J1K63k55L77j8m94M46k80k2L00j38r6K42K6l2r5j23K27
$$ -129 176 -161 -129 -27 -226 -215 48 -207 170 152 -342 104 -176 -198 102 -36 -132 110 136 104 9 -114 113
3484A13r0k16J54J0P5m6j6J19p9j0J52j11l61K46R9M6j06Lj24K47k47k1K37r2
$$ 113 23 -193 -39 -29 46 0 -16 103 24 14 166 55 -306 -60 39 85 -21 -18 -142 105 -142 -163 74 -18
3508a8j2K86k03N4l31K3L57k90lj55L90J2n0J9M2k27K89k57L87l35L08m71J85
$$ -18 -30 256 53 107 -224 -201 156 -134 -137 -292 98 110 60 79 121 -106 183 -74 313 -22 286 -185 0
3531@K90k49o7L09l33L3l1%J2K77j57m2K90m86Rk8L58k12J01P9j3k44J91k87M10
$$ 0 290 41 -26 283 -50 -17 -48 -48 -36 241 84 42 332 -154 -145 -173 185 -27 74 153 140 -104 87 -200 210
3556B10k77R2O2k57L01ol89n3M45k82M5j6Q0J01m07M11P2j74J93l35J52l61N14
$$ 210 -67 25 87 -170 131 125 -264 -317 128 -154 -109 -125 -45 56 -351 60 132 -42 151 -184 -32 -393 121
3579A21l61K57o0m1J29l54L13R7L07p2l16p1J07k19J45l40L25k9J57j32r4l7J1
$$ 121 -240 17 -43 -84 45 -309 4 101 408 336 20 -51 56 -163 -18 -358 -33 -62 95 -37 -131 -168 -157
3602a57J94oj00R8j96K24Q0j67J15j93P4P9O2j0K19K0k18J39m27J38J82m7j07
$$ -157 37 31 -69 29 -167 57 137 -30 85 -108 -34 45 107 97 316 336 118 257 -170 -32 150 103 -4
3625dj5nL5P1j08J88n09M16N3k73J4L3J43n0k0M7j89k42N04k61P9J5m1K09M8r3
$$ -4 -19 -24 11 82 -26 162 -347 69 122 -151 -137 -104 39 -11 -31 16 -173 -415 89 -172 -93 -78 -119 90 138 45
3651D5m0m2Q9K43k41J04k46L31j9l74J64j3J17J87m73J53j66L6l1m3K50k17J32
$$ 45 5 -37 52 295 54 158 -88 243 224 -150 14 1 118 305 -168 -15 -181 -145 -176 -219 31 -186 -54
3674e4O4J76K4m48M17j3j97J5N3j02j48L33j69L49n63M40l30j31K66m8J36j44
$$ -54 10 186 210 -238 179 166 -31 -16 37 -65 -213 120 -49 300 -263 177 -153 -284 -18 -66 70 -74
3696g4K60j04j06L00j97k00K3J11LL25k26m5q1L5Oj27R6J97m0k48QP3j17M4J81
$$ -74 186 82 -24 276 79 -121 -98 13 16 341 115 70 -11 24 30 -97 -1 196 156 -92 -84 -11 -128 -84 97
3721I7j16j38p3J06J88j60J45J79n24M01l2J02k03j37M62j26j41j86J92pj2K15
$$ 97 -19 -157 -230 -124 64 -96 49 228 -296 105 73 175 -28 -165 297 171 30 -156 36 29 17 232
3743B32m76J94J04j13Q9j96M3l8M51l49j68J41L28k69r1K20l34K57Mj39p7K79
$$ 232 -244 -50 54 -59 30 -166 -123 -161 290 -59 -227 -86 242 -27 -118 102 -232 25 29 -110 -187 92
3765I2J9j74K27m77K55K05Q6m10L83j76j34P4R8j42RJ30l95K49R1k9J76j0Po9
$$ 92 111 -63 164 -313 -58 147 233 -177 206 30 -104 -30 68 -74 -65 65 -330 -81 10 -19 157 147 154 85
3789H5k20J68j22l15K66J12j09LJ62J53o9k72K11k78o6K44j76J00J15l21M42r
$$ 85 -135 33 -89 -404 -138 -26 -135 -132 30 183 114 -158 53 -225 -291 -47 -223 -123 -8 -329 113 104
3811A04K8J3J94l78J71%J15k33j19J74k22L28l99L84%k77K52J43j52j69o2K00
$$ 104 132 145 339 -39 132 132 247 14 -105 69 -153 175 -224 160 160 -117 135 278 126 -43 -105 95
3833I5j5r5p7o0M10n04K3L66l1j74J02J32j40j8q6K2k5j55m2M72k10j09J25l8
$$ 95 80 -15 -92 -152 258 -246 -223 143 112 -62 40 172 32 14 -72 -50 -75 -230 -272 200 -10 -119 6 -32
3857c2J27k85MJ00J7J12m1p2n2O0K68l62M41n07J82J72o2j13k24M56p3K29o30
$$ -32 95 -190 -186 -86 -69 43 2 -70 -122 -62 206 -156 285 -222 -40 132 70 -43 -267 189 116 345 -285
3880b85M41k41J46k70K73N4M7j47o5j01L3J6R1nJ1J23k74J46N4j97K18m6R4l60
$$ -285 156 -85 61 -209 64 118 165 18 -47 -148 -115 -99 -8 -13 -2 121 -153 -7 47 -150 68 22 116 -244
3904b44K15q3n0J67M2P5k28K94P0l04j3l3J5K38l60K57j02o7J09J04p5j31J44
$$ -244 -29 -112 -162 5 47 122 -106 188 258 -46 -59 -92 -77 161 -199 58 -44 -111 -2 102 27 -104 40
3927D0nk04L79j74p8N8q2K33k11K62k20Mj03J67l08K35L3p5J50j7j06j37L25m52
$$ 40 35 -169 210 36 -42 16 -66 167 -44 218 -2 2 -101 66 -242 -7 26 -49 101 84 -22 -159 166 -286
3951b86J80J81j54N29n89M18j61R7j6M0j60N4kj59J85o4j82K12K9l16K40j56q2
$$ -286 -106 75 -79 450 -139 279 118 215 199 239 79 133 131 -28 157 93 -89 123 152 -164 76 -80 -162
3974a62K41M1k58L19j74Q6l11M8N0K81K1m04J40M4j55J33j11K84j19LM16l18j3
$$ -162 79 120 -138 181 7 93 -218 -170 -120 161 182 -222 -82 -38 -193 -60 -171 113 -6 -3 413 95 82
3997H2L6j37J6K10j81L7q2jJ2J44j6kK03m39j63L26J0m5K19k25M6k51j2N3J53
$$ 82 118 -19 -3 207 26 63 -19 -20 -8 136 120 118 321 -118 -281 45 55 10 229 4 50 -201 -213 -160 -7
4022gk79N37m00L49J28k08q5j12r2rK44j88j38L02L0l28M34k08L22l55K39k23
$$ -7 -286 251 -149 200 328 120 35 -77 -169 -178 66 -122 -260 42 72 -256 178 -30 292 -63 176 -47
4044d7j1j60K02r2j91N66l39O9q8L44l49J89j94R0L98o22L17Q2j3m2m12L69j2
$$ -47 -58 -218 -16 -108 -299 267 -72 -3 -91 253 -96 93 -101 -11 387 -235 82 164 151 109 -303 66 54
4067E4k28M32k77p0j64K70J01J03l19J66j44M0J04j2J92k79P6l7k62M40l40K01
$$ 54 -174 258 -19 -89 -253 17 118 221 -98 68 -76 -36 68 56 248 -31 45 8 -254 186 -154 47
4089D7k99J50L1l4K48q6k59O8K7K52r7N6k79L81m5m14N77l16J12r2q2K81m03J57
$$ 47 -252 -102 -71 -105 143 57 -202 -134 -107 145 48 104 -175 206 161 -253 324 8 120 28 -54 227 -176 -19
4113a9K56l10K00j64J73j53k30J34J30k16R5L47l34K20l65K90j83J67k60J18N4
$$ -19 237 -73 127 -37 136 -17 -247 -113 17 -199 -104 243 -91 129 -236 54 -129 38 -222 -104 -50
4134e0J29J03k62K93k72P7m5j00K04j41J93k91Q4K79j43k8k6o3r8J01Q4m20L79
$$ -50 79 182 -80 213 -59 18 -27 -127 77 -64 129 -162 -78 201 58 30 4 -59 -157 -56 28 -392 -13
4157a3J52k48Q3K1o9J10qO7J5k55r6K98k5o0J17Pj39Q1J43p4j22n7J2O1O3j41
$$ -13 139 -109 -26 -5 -74 36 28 95 110 -145 -241 57 32 -28 89 96 -43 38 181 107 -15 -72 -60 1 64 -77
4183g7J1m9O5K75l63j56M44o4J6o9j1j33L46j23k08k81N97n23J67J45j08q8J92
$$ -77 -66 -115 -50 225 -138 -294 150 86 102 33 22 -111 235 112 -96 -377 220 -303 -136 9 -99 -187 5
4206EO2k24J46K89j22j21J80m6j7k51%K30k22J10m52L35L57j69p5p0M0j50J90
$$ 5 67 -157 -11 278 156 35 215 169 152 -99 -99 131 -91 19 -433 -98 259 90 15 -55 -15 -165 25
4229B5j08j31L21j28j16J77k08K20J52p2k89J92j15j44K75L9j16P7j50L45m19
$$ 25 -83 -214 107 -21 -137 40 -168 52 204 132 -157 35 -80 -224 51 90 -26 51 -99 246 -173
4250a73J13O3J25J85k34J12M2q0K9k89J08J47j78J49l69M48P8l67J90j13j46J92
$$ -173 -60 3 128 313 79 191 233 153 182 -107 1 148 -30 119 -250 198 276 -91 99 -14 -160 32
4272C2k46p6K65K01o84L21K10k4M3L1k52L41K7j84P0j70j9K49k98N15n26K43R0
$$ 32 -214 -290 -25 176 -508 -187 23 -1 42 73 -179 162 189 5 75 -95 -114 135 -163 352 -174 69 159
4295A59N8R5l93P5K39j35n6k9L2k49O26n34j87O05l48J40j59k1r6K15J4N6m9n8
$$ 159 217 312 -81 -6 233 98 42 13 45 -204 422 -112 -299 306 -42 98 -61 -82 -178 37 51 107 58 0
4319@m7J39q1J10J4l33K9M3L36k21L7J87k58O6q9qJK55k15j15M13k48N0J5J49
$$ 0 -47 92 11 121 135 -198 -169 -126 210 -11 26 213 -45 21 -68 -76 -75 180 -35 -150 263 15 65 80 229
4344B29k43Q5j73K18o9j27J57l5O4j8j43J6K07n6p4j4O7O5j16o1qm1M0j66J8P4
$$ 229 -14 71 -102 116 47 -80 77 42 106 88 -55 -39 168 112 38 24 91 156 40 -21 -29 -70 -30 -196 -178 -104
4370a04q8J56j76L15K10m50J16k5o0M4J97M8o7j54J49j29Moj56J3J45j11pR5k8
$$ -104 -192 -36 -212 103 313 -137 -21 -46 -106 -62 135 183 116 -38 111 -18 -14 -20 -176 -163 -18 -129 -136 -41 -69
4395f9J56r9M6J38l52M7L2K09j52k5k38M23k26K55k58Q9J23k53K12J1K49k09n8
$$ -69 87 -12 34 172 -180 -133 -101 108 -44 -69 -307 116 -110 145 -113 -24 99 -154 58 69 318 109 51
4418E1K9J6l4L15m76Q0o8q4J16J73j36J99k01J38k81J08J67j92k72J76mj9J5K41
$$ 51 80 96 62 377 -99 -19 -87 -171 -55 118 -18 181 -20 118 -163 -55 112 -80 -352 -176 -180 -199 -184 57
4442E7j90L30l34J84q6o6j07J78K02K2k67O3J07M8j80P3k57L81k87J62n6k08K52
$$ 57 -133 197 -137 47 -39 -105 -212 -34 168 190 -77 -14 93 141 -39 34 -223 158 -129 33 -23 -231 21
4465B1m8J75j35k56J31M07k81Lk61L02l4p2j7q6J61p5j48L79l17K5K52l55K26
$$ 21 -27 148 13 -243 -112 295 14 17 -244 58 24 -48 -65 -151 10 -65 -213 166 -151 -126 126 -229 -3
4488cJ30l58J24J05P4q2n1L18k44j36Q0N4k23J89N3p8j08J73J79k64R6r0Q5NJ11
$$ -3 127 -231 -107 -2 72 -10 -61 257 13 -123 -43 11 -212 -23 30 -48 -156 17 196 -68 28 -62 23 28 139
4513A39o5j24J25k63K33J93n4j43J20n28L70j62J40j05j09L62l28P4K40j25Q7
$$ 139 74 -50 75 -188 45 238 184 41 161 -367 3 -159 -19 -124 -233 129 -199 -125 115 -10 77
4534G7L7j80J74k7k94K96k6j03o3J53m1J44j43J29J5l04J69j59M3J52K52l13J02
$$ 77 114 -66 108 81 -213 83 57 -46 -109 44 3 147 4 133 148 -156 13 -146 -103 49 301 -12 90
4557I0k36J43j12L01j06p2j0kn6P0kj69K8J21qk46J9L52Qj15k82J90L37R7k57
$$ 90 -146 -3 -115 186 80 8 -2 -4 -60 10 8 -161 -133 -12 -20 -266 -247 105 113 -2 -284 -94 243 340 83
4582H3nj87l0L05m51p6J08P8J71j63J06N2L3j09J55r4J29k90K81j87J08L0Lj23
$$ 83 78 -109 -139 166 -285 -361 -253 -175 -4 -167 -61 -9 24 -85 70 -24 105 -185 96 -91 17 47 50 -73
4606g3N1j02J45P0L8n9k98M36l02K2N0R4m2K36l57J71R1k19P9Pj45L03k61L25
$$ -73 -22 -124 21 91 129 70 -228 208 -94 -72 -22 72 30 266 -91 80 171 -48 31 38 -107 196 -65 260
4630B60j94j26L8O4j01J35Q5j25m5k25Rj1N0nK78n0j08k82J19O8Q9L0R5j66m6
$$ 260 66 -60 -22 42 -59 76 161 36 -9 -234 -225 -236 -186 -191 87 37 -71 -353 -234 -166 -77 -47 48 -118 -164
4655a64J70M9j88m8L17k93J73L33k18n6o6J48j76J01q5L2j52K8J47k00J27j31
$$ -164 6 55 -133 -181 136 -157 16 349 131 75 9 157 -19 82 -3 29 -123 -95 52 -148 -21 -152
4677a52J32P2M7p9L4J48k7q8K23l70J9K99l86J67n3J84m4j70j4J25l7J16j63j29
$$ -152 -20 52 99 20 54 202 175 87 310 -60 -41 258 -128 39 -14 170 126 -44 -58 67 30 146 -17 -146
4701a46pK60j67L76l01J81k56J61k34N7M6oL98j81R3m30O8O2N3m6K39l44j16J48
$$ -146 -153 107 -60 316 15 196 -60 101 -133 -76 -30 -36 362 181 274 -156 -88 -26 27 -19 220 -124 -240 -92
4725i2k3K46j32l88N92k39J80k45J26j67J0R1J35M6k30K66l07J03m1Q6Lj06l08
$$ -92 -115 131 -1 -389 203 -36 144 -101 25 -142 -132 -41 94 140 -90 176 -131 -28 -69 17 20 -86 -394
4748c94M12l16K37k5J77n6Q5l0k79L46l03J88j66P3J39J33j45j29K19k06r0Q9
$$ -394 18 -298 -61 -86 91 35 120 90 -189 157 -146 42 -124 -51 88 221 76 -53 166 -40 -130 -41
4770d1J98j24q0R2J8KJ09p2J65j37J81q6j51k00L04j10J23k9j36N4j58p0j55J69
$$ -41 157 33 -47 45 63 65 174 102 267 130 311 225 74 -126 178 68 191 162 26 80 -78 -148 -303 -134
4794a34o3L67j08j00J9p5R6k61L28J10k93K00kj33L41k29j87K22L9j47p4J73k14
$$ -134 -197 170 62 -38 -19 -94 2 -259 69 179 -114 86 84 -49 292 63 -124 98 137 -10 -84 89 -125
4817a25L24o4J07j71j86o7J24J04R5o3p8o6P8J40k53l0J70q9J01k2o6J70k86J59
$$ -125 199 135 242 71 -115 -182 -58 46 141 78 0 -66 12 152 -101 -131 39 -50 51 29 -37 133 -153 6
4841FN8j2j38K03r3r5j20N01j63j68QJ55k55O9Q3O5J30l79J46p8r7J36J08p1j52
$$ 6 64 52 -86 117 24 -71 -191 310 147 -21 -13 142 -113 -44 39 104 234 -145 1 -77 -174 -38 70 -1 -153
4866a53K11q7L5l05J77o1J25J04O6K34m43p8J16OJ35m8m4Oj93M77l79L77l29p5
$$ -153 58 -29 6 -299 -122 -183 -58 46 112 346 -97 -175 -59 -53 82 34 -10 -4 -197 280 -99 278 -51 -126
4890a26m0K01M3j10M0J35j24K4j6rp7J42oJ58j09r5p3J28j08J08%l9k2m2m8J25
$$ -126 -166 35 78 -32 8 143 19 43 27 18 -59 83 77 235 126 31 -42 86 -22 86 86 47 25 -17 -65 60
4916F0j04K63l45L9RQR3J88k71J52o6K26j82j35J76N0q4k92J45j10N52k41k34
$$ 60 -44 219 -126 -87 -78 -70 23 211 -60 92 26 252 70 -65 111 161 77 -215 -70 -180 372 131 -103
4939a03o1K73j09ro7N8l5J75j45K81j84N5l23L57m4j92LJ02o0q0J84m2J00j94
$$ -103 -164 109 0 -9 -76 -18 -53 122 -23 258 74 129 -194 163 119 -73 -70 32 -28 -108 76 34 134 -60
4963f0q4J74m7P7j4k84J77K23j70k11K14K36k43OQ0qJ88j62j77J46o2j10O4j39
$$ -60 -144 30 -17 60 46 -238 -61 162 -8 -219 -5 231 -12 -6 74 66 254 92 -85 61 -1 -111 -47 -186
4987a86P3j89K32Jq9L30p9J15k5k58J2n3k35M81o0r8j62m8K89j67J02M3r7k01
$$ -186 -113 -302 -70 -69 -158 172 93 208 183 -75 -63 -116 -351 130 70 -28 -190 -238 51 -116 -14 29 -68 -269
5011b69Q7L32q0j08k6Q6J5J48k00q8J17k94M36k06j40J58K10k48K41k90J38k44
$$ -269 -182 150 70 -38 -64 22 37 185 -15 -103 14 -280 156 -50 -190 -32 178 -70 171 -119 19 -225
5033b25Q7k12K67k67J74K17j40L28k67m7K80k56q4Q7O7j4M3jq5O0l8M5L02j30
$$ -225 -138 -350 -83 -350 -176 41 -99 229 -38 -85 195 -61 -145 -58 9 -5 38 37 -48 12 -26 19 321 191
5057A91K7m24M48Oq9P0k24N7j69L4O7q7J73O0k84l4J74o5j47Q4L88l9j93j91J1
$$ 191 218 -206 242 248 159 229 5 62 -107 -73 -6 -93 80 140 -144 -178 -4 -69 -216 -132 256 217 24 -167 -156
5082a56n8J54l8q2m4K06o8J58J73p0r1k21M25q3j34R9k22JM5J33N0l34J68j12
$$ -156 -214 -60 -98 -180 -224 -18 -86 72 245 175 84 -137 288 205 71 170 -52 -51 -6 127 177 -157 11 -101
5106a01J21K38j40k41J15q1O7rJ82l9Q3l84J99p4J85J04k22M8K78l98J7P8p8K12
$$ -101 20 258 118 -123 -8 -89 -22 -31 151 112 195 -189 10 -64 121 225 3 51 329 -69 -52 26 -52 160
5130A60l43Q9J79j15K91l10R1j11N8L69l93K38l69J40M15k58J7K0j41R2j85L59
$$ 160 -183 -94 85 -30 261 -49 42 -69 -11 358 -35 203 -166 -26 389 131 148 168 27 119 -66 293
5152B93j90l1j67r3L88j16K19k73j70L99k15k27L88m64L07J45j0l36K2J83L9m32
$$ 293 103 72 -95 -188 200 84 303 30 -140 259 44 -183 205 -259 48 193 183 -153 -131 52 91 -341
5174c41L09J66j21n9k90L86J39p2j41N1Q2k15J30K0O4j86J86l8k17J72J89o7j23
$$ -341 -32 134 13 -46 -336 50 189 117 -24 27 109 -106 24 44 108 -78 108 70 -147 25 214 147 24
5197B4K4j64K53k10o3J51j45j5J06P1q2r0J29n6k9J9K3j04K07R4r5j81J05Q1j7
$$ 24 48 -116 137 -73 -136 15 -130 -145 -39 32 -50 -140 -11 -67 -96 -77 -54 -158 49 143 48 -133 -28 53 36
5222C6jk4%N0PK51j70l23J15L0j05J00J73k16K27On1m2n4M9j30J75n0p7N7j12
$$ 36 35 11 11 61 68 319 149 -174 -59 -29 -134 -34 139 -77 150 156 105 63 9 58 -72 103 53 -24 33 -79
5248g9J56n0p4J22m7K27L2m85L33K7j51K69l70l3k7j01L66l7l4J12r0J64l30L66
$$ -79 77 27 -47 75 28 255 287 -198 135 162 11 280 -90 -123 -150 -251 115 78 44 156 66 230 -100 266
5272B66m08R6K30k62K93j99J55k54L3K03J34k52R1j8j15n6j8J65k92J0Q1RM3M35
$$ 266 -142 -46 184 -78 215 16 171 -83 -50 153 287 35 126 108 -7 -63 -81 84 -208 -198 -117 -108 -65 370
5296C70k78j2M6j91J47q6O8j51J80k47k6K25J04k47L57l89K83J3l71P9K27r5j43
$$ 370 92 80 126 -65 82 -4 64 -87 93 -154 -180 45 149 -98 259 -130 153 166 -205 -126 101 6 -137
5319a37J51p2L2j09K14o0n6J15l04J69l83N84k04K85k40n5J17J71j67M4k02K0
$$ -137 14 -58 -26 -135 79 19 -37 78 -226 -57 -440 144 -60 225 -15 -70 47 218 51 95 -107 -87
5341h7O2N8j68M3M3K31l37M18l18j3K53k34J37k95K64j22m1j55K04K4l5J48J77
$$ -87 -25 33 -135 -92 -49 182 -155 263 -55 -68 185 -49 88 -207 57 -65 -106 -261 -57 -33 -68 80 257
5364B57m55m9K06K61q5Q2j86J66j59p8j70Q6K0P5P4j08l18M31LJ3K13l78M4J3
$$ 257 -198 -247 -41 220 135 217 31 197 38 -40 -210 -124 -104 -29 45 -63 -381 50 53 66 279 -99 -55 -42
5388d2L3j63J22K6J51j56qJ45k42n9L27Q2jLm8j63N7k8q7k34M62o2l5J17j63J72
$$ -42 -9 -172 -50 -24 127 -29 -37 108 -134 -193 134 216 215 218 170 7 64 36 -51 -285 177 115 80 197 34 206
5414B06j71N8k46L21l90M6K48j17m5j21L24n9QK94m78l7J88r8J65m0l6j44P6K30
$$ 206 35 93 -153 168 -222 -176 72 -45 -90 -211 113 54 62 356 -122 -159 29 -69 96 56 20 -124 -48 182
5438A82m18K05J62j00K12j18k33J30J18k17J81r5K31j30O6m89K35J75Kk19N5o1
$$ 182 -236 -31 131 31 243 125 -108 22 140 -77 104 9 240 110 176 -313 -78 97 99 -120 -65 -126
5460a26J44j88L34l63J85j29J79J48l31M0K8P9k17K54o8J1mk1K79j57L5k12jo8
$$ -126 18 -170 164 -199 -14 -143 36 184 -147 -107 -79 0 -217 37 -31 -20 -24 -45 234 77 112 -100 -101 -169
5484a69Q7L19r5k28o7M18m33J85Q9J5k8J74k98M4K62o96L75j1K38j14p3m09L56
$$ -169 -82 237 142 -86 -153 265 -168 17 106 121 93 267 -31 13 275 -421 -46 -57 181 67 -6 -415 -59
5507e9m2j01J49J70j72R5r0j71K43L3j01q8K02L4J12j44J35j95jp8J46j27J2l8
$$ -59 -101 -202 -53 117 -55 40 -50 -221 22 55 -46 -134 68 102 214 70 205 10 9 -69 77 -50 -38 -76
5531g6L21k96J48J06l56qK05j40n6j29K70j12N7l1M5K6J3j53j0q3J66K09J27l25
$$ -76 245 -51 97 203 -153 -161 44 -96 -152 -281 -11 -123 -66 -97 -52 -26 -13 -166 -176 -259 -93 116 243 -82
5555h2J16j74R5l6L5K7o0Q2N0M7m80L22J53j85K40n80O72k53K28k01r9K11j9L9
$$ -82 34 -140 -45 -81 -46 -19 -79 3 53 100 -380 -58 95 -90 150 -430 242 -11 217 16 -83 128 109 148
5579A48k95J99l43M17j55J22k14P0NK04r5k62J78J89m19J35L06j46J21k71K09
$$ 148 -147 52 -291 126 -29 93 -121 -51 -46 158 63 -199 -21 168 -251 -116 190 44 165 -106 103
5600A03j03kJ25k3l13K70k52L66P6j74K02k46k13L23O9j22j98Q5R8j70J10k63
$$ 103 0 -2 123 100 -213 57 -195 171 247 73 275 29 -184 139 208 86 -112 -27 71 -99 11 -252
5622b52L71j45J0L2m4j08KQ1j50N7J56j12M4J82l47K91J96j12J8m57L84j58j91
$$ -252 119 -26 -16 16 -28 -136 -134 -53 -203 -146 10 -102 -58 124 -223 68 264 152 170 -287 97 -61 -252
5645b52J30p0K33K73m37K2m6J04J94j67R4j3j33J14l8j02j5K90k23j09L30m63
$$ -252 -122 -192 41 314 -123 -101 -147 -43 151 -16 78 65 -68 46 8 -94 -109 181 -42 -151 179 -284
5667b84J65kP0O8J46j00l3P4j9k39J85q1J15p7J9n4R2RQ7j85j8R0j49O4m8j15
$$ -284 -119 -121 -51 17 163 63 30 104 85 -154 31 -50 65 -12 7 -47 45 54 141 -44 -62 28 -121 -57 -105 -220
5693b20J99j34M34k61r4l7J31Pl29L07M3j39o2J09l8J81m33L32O3J71k13j87Q4
$$ -220 -21 -155 279 18 -76 -113 18 25 -304 3 46 -93 -155 -46 -84 97 -336 -4 59 230 17 -170 -86
5716h6J13l62M25q2N0O1j13n6j49QL09k5j04j16O7J78j66K35j62K1o2M4l6Qk29
$$ -86 27 -335 90 8 58 119 6 -50 -199 -191 118 93 -11 -127 -60 118 -48 187 25 46 -16 28 -8 0 -229
5741b29J63R5P3k37M7J16K11m27K64k57K05k78K61k4j71J45pN3K98n02J93J84
$$ -229 -66 29 102 -135 -88 28 239 -188 76 -181 24 -254 7 -17 -188 -43 -50 3 301 -201 -8 176
5763A76j10o9J02j51J75j40n6lJ77k11K16j96lK88rk62K2j07K16k66L33J00n1
$$ 176 66 -3 99 -52 123 -17 -73 -76 101 -110 106 -90 -93 195 186 -76 -54 -161 55 -211 122 222 171
5786A71k14K26r4j98K84j03l10NM35m0k14k70Q4J78L14j66j06k52k4M37n05L16
$$ 171 -43 183 89 -109 175 72 -238 -233 202 162 -52 -322 -238 -60 254 88 -18 -270 -294 143 -362 -46
5808d6Pj18J43K47l06J89kr4k25j1J98nJ61o2K5J00j83P9m3Q3j31R3K8l94K82
$$ -46 -39 -157 -14 233 -73 116 114 20 -205 -216 -18 -23 138 76 101 201 18 97 54 137 6 99 127 -267 15
5833A5j90K73j64j64K10M9j81Q4O8LO1K0L1j40j51R3K94j00lr3j95j42N47j12
$$ 15 -175 98 -66 -230 -20 29 -152 -68 0 3 64 84 115 -25 -176 -83 211 111 108 15 -180 -322 225 113
5857A13j89j67J7K24k37J30K22P6N0j16k62M6L79k35M3p8r9m2K09J48l64J13P2
$$ 113 -76 -243 -226 -2 -239 -109 113 189 239 123 -139 -93 286 51 94 16 -83 -125 84 232 -132 -19 53
5880E3P9j76K89l64n5J99j24M1j00J14j17K74n13O74j62m63K58R3k4ml0R3J51
$$ 53 132 -44 245 -119 -174 25 -99 -58 -158 -44 -161 113 -400 274 112 -351 -93 0 -24 -28 -58 35 186
5903A86l98J90j11J08o5%J14p7j9J63j79J55j64pJ55q7K62l58L21k51J17Q5j48
$$ 186 -212 -22 -133 -25 -90 -90 24 -53 -72 91 -88 67 -97 -104 51 -36 226 -132 189 -62 55 140 -8
5926hM5k91RJ63Q1K38j25j18K69j12o9k25K79k61K47j11k02M5J22J43k68J47r3
$$ -8 37 -254 -245 -82 -1 237 112 -6 263 151 82 -143 136 -125 122 11 -191 -146 -24 119 -149 -2 -95
5949i5j9j9K66k03J56l12K58j61K0kM9M6J79l7l53J81p8L96j23l74R5O8n6K96
$$ -95 -114 -133 133 -70 86 -226 32 -129 -109 -111 -62 -16 163 126 -227 -46 -124 272 149 -225 -130 -62 -118 178
5973A78m28K64k50L49O4m31K62J33k90J88l11J06K70%j74k29N37k73J62l60J09
$$ 178 -250 14 -236 113 177 -254 8 141 -149 39 -272 -166 104 104 -70 -299 238 -35 127 -233 -124
5994a24J12J06j89K23j46j93k4K82j20J69n4k6j29Q3m5Q0j1R3p0k04j53J47K36
$$ -124 -12 94 -95 128 -18 -211 -235 47 -73 96 42 16 -113 -30 -75 5 -6 87 17 -187 -340 -193 43
6017D3j31N14m24l45J73l0K73J66k24p2L8jj75M03k20k01K6R4K15k07J10j7K5
$$ 43 -88 426 2 -343 -170 -200 73 239 15 -57 -19 -20 -195 208 -12 -213 -187 -93 122 -85 25 8 33
6040C3j65O0J25M0n6j36K73j53P3q1j44N8%Q1j86J62J9q1K19k90K65j54L80J6
$$ 33 -132 -72 53 93 37 -99 174 21 94 13 -131 -73 -73 8 -178 -16 3 -78 141 -149 116 -38 342 358
6064C58l15N3k36J33r7M6k1R2q7O5R9k50Q7rR0k72L24j43J29k4j05J33r1J8N3
$$ 358 43 96 -140 -7 -104 -58 -79 13 -74 -9 90 -160 -73 -82 8 -264 60 -83 46 22 -83 50 -41 -23 30
6089C0K75j52j63J88m83K35j71N2K47M5K48m40j40J51J00mJ86j3M5k93p1K9M68
$$ 30 305 153 -10 178 -305 -70 -241 -189 58 103 351 -89 -229 -78 22 18 204 191 236 -57 -128 -99 369
6112C69k95j13K25j39K15k01j27l4j02K9rK02j35k04K55K98j60J05p3m6l4j75
$$ 369 74 -39 186 47 262 61 -66 -100 -202 -173 -182 20 -115 -319 -64 234 74 179 106 60 26 -149
6134a49K44j45L68No42J65J95j34L64m73M44j67k15J57J10n6k10P1Q6M7k51K11
$$ -149 95 -50 318 323 -319 -154 41 -93 271 -202 242 75 -140 17 127 71 -139 -68 18 65 -186 25
6156B5k56K60j68O2K26o6l86J21J23O1l63L47N1J82K2m18J77OK0rj28L89j28J57
$$ 25 -231 29 -139 -77 149 83 -303 -182 -59 2 -361 -14 37 219 241 -177 0 6 26 17 -111 278 150 307
6180C07j35j12L75q99M95j31q9K30j06n3J1L59l8k04l8K04l08L4J66q9J95l15
$$ 307 172 60 435 -464 31 -100 -189 41 -65 -118 -107 252 214 10 -28 176 -132 -98 68 -21 174 -141
6202a41K25J24J16k52j91J03j34J47J40J14j00l45J6K81k76J70K46k23k62M00
$$ -141 84 208 324 72 -119 -16 -150 -3 137 251 151 -194 -178 103 -173 -3 243 20 -242 158
6222A58N8r0K2r1l14J85k0K51j38K06j56r0J15q1j4k74K62l5k2K57j01J39j38
$$ 158 216 126 148 57 -257 -72 -92 159 21 227 71 -19 96 15 1 -273 -11 -46 -68 189 88 227 89
6245H9k09L11n4j77K82k28l5R9m0j85K70k65K5k8K3K49o7j66j63L11M7j80K33
$$ 89 -120 191 137 -40 242 14 -21 78 38 -147 123 -142 -117 -145 -122 127 60 -106 -269 42 89 -91 142
6268A42J86l90j34j8R2J12m1KK19l22K6K70j46J01j67k0J9M6J54k45K96k96J73
$$ 142 328 -62 -196 -214 -122 -10 -51 -49 170 -152 -126 144 -2 99 -68 -88 -69 -23 131 -114 182 -114 59
6291E9l94M33J18j29J86l53r5R6J03L6J77l54k4N7K0K46J17k60J52K7j88J21l77
$$ 59 -335 98 216 87 273 -80 -175 -79 24 60 237 -117 -141 -84 -64 182 299 39 191 218 30 151 -226
6314b26L65J44m61L97l00R7j33j95K49J75j04j31j41K10L54q4l49J06L61m56J45
$$ -226 139 283 -178 219 -81 16 -117 -312 -63 112 8 -123 -264 -54 300 216 -133 -27 334 -122 23
6335B3J6j82L32L6j77L5J34l23j00K42k21J73m0m5J02J60k46N7J42k14k07K35
$$ 23 39 -143 189 225 48 83 217 -106 -206 36 -185 -12 -52 -97 5 165 -81 -24 118 -96 -303 -68
6357f8K32j34R8j78P1q1J87k1K02l63n9J89j5j76k55L91J20j75r2L19j75l1l9
$$ -68 164 30 128 -50 21 -60 127 106 308 -55 -114 75 60 -116 -371 20 140 -35 -127 192 17 -14 -53
6380e3J23k82K04j6j22J8K93l61M60k19N5m7l17J65K00O3m17K62k16K54N5r9O4
$$ -53 70 -212 -8 -24 -146 -128 165 -196 264 45 100 53 -264 -99 101 164 -253 9 -207 47 102 3 67
6403F7mj21K07k86k4N13j79k34n7J77k2k13M39k29p5p9M8j83J89r9J05K3J5K61
$$ 67 63 -58 149 -137 -161 352 173 -61 -118 59 37 -176 263 34 -41 -120 -72 -255 -66 -165 -60 -37 -22 239
6427B39L9r3j61J37o5N4l3q7p1J56Q5j48k7J62l32K6J20l10K63j70J32N8P1J1
$$ 239 278 185 24 161 96 150 117 30 -41 115 200 52 25 187 -145 -119 1 -309 -46 -216 -84 -26 45 56
6451E6J7r0mQ7J38n18J61L75l84J66K12l81j9M03k67N8J31j95L57m71L75J82n40
$$ 56 73 -17 -21 66 204 -314 -153 222 -162 4 216 -165 -184 219 -48 10 141 -54 303 -168 207 389 -151
6474a51J33J01J04k28M5rK4L8k22J73l90J78L45j61R8j60k0o0K18l14lK21k00
$$ -151 -18 83 187 -41 4 -5 19 57 -165 8 -382 -204 141 -20 78 -82 -102 -162 56 -258 -261 -40 -240
6497b40L54q0j1L5j83J87l99L34j21J32J81k01J70k79L02l89J40j06J08L36l83
$$ -240 114 34 23 58 -125 62 -337 -3 -124 8 189 -12 158 -121 181 -208 -68 -174 -66 270 -113
6518a13K65L3j19j83K59j66j7j02K50%k98K80L1K9k46L2MK94l67j80J75K15p5
$$ -113 152 185 66 -117 142 -24 -41 -143 107 107 -191 89 120 149 -97 -65 -61 233 -134 -314 -139 76 1
6541An9M5O9k13OL73q4p4n0r4J78K7n4M8k10K7LK77q0k4K04l39Q0j02P5rL6j11
$$ 1 -58 -13 56 -157 -151 222 138 64 14 -80 98 125 71 119 -91 -64 -61 216 136 112 316 -23 57 -45 30 21 57 -54
6569e4M3K3P0O6K3k47L11l50K63k2p4P8P2j60j1j0k4k46M40k89K81k94J71R5j95
$$ -54 -11 12 82 148 171 -76 235 -115 148 126 52 130 202 42 31 21 -3 -249 191 -98 183 -111 60 155 -40
6594d0J54l18M5K00omk4j62J89k32J52m4l6J86o1n1j46K00J25k76J47J62j79O3
$$ -40 114 -204 -159 41 35 31 7 -155 34 -198 -46 -90 -126 60 -1 -52 -198 2 127 -149 -2 160 -19 44
6618D4k74J33l0J62K9R3n04KM33j14R0k26L0j50Q5J49k2j7M3J23j68j06M58k19
$$ 44 -230 -97 -127 35 64 157 -347 -345 88 -26 64 -162 -132 -282 -197 -48 -70 -87 -44 79 -89 -195 263 44
6642D4O1k0j35L06j64j84j2J18J40j84O1K56j81q3j28m9N4L84l54J37k86L07j46
$$ 44 105 85 -50 256 92 -92 -104 14 154 -30 31 287 106 23 -105 -154 -100 284 -70 67 -219 88 -58
6665e8kj93K38P4m6r9J33l31J52J57r6J97j72k6l87N41k54J07J59r7j4m8K7j46
$$ -58 -60 -253 -15 59 13 -86 47 -284 -132 25 -71 126 -46 -72 -459 82 -172 -65 94 -3 -17 -65 -38 -184
6689a84J29j35%M69j64l13j9Q2N0J20M05l97k30J54n1p0jK55P8k17k64L13l7P1
$$ -184 -55 -190 -190 279 115 -198 -217 -135 -85 35 440 43 -187 -33 -84 -154 -155 100 178 -39 -303 10 -27 44
6713D4j27O0n0J49k81J47L9l0P0km8p4O3o7L06N7o10L92j49J47o2p8N3J22k2n4
$$ 44 -83 -23 -73 76 -205 -58 -19 -49 21 19 -29 -103 -40 -107 199 256 -354 38 -111 36 -26 -104 -51 71 49 -5
6739eJ09l15J27K93j33P9l58L80n8k1l78K07Nj84M9M31l40K06J58j71n1pJ07j29
$$ -5 104 -211 -84 209 76 155 -203 177 119 98 -280 -73 -68 -252 -203 228 -112 94 252 81 30 23 130 1
6763AO8O2q6J47l35L07r7K02J01l85KN5rl51L26r3J71l71J31K84k48L13k7k93
$$ 1 69 131 45 192 -143 164 67 269 370 -15 -13 42 33 -318 8 -85 86 -285 -154 130 -118 195 168 -125
6787a25J75J42k47J01l97K40K64l87M42k17k60M60m62K78K64k67L20m27J62l7
$$ -125 50 192 -55 46 -351 -111 153 -234 208 -9 -269 191 -271 7 271 4 324 -103 59 22
6807B2q6K3J72l14K58j00M6k80P6N9M3M08l74j7J70j22j72o3K55J85k16m0K67
$$ 22 -64 -41 131 -183 75 -25 21 -259 -183 -124 -81 327 -47 -64 106 -16 -188 -251 4 189 -27 -67 200
6830B00k95J36N2k68L62J7k27%j16K30O0J73l64j88Q3K10O1k8J03j12m3J41l51
$$ 200 -95 41 93 -175 187 204 -23 -23 -139 91 151 324 -40 -228 -145 65 126 98 201 89 46 187 -164
6853a64R1J14O9nJ53l82j01L65l76L30p9J96l40L5p0L35M8j75o3M9L42k33r4J45
$$ -164 -73 41 110 105 258 -124 -225 140 -236 94 15 211 -129 -94 -164 171 219 44 -19 30 372 139 45 190
6877A90o05K14K0K29k40K94k67J76Q4k25m8J46q0K28p9j07M5Q1O7o2P7k16M62
$$ 190 -415 -201 -181 48 -192 102 -165 11 95 -130 -178 -32 -112 116 37 -70 -25 56 123 61 138 -78 384
6900C84l07n5J09m29R7J76M1L5j05J19j89p2J28n2K57k79J36J58k81m9Q2j0J47
$$ 384 77 22 131 -298 -201 -25 16 51 -54 65 -124 -196 -68 -120 137 -142 -6 152 -129 -178 -96 -106 41
6923D1l1o6j44M53j15j27R4j70K38j10k46J30N4O7j78K7j20L07j78J3K09j92O6
$$ 41 10 -56 -200 253 138 11 105 -65 173 63 -183 -53 1 68 -110 -83 -203 104 -74 -61 148 -44 22
6946B2O5j20l1J0N0k03J18J86k37J50l8K9m3nP5k54O67n69M8L25l62j16K15p5
$$ 22 87 -33 -64 -54 -4 -207 -89 97 -140 10 -28 1 -42 -47 28 -226 441 -128 -80 245 -117 -233 -18 -93
6970i3P1J90r9O3j22j16K07n8P8J61o13M20o3%R0k97M34k21L0K42m09j06M6R8
$$ -93 -22 168 69 132 10 -106 101 43 121 282 -331 89 26 26 116 -181 253 32 62 304 -105 -211 -165 -67
6994f7J12J48k91J51O1p24P15k12K86k95K35q1Rk15J19O6K8N3J7K29m21L34j62
$$ -67 45 193 -98 53 114 -610 105 -107 179 -116 119 38 47 -168 -49 17 45 98 115 344 -77 257 95
7017I5qk39L1L66m0l29L3L06k15O1ok31l1p0L20j07q7K6K33o9n7R7o2l2j71q4
$$ 95 87 -152 -121 245 205 -124 -91 215 0 61 55 -176 -207 -277 43 -64 -151 -125 108 39 -18 79 17 -15 -186 -270
7043b70L68j79j12O2k7K73mp5k7n2MK18k69L37m87K11RJ29J8j26m4P6J12m45M05
$$ -270 98 -81 -193 -131 -158 115 111 36 9 -43 -39 179 -90 247 -240 -29 -20 109 127 1 -43 33 145 -300 105
7068A05J18k95q9Q6j28J10P4L9j7J59N4k48j7k77L79P1k33j88K70o4J4K54J81
$$ 105 223 -72 -161 -75 -203 -93 -19 20 3 162 216 -32 -49 -326 53 124 -109 -297 -27 -91 -77 177 358
7091C58j88l93J74J38R4l48L65k13j55K53j98N5K52m57J5j1R8J42Q4j77J61L8
$$ 358 170 -223 -49 89 183 -165 200 -13 -168 85 -113 -58 194 -263 -248 -259 -161 -19 65 -112 49 87
7113H7l00J38q6K00N3M9j46k24K43J6J18K22m48m6k3M4KJ54l39M33j80J52k90
$$ 87 -213 -75 -161 39 92 141 -5 -229 14 30 148 370 -78 -124 -147 -103 -101 53 -286 147 -33 119 -171
7136a71J34K11m4k52mJ65R8m06L24np3N6j25L8J58k0k40L25k14j28M15q7m1O5
$$ -171 -37 174 130 -122 -126 39 137 -269 55 50 -23 33 -92 -54 104 84 -156 169 -45 -173 242 155 114 179
7160A79Q9m65K10o8j5r3Q4NJ85k83j43N44l98N2K02P8k56j65K65K07l21q9M34
$$ 179 268 -197 13 -55 -70 -163 -79 -74 111 -172 -315 229 -169 -117 85 163 -93 -258 7 214 -107 -196 238
7183B38o6q4k20L66l04j32P5J3j6M13j15j36k66J27L02m28K5K36K6J46j57k9N
$$ 238 172 88 -132 234 -70 -202 -127 -114 -130 283 168 32 -234 -107 195 -233 -208 28 54 200 43 14 19
7206A9N0k22K04M6k74K40J9j35L35m14p7J35L68l23O8j45L8j40L41R8l37J6L1
$$ 19 69 -153 51 97 -177 63 82 -53 282 -132 -209 -74 294 -29 39 -106 -68 -208 133 231 -106 -90 -59
7229e9J74j54J40J0k37o8K11J50j18L75l45N7qm58K70P7j76J14L4n0N08l69p1
$$ -59 115 -39 101 111 -126 -194 17 167 49 424 79 136 128 -330 -60 17 -159 -45 -11 -61 447 78 7
7252Glk45K02Q0K2j41j5J63j35L54m53L30j30j46K48l14J91J56N0l96j83L09R0
$$ 7 4 -241 -39 41 63 -78 -93 70 -65 289 -164 166 36 -110 138 -176 15 171 221 -175 -358 -49 41
7275D1n8K97l2k61J59p6K6jj19j4j27n8J42K68l81L69k02M6j02j60L30J68l18
$$ 41 -17 280 248 -13 146 70 96 95 -24 -38 -165 -223 -81 187 -194 175 -27 19 -83 -243 87 255 -63
7298f3k03kM23p8K6q8k35K72J18r5l48MJ72MJ23K2Lj04K03j3j83l7j88O1J38J91
$$ -63 -266 -268 155 77 103 15 -220 52 170 75 -273 -269 -97 -93 30 52 55 -49 154 141 -42 -79 -267 -206 -68 123
7324A23l6l55K07K62l16J47k33K63k18K09Ro5p8qk34J66J20j36L20q8j95r0P4
$$ 123 87 -268 -61 201 -115 32 -201 62 -156 53 62 -3 -81 -89 -323 -157 -37 -173 147 59 -136 -226 -152
7347a52K83l23R8L5nj55Q6P8l1J07l8m6K66j88K9j01K24N8Lk01l38K77j07q4L86
$$ -152 131 -192 -94 -59 -64 -219 -133 -55 -86 21 -17 -63 203 15 44 -57 167 225 228 27 -311 -34 -141 -225 161
7372A61J5l04j04K84J05k55j47K58pl7J65m07R5M7J01j20k02j49M92P6l32M11
$$ 161 176 -128 -232 52 157 -98 -245 13 6 -31 134 -273 -178 -131 -30 -150 -352 -501 -9 67 -265 146
7394A46J91m05J30J46k12oO0k04R6L15j85j57o3R4k1k5L05P5k59J76k21k70K48
$$ 146 337 -68 62 208 -4 -10 50 -154 -58 257 72 -85 -148 -54 -75 -100 205 280 21 197 -24 -294 -46
7417d6K50k39K66j48j54P8o6K1p0K6KJ1j22M86k20Q0j57P0k35J00l3N5P2l7L4
$$ -46 204 -35 231 83 -71 7 -59 -38 -108 -82 -80 -69 -191 295 75 155 -2 68 -167 -67 -100 -45 27 -10 24
7442B4j7l9j30J98k95K22m7K0O2NJ56m5j6q7n5N8M9kk08O7j19K89o8k0p5r0J22
$$ 24 7 -32 -162 36 -259 -37 -84 -64 -2 3 159 114 98 11 -44 14 63 61 -147 -80 -199 90 22 2 -73 -163 -41
7469d1J28o0J22n7p5k85J76J13jJ46P1k90R3Q8m8J57j52q8L9l37K98j14Q2K51
$$ -41 87 27 149 92 17 -268 -92 21 20 166 237 -53 40 128 80 237 85 -3 36 -301 -3 -117 -35 216
7493B16j74K19l99J01k54J72M8j81N81k09o8j55J41k9j73K09j39K79l3J0L1q5
$$ 216 42 261 -138 -37 -291 -119 -71 -252 329 120 52 -103 38 9 -164 45 -94 185 152 162 193 108
7515A08j39J07J10m82M95J9k95J48j59J28l2J1K20k39J6Oj86M34j18r6n2J08j56
$$ 108 -31 76 186 -296 199 218 -77 71 -88 40 8 19 239 0 16 22 -164 270 152 56 4 112 -44
7538d4J54j30m2j40J97N2r2Q7n3j61J57J44J33k01R9k42j34M22j53j36J2m2jL04
$$ -44 110 -20 -62 -202 -5 47 -45 42 -11 -172 -15 129 262 61 160 -82 -216 206 53 -83 -71 -113 -114 190
7562A90k43J87J2j09j99J09p5J9K57l10K33j93J63J03n6k4J02j81j02P0pQ1J92
$$ 190 -53 134 146 37 -162 -53 -128 -109 148 -162 71 -122 41 144 88 64 166 -15 -117 -47 -54 27 219
7585B19l18J61o0o1R5k06J6J03K45k17m3J63l61R9K18j19Q2J46m99J83O16k77
$$ 219 -99 62 2 -59 36 -170 -154 -51 194 -23 -66 97 -264 -165 53 -66 16 162 -337 -154 462 185
7607A85l80J11K65q7k4o7MJ81j14k8l9q5j92L72k52K45j28j06jK64j33P3r0j36
$$ 185 -195 -84 181 94 70 3 7 188 74 46 7 -78 -270 102 -150 95 -33 -139 -140 124 -9 64 -26 -162
7631a62J34j6Lk49L08J17k9k49L09j27k05P8k47K74lM6k35K47j8j02J5J19j54
$$ -162 -28 -44 -41 -290 18 135 106 -143 166 39 -166 -88 -335 -61 -64 -18 -253 -6 -24 -126 -111 8 -146
7654a46J72K36k72J12j54J89O4k88j19M5J7J08O0j02J01J07j64pK03j29K08l24
$$ -146 26 262 -10 102 -52 137 201 -87 -206 -161 -144 -36 24 -78 23 130 -34 -41 162 33 241 -83
7676h3p5N2kJ24pJ87q3P6l40L9L77m51L10L0m79K69M5j14J74K4j36J71j2J31l01
$$ -83 -158 -106 -108 16 9 196 113 189 -151 -112 265 -186 124 154 -325 -56 -11 -125 49 73 -63 108 96 227 -74
7701g4M2l8J00K0o4J44j52m5J31k7J0L4o6J0k50Q9l5J0M4M5l8K83k06j71M45q0
$$ -74 -32 -70 30 50 -14 130 -22 -67 64 37 47 81 15 25 -225 -136 -171 -161 -117 -72 -110 173 -33 -204 241 161
7727A61q8j20J12l17%K19J40J61k4k26J88k11o8o4M9K8J35P5j20J7M7j2k87L82
$$ 161 73 -47 65 -252 -252 -33 107 268 244 18 206 -5 -73 -137 -88 -60 75 150 30 47 94 82 -205 177
7751A77j28l04M3jkK02o9K9k35L73ml30J20L04j08o9j26L43q2l86K11J6P6r6m1
$$ 177 49 -255 -212 -213 -215 -13 -82 -53 -288 85 81 -249 -129 175 67 -2 -128 215 133 -253 -42 -26 50 -46 -87
7776h7K25N0j21J39R9k15j35K55k11J12l14M61m63J56r1J89j46J63n1m3j64J32
$$ -87 138 188 67 206 305 90 -45 210 -1 111 -203 258 -205 -49 -140 49 -97 66 15 -28 -192 -60
7798f0n3L33l60K5n6J28J58j92p4L53k30K27j27j78j06K32q9J98l42K37p7J9J85
$$ -60 -113 220 -140 -115 -171 -43 115 -77 -151 202 -28 199 72 -106 -212 20 -69 129 -213 24 -53 -34 151
7821A51q0j03k04K06l27K92K08j42J82k78O6J88k49l7MJ85L6j30k21J50p5M4J90
$$ 151 71 -32 -236 -30 -357 -65 143 1 183 -95 -29 159 -90 -127 -123 62 98 -32 -253 -103 -178 -134 56
7844E6l41K49p3qj1L86m43J30J07r2k89L49J31p4J3o6q5J07k91L01j34J25L4q0
$$ 56 -285 -36 -109 -117 -128 258 -185 -55 52 -40 -329 20 151 77 90 24 -61 46 -245 56 -78 47 81 1
7868AP0o6p3M0L55k48q3j70L9L14j01l5l1k34J00J31O9j15m3L6r0J68l5J07l09
$$ 1 71 5 -68 -28 327 79 -4 -174 -135 179 78 43 12 -222 -122 9 78 -37 -80 -44 -134 34 -1 106 -203
7893b03K77q2K58l34M9M84n00J80k41j1K31Mo2K5J28j27j61J86m3m29O53j44j75
$$ -203 74 -8 250 -84 -35 449 -51 129 -112 -123 108 112 50 75 203 76 -85 101 58 -371 282 138 -37
7916c7j35j26L59M0k50J85lJ61k05K3o8J0K3K9J96m01K63m5j59K02J25j05J61
$$ -37 -172 -298 61 101 -149 36 33 194 -11 12 -56 -46 -23 6 202 -199 64 19 -140 62 187 82 243
7939B43j94k16m7J33L37m15P2K54J7k37J05p3O3q9K8j99J18K37k48M18k52J54
$$ 243 49 -167 -214 -81 256 -159 -87 167 184 -53 52 -21 42 -47 -19 -218 -100 137 -111 307 55 209
7961B09k26j21J15o8KQ5m7N4k26L83k63K52j49j48j15N62j69j12rK7j45j6M1J87
$$ 209 -17 -138 -23 -91 -89 -4 -51 3 -223 160 -103 149 0 -148 -263 299 130 18 9 36 -109 -125 -84 103
7985A03k40k6j07L22K1J60j29k17j73M01p5o2m5L2j08J65J5QO5K7j4M7M4l72J97
$$ 103 -137 -163 -270 52 73 233 104 -113 -286 115 40 -22 -67 -35 -143 22 37 45 110 137 123 170 214 -158 39
8010C9O2Q0k46q9J97K2R4J44j17j83O7K7j58K33k86K61l48M45j66j44K07j95J12
$$ 39 101 181 -65 -154 43 65 159 303 186 3 70 97 -61 172 -114 147 -201 244 78 -66 141 -54 58
8033E8p2K88m47j2M7K30K2Rp7r0K21j67m5K55l22J54%k15K03J39j15O3j14l3m0
$$ 58 -14 274 -173 -185 -138 92 114 123 46 -44 177 10 -35 220 -102 52 52 -163 40 179 64 127 13 -20 -60
8058f0R5n1k85L72k00N51l39n0j73K16j90K57m03K39J5k5J14j5j86M8J16K6j28
$$ -60 35 -16 -301 71 -129 422 83 33 -140 76 -114 143 -260 -21 -6 -31 83 68 -118 -70 46 72 -56
8081e6j70J96K5o4J3K5p7J67k01L53l3n7J50m45K76p8k77K14l3J95o3j04L75l24
$$ -56 -226 -30 -5 -69 -56 -31 -108 59 -142 211 178 121 271 -174 102 24 -253 -39 -72 123 60 -44 331 7
8105Gl45O83l28M2j50J08j02n5r9J56L3J2j15L59k36k9K70j96j46R8J2l8K41j02
$$ 7 -338 345 17 59 -91 17 -85 -140 -239 -83 -50 -38 -153 206 -30 -59 211 15 -131 -33 -21 -59 182 80
8129H0j71K67Mk53j65J19J25k14R6M6J17m8j1o5J09k73K78k73N45o25M58r9rj6
$$ 80 -91 176 180 -73 -238 -119 6 -208 -112 -66 51 3 -8 -73 36 -237 41 -232 313 -312 146 47 38 22
8153B2k13K14pJ9j59P1N3j14PP4j48K58j99n8J17J18M6j95K17mj98r9R6j0J81
$$ 22 -191 23 16 35 -124 -53 0 -114 -107 -33 -181 77 -122 -180 -63 55 101 -94 123 119 -79 -178 -82 -92 89
8178H9N98o90j43L54k93j3J75k33J48J97j52Km88
$$ 89 687 -3 -146 208 -85 -98 77 -156 -8 189 37 39 -449
8191d49
$$ Imaginary data points
##PAGE= N=2
##DATA TABLE= (X++(I..I)), XYDATA
0@%%%%%%%%%%qJ6j6J6j7K5l2M0m8N6p2Q8j04J20j44J68j92K24k58K98l44L92m45
$$ 0 0 0 0 0 0 0 0 0 0 0 -8 8 -8 8 -9 16 -16 24 -24 32 -40 48 -56 64 -80 88 -104 120 -138 160 -184 208 -237
33b37N04n71O43p21Q09r05J011j125J250j388J537j700J879k074K288k521K777
$$ -237 267 -304 339 -382 427 -478 533 -592 658 -730 807 -893 986 -1088 1200 -1321 1456
50A456l058L367l711M093m518M997n541O162o879P720q724R941j1454J3396j5988
$$ 1456 -1602 1765 -1946 2147 -2371 2626 -2915 3247 -3632 4088 -4636 5305 -6149 7247 -8741
65h741J9638k5197L4771n5716J81873n3612j83317J97868j77030O4382P9786n9091
$$ -8741 10897 -14300 20471 -35245 146628 93016 -90301 107567 -69463 -5081 74705 15614
77A5614L8764K6150r6189M6872o88q6786J09695j1476m6411O8027q5330L5410
$$ 15614 54378 80528 -15661 31211 30523 -56263 53432 41956 -4455 63572 -21758 13652
89A3652j7712q236M4844l9028K4014l4248Q406K271l5568M8807k5786J1047N572
$$ 13652 -4060 -12296 32548 -6480 17534 -16714 -8308 -6037 -41605 7202 -18584 -7537 -1965
102a965j1313j2240j397P316j4909N1335n6947J3710L3647q3246R1139l6975l4179
$$ -1965 -13278 -25518 -26915 -19599 -34508 16827 -40120 -26410 7237 -76009 15130 -21845 -56024
115e6024Q0064n5838O349J7179k0691K250L0674j5652m441L3181o2775N3237p136
$$ -56024 24040 -31798 -25449 -8270 -28961 -26711 3963 -11689 -16130 17051 -45724 7513 377
128C77m8177Q0844m2862O429J3979j8957K0432j7118J7615j0286J8645j4414o235
$$ 377 -47800 33044 -9818 -3389 10590 -8367 12065 -5053 12562 2276 20921 6507 272
141B72L1673n0214L5780O371j5640R002j2603K5164k9757J7417m442k649K5005
$$ 272 31945 -18269 17511 23882 8242 17244 4641 29805 48 17465 13023 10374 35379
154C5379m1025L9180k3245j5318L3105k7081J3111j1347J2458o045o740P988j7724
$$ 35379 -5646 33534 10289 -5029 28076 995 14106 2759 15217 9172 2432 10420 -7304
167g304L3967l6468J4948J3995m1062L8422k4096J894N268n858J1598j9427J7884
$$ -7304 26663 -9805 5143 19138 -21924 16498 -7598 -5704 -436 -6294 5304 -14123 3761
180C761k3446J8472j498j9822L4730l5535K3578q48k2663K1056j3296J4495j6627
$$ 3761 -19685 -1213 -2711 -22533 12197 -23338 240 -608 -23271 -2215 -15511 -1016 -17643
193a7643J2624l909p984K0597l0946L3240j7519l043L1305l8545J8328k024L386
$$ -17643 -5019 -8928 -16912 3685 -27261 5979 -11540 -14583 16722 -21823 -3495 -5519 -2133
206b133l043n156J8525j9096J9474k2455J1142J2674l0389L9569k0305o87Q437
$$ -2133 -5176 -10332 8193 -10903 8571 -13884 -2742 9932 -20457 19112 -1193 -1880 6557
219F557o698J1549k3064K3632p469K144j375j4424K9373l1114J8338N943j6469
$$ 6557 -141 11408 -11656 11976 4507 6651 5276 -9148 20225 -10889 7449 13392 -3077
232c077J8222j5985J4387j6728O723P429q913J6525k9545K5889r616j5923K7013
$$ -3077 15145 -840 13547 -3181 3542 10971 2058 18583 -10962 14927 5311 -10612 16401
245A6401k2950J6863n443l24j402p477J5881j8666K1752j6794J418J5554l1905
$$ 16401 -6549 10314 4871 4547 3145 -4332 11549 -7117 14635 -2159 -741 14813 -17092
258a7092K7143j7268K936J5327j6724R317j2627J4388j2381L984O943j3355K3901
$$ -17092 10051 -7217 -4281 11046 -5678 3639 -8988 5400 -6981 -2997 3946 -9409 14492
271A4492k8997J3431J851j9620K6601j5364P163p456L929N406j7070J7557j2864
$$ 14492 -14505 -1074 777 -18843 7758 -7606 -443 -7899 -3970 1436 -15634 1923 -10941
284a0941J8430r964j1089K3341k6367J4662j685o0L175r301J8064k0846J0273
$$ -10941 7489 -2475 -13564 9777 -16590 -1928 -3613 -3673 -498 -9799 8265 -12581 -2308
297b308l501L543J4324k8376K6136j0130o596J0785j0218J2931j1478J3288r406
$$ -2308 -5809 -2266 12058 -16318 9818 -312 -6908 3877 -6341 6590 -4888 8400 -1006
310a006k167P105j3830K6404k2544Q090J1898k0007J6453j4967R468n48k96M346
$$ -1006 -3173 3932 -9898 16506 -6038 2052 13950 -6057 10396 -4571 4897 4349 4053 8399
324H399j2445J5069j7864J3806k437j1189K4182k1132J1810m596o769J0803p836
$$ 8399 -4046 11023 -6841 6965 4528 -6661 17521 -3611 8199 3603 -3166 7637 -199
337a99J1190j5750J2505m489p606J2363j9593K2497r269m967J2366j5414J0316
$$ -199 10991 -4759 7746 3257 -4349 8014 -11579 10918 1649 -3318 9048 -6366 3950
350C950q590R843o939k541J3490j7423J3022j6114Q307J0573k0803J8022r080
$$ 3950 -4640 5203 -1736 -4277 9213 -8210 4812 -11302 -2995 7578 -13225 4797 -4283
363d283K832l244m01P158j3439J7362j1925N487k423j1601K3496k0619P822L227
$$ -4283 -1451 -4695 -5096 2062 -11377 5985 -5940 -453 -2876 -14477 9019 -11600 -3778 -551
377e51m542O484j1827J2699j0777Q929l96n497J3148k0145J7444n583q300J3602
$$ -551 -5093 1391 -10436 2263 -8514 415 19 -5478 7670 -12475 4969 -614 -8914 4688
391D688r734J1514j0561M903q57k135J0513j5551J7218j0079O14R336j7054J5162
$$ 4688 -5046 6468 -4093 810 -47 -2182 8331 -7220 9998 -81 533 9869 -7185 7977
405G977q381M751K77m633O691j0554J4248j2141L887O834j0702J5244j7638P974
$$ 7977 -404 4347 4624 -9 6682 -3872 10376 -1765 2122 8956 -1746 13498 -4140 3834
419C834L483r419R089q433Q717j0144O257L50j0025J4239j2703J2856p223p339
$$ 3834 7317 -2102 6987 -1446 7271 -2873 3384 3734 -6291 7948 -4755 8101 878 -6461
433f461J5373j3184O226o274O607m35q354J1413j3921J0427n782J406Q149j6548
$$ -6461 8912 -4272 1954 -4320 2287 1852 -6502 4911 -9010 1417 -4365 -2959 5190 -11358
447a1358J5174o588j99k6l105J0736j2091Q751p081K200M189j2252J7051j3026
$$ -11358 3816 -2772 -2971 -2997 -6102 4634 -7457 1294 -5787 -3587 602 -11650 5401 -7625
461g625M903N174q486O568p731J0346n904K102J862p550J3078j4794Q415mn812
$$ -7625 -2722 2452 -6034 534 -7197 3149 -2755 -653 1209 -6341 6737 -8057 358 354 -5458
476e458J2660j2211P585l851J532L119n554Q894j0431J0761n533l742Q616j2411
$$ -5458 7202 -5009 2576 -1275 257 3376 -2178 6716 -3715 7046 1513 -2229 6387 -6024
490f024J5260q286j830O802o039O085r101J0165n229l03P175j2005J0921j0028
$$ -6024 9236 950 -880 5922 -117 5968 -3133 7032 1803 1500 8675 -3330 7591 -2437
504b437N144L711j0395Q836n556O394q244J191P016r071J0222j0203O423j207
$$ -2437 2707 6418 -3977 4859 -697 5697 -2547 -1356 5660 -3411 6811 -3392 3031 1824
518A824p887J2548j1964N408m78L62P72p793R909q029P443m645k217J0924j4381
$$ 1824 -6063 6485 -5479 -71 -549 -187 585 -7208 2701 -5328 2115 -2530 -4747 6177 -8204
533h204R374l548j894N248n550P184r407N917j274k090N510r368J2955p495J112
$$ -8204 1170 -2378 -4272 976 -4574 2610 -6797 -880 -2154 -4244 1266 -8102 4853 -2642 -1530
548a530K460p341J0708q216N024k234j080M728q541J0150r220N628L232p765R695
$$ -1530 930 -6411 4297 -3919 1105 -1129 -2209 2519 -6022 4128 -5092 536 3768 -3997 5698
563E698j0166O586P0k726K462l569R062j1191N304J76n007J0041j0524Q993l858
$$ 5698 -4468 2118 2188 -538 1924 -1645 7417 -3774 1530 1706 -3301 6740 -3784 5209 1351
578A351k713P513p748N342n127O714j911n201N756o797R003q029J503O690j0329
$$ 1351 -1362 6151 -1597 3745 -1382 5332 3421 -1780 3976 -2821 6182 -1847 -344 6346 -3983
593c983R027o232K585j655l72O633r511P665o407L360J682r506J0914o100K566
$$ -3983 5044 -1188 1397 -258 -630 6003 -3508 4157 -2250 1110 2792 -6714 4200 -1900 666
608F66j479j508M089o637Q732p371L568Q41n298Q956j1976P339j01l089N851q214
$$ 666 -813 -2321 1768 -4869 3863 -3508 60 901 -4397 4559 -7417 -78 -179 -3268 2583 -5631
624e631O377l896K259j120j962P550q680Q060n237j005N804p279P654o164K630
$$ -5631 746 -3150 -891 -2011 -3973 3577 -5103 2957 -2280 -3285 2519 -4760 2894 -3270 -640
639f40N74k419M603q066R563l260j273L579o333Q331p246L743P42l030M478n282
$$ -640 -66 -2485 2118 -5948 3615 355 -918 2661 -3672 4659 -2587 1156 1898 -1132 3346 -1936
655a936O175p505L480L943o344P211q197O981m51o409P192m674M178m165K702
$$ -1936 4239 -3266 214 4157 -2187 5024 -3173 3808 3357 -3052 4140 -534 3644 -521 2181
670B181q61m461Q045p261N437l215n65O681r180O095l849K941N50n275O721o637
$$ 2181 1320 -3141 4904 -2357 3080 -135 -700 5981 -3199 2896 -953 1988 2538 -2737 3984 -2653
686b653M781l456R0L494o490Q268o240J157J321k655N501o462N256l474J534J547
$$ -2653 2128 -1328 -1238 2256 -4234 4034 -2206 -1049 272 -2383 3118 -3344 1912 -1562 -28 1519
702A519p413Q480n807K921N15m263N907n725N040l222J024J375k888N968p911
$$ 1519 -5894 2586 -3221 -300 215 -4048 1859 -3866 1174 -2048 -1024 351 -2537 3431 -4480
717d480M084k31j497M337p621P644l454q75K781l407N212n344N615k841j798M718
$$ -4480 -396 -627 -2124 2213 -5408 2236 -1218 -2093 688 -2719 2493 -2851 2764 -77 -1875 2843
733B843n615O612o434K169L680m637L342m724N978k960p53M577o370O284n045
$$ 2843 -2772 3840 -2594 -425 3255 -1382 1960 -2764 3214 254 -499 4078 -2292 3992 -1053
748a053K916M69m864P033m694K167k865O74L199n127N565m847M094q58l599N780
$$ -1053 1863 2332 -2532 4501 -193 1974 -891 -217 2982 -2145 3420 -1427 2667 1809 -1790 3990
764C990o725N312j884q30J787m500N451m762K820j626o46N331o958N149l214J068
$$ 3990 -2735 2577 693 -137 1650 -2850 2601 -2161 659 -967 -1613 3718 -3240 1909 -1305 -237
780b37K144m970N234m626L405j752j221L220n704O716m116O96J336l352O128o360
$$ -237 1907 -3063 2171 -2455 950 -802 -2023 1197 -4507 2209 -1907 -1211 125 -3227 2901 -3459
796c459L256K99p11J654m836N821n108K875O88l443N034n605N217k186j771L675
$$ -3459 -203 96 -615 1039 -3797 2024 -3084 -209 479 -2964 2070 -3535 1682 -504 -2275 1400
812A400k826M286n627L471L07k822M185n434N450l019l9L362n192M719l057L038
$$ 1400 -1426 2860 -2767 704 1011 -1811 2374 -3060 2390 -629 -668 2694 -2498 2221 -836 2202
828B202j053k011M432m756M165m359J929K466m922N247m472K705o69j424L512
$$ 2202 1149 -862 3570 -1186 2979 -1380 549 3015 -1907 3340 -1132 1573 904 -520 2992
843B992m754N122l604J451M07m151O078m875K690j483j049L653n019L829l258
$$ 2992 -1762 3360 -244 1207 1614 -2537 3541 -1334 1356 -127 -1176 2477 -2542 1287 -1971
858a971K827J58k893M527n579L902j193j183K829m749N276l309M15K0j162M073
$$ -1971 856 1014 -1879 2648 -2931 971 -222 -1405 1424 -3325 1951 -1358 -943 -923 -2085 1988
874A988n284M226j890PK143m307M971m181K149Q60k467K225l856N273l290j99
$$ 1988 -3296 930 -960 -953 1190 -3117 1854 -2327 -178 682 -1785 440 -3416 1857 -1433 -1632
890a632K719l227M608m952K883K00j932L582l919L584l429J616J499l864M279
$$ -1632 1087 -2140 2468 -2484 399 599 -1333 2249 -1670 1914 -1515 101 1600 -2264 2015
905B015l380L549k092j575L981l732L682k857J167R15k764L426m362L971k106
$$ 2015 -1365 2184 92 -1483 2498 -1234 2448 -409 758 1673 -1091 2335 -2027 1944 -162
920a62K6K958m979M198k414J269L82k601M048l386K767l143M48K820m288M268
$$ -162 -136 2822 -2157 2041 -373 896 1278 -1323 2725 -661 2106 -1037 -589 2231 -2057 2211
936B211l847K170j77k034L964m692L431q16n2M21k999M754m065J636n25j065L511
$$ 2211 -1636 534 357 -1677 2287 -2405 1026 210 158 579 -2420 2334 -1731 -95 -620 -1685 1826
953A826m805L556j933J55J431j860L373m688L535k00j811K107l423M598l149n6
$$ 1826 -2979 577 -1356 -1201 230 -1630 1743 -2945 590 390 -1421 686 -2737 1861 -1288 -1344
969a344J734k334L378l807L174p91p77K417l345L208l452K674J002l476L220k846
$$ -1344 390 -1944 1434 -2373 801 10 -767 1650 -1695 1513 -1939 735 1737 -1739 1481 -1365
985a365L046k149m55K357k833L762l416J737J83k121L728l789K923j665K67J616
$$ -1365 1681 -468 -923 1434 -1399 2363 -1053 684 867 -1254 2474 -1315 1608 -57 210 1826
1001A826l534L339k773K583q31j760L102l039K942k283N66J796l764L701k833
$$ 1826 -1708 1631 -1142 1441 610 -1150 1952 -1087 1855 -428 138 1934 -1830 1871 -962
1016i62J452n54j18J982m238L805j650M09P21k840M212l042J434q52m43J923l308
$$ -962 490 -64 -182 1800 -2438 1367 -283 126 847 -1993 2219 -823 611 -241 -684 1239 -2069
1033b069L380k987J103R56j707K643l743L022m81q96J321k380L393l027J278Q9
$$ -2069 1311 -1676 -573 383 -1324 1319 -2424 598 117 -779 542 -1838 1555 -1472 -194 -105
1049a05j424K789l259K986j886n89K654k271K177k340K009k73j301J947k905L151
$$ -105 -1529 1260 -1999 987 -899 -1488 1166 -1105 1072 -1268 741 468 -833 1114 -1791 1360
1065A360j954M6J747k853L120k570J835m10q90K382k553J988j748J146J038l138
$$ 1360 -594 -548 1199 -1654 1466 -1104 731 321 -569 1813 -740 1248 -500 646 1684 -1454
1081a454K995k658K312o05j449K137k012K252j875J328n3k103L484l188J351n70
$$ -1454 1541 -1117 1195 590 -859 1278 -734 1518 -357 971 918 -1185 2299 -889 462 -108
1097a08j23J759l361L011j987J110R0j708L172l175K444j288j92J193k211L216
$$ -108 -231 1528 -1833 1178 -809 301 391 -1317 1855 -1320 1124 -164 -356 837 -1374 1842
1113A842l051O73O95j090J895l097K986j470M37O75k302L105k652J416J61j286
$$ 1842 -1209 -536 159 -931 964 -2133 853 -617 -180 495 -1807 1298 -1354 62 223 -1063
1129a063K022k079K113k317L34J826k027K063k496J900j34j051J880k160K566
$$ -1063 959 -1120 993 -1324 -990 836 -1191 872 -1624 276 142 -909 971 -1189 1377
1144A377j938K41P60j791K099j895K096j304o20K457k935K329j511R55P68j666
$$ 1377 -561 -320 440 -1351 748 -1147 949 -355 -975 1482 -1453 876 -635 320 1088 -578
1160e78J544j992K345j532j35J732k908K841j893P99J36j372L001k609J233q03
$$ -578 966 -1026 1319 -213 -348 1384 -1524 1317 -576 223 359 -1013 1988 -621 612 -191
1176a91O05O55k243K402j949J562l43j400K182k667K271q04j17M53r90K176k780
$$ -191 414 1069 -1174 1228 -721 841 498 -902 1280 -1387 884 80 -37 416 -574 1602 -1178
1193a178J376l1m38J427k700K064p98k37P76j294J840j946J844n67p95J537j957
$$ -1178 198 167 -271 1156 -1544 520 -278 -515 261 -1033 807 -1139 705 138 -657 880 -1077
1210a077K310k346O74P27j483J908k078J763l75m98Q63j414K140j963J119L39
$$ -1077 1233 -1113 -439 288 -1195 713 -1365 398 23 -475 388 -1026 1114 -849 270 609
1226F09j878K263j767J470j150K2J362j603J396j909J652j16j234J859j716J397
$$ 609 -1269 994 -773 697 -453 -431 931 -672 724 -1185 467 351 -883 976 -740 657
1242F57p39K81N91k019K370j540J004o78m62J962k145J499j122O80M99j452K062
$$ 657 -82 199 790 -1229 1141 -399 605 -73 -535 1427 -718 781 -341 339 838 -614 1448
1259A448j876P95l09l21R35j731K320j202o8L68j332K339k115J170j40l74Q03
$$ 1448 -428 367 58 -263 672 -1059 1261 59 -9 359 -973 1366 -749 421 281 -93 710
1276G10j503J680j326M55M17j150J533j930J539k49j178J454j453K044j883O24
$$ 710 -793 887 -439 16 433 -717 816 -1114 425 176 -1002 452 -1001 1043 -840 -216
1292b16J41l98J229k086J632n54k14R35j507J192j003J337m32q50J365j123J425
$$ -216 -75 -473 756 -1330 302 -252 -466 469 -1038 154 -849 488 56 -794 571 -552 873
1309H73j365K45Q38j568J383j315J328k83q22J533j628J605j306N73O57j537J668
$$ 873 -492 -247 591 -977 406 -909 419 136 -686 847 -781 824 -482 91 748 -789 879
1326H79j428J023o25k61J365j890J390q39O51J90q49J271j590J063k47j44Q16
$$ 879 -549 474 -151 -412 953 -937 453 -386 265 455 -394 877 -713 350 103 -41 775
1343G75j945K049j191M64j09n71J540j811J397q69L02O89j301J318j361Q01L20
$$ 775 -1170 879 -312 152 43 -528 1012 -799 598 -271 31 720 -581 737 -624 177 497
1360D97r15J074j589J621j016O9L23o50J597j721R67j24n09J158j390J268j374
$$ 497 -418 656 -933 688 -328 -259 64 -586 1011 -710 257 133 -376 782 -608 660 -714
1377g14K66J012j421J224j194J059j47o23Q43r84J434j301M20M54j072J245j086
$$ -714 -448 564 -857 367 -827 232 85 -538 305 -679 755 -546 -126 328 -744 501 -585
1394e85R73n58j76R24j195J013q36Q66n2q99J129p76O82q58J79P26j168J042q03
$$ -585 388 -170 -346 578 -617 396 -440 426 374 -525 604 -172 510 -348 -169 557 -611 431 -372
1413c72N01K7o56J532j584J111l50r7M55j315J578j114N80l13k78J016j303J248
$$ -372 129 156 -500 1032 -552 559 209 112 567 -748 830 -284 296 -17 -295 721 -582 666
1431F66p97j56O70p95R78j183R23k26k31Q00j552J354n55J21K47o08Q59r50P83
$$ 666 -131 -287 383 -412 566 -617 306 80 -151 649 -903 451 -104 17 264 -344 515 -435 348
1450C48m02m28R08q13R80r63L79N17j172J151j101P68k33j64K34n92J319r14K60
$$ 348 -54 -482 426 -387 593 -370 9 526 -646 505 -596 172 -61 -225 9 -583 736 -178 82
1469H2J16n84R97j239R62l17l77N62p40R75j062Q26k49m00J156j063N10m12L99
$$ 82 198 -386 611 -628 334 17 -360 202 -538 437 -625 201 -48 -448 708 -355 155 -257 142
1488A42J74o55R38r95O36j66P9M78j325Q84l87L36N7n67R79m66K03j65m57N67
$$ 142 316 -339 599 -396 240 74 153 631 -694 190 -197 139 196 -371 608 142 345 180 -277 290
1508B90n84Q13r33N46l0k76O94j302R09J16k99O3m71J177q20J41L63o94O45r51
$$ 290 -294 519 -414 132 102 -174 520 -782 127 243 -56 7 -464 713 -107 34 397 -297 348 -603
1528f03P47k23K3J7m68J004q61O33m2m01K31n40J181j014J92M97j083J037o25
$$ -603 144 -79 -56 -39 -507 497 -364 269 227 -174 57 -483 698 -316 -124 373 -710 327 -298
1547b98M12k09l11P94n63L69p05J79J081j123O65o08O88m95l94P33m50K66k22
$$ -298 114 -95 -406 388 -175 194 -511 -332 749 -374 291 -317 371 -124 -518 215 -235 31 -191
1566a91J05J56n65J093r81P67o32J96M66p54N78m60K96O1l74L89l66O47l20l60
$$ -191 -86 70 -495 598 -383 384 -248 -52 414 -340 238 -222 74 135 -239 150 -216 431 111 -249
1586b49O30p03R43q22J44m2J8N38r59O83k88k14N23n07J025q94L86o2l09M67p28
$$ -249 381 -322 621 -201 -57 -99 -81 457 -502 181 -107 -321 202 -305 720 -174 212 150 -159 308 -420
1607d20O71k16r0j6k52P98r23M52K81m02N53r79Q50m46L00P9n37M97r50J043m02
$$ -420 251 35 -55 -71 -323 475 -448 4 285 -117 436 -543 307 -139 161 240 -297 200 -750 293 -109
1628a09k65O97k64L55n95L15k2m99P01o50N90m62m1O09p80P28l83j07K52m65R01
$$ -109 -374 323 59 414 -181 134 112 -387 314 -336 254 -208 -249 360 -420 308 -75 -182 70 -395 506
1649E06p79N94o63N16M9o58Q68q57N99L0j41L3l64M01k14P9K10n20Q62o51L07
$$ 506 -273 321 -342 174 223 -435 433 -424 175 205 64 97 -267 134 -80 -1 209 -311 551 -100 207
1670B07k71p5M63m74L41l39L72K22o95N15m58M83j90l29O79o55Q33p66q7K28r1
$$ 207 -64 -139 324 -150 191 -148 224 446 -249 266 -192 291 101 -228 451 -204 629 -137 -224 4 -87
1691h7M27q25O28j47j14M53o84O12n12N10rk27J04j63M03m43j72K00O8n6n7N7
$$ -87 340 -485 143 -4 -118 335 -349 263 -249 261 252 25 129 -34 369 -74 -246 -46 22 -34 -91 -34
1713c4k3q7L83l96L36o3j70J97l57L40m23N07j37m40O14o27N92m65K81J04l14
$$ -34 -57 -144 239 -157 179 116 -54 143 -214 126 -297 210 73 -367 247 -380 212 -253 28 132 -182
1734a82P01r14K46K48j5K42n13L48k46J52j11j80M58m15K40l8m9K90o23R18n10
$$ -182 519 -395 -149 99 84 326 -187 161 -85 67 -44 -224 234 -181 59 21 -28 262 -361 557 47
1755D7J82k62Q4J78o36O41k44%n6l00Q28p90M51J5k1Q3l26O06n98J69j7j04K64
$$ 47 229 -33 51 229 -407 234 -10 -10 -66 -366 462 -328 123 138 117 200 -126 480 -118 51 34 -70 194
1778A94k47Q6j3j32M35l93K73l76J29K20m76M74l66J69k26p3M33l8K33l86qL4
$$ 194 -53 33 20 -112 323 -70 203 -173 -44 176 -300 174 -192 -23 -249 -322 111 73 306 -80 -88 -54
1800e4l05M87l81M70l69j53L84m30L46k33L19j86l45P18n92K63k6J17kq2J28k37
$$ -54 -359 128 -253 217 -152 -305 79 -351 -5 -238 81 -105 -450 268 -324 -61 -87 30 28 -54 74 -163
1822a63K77M0l82O10l42q3M5K02k08l16O62q53N80J5pn7m59O07k50K48Kn21P72
$$ -163 114 154 -228 382 40 -43 2 204 -4 -320 342 -511 69 84 77 20 -439 168 -82 166 168 -353 419
1845D19o45K18N6RP3l44L22j98K34J22m74K60k89L22J88m53J71j36K65k09J97
$$ 419 -226 -8 48 57 130 -214 108 -90 144 266 -208 52 -237 85 273 -180 -9 -145 120 -89 108
1866A08q5m24P26m70L26l56K14N0l22L24j98oJ55l60N86l07J85j72j30K89k31
$$ 108 23 -401 325 -145 181 -175 39 89 -233 91 -107 -113 42 -318 268 -39 146 -26 -156 133 -98
1887i8K09n39L22O8j18J64l52N63j47N9J16m86J98k14K28O9k91N22o26P21o21
$$ -98 111 -428 -106 -38 -156 8 -344 219 72 131 247 -239 -41 -255 -27 42 -249 273 -353 368 -253
1908b53M38l63Q6M41n10M67l39n4n0p4M11O0l61K50o1J62n72L96k74K70J26n28
$$ -253 185 -178 -92 349 -161 306 -33 -87 -137 -211 200 260 -101 149 88 250 -322 74 -200 70 196 -332
1930c32K88k97P10n21K14L31n43K3K5Q8o7q6J75p4K09L9k42P0l05N67j31l19J86
$$ -332 -44 -341 369 -152 62 393 -150 -127 -102 -14 -81 -167 8 -66 143 182 -60 10 -295 272 141 -178 8
1953Hj18L84p32N07L6j91J91o2K43l39J78j20m3R5j09J45k80K10K44k82P1k53
$$ 8 -110 274 -458 49 85 -106 85 23 266 -73 105 -15 -58 37 -72 73 -207 3 247 -35 36 -217
1975b17K21j18j33L31m09L05k8Q8L5n8L41l66Pj45J97K00m83L44l74L50J68o93
$$ -217 4 -114 -247 84 -325 -20 -48 40 75 17 358 -8 -1 -146 51 251 -232 112 -262 88 256 -437
1997d37O46l48K44J82l12M21n29L72l03m4J59j39K76n84N67pk43j8J06k21LM23
$$ -437 209 -139 105 287 -25 396 -133 239 -64 -108 51 -88 188 -396 171 164 -79 -97 9 -212 -209 214
2019B14jM5j35O1p5k14j40K30N2K9l81J37j16K89K23n58M06j65p4O4J14J03k86
$$ 214 213 258 123 184 109 -105 -245 -15 37 66 -315 -178 -294 -5 218 -340 66 -99 -173 -109 5 108 -178
2042a78J78k8j92L97n34L50R1j31Q1k63J28o7M04m14P6J76m67M19o5M0K31m17
$$ -178 0 -28 -220 177 -357 -7 84 -47 34 -229 -101 -168 236 -178 -102 74 -393 26 -39 1 232 -185
2064a85M10n08L05M1j02K76j52r7j4M0k01LM70k67M9pl95M66o8n5j08J1J76k95
$$ -185 225 -283 22 63 -39 237 85 -12 -26 14 -187 -184 286 19 68 61 -334 132 64 9 -99 -88 88 -207
2088b07K50k01k23J12L93p0m27L42K1r0K73n7k46K3N82o72R4L46j74j06Q0K3o7
$$ -207 43 -158 -381 -269 124 54 -373 -31 -10 -100 173 116 -130 -107 475 -197 -103 243 69 -37 43 66 -1
2111aj39J27L7J32k98K59m5o5J72k48J39%k00K85j37K04m70J00J65l5n5M2L7J87
$$ -1 -140 -13 24 156 -142 117 72 7 179 -69 70 70 -130 155 18 222 -248 -148 17 -18 -73 -31 6 193
2135A93j00K15m52K22j58R5R6l00L61j86J72j20K9j94Q5K6J71k90j08J98K19l29
$$ 193 93 308 -144 78 -80 15 111 -189 172 -14 158 38 67 -127 -42 -16 155 -135 -243 -45 174 -155
2157a55L17L1l13N81o00K99j35K05j72n5J49o23N21j25J29L8p7J88l13K12Nm75
$$ -155 162 193 -120 461 -139 160 25 230 58 3 152 -471 50 -75 54 92 15 203 -110 102 107 -368
2179c68M97j97K59P9n56K84j14J68j13L7p6J76K16m72K55Q8L1k21n8NK9K5K21
$$ -368 129 -68 191 270 -286 -2 -116 52 -61 -24 -100 76 292 -180 75 163 194 -27 -85 -80 -51 -26 195
2202A95m93L97l3M0j65K30j73K03j16mR7l26Q0J69k55J04r9K36r7l17Q41q04L42
$$ 195 -298 99 66 106 -59 171 -2 201 85 81 178 -148 -68 101 -154 -50 -149 87 -10 -327 514 -290 52
2225E2j52J13n8R1M5p3Q5j59J01K46m44K93N7k10p1K7K86l14J75j38l2O4J58k82
$$ 52 -100 13 -45 46 91 18 103 -56 45 291 -153 140 197 -13 -84 -57 229 -85 90 -48 -80 -16 142 -140
2249a40k7J95L19k36J02k22J38m4K2J09l09J58k93L57L1l1k52K07R7n39N32n14
$$ -140 -167 28 347 111 213 -9 129 85 107 216 -93 65 -228 129 160 129 -123 84 181 -358 174 -340
2271c40M04J21k90j7J21j35M42j25M6mK6l80K2L50k81O4M0j6k00j42M61l55K53
$$ -340 64 185 -105 -122 -1 -136 306 181 227 223 249 -131 -109 241 -40 24 64 48 -152 -294 167 -188 65
2294F5J04k44L28l33O5L6k06O5q2K6J66J56k3j8j69J87jj87J82j54M9J17k06L
$$ 65 169 -75 253 -80 -15 21 -185 -120 -202 -176 -10 146 123 105 -64 123 122 -65 117 -37 12 129 -77 -74
2318g4K2j3nJ26P7n14M47mk23K21l30L18J68r5k00N7J57m3K9Pm68Q56l97J75k10
$$ -74 -52 -65 -70 56 133 -381 66 62 -161 60 -270 48 216 121 -79 -22 135 92 121 128 -340 516 119 294 84
2343H4J57j98j29l3k58M66j76k1J31J09j53J86m87K85K22O7n14K29J11k38P7O7
$$ 84 241 43 -86 -119 -377 89 -87 -108 23 132 -21 165 -322 -37 185 252 -262 -33 78 -160 -83 -16
2365a6j08j94N0M47l80J90l8R9j88r9L28r6J68j36j31K63k09K79m22N5J13J61
$$ -16 -124 -318 -268 179 -201 -11 -49 50 -138 -237 91 -5 163 27 -104 159 -50 229 -193 -138 -25 136
2387A36j90l7L00k70m0j23J16J51o7m5J53l73L46l35K12j84K21J39k6j85J42o9
$$ 136 -54 -91 209 -61 -101 -224 -108 43 -24 -69 84 -289 57 -278 -66 -250 -29 110 84 -101 41 -28
2409b8J02L2k30n5L23j15k03L34r3J2j48K01m62O25j36m84M73lj99M4j34K67l35
$$ -28 74 106 -124 -179 144 29 -174 160 67 79 -69 132 -330 295 159 -325 148 145 -54 -10 -144 123 -212
2432b12K69j62J8M8O3L2n4J47r4N0j07L3K98o21L86j02n0L15j36k35j40J47K59
$$ -212 57 -105 -87 -39 24 56 2 149 55 105 -2 31 329 -292 94 -8 -58 257 121 -114 -254 -107 152
2455A52l32K6qK65p9k86M67k16K8j68MJ09j11K43j64K8R9J04rj71J22O4rl67J64
$$ 152 -180 -154 -162 103 24 -262 205 -11 17 -151 -147 -38 -149 94 -70 -42 57 161 152 -19 103 167 158 -209 -45
2480d5P4Q8k69L19j7K15m00J2m4K09l27J50J76k60K27R6l43J68L1o6O4J66k14
$$ -45 29 117 -152 167 150 365 -35 -23 -67 142 -185 -35 141 -119 108 204 -139 29 60 -6 58 224 10
2503A0j9J61j24J31J95j24k38L2o5K86l61j5K80j7k43K55k50J32L8JJ49j68J36
$$ 10 -9 152 28 159 354 230 -8 24 -41 245 -116 -131 149 132 -111 144 -106 26 64 65 214 46 182
2526A82j97K7k07K18mM03n07J53j41K12k55o7K68k56O63o24K17J06o9q9p7k6j20
$$ 182 -15 12 -195 23 19 422 -85 68 -73 139 -116 -183 85 -171 492 -132 85 191 122 33 -44 -70 -190
2549a90K92P8j76K8l90N50n9q3J11j13m3j81n0K58k70K96N4K0n5k71L74k21l1
$$ -190 102 180 4 32 -358 192 133 50 161 48 5 -176 -226 32 -238 58 112 132 77 -194 180 -41 -72
2572g2J13k48J01J81O9k69L37m04M17n23J25J77j92L11j4j42Q4l3l3M5k49K70
$$ -72 41 -207 -106 75 144 -125 212 -192 225 -298 -173 4 -188 123 109 -33 51 18 -15 30 -219 51
2594E1K13l22l44M56l64Q5O2M14K6l15L3J18M2m7l12L8K59O1j26K27o17J54M47
$$ 51 264 -58 -402 54 -310 -225 -163 251 277 -38 -5 113 155 108 -204 -166 93 154 28 255 -362 -208 239
2617B39k44k24J79P5n7q4K27kl11J19R4j24jL67k47p6J25j51K21j00j20K54k18
$$ 239 -5 -229 -50 25 -32 -116 111 109 -202 -83 11 -113 -114 253 6 -70 55 -96 125 25 -95 159 -59
2640e9o7P3J21J75j69j6j60J7R7J35k7k68J96P7m1M0k29J86k72Mj5J98M1k06K90
$$ -59 -126 -53 68 243 74 58 -102 -85 12 147 120 -148 48 125 84 124 -105 81 -191 -187 -202 -4 37 -169 121
2665A21j10K2n2N4n7J92j07k25N5N11n81K43M3j55N47n50O1l07N44l44M8j03J04
$$ 121 11 33 -19 35 -22 170 63 -162 -107 404 -177 66 109 -46 501 -49 12 -295 249 -95 -47 -150 -46
2688d6J34j27J15l60J94j62L01j15M5r7J26r3J48J17m49O10l01J4L7K31l53J72
$$ -46 88 -39 76 -284 -90 -252 49 -66 -21 -118 8 -85 63 180 -269 341 40 54 91 322 -31 141
2710A41o9j40M7j5M4j05l6J50m18M52j93m8J14p3J88j49r4J38j06J64J06J2j17
$$ 141 72 -68 -21 -36 8 -97 -133 17 -401 51 -142 -190 -76 -149 39 -110 -204 -66 -172 -8 98 110 -7
2733gK83j22m05P9J08Q5j71K9L68k9j05k20K04j91k9K35l24L73k88R6J11j3K88
$$ -7 276 154 -251 -172 -64 21 -150 -121 247 218 113 -107 97 -94 -123 112 -212 161 -127 -31 80 67 355
2756C55m19K61k39K45ol48K55P3M9k40j73n3J96J60q1j93K55o5j76J6K02P6r1
$$ 355 -64 197 -42 203 197 -151 104 177 226 -14 -187 -240 -44 116 35 -158 97 32 -144 -128 74 150 59
2779E9L9k99L59j78K77n4l54L27k13J47J28k02j06O7K87k79l21M31j29JK42j28
$$ 59 98 -201 158 -20 257 203 -151 176 -37 110 238 36 -70 -3 284 5 -316 115 -14 -13 229 101
2801A01n7M9k15k52N29l35N0l5qJ62J08j53O3k33N52n72J58L24k52P7k68N14m41
$$ 101 44 93 -122 -374 155 -180 -130 -165 -173 -11 97 -56 7 -226 326 -246 -88 236 -16 61 -207 307 -134
2824a34K37k24K27J1j98q7J95J07j39J94q2k65J26Q3k31J93N8j01p2L38j64j70
$$ -134 103 -121 106 117 -81 -168 27 134 -5 189 107 -158 -32 51 -180 13 71 -30 -102 236 72 -98
2846i8J96j94K84l6K8l14L4j30L71J18l24K88j96l5j59K18j15J65o68M16R2J75
$$ -98 98 -96 188 152 180 -134 -100 -230 141 259 -65 223 27 -8 -167 51 -64 101 -567 -151 -59 116
2868A16j63P5M7Nj05r0m9J77K0j72J82M8l2k66L15k94K62r7n6J23m3j67M16k65
$$ 116 -47 28 75 80 -25 -115 -164 13 33 -139 43 91 59 -207 108 -186 76 -21 -77 46 3 -164 252 -13
2892a3l06N20j97j6Q8P1k03p6J51R9j19l5o0K40k09Q9m1j41K64j41J08N5Jk25
$$ -13 -319 201 4 -12 76 147 -56 -132 19 118 -1 -36 -96 144 -65 24 -17 -158 106 -35 73 128 129 -96
2916i6K16l75M58l86J22j1K54k4m75M10J50N8k15j42QJ30Nj99K39j32N5J41l41
$$ -96 120 -255 203 -183 -61 -72 182 158 -317 93 243 301 86 -56 -48 82 87 -112 127 -5 50 191 -150
2939a50K53k86K40m8nl96M46K24m15k5J73j7n6K40J38k9m69J03n5K82o3j1j99
$$ -150 103 -183 57 9 4 -392 54 278 -137 -162 11 -6 -62 178 316 287 -182 -79 -134 148 85 74 -125
2962a25j4J42j68J20j0k81N04n1n6k13K29j44j4J57k56K9J29J81k28j95N14k79
$$ -125 -139 3 -165 -45 -55 -336 168 117 61 -152 77 -67 -81 76 -180 -151 -22 159 -69 -264 250 -29
2984b9J98j13k88L31j73N7j38K25J67j79j78K78l7l3P1k50M5P7j0l17N34l75J94
$$ -29 169 56 -232 99 -74 -17 -155 70 237 58 -120 158 121 88 159 -91 -46 31 21 -296 238 -137 57
3007E7j12O8N2j45L40j05k73J4K44k91NP3J99R6k16j3M7l7L94l88m9L24k06j11
$$ 57 -55 13 65 -80 260 155 -118 -104 140 -151 -146 -73 126 222 6 -7 40 3 397 9 -40 284 78 -33
3031c3q2L9l40K95K70k16L7K70j53J59l50K35O9p7k78K6j4O1N0MR5l37J29K87
$$ -33 -115 -76 -416 -121 149 -67 -30 240 87 246 -104 131 200 123 -155 -129 -143 -82 -32 -28 67 -270 -141 146
3055A46m6k37J71k79J49K17k17N7k3K44l67J21lL22r5m8m30L77J39l08J59o7l4
$$ 146 100 -137 34 -245 -96 121 -96 -39 -62 182 -185 -64 -67 255 160 112 -318 59 198 -110 49 -18 -52
3078e2J41j38m3pJ04nJ75j57k8J21m02M16j05l55K31M04k62r4m8K65j19J2N2J41
$$ -52 89 -49 -92 -99 5 0 175 18 -10 111 -291 125 20 -335 -104 300 38 -56 -104 161 42 54 106 247
3102B47m53K37j55J03o0L91k69o6K0K36m47K42l83M14L04l55L1J9k17J45n2n6
$$ 247 -206 31 -124 -21 -81 310 41 -25 -5 231 -216 26 -357 57 361 6 37 56 -161 -16 -68 -124
3124a24J90l9J49n27L57j36O9K59k87J95J2l99L27J37l76P0M34o6l19lL8j94K55
$$ -124 66 27 176 -351 6 -130 -61 198 -89 106 118 -281 46 183 -193 -123 311 245 -74 -77 -39 -233 22
3147B2m7r6L6n5J14K34l20J68k06j11M62l26K10j96N1N2j18R4L08j96M4j35k18
$$ 22 -25 -121 -85 -140 -26 208 -112 56 -150 -261 201 -125 85 -111 -60 -8 -126 -32 276 80 124 -11 -229
3170b29K53n8o0j3p8M30l12l34K06K64r1K27l59M32l30J91k1J75l56L8L56j26
$$ -229 24 -34 -94 -107 -185 245 -67 -401 -195 69 -22 205 -154 278 -52 139 118 293 -63 -25 331 205
3192B05l88J17J06J83l68K49j00k6m6N5K26j78M1O7j67O4l8L2k9k6J39j88J65
$$ 205 -183 -66 40 223 -145 104 4 -22 -68 -13 213 35 76 143 -24 40 2 34 5 -21 118 -70 95
3215I5p4m2qj94L83j29k0j1k73K57j32K79k70J40j66K14j77lM8j51M24N0N3k1
$$ 95 21 -21 -29 -223 160 31 11 0 -273 -16 -148 131 -139 1 -165 49 -128 -131 -83 -234 190 240 293 272
3239B72m38L93l70K17N6p9J67l62QM2K64m35K32P0r4L3k08J88J9j35J67J91m92
$$ 272 -166 227 -143 74 130 51 218 -144 -136 -94 170 -265 -33 37 -57 -24 -232 -44 -25 -160 7 198 -294
3262b94L39j19Q1K4j09J7O5J34r3j01j70O50m02J11o6l5N8j01j53J71O8k1jk01
$$ -294 45 -74 7 31 -78 -61 4 138 45 -56 -226 424 22 133 67 32 90 -11 -164 7 75 54 53 -148
3286a48J2L99k18o5p7Mn5J65j48M3R8r5J45JR9j12nP1Q5j21P0j97jj74L5K75j26
$$ -148 -136 263 45 -20 -97 -93 -148 17 -131 -88 10 -85 60 61 160 48 43 114 199 78 148 -49 -50 -224 -189 86 -40
3313d0J73J3L1j22n0K7m1J54j97J60q6j97K36J57l92J78N0q3J6m4K61l54j80O22
$$ -40 133 146 177 55 5 32 -9 145 -52 108 22 -175 61 218 -174 4 54 -29 -13 -57 204 -150 -330 292
3337B92n17K30Q3j92Q2k4M6j59n9J23o8K84j17J47j93k14L09P4o6k41K00J13k23
$$ 292 -225 5 88 -104 -22 -46 0 -159 -218 -95 -163 121 4 151 -42 -256 53 127 61 -180 20 133 -90
3360i0J16l26k3M11m4k55L67J33m41J00L61l74J16r2l1J87n5l12N68l62j59J69
$$ -90 26 -300 -323 88 44 -211 156 289 -152 -52 309 -65 51 -41 -72 115 60 -252 316 -46 -205 -36
3382c6N5J05r5r2j02J39M32l18p5J12k19r1J69K65k68O9l24K22K35r3Q4m52J32
$$ -36 19 124 29 -63 -165 -26 406 88 13 125 -94 -185 -16 249 -19 50 -274 -52 183 90 174 -278 -146
3405a46LK68J6J2K42k72J61n3k04l04J96Rj48j32N36k20K9M4%n4l23K93J12l70
$$ -146 -143 125 141 153 395 123 284 231 27 -277 -81 -72 -220 -352 184 -36 -7 37 37 -17 -340 -47 65 -305
3429c05K15o1l0O5K07n3M7Jj5j10o2K9J96p8M8k9kJ63m19K49rR1j14K54j80k6
$$ -305 -90 -151 -181 -116 91 38 85 86 71 -39 -101 -72 124 46 94 65 63 226 -193 56 47 138 24 278 98 72
$$ [...]
8191b16
##END NTUPLES=NMR FID
##END=
