##TITLE=1H_DE-154_CCl4_TFAp
 200.13Hz,CCl4.
 8 sc
 10.6.2026
##JCAMPDX= 6.0         $$ Bruker NMR JCAMP-DX V2.0
##DATA TYPE= NMR FID
##DATA CLASS= NTUPLES
##ORIGIN= UXNMR, Bruker Analytische Messtechnik GmbH
##OWNER= pz
$$ XWIN-NMR		Version 3.5
$$ Wed Jun 10 13:49:47 2026 Russian Standard Time (UT+4h)  she@DPX200
##.OBSERVE FREQUENCY= 200.131
##.OBSERVE NUCLEUS= ^1H
##.DELAY= (6, 6)
##.ACQUISITION MODE= SIMULTANEOUS
##.ACQUISITION SCHEME= undefined
##.AVERAGES= 8
##.DIGITISER RES= 18
##SPECTROMETER/DATA SYSTEM= spect
##.PULSE SEQUENCE= zg30
##.SOLVENT NAME= CDCl3
##.SHIFT REFERENCE= (INTERNAL, CDCl3, 0, 14.3821)
##AUDIT TRAIL= $$ (NUMBER, WHEN, WHO, WHERE, WHAT)
$$ ##TITLE= Audit trail, XWIN-NMR		Version 3.5
$$ ##JCAMPDX= 5.01
$$ ##ORIGIN= Bruker BioSpin GmbH
$$ ##OWNER= she
$$ F:/spectra/data/she/nmr/H-C/1/audita.txt
$$ ##AUDIT TRAIL=  $$ (NUMBER, WHEN, WHO, WHERE, WHAT)
(   1,<2026-06-10 13:48:30.42 +0400>,<she>,<DPX200>,
      <created by zg, POWCHK disabled, PULCHK disabled
       configuration hash MD5:
       00 E9 B6 7A A2 85 ED C7 34 08 36 98 17 FE 4E 26
       data hash MD5: 16K
       A7 87 18 35 D6 41 0C 2F CD 6F 72 D6 17 67 2D 55>)
$$ ##END=
$$ 
$$ hash MD5
$$ 3A 72 EE D2 5E 08 91 9C 1D 03 E8 24 6B 25 25 13
##$RELAX= 
##$RELAX= 
##$RELAX= 
##$RELAX= 
##$RELAX= 
##$RELAX= 
$$ Bruker specific parameters
$$ --------------------------
##$DU= <F:/spectra>
##$EXPNO= 1
##$NAME= <H-C>
##$PROCNO= 1
##$TYPE= <nmr>
##$USER= <she>
##$AMP= (0..31)
100 100 100 100 100 100 100 100 100 100 100 100 100 100 100 100 100 100 
100 100 100 100 100 100 100 100 100 100 100 100 100 100 
##$AQSEQ= 0
##$AQ_mod= 1
##$AUNM= <au_zg>
##$AUTOPOS= <>
##$BF1= 200.13
##$BF2= 200.13
##$BF3= 200.13
##$BF4= 200.13
##$BF5= 200.13
##$BF6= 200.13
##$BF7= 200.13
##$BF8= 200.13
##$BYTORDA= 1
##$CFDGTYP= 0
##$CFRGTYP= 5
##$CHEMSTR= <none>
##$CNST= (0..31)
1 1 145 1 1 1 1 1 1 1 1 1 1 1 1 1 1 1 1 1 1 1 1 1 1 1 1 1 1 1 1 1 
##$CPDPRG= <>
##$CPDPRG1= <>
##$CPDPRG2= <>
##$CPDPRG3= <>
##$CPDPRG4= <mlev>
##$CPDPRG5= <mlev>
##$CPDPRG6= <mlev>
##$CPDPRG7= <mlev>
##$CPDPRG8= <mlev>
##$CPDPRGB= <>
##$CPDPRGT= <>
##$D= (0..31)
0 0.7 0 0 0 0 0 0 0 0 0 0.03 0 0 0 0 0 0 0 0 0 0 0 0 0 0 0 0 0 0 0 0 
##$DATE= 1781084910
##$DBL= (0..7)
120 120 120 120 120 120 120 120 
##$DBP= (0..7)
150 150 150 150 150 150 150 150 
##$DBP07= 0
##$DBPNAM0= <>
##$DBPNAM1= <>
##$DBPNAM2= <>
##$DBPNAM3= <>
##$DBPNAM4= <>
##$DBPNAM5= <>
##$DBPNAM6= <>
##$DBPNAM7= <>
##$DBPOAL= (0..7)
0.5 0.5 0.5 0.5 0.5 0.5 0.5 0.5 
##$DBPOFFS= (0..7)
0 0 0 0 0 0 0 0 
##$DE= 6
##$DECBNUC= <off>
##$DECIM= 32
##$DECNUC= <off>
##$DECSTAT= 4
##$DIGMOD= 1
##$DIGTYP= 9
##$DL= (0..7)
0 120 120 120 120 120 120 120 
##$DP= (0..7)
150 150 150 150 150 150 150 150 
##$DP07= 0
##$DPNAME0= <>
##$DPNAME1= <>
##$DPNAME2= <>
##$DPNAME3= <>
##$DPNAME4= <>
##$DPNAME5= <>
##$DPNAME6= <>
##$DPNAME7= <>
##$DPOAL= (0..7)
0.5 0.5 0.5 0.5 0.5 0.5 0.5 0.5 
##$DPOFFS= (0..7)
0 0 0 0 0 0 0 0 
##$DQDMODE= 0
##$DR= 18
##$DS= 0
##$DSLIST= <SSSSSSSSSSSSSSS>
$$ [...]
##$SUBNAM0= <"">
##$SUBNAM1= <"">
##$SUBNAM2= <"">
##$SUBNAM3= <"">
##$SUBNAM4= <"">
##$SUBNAM5= <"">
##$SUBNAM6= <"">
##$SUBNAM7= <"">
##$SUBNAM8= <"">
##$SUBNAM9= <"">
##$SW= 18.0517599122864
##$SWIBOX= (0..15)
0 0 2 0 0 0 0 0 0 0 0 0 0 0 0 0 
##$SW_h= 3612.71676300578
##$TD= 16384
##$TD0= 1
##$TE= 0
##$TE2= 300
##$TE3= 300
##$TEG= 300
##$TL= (0..7)
0 120 120 120 120 120 120 120 
##$TP= (0..7)
150 150 150 150 150 150 150 150 
##$TP07= 0
##$TPNAME0= <>
##$TPNAME1= <>
##$TPNAME2= <>
##$TPNAME3= <>
##$TPNAME4= <>
##$TPNAME5= <>
##$TPNAME6= <>
##$TPNAME7= <>
##$TPOAL= (0..7)
0.5 0.5 0.5 0.5 0.5 0.5 0.5 0.5 
##$TPOFFS= (0..7)
0 0 0 0 0 0 0 0 
##$TUNHIN= 0
##$TUNHOUT= 0
##$TUNXOUT= 0
##$USERA1= <user>
##$USERA2= <user>
##$USERA3= <user>
##$USERA4= <user>
##$USERA5= <user>
##$V9= 5
##$VALIST= <valist>
##$VCLIST= <CCCCCCCCCCCCCCC>
##$VD= 0
##$VDLIST= <DDDDDDDDDDDDDDD>
##$VPLIST= <PPPPPPPPPPPPPPP>
##$VTLIST= <TTTTTTTTTTTTTTT>
##$WBST= 1024
##$WBSW= 4
##$XGAIN= (0..3)
0 0 0 0 
##$XL= 0
##$YL= 0
##$YMAX_a= 111081
##$YMIN_a= -100192
##$ZGOPTNS= <>
##$ZL1= 120
##$ZL2= 120
##$ZL3= 120
##$ZL4= 120
##$ABSF1= 10
##$ABSF2= 0
##$ABSG= 5
##$ABSL= 3
##$ALPHA= 0
##$AQORDER= 0
##$ASSFAC= 0
##$ASSFACI= 0
##$ASSFACX= 0
##$ASSWID= 0
##$AUNMP= <proc_1d>
##$AZFE= 0.1
##$AZFW= 0.1
##$BCFW= 1
##$BC_mod= 2
##$BYTORDP= 1
##$COROFFS= 0
##$CY= -3
##$DATMOD= 1
##$DC= 2
##$DFILT= <>
##$DTYPP= 0
##$F1P= 0
##$F2P= 0
##$FCOR= 0.5
##$FTSIZE= 0
##$FT_mod= 4
##$GAMMA= 1
##$GB= 0.15
##$INTBC= 1
##$INTSCL= 1
##$ISEN= 128
##$LB= 0.25
##$LEV0= 0
##$LPBIN= 0
##$MAXI= 10000
##$MC2= 0
##$MEAN= 0
##$ME_mod= 0
##$MI= 1.114404
##$NCOEF= 0
##$NC_proc= 0
##$NLEV= 6
##$NOISF1= 3.799351
##$NOISF2= 2.8
##$NSP= 1
##$NTH_PI= 0
##$NZP= 0
##$OFFSET= 14.38212
##$PC= 1
##$PHC0= -4227.677
##$PHC1= 22.19229
##$PH_mod= 1
##$PKNL= yes
##$PPARMOD= 0
##$PSCAL= 0
##$PSIGN= 0
##$REVERSE= no
##$SF= 200.129724274929
##$SI= 16384
##$SIGF1= 3
##$SIGF2= 2
##$SINO= 400
##$SIOLD= 16384
##$SREGLST= <1H.CDCl3>
##$SSB= 0
##$STSI= 0
##$STSR= 0
##$SW_p= 3205.1282051282
##$SYMM= 0
##$S_DEV= 0
##$TDeff= 0
##$TDoff= 0
##$TI= <>
##$TILT= no
##$TM1= 0
##$TM2= 0
##$TOPLEV= 0
##$USERP1= <user>
##$USERP2= <user>
##$USERP3= <user>
##$USERP4= <user>
##$USERP5= <user>
##$WDW= 1
##$XDIM= 8192
##$YMAX_p= 0
##$YMIN_p= 0
$$ End of Bruker specific parameters
$$ ---------------------------------
##NTUPLES= NMR FID
##VAR_NAME=  TIME,          FID/REAL,        FID/IMAG
##SYMBOL=    X,             R,               I
##VAR_TYPE=  INDEPENDENT,   DEPENDENT,       DEPENDENT
##VAR_FORM=  AFFN,          ASDF,            ASDF
##VAR_DIM=   8192,          8192,            8192
##UNITS=     SECONDS,       ARBITRARY UNITS, ARBITRARY UNITS
##FACTOR=    0.0002768,     1,               1
##FIRST=     0,             0,               0
##LAST=      2.2672688,     0,               0
##MIN=       0,             -100192,         0
##MAX=       2.2672688,     111081,          0
$$ Real data points
##PAGE= N=1
##DATA TABLE= (X++(R..R)), XYDATA
0@%%%%%%%%%%%%%%%%%qJ6j6J6j6J9k7L2l6M4n0N8o9P9r0J03j17J32j51J72j92
$$ 0 0 0 0 0 0 0 0 0 0 0 0 0 0 0 0 0 0 -8 8 -8 8 -8 11 -16 16 -20 24 -26 32 -37 42 -48 55 -62 70 -81 91 -101
38a01K15k42K71l02L36l73M15m60N08n63O22o84P53q31R13j004J108j221J348
$$ -101 114 -128 143 -159 177 -196 219 -241 267 -296 326 -358 395 -436 477 -527 581 -640 708
57G08j493J655j839K053k306K605k966L416l990M758n846P595j8112M9100j35530
$$ 708 -785 870 -969 1084 -1222 1383 -1583 1833 -2157 2601 -3245 4350 -13762 35338 -100192
72a00192N0144J01244p9132Q2559m383o3417L5142k3213m4911P5353k9622j0697
$$ -100192 -50048 51196 -27936 54623 50240 -13177 21965 -1248 -46159 29194 -428 -11125
84a1125P0591m4465R408R03l2749K2740k3637J9815Q511R127q60k2420J6954k9121
$$ -11125 59466 15001 24409 25312 -7437 15303 -8334 11481 19992 29119 28259 5839 22793 -6328
98f328L322J6266j4759J5742K763q018l826J897k5551K6615O997l7671M7769l3920
$$ -6328 -3006 13260 -1499 14243 17006 8988 5162 7059 -18492 8123 15120 -22551 25218 -8702
112h702p419L7407n3878K7256J2644k6088J9339m932j5692J3531O411j8861K4192
$$ -8702 -16121 21286 -32592 -5336 7308 -18780 559 -4373 -20065 -6534 -123 -18984 5208
125E208j9898m745L3167m6542K2487J4390k3334J8295j1280N129lj303k17N613
$$ 5208 -14690 -19435 13732 -32810 -10323 4067 -19267 -972 -12252 -7123 -7126 -8429 -8646 -3033
139c033N588j5562K4661j7933j0947K4476r204K310n904R120j264k024L091q371
$$ -3033 2555 -13007 11654 -6279 -17226 7250 -1954 356 -5548 3572 2308 284 3375 -4996
153d996K1659k0033R863J1622k7465K1679n592l890M987m858O637p99k865j0973
$$ -4996 16663 -3370 6493 18115 -9350 12329 6737 2847 7834 2976 9613 8814 5949 -5024
167e024K2412j1427q495K4106k6133J3401L092j4393J0538p277M254k348L975
$$ -5024 17388 5961 -2534 21572 -4561 8840 11932 -2461 8077 800 5054 2706 6681
180F681j1251M285J0289k1068J8826r807j357J4817j9686O145N59J237m856L209
$$ 6681 -4570 -285 10004 -11064 7762 -2045 -3402 11415 -8271 -2126 -1567 -330 -5186 -1977
194a977n2q736J6669j8738R725K618j6103K6411j4447n796R725j187l140k858
$$ -1977 -2029 -10765 5904 -12834 -3109 -491 -16594 9817 -4630 -10426 -701 -1888 -5028 -7886
208g886Q241q218J1048r927k876J5558k0910J6638J568j0627Q267j703N403j1507
$$ -7886 355 -7863 3185 -6742 -9618 5940 -14970 1668 3236 -7391 876 -827 4576 -6931
222f931N452K895J329K55j1784J7804j3071O03J0144j0285Q607m270N640n464
$$ -6931 -1479 1416 2745 3000 -8784 9020 -4051 -3448 6696 -3589 5018 748 6388 924
236I24k150M853j657Q904j7327J1790L055j5267J3350r065N235K777k338Q11m154
$$ 924 -1226 3627 1970 10874 -6453 5337 8392 -6875 6475 -2590 2645 5422 3084 3895 -259
251b59N587p329J0373q027q54J1893j6903J0380p044k227J2216q839K171k160
$$ -259 5328 -2001 8372 345 -509 11384 -5519 4861 -2183 -4410 7806 -1033 1138 -1022
265a022M859o385K556J342o406J4603j4381M786K762j3810J4336m828j157j089
$$ -1022 3837 -2548 8 1350 -5056 9547 -4834 -48 2714 -11096 3240 -1588 -2745 -3834
279c834L779Q27p728O232o236J2470o593o379J4031j4342N183R69j653J157j885
$$ -3834 -55 772 -6956 -724 -6960 5510 -1083 -7462 6569 -7773 -2590 -1621 -3274 -2117 -4002
294d002P473q831L564m561O684N692j5901J5315l950m836M643m965M965l697O065
$$ -4002 3471 -5360 -1796 -6357 327 6019 -9882 5433 1483 -3353 1290 -3675 1290 -2407 3658
309C658m805J347r66l994J4490j4921N763P389q893N961p308M043K50J122j558
$$ 3658 -1147 200 -766 -4760 9730 -5191 572 7961 -932 5029 -2279 1764 2014 3136 1578
324A578j654N333j0177J0492n728l598J2432r826O316m120k687N143j708J127
$$ 1578 -76 5257 -4920 5572 -156 -3754 8678 -1148 5168 1048 -1639 3504 1796 2923
338B923n836Q935o687N40K191q861J3306p907J223M522o975M184k384L450o534
$$ 2923 -2913 6022 -665 -125 2066 -6795 6511 -1396 -173 4349 -2626 1558 -826 2624 -3910
353c910M316K794n702M844j1055J0333p8q792R823m195J327k700K780j605k294
$$ -3910 406 3200 -2502 2342 -8713 1620 1542 -7250 2573 -1622 -295 -2995 -215 -1820 -4114
368d114P002o522O096q260J577R294j3387O459Q08R58o31k862M310m384N808m884
$$ -4114 2888 -3634 2462 -5798 -4221 5073 -8314 -1855 -1047 -89 -720 -3582 728 -3656 2152 -2732
384b732M048L61p814J2619r744j6M150j445L719n080L376k007L896k793k543R370
$$ -2732 1316 1677 -6137 6482 -3262 -3278 872 -573 3146 -1934 1442 -565 3331 538 -2005 7365
400G365r506O731j874n364O226m288M606l715J042j10L86K854q355Q480l236Q33
$$ 7365 -2141 4590 2716 -2648 3578 -710 3896 181 1223 1113 1499 4353 -4002 4478 1242 2075
416B075K528q712Q714m519n31J369j173K059l571N363p141L120K009l156O828
$$ 2075 4603 -4109 4605 86 -445 924 -249 1810 -1761 3602 -3539 -419 1590 -1566 5262
431E262j0510N865K442o145K075j809N017m870J825L19l014M216n210P567n332
$$ 5262 -5248 617 3059 -3086 -1011 -2820 2197 -2673 -848 -529 -3543 673 -4537 3030 -2302
446b302j083P892p506K313l309M603M2l689K256k404N621p455L981L513q120R429
$$ -2302 -3385 4507 -2999 -686 -3995 608 650 -3039 -783 -3187 2434 -5021 -1040 2473 -5647 3782
462C782l497j051j32r8K804l168K354l839O365k931n372Q382o404N098j26l320
$$ 3782 285 -766 -898 -996 1808 -1360 994 -2845 3520 589 -4783 3599 -2805 2293 2167 -1153
478a153M232l311L159k479J276j940J579L870q537O440l970J233M273p250N757
$$ -1153 3079 -232 2927 448 1724 -216 1363 5233 -3304 3136 -834 399 4672 -2578 3179
493C179q99j17k784J613K172n221O921o034Q10J820m258O267o113J227K090R23
$$ 3179 2280 2163 -621 992 3164 -2057 4864 -1170 -360 1460 -2798 3469 -2644 -1417 673 1596
509A596j774l527O842m888K116q82j695N074p581N113j614k650M134j145J681
$$ 1596 -178 -3705 3137 -1751 365 -517 -2212 2862 -4719 394 -1220 -3870 264 -881 800
524H00m758M072j48r27P04m214Q556n731m78L258m384L565k211K988k423q01L825
$$ 800 -3958 114 -34 -961 -257 -4471 4085 -1646 -2124 1134 -3250 315 -1896 1092 -1331 -2132 1693
541A693l346K982l920M832M61m524L661m147M533k438j199K740k459L440l268
$$ 1693 -1653 1329 -2591 2241 2702 -1822 1839 -2308 2225 -213 -1412 1328 -1131 2309 -959
556i59K692l001M52N519o365M456k544m85L724m681J665p1K997m389M55K563m168
$$ -959 1733 -1268 -816 4703 -1662 2794 250 -235 3489 -1192 473 402 3399 -990 -535 2028 -2140
573b140O140n066K432J254m222N442m242jk35J726M91m077L406k433L211k687
$$ -2140 4000 -1066 1366 2620 -1602 3840 -402 -403 -638 1088 1579 -2498 908 -1525 1686 -1001
589a001r53N784o246L136n59j153J80o97L892n518L065n62l34J294o161P033p30
$$ -1001 -1954 3830 -2416 720 161 -992 -812 -1509 2383 -3135 -70 -632 -966 328 -5833 1200 470
606D70j562Q96q83J872l253L576k757N83J384k344L950n956L297K451l944L524
$$ 470 -1092 -196 -1079 793 -2460 1116 -1641 -1058 326 -2018 1932 -4024 -727 1724 -2220 1304
622A304l292L401j128o74J76l9L117m317L927k557j488L786l569K854k151J146
$$ 1304 -1988 1413 285 -389 -213 -252 2865 -1452 2475 -82 -1570 2216 -1353 1501 -650 496
638D96J661k339K081l422M604j927j696K620k942L065l251J350M18j347K492k090
$$ 496 2157 -182 1899 -1523 3081 1154 -542 2078 -864 2201 -1050 300 718 -629 1863 -227
654b27J793l144K236J535l382K978l011L748j933l832M822k413R66j237J481m98
$$ -227 1566 -1578 658 2193 -1189 1789 -1222 2526 593 -3239 1583 -830 136 -1101 380 -118
670a18j635L619l407K086j517J332J666n230L203q44J252j062k048M246l344J749
$$ -118 -1753 1866 -1541 545 -972 360 2026 -3204 -1 -845 407 -655 -2703 1543 -1801 -52
686e2j234Q80L23j777M283m268J285R09p81J046l310L357q87N02j079j482M428
$$ -52 -1286 -406 -83 -1860 2423 -1845 -560 349 -432 614 -2696 661 -226 276 -803 -2285 2143
703B143l998L103n33j640K990k761J925j784Q06O10m06Q95l184L639j706K95O69
$$ 2143 -1855 1248 715 -925 2065 -696 1229 -555 251 861 455 1350 -1834 1805 99 394 1063
720A063k489N273m095M77J382j845J712j578J908k575J163P54j967K320l456L490
$$ 1063 -1426 3847 -248 229 1611 -234 1478 -100 1808 -767 396 1150 -817 1503 -1953 1537
736A537K50k755J389o23J753l152J933L52j872K546l445K558j558j69L034l136
$$ 1537 1787 -968 421 -202 1551 -1601 332 684 -1188 1358 -2087 471 -1087 -1256 1778 -1358
752a358J578j475K269j271j353K178j832K673l608J579J223l113L426k274O41
$$ -1358 220 -1255 1014 -257 -1610 568 -1264 1409 -2199 -620 603 -2510 916 -1358 -717
767g17K35oJ565k777J809r76J953r21k306L514k812J877j502J96J679k041K397
$$ -717 -482 -488 1077 -1700 109 -867 1086 165 -2141 1373 -1439 438 -1064 -868 811 -1230 1167
784A167j751O74J43k08J768l251K717r88L39M2k519L473j414O32j000J54J214
$$ 1167 -584 90 233 25 1793 -1458 1259 271 610 652 -1867 1606 192 824 -176 -22 1192
801A192j986K649k226J036P05j332K109l631J968M44r38K84j220K605k199L74
$$ 1192 -794 1855 -371 665 1370 38 2147 -1484 484 928 -10 274 -946 1659 -540 -166
817a66K73n19K308l085K703j753p38K098k114J495k053K074m88j141J027j459
$$ -166 107 -412 1896 -1189 1514 -239 -977 1121 -993 502 -1551 523 35 -1106 -79 -1538
833a538L029k522L05J438j931J774j858J353j101K61J284j817J296j743K259j18
$$ -1538 1491 -1031 -726 712 -1219 555 -1303 50 -1051 -790 494 -1323 -27 -1770 489 371
849C71k007K472j462J790j779k13J412j078J661k207J687r74m18K251l028K174
$$ 371 -1636 836 -626 1164 -615 -828 584 -494 1167 -1040 647 -327 -745 1506 -1522 652
865F52j011J102M89k183J874j155J479j576J67J559k245J658j532J134L83j322
$$ 652 -359 743 1232 -951 923 -232 1247 -329 -162 1397 -848 810 -722 412 795 -527
881e27K430k545J284l75N95p2j722K537j448M73j104n20K331k358J562p52K00
$$ -527 1903 -642 642 267 862 790 -932 1605 157 630 -474 -994 1337 -1021 541 -211 -11
898a1L46q42J748k733J951q8l93J83j993L029j644l51M69l07J685k147J462j132
$$ -11 335 -507 1241 -1492 459 371 -22 161 -1832 1197 -447 -798 -329 -636 1049 -1098 364 -768
916g68M38R82j216J426k399J547K35j500J153j184K179j294p06R39m86J679k242
$$ -768 -330 652 -564 862 -1537 10 245 -1255 -102 -1286 893 -401 -1107 -168 -654 1025 -1217
933a217J718p12k60J515j894J418j541J053P71j541R96j117K203j667nJ223j378
$$ -1217 501 -211 -471 1044 -850 568 -973 80 851 -690 306 -811 1392 -275 -280 943 -435
950d35K270k343R66M35j581J690j248Q02j017J216M1j915K044j138J132p46o55
$$ -435 1835 -508 458 893 -688 1002 -246 556 -461 755 796 -1119 925 -213 919 173 -482
967d82K124k069R52r02N88L96j469K122k019J231j018N30P71k182K564j156M1
$$ -482 1642 -427 525 -377 211 607 -862 1260 -759 472 -546 -16 755 -1427 1137 -19 22
984B2j66m82J570j835J312j396O18N76j440J899j305K50N06j86O49j882K057o96
$$ 22 -144 -626 944 -891 421 -975 -357 219 -1221 678 -627 -377 129 -57 592 -1290 767 71
1002G1k48j73l26J369j951J207m91K84J121j891J666j127O36M29o74L31j286J956
$$ 71 -177 -350 -676 693 -1258 -51 -542 -258 863 -1028 638 -489 147 576 -98 233 -1053 903
1020I03j151p8L30p25K009k036P78M67n34O22j305J574j229P90O04j425J212j887
$$ 903 -248 -326 4 -721 1288 -748 30 497 -37 585 -720 854 -375 415 1019 -406 806 -1081
1038a081J975o22p87J257p49P91j242O49K56n68J006j672J509o41l69J241j913
$$ -1081 894 272 -515 742 -7 784 -458 191 447 -121 885 -787 722 81 -288 953 -960
1055i60Q75O1Q05j218n00J671j190J078j261L51J004j233R75j152P61m07j7O82
$$ -960 -85 -24 781 -437 -937 734 -456 622 -639 -288 716 -517 458 -694 67 -340 -357 325
1073C25j449J126j59j93J32m38J539j249O65q54K27Q71r75P03p42O32q9m27O19
$$ 325 -1124 2 -157 -350 -218 -656 883 -366 299 -555 -328 543 -432 271 -471 161 72 -355 264
1092B64j272J385j71k89M9n38J457j189N28k59j66J085j484Q75p48N19K09k29
$$ 264 -1008 377 206 -83 -34 -572 885 -304 224 -35 -201 884 -600 275 -473 46 255 26
1110B6N01j379J771l17j040O54n62J166j086M42l84M21K34j443J559o45j56R99
$$ 26 527 -852 919 602 -438 216 -346 820 -266 176 -208 213 447 -996 563 -82 -238 761
1128G61r02L98o47J167n58o38P22n69J044j485L01P66p93R30r89O72j22l15P57
$$ 761 -141 257 -390 777 219 -419 303 -266 778 -707 -406 360 -433 497 -492 180 58 -257 500
1147E00r27P33q19O49l10q68J475r51P41p10J75M69o27P63j009J057k10o38Q00
$$ 500 -427 306 -513 136 -174 -1042 433 -518 223 -487 -312 157 -470 293 -716 341 131 -507 293
1166B93j376J201k10M43l23r87J566r13Q51l95n18J294j276O67m30M33j47m32
$$ 293 -1083 118 -92 351 28 -959 607 -306 545 150 -368 926 -350 317 -113 320 173 -259
1184b59R30j224Q10q1j03K19r01J478r90J49K16k99P55j046M69l14M1L74o51O83
$$ -259 671 -553 257 176 73 292 -609 869 -121 28 244 -55 700 -346 123 -191 -150 224 -427 256
1204B56q35P52L07m79o5j46J254j183J84K23r23J338j097L53o2M43k08m62J147
$$ 256 -579 173 480 1 -64 -210 1044 -139 45 268 -655 683 -414 -61 -123 320 112 -350 797
1223G97j297R05l2o52P46p44R71r79k34O75m48N00j003P33J08j90L19o33R63n81
$$ 797 -500 405 373 -279 467 -277 694 -285 -519 156 -292 208 -795 -62 46 -144 175 -458 505 -76
1243g6O1M17j072P69j49N08q90k31J006q30P89p98P81K93r25P36p68Q44n15M07
$$ -76 -15 402 -670 99 -50 458 -432 -663 343 -487 302 -496 285 578 -347 389 -379 465 -50 357
1263C57l3j106J262p72N44m97j11J073q12M11n96L34P4m08J050j378P83o7j56
$$ 357 324 -782 480 -292 252 -245 -356 717 -95 316 -280 54 128 -280 770 -608 175 108 -48
1282d8L72j061J004k36j17k7M8N37j007N98J46k32L8l97R22p65K91j80n3J22n79
$$ -48 324 -737 267 31 -86 -113 -65 472 -535 63 209 -23 15 -382 540 -225 66 -114 -167 -45 -624
1303f24Q26j7k26K97l92O66j142O20K93m57M94q62P70n83L86J94m59L64k23N12
$$ -624 202 185 -41 256 -136 530 -612 8 301 -156 338 -524 246 -337 49 243 -216 148 -75 437
1323D37n72J69k3k84P00p69M62J2k73K32m79N36l86K00K98n54P41l71L34m21m60
$$ 437 -135 34 11 -273 427 -342 120 132 -141 91 -388 148 -238 -38 260 -294 447 76 410 -11 -471
1344d71R19n93J51k85M26%n15N68m48O32k60p7M34p46P20m77L33n62M12J31n54
$$ -471 448 -145 6 -279 147 147 -368 200 -248 384 124 47 481 -265 455 -22 311 -251 161 292 -262
1365b62L65k38L99M2q29Q48k73o1J72j13J51p99R32k38o5j31k48P99r11N26k56
$$ -262 103 -135 264 306 -523 325 52 -9 163 50 201 -598 334 96 31 -100 -348 451 -460 66 -190
1386a90J30M47r05O43m62M45k60rK43o48J160n38l82O16n26N97p32M03k1M9N72
$$ -190 -60 387 -518 125 -337 108 -152 -161 82 -566 594 56 -326 290 -236 361 -371 32 11 60 632
1407F32q84N78n15M6L42n83P97p14L69j30k25O70m56N88r12L92M12l89J81m37
$$ 632 -252 326 -189 -143 199 -384 413 -301 68 -62 -287 383 -73 515 -397 -5 407 18 199 -238
1427b38L74j39Q4N0j69L92k05j00n0j33M41k94K18m96L6M81m02Q3j59L56l70J81
$$ -238 136 -3 81 131 -38 354 149 49 -1 -134 307 13 231 -265 -229 252 -150 -67 -226 130 -240 -59
1449e9N65o19J06kK04j60m13O77l39O9l29K77J10l55L73j59r1n0J24K43p30O61
$$ -59 506 -113 -7 -9 195 35 -378 299 -40 29 -300 -23 87 -268 105 -54 -145 -195 -71 172 -558 103
1471A03r7q4p2J76J19k60Q8m07K61N87p69N00k62K32m6l63M35m59M82m2J34m55
$$ 103 6 -78 -150 26 145 -115 -27 -434 -173 414 -355 145 -117 115 69 -294 141 -318 164 122 256 -199
1493a99p2N55m86j23N65p8l7l90J86Q3K24l23J66M8k68L94l17o7M04l88M98n84
$$ -199 -271 284 -202 -325 240 162 125 -265 -79 4 228 -95 71 119 -149 245 -72 -139 265 -123 375 -209
1515b09J9N90k25J68p75M07J39k85j10nO16k97P4l83L2L04j64K97k16k58M07k35
$$ -209 -190 400 175 343 -432 -25 114 -171 -281 -286 330 33 107 -276 -244 60 -104 193 -23 -281 126 -109
1537a09L70k96P9p1J05J41l15P5q5M18j97l18N69m92L74m98K06K87o60L95j81
$$ -109 261 -35 44 -27 78 219 -96 -21 -106 312 115 -203 366 -126 248 -250 -44 243 -417 -22 -203
1558b03J85l4j45K66k89K31J80n88O60m90M72l68k8P2j01O44o31L17j89r6K50
$$ -203 -18 -52 -197 69 -220 11 191 -397 263 -227 245 -123 -151 -79 -180 464 -167 150 -39 -135 115
1579A15p9J79j67k52M23l40k2q7M24m18K27Pj17M16l66K49k7k09K87o14R08o25
$$ 115 36 215 48 -204 219 -121 -143 -230 194 -224 3 10 -107 309 -57 192 165 -44 243 -371 537 -88
1601h8J28L93n09o7l9L36l2l23L45m05M71j21j09R1k0L7l34Q1L1J76K6r7N9q0
$$ -88 40 433 -76 -143 -182 154 122 -201 144 -261 210 89 -20 71 51 88 -246 -165 -134 42 68 -29 30 -50
1625e0J02J10l83K30j79J76l08P53j62k42M31l86J43l03K6j85n7L14k7K21k68
$$ -50 52 162 -221 9 -170 6 -302 451 289 47 478 92 235 -68 -42 -227 -284 30 3 224 -44
1646d4k06M59k12m0J14R3n5k52O2R4j31M1M2L7o3J94q8j22M6p3P70o11K69j20
$$ -44 -250 209 -3 -43 71 164 109 -143 -81 13 -118 -77 -35 2 -61 133 45 -77 -31 -104 666 55 324 204
1670B04k35q8k06M25k41M3J24r4K51k36L62o19L52J31r2L27m69J08L6P5k97r4
$$ 204 -31 -119 -325 100 -141 -98 26 -68 183 -53 309 -310 42 173 81 408 -61 47 83 158 -139 -233
1692b33K90J29M6k31K2LJ08j79P5M2L0o79O89k54JK13Jj06l8L34k67R2o7k43M0
$$ -233 57 186 232 1 23 26 134 -45 30 72 102 -577 112 -142 -141 72 73 -33 -71 263 -4 88 21 -222 -182
1717a82J81k8j06J54J39m06L87j06l8m4q2J79k10L13M1m2k23N6J30p8m92O89m44
$$ -182 -1 -29 -135 19 158 -248 139 33 -5 -49 -131 48 -162 151 192 150 -73 -17 113 35 -457 232 -212
1740b12M31k88j01J04j99K90j11J22K0l14N91o09M31J22k81j07o8M05n86O50k43
$$ -212 219 -69 -170 -66 -265 25 -86 36 56 -258 333 -276 155 277 -4 -111 -179 226 -360 290 47
1761D7o2j39L17J8m59L21j89J76N7r1j47p0j4M57j61Q1l0l7j18j1j3P5P5k77K08
$$ 47 -15 -154 163 181 -278 43 -146 30 87 -4 -151 -221 -235 222 61 142 112 75 -43 -54 -67 8 83 -194 14
1786A4l13J84J22j91K33l06K49k42N36l92K28J01k32J73j50Q0J10m94K77J17m8
$$ 14 -299 -115 7 -184 49 -257 -8 -250 286 -106 122 223 -9 164 14 94 204 -290 -13 104 56
1807E6k32J84K11j12k76K83j94K26j80L31l75J4J03K6j22j43J84j07J65L5k08
$$ 56 -176 8 219 107 -169 114 -80 146 -34 297 -78 -64 39 65 -57 -200 -16 -123 42 77 -131
1828a31L23o1j81O6k40M41J6m5k63p6K70j99J85l1N2l5j92K39o6N4j58j59K74
$$ -131 192 131 -50 16 -224 217 233 188 -75 -151 119 -80 105 74 126 91 -101 138 72 126 -32 -191 83
1851H3l4R5m7lM0k14K10k04Lk8K12l0j27n2J11rq2P8K31m27J10J00M1k02K35j64
$$ 83 49 144 97 94 134 -80 130 -74 -71 -99 113 83 -44 -96 15 6 -76 2 233 -194 -84 16 57 -145 90 -74
1877g4J28j26j6K16J94n64K06j14J43r0K8J78l02K93k07Q5r4K9J40Pj58J06N3
$$ -74 54 -72 -88 128 322 -242 -36 -150 -7 -97 -69 109 -193 100 -107 -22 -116 -87 53 60 -98 8 61
1900F1K30n50L94j16L29j46l01J37K9k76J22K88l62L21l34N7M2J68n3J89l52p5
$$ 61 291 -259 135 19 348 202 -99 38 67 -209 -87 201 -161 160 -174 -117 -75 93 40 229 -123 -198
1922a98K07j64N24m48P0J85k24j2J38J3np6R8l45L8M29k81o7J85J43k57p3R4N7
$$ -198 9 -155 369 -79 -9 176 -48 -60 78 91 86 10 108 -237 -199 230 -51 -118 67 210 -47 -120 -26 31
1946C1k64M66l57L51j12O2k8k98K9M4J02M7l26L91k13q1K72k30J98m2j68J1J84
$$ 31 -233 233 -124 227 115 177 149 -149 -120 -76 26 73 -253 138 -75 -156 116 -114 84 42 -126 -115 69
1969F9Nk60L4J47J11K03o47N36o7M0j36k8K13k27l0N6j41n7P3L34l42L25m5J1
$$ 69 74 -186 -152 -5 106 309 -338 198 131 171 35 7 220 -7 -37 19 -122 -179 -106 228 -114 211 166 177
1993A77j67q5R7j47K16l43J39K23o5P0j15j13K37k30Q4O7M6p4k1j60j4R2J28m0
$$ 177 10 -75 22 -125 91 -252 -113 110 45 115 0 -113 124 -106 -22 45 91 17 -4 -164 -178 -86 42 2
2017Bj00P1K33l72K09R9l9j33J53l43p3K81m5P1L9j98L88l13k6K01O0j94k27L71
$$ 2 -98 -27 206 -166 43 142 103 -30 123 -220 -293 -12 -57 14 53 -145 243 -70 -96 105 165 -29 -256 115
2041A15m9k52J84r3j95M17M2o5m16K81K01j45QJ23m05L29o2m9K45k80k4J24%O1
$$ 115 66 -186 -2 -95 -290 127 169 104 -312 -31 170 25 33 156 -249 80 18 -31 214 -66 -90 34 34 95
2065I5j31K3j40j19J08k69L57K10l46J73K87j86R5j92R5L3K34m96p9M17j26n8
$$ 95 -36 -13 -153 -272 -164 -433 -76 134 -212 -39 248 62 157 -35 60 93 327 -169 -248 169 43 -15
2087a5RL10k39k34k8K98O2k54l1j38M42p5j89Ql6Q5j75J39l1j4rJ85k21K74j66
$$ -15 -6 304 65 -169 -197 101 163 -91 -122 -260 182 107 -82 -74 -110 -25 -200 -61 -92 -106 -115 70 -151 123 -43
2112d3J21L4K37k29j64J33j16Q3p0j03K49k02J2O1j6q7O6k05J0L32j94L44j22
$$ -43 78 112 349 120 -44 89 -27 56 -14 -117 132 -70 -58 3 -13 -100 -34 -239 -229 103 -91 253 131
2135A31j74J55k70L09j1n27J53K63k52J39k5K05q1j02j03L33k43K46k95K40j47
$$ 131 -43 112 -158 151 140 -387 -234 29 -223 -84 -109 96 15 -87 -190 143 -100 146 -149 91 -56
2156e6J55k93K21r1J63L3k41K34q7o6j14k8K08J70L4l52J08r8K13j80j70L82k59
$$ -56 99 -194 27 -64 99 132 -109 125 38 -28 -142 -170 38 208 242 -110 -2 -100 113 -67 -237 145 -114
2179a14mK48k37J87J0K55l18K01L8j89k94K59Jj68M0J20L2J98q8j06k35L8K55
$$ -114 -118 130 -107 80 90 345 27 228 266 77 -217 42 43 -125 -85 35 67 265 177 71 -164 -126 129
2202A29j22j65J59j17j14J61J26l8p6k37J28K93K9j00j23L75j56O4j75J00j73
$$ 129 7 -158 1 -116 -230 -69 57 19 -57 -294 -166 127 156 56 -67 308 152 216 41 141 -32
2223c2j01P2Q0K32k11k51K93j79J37r7kL48l03M8K26k77m5M9R3j74K04k05J17
$$ -32 -133 -61 19 251 40 -211 82 -97 40 -57 -59 289 -14 34 260 -17 -62 -13 80 -94 110 -95 22
2246B2j03p3L60n0m83M69j56j55J71K12k03Q2J00k21J64r0M7k11K4M25m84K18
$$ 22 -81 -154 206 156 -327 142 -14 -169 2 214 11 93 193 -28 136 46 93 -118 -94 331 -153 65
2268F5q6QJ4M2m3N1o1Q5j31j07J83J2j46J94r3M9j31O9L44k70l6N1j00r1P0N3
$$ 65 -21 -13 1 43 0 51 -10 75 -56 -163 20 32 -114 80 -13 36 -95 -26 318 48 12 63 -37 -128 -58 -5
2294em9j98L02L4M2l7j56k19N66l58k9N1J09j75K07r4n3q8P7j1J26J9j1j80O6
$$ -5 -54 -252 50 84 126 89 -67 -286 280 -78 -107 -56 53 -122 85 -9 -62 -150 -73 -84 42 61 50 -130 -64
2319f4L6J82K8r2k19m6K20k43O3k0K16k13K87R0l68K18j43m2K34J6j20j03M3J63
$$ -64 -28 154 182 90 -129 -175 45 -198 -135 -155 61 -152 135 225 -143 75 -68 -110 124 140 20 -83 -40 123
2343A23n63N25j70R3K7M9j08Q0k39L50l32k35K96J7p4L36m17L03kj77L75k06n
$$ 123 -440 85 -85 8 35 84 -24 56 -183 167 -165 -400 -104 -87 -161 175 -242 61 59 -118 257 51 46
2366D6M9n1k65K32P9j80k24K42J72J30l69O5K8L38J4k10k52J85j43L28m00K10
$$ 46 95 44 -221 11 90 -90 -314 -72 100 230 -139 -74 -46 292 306 96 -156 29 -114 214 -186 24
2388B4j71L68l85P8O3k9J13k08J34j12J18J59o6j09K76j52jj09o4J44J26l55N26
$$ 24 -147 221 -164 -86 -23 -52 61 -147 -13 -125 -7 152 86 -23 253 101 100 -9 -73 71 197 -158 368
2411C68m39J33n9L2l4K14J6l70qK40k89R8J41p0P9j80K07j54L15k27k3nl8k11
$$ 368 -71 62 3 35 1 215 231 -139 -147 93 -196 -98 43 -27 52 -128 79 -75 240 13 -10 -15 -53 -264
2435b64K27n8J3J38Q1k14L8q2J59j49J54N1k80J88r1K28j16q4J11j88J58O3j12
$$ -264 -37 -95 -82 56 137 -77 -39 -121 38 -111 43 94 -186 2 -89 139 23 -61 50 -138 20 83 -29
2458b9M7rj30O2K71k79J22K3o9L7Q5k45K06k29L4L12k91J39K9k54J5J32M1k4k1
$$ -29 18 9 -121 -59 212 -67 55 78 9 46 131 -114 92 -137 -103 209 -82 57 86 -168 -153 -21 20 -4 -25
2483b5J0K28k98J07K90o24L67j01J92k92O5L26k73j87L03r2J01j03j6n3K36l57
$$ -25 -15 213 -85 22 312 -312 55 -46 146 -146 -81 245 -28 -215 88 -4 97 -6 -22 -75 161 -196
2505a96J98j47J36L8j37K74L9j28NM6ok12k14K32l5k55M46o7M5r1Q5j37J36k82
$$ -196 2 -145 -9 29 -108 166 205 77 82 128 122 -90 -304 -72 -107 -362 84 17 62 -29 56 -81 55 -227
2529b27J5M08j41j08J30R9k16J15J67j80L9K5k42J92K5n2O2kn5K27l62J92l4J13
$$ -227 -212 196 55 -53 77 176 -40 75 242 62 101 126 -116 76 101 49 111 109 54 281 -81 111 77 190
2553A90k45J81J78k38p7N6k1J47n4j74jK54l8k65K6J11l0r2J74o4j7k60M55k28
$$ 190 -55 126 304 66 -11 45 24 171 117 -57 -58 196 158 -107 -81 30 0 -92 82 18 1 -259 196 -32
2577c2j41J41J12l4j09nn2j0K58j4j20J16j22j30k0L93n06K09n6K1K61j61j05
$$ -32 -173 -32 80 46 -63 -68 -120 -130 128 114 -6 110 -12 -142 -162 231 -275 -66 -122 -101 160 -1 -106
2600a06J74J65k60k48L23P5k57J94j20pq0R5o1J22l55K05L88l23K21k31K94o9
$$ -106 68 233 -27 -275 48 123 -134 60 -60 -67 -147 -52 -113 9 -346 -141 247 -76 145 -86 208 139
2622A39p3n8k17J74K60r5k13n5K53k76k7M95j25l54L15m53L78K29k95j08Q8K94
$$ 139 66 8 -209 -35 225 130 -83 -138 115 -161 -188 307 182 -172 143 -310 68 297 2 -106 -18 276
2644B76m20J43N1M6l31K68K47l91M4J89j30l25K93K11k26J6R2j40J38L0p1K05
$$ 276 -144 -1 50 96 -235 33 280 -111 -67 122 -8 -333 -40 171 -55 -39 53 -87 51 81 10 215
2666B15k78Q5R1K3p4k02K9J24Q2k59J21P8k02J37J75n8j45M6k35K56m26L81o3
$$ 215 -63 22 113 136 62 -140 -111 13 95 -164 -43 35 -167 -30 145 87 -58 -12 -247 9 -417 -36 -99
2689i9L99l53J51r7j26K16j67P7j37J2M20L1n05M09l07J72L6k29J70k1J25l12
$$ -99 300 -53 98 1 -125 91 -76 1 -136 -124 296 327 -178 231 -76 96 132 -97 73 52 177 -135
2711a35J44L98n07M37m96M0K19j41O7q3L04n59M41j97J02J44k11J19J35k29n0
$$ -135 9 407 -100 337 -159 -119 100 -41 26 -57 247 -312 129 -68 34 178 -33 86 221 -8 -58
2732e8J25j6L0j70J20o2L12j98o5k82j76M38j21P6K69l51L63l19j42M87l60L79
$$ -58 67 51 81 -89 31 -31 281 83 18 -264 -440 -2 -123 -47 222 -129 234 -85 -227 260 -100 279
2754B79l27J83j4k2k96J87J04P0j39J08j11Mj8j69L35k82K71j16j40J42M9Qj08
$$ 279 -48 135 121 99 -197 -10 94 164 25 133 22 26 8 -161 174 -108 163 47 -93 49 98 106 -2
2777bO7j57j9J98ro5j64K11j18p3L02k26k8K42k03Q9J00j70J29k09mm4K71k09
$$ -2 65 -92 -111 87 78 13 -151 60 -58 -131 171 -55 -83 159 -44 45 145 -25 104 -105 -109 -153 118 -91
2801i1K89l12K77k74r8M6P5K95l99J52M1j13m0J78J00k34kM09n6k38J4n7J30j89
$$ -91 198 -114 163 -111 -209 -163 -88 207 -192 -40 1 -112 -152 26 126 -108 -110 299 243 5 19 -38 92 -97
2825i7J2N6pJ98j14n6o8J84j27Jn5j00K52j01PJ2j89N33k22m6p6oP9q4J0L01k30
$$ -97 -85 -29 -36 162 48 -8 -76 108 -19 -18 -73 -173 79 -22 -15 -3 -192 341 119 73 -3 -9 70 -14 -4 297 67
2852F7l69L1K22j76J99p5K07p2RJ36j40Q8K51n41K06n5J02J11k02j32L00l44J82
$$ 67 -302 -271 -49 -225 -26 -101 106 34 43 179 39 127 378 -163 43 -12 90 201 -1 -133 167 -177 5
2875EMj28R9o2l5m5K87k47J06P2k25K77j5j67K27k11O0j7K20j30q8K47k61j10
$$ 5 9 -119 -20 -82 -117 -162 125 -122 -16 56 -169 108 93 -74 153 -58 2 -15 205 75 -13 234 -27 -137
2899a37J51J19mk10j19J68K51l5m13j19J44K92j51Q4O0q7J6M9j19q4N18l34m6
$$ -137 14 133 129 -81 -200 -32 219 184 -229 -348 -204 88 -63 21 81 -6 10 59 -60 -144 374 40 -6
2922fL18l15Qj54J04M7k6j48M54j35l02J48o6K9J01j09M7j73J91K38j58k80K09
$$ -6 312 -3 5 -149 -45 2 -24 -172 282 147 -155 -7 -73 -44 57 -52 -5 -178 13 251 93 -187 22
2945B2j36LP4k20K79j19J01J51m3l2k3k49K50k28qL20l96K89J6O8l11K58j26M
$$ 22 -114 -111 -37 -257 22 -97 4 155 112 80 57 -192 58 -170 -178 142 -254 35 51 119 -192 66 -60 -56
2969e6J21l33K31K1R4j08j91N55m56j1K81j93K20k63j17J11J52J5J93l06J66j40
$$ -56 65 -268 -37 -16 78 -30 -221 334 -122 -133 148 -45 175 -88 -205 -94 58 73 266 -40 126 -14
2991a4J44r4J18j08L60n85J28j96J03J45j22J53J74k96j28K66K0j80l4K71j77
$$ -14 130 36 154 46 406 -179 -51 -247 -144 1 -121 32 206 -90 -218 48 68 -112 -146 125 -52
3012e2K65m4k47R7o4Q6O2k11K6J18J00j5j2l23L55j04l28L28R8j67L28n31K93
$$ -52 213 169 -78 19 -45 41 103 -108 -82 36 136 121 109 -214 141 37 -291 37 135 -32 296 -235 58
3035E8N7k09J23J8r7Q2l50J45J73k40L93r4j81M2K62J3p7l79K27K05k86K45j51
$$ 58 115 -94 29 47 -50 32 -318 -173 0 -240 153 59 -122 -80 182 195 118 -261 -34 171 -115 130 -21
3058b1J79j44j86J51j9L5L9j57r0J99L58k88j43K09o1r8J09K06p5j5j65j69J70
$$ -21 158 14 -172 -21 -40 -5 34 -123 -213 -14 344 56 -87 122 61 -37 72 278 203 188 23 -146 24
3081B4M6j2j24J60k82J29N9k01J77L1q0Q5j64j29K60O1m6J22N1k52J44j65K31
$$ 24 70 58 -66 94 -188 -59 0 -201 -24 7 -73 12 -152 -281 -21 40 -6 116 167 -85 59 -106 125
3104A25l61L28k37J35l16M04Q5k16K67k10J15j34N0m9J53j46R3L9p4j64Q0j24
$$ 125 -236 92 -145 -10 -326 78 163 -53 214 4 119 -15 35 -14 139 -7 86 125 51 -113 -33 -157
3126a57J94q7K76k70L8nJ49j71O6j52L22j31n0J47j55j09K05j81J85O9k03L84
$$ -157 37 -50 226 -44 -6 -11 138 -33 33 -119 203 72 22 169 14 -95 110 -71 114 183 -20 364
3148C64m63L9Q1l01K63J35j71R5j01J33q8l0J48l79K65J66j81P5O0l03J46p3L8
$$ 364 -99 -60 21 -280 -17 118 -53 42 -59 74 -14 -44 104 -275 -10 156 -25 50 110 -193 -47 -120 -82
3171h2L5l1J8j45J93J19J07k67K98k19J23Q3l66L42o0j04kj56J75k02J98k15k63
$$ -82 -47 -78 -60 -205 -12 107 214 -53 245 26 149 232 -134 208 148 44 42 -114 61 -141 57 -158 -421
3194d21M58J1mo0Pk28M12k95M50k21k47K75p2q8o9k02N27j6nJ1k78J74k51L36
$$ -421 37 48 44 -16 -9 -237 175 -120 330 109 -138 137 65 -23 -92 -294 233 217 212 223 -55 119 -132 204
3218B04p6k8Ml97M80l06L46k74K06m5j80nP2M29l16Q1l93K77L1j20L03m00p8K2
$$ 204 128 100 104 -293 187 -119 227 -47 159 114 -66 -71 1 430 114 195 -198 79 110 -10 293 -107 -185 -163
3242a63MK63k23l2K51j04m1L26j43m54J88r5K14m1jK39k69K41k42Q0m5o0J85k94
$$ -163 -159 104 -119 -151 100 -4 -45 281 138 -316 -128 -223 -9 -50 -51 188 -81 160 -82 -2 -47 -107 78 -216
3266b16K91r0j38J56L1M0j45r2k16M30j07J77j16j15P4l5J81k18M4N6k4kJ86l47
$$ -216 75 -15 -153 3 34 74 -71 -163 -379 51 -56 121 5 -110 -36 -71 110 -108 -64 -8 -32 -34 152 -195
3290a95oM04J89j67m67L76p4J37k23k28J77M3J4k5J41jn15M92j96J23n8l3L8O0
$$ -195 -201 203 392 225 -242 134 60 197 -26 -254 -77 -34 -20 -45 96 95 -420 72 -124 -1 -59 -92 -54 6
3314Fp8j9J53J66l61N4L8K48l21J71j71N2J64j81J14K73o26K50K42o2j39J96j70
$$ 6 -72 -91 62 228 -133 -79 -41 207 -114 57 -114 -62 102 -79 35 308 -318 -68 174 112 -27 169 -1
3337aJ31j12k08M77k82M7J03Rl48M23j58N0Ok99J30k0N3J02k67N36n24J17JJ95
$$ -1 130 18 -190 287 5 52 155 164 -184 239 81 131 137 -162 -32 -52 1 103 -164 372 -152 -35 -34 161
3361A61J9l02L41o1k4K36n94j29M21l1N1R7m30J01J76j55L70l16M3K03j2qj29
$$ 161 180 -122 219 158 134 370 -224 -353 68 37 88 185 -245 -144 32 -123 247 -69 -26 177 165 157 28
3384B8m0Q8m6o7L0j36n2K20J10k0j91j15K91n4k21L39k47Q7k39J77J00P4q1j55
$$ 28 -12 76 30 -37 -7 -143 -195 25 135 115 -76 -191 100 46 -175 164 -83 4 -235 -58 42 116 35 -120
3408a20P3O1Q9l52L08j81p1K46k19R4j22M71j80j4J5l25M91j99n0r0l3LJ62J06
$$ -120 -47 14 103 -249 59 -122 -193 53 -166 -72 -194 277 97 83 98 -227 264 65 15 -75 -108 -105 57 163
3432A63j06j33M1K11o2m98M29k11p3j65N45k04P0l7K15j01j66K94K3k03L2jo9
$$ 163 57 -76 -35 176 114 -384 45 -166 -239 -404 141 -63 7 -30 185 84 -82 212 235 32 64 63 -6
3455fj01o7K53k24J20J03n9J24K7r8j26L0j58J95M4j4k23M64k67M0R8k08L2k88
$$ -6 -107 -174 79 -145 -25 78 19 143 170 72 -54 -24 -182 13 57 43 -180 284 17 57 155 -53 -21 -309
3479c09K05K6P2L8m0k2j80K49M3Q0k42J99nj0l37J68J17j78J65P3r7Oj67R4q0
$$ -309 -104 -78 -6 32 -8 -30 -210 39 82 162 -80 119 114 104 -233 -65 52 -126 39 112 15 21 -146 -52 -132
3504a32J13K08k03j49K47P2j88J49m5k93K13q3k12K94m2j6Q6M4l7j4o4L7k45K57
$$ -132 -19 189 -14 -163 84 156 -32 117 72 -221 -8 -91 -303 -9 -51 -67 19 63 26 12 -52 -15 -260 -3
3528ck54J63J05J8Mj7K38k38l37j34L58j72O4K18M4J49n8j40R1r0k5j24J34l10
$$ -3 -257 -94 11 29 33 16 254 16 -321 -455 -97 -269 -205 13 57 206 148 8 99 9 -16 -140 -6 -316
3552c16M61k56K10j95R6P9L3j43Q3K7J47l76j59N03k34K0p1J22j43P2J78J32k76
$$ -316 145 -111 99 -96 0 79 112 -31 52 79 226 -150 -309 194 -40 -20 -91 31 -112 -40 138 270 -6
3575fK53l06J62j64k70J78K30l26J02L5Q8O2j69J85o3K49l03J92k27L67l26L8
$$ -6 247 -59 103 -61 -331 -153 77 -249 -147 -112 -24 38 -131 54 -9 240 -63 129 -98 269 -57 -19
3597a9o5J41q5j22J68j89k65J19L48k03M2M2J4J17j53K93k48j73O2K56j91L21
$$ -19 -84 57 -28 -150 18 -171 -436 -317 31 -172 -130 -88 -74 43 -110 183 -65 -238 -176 80 -111 210
3619B10l60M6P7J04j44ON6K08j67l1J25j80J0J00j37L1J37l13L8L30Q9j00j08
$$ 210 -150 -104 -27 77 -67 -61 -5 203 36 5 130 -50 -40 60 -77 -46 91 -222 -184 146 235 135 27
3642B7J91k72o6K97j71l7n6Nl5j4J70K07k21k08J56L7j7j22L02P5l84K8k3L3M35
$$ 27 218 -54 -120 177 6 -31 -87 -82 -117 -131 39 246 25 -183 -27 10 -7 -129 173 248 -136 -108 -131 -98 337
3667C37n38N9J48k15J96p5J6n0K09k01j20P9L05j99K54k32P0J15p2j85K28k01
$$ 337 -201 -142 6 -209 -13 -88 -72 -122 87 -114 -234 -155 150 -49 205 -27 43 158 86 -99 129 -72
3689g2J25ON1l84L29M1l2k78Q8J53Q8j70j78K79K20l49l3K20j16K46J3o67L28
$$ -72 53 59 110 -274 55 96 64 -214 -126 27 115 -55 -233 46 266 -83 -116 104 -12 234 247 -420 -92
3712i2J9K28j07J62j33j97J14l9K12l39K14K11k54j11L33m54L25M0k30J58j48
$$ -92 -73 155 48 210 77 -120 -6 -45 167 -172 42 253 -1 -112 221 -233 92 132 -98 60 -88
3733h8R0L2j00L45k18N2n4J17J58l97J71K9p6k8O5k98M10j06j57J78l82qL84p3
$$ -88 2 34 -66 279 61 113 59 176 334 -63 108 137 61 33 98 -200 210 104 -53 125 -257 -265 119 46
3757D6j47mJ06K4j26J94j10Q6k33J96j16J2j9P8j8J73k27k2J56p0J87k22J67J61
$$ 46 -101 -105 1 25 -101 93 -17 69 -164 32 -84 -72 -91 -13 -31 142 -85 -107 49 -21 166 -56 111 272
3781B72m65R6L33l04k1L07k61J04k31Q5L09p3m05L08m2K30l28J05Q9r6n5J23l8
$$ 272 -193 -97 236 -68 -89 218 -43 61 -170 -85 224 151 -254 54 12 242 -86 19 108 12 -43 80 42
3804D2p0K89q2l55p5K47k20K80MQ8k49O8Q5k87L00l6jm5l5L4Q8j9J4j3j4j29o
$$ 42 -28 261 179 -176 -251 -4 -224 56 60 148 -101 -33 52 -235 65 29 28 -17 -52 -18 70 51 65 52 38 -91 -97
3831i7o5J47J24J45k43l5l5P6o2J70k27N9r0K26J90k57j83K05k11K12J7k81j5
$$ -97 -162 -15 109 254 11 -24 -59 17 -45 125 -102 -43 -133 93 283 26 -157 48 -163 49 66 -215 -230
3854b30J63J20m03L70j44M8J62m90M54m5m2J43J08r7j85R8k1k84L88m2j5q3O4
$$ -230 -67 53 -350 20 -124 -76 86 -404 50 5 -37 106 214 117 -68 30 9 -275 113 71 56 -27 37
3877C7J56j75J24k63K86P4l16O6J08q8P3j71LM50j90pj50J38k96N0M3q3J39m44
$$ 37 193 18 142 -121 165 239 -77 -11 97 9 82 -89 -86 364 174 167 17 155 -141 -91 -48 -131 8 -436
3901d36M62N8m1o7m6P7Q1ok9n8k27L38j21J15QJ8j04l6k41J90N8k37K54p1N9o2
$$ -436 26 84 43 -24 -70 7 88 82 53 -5 -232 106 -15 100 108 126 22 -14 -255 -65 -7 -244 10 -61 -2 -64
3927f4J45J1K0m9k31J02J88j94J68k3lK1m0r9R6q7N8q2K63k87R1J33k06J64J2
$$ -64 81 92 112 63 -168 -66 122 -72 96 73 70 91 51 -48 48 -39 19 -63 200 -87 4 137 -69 95 107
3952A07k12J58O4N8J34j08j27o6j99J32q4K05M%j38K4K3p7KL30m47K01p1O0P1
$$ 107 -105 53 117 175 309 201 74 8 -191 -59 -143 62 66 66 -72 -48 -25 -102 -100 230 -217 -16 -87 -27 44
3977D4J56j68j95L92j32l10J41J34O0r3j04J89L5J04l31J85l27L44k62M1k0J55
$$ 44 200 32 -163 229 97 -213 -72 62 122 29 -75 114 149 253 -78 107 -220 124 -138 -97 -117 38
3999C8j43J26l3L4pK53k9r7Rk79p0K44J05Rj50pJ80k03O7j86R4OL3K67l71K87
$$ 38 -105 21 -12 22 15 268 239 142 151 -128 -198 46 151 160 10 3 183 -20 47 -139 -45 -39 -6 261 -110 177
4025A77J20l52Q9O9L7r2j21m0J53P9l92M72l5k22m3P8J55k41L48m6K7j85K7m6
$$ 177 297 -55 34 103 140 48 -73 -113 40 119 -273 199 164 -58 -101 -23 132 -109 239 193 220 35 62 16
4049A6K3J79j97j68K18M7M0j44L81n37L13p1j83R1j81P5K09l13M34k88J09j48
$$ 16 39 218 21 -147 71 118 158 14 395 -142 171 100 -83 8 -173 -98 111 -202 232 -56 53 -95
4071i5J38J88l47J52j06o4J41N3j90J39j43JJ46L1K3o8M4n1k28J52K3M7J67p6
$$ -95 43 231 -116 36 -70 -134 7 60 -130 9 -134 -133 13 44 67 -1 43 -8 -236 -84 -61 -14 153 77
4095G7l69K3K23J58k34R2j09K9K21K4n46L79j43K84j44K76j85O3m27K31K30k51
$$ 77 -292 -269 -46 112 -122 -30 -139 -110 111 135 -411 -32 -175 109 -35 241 56 119 -308 -77 153 -98
4117i8K25k50J9J57k10Q1J96R0L35p11K11L0J29j60k3N4qM6k19J64m9J44l46L60
$$ -98 127 -123 -104 53 -157 -76 120 210 545 -166 45 75 204 44 21 75 67 113 -106 58 9 153 -193 167
4141A67l04N9K81l72J79J04M0m8j27L03n22L20r4k1K2K42m4l17o7l6N4K80j23
$$ 167 -137 -78 203 -169 10 114 154 106 -21 282 -240 80 -14 -35 -13 229 185 -132 -199 -235 -181 99 -24
4164b4k40M87o8j20j66N2K34N3j02j33L36l95K4k72M71j42m1L05K1m33KK89r5
$$ -24 -264 223 155 35 -131 -79 155 208 106 -27 309 -86 -62 -334 137 -5 -46 259 280 -153 -151 138 43
4187D3n3J14l16K58J32l65K95l4nk37J15K2M27j67l11J33r5J63jj17j34O1k66
$$ 43 -10 104 -212 46 178 -187 108 74 69 -168 -53 -31 396 229 -82 51 -44 119 118 1 -133 -72 -338
4210c38O13l41K5K4r9l5RK12j4r4K5r5o9J63j32K33k56J88n2N5J15k48K66qj16
$$ -338 275 -66 -41 -17 -116 -151 -142 70 56 -38 -13 -108 -177 -14 -146 87 -169 19 -33 22 137 -111 155 147 31
4235C1J07j71j1J92J27m20J48Nm08L15k27M34j28R4J33l9j60KqJ84k49oj33O9
$$ 31 138 -33 -44 148 275 -145 3 8 -400 -85 -312 122 -6 88 221 182 22 24 16 200 -49 -55 -188 -119
4259a19L18k18m0R1j96J42Q3rK03l72j49K49k3K9P5R9J45j06j42j96K24j29K55
$$ -119 199 -19 -59 32 -164 -22 61 52 255 -117 -266 -17 -40 -11 64 163 308 202 60 -136 88 -41 214
4282B14Nm04N24m88l94L08L51k27J78j26L95l32RJ5j04J96m6q5j75j1L89j45j00
$$ 214 219 -185 339 -149 -543 -235 116 -111 67 -59 336 4 13 28 -76 120 74 -11 -186 -197 192 47 -53
4305e3j59O3K24J01j33k01m8L72j55L13k39j26N1r3J08J72j45j17k5L49j62K5
$$ -53 -212 -149 75 176 43 -158 -206 166 11 324 85 -41 10 -83 25 197 52 -65 -90 259 97 122
4327A22k05K90j59M1l88J76R4k4q6K18j54J55J41k24K54l12j7NN1R3l33L65n23
$$ 122 -83 207 48 89 -299 -123 -29 -53 -139 79 -75 80 221 -3 251 -61 -78 -73 -22 71 -262 103 -420
4350d20L74o1K60m17J94J94J3l07J86P5q7j11K14L4m04L13j07l7J37j84K43J09
$$ -420 -46 -107 153 -264 -70 124 137 -170 16 91 4 -107 107 141 -263 50 -57 -94 43 -141 102 211
4372B11k82M5J72qq8K42l39N9OK16j70j00K55o9m3q0o7J66j88P5q6J44p8K47m20
$$ 211 -71 -26 146 138 50 292 -47 12 18 234 64 -36 219 150 107 27 -40 126 -62 13 -73 71 -7 240 -180
4397a80K03J0n4j66Q1L0j07J51p6J70l3j70J43J4L1K72l39K44J6l17J31k06k6
$$ -180 23 33 -21 -187 -106 -76 -183 -32 -108 62 29 -141 2 16 47 319 -20 224 240 -77 54 -152 -178
4420a78K38k91j36J76K72k16L52j64m3l8J07n5Pn5j21M35j15k32K20j32J03k52
$$ -178 60 -231 -367 -191 81 -135 217 53 10 -28 79 24 31 -24 -145 290 175 -57 163 31 134 -118
4442a18O5K39j12n2J57P8k13J05r4j0J36l77K72ml07K09N4r5J48J67k62P6k13
$$ -118 -53 186 74 22 179 257 44 149 55 45 181 -196 76 72 -235 -26 28 -67 81 248 -14 62 -151
4465a51k0L57l70M01j27j10K23m38J80r7M01k00J03k01M7N0lJ84l14j2Q4J45l33
$$ -151 -171 186 -184 217 90 -20 203 -235 -55 -152 249 49 152 -49 -2 48 45 229 -85 -97 -13 132 -201
4488b01K07J10l63L61n6l2K07J03n78J88o3R6J71k10K37m43K34K15j04j28L46
$$ -201 6 116 -247 114 58 26 233 336 -242 -54 -117 -21 150 -60 177 -266 -32 183 79 -49 297
4509B97l41m7P8n8nJ22M1j7k05N19m53K81q9N9k09l1j1J96rl43J74J54j70J52
$$ 297 -44 -91 -13 -71 -76 46 87 70 -135 384 -69 212 123 182 -27 -58 -69 127 118 -225 -51 103 -67 85
4533H5P3k46L5J74n82P17k05K2r2ro3j75O5K42m2J10q8Q0n1KM7k5j75K45j73K21
$$ 85 158 -88 -53 121 -461 256 51 73 -19 -28 -91 -266 -201 41 -1 109 21 101 50 52 99 74 -101 144 -29 192
4559A92k57%L82j02j19r9j86K18pRq3j56M62J9l91J20jl3J37k02J44K5L5j91L8
$$ 192 -65 -65 317 215 96 -3 -189 29 22 31 -52 -208 254 273 -118 2 1 -32 105 -97 47 72 107 -84 -46
4584d6P1J00l84L77l37K16k60L46M5k02K58l99K17J88j70k26J75j08R9k8M57n77
$$ -46 25 125 -259 118 -219 -3 -263 83 128 -74 184 -215 2 190 20 -206 -31 -139 -40 -68 389 -188
4606a88L15O7q3r7K62k24P3k3l39P0L89m62M5l7K73k30J30R4k93o3L53J33q7P0
$$ -188 127 194 111 14 276 52 125 102 -237 -167 222 -240 -195 -232 41 -189 -59 35 -258 -321 32 165 78 148
4630A48j94J66l68K08L41k18k9J9k9j43J85K34m63Q4O9K14l30m7J95P9j43L8K3
$$ 148 -46 120 -248 -40 301 83 54 73 44 -99 86 320 -143 -59 10 224 -106 -153 42 121 -22 16 39
4653C9J64R8k35J3P9j73O7J20k38L43k19k04K93j13JK2r9R6L0k3K08l67n7K53
$$ 39 203 301 66 79 158 -15 52 172 -66 277 58 -146 147 34 35 57 -42 54 84 61 269 -98 -155 98
4677I8k04R5r7l0nJ08K40j12k25K18J06l11L6O2J12j15m7r4K53j53J5R5J6m6q3
$$ 98 -106 -11 -108 -138 -143 -35 205 93 -132 86 192 -119 -83 -21 91 -24 -71 -165 88 -65 -50 45 61 15 -68
4702f8J05q9J13j23k06K61m2J26j07n7J25J3L3k37o7L93m7l10n6M05j75r2J19
$$ -68 37 -52 61 -62 -268 -7 -49 77 -30 -87 38 51 84 -153 -220 173 126 -184 -240 165 -10 -102 17
4725A7o6J20Mk76K68M2l9j7K05k16K50l25M9M2J96p2j51M9J87k91L5n4nPR6M6
$$ 17 -49 71 75 -201 67 109 70 53 258 42 292 -33 16 58 254 182 31 80 267 -24 11 -43 -48 -41 55 101
4751A01JK81m27k07J79PK00j81N7JQ4k1J36j57m7J97l97J03L61m40K17J88l7j01
$$ 101 102 383 -44 -251 -72 -65 135 -46 11 12 96 75 211 54 7 204 -193 -90 271 -169 48 236 199 98
4775I8k64J44O9Jj54nL44m40J24J10j70L59q6k51r6L67j78R2j30OK73l60L26j74
$$ 98 -166 -22 47 48 -106 -111 233 -207 -83 27 -143 216 130 -121 -217 150 -28 64 -66 -60 213 -147 179 5
4799EK16l72M0k2J07J0l8J04j34J39J38m4J08l51J43k24J52j18R4K04j92J12l8
$$ 5 221 -151 -111 -133 -26 -16 -54 50 -84 55 193 149 257 -94 49 -175 -23 -141 -47 157 -35 77 39
4822C9M8j94K69q0K6k35l5O2JL47l55R7J24j17M80m45j61K60k23j67K82K3K66
$$ 39 87 -107 162 82 108 -127 -162 -100 -99 248 -107 -10 114 -3 477 32 -129 131 -92 -259 23 46 312
4845C12k83k4k2J01J74q1j62N8l7J41j84r4K86N5l62M1Q6K62l56J14J79k79m4
$$ 312 29 5 -17 84 258 177 15 73 36 177 -7 -101 185 240 -122 -81 5 267 -89 25 204 -75 -119
4868a19J13J03j0r2q5Q5N3l35J02N88l11j59N3J09k71Q6J37o2o9N1J49o0j03K45
$$ -119 -6 97 87 -5 -90 -5 48 -287 -185 403 92 -67 -14 95 -176 -90 47 -15 -84 -33 116 56 -47 198
4892A98j47L1k70K74j46K05k8j67K70k73l2P4N1O0O3j84K06j93N9r9J74p9j44
$$ 198 51 82 -188 86 -60 145 117 -50 220 -53 -85 -11 40 100 163 -21 185 -8 51 -48 126 47 -97
4915i7j21N35j09l41K52l37J04J07m1L0J16k74M2l8K62Nl04K96r3o3J15n8pJ0
$$ -97 -218 317 208 -133 119 -218 -114 -7 -48 -18 98 -176 -134 -172 90 95 -209 87 -6 -69 46 -12 -19 -9
4939iK41l20pJ66j06Q5j62K05L5j20L7L4j99K1K09j06k20l7J21J48j45K19k5J01
$$ -9 232 -88 -95 71 -35 50 -112 93 128 8 45 79 -120 -99 110 4 -216 -253 -132 16 -129 90 65 166
4963A66R9m86J70k7K82k65J96j22p1J41k71K22k57J93qr9q5L26Q7j58K06m23L60
$$ 166 265 -221 -51 -78 204 -61 135 13 -58 83 -188 34 -223 -30 -38 -137 -222 104 191 33 239 -184 176
4986A76k07k37K07k5J87j09n8J43j57Q8J0P5k18j9M9K2M85m41J5m5l1J38O4M3
$$ 176 -31 -268 -61 -86 101 -8 -66 77 -80 8 18 93 -125 -144 -95 -73 412 -29 -14 -59 -90 48 112 155
5010A55j06%m0k09J40J0k76L06j9o4J53Q0j71L93l13q7J7l57N30l42l7M56m67
$$ 155 49 49 9 -200 -60 -50 -326 -20 -39 -103 50 130 -41 352 39 -48 -31 -388 142 -200 -237 219 -248
5033b48L57j18o9k7P0j07J76m4J00M6j9N6k18J20P0k45k0J16j72J3L2N7k6J78
$$ -248 109 -9 -78 -105 -35 -142 34 -10 90 136 117 173 -45 75 145 -100 -120 -4 -176 -163 -131 -74 -100 78
5057G8l09J81j22K10k14M6L69l40j40K49J97Pm5o4o7J36j8j80j06K1j02J74L2
$$ 78 -231 -50 -172 38 -176 -130 239 -101 -241 8 205 212 167 103 36 172 154 -26 -132 -111 -213 -39 -7
5080gJ61n4k70J34j06J22Lj64J73N6k57L42k06M4J1J25q6K3r0OL59l49j8J69j75
$$ -7 154 100 -170 -36 -142 -20 -17 -181 -8 48 -209 133 -73 -29 -18 107 21 44 -46 -40 319 -30 -48 121 -54
5105e4l4K20J82k49j24L0p6J47J57o0N6Ml64j31L63j25O5J13Nj00l3k35L79p6
$$ -54 -88 132 314 65 -59 -29 -105 42 199 139 195 199 -165 -296 67 -58 7 120 125 25 -8 -243 136 60
5129F0j98Qp3J71J76l9J4o7Q4n5o5q7K5K9K19n6k20l2P9j92Q4J73L22j60j43m6
$$ 60 -138 -130 -203 -32 144 105 119 52 136 81 16 -71 -46 -17 202 146 -74 -106 -27 -219 -135 38 360 200 57 11
5155A1l62K08L96n58L66q6Q4o0n2J29l8j12o6J14l4K89k49L3J10q5j55q0J80J67
$$ 11 -351 -143 253 -305 61 -25 59 -1 -53 76 38 -74 -140 -26 -60 229 -20 13 123 38 -117 -197 -17 150
5179A50k06J3K67l55J23N6k04J61j57K73N4j78J06j20o1J84k42M00j62l3p1L1
$$ 150 -56 -43 224 -131 -8 48 -156 5 -152 121 175 -3 103 -17 -78 106 -136 264 102 69 -2 29
5201B9k7m9L80j00n98O27j26k50J10m2L1k22L56L2qL8L4j92j71k7K08j54M2j45
$$ 29 2 -47 333 233 -365 262 136 -114 -4 -46 -15 -237 119 151 143 181 215 23 -148 -175 33 -121 -79 -224
5225b24K55p9K5k59Q4J41l5J42k10j27K64J24l38K11j8j07J70j55L24k27K17m08
$$ -224 31 -48 -23 -282 -198 -57 -92 50 -160 -287 -23 101 -237 -26 -44 -151 19 -136 188 -39 178 -230
5247b30L34j11p4j64K10P8R9k37M9m8m8L77j11J70m60J46K8L90n40J78J20j80
$$ -230 104 -7 -81 -245 -35 43 142 -95 -46 -94 -142 235 124 294 -166 -20 8 398 -142 36 156 -24
5269b4m1k9J79J23k79J04j46j48J55K6n9P6J68j45o6J80K17j06j65N3k55J49p
$$ -24 -65 -94 85 208 -71 33 -113 -261 -106 -80 -139 -63 105 -40 -106 74 291 185 20 73 -182 -33 -40
5292d0O4J85k7j90n6L5P4m5o8j4K44l14K61j67Q8J02k11n4J76l10K21N0J30j35
$$ -40 24 209 182 -8 -64 -29 45 0 -68 -82 162 -152 109 -58 30 132 -79 -133 43 -267 -46 4 134 -1
5316aM6KJ94k94k14oL9K99j93J49k0LJ94j36j5K03j36J29j34M7n4k51R3qj63M41
$$ -1 45 47 241 -53 -267 -273 -234 65 -128 21 1 4 198 62 47 250 114 243 109 156 102 -149 -56 -64 -227 214
5342B14j40j01L1r1j53K35k7k16L21o0r1N2M0j19J99j22J83j64r6Q4J29Mk08R6
$$ 214 74 -27 4 -87 -240 -5 -32 -248 73 13 -78 -26 14 -105 94 -28 155 -9 -105 -21 108 112 -96 0
5366@L1j29J56o4j5L6J77j36j03o5J09k31J90K14j65r3j89J76N5J5k09K52k26
$$ 0 31 -98 58 -6 -21 15 192 56 -47 -112 -3 -234 -44 170 5 -88 -277 -101 -46 -31 -240 12 -214
5389b14J47J55Q9m4l36Q1K38m61K14K85j87L03r5j09k1j9j44J50j17J00K2j95
$$ -214 -67 88 177 133 -203 -122 116 -345 -131 154 -33 270 175 66 45 26 -118 32 -85 15 37 -158
5411a58M8K16l5o8k35K64j8N9j07J76j0k52K50r7k09K50k82K17M3P2k43J62J28
$$ -158 -110 106 71 3 -232 32 14 73 -34 142 132 -120 130 33 -176 74 -208 9 52 124 -119 43 171
5434A71l34J21K95k95J06k52QM05k09k40L64k31L0J55k29M29k78J58j06n0K12
$$ 171 -163 -42 253 -42 64 -188 -180 225 16 -224 140 -91 -61 94 -135 294 16 174 68 18 230
5455B30j64l63N18n35L49l49L01RJ3n2R8j90K51k24M6o9k32K42n5K87k10M39k07
$$ 230 66 -297 221 -314 35 -314 -13 -4 9 -43 55 -135 116 -108 -62 -131 -363 -121 -176 111 -99 340 133
5478A33j41k10J21J60J22j3J24m36M2K97l03j76K43K79l29j12J85O4p3K13J51
$$ 133 -8 -218 -97 63 185 172 296 -140 -98 199 -104 -280 -37 242 -87 -199 -14 50 -23 190 341
5499C41k66m9p3m16R6J2J84K76l29K55%k11K3j7K12k69L45j00r4P2Q4k45J68q8
$$ 341 75 26 -47 -463 -367 -355 -171 105 -224 31 31 -180 -157 -174 38 -231 114 14 -80 -8 76 -169 -1 -89
5523h9k9K9j57L14l65J84J20K14m90J97Q1P1j26k09L83%n5k17L5J97J04m98M85
$$ -89 -118 -89 -246 68 -297 -113 7 221 -269 -72 9 80 -46 -255 128 128 73 -144 -109 88 192 -306 179
5546A79j36J64k10j8n6J13j36J92RO2l34J51N6l8j57K02J42k06J22j01j12K37
$$ 179 43 207 -3 -21 -77 36 -100 92 101 163 -171 -20 36 -2 -159 43 185 -21 101 0 -112 125
5568A25j02k9k22M49k81J47j24O6k63L97l56P7O5r1L82j40K9J26j26R5l63K41
$$ 125 23 -6 -228 221 -60 87 -37 29 -234 163 -193 -116 -51 -142 240 100 129 255 129 224 -139 102
5590A02K29m54L59n24M77J0m5r6pj78K27k18Q6L01n16L27m6J93j50j12J46j70
$$ 102 331 -123 236 -288 189 199 154 58 51 -127 100 -118 -32 269 -247 80 34 227 77 -35 111 -59
5612e9m1K04j43O2l70M39m94M43j6l3q9j13J65K50j40o3Rj68K72k7k27L36k14
$$ -59 -100 104 -39 23 -347 92 -402 41 25 -8 -97 -210 -45 205 65 2 11 -157 115 88 -139 197 -17
5635a7j4J02l1k0J35j42j18J61lK42l40l62M51pN5q1K24l92O4K37k31K04j62j42
$$ -17 -31 71 40 20 155 13 -105 56 53 295 -45 -407 44 37 92 11 235 -157 -93 144 -87 117 -45 -187
5659a87Q0K59j94L43n43R7K21q4n9J63k23J59J25M8k83P4P8J29k02K04n01M45
$$ -187 -107 152 -42 301 -242 -145 76 -8 -67 96 -127 32 157 205 -78 -4 74 203 1 205 -296 149
5681A49k27K9n0J65q7M57o23J04K3m4Q9m5J56k57k48N01O5l11m5M36n2l30J40
$$ 149 -78 -49 -99 66 -21 436 -187 -83 -60 -104 -15 -60 96 -161 -409 92 157 -154 -199 237 185 -145 -5
5704eJ95j29Q2j64J33J01l20J00l1l8O2J51J9k32Q2K7Jq5m4q1J20J1R6k12K94
$$ -5 190 61 143 -21 112 213 -107 -7 -38 -76 -14 137 156 -76 6 33 34 -51 -95 -176 -56 -45 51 -161 133
5729A33ml60L15k18J61J8J23k91J06K21j74k09N10l90n9L18N9j30j24k77L21J6
$$ 133 129 -231 84 -134 27 45 168 -123 -17 204 30 -179 331 -59 -118 200 259 129 5 -272 49 65
5751F5j13R1j08L26m68L80l05J39k54J79k7J84j62%J77m03L36j30L28k17k04J31
$$ 65 -48 43 -65 261 -207 173 -132 7 -247 -68 -95 89 -73 -73 104 -299 37 -93 235 18 -186 -55
5773e5j03K0O0K12j11j61J23Q9J14k51n9L02n19K20L02j57M6n8R2j07j25r3J75
$$ -55 -158 -138 -78 134 23 -138 -15 74 188 -63 -122 180 -339 -119 183 26 72 14 106 -1 -126 -219 -44
5796d4o9O89o41k71J59J36K77n1j61K34j12j43J18l29K81J55k50n4k7j82K18J28
$$ -44 -113 576 -65 -336 -177 -41 236 185 24 258 146 3 121 -208 73 228 -22 -76 -103 -285 -67 61
5818F1k02J29J23l32L45k27J33OL2J26j49J43l43L71j17j43j9J07J43j57K4j7
$$ 61 -141 -12 111 -221 124 -103 30 36 68 194 45 188 -155 216 99 -44 -63 44 187 30 54 37
5840C7l4k51M42Q5p2j02l04J06K26k30K00J75k02j22J54k54J93j14kK04m3P5p9
$$ 37 3 -248 194 279 207 105 -199 -93 133 -97 103 278 76 -46 108 -146 47 -67 -69 135 92 167 88
5863H8l6R6k42k94K10L31p1Np9j06K03j48L33l09j8j41J61R8j8Q1j10K9n8R1q3
$$ 88 52 148 -94 -388 -178 153 82 87 8 -98 105 -43 290 -19 -37 -178 -17 81 63 144 34 63 5 96 13
5888A3o4j25M36k94j27K72n0j81K04j96J13P0j4l49N61k26j09L4j79L41q2r1R2
$$ 13 -51 -176 260 -34 -161 111 61 -120 84 -112 1 71 57 -292 269 43 -66 -32 -211 130 48 -43 49
5911D9j6jK53k79k02J32O5j58L07l86K64Jl1j42J81j09J00J42q3mj82J05L01o4
$$ 49 33 32 285 6 -196 -64 1 -157 150 -236 28 29 -2 -144 37 -72 28 170 87 83 -99 6 307 243
5935B43k02P0k27K10j53O5j18O9J25k06L1Jj34K11J04qJ2k8J56j86j5k65J84J04
$$ 243 41 111 -116 94 -59 6 -112 -43 82 -124 -93 -92 -226 -15 89 81 93 65 221 35 20 -245 -61 43
5959D3P2p1j04J68k81J50Q1p9J41J01J43k01k84K45rR8K6k91j10P8J82m34M62
$$ 43 115 44 -60 108 -173 -23 58 -21 120 221 364 163 -121 124 115 213 239 -52 -162 -84 98 -336 126
5982A26J04j63Oj31j30K70j83K09j28q2Q7p1J60O5l17L57o5L4q3k70J78j06J58
$$ 126 230 67 73 -58 -188 82 -101 108 -20 -102 -15 -86 74 139 -178 179 114 148 65 -205 -27 -133 25
6005B5k06M66l56J00j14L52k26q8K19o4k12K26J2j23k46L11P8m69K58r6N6J95
$$ 25 -181 285 -71 29 -85 267 41 -47 172 108 -104 122 134 11 -235 76 154 -315 -57 -153 -97 98
6027I8n6j04m7L0K10l94J94K90Np6j73j59J38j27J13l9K68j80J45n1J50l28j97
$$ 98 42 -62 -109 -79 131 -263 -69 221 226 150 -23 -182 -44 -171 -58 -97 171 -9 136 85 235 -93 -290
6050b90J72Q1k9n8j71J70L08k20J69lj22O7l20L07j2k40K32j97L3j16J28M5J62
$$ -290 -118 -37 -66 -124 -295 -125 183 -37 132 129 7 74 -246 61 49 -191 41 -156 -123 -239 -111 -66 96
6073I6l1j45N8l6j60J03q0L9J81k33K97J2o0J72j4l19J55J10k98r5M37l45K84
$$ 96 65 -80 -22 -58 -218 -115 -195 -156 25 -208 89 101 41 213 199 -120 35 145 -153 -248 189 -156 128
6096A28j98J20j36L59j88L7O6k38J73l04M31m02J85n2N9k25J97J97m38K78P3k57
$$ 128 -70 50 -86 273 85 122 188 -50 123 -181 250 -152 33 -19 40 -185 12 209 -229 49 122 -135
6118a35J55k92K20P0j57L20k33N4l9l0J06p8L06j51j66J50n7N8j09j20K70k44
$$ -135 20 -272 -52 18 -139 181 -52 2 -37 -67 39 -39 267 116 -50 100 43 101 -8 -128 142 -102
6140a02l4J4j24K99n6J47m8o9p0J52PJ59l81%N5J52J02l90J38m0M3j06L20L2m36
$$ -102 -136 -122 -246 53 -3 144 96 27 -43 109 116 275 -106 -106 -51 101 203 -187 -49 -89 -46 -152 168 200 -236
6165b36M89l51j13J80P5K70k32l29J95M1N0Mj81J50k56K46O3j68J51l6j74J93
$$ -236 253 -98 -211 -31 44 314 82 -247 -52 -11 39 43 -138 12 -244 2 65 -103 48 12 -162 31
6187C1L2k2j10O9K67k80K01k57K11r1k4J33k63K48m01M07m33J82Q6l0K34r8j86
$$ 31 63 41 -69 0 267 -13 188 -69 142 51 27 160 -103 145 -256 151 -282 -100 -14 -44 190 92 -94
6210i4O1p8K94k1Rj6M5l63R0j5K51Q8m65K30M5K67l27J21J13p2l95N5N4J99N2
$$ -94 -33 -111 183 162 171 155 200 -163 -73 -88 163 251 -214 16 61 328 1 122 235 163 -232 -177 -123 76 128
6235A28k05R3j47K28j85J58j16j25K72k31K1n5jL7L41m11K6K41j62J06q8J72k90
$$ 128 -77 16 -131 97 -88 70 -46 -171 101 -130 -109 -164 -165 -128 213 -198 -172 69 -93 13 -75 97 -193
6258a93J24K58k21o4K41o1r2K01k16K13l23L48k92l9q9K01o5J81l09J30K37j65
$$ -193 -69 189 -32 -96 145 84 -8 193 -23 190 -133 215 -77 -116 -205 -4 -69 112 -197 -67 170 5
6280Ej01P5N7J94k06K0Jj58K39J16p4J53m9l77M6P5J91k35M7r3R6J89j71j93J50
$$ 5 -96 -21 36 230 24 44 45 -113 126 242 168 321 272 -105 -59 16 207 -28 19 -74 22 211 40 -153 -3
6305cL0nN9j6k73L07j12R2l17K04jj12N8J3m1K08k21j2J69j10J55K25l02O7j93
$$ -3 27 22 81 65 -208 99 -13 79 -238 -34 -35 -147 -89 -76 -117 91 -130 -142 27 -83 72 297 -5 62 -131
6330a31J10J61l1j97J20J19k22J06j70J72L35n89j09RM05j44j23L83Q7k06r0q3
$$ -131 -21 140 109 -88 32 151 -71 35 -135 37 372 -217 -326 -317 88 -56 -179 204 291 85 -5 -88
6352h8j38M10j85q8K49k23K16Ml02N4K24k10n9J63k04J4J85nm5L1j08J62j50J00
$$ -88 -226 184 -1 -89 160 -63 153 157 -145 -91 133 -77 -136 27 -177 -163 22 17 -28 3 -105 57 -93 7
6376Gp5K65J4l95J81J8J20l20M28k55O9M8j02N0k0O1j63L1J3J07Oj76mJ80k80
$$ 7 -68 197 211 -184 -3 15 135 -185 243 -12 57 105 3 53 33 94 -69 -38 -25 82 88 -88 -92 88 -192
6401a92L56k38j61K44j85L99j37j81p4L35k72J36k17J06M8J77o2L7k12Q6p1Q9
$$ -192 164 -74 -235 9 -176 223 86 -95 -169 166 -106 30 -187 -81 -33 144 82 119 -93 -7 -78 11
6423A1K5j80K10k48q4K13J52q2Q2k26K59j31j55K25j86K15j37L29l04J28oj95
$$ 11 36 -144 66 -182 -266 -53 99 17 99 -127 132 1 -154 71 -115 100 -37 292 -12 116 110 -85
6445h5KM19j99k78J31j82R5O9PJ50k62J44l3J89l91J85K2j79J42K84k46K64j86
$$ -85 -83 336 137 -141 -10 -192 -97 -28 -21 129 -133 11 -22 167 -224 -39 -17 -196 -54 230 -16 248 62
6468F2j07J96K1l57L83K6k03J64l2j78M0j6r9K36k02J72l42M81k76J57k72L97
$$ 62 -45 151 172 -185 198 224 21 185 153 -25 15 -1 -100 136 -66 106 -236 245 -31 126 -146 251
6490B51k49J47p1l90M08j15l71M45k98%M29k64J24j15j36K01j03J47pl0M4l39
$$ 251 2 149 78 -312 96 -19 -390 55 -243 -243 186 -78 46 -69 -205 -4 -107 40 33 3 47 -292
6512b92O05o05K25J97j47P5M1j73pM02j74j81J59j47J4L46j79j14j11M01o64M68
$$ -292 313 -292 -67 130 -17 58 99 -74 -81 321 147 -34 125 -22 -8 338 159 45 -66 335 -329 139
6534A39k42J51r5R4j39K80k35Ql8K82m07l2L47R2k81K81q5k43J0K55j00j64K25
$$ 139 -103 48 -47 47 -92 188 -47 -39 -77 205 -202 -234 113 205 -76 205 120 -123 -113 142 42 -122 103
6557A03j67K24m13K42Q8r3K95l09K77q9m92J00qJ65K94k64j89N74o6p1j79Oj24
$$ 103 -64 160 -253 -11 77 -16 279 -30 247 158 -334 -234 -242 -77 217 -47 -236 338 272 201 22 28 -96
6580i6J5K6K38k67J17j10k3J07n6j43K94j88q6k2J59K06k60J15P7k90J04O8l5
$$ -96 -81 -55 183 -84 33 -77 -100 7 -49 -192 102 -86 -172 -194 -35 171 -89 26 103 -187 -83 -15 -50
6603e0j65K15k12K83J71k46j27m5m6M7K38J63k67j89K54p4k6N6P0k13R2j76J30
$$ -50 -215 0 -212 71 242 -4 -131 -176 -222 -175 63 226 -41 -230 24 -50 -76 -20 50 -163 -71 -247 -117
6626a17O1L40m32L94r3n10L27n7k04J97J07j7r0n2J4N7Q7k32Q1K93j09j4R1k16
$$ -117 -56 284 -148 246 153 -357 -30 -87 -291 -94 13 -4 -94 -146 -132 -75 12 -220 -139 154 45 31 122 -94
6650i4j57J07J01mM02l92P9l0L24k41l19M06k69L19k53J43k56J20p6oJ83j46j30
$$ -94 -251 -144 -43 -47 355 -37 42 12 336 95 -224 182 -87 232 -21 122 -134 -14 -90 -96 87 -59 -189
6673a89M17l45K24k28OK92J9k07J87Pq0k45J68Lj11j78L90o2J94k81m1QJ1j60
$$ -189 228 -117 107 -121 -115 177 196 -11 176 183 103 -142 26 29 -82 -260 130 68 262 -19 -60 -52 -41 -201
6697b01J98j9l6J16R5j28r5J87j95J3R9l45M20J60m16LJ67M7q3j55K04M9K7Pl49
$$ -201 -3 -22 -58 58 153 25 -70 117 -78 -65 34 -311 109 269 -147 -144 23 70 -13 -168 36 85 112 119 -230
6722b30J74K1J62r7j57R0j84L75k54J41j2J28q1j42o2J50K11j86p7Q3l1q8J27
$$ -230 -56 -35 127 30 -127 -37 -221 154 -100 41 29 157 76 -66 -128 22 233 47 -30 53 22 -66 61
6745F1r5q8R1r0j17L58j45k17L29k21P4p0K56k31K18M6q4J44J1j46j66oJ67j39
$$ 61 -34 -122 -31 -121 -238 120 -25 -242 87 -134 -60 -130 126 -105 113 159 75 219 230 84 -82 -88 79 -60
6769f0j5P3m4n5N5Q7K3k99J72J23L0j88Nj19M62j26r1nj21J60r7k0R3j08j2j91
$$ -60 -75 -2 -46 -101 -46 41 64 -235 -63 60 90 -98 -93 -212 250 124 33 28 -93 67 -30 -50 43 -65 -77 -268
6795b68L55j61n0j6K83j99r2J16m7J32j05P6j42O7J63K5k04L00k07j21J08n9j05
$$ -268 87 -74 -124 -140 143 -56 -148 -32 -79 53 -52 24 -118 -51 112 137 -67 233 26 -95 13 -46 -151
6818a51N6J13K04l41M1J64l41K70J35m75M77k9L5j84k3K4j39M5m5L44o2k26J1
$$ -151 -95 18 222 -119 -78 86 -255 15 150 -325 152 123 158 -26 -49 -25 -164 -119 -164 180 118 -108 -97
6841i7j72P5K03k93M10j10K07l46P7l0l3K36j83J26j00L03l35j62L00k48L40j92
$$ -97 -269 -194 9 -284 126 16 223 -123 -46 -76 -109 127 -56 70 -30 273 -62 -224 76 -172 168 -24
6863b4q7N1O0O2K25l04o6L31k60j63J71J01j15p4J03q5r2J08K26j03j75J36J80
$$ -24 -111 -60 0 62 287 -17 -83 248 -12 -175 -4 97 -18 -92 11 -74 -166 -58 168 65 -110 26 206
6886B06o0k70m1M77m38J55J2k8P9k60J97k0P3k03K57J03k50K02r4k7j42K34k4
$$ 206 146 -124 -165 312 -126 29 41 13 92 -168 29 9 82 -121 136 239 -11 191 97 70 -72 162 138
6909A38j92j2oJ91j33R6k69J55L7J26j66K48l08K35j32l09M40K0j97K95l87P1
$$ 138 -54 -66 -72 119 -14 82 -187 -32 5 131 -35 213 -95 140 8 -301 139 159 -38 257 -130 -59
6931e9J36j10N3j58P9l7K9l1k85K85M50j30k03k48m8L21l9j33L49m44J92n4J8
$$ -59 77 -33 20 -138 -59 -96 -67 -98 -383 -98 352 222 19 -229 -277 44 5 -128 221 -223 -31 -85 -67
6954f7O1OKr3l1J96J48j0k6j29k31M47m03L22l50L8Q2j85K49j07J12l24K42j18
$$ -67 -6 0 2 -91 -122 74 222 212 186 57 -174 273 -130 192 -158 -120 -38 -223 26 -81 31 -293 -51 -169
6978a69Q1J24j7j12m0L19J11k53J46Q8l01J0k24O45k57n0o7j76n8J50J93N5k89
$$ -169 -88 36 19 -93 -133 186 297 44 190 278 -23 -13 -237 408 151 101 34 -142 -200 -50 143 198 -91
7001i1J12J6j13N4J25N2l20J57k0J42j7k7k73P9J58q9j6K23j81m3K03l00K57J0
$$ -91 21 37 -76 -22 103 155 -165 -8 -28 114 97 70 -203 -124 34 -55 -71 152 -29 -72 131 -169 88 98
7025I8j55K5r7J34p8N9J48j36Qjk9M07n90M7J90r6l1K2J69j09L11m92l5L17L87
$$ 98 -57 -32 -129 5 -73 -14 134 -2 6 5 -24 383 -207 -160 30 -66 -97 -75 94 -15 296 -196 -231 86 473
7050D73m68j22L16k75K3j97L32l6j13j85L77j33k36M6K54j56J46j1J80k64J58
$$ 473 5 -117 199 -76 -53 -250 82 46 -67 -252 125 -8 -244 -198 56 -100 46 35 215 -49 109
7071A09j23j48J41N6k45O7L17k22j29K23J27l75J57k4M6k29K78j08K2L85m91J06
$$ 109 -14 -162 -21 35 -210 -143 174 -48 -177 46 173 -202 -45 -69 -23 -252 26 -82 -60 325 -166 -60
7093f0j8J41p4p9K03l93K77O8P3l01n6K69j63J35n2j01K41JPj69j29N27J29l76
$$ -60 -78 63 -11 -90 113 -280 -3 65 138 -163 -219 50 -113 22 -30 -131 110 111 118 -51 -180 347 476 100
7117A00l47M31l45p7M08k75J33J11j35K27n07N29o2l45M5K28j17M9o0l04K41p7
$$ 100 -247 184 -161 -238 170 -105 28 139 4 231 -276 253 191 -154 -109 119 2 51 -9 -313 -72 -149
7139a49K64j75L00k22Q1j51j74o9J74K18j08K7m1j54Q1K68m6k60J42R9L30m31
$$ -149 115 -60 240 18 99 -52 -226 -295 -121 97 -11 16 -25 -179 -98 170 124 -136 6 105 435 4
7161Dp8r0K42J52j56j0p4j82K72m04N7L48j56pk6mk14N29n2j46N3n4j74J17K89
$$ 4 -74 -164 78 230 74 64 -10 -192 80 -324 -267 81 -75 -82 -108 -112 -326 203 151 5 58 4 -170 -53 236
7186B36j34l53K44j3m5O5N4k49O0J61m1J40j10L8M7Q1k73P9n3L8j38L2K6j4L85
$$ 236 102 -251 -7 -20 -65 0 54 -195 -135 26 -15 125 15 53 100 181 -92 -13 -66 -28 -166 -134 -108 -122 263
7211B63jk83j16K92L3q8J12l31K31l22K35k61K71mk98J30J52Mm8NQj18K69j55
$$ 263 262 -21 -137 155 188 100 212 -119 112 -210 25 -236 35 31 -267 -137 15 19 -29 -24 -16 -134 135 -20
7235b0j79J83j79K24k3J19l76N12m70K62m6J79j83j69J42k15J74j11K19J49n1
$$ -20 -199 -16 -195 29 6 125 -251 261 -209 53 7 186 3 -166 -24 -239 -65 -176 43 192 141
7256A41k03R1n4k15N04l28O4k8m6J0N2m9qn2K76m51L39L00l91N7Q6l20M25j22
$$ 141 -62 29 -25 -240 264 -64 0 -28 -74 -64 -12 -61 -69 -121 155 -296 43 343 -48 9 95 -225 200 78
7280G8k39K13k51L44j18Nk93J45K15L6j84J97j23J72o9j02Rj03Q0J7Jj81L7N5
$$ 78 -161 52 -199 145 27 32 -261 -116 99 135 -49 148 25 197 128 26 35 -68 12 29 30 -151 -114 -59
7304e9P9J36p3l52Q8K90o4j24N3k8J49l2l67M81Qj72M6j98j01J62j23K29M31k06
$$ -59 20 156 83 -269 -181 109 45 -79 -26 -54 95 63 -304 177 185 13 59 -139 -240 -78 -201 28 459 253
7328B53k19j08PJ08K71l97J25J72j04M3r2j07p1J32l14K60L5O7q6J10l00K36l59
$$ 253 34 -74 -67 41 312 -85 40 212 108 151 59 -48 -119 13 -301 -41 -6 61 -25 85 -215 21 -338
7351c38K33K7KK45k81K68k06k8O7K54l01R2j92Q3K35J14k66J66k50j3N3J24j86
$$ -338 -105 -78 -76 169 -112 156 -50 -78 -11 243 -58 34 -158 -75 160 274 8 174 -76 -89 -36 88 -98
7374i8J98k53M19k49q2J62k39J43K00Q3l61L9O7m0Q7o3j47L14J2j91J24j64j23
$$ -98 100 -153 266 17 -65 97 -142 1 201 284 -77 -38 29 -11 76 13 -134 180 192 1 125 -39 -162
7397a62K99k79K29Jj63j67Q0L10J34m64J40k2o2K09j00J84p1l7p7q1M27l81J84
$$ -162 137 -142 87 88 -75 -242 -162 148 282 -182 -42 -64 -126 83 -17 167 96 59 -18 -99 328 -53 131
7420A31N6j50k63J56K74j48J23j07r6K45nl26L49j45j41m9k77L69k13j41N10O8
$$ 131 187 37 -226 -70 204 56 179 72 -24 221 216 -110 239 94 -47 -96 -373 -4 -217 -358 152 220
7442B20m15K66R4j86j07L6J0K51k90M07j33q9qP9Q3k06q1qK70o9kk25K4q0l4K16
$$ 220 -195 71 165 -21 -128 -92 -82 169 -121 286 153 64 56 135 218 12 -69 -77 193 124 122 -103 -79 -159 -193 23
7468B3K32k43j17J97j36J8j71J94j86O2J83N6j50J39l86J26J78o4K06j0k67K1
$$ 23 255 12 -105 92 -44 -26 -197 -3 -189 -127 56 112 -38 101 -285 -159 19 -45 161 151 -116 -95
7490i5J11r3j0K00k6L7J30n8k58K34j44L53j13k53N9k33J23j41M69l85K03m41
$$ -95 16 -77 -87 113 87 124 254 196 -62 172 28 381 268 15 74 -159 -36 -177 292 -93 110 -331
7512c31K92p2J41M1P8LR6q8k49K86n22K81k2K8P6j66J14o2j02N0Q4j17L33l7m12
$$ -331 -39 -111 30 71 149 152 248 160 -89 197 -325 -44 -66 -38 38 -128 -14 -76 -178 -128 -44 -161 172 135 -277
7537b77L07n3L8L3L2k14K32N5p3k35K7M39k37k66K25O0K9m38J99Q4j97K64J70
$$ -277 30 -23 15 48 80 -134 98 153 80 -155 -128 311 74 -192 33 93 122 -316 -117 -33 -230 34 204
7560B04p5p4J03j97J08k07L24J18n66O22l64j43J33k14N41l14p7L2K03j51k8K86
$$ 204 129 55 158 -39 69 -138 186 304 -262 360 -4 -147 -14 -228 313 -1 -78 -46 157 6 -22 264
7582B64j19j11K28l5l69Lj4J33J97l5l25K19K7O2k66L66J5j47L4p8p2n3P0J19
$$ 264 145 34 262 227 -142 -139 -153 -20 177 142 -183 36 63 125 -141 225 240 93 127 49 -23 -76 -6 113
7606A13j51J12N5k90k3J67N8R5l3m0o0M4n09M60M1k96M51j98L9O8r3J12j80K75
$$ 113 -38 74 129 -161 -184 -17 41 136 103 63 3 47 -462 -2 39 -257 194 -4 35 103 10 122 -58 217
7630B17j23j48L55l78N1j0l1L1Q4J88j82j09J68k73K12J01j31k17J00P3q8R2m9
$$ 217 94 -54 301 -77 -26 -36 -67 -36 48 236 54 -55 113 -160 52 153 22 -195 -95 -22 -110 -18 -67
7653f7K65q3j73j28J35M4l27M38K7m9k23j58M49l96J69q5L11j24j17j52O0J23
$$ -67 198 115 -58 -186 -51 -7 -334 104 131 82 -141 -299 150 -246 -77 -162 149 25 -92 -244 -184 -61
7675f1J36k43M38J69o07K32k4j52O7J70l66L66k36j6J18N3L9p5J68j39J35n1l8
$$ -61 75 -168 270 439 -168 64 40 -112 -45 125 -241 125 -111 -127 -9 44 83 8 176 37 172 121 83
7698H3O6q4J16j44N4k43O9K12m7l04n6M84k16J14l07L91m5j98o6L55k46K3jJ01
$$ 83 149 65 181 37 91 -152 -83 129 82 -222 -278 206 -10 104 -203 188 143 -55 -121 234 -12 11 10 111
7722A11j36J54j36k19R8K30l05L13P6l34L21j94J19l72L46j18k54J54J24q5l1
$$ 111 -25 129 -7 -226 -128 102 -203 110 186 -148 173 -21 98 -274 72 -46 -300 -146 -22 -107 -138
7743a38M31l11k34m2J95j8K24J59j50j35L93k73N9l48K20j26K73O7k28q0J48r5
$$ -138 293 -18 -252 -294 -99 -117 107 266 116 -19 374 101 160 -188 32 -94 179 246 18 -62 86 -9
7765ij3J46j98J39l11M08M0m11L1K68k26K08o4p2K79m12P9J08p6J01j04K40k22
$$ -9 -22 124 -74 65 -246 162 202 -209 -178 90 -136 72 8 -64 215 -197 -118 -10 -86 15 -89 151 -71
7788g1L43j93J7k34q5K64l02L75m02M18k0J9Qk32J58K57m09j98L52m7j5%j48N3
$$ -71 272 79 96 -138 -223 41 -261 114 -288 130 110 129 137 -95 63 320 -89 -287 65 18 3 3 -145 -92
7812i2k06M21m29L60j1r6o1R5j60K86n00M08j15L3J41J18Ol62N2L14k68Q9rn0
$$ -92 -298 123 -306 54 43 -53 -114 -19 -179 107 -393 15 -100 -67 74 192 198 -164 -112 202 -66 23 14 -36
7836c6J8L2k55L39Jp4m6k16K87r9m5J16p0Q9j12P3j30J34j78J30l1j05P0l2k0
$$ -36 -18 14 -241 98 99 25 -21 -237 50 -49 -94 22 -48 41 -71 2 -128 6 -172 -42 -73 -178 -108 -140 -160
7861a60PJ76j85J94j11J33j4O4K7j51j33K9K36j39J23n3J04k36J01o5j10M5M35
$$ -160 -153 23 -162 32 -79 54 40 104 131 -20 -153 -124 112 -27 96 43 147 -89 12 -53 -163 -118 317
7884C17k17j6j73qP7j2p1J12j03j34Q7J95N3r4P9K6j52Oj02J32L04m00K82j67
$$ 317 100 84 -89 -97 -20 -32 -103 9 -94 -228 -141 54 107 13 92 118 -34 -28 -130 2 306 -94 188 21
7908B1N0r8P6K4l7J97l69J84l21k3N48l72rK12o1R5l03j34K42m3J72k08M8j63
$$ 21 71 -27 49 73 36 233 -136 48 -273 -296 252 -120 -129 83 22 117 -186 -320 -78 -121 51 -157 -109 -272
7932b72L44k39L85l49K08k17J13O0j18J71k53K14O7q4J17j51N8J47o09L58P0k1
$$ -272 72 -167 218 -131 77 -140 -27 33 -85 86 -167 47 114 30 147 -4 54 201 -408 -50 20 -1
7954ar5J94l4L4k89M53k59j79K56Qj4k94K42j51J51j91K19k67n6J54P8%J83k19
$$ -1 -96 98 64 98 -191 262 3 -176 80 88 74 -220 22 -129 22 -169 50 -217 -273 -119 -41 -41 142 -77
7978g7NM11k08j30J69k55Q0P3j44p1L31k44M4j63N1J87j17N3j09NR8K51l22K23
$$ -77 -72 339 131 1 170 -85 -5 68 -76 -147 184 -60 -16 -179 -128 59 -58 -5 -114 -109 -11 240 -82 141
8002A41k2J08l54J15K66l44K6K52m40L49l98J77J24J02L2j40j01K51P0l16K71
$$ 141 119 227 -127 -12 254 -90 -64 188 -252 97 -301 -124 0 102 134 -6 -107 144 214 -102 169
8023A69j88k39K41j45J43J9J63k28K01j19J11l27J06K19j65o5J04L1L7l68O30
$$ 169 -19 -258 -17 -162 -19 0 163 -65 136 17 128 -199 -93 126 -39 -104 0 31 68 -300 330
8044C30l26j82K37J86l54O4j43N6K95r5J57k55o1J63k56L06k55J09n2k30K60K43
$$ 330 4 -178 59 245 -109 -45 -188 -132 163 68 225 -30 -91 72 -184 122 -133 -24 -76 -306 -46 197
8066A97k41J75mQ4j60kr8lO9l14J98q3M75k36K99k70j44R6j61J9N1N5l0k5J99
$$ 197 -44 131 127 211 51 49 -49 -52 17 -297 -99 -182 293 57 356 86 -58 38 -123 -104 -53 2 -28 -53 146
8091A46J45j13k87P1L91l38l32Q2K36k4K54k14j39J53k46K93J18m22O2N18k03
$$ 146 291 178 -109 -38 353 15 -317 -235 1 -23 231 17 -122 31 -215 78 196 -226 -164 354 151
8112A51J07j04M0l13N8P7L09l33p8j7K28J27k64J26J75k85k09L9J59k4J91n8j99
$$ 151 258 154 194 -119 -61 16 325 -8 -86 -103 125 252 -12 114 289 4 -205 -166 -7 -31 160 102 -97
8135i7L11k16j15L56j89K9m9r6j95J55JM7L23l63j50J31k14J46J78L8o8R1Q4j45
$$ -97 214 -2 -117 239 50 79 30 -66 -261 -106 -105 -58 265 -98 -248 -117 -331 -185 -7 31 -37 54 138 -7
8159gJ48k91Q4l5L7L1j76rL79L2Qk17m6K84j06K45l37K6j49M20l28j44rJ10l1
$$ -7 141 -150 -66 -101 -64 -33 -209 -218 161 193 201 -16 -62 222 116 361 24 50 -99 321 -7 -151 -160 -50 -81
8184h1k00K89j29J93J48j95p
$$ -81 -281 8 -121 72 220 25 18
8191A8
$$ Imaginary data points
##PAGE= N=2
##DATA TABLE= (X++(I..I)), XYDATA
0@%%%%%%%%%%%%qJ6j6J6k4L2l2M0n6O4p2Q8j04J20j37J61j89K15k45K83l21L62
$$ 0 0 0 0 0 0 0 0 0 0 0 0 0 -8 8 -8 8 -16 16 -16 24 -32 32 -40 48 -56 64 -73 88 -101 114 -131 152 -169 193
34A93m10M62n20N83o53P30q12R02j001J108j227J357j498J652j820K006k211K436
$$ 193 -217 245 -275 308 -345 385 -427 475 -526 582 -645 712 -786 866 -954 1052 -1159 1277
52A277k682K957l267L613m006M456m975N584o310P190q284R690j1570J4221j8267
$$ 1277 -1405 1552 -1715 1898 -2108 2348 -2627 2957 -3353 3837 -4447 5243 -6327 7894 -10373
67a0373K5266m0711J36899l0395j43393J22004j28633M0953P0191l7254M2260
$$ -10373 14893 -25818 111081 80686 -62707 59297 -69336 -28383 41808 4554 46814
78D6814K5508p9665L1721j7499o0064P2006l699j8873M6914m2381J3853j7492
$$ 46814 72322 -7343 24378 6879 -53185 18821 15122 -3751 43163 782 14635 -2857
90b857j1901J7020r861J0309j6637J5725l391j8786K6553k2097L985Q137q512
$$ -2857 -14758 2262 -7599 2710 -13927 1798 -1593 -20379 6174 -15923 -11938 -3801 -12313
103a2313j001P160j0200M578K3421m6017K4749P530l8952N5492l2998l082M0733
$$ -12313 -13314 -6154 -16354 -11776 11645 -34372 -9623 -2093 -41045 14447 -18551 -21633 19100
116A9100l9109R731P895j6701J1730J5813j7464R255M583k6223L6532k5967o635
$$ 19100 -20009 -10278 -2383 -19084 -7354 8459 -9005 250 4833 -21390 15142 -10825 -17460
129a7460M1788l2630J2545K936p048R413q134M936m83Q142j4632J0421K687k4849
$$ -17460 24328 -8302 4243 7179 131 9544 1410 6346 5863 14005 -627 9794 12481 -12368
143a2368K9758m481q662K590k2O583j1289Q020q424J2444m291j2385K3614k7871
$$ -12368 17390 12909 4247 6837 6815 13398 2109 10129 1705 14149 9858 -2527 21087 -6784
157f784Q350J1391j7981J0726n789L958k89l438o113J1441L935k3767K4611j3802
$$ -6784 1566 12957 -5024 5702 -87 3871 3582 144 -5969 5472 9407 -14360 10251 -3551
171c551p956K0286k2226J0063L69k651L424k945j067n578J6989j7265N912R085
$$ -3551 -11507 8779 -13447 -3384 -3015 -5666 -2242 -5187 -6254 -11832 5157 -12108 -6196 2889
185B889j6615J9350j4627k378J0597m685P65k718P354j0190J1940m472o880J8678
$$ 2889 -13726 5624 -9003 -11381 -784 -5469 -4704 -7422 -68 -10258 1682 -2790 -9670 9008
199I008j9906J7081L07j9558J7163k756k137l234Q304l486Q94K975j3324K0053
$$ 9008 -10898 6183 6490 -13068 4095 1339 -798 -4032 4272 786 1680 4655 -8669 11384
213A1384j2811J038J5619j9519R189K19J76m900j653J0407o861L870j1268J0687
$$ 11384 -1427 -389 15230 -4289 4900 5119 5295 395 -1258 9149 2288 6158 -5110 5577
227E577P92j3107J8427j0604K499J746l783K261p642R109m007M800q525j672J5255
$$ 5577 6369 -6738 11689 1085 3584 5330 1547 3808 -3834 5275 1268 6068 -2457 -4129 11126
242A1126k0522J0467J597n309R035p961K582m592M773k928J912K362j1674J6093
$$ 11126 -9396 1071 2668 -2641 6394 -1567 1015 -3577 1196 -1732 180 2542 -9132 6961
256F961j2874l17P768j0899J5095p053l025K595K89J68m528Q187q600R141m321
$$ 6961 -5913 -6230 1538 -9361 5734 -1319 -4344 -1749 -1460 -1292 -5820 2367 -6233 2908 -1413
271a413q311J3719j4504R654L870q887N085j215M584q635N503J35J984L748j4682
$$ -1413 -9724 3995 -10509 -855 3015 -5872 -787 -2002 2582 -6053 -550 -415 1569 5317 -9365
286i365J4675o988m218J0533p043M176k691N684m729j988M647j851R960j5613
$$ -9365 5310 -1678 -5896 4637 -2406 1770 -921 4763 34 -1954 2693 842 10802 -4811
300d811O389P468j4574Q850l425L164m70J04P28n546O114o757J0937n903o531
$$ -4811 1578 9046 -5528 3322 -103 3061 2591 2695 3423 -2123 3991 -2766 8171 2268 -4263
315d263J5612j3291K602q56j462O238m762K092m531N774n675J865N814j1930J3666
$$ -4263 11349 -1942 660 -196 -1658 4580 -182 1910 -2621 3153 -2522 -657 5157 -6773 6893
330F893o487k559M434q443P974k226j10l284L889J094p759Q521q383Q241J082
$$ 6893 406 -2153 2281 -6162 1812 -414 -524 -3808 81 1175 -6584 1937 -6446 1795 2877
345B877r089J0142q150K592M49m28o92j439P353q843M311l704J603R248j3753
$$ 2877 -6212 3930 -4220 -1628 -1179 -1607 -2299 -3738 3615 -5228 -917 -4621 -3018 6230 -7523
360g523Q822N04l886J504j584L633n551P055l358p71J052n624J2896j0491M05
$$ -7523 1299 1803 -2083 -579 -2163 1470 -4081 2974 -384 -1155 -103 -5727 7169 -3322 -2917
375b917Q486n464K658m559M649k007J348M43l049O047r956Q907j647p954J0289
$$ -2917 5569 105 2763 -1796 2853 846 2194 2637 -412 5635 -4321 4586 2939 -5015 5274
390E274l710K621l704j60K797j561K422o813Q632n183k329O498j0140P504j791
$$ 5274 1564 4185 481 321 3118 1557 3979 -2834 5798 615 -1714 4784 -5356 2148 357
405C57P3J451m345M229k961L868o209L183M019p118O241q547M876K342o757N876
$$ 357 430 1881 -2464 1765 -1196 2672 -3537 -354 3665 -3453 2788 -5759 -883 1459 -5298 578
421E78l231K641k672K755j394k979P363n897M626m701j756Q984r025K803J27K293
$$ 578 -2653 -12 -2684 71 -1323 -4302 3061 -2836 1790 -2911 -4667 4317 -4708 -1905 -1778 515
437E15r92k795N070n138M952k895K043J597p016R701n736j687K190k10L882n978
$$ 515 -477 -3272 1798 -3340 1612 -1283 760 2357 -4659 5042 -694 -2381 -191 -401 3481 -2497
453b497L487j605K985j858k781Q795r308N036K346o624L733k019L468l256J176
$$ -2497 990 -615 2370 512 -2269 6526 -2782 2254 4600 -2024 1709 -310 3158 -98 1078
468A078p21R08K752q867Q682j865k212N251p201M868j896K4O38k262J931k276
$$ 1078 357 1265 4017 -4850 3832 1967 -245 5006 -2195 2673 777 801 1439 -823 1108 -1168
484a168M988p019J994L694n385P120o587J780K979l988P32j619M689n364L422
$$ -1168 3820 -3199 -1205 2489 -2896 4224 -2363 -583 2396 -1592 -860 -2479 2210 -3154 268
499B68j95n052O678n447L847q86l205N534k086O07m652N460k37l752M295m694
$$ 268 73 -4979 1699 -3748 99 -787 -3992 1542 -544 63 -4589 871 634 -3118 1177 -3517
515c517M700l905K46M590o034N393r45n2j710K51L922m285K526l068M382k98o143
$$ -3517 1183 -2722 -2476 2114 -3920 1473 528 476 -1234 -983 2939 -1346 1180 -1888 2494 2196 -3947
532c947O806m335K031P26p83J698m010N244l009O40l55o3L908p013L771j519P29
$$ -3947 2859 -1476 555 1281 498 2196 -1814 3430 421 1061 706 643 4551 -2462 1309 -210 519
549E19J940m816M952k766J569o01j181K062l500O701n274l30K727m863N622l975
$$ 519 2459 -2357 2595 -171 1398 797 -384 1678 -1822 4879 -395 -725 2002 -2861 2761 -1214
565a214J60J602L54r80k780N404m580L241j62l147M693n009L197j211l031L568
$$ -1214 -1054 548 902 -78 -2858 2546 -2034 1207 1045 -2102 2591 -2418 779 -432 -3463 105
581A05q75J979m427K418L92n32J415m210O533l785j350L339l437K347j531K610
$$ 105 -770 1209 -3218 -800 -408 -940 475 -3735 2798 -987 -2337 1002 -2435 -88 -1619 991
597I91k856n32L842l739L688m652L321M076n766K245j057J454j761R52J467l081
$$ 991 -1865 -2397 1445 -2294 1394 -3258 63 4139 -1627 618 -439 1015 -746 206 1673 -1408
613a408L755l630K898j861j298O237n669K369r06j65K753l983J818o63K638k882
$$ -1408 2347 -1283 1615 -246 -1544 4693 -976 1393 487 322 3075 -908 910 247 2885 3
629CM4J740m721N799k741K93R06k257L715l521J549j394J045J793n321L974j893
$$ 3 47 1787 -2934 2865 124 417 1323 -934 2781 -740 809 -585 460 2253 -3068 906 -987
646i87J056n06j600L716l164K417j279n08N32j137M180m841K048o95qK114o071
$$ -987 69 -437 -2037 1679 -1485 932 -347 -855 -323 -1460 2720 -2121 -73 -768 -776 1338 -4733
663d733N483m78j496R74p81J972l216L710j944p72J958k206L793n281J537K398
$$ -4733 750 272 -1224 -250 -1031 941 -2275 1435 -509 -1281 677 -1529 2264 -3017 -1480 918
679I18j852J694l417L897j062j081J837j615K541l046K883j422j930L692k748
$$ 918 -934 760 -2657 1240 178 -903 934 -681 1860 -1186 1697 275 -1655 2037 -711
694g11K095k340R96J782k132J443k715M562j833j310K836l929L240j877L5O16
$$ -711 1384 -956 40 1822 -310 1133 -1582 2980 1147 -163 2673 -1256 1984 107 142 758
710G58j714K659j993J160k073J700J513l137K893l058K718j57l479L748k443J329
$$ 758 -956 1703 -290 870 -1203 497 2010 -1127 1766 -1292 1426 1269 -2210 1538 -905 424
726D24q19L52l30j391L063k777J903j115l3L159m728J776k64J005j063r92K890
$$ 424 -395 -43 -373 -1764 1299 -1478 425 -690 -723 2436 -2292 -516 -780 225 -838 -1830 1060
743A060l202K545j873J47J634k209L979k761m98Q40L53Q63l206L074r51M28n62
$$ 1060 -2142 403 -1470 -1323 311 -1898 2081 -680 -1178 -338 15 878 -2328 746 -205 223 -339
760c39j696L933l566K463n2j469K010j625J609j866K35J537q25R95l335L127o17
$$ -339 -2035 1898 -1668 795 743 -726 1284 -341 1268 -598 -363 1174 349 1344 -1991 1136 519
777E19q86J463k063K940k074J165l72j478K370j653J840k426N63J652k248J518
$$ 519 -367 1096 -967 1973 -101 1064 692 -786 1584 -69 1771 -655 -92 1560 -688 830
793H30k454K757K22k273J528j147K250k324J064M24j885K268k416J704j381n51
$$ 830 -1624 1133 1355 -918 610 -537 1713 -611 453 877 -1008 1260 -1156 548 -833 -1384
809a384K957k871J333j388K137q23j256J737j570K453k610P17P74k743L145j343
$$ -1384 1573 -1298 35 -1353 784 -39 -1295 442 -1128 1325 -1285 -568 206 -2537 608 -735
825g35o7o6J46J695k508J454n76J693m79k222L174k397Q29j95m12J289j599K170
$$ -735 -802 -868 -722 973 -1535 -81 -657 1036 557 -1665 1509 -888 -59 -254 -666 623 -976 1194
843A194k027O74r9M55J939l564K736k62q93Q53k054K131j011O22n82m15J556k392
$$ 1194 -833 -159 -258 197 2136 -1428 1308 1046 153 1006 -1048 1083 72 694 112 -303 1253 -1139
861a139L089j875l6J323j507J741k595J435J43l69j51j146K658k074M78L78j349
$$ -1139 1950 75 39 1362 -145 1596 -999 436 579 210 59 -1087 1571 -503 -25 353 -996
878i96K815k426J250p87o85J690j287O94k154K278j92j565J336j530K530j730
$$ -996 1819 -607 643 -144 -829 861 -426 268 -1886 392 200 -1365 -29 -1559 971 -759
894g59J42J114j377J573j708J469j329o2K143k225Q86j566J771M00k244K398j225
$$ -759 -617 497 -880 693 -1015 454 -875 -937 1206 -1019 -133 -1699 72 472 -1772 626 -599
911e99J359j125j71J276j573J808j733J014o93l38K088k290J212m95Q10K77k014
$$ -599 760 -365 -536 740 -833 975 -758 256 -437 -775 1313 -977 235 -260 550 827 -1187
928a187K125j142Q45k55n86J669k053J651j316K84L78p44J909k293J263k32J61
$$ -1187 938 -204 641 386 -200 1469 -584 1067 -249 35 413 -331 1578 -715 548 316 477
945D77M21j801K216j691J117m91j161J931j652J065o12J1K77l91J311k126J165
$$ 477 898 -903 1313 -378 739 248 -913 1018 -634 431 -181 -170 107 -284 1027 -1099 66
962F6O20o39M68j990K186r40l66L33m40J225j547J301m91l38R13r99J560k198
$$ 66 686 47 515 -1475 711 -229 -595 -262 -702 523 -1024 277 -214 -552 361 -638 922 -1276
980a276J471N53j525O89j063J926j260m23R51r62J519j521J203K7j180J873j478
$$ -1276 195 748 -777 -88 -1151 775 -485 -908 43 -919 600 -921 282 309 -871 1002 -476
997d76J217j509R90M90j544J067r61J273q71o4J229j317J907j790N28J29q91K011
$$ -476 741 -768 222 712 -832 235 -726 547 -324 -388 841 -476 1431 -359 169 298 -593 1418
1015A418j499L66q50J099J6j711J621n88P86k7j252K031j313N36j030N21L53r31
$$ 1418 -81 285 -565 534 550 -1161 460 -128 658 631 -621 1410 97 633 -397 124 477 -454
1033d54J540j712N54j74L64P42k235J971o31m9J6n02J420j127O97q56j16P62j031
$$ -454 1086 -626 -72 -246 118 860 -1375 596 -35 -84 -68 -570 850 -277 420 -436 -552 210 -821
1052h21J354j495J09J376n39Pr34J216n63J94J45r16J934j536M62O3o66R61o96
$$ -821 533 -962 -853 523 -16 -9 -943 273 -290 -96 49 -867 1067 -469 -7 56 -610 351 -345
1071c45J181j737R68M25p57P68j210J750o90p25O80j062J552j102K57L9m17R57
$$ -345 836 -901 67 492 -265 503 -707 1043 353 -372 308 -754 798 -304 -47 -8 -425 532
1089E32o29Q20r39R1J074j161N60q86R60j93q87J414j429J521j405O21N82j194
$$ 532 -97 723 -216 -125 949 -212 348 -538 422 229 -658 756 -673 848 -557 64 646 -548
1107e48J378r35O31j016M12J231k133R82n3O10n75n63J080r98J156j320J153R6
$$ -548 830 -105 526 -490 -78 1153 -980 2 -51 559 -16 -579 501 -497 659 -661 492 588
1125E88j362J291q56J18L50j66M56j747J395j21K00k78o05J547j264Q24m43l90
$$ 588 -774 517 -339 -221 129 -37 419 -1328 67 -54 146 -132 -737 810 -454 370 -73 -463
1143d63O15q30R75q42K14K17k2L29j387J740j78p23N97q08J418r78K43j11j57
$$ -463 152 -678 297 -545 -331 -114 -136 193 -1194 546 368 -355 242 -566 852 -126 117 6 -151
1162a51J064j287J040r06K6Q77p28M22r42J166k00n50M07p58J414j018j04L84
$$ -151 913 -374 666 -240 -214 663 -65 357 -585 581 381 -169 238 -520 894 -124 -228 156
1180A56n76P57o85P84m91j45R10r24M04p49J053kr96P67m35P52j122K74K42l52
$$ 156 -420 337 -348 436 -55 -200 710 -214 190 -559 494 492 -504 263 -172 580 -542 -268 -26 -378
1200c78J053j085O22q9n44J085j352O88m20P23j69j269J623p26O16n85l22P42
$$ -378 675 -410 212 123 -421 664 -688 0 -420 303 134 -1135 488 -238 378 -207 -529 213
1218B13o79R08p26M49j90K9N86j399J051k51J6J35q58R30o10M44j63l66R49r16
$$ 213 -466 442 -284 165 -25 4 590 -809 242 -9 7 142 -716 214 -396 48 -115 -481 468 -448
1238d48Q15m62K43K74r94J119o42J99K8m1j84m07J285p78K47j81k95R03r37L92
$$ -448 367 -95 148 422 -572 547 -95 104 132 91 -93 -500 785 7 254 73 -222 681 -256 136
1258A36j41J71P3k64N55j314Q76J9k54K1m25J211n63l14L85l35M04p29P86o11
$$ 136 -5 166 239 -25 530 -784 92 111 -143 -122 -547 664 101 -213 172 -163 241 -488 298 -313
1278c13K0L58p75Q13o09M26N35o31L44m79L58k07m36O02l07M03o93N00j16j73
$$ -313 -293 65 -710 103 -506 -80 455 -176 168 -311 47 -160 -596 6 -301 102 -591 -91 -207 -380
1298c80P92p01K64q8L34M0n08P09o88L70m52m02R86p98J001j036N74K98n72J090
$$ -380 412 -289 -25 -113 221 261 -247 462 -226 144 -308 -710 276 -522 479 -557 17 315 -257 833
1318H33j484P49j98K08J30o77N74k21J77m93P0P65n61L81l14Q4K18o83Q23l08
$$ 833 -651 98 -100 108 238 -439 135 -86 91 -402 -332 433 -128 253 -61 23 241 -442 381 73
1338G3J91j35k43N10j163J113l84L7k9o1Q03j019M95k80J05J7l27P27o76L31K79
$$ 73 264 129 -114 396 -767 346 -38 -1 -30 -91 712 -307 188 -92 13 30 -297 430 -246 85 364
1359C64p09M24n94Q31k85j62K81m51O49j003Q84j61m15Q09r47P77n64J34K82o49
$$ 364 -345 79 -515 316 31 -131 150 -301 348 -655 229 68 -347 462 -485 292 -272 -138 144 -505
1379e05M98m45R85o35j43M64k47J53m31J89J63q4M19q61M84k72K60K48m55L81
$$ -505 -7 -452 533 -102 -245 219 -28 125 -306 -117 46 -38 381 -480 4 -268 -8 240 -215 166
1399A66m78M67p9m18O14k92L59o27k8K49k28P19m71O2j37K47j1m24M88j0ln9l20
$$ 166 -312 155 76 -342 272 -20 339 -288 -316 -67 -295 424 -47 15 -122 125 114 -310 178 168 165 106 -214
1422b14O41o75N24n32L37M01p06N05n05K51j88l7K95l27K80q5J2k00L1L15n08
$$ -214 427 -248 276 -256 81 482 -224 281 -224 27 -161 -198 97 -230 50 -35 -23 -223 -192 123 -385
1443c85K8M71k11L50l7M7m25L45j41k97M01l95K41N1m29K40k8J81j16m2M51l53
$$ -385 -357 114 -97 253 216 263 -162 183 42 -255 146 -249 -8 43 -386 -146 -174 7 -109 -151 300 -53
1465e3N1M2L9m18N29j57m52Q59m33J1N6k67K49k36L79o05L79O6o0M85q14M50m6
$$ -53 -2 40 79 -339 190 33 -419 440 7 18 74 -193 56 -180 199 -406 -27 39 -21 464 -350 100 54
1488E4o0J20k35J87l49K15K33n06O32j84L90o59J42J30m04N08m84O17m22r7M66
$$ 54 -6 114 -121 66 -283 -68 165 -341 291 107 497 -162 -20 110 -294 214 -270 347 -75 -172 294
1509B94m83L42m43N31n0m68N49k08J31m81J61L46q59O21k9K86k82p5J13k41L71
$$ 294 -189 153 -290 241 191 -277 272 64 195 -286 -125 221 -638 -17 -46 240 -42 -117 -4 -245 126
1530A26j88K07O3l69J49l18P4J44L2K40o32O39m13K91L56o08L18m2J81o5L3nn63
$$ 126 -62 145 208 -161 -12 -330 -256 -112 -80 160 -472 167 -246 45 401 -207 111 69 250 185 218 213 -350
1553c50P01l80oK34m79O62l94j3n5J40J90m01M42n50K85L33m97K85k25L16k10
$$ -350 351 -29 -35 199 -280 382 -12 -25 -80 60 250 -151 291 -259 26 359 -138 147 -78 238 28
1574B8j41J13q2K71n27L38m0J46K26l25M0l95N9L19o2M13l78L65m86q6O09o11
$$ 28 -113 0 -82 189 -338 0 -40 106 332 7 47 -348 -289 30 -32 381 3 368 -118 -204 405 -206
1596b06N31m46K59m61K20R7p7J75j44J96J66n93L44k43L95o40L44K57j47j86L1
$$ -206 325 -121 138 -323 -103 -6 -83 92 -52 144 310 -283 61 -182 213 -427 -83 174 27 -159 -128
1617a28J51j01k3n9M48m90J8J87j79K02J71q1j39P6j88N55m14J59k42J70r2j99
$$ -128 23 -78 -101 -160 288 -202 -184 3 -176 26 197 116 -23 53 -135 420 6 165 -77 93 1 -198
1639a98J22o7L08k85J71L55n55K76k12N1J55k46J93l24K71j62L36j10k87J31L2
$$ -198 -76 -143 165 -120 51 406 -149 127 -85 -34 121 -125 68 -256 15 -147 189 79 -208 -77 -45
1660d5j71O86o39M34k67P3k75R6J49j22J50j92N06l59q5J69m57J59J02J56Q5j61
$$ -45 -216 470 -169 265 -2 71 -204 -108 41 -81 69 -123 383 24 -61 108 -349 -190 -88 68 153 -8
1682hj16O2R1k11q7P10o11J85k78J36J32j63N21p75L58l6m6J82m55M93l47K06
$$ -8 -124 -62 29 -182 -269 441 -170 15 -263 -127 5 -158 363 -412 -54 -90 -136 46 -409 84 -263 -57
1704e7N2m06N02K7M5q8J18K6M5j66k20L04j05o3J93k18L77m29P8J7K6J03J9p7
$$ -57 -5 -411 91 118 163 75 193 219 264 98 -122 182 77 14 207 -11 366 -63 15 32 58 161 180 103
1728A03j00L16k16j26L9J06j26L7r1k9Q1L7j25J08j47j11M20k00n5J02j21K62
$$ 103 3 319 103 -23 16 122 -4 33 -58 -87 -6 31 -94 14 -133 -244 176 -24 -79 23 -98 164
1750A64j44j98J09o5r7P5J67k41M18j57j18K17p7J31j19q5K63k16j19M5J59k47
$$ 164 20 -178 -69 -134 -231 -156 11 -230 188 31 -87 130 53 184 65 -20 243 27 -92 -47 112 -135
1772a35R3K22l55N52n24R6K39n22M06p5P7m9k77M99l88K28M1j66kK5J19l48M39
$$ -135 -42 180 -175 377 -147 -51 188 -334 72 -3 74 25 -252 247 -141 87 128 -38 -40 -15 104 -244 195
1795A95k50nJ66l35L16j59J07k86J60M82j93j64n7j39j3n9M51l14J87o8j42J22
$$ 195 -55 -60 106 -229 87 -72 35 -251 -91 391 198 34 -23 -162 -175 -234 217 -97 90 22 -120 2
1817Bl1J6K07J00j92L2j3k22K93k48K69l22j57L41k94L14R4o6j46k03M05j97L6
$$ 2 -29 -13 194 294 102 134 121 -101 192 -56 213 -109 -266 75 -219 95 189 123 -23 -226 179 -18 18
1840A8L02m64L16l06L20k78OJ74k91J40J53l01M49l67J70j60L5n5k34M92k85M01
$$ 18 320 -144 172 -134 186 -92 -86 88 -203 -63 90 -211 238 -129 41 -119 -84 -139 -373 119 -166 235
1862B35n29K63O9J25M3m18O1K18J73j97l1K32j99K62l71o3J44m7K79k85J78k72
$$ 235 -294 -31 38 163 206 -212 -151 67 240 43 12 244 45 307 -64 -127 17 -30 249 -36 142 -130
1884a30K0L97n95K50N0J67k1j21J17m09L75k13m2M31k17k66K51J9k4l67M92j78
$$ -130 -110 287 -308 -58 -8 159 138 17 134 -275 100 -113 -155 276 59 -207 44 63 39 -328 164 -14
1906a4M9j74O6J95j65Q9J30m15j71J26M32m72K44J82j78K68k03L27n85L99k63
$$ -14 35 -139 -73 122 -43 46 176 -239 -410 -284 148 -324 -80 102 -76 192 -11 316 -269 130 -133
1927a33J1Q8p8J88N0k26j26J12K37k16l26K80k87N82o28N15l01L45p5q1K74j62
$$ -133 -122 -34 -112 76 126 -100 -226 -114 123 -93 -419 -139 -426 156 -472 43 -258 87 12 -69 205 43
1949D3j3o5k4o5M4J16j64L78l99O5J40jl1l5N4J30j25J25q8j65M34n27M42n91
$$ 43 30 -35 -59 -124 -80 36 -128 250 -149 -84 56 55 24 -11 43 173 48 173 85 -80 354 -173 269 -322
1973c22K85r9N4j91K51J26j34J01M4n3j62J55m87K14L81k32QJ7L02m34O5L52R2
$$ -322 -37 -136 -82 -273 -22 104 -30 71 115 62 -100 55 -432 -218 163 -69 -61 -44 258 -176 -111 241 333
1996C33m57J53J85k86K81l81J13l79J65L18j61J4K3N7r1l8o0K06k18K82P7J39
$$ 333 -124 29 214 -72 209 -172 -59 -438 -273 45 -116 -102 -79 -22 -113 -151 -211 -5 -223 59 136 275
2018B75l26J79J38k54n6K1k27K83j44L49j47k09l0j4J6L86j86K9N3k03J97k54
$$ 275 -51 128 266 12 -44 -23 -250 33 -111 238 91 -118 -148 -162 -146 240 54 83 136 -67 130 -124
2040a24K89k04L56k70j87M2K0P4n1O6O4k75L46n28N96k84L61j7j97k35M07M2m3
$$ -124 165 -39 317 47 -140 -98 -78 -4 -55 11 75 -200 146 -382 214 -70 291 274 77 -158 249 291 248
2063B48m46N20m31K06j22M2K52n25J13j00L39r1j43k0L10l58J37j93J44p0L27
$$ 248 -198 322 -109 97 -25 17 269 -256 -143 -243 96 5 -138 -158 152 -206 -69 -262 -118 -188 139
2084A39l68L55k65J82j70O3J26l82N27r7j30QK93j81k40Q0Q1r5K7q2k3P2K1L35
$$ 139 -229 126 -139 43 -127 -64 62 -320 207 110 -20 -12 281 100 -140 -60 21 -74 -47 -129 -152 -80 -59 276
2108B76k54O3o7K6k39J22j7k39K3K33K89j16m62M98m17L79l11K64j63N4j2l28
$$ 276 22 85 18 44 -195 -73 -90 -329 -306 -73 216 100 -362 136 -281 98 -213 51 -112 -58 -70 -398
2130c98L44J91j40o6J79k40L67r4m89J68M64l95Q6N7qQ4j02l5lk8j79K63k12l2
$$ -398 -54 137 -3 -69 110 -130 237 143 -346 -178 286 -109 -23 34 26 110 8 -27 -30 -58 -237 26 -186 -218
2154b18L48j06r0n4L8P2k07N4K52O3k04N3l6k3p9M98q41N04J66j00L4j7L4k17
$$ -218 130 24 -66 -120 -82 -10 -217 -163 89 152 -52 1 -35 -58 -137 361 -480 24 190 90 124 107 141 -76
2178g6J53M9j72J50j40J5k65J88K04k25N13m15j6n5N5J56jj43p0K15k99K04pj43
$$ -76 77 126 -46 104 -36 -21 -286 -98 106 -119 394 -21 -37 -92 -37 119 118 -25 -95 120 -179 25 18 -125
2202a25N13l10r7l4l24L70k46K36N2j83J86r9L32k45O9r3k22r7K49J05k23K40
$$ -125 388 78 -19 -53 -377 -7 -253 -17 35 -148 38 -61 271 26 95 2 -220 -317 -68 37 -186 54
2224E4K59l52Q3k45L17k72N9J54j03O6j18j01K29P8m4j56K85l76K14J95m54K27
$$ 54 313 -39 44 -201 116 -156 -97 57 -46 20 -98 -199 30 108 64 -92 193 -183 31 226 -228 -1
2246an8k17M54j54K9j2j23l4oRrK23l00J30j6P6J76l85J27J20j38K00k91K72M2
$$ -1 -59 -276 178 24 53 41 -82 -116 -122 -113 -122 101 -199 -69 -85 -9 167 -218 -91 29 -109 91 -200 72 114
2271A14k36r5K42j02R5J0l25K17R9q9n0L49j05j15K6l7m3Q5J17n6j53Q6R4J68
$$ 114 -122 -217 25 -77 18 28 -297 -80 19 -70 -120 229 124 9 35 -2 -45 40 157 101 -52 34 128 296
2295B96kj53k53O4M0N5j61N06l41j35P5o3m0J92p7J56k84J32K23j60j32J19p1
$$ 296 294 141 -112 -48 -8 47 -114 392 51 -84 -9 -72 -112 80 3 159 -125 7 230 70 -62 57 -14
2318a4J29p2j28P1j12K27j69O9j08L6M23j77K3j50j7k04L11j6K1m7O6j88J9M1
$$ -14 115 43 -85 -14 -126 101 -68 1 -107 -71 352 175 198 48 31 -173 138 122 143 96 162 -26 -7 34
2342C4j34K73l7j94J66K0m4K37k64J1j59M4l6K2R5Qk0K8p5o8L07k22o5N2R0J23
$$ 34 -100 173 136 -58 108 128 84 321 57 68 -91 -47 -83 -61 34 42 22 50 -25 -93 214 -8 -73 -21 69 192
2368A92l55J62J47m46M28j40J74l49n4L69k83J51l8M1r6J2j9J65k17J98N9j31
$$ 192 -163 -1 146 -300 128 -12 162 -187 -241 128 -155 -4 -42 -1 -97 -85 -104 61 -156 42 101 -30
2390c0J11j38M37l30k68J72K79l09J09K7j09l5pK54k95L65j90r0J98lk4k92R9
$$ -30 81 -57 380 50 -218 -46 233 -76 33 60 -49 -84 -91 163 -132 233 43 -47 151 148 124 -168 -69
2413f9P5l4r6J73j18K34j90J75j93O5r4K21k65J65j7k39L59j01q5J27k96M17k59
$$ -69 6 -28 -124 49 -69 165 -25 150 -43 22 -72 149 -116 49 32 -207 152 51 -34 93 -203 214 -45
2436d5j34J46k20P8L49j53N9J15j68j12k03K70p8L01l48K05K53q8j94J8l9O9k13
$$ -45 -179 -33 -253 -175 174 21 80 195 27 -85 -288 -18 -96 205 -143 62 315 227 33 51 12 81 -132
2459a32K8K43m39j6N98l38J05R6k09m4J54J24n3l35M31M4K8k08l06L35j75R7p2
$$ -132 -104 139 -300 -316 282 -56 49 145 -64 -108 46 170 117 -218 213 257 285 77 -229 106 -69 28 -44
2482d4J05K5L7l54M80k29j82L44k93m6J71j94L97l20K62k46L2J3k4J13q3K90l88
$$ -44 61 86 123 -231 249 20 -162 182 -111 -157 14 -180 217 -103 159 -87 -55 -42 -66 47 -36 254 -134
2505a34J52j99Q6J84n2o9r2P7J0J27j29J10k85K81j13o6J74Nk05J87j4k3r3o8
$$ -134 18 -181 -95 89 37 -32 -124 -47 -37 90 -39 71 -214 67 -46 -112 62 67 -138 49 35 12 -81 -149
2529a49K32K4J89O6n14K95k09K26k06K46j04N9j09L1n5j94J20j80J65Qk27J81
$$ -149 83 107 296 362 -152 143 -66 160 -46 200 96 155 46 77 22 -172 -52 -232 -67 -59 -286 -105
2551a05J26j71K54l04K36J69P5k44q5K3j78J02K06m14L02n7R6K1J50m0k88K26
$$ -105 21 -150 104 -200 36 205 280 36 -49 -26 -204 -102 104 -310 -8 -65 31 52 202 162 -126 100
2573A00j79q4R2j8J34l81K74Q7o3L02k37L67j99k06J42m7j37L9J98J96l99J23
$$ 100 -79 -163 -71 -89 45 -336 -62 25 -38 264 27 394 195 -11 131 84 -53 -14 184 380 -19 104
2595A04j85J7l7j%J6J41m04N80k56J41n4K18k88j52J96J3j56J84j74k41M68k31
$$ 104 -81 -64 -101 -102 -102 -86 55 -349 231 -25 116 62 280 -8 -160 36 49 -107 77 -97 -338 130 -101
2618a01J91l41M48k26P1p9j78K0K59K09k90J12j34R2k59J03M5K25j16%k49K82
$$ -101 90 -251 197 -29 42 -37 -215 -195 64 273 -17 95 -39 53 -206 -103 -58 167 51 51 -198 84
2640H4J83J7l00K06j45j81L76k54K24k21J65M8l88J35LL28j53j5j66o1m9RJ72
$$ 84 267 284 -16 190 45 -136 240 -14 210 -11 154 202 -186 -51 -48 280 127 112 -54 -115 -164 -155 17
2663A7J98m00J96o8k04K49k03P1P7m7J25On2R8k18J31O8J31k10J74m93N73k12
$$ 17 215 -185 11 -57 -261 -12 -215 -144 -67 -114 11 17 -35 63 -155 -24 44 175 -35 139 -354 219 7
2686GJ32j30K4j39J41j1J59j11m5j28N9j7j85J25K45J22m31M7N1J12j93J99k78
$$ 7 139 9 33 -106 35 24 183 72 27 -101 -42 -59 -244 -119 126 248 -183 -136 -85 27 -166 33 -245
2709b45K3K97j45J17L92n98J52k33J43L83j93Qk80L15j77j51K36K32k98j24P6
$$ -245 -222 75 -70 47 439 -159 -7 -240 -97 286 93 101 -179 136 -41 -192 44 276 -22 -146 -70
2730g0j1j4M6M9j5K15l40n0K47j78J62n2n2m5j28K03k8n1K09L0pL0k46K33L2j64
$$ -70 -81 -95 -49 0 -15 200 -140 -190 57 -121 41 -11 -63 -108 -236 -33 -61 -112 97 127 120 150 -96 137 169 5
2756EK58l39J82K10n39N54o5J1m81J96o2J68j43N4M6m51N59l0n9n9l3j96J3J70
$$ 5 263 -76 106 316 -223 331 266 277 -204 -8 -70 98 -45 9 55 -396 163 133 74 15 -18 -214 -201 -31
2780c1l9j54J68l09J98K60j48pJ16J30m4n36M02L70l22j6k13K61j41p3j01JL34
$$ -31 -70 -224 -56 -365 -167 93 -55 -62 54 184 140 -396 6 376 54 38 -175 86 -55 -128 -229 -228 106
2803A06j52N8j61J81k00R8k1K04k37M7j94L69j57L80l70j7%J49M8k95MJ22k21
$$ 106 -46 12 -149 32 -168 -70 -91 113 -124 -77 -271 98 -59 321 -49 -66 -66 83 131 -164 -160 -38 -259
2826b59J99j07M23l66M45j98k31k02L22k48K33K49m73L72M6k62OO1q8J30K3r0
$$ -259 -60 -167 256 -110 335 137 -94 -296 26 -222 11 260 -213 159 205 -57 -51 10 -78 52 75 -15
2848a5N1l00L02q1k21K88r6mJ00k83l3K24O2%k27J77L17l64J3q9O1N7K77Q0k88
$$ -15 36 -264 38 -43 -264 24 -72 -76 24 -259 -292 -68 -6 -6 -233 -56 261 -103 -90 -179 -118 -61 216 296 8
2873HJ32k45OJ94J0pj24k03K17N8j19Mj41L23Kj76k1K26j4j02L14l44j9j82L36
$$ 8 140 -105 -99 95 105 98 -26 -229 -12 46 -73 -69 -210 113 115 -61 -82 144 130 28 342 -2 -21 -203 133
2898A33k7j26j44L4R9pj00L0O7J33rj50jK8J59k22R6P8m0j64N1J68K70k92J4j43
$$ 133 106 -20 -164 -130 -31 -38 -138 -108 -41 92 83 -67 -68 -40 119 -103 -7 71 31 -133 -82 86 356 64 78 -65
2924f5K75k27L9l16L60j13K40o2l86M61k72K1J59k8J52l56q7L37j87p3Q1j24n9
$$ -65 210 -17 22 -294 66 -47 193 131 -255 206 -66 -45 114 86 238 -118 -205 132 -55 -128 -47 -171 -230
2947b30K52k30%K48j38J79P6n1o1P6k14j2O1K9K0K11n1j07j74p6K91j12M2k05
$$ -230 22 -208 -208 40 -98 81 157 106 45 121 -93 -105 -44 -15 5 216 165 58 -116 -192 99 -13 29 -176
2971a76L4K24r3L5q1Q3J17k83mJ09J78j80J12K88m17J12j35k2K14j0J75l45j3
$$ -176 -142 82 -11 24 -57 26 143 -140 -144 -35 143 -37 75 363 -54 58 -77 -99 115 105 280 -65 -78
2994g8K11l07P2N5J87J8J14m09K64K0j18j30J4J07k40L6l3L64q0j18p7L09k52
$$ -78 133 -174 -102 -47 140 158 272 -137 127 147 29 -101 -87 20 -220 -184 -217 147 67 -51 -128 181 -71
3017g1J87L07n41N2j52J64j11K04p0J75L2k53j14J31j13K3L91l25n6K61q7J32
$$ -71 116 423 -118 -66 -218 -54 -165 39 -31 144 176 -77 -191 -60 -173 -150 241 -84 -140 121 34 166
3039A66k33Q5k5j99J39J80j3j16M7j46J00j16k02M14k00K83k65m6k6M5J03J31
$$ 166 -67 18 -7 -206 -67 113 100 -16 31 -115 -15 -131 -333 81 -119 164 -101 -147 -173 -128 -25 106
3061A06j58p2L1K9R4j43J72Q4j24l38M68k41j29Q9K14j18K5l0K6k37L84m8l41
$$ 106 -52 -124 -93 -64 30 -113 59 143 19 -319 149 -92 -221 -132 82 -36 -11 -41 -15 -252 132 84 -257
3084b57J6M14O6r8p5q5O3n6j7J48j90rO7j13J80Qk05K77j64k6J36p3Ol8pj94J06
$$ -257 -241 173 239 141 66 -19 44 -12 -29 119 -71 -80 -13 -126 54 62 -143 134 -30 -56 80 7 13 -25 -32 -226 -120
3111a20n5J68J21M3k87m9J57M2J60j13n3o0mk13M02l10J06k2n2M0K9K34q8j54
$$ -120 -175 -7 114 157 -130 -179 -22 20 180 67 14 -46 -50 -263 139 -171 -65 -87 -139 -99 -70 164 76 -78
3135g8L2J44j31o0J1q7K07O3j63J09R9j02j93J51r9Q9K16l66K13l19l1J89p7K17
$$ -78 -46 98 -33 -93 -82 -169 38 101 -62 47 146 44 -149 2 -97 -8 208 -158 55 -264 -295 -106 -183 34
3159C4K42n24o4K92P3Q8k12J01J18J02j73k47L94k18l84K44K36m8J9J82k02oj23
$$ 34 276 -248 -312 -20 53 141 -71 30 148 250 77 -170 224 6 -378 -134 102 54 73 255 53 47 -76
3182g6l9J67R7l15J84j47O3k1q7J26K93l34L4O3J04M3k3j99qL42m01M10l7n90
$$ -76 -115 52 149 -166 18 -129 -66 -87 -174 -48 245 -89 -55 8 112 155 132 -67 -75 267 -134 276 239 -351
3206c51K78O1L09l13j9Q0k63L81k42J80k27J64K10p1Qk07RJ53j07j84J13r2Q6
$$ -351 -73 -12 297 -16 -35 45 -218 163 -79 101 -126 38 248 177 185 -22 -13 140 33 -151 -38 -130 -44
3229d4J66k99J56j08L56o36M52J17k60M4k1j16L72k54O6p4N4J46m6J2k04K94k27
$$ -44 122 -177 -21 -129 227 -409 43 160 -100 -56 -77 -193 179 -75 -9 -83 -29 117 71 83 -121 173 -54
3252e4n7p9K57j78J46J5j21J97Nn7k53J45j38K48j03J22k11L29k84J52j21J8R8
$$ -54 -111 -190 67 -111 35 50 -71 126 131 74 -179 -34 -172 76 -27 95 -116 213 -71 81 -40 -22 76
3275G6l05J94K54j15j40J1p0R2k31L46l8n1k19K81k07J5K92j97J48k11L62l3l84
$$ 76 -229 -35 219 104 -36 -25 -95 -3 -234 112 74 23 -196 85 -122 -107 185 -12 136 -75 287 254 -130
3298a30P1L38k19mJ1j36J08J04m19M37l38J71K57k95j74qJ63k68M49l59K71J64
$$ -130 -59 279 60 56 67 -69 39 143 -276 161 -177 -6 251 -44 -218 -226 -63 -331 118 -241 30 194
3320A94m2k5j27r2J41K2k86J67j40N7k37M23l02L21p9r7J12m2O5K60l14j8o8J56
$$ 194 152 127 0 -92 49 71 -215 -48 -188 -131 -368 55 -247 74 -5 -102 10 -32 33 293 -21 -39 -107 49
3344D9j20J46J1J60k77j15O5J51j2l71J74Q5J17r5O8k25L88m46j6K11K10jk91
$$ 49 -71 75 86 246 -31 -146 -81 70 58 -313 -139 -54 63 -32 36 -189 199 -247 -263 -52 158 157 -134
3367a34K46k59L9j75M83k21P1j76J27p9K4k33N2J85j4L0j52j6J23K42l73K12K8
$$ -134 112 -147 -108 -283 200 -21 50 -126 1 -78 -54 -287 -235 -50 -64 -34 -186 -202 -79 163 -210 2 30
3390C0P6J9J5j69l29K88m0L10j77j08R6k0KR7k25J72L9j53J52r1j45L77L9j32
$$ 30 106 125 140 -29 -358 -70 -110 200 23 -85 11 -9 -7 90 -135 37 76 -77 75 -16 -161 216 255 123
3414A23k41J90o9o8K88N1j94j54l3L95j71j94K59R9p26M55j18N1J6K79o3j72P7
$$ 123 -118 72 3 -65 223 274 80 -74 -107 288 117 -77 182 281 -445 10 -108 -57 -41 238 175 3 80
3437H0j84L2R0O0M9j08O5j64j09k4K84k55j07J24J38L08k14q3j42J7l4J17j15
$$ 80 -104 -72 18 78 127 19 84 -80 -189 -213 71 -184 -291 -167 -29 279 65 -18 -160 -143 -177 -60 -175
3460a75L30j25o7P7j55K95l66K01L41l12J49l87J26o3J22RJ28j53mk6J74j48k94
$$ -175 155 30 -37 40 -115 180 -186 15 356 44 193 -194 -68 -131 -9 0 128 -25 -29 -55 119 -29 -323
3483c23K00R9j00L02j83n7K88k32J75j40P2k29O0L10m70J8M17l87n0K85j82oK66
$$ -323 -123 -24 -124 178 -5 -62 226 -6 169 29 101 -128 -68 242 -228 -210 207 -180 -230 55 -127 -133 133
3506A33j42K52k65J65k1r4k95L52l8j13O0o7j49K85j5q8l5J57k6K7R5k81K22l02
$$ 133 -9 243 -22 143 122 28 -267 85 47 -66 -6 -73 -222 63 48 -40 -75 82 56 83 178 -103 119 -183
3530a83K95l77J81N35j37j0k6k27l42L8K53J56j18p3K04j10j56R4j01J63j45N14
$$ -183 112 -265 -84 451 314 304 278 51 -291 -253 0 156 38 -35 169 59 -97 -3 -104 59 -86 428
3552D28l48k5J80j25J84l18L17n18J57mP8j34j21J77J28J83l57m6J29O3j18R3
$$ 428 80 55 235 110 294 -24 293 -225 -68 -72 6 -128 -249 -72 56 239 -118 -164 -35 28 -90 3
3574CQO5k91QN1J71p3K35k47K61j24Q2k18K44J24k77o3K74j71p0J21r4k88M24
$$ 3 11 76 -215 -207 -156 15 -58 177 -70 191 67 149 -69 175 299 22 -41 233 62 -8 113 19 -269 155
3598A55k09J45q7K75l46J27k3j17j3N7R6J07m1j69j88J97k1p5J50p8Lr8L6K01
$$ 155 -54 91 4 279 -67 60 37 -80 -93 -36 60 167 126 -43 -231 -34 -55 -130 20 -58 -55 -153 -117 84
3622H4j73n4n8K93o8j29K43L4M8m34J19K01P9j31k11K77o3j28K69j54J5q1KJ21
$$ 84 -89 -143 -201 92 24 -105 138 172 220 -214 -95 106 185 54 -157 120 57 -71 198 44 59 -22 -20 101
3646A01J5n9j80J01R1J86j71j03l25J42M7jK54N2j11Q8J5R0k24j58K78k9J90l56
$$ 101 116 57 -123 -22 69 255 84 -19 -344 -202 -155 -156 98 150 39 127 142 232 8 -150 128 99 289 -67
3670f7J31o6j67K74k79o3K23p8R9n5j73K1J55J22J83l94K03J59l75L9j18O08j88
$$ -67 64 -2 -169 105 -174 -237 -14 -92 7 -48 -221 -200 -45 77 260 -134 69 228 -147 -108 -226 382 194
3693A94j88K48k44K49k01Q6k93K23J16k34J5k69M17k64k3J23n2L74l86J46j76
$$ 194 6 254 10 259 58 144 -149 74 190 -44 -29 -298 119 -145 -168 -45 -97 277 -109 37 -139
3714a39N1j12r4P65p42M60j95R2j83O8J83m5l09K43J56l63N2J46k73K02o6K28
$$ -139 -88 -200 -294 471 -271 189 -6 86 -97 -29 154 109 -200 43 199 -164 -112 34 -239 -37 -103 125
3736A25j69k41o5K25L1J52P7p1q2q0J43l0K5j30N3P6N7j01J21j89P6Q9j07R2O6
$$ 125 -44 -285 -350 -125 -94 58 135 64 -18 -98 45 15 40 -90 -37 39 96 -5 116 -73 3 92 -15 77 143
3761A43Ro1q9R1k31J64M7j14L2m9J10r6l56N26j06nK2j34K12K6m7K9j47N1J24
$$ 143 152 91 2 93 -138 26 73 -41 -9 -58 52 -44 -400 126 20 15 37 -97 115 141 94 123 -24 27 151
3786A51j32J13O1j64O1l39K71n9J63l7n58L85R4m5J54q1Q4J02j12L6q8k5K9J38
$$ 151 19 132 193 29 90 -249 22 -37 126 89 -469 -84 10 -35 119 38 122 224 112 148 60 35 64 202
3810B02m11K79KK4j65L9J41k56J51J8j41K26p0j1P9J4O7j59j30K19j9j20j22L15
$$ 202 -209 70 72 96 -69 -30 111 -145 6 24 -117 109 39 28 107 121 188 29 -101 118 99 -21 -143 172
3834A72k67K73j41Kl86L68l2Q9J22k20n5J94k84n5J31L45j40L6p8j9k83K78k52
$$ 172 -95 178 37 39 -347 21 -11 78 200 -20 -75 119 -165 -220 -89 256 116 152 74 55 -228 50 -202
3857b02M24m36Q5P1j02L39j16N3k85Q0L4M7P6j76J6M12o9l72J01m9K06k45J23
$$ -202 222 -214 -129 -58 -160 179 63 116 -169 -89 -55 -8 68 -108 -92 320 251 -121 -20 -69 137 -108 15
$$ [...]
8191E3
##END NTUPLES=NMR FID
##END=
