##TITLE=1H_DE-153-_TFA
 200.13Hz, DMSO-d6+CCl4.
 8 sc
 25.6.2026
##JCAMPDX= 6.0         $$ Bruker NMR JCAMP-DX V2.0
##DATA TYPE= NMR FID
##DATA CLASS= NTUPLES
##ORIGIN= UXNMR, Bruker Analytische Messtechnik GmbH
##OWNER= pz
$$ XWIN-NMR		Version 3.5
$$ Thu Jun 25 13:32:52 2026 Russian Standard Time (UT+4h)  she@DPX200
##.OBSERVE FREQUENCY= 200.1313
##.OBSERVE NUCLEUS= ^1H
##.DELAY= (6, 6)
##.ACQUISITION MODE= SIMULTANEOUS
##.ACQUISITION SCHEME= undefined
##.AVERAGES= 8
##.DIGITISER RES= 18
##SPECTROMETER/DATA SYSTEM= spect
##.PULSE SEQUENCE= zg30
##.SOLVENT NAME= DMSO
##.SHIFT REFERENCE= (INTERNAL, DMSO, 0, 14.3821)
##AUDIT TRAIL= $$ (NUMBER, WHEN, WHO, WHERE, WHAT)
$$ ##TITLE= Audit trail, XWIN-NMR		Version 3.5
$$ ##JCAMPDX= 5.01
$$ ##ORIGIN= Bruker BioSpin GmbH
$$ ##OWNER= she
$$ F:/spectra/data/she/nmr/H-C/1/audita.txt
$$ ##AUDIT TRAIL=  $$ (NUMBER, WHEN, WHO, WHERE, WHAT)
(   1,<2026-06-25 13:31:32.09 +0400>,<she>,<DPX200>,
      <created by zg, POWCHK disabled, PULCHK disabled
       configuration hash MD5:
       00 E9 B6 7A A2 85 ED C7 34 08 36 98 17 FE 4E 26
       data hash MD5: 16K
       09 46 35 E2 F0 12 4E 35 A2 14 24 3E BC 09 D4 15>)
$$ ##END=
$$ 
$$ hash MD5
$$ D3 F6 4B 61 66 2E C0 5A 79 5D 61 24 8E 29 5F E5
##$RELAX= 
##$RELAX= 
##$RELAX= 
##$RELAX= 
##$RELAX= 
##$RELAX= 
$$ Bruker specific parameters
$$ --------------------------
##$DU= <F:/spectra>
##$EXPNO= 1
##$NAME= <H-C>
##$PROCNO= 1
##$TYPE= <nmr>
##$USER= <she>
##$AMP= (0..31)
100 100 100 100 100 100 100 100 100 100 100 100 100 100 100 100 100 100 
100 100 100 100 100 100 100 100 100 100 100 100 100 100 
##$AQSEQ= 0
##$AQ_mod= 1
##$AUNM= <au_zg>
##$AUTOPOS= <>
##$BF1= 200.13
##$BF2= 200.13
##$BF3= 200.13
##$BF4= 200.13
##$BF5= 200.13
##$BF6= 200.13
##$BF7= 200.13
##$BF8= 200.13
##$BYTORDA= 1
##$CFDGTYP= 0
##$CFRGTYP= 5
##$CHEMSTR= <none>
##$CNST= (0..31)
1 1 145 1 1 1 1 1 1 1 1 1 1 1 1 1 1 1 1 1 1 1 1 1 1 1 1 1 1 1 1 1 
##$CPDPRG= <>
##$CPDPRG1= <>
##$CPDPRG2= <>
##$CPDPRG3= <>
##$CPDPRG4= <mlev>
##$CPDPRG5= <mlev>
##$CPDPRG6= <mlev>
##$CPDPRG7= <mlev>
##$CPDPRG8= <mlev>
##$CPDPRGB= <>
##$CPDPRGT= <>
##$D= (0..31)
0 0.7 0 0 0 0 0 0 0 0 0 0.03 0 0 0 0 0 0 0 0 0 0 0 0 0 0 0 0 0 0 0 0 
##$DATE= 1782379891
##$DBL= (0..7)
120 120 120 120 120 120 120 120 
##$DBP= (0..7)
150 150 150 150 150 150 150 150 
##$DBP07= 0
##$DBPNAM0= <>
##$DBPNAM1= <>
##$DBPNAM2= <>
##$DBPNAM3= <>
##$DBPNAM4= <>
##$DBPNAM5= <>
##$DBPNAM6= <>
##$DBPNAM7= <>
##$DBPOAL= (0..7)
0.5 0.5 0.5 0.5 0.5 0.5 0.5 0.5 
##$DBPOFFS= (0..7)
0 0 0 0 0 0 0 0 
##$DE= 6
##$DECBNUC= <off>
##$DECIM= 32
##$DECNUC= <off>
##$DECSTAT= 4
##$DIGMOD= 1
##$DIGTYP= 9
##$DL= (0..7)
0 120 120 120 120 120 120 120 
##$DP= (0..7)
150 150 150 150 150 150 150 150 
##$DP07= 0
##$DPNAME0= <>
##$DPNAME1= <>
##$DPNAME2= <>
##$DPNAME3= <>
##$DPNAME4= <>
##$DPNAME5= <>
##$DPNAME6= <>
##$DPNAME7= <>
##$DPOAL= (0..7)
0.5 0.5 0.5 0.5 0.5 0.5 0.5 0.5 
##$DPOFFS= (0..7)
0 0 0 0 0 0 0 0 
##$DQDMODE= 0
##$DR= 18
##$DS= 0
##$DSLIST= <SSSSSSSSSSSSSSS>
$$ [...]
##$SUBNAM0= <"">
##$SUBNAM1= <"">
##$SUBNAM2= <"">
##$SUBNAM3= <"">
##$SUBNAM4= <"">
##$SUBNAM5= <"">
##$SUBNAM6= <"">
##$SUBNAM7= <"">
##$SUBNAM8= <"">
##$SUBNAM9= <"">
##$SW= 18.0517328524113
##$SWIBOX= (0..15)
0 0 2 0 0 0 0 0 0 0 0 0 0 0 0 0 
##$SW_h= 3612.71676300578
##$TD= 16384
##$TD0= 1
##$TE= 0
##$TE2= 300
##$TE3= 300
##$TEG= 300
##$TL= (0..7)
0 120 120 120 120 120 120 120 
##$TP= (0..7)
150 150 150 150 150 150 150 150 
##$TP07= 0
##$TPNAME0= <>
##$TPNAME1= <>
##$TPNAME2= <>
##$TPNAME3= <>
##$TPNAME4= <>
##$TPNAME5= <>
##$TPNAME6= <>
##$TPNAME7= <>
##$TPOAL= (0..7)
0.5 0.5 0.5 0.5 0.5 0.5 0.5 0.5 
##$TPOFFS= (0..7)
0 0 0 0 0 0 0 0 
##$TUNHIN= 0
##$TUNHOUT= 0
##$TUNXOUT= 0
##$USERA1= <user>
##$USERA2= <user>
##$USERA3= <user>
##$USERA4= <user>
##$USERA5= <user>
##$V9= 5
##$VALIST= <valist>
##$VCLIST= <CCCCCCCCCCCCCCC>
##$VD= 0
##$VDLIST= <DDDDDDDDDDDDDDD>
##$VPLIST= <PPPPPPPPPPPPPPP>
##$VTLIST= <TTTTTTTTTTTTTTT>
##$WBST= 1024
##$WBSW= 4
##$XGAIN= (0..3)
0 0 0 0 
##$XL= 0
##$YL= 0
##$YMAX_a= 156712
##$YMIN_a= -204950
##$ZGOPTNS= <>
##$ZL1= 120
##$ZL2= 120
##$ZL3= 120
##$ZL4= 120
##$ABSF1= 10
##$ABSF2= 0
##$ABSG= 5
##$ABSL= 3
##$ALPHA= 0
##$AQORDER= 0
##$ASSFAC= 0
##$ASSFACI= 0
##$ASSFACX= 0
##$ASSWID= 0
##$AUNMP= <proc_1d>
##$AZFE= 0.1
##$AZFW= 0.1
##$BCFW= 1
##$BC_mod= 2
##$BYTORDP= 1
##$COROFFS= 0
##$CY= -3
##$DATMOD= 1
##$DC= 2
##$DFILT= <>
##$DTYPP= 0
##$F1P= 0
##$F2P= 0
##$FCOR= 0.5
##$FTSIZE= 0
##$FT_mod= 4
##$GAMMA= 1
##$GB= 0.15
##$INTBC= 1
##$INTSCL= 1
##$ISEN= 128
##$LB= 0.25
##$LEV0= 0
##$LPBIN= 0
##$MAXI= 10000
##$MC2= 0
##$MEAN= 0
##$ME_mod= 0
##$MI= 1.114404
##$NCOEF= 0
##$NC_proc= 0
##$NLEV= 6
##$NOISF1= 3.799351
##$NOISF2= 2.8
##$NSP= 1
##$NTH_PI= 0
##$NZP= 0
##$OFFSET= 14.38212
##$PC= 1
##$PHC0= -4221.73
##$PHC1= 13.3923
##$PH_mod= 1
##$PKNL= yes
##$PPARMOD= 0
##$PSCAL= 0
##$PSIGN= 0
##$REVERSE= no
##$SF= 200.129724274929
##$SI= 16384
##$SIGF1= 3
##$SIGF2= 2
##$SINO= 400
##$SIOLD= 16384
##$SREGLST= <1H.CDCl3>
##$SSB= 0
##$STSI= 0
##$STSR= 0
##$SW_p= 3205.1282051282
##$SYMM= 0
##$S_DEV= 0
##$TDeff= 0
##$TDoff= 0
##$TI= <>
##$TILT= no
##$TM1= 0
##$TM2= 0
##$TOPLEV= 0
##$USERP1= <user>
##$USERP2= <user>
##$USERP3= <user>
##$USERP4= <user>
##$USERP5= <user>
##$WDW= 1
##$XDIM= 8192
##$YMAX_p= 0
##$YMIN_p= 0
$$ End of Bruker specific parameters
$$ ---------------------------------
##NTUPLES= NMR FID
##VAR_NAME=  TIME,          FID/REAL,        FID/IMAG
##SYMBOL=    X,             R,               I
##VAR_TYPE=  INDEPENDENT,   DEPENDENT,       DEPENDENT
##VAR_FORM=  AFFN,          ASDF,            ASDF
##VAR_DIM=   8192,          8192,            8192
##UNITS=     SECONDS,       ARBITRARY UNITS, ARBITRARY UNITS
##FACTOR=    0.0002768,     1,               1
##FIRST=     0,             0,               0
##LAST=      2.2672688,     0,               0
##MIN=       0,             -204950,         0
##MAX=       2.2672688,     156712,          0
$$ Real data points
##PAGE= N=1
##DATA TABLE= (X++(R..R)), XYDATA
$$ [...]
1831a48q0O8J4k9R2J52k7j33j88K93k6k33M06j95J74j7j82j16M46j53J3r0o3J95
$$ -148 -228 -160 -146 -175 -83 69 42 -91 -279 14 -12 -245 161 -34 140 123 -59 -175 271 118 131 41 -22 173
1855A73k43O0q5Q0J59j0m3J1Q4k7k19L7pJ19j20K02MP9l98J88P8k86K05k56J15
$$ 173 -70 -10 -95 -15 144 134 91 102 186 159 -60 -23 -30 89 -31 171 175 254 -144 44 122 -164 41 -215 -100
1880a00L39l42J83k11k6P8J15m3l2lmL70j98j84J83k12M5N0%K2j03o3K10n5P4
$$ -100 239 -103 80 -131 -157 -79 36 -7 -39 -42 -46 324 126 -58 125 -87 -42 8 8 30 -73 -136 74 19 93
1905I3j85q5M2K7r1L04j12k4q4o0J07J42k17R3J84k32R6j97J80L5Q5J23n4r2l66
$$ 93 -92 -177 -135 -108 -199 105 -7 -31 -115 -175 -68 74 -143 -50 134 -98 -2 -199 -19 16 101 224 170 78 -288
1930b88L66j33J70N3k32J25j50K2J41k63O7K0K47P4L4j76l9m8J68N1k1J17l73
$$ -288 78 -55 115 168 -64 61 -89 -67 74 -189 -122 -102 145 219 253 77 38 -10 158 209 188 305 -68
1953f8K80k59rk22K87O9J85l47J63q1J99k58J05J56l24M31m90K27K07m16Q4pK8
$$ -68 212 -47 -56 -278 9 78 263 -84 79 -2 197 -61 44 200 -124 307 -183 44 251 -165 -81 -88 -60
1976f0K80m65L61R9L9L9j30q9m00N41j07Ll17J53O4l51M66m0l21L13j32M9r6J85
$$ -60 220 -245 116 215 254 293 163 74 -326 215 108 111 -206 -53 11 -340 126 86 -235 78 -54 -5 -101 84
2000H4j08J75j32J53l08K20k44J02J26k43K0m0J87j58J96J35k61K78j61k06Q8
$$ 84 -24 151 19 172 -136 84 -160 -58 68 -175 -155 -195 -8 -166 30 165 -96 182 21 -185 -97
2021i7m4Q8J70j40J90l50O8PJ69j86J6p9O0J62k02J10M07k62j04k1P1l8m7j5Q3
$$ -97 -141 -53 117 -23 167 -183 -115 -108 61 -125 -109 -188 -128 34 -168 -58 349 87 -17 -38 33 -5 -52 -67 16
2046A6j90J70K41k25J3J64j92N3N6k19P5J56J23l13P6K6J59l4k31J19j26R2k41
$$ 16 -174 -4 237 12 25 189 -3 50 106 -113 -38 118 241 -72 4 30 189 155 -76 43 -83 9 -232
2069b32J72J3Q9j03q7K62l58J91J61j28Q1j17J47o7J84j9r9OK8k42J78O6l87K90
$$ -232 -60 -47 42 -61 -148 114 -244 -53 108 -20 61 -56 91 24 208 189 90 96 124 -118 60 126 -261 29
2093B9j77J4K49j67Qj09R1J73k73M25k42J62r6j63K1j92K62J1J37j16k04K01K10
$$ 29 -148 -134 115 -52 -44 -153 -62 111 -162 263 21 183 87 -76 -55 -247 15 26 163 47 -157 44 254
2116B54o3r5j69P8M3OL5j66J26k77L15o2M1P8j22K12k52k9M5M5p4K4LJ99q2O1
$$ 254 191 96 -73 5 48 54 89 -77 49 -228 87 25 66 144 22 234 -18 -47 -2 43 -31 -7 -4 195 113 174
2142A74j61j40M3K77k12P5r8J82m22L20k0Q2j3j69J2o0J33o5K18r1k52K84j21
$$ 174 13 -127 -84 193 -19 56 -42 140 -282 38 18 100 87 -82 -70 -130 3 -62 156 65 -187 97 -24
2165b4J37j93J06q5j62K83j6P2J29k15M9q0M2k79J25L97k49O5j35J13O7k72J69
$$ -24 113 -80 26 -59 -221 62 46 118 247 32 81 1 43 -236 -111 286 37 102 -33 80 147 -125 44
2188D4j21J88j84q1J66K27l40J60p6J12K21n85R6K41k5j1j47K24j5j19l9NJ65
$$ 44 -77 111 -73 -154 12 239 -101 59 -17 95 316 -269 -173 68 43 32 -115 109 94 -25 -64 -59 106
2211A06j05j53L34n4j80M8J10M3p0j25J47K13m98R2K81p3j20J04j01N5m53O31
$$ 106 1 -152 182 128 -52 -4 106 149 79 -46 101 314 -184 -92 189 116 -4 100 -1 54 -399 232
2233B32m36J12QkJ93j70M8J35k58J11J15k56Q9K21j01J5n5J26n2r5j11K47J2q1
$$ 232 -204 -92 -84 -86 107 -63 -15 120 -138 -27 88 -168 -79 142 41 56 1 127 75 -20 -131 116 128 47
2257D7l7q4J42q8M2j46J85N1J08m54J34J61J3n3jk66L15l4j17N4rP2K0j31p3L66
$$ 47 10 -74 68 -20 22 -124 61 112 220 -234 -100 61 74 21 20 -246 69 35 -82 -28 -37 35 55 -76 -149 217
2283B17l01R8k02K99Q6q5K08l18qJ19j31Q3Q2m7J39m48L75k76Q9j74L88K1k44
$$ 217 -84 14 -188 111 197 112 320 2 -6 113 -18 65 147 100 239 -209 166 -110 -21 -195 193 214 -30
2306c0j35K90k20j7P7N2l5M1K73k89N2j65P2Q9K3N9o4p1J91m38M09n0j30O0qj29
$$ -30 -165 125 -95 -112 -35 17 -18 23 296 7 59 -106 -34 55 78 137 73 2 193 -245 164 114 -16 44 36 -93
2332i3K5k76N06j64k0J9K28j46K39n95j8J76K70L94j33k58l09L02n43L17O06q79
$$ -93 -68 -344 162 -2 -22 -3 225 79 318 -277 -295 -119 151 545 412 154 -155 147 -396 -79 527 -352
2354c52N77k93q39J520j012L12L58p89Q70o99Q20o07K94k49l20O3O57k35p48J41
$$ -352 225 -68 -907 613 -399 -87 271 -518 352 -347 473 -134 160 -89 -409 -346 311 76 -672 -531
2374e31P99j80K7k58L23m17L73j09J00L37j03l35j24O8L99N55j142J014J99n48
$$ -531 268 88 115 -143 180 -237 136 27 127 464 361 26 -98 -30 369 924 -218 796 995 447
2394D47j50p8M1K21k75k86J13N3L77n8p38M87N5l80R74j047J85N1l66Q8O14l96
$$ 447 297 219 260 481 206 -80 33 86 463 405 -333 154 209 -171 803 -244 -59 -8 -374 -286 328 -68
2416f8K06r1P2K43k48j45J67L06N1r8k41j91k77R5L07j49J37m3R8k11L04k45l11
$$ -68 138 47 119 362 114 -31 136 442 493 395 154 -37 -314 -219 88 -61 76 33 131 -80 224 -21 -332
2439c32L35J8J35J10m96K36K21k10J33k12R0k2L6j83n8L54L1l08J82j4K47k67
$$ -332 3 21 156 266 -230 6 227 17 150 -62 28 6 42 -141 -199 155 186 -122 60 46 293 26
2461B6m7j4j09j47J9M08k3J34m19J74l7J06j99J26J40m72L15l9J82k43J08J08
$$ 26 -21 -35 -144 -291 -272 136 113 247 -172 2 -35 71 -128 -2 138 -334 -19 -58 124 -119 -11 97
2483I7j7k42Q6K81Q1m10K0r0N1K29k36L01k32J68k79J73n1J7O1j04j9Q2p8L14
$$ 97 80 -162 -76 205 286 -124 -104 -194 -143 86 -150 151 -81 87 -192 -19 -70 -53 8 -96 -115 -33 -111 203
2507B03k5m9j14K7O9j32k1P1r8p5J71j70j3K78kj67R6Q5j23L6P6k02J00k90K04
$$ 203 178 129 15 42 111 -21 -42 29 -69 -144 27 -143 -156 122 120 -47 49 134 11 47 123 -79 21 -269 -65
2532f5j1N4q7K61j67P1k14J89N8j11J44j43J07Q8j48j8q8k9P4L48k00m29r6L55
$$ -65 -76 -22 -109 152 -15 56 -158 31 89 -22 122 -21 86 174 26 8 -80 -109 -35 313 113 -316 -412 -57
2556e7J02k46K66K7j7l8L3J18j25j52J19j31J20k09K30k25K11k44M56o31L22O8
$$ -57 45 -201 65 92 75 37 70 188 63 -89 30 -101 19 -190 40 -185 26 -218 238 -393 -71 -3
2578cN8j84l7J25Q2m6J61q5K20l41k23m8M36j17j53q3J02K84l20K90oK3R3k36
$$ -3 55 -129 -166 -41 41 -5 156 71 291 -50 -273 -321 115 -2 -155 -238 -136 148 -172 118 112 135 228 -8
2602hK29k03l3j22O4K06j56j0k42L19l6j99K17p6K64k49K73j22K06k69P1k57L65
$$ -8 221 18 -15 -137 -73 133 -23 -33 -275 44 8 -191 26 -50 214 -35 238 116 322 53 124 -133 232
2625B32k62k4p4J76j89J87p2l2k5L42k83j04K19j54L43l49J1o1O9J80K13l80j07
$$ 232 -30 -54 -128 48 -141 46 -26 -58 -83 259 -24 -128 91 -63 280 -69 -58 -119 -50 130 343 -37 -144
2648a44p5J50J45m35K70j58L08j13j40M67k48Q8k10j4L35k05J60k60R1J08J0J13
$$ -144 -219 -69 76 -359 -89 -247 61 -52 -192 275 27 115 -95 -109 226 21 181 -79 12 120 130 243
2670B43k82K87l26R6k67K2L88J3Kr3o4p5l3J78k28j02L8K35j49O0k03J84P3O6
$$ 243 -39 248 -78 18 -249 -227 161 174 176 83 19 -56 -89 89 -139 -241 -203 32 -117 -57 -260 -76 -3 63
2694F3P1p4j70J67j01J61M3j54j96J24P8MJ20k34o9K30j11K19j77j30J63KK66
$$ 63 134 60 -110 57 -44 117 160 6 -190 -66 12 16 136 -98 -167 63 -48 171 -6 -136 27 29 295
2717B95l31q6q7K89n4j25M19k41k40J28p5j20K06K04r2j01M6m9j50K51p5M3p6
$$ 295 -36 -122 -209 80 26 -99 320 79 -161 -33 -108 -228 -22 182 90 -11 35 -14 -164 87 12 55 -21
2740b1J69m99R1j40K99m6J20j64K25M7k31K19j28%K88l01J19M0j44K08l59J08
$$ -21 148 -351 -260 -400 -101 -147 -27 -191 34 81 -150 69 -59 -59 229 -72 47 87 -57 151 -208 -100
2762a00L28k18k46n4M3M19J26l37J47k2m7%m61L62L90k69m9k45L83l1k70K14J11
$$ -100 228 10 -236 -290 -247 172 298 -39 108 86 39 39 -422 -60 330 61 12 -233 150 119 -151 63 174
2785A74K1j78j21J83m9n1J52j64P5r0p6k32K72M4J44j71n3p2J77o0J5J0K55j86
$$ 174 195 17 -104 79 30 -21 131 -33 42 -48 -124 -356 -84 -40 104 -67 -120 -192 -15 -75 -60 -50 205 19
2809A9j53K26l8J25k83L28j67K33r4l30K91r7p6J89K0M4k06k44M49m97L77N0m01
$$ 19 -134 92 54 179 -104 224 57 290 196 -134 157 60 -16 173 193 237 31 -213 236 -261 116 166 -235
2832b35jL62l27L29j92l9K7R3o9J09r2K53j17j94n6K53k73J97qJ6K9l0Qk59L68
$$ -235 -236 126 -201 128 -64 -103 -76 17 -52 57 -35 218 101 -93 -149 104 -169 28 20 36 65 35 43 -216 152
2857A52m92J75Q6K20m66J04J73J03k59nK96k87K74j03K06k14j51L59r7J34k42
$$ 152 -340 -165 -79 141 -325 -221 -48 55 -204 -209 87 -200 74 -29 177 -37 -188 171 74 208 -34
2878c4p8K7K97m03j5K33N1Q9k48q8J94k58L63Mj65L04k53p0J79P7k15j32Q3j27
$$ -34 -112 -85 212 -191 -206 27 78 167 -81 -169 25 -233 130 134 -31 273 20 -50 129 206 -9 -141 -58 -185
2902a85j0J88p7K95pk81K84l65K12o4j07J80j80L53l31K60nl68K36k12L11j38
$$ -185 -195 -7 -84 211 204 -77 207 -158 54 -10 -117 63 -117 236 -95 165 160 -208 28 -184 127 -11
2924a1Jj41M0Q4J09q9k77K51J62j00N8L0k57M83m34J93j62K40j72j13R7J10k62
$$ -11 -10 -151 -111 -27 82 -7 -284 -33 129 29 87 117 -140 343 -91 102 -60 180 8 -105 -8 102 -160
2947a60n0J05J22p2P6k9j61K55l1j30P5Q0k17N20m97M7J97q9l3L6O7k88J50K84
$$ -160 -210 -105 17 -55 21 -8 -169 86 55 -75 0 80 -137 383 -114 -67 130 41 8 44 111 -177 -27 257
2971B57n17K4L91k17J8J25j67M03l80Q3k61J36K28k28L9J87M2k61l3J18l65K68
$$ 257 -260 -236 155 -62 -44 81 -86 317 -63 20 -241 -105 123 -105 -66 121 163 -98 -131 -13 -378 -110
2993a10J91p3Q9j60k97M25j01J51l4k81J41J40lj56M4k2L0j65L35j58O4N1o1m29
$$ -110 81 8 97 -63 -360 65 -36 115 81 -200 -59 81 78 -78 -34 -56 -26 -191 144 -14 50 101 40 -389
3017c89M08J84k07K46r4L1j57J9j54P7j61K34j93L9N8Q0J30k25J09M4Q0k70J82
$$ -389 19 203 -4 242 148 179 22 41 -113 -36 -197 37 -156 -117 -59 21 151 -74 35 79 159 -111 71
3040G1mj79J90K1j58J36m5J8M3k71L7K55j65n3J76j15j00MR0J90m8k65J73j4j51
$$ 71 67 -112 78 99 -59 77 32 50 93 -178 -141 114 -51 -104 72 -43 -143 -139 -49 141 93 -172 1 -13 -164
3065a64M34l89K51r0J3J03N0m44J01j28M71K2m03J21o0J07o4q4R1M7J3J80k09
$$ -164 270 -119 132 42 55 158 208 -236 -135 -263 208 230 -173 -52 -112 -5 -69 -153 -62 -15 -2 178 -31
3088c1m5P4kK6Q0j19J01p8N8j99L12N2j14%m1j54O6j34j17Q9K08j49J14o9L94
$$ -31 -76 -2 -4 22 102 -17 84 6 64 -135 177 229 115 115 74 -80 -14 -148 -265 -176 32 -117 -3 -72 322
3113C22m31M78j42k40K39k46m5N3L22m73O8M72l06k02L82l36J52j5j53p0k1j3
$$ 322 -109 369 227 -13 226 -20 -65 -12 310 -163 -95 377 71 -131 251 -85 67 52 -101 -171 -192 -205
3135b05K17J34o7l1M1m1l0p5L41l05k1R8R9j61k19K83j64R5l0K56m59M38m63L90
$$ -205 12 146 79 48 89 48 18 -57 284 -21 -42 56 155 -6 -225 58 -106 -11 -41 215 -244 194 -269 121
3159A21j95K8L05j43k12j58J45R0j06j03J52m2l3J64m2K26j61j42n5K85j96L11
$$ 121 -74 -46 259 116 -96 -254 -109 -19 -125 -228 -76 -118 -151 13 -29 197 36 -106 -161 124 -72 239
3181B39m20L9J33j25K32J1j54K6J20J38j59o8J3m5k16L15j14j41L22j58J43l47
$$ 239 -181 -142 -9 -134 98 109 -45 -19 101 239 80 12 25 -20 -236 79 -35 -176 146 -12 131 -216
3203b16J45j18j6K14J44k38k5Q3J24lPj82j05J91k93L03O3k16M23m83J51K17j18
$$ -216 -71 -189 -205 9 153 -85 -110 -27 97 94 101 -81 -186 5 -288 15 78 -138 285 -198 -47 170 52
3226E2p0K48m8j61j53j62Q3K67j38L6J49j94N6MJ97j59J6o9l5J50j85m7O2m3O0
$$ 52 -18 230 182 21 -132 -294 -211 56 -82 -46 103 -91 -35 -31 166 7 23 -46 -81 69 -116 -163 -101 -144 -84
3251h4N78o94K23L2l34L29k25K76k2J79k00j00J88p6j36q1J36k09L97k96p6J69
$$ -84 494 -200 23 55 -279 50 -175 101 79 258 58 -42 146 70 -66 -147 -11 -220 177 -119 -195 -26
3273b6J06l4n5J98j26K72n25P3J84N2K73k82j93q3m5J98J07K3k05Kn5K96j60K1
$$ -26 80 46 -9 189 63 335 -190 -117 67 119 392 110 -83 -166 -211 -13 94 117 -88 -86 -141 155 -5 16
3297A6m6L0l3J37j03l1mJj30L96k82K00j47R0n2j01O3m8j07M15l45M09m09L2M7
$$ 16 -30 0 -33 104 1 -30 -34 -33 -163 233 -49 151 4 94 42 -59 4 -44 -151 264 -81 328 -81 -49 -2
3322bL8r7j55N67n35OL74k31Kj2k4J29r2K1k43N15m48L20j73j8o5k7J67j69J16
$$ -2 36 -61 -216 351 -184 -178 196 -35 -33 -45 -69 60 -32 -11 -254 261 -187 133 -40 -58 -123 -150 17 -152 -36
3347c6L30l14J38k6k88M7L99n09L92k52J81r3J31k34J51q6K43k14M6M20k11k71
$$ -36 294 -20 118 92 -196 -149 250 -259 133 -119 62 -31 100 -134 17 -69 174 -40 6 426 215 -56
3369e6Qj28K25j39M9J88j68R1J2j5k99M00p8q0j14m8K10o8M6j68O4N76m06k25
$$ -56 -48 -176 49 -90 -41 147 -21 70 82 67 -232 168 90 10 -104 -152 58 -10 36 -132 -68 508 102 -123
3393a23L31k66J53o2L4L4l8k07J98l0J49k88j42K70N4k30J94q7R5mk32L27j09
$$ -123 208 -58 95 33 67 101 63 -144 54 24 173 -115 -257 13 67 -163 31 -56 39 35 -197 130 21
3416B1p5L16l01K77q1o6j39j47K02J17k09P6J07O2J0l78J42j34K64Ll5JMq6Q6
$$ 21 -54 262 -39 238 157 91 -48 -195 7 124 -85 -9 98 160 170 -208 -66 -200 64 67 32 33 37 -49 37
3441C7l6j39J09m5L05j21l82J84J30M2J6J8m45K23J02J28L3j19J57J16l36M8N
$$ 37 1 -138 -29 -74 231 110 -272 -88 42 84 100 118 -327 -104 -2 126 159 40 197 313 -23 25 30
3464C0K25l06p0oPM2k78K51L22l38K77k73K0J73j4J11j73p3K03k31P6J86J04n8
$$ 30 255 -51 -121 -127 -120 -78 -356 -105 217 -121 156 -117 -97 76 62 173 0 -73 130 -101 -25 161 265 207
3488B07k60P8l96K83R9R6Q6l27K03j01J44r8J48l20j7N12m60j47L40Ln5O8j34
$$ 207 -53 25 -371 -88 11 107 193 -134 69 -32 112 14 162 -158 -175 337 -123 -270 70 73 18 86 -48
3511d8K14k97KL0P9j94K12n5k07M08l01K72n6J26k23J49L4j32M2j30L15k23q6
$$ -48 166 -131 -129 -99 -20 -214 -2 -57 -264 144 -157 115 59 185 -38 111 145 13 55 -75 240 17 -69
3534f9J82n1l7j19Q5q9Q1K48m11l6L58j26p7Q5m5o8J8Q3l17L89p7l27N96k64O8
$$ -69 113 62 25 -94 -9 -98 -17 231 -180 -216 142 16 -61 24 -21 -89 -71 12 -305 84 7 -320 276 12 80
3559H0l87L01K73l22Q2L2K9J3j96n6J62Q6j59K00q2j75K65P8p2m56L75k45M68
$$ 80 -307 -6 267 -55 27 59 88 101 -95 -151 11 97 -62 138 56 -119 146 224 152 -304 71 -174 294
3582B94l42J19k60K03j30k71L22J40k3K03j5k84j83M51l25q9L20Ml0r7K42k94
$$ 294 -48 71 -189 14 -116 -387 -65 75 52 255 240 -44 -227 224 -101 -190 130 134 104 7 249 -45
3604d5K65l57K91J43k38l18K12m6J29J28j41l1j58p9L88j77J11j2Q3M9q7j34j36
$$ -45 220 -137 154 297 59 -259 -47 -93 36 164 23 -8 -166 -245 143 -34 77 65 148 197 110 -24 -160
3627a60N2p1N2L61j36k8k39r4K61k91N8K76J07l55O23n44K11L48m95J56j0k88
$$ -160 -108 -179 -127 234 98 70 -169 -263 -2 -293 -235 41 148 -207 416 -128 83 431 -64 92 82 -206
3649b06M39j17l21K35J24k25K87j66lj22k79N27n06L63J73o0J28l80N0N2j1l3
$$ -206 233 116 -205 30 154 -71 216 50 47 -75 -354 173 -333 30 203 143 271 -109 -59 -7 -18 -51
3671e1j12K74k81L45kj87q8P1K06j37j34M5q2L41j34o1j8J75l85R8K14j72L0N9
$$ -51 -163 111 -170 175 173 -14 -102 -31 175 38 -96 -51 -133 208 74 13 -5 170 -215 -117 97 -75 -45 14
3695A4j11J8l6L14k99K31j70qO0L7j6N4l9m3n4j9K02r0J83q9l60K46k7j21nK89
$$ 14 -97 -79 -115 199 -100 131 -39 -47 13 50 34 88 49 6 -48 -67 135 45 228 139 -221 25 -2 -123 -128 161
3721A61J17l81lK4L36j66j19j09R6K6J30j40K23q7J05j91J40k88L06l16K66k64
$$ 161 278 -103 -106 -82 254 88 -31 -140 -44 -18 112 -28 195 108 213 22 162 -126 180 -136 130 -134
3743a34J74J58j35j39L5J92k00o7J16K59j28l01J71K75m22L6J64k27K38Q1l48
$$ -134 40 198 63 -76 -41 151 -49 -116 0 259 131 -170 1 276 -146 -110 54 -173 65 146 -202
3764b02J75J68j49n4p6N1K17j62J4k11J07K76j65J44j53O3O3R5k72J06j71O5o
$$ -202 -27 141 -8 -62 -138 -87 130 -32 -18 -229 -122 154 -11 133 -20 43 106 201 -71 35 -136 -71 -77
3787g7L3L0R3k80J34k68L99j71J65l1r4r5K11J75k35j69J81J77l85K93j00j45
$$ -77 -44 -14 79 -201 -67 -335 64 -107 58 27 -67 -162 49 224 -11 -180 1 178 -207 86 -14 -159
3809a59J86N4Q5l47R1K84J35m04j70K28j21J43L9J62r5j9O7l32J22j32q4K29L41
$$ -159 27 81 166 -181 -90 194 329 -75 -245 -17 -138 5 44 206 111 92 159 -173 -51 -183 -267 -38 303
3832C03k96J52q0J00n38M01j70J16j34L49L5k71J52k92K07p4J09j23m9J35L57
$$ 303 7 159 79 179 -359 42 -128 -12 -146 203 238 -33 119 -173 34 -40 69 -54 -103 32 389
3853C89m19Q8j92K90n1j35J34K6k21K63j94R7j28L7kl3J56q4n6p4K83j27p9R4
$$ 389 -30 58 -134 156 105 -30 104 130 -91 172 -22 75 -53 -16 -18 -51 105 21 -35 -109 174 47 -32 62
3877F2k30J26r6L6k70L19m5J95l6J50j64j36j10R6L39L0j27l3j44%J95k63NJ19
$$ 62 -168 -42 -138 -102 -372 -53 -98 97 61 211 47 -89 -199 -103 236 266 139 106 -38 -38 157 -106 -101 18
3901A8j61J35J33p6j23n7J93P8j22m8N0K36l12j59K58o0K02k28q6P1J79l46L09
$$ 18 -143 -8 125 49 -74 -131 62 140 18 -30 20 256 -56 -215 43 -17 185 -43 -129 -58 121 -225 84
3924H4J12L5n6k83J87k1J4k2l2j27n4K80P6q6O0m13K17J47j08O3j8Lj46Q0m8n
$$ 84 196 231 175 -108 79 58 72 50 18 -109 -163 117 193 107 167 -246 -29 118 10 73 55 58 -88 -8 -56 -61
3950f1r1P0MJ39k7Lm2j96J87L7K05k79j08J57p6R6jl0J02j22m4j1K50n1k19R2
$$ -61 -152 -82 -78 61 34 37 -5 -201 -14 23 228 -51 -159 -2 -78 18 17 -13 89 -33 -77 -88 162 111 -108 -16
3976a6pj48L55k07j55L9K86k52k3J23J91p9M6k09j6J42M6q4M3o0n2P7K62j83K7
$$ -16 -23 -171 184 -23 -178 -139 147 -105 -128 -5 186 107 153 -56 -72 70 116 32 75 15 -37 40 302 119 146
4001A46j9m25N02o0l5l3j19K17m45L34k66K89j53M7r5k3J57KJ0J9m7j23Q0k09
$$ 146 127 -298 204 144 109 76 -43 174 -271 63 -203 86 -67 -20 -115 -138 19 21 31 50 3 -120 -40 -249
4025b49K91PN2l15M55l97j2K57r9p4J55mj08J29l40N3N4L6K96k38k03k1J58J84
$$ -249 42 49 101 -214 241 -156 -168 89 -10 -84 71 67 -41 88 -252 -199 -145 -109 187 -51 -254 -275 -117 67
4049F7o9K8Q4kM6pJm04K34n8j39K05J53l49K80K31l59J37Q8K4l4j32j28n0J23
$$ 67 -2 26 110 108 154 147 148 -256 -22 -80 -219 -14 139 -210 70 301 -58 79 167 191 157 25 -103 -153 -30
4074c0n7K29m01K85k3J41j03j02J01P4j21J58l0p6l11K25J69Nn0l6j00J27o4J30
$$ -30 -87 142 -259 26 3 144 41 -61 40 114 -7 151 121 45 -266 -41 128 133 83 47 -53 74 10 140
4098A40r7k18Q0K6o4P7l7K76m00j6L70j86K9k35P6K21N4O8m87K81k73J32J41n9
$$ 140 43 -175 -95 -69 -133 -56 -93 183 -217 -233 137 -49 -20 -255 -179 42 96 164 -323 -42 -315 -183 -42 -101
4122a01J01J08J60m10P6J08R4j76J19k94L68R8l48j05p6K92j88J98r7j6J14K31
$$ -101 0 108 268 -142 -66 42 136 -40 79 -215 153 251 -97 -202 -278 14 -174 24 -73 -89 25 256
4144B56L0l16K01j85q2J27k75K37J4j44K15J9r8R1k29L10K53p48M44K11l84K2
$$ 256 286 -30 171 -14 -96 31 -244 -7 7 -137 78 97 -1 90 -139 171 424 -324 120 331 -53 -31
4166c1j58P1O5j72J43K51j37j4j43J0K83ON6J22l17J8J52k17m2J57n79N46L1r7
$$ -31 -189 -118 -53 -225 -82 169 32 18 -125 -115 168 174 230 352 35 53 205 -12 -54 103 -476 70 101 4
4190DJ57N0l59j4K26O6j41l1j23J74o9l22M29J41k67N1J97k58L39j67j10J62l84
$$ 4 161 211 -148 -162 64 130 -11 -42 -165 9 -60 -382 47 188 -79 -28 169 -89 250 83 -27 135 -249
4213b49J01J89k80m6K74k63M44k06o1N7K07k45J49J28j76r2K20j99o8K22J56j13
$$ -249 -148 41 -239 -285 -11 -274 170 -36 -97 -40 167 -78 71 199 23 -69 151 -48 -116 106 262 149
4235A49j87K19j57j62J66l38n2L89m1k7J22J19j09k18K80j04l77K60K90J20k37
$$ 149 -38 181 24 -138 28 -310 -362 27 -14 -41 81 200 91 -127 153 49 -328 -68 222 342 105
4256A05k15L8J07j07J93j08K52r3n4k10j23K95k01L66k38M1k32K53j74K05K3J4
$$ 105 -110 -72 35 -72 121 13 265 172 118 -92 -215 80 -121 245 7 48 -184 69 -105 100 123 137
4278A37q3j25k96P18l41m0J81q0j52J65j17k59L64k61J74j82P4K1k02M68m70M50
$$ 137 54 -71 -367 351 10 -30 151 71 -81 84 -33 -292 72 -189 -15 -197 -123 -102 -304 164 -306 144
4300A44J42m56r0J86k45J94P0K65k89M1j65K54L7L1Q6l50PJ66J09j87k8q9N3K20
$$ 144 286 -170 -260 -74 -319 -125 -55 210 -79 -38 -203 51 88 119 205 -145 -138 28 137 -50 -78 -167 -114 106
4324A06j64J92k21L32o2l77Q1L8JJ00J44r3r6J7qK03Lk03MJ66o2j13J68r5j57
$$ 106 -58 134 -87 245 183 -194 -113 -75 -74 26 170 77 -19 -2 -10 193 196 -7 -3 163 101 -12 156 61 -96
4349i6L20k49K1Q3k46K58k25J57M9L18l58k5L7n7k01J52K07j89k3J19Rj04L9J54
$$ -96 224 -25 -4 79 -167 91 -134 23 72 390 32 7 44 -13 -214 -62 145 -44 -67 52 61 -43 -4 150
4373A50l66K17lK9k8J67k76J0P0R1l3J01p6J88k83J97J38k33j2l00J46n6R9R5
$$ 150 -216 1 -2 27 -1 166 -110 -100 -30 61 28 129 53 241 -42 155 293 60 48 -252 -106 -162 -63 32
4397C2O7j93K2O9k61L87j11JM7J5J6m5j01L1j48M92n47Q2K53M6j25m0J10k93M83
$$ 32 99 -94 -72 -3 -264 123 12 13 60 75 91 46 -55 -24 -172 320 -227 -145 108 154 29 -11 99 -194 289
4422B89j0j51J00k51K03q9n1PN3j03Q3l4J9O9j71R0J83j52n5j6J40l38K61Rm8
$$ 289 279 128 228 -23 180 91 40 47 100 -3 80 46 65 134 -37 53 236 84 29 13 153 -185 76 85 37
4447C7j28J56k63J72K50l61Q6l6j14P0K44l07K15J2P0k38P3j58K48j22j2J74j07
$$ 37 -91 65 -198 -26 224 -137 -51 -87 -201 -131 113 -194 21 33 103 -135 -62 -220 28 -94 -106 68 -39
4470c9K99k61n6J2p0J50k87L67k92M3J36K58j74J75l40K8J37N7k27J96k14M7K99
$$ -39 260 -1 -57 -45 -115 35 -252 115 -177 -134 2 260 86 261 -79 -51 86 143 -84 112 -102 -55 244
4493B44m43J93O6j09J91k44K3j29L38nl94K09K44n8k20K54k89J66j93Q7r6J08
$$ 244 -199 -6 60 -49 142 -102 -79 -208 130 125 -269 -60 184 126 -94 160 -129 37 -156 -69 -165 -57
4515e7R3J83l54J02j23J12q7m2j19K88k9K53l77J40J48m5J6J5k70J48k63K38K15
$$ -57 36 219 -135 -33 -156 -44 -131 -173 -292 -4 -33 220 -157 -17 131 86 102 117 -153 -5 -268 -30 185
4538A85m44K38p5K09j26q6KJ80k90K52k2o0K29j41l50J59L6mJ65k2j56P6K69l57
$$ 185 -259 -21 -96 113 -13 -99 -97 83 -207 45 23 -37 192 51 -299 -140 -104 -108 57 35 -121 -45 224 -133
4562a33J05q6J1R1q0K33k20K24j99l8J2L43l55j44J41J18l21J89P0k53L6J46K45
$$ -133 -28 -114 -103 -12 -92 141 -79 145 -54 -92 -80 263 -92 -236 -95 23 -298 -109 -39 -292 -256 -110 135
4585A35n8J3n3k19J5R8M49l23j18lJ13j78J64q7K58m2k84O8k27M38L2L9k47J90
$$ 135 77 90 37 -182 -167 -69 380 57 -61 -64 49 -129 35 -52 206 164 -120 -52 -279 159 191 230 -17 173
4609A73M4kj16k03QJ04q0m2K6J99J30m03R4O3o0L7J11q6R6j14K16j46K07l38j13
$$ 173 217 215 99 -104 -96 8 -72 -114 -88 111 241 -162 -68 -5 -65 -28 83 -3 93 -21 195 49 256 -82 -195
4634a95K3J84K4p6Q9o4K90m87J18q5N07l57J21k32J65p8L46k09m2j69j11K68k43
$$ -195 -172 12 36 -40 49 -15 275 -212 -94 -179 328 -29 92 -140 25 -53 293 84 42 -127 -238 30 -213
4657b13L75J40m05j02J99j09L18l52J07r0J45L8Q8j83o4j36J77K64k04R1j37J22
$$ -213 162 302 -103 -205 -6 -115 203 -149 -42 -132 13 51 139 -44 -108 -244 -67 197 -7 84 -53 69
4679F9K02J9k79j19P1L28j34k24L6j00Q7j14O6R4L09l20k76J45Q1K37l84J38J5
$$ 69 271 290 11 -108 -37 291 157 -67 -31 -131 -44 -158 -92 2 311 -9 -285 -140 -59 178 -206 -68 -53
4702e3k04K47J19n4k9Q6j63k30K37Q3J24j72k90L81j42K46j35J58l16K96k23N8
$$ -53 -257 -10 109 55 26 112 -51 -281 -44 39 163 -9 -299 82 -60 186 51 209 -107 189 -34 24
4724B4J99k7l98J89n4J82l28K97jk09K83k50K14q7j5J16j84N4l1j31K58k38K3
$$ 24 223 196 -202 -13 -67 115 -213 84 83 -126 157 -93 121 34 19 135 -49 5 -26 -157 101 -137 -114
4747a14J22K0L4N3k61J45J09p8j68J49j46J8K78l06m8M42l53K4p6K25k78J00J8
$$ -114 8 28 62 115 -146 -1 108 30 -138 11 -135 -117 161 -145 -193 249 -104 -80 -156 69 -209 -109 -91
4770i1N8j16J28R0k68J12K93k18K08R3k20l19M6O33n08J01j05n0J4j95M17k17
$$ -91 -33 -149 -21 69 -199 -87 206 -12 196 289 69 -250 -204 429 -79 22 -83 -133 -119 -314 103 -114
4792a14J77k27K56j18p2j22oK50M2o0l04K79j68K65M8n7Q1j33j4J36j39j20J05
$$ -114 63 -164 92 -26 -98 -220 -226 24 66 6 -298 -19 -187 78 126 69 150 17 3 139 0 -120 -15
4815a5J52Lj90J52m03L95j72m7J00n2J85j4k03q0K96o5K2j65K2M08l85j39M31
$$ -15 137 140 -50 102 -301 94 -78 -125 -25 -77 108 94 -109 -189 107 42 64 -101 -79 329 -56 -195 236
4838B36R5n00K17j24R9q6J50j71M0J83j90Rj96K61k79N5K35j8J3j30L53k63J61
$$ 236 331 -169 48 -76 23 -63 87 -84 -44 139 -51 -42 -238 23 -256 -201 34 16 29 -101 252 -11 150
4861A50j69r5K22k76K04M23r39L55J12k87L53n9k16K42j48L18k69L19j64L9n3
$$ 150 -19 -114 108 -168 36 459 -480 -125 -13 -300 53 -6 -222 20 -128 190 -79 240 76 115 62
4882F2N8k73N8L43k52J7J18J05l46J15j5J7j64J94l24K23K37J45r7j38j27J06
$$ 62 120 -153 -95 248 -4 13 131 236 -110 5 -10 7 -157 37 -287 -64 173 318 221 83 -44 62
4904F2k38J12M07m07J57l59L42m6r6jj82L41j71J85k04K9k4N5o2K06NJ48k42l49
$$ 62 -176 -64 343 -64 93 -266 76 30 -66 -67 -249 92 -79 106 -98 -69 -93 -38 -100 106 111 259 17 -332
4928c32L42j93J63r2P5K26j54k38L30j82J2K43l70LK53k7j35r9K06k45J71o3m7
$$ -332 10 -183 -20 -112 -37 189 35 -203 127 -55 -43 200 -170 -167 86 59 -76 -175 31 -214 -43 -106 -153
4951a53k9L98l60M53n19k0K41m2J1j9r8L12j00J2P7m9q4J44j89j67M40l48K50
$$ -153 -182 216 -144 309 -210 -230 11 -31 -20 -39 -137 175 75 87 164 115 31 175 -14 -181 259 -89 161
4974A61p5l22K06J4QR5j05J96k48MK18l33L8J64K93l52j3j36K84j96Q1l9k21M1
$$ 161 86 -236 -30 -16 -8 87 -18 178 -70 -66 152 -181 -143 21 314 -38 -51 -187 97 -99 -18 -57 -278 -237
4998b37K66p7J29j8k58J63K35j84j64L09j1j57k67J65N3k87K89L3r8J19o9rk8
$$ -237 29 -48 81 63 -195 -32 203 19 -145 164 153 -4 -271 -106 -53 -340 -51 -18 -116 3 -66 -75 -103
5021a03L5o5J74m5p5q9N0j66L83j78J16L2l30J71Q6j58J76J84o4m17K85j23OL24
$$ -103 -68 -133 41 -4 -79 -168 -118 -284 99 -79 37 69 -261 -90 -4 -162 14 198 134 -283 2 -121 -115 209
5045B09j02j10P8m7p1J98l52J26J82j60K79p6j65j11K78j37J73r6Q9k49J60l07
$$ 209 107 -3 75 28 -43 155 -197 -71 111 -49 230 154 -11 -122 156 19 192 96 185 -64 96 -211
5067b11K86j82k09L43K9J1p7qM86l15k34J81j03j82J37J82j80J49k22O7k0N9k64
$$ -211 75 -107 -316 27 56 67 -10 -18 468 153 -81 100 -3 -185 -48 134 -46 103 -119 -52 -72 -13 -277
5090b77L68k4j48j4k36K54J89K0k94K43r7J52q3M1k36J34K18j45J48M9k54m4L4
$$ -277 91 67 -81 -95 -331 -77 112 132 -162 81 -16 136 53 94 -142 -8 210 65 213 262 8 -36 -2
5113bm3J5r5K81k67j69J75J61N6L1m47K93m03O27k26n7O4q0K64k91K67j70p7K39
$$ -2 -45 -30 -125 156 -111 -280 -105 56 112 143 -304 -11 -414 213 -13 -70 -6 -86 178 -113 154 -16 -93 146
5137A46k28K56k1p5J38l52L8K81j36k82J90J05K8j90n3K81j20p8O4j74K71n8J09
$$ 146 -82 174 153 78 216 -136 -98 183 47 -235 -45 60 88 -102 -155 126 6 -72 -8 -182 89 31 140
5160A40Q9k96O2L7m6j28K13P3j24j36j26K76K67k57l1j43J50j3J82j35j33K18
$$ 140 229 -67 -5 32 -14 -142 71 144 20 -116 -242 34 301 44 13 -130 20 7 189 54 -79 139
5182A39j37K9J5R0j77Q1k03J21k7j67J43K80k82j95L50j66J49J89Kk64Lj02r1
$$ 139 2 31 46 136 -41 40 -163 -42 -69 -236 -93 187 -95 -290 60 -106 43 232 234 -30 -27 -129 -220
5205b20K45j89K73k85kL67k94J09J5j44J47l7Q5M2j09Jk97K94M0J9J13j07m7J1
$$ -220 25 -164 109 -176 -178 189 -105 4 19 -125 22 -15 70 112 3 4 -293 1 41 60 173 66 19 30
5229C0j27l8J71l89M42k20J94m3k19K98r6m9r2K69k6Q0m41L19L0j71J60n8l5Q6
$$ 30 -97 -135 36 -353 89 -131 63 20 -199 99 3 -46 -138 131 105 185 -256 63 93 -78 82 24 -11 75
5253G5K6l39L68m6j01N9L03k38l02J73J54J52LRk36n2K55m61J61N4n6L0r8nJ64
$$ 75 101 -238 130 84 -17 42 345 107 -195 -22 132 284 287 296 60 8 263 -198 -37 17 -39 -9 -107 -112 52
5278E2l9l00L13L60l87j05m4J76K40q2m41K00nk1L3l8L14qP8m30l7J62j01k2J61
$$ 52 13 -287 26 386 -1 -106 -150 26 266 184 -257 -57 -62 -83 -50 -88 226 218 296 -134 -171 -9 -110 -132 29
5303B9K84l30j11J74J68m09m1L32j30j27K93j69J6j0L4o4J28j19Q6p0L9k09K26
$$ 29 313 -17 -128 46 214 -195 -236 96 -34 -161 132 -37 -21 -31 3 -61 67 -52 34 -36 3 -206 20
5326B0r4L4N7q4K77j16j7k20J18J55j5j68L63k35Q0K2m60J57K55n4j88K44l06
$$ 20 -74 -40 17 -67 210 94 77 -143 -25 130 115 -53 310 75 155 177 -283 -126 129 75 -113 131 -175
5349a75K31j21K20j50L17k16j57N2j12j25J71J17o9J46j09j92J86O2l84M89j55
$$ -175 56 -65 155 5 322 106 -51 1 -111 -236 -65 52 -17 129 20 -172 14 76 -308 181 26
5370B6r2j4N4N3m7Q4j9J20j72p4R0l2n0K37l54Q1j53l9K42J91m5J73j52k52L41
$$ 26 -66 -80 -26 27 -20 64 45 165 -7 -81 9 -23 -73 164 -190 -109 -262 -301 -59 132 87 260 108 -144 197
5395A97l20K41K03k76r1K67j87l43Q4N33k35k4q1j06K12Q0j62J61R2l53K09p2
$$ 197 -123 118 321 45 -46 221 34 -309 -225 308 73 49 -32 -138 74 154 -8 153 245 -108 101 29
5417B9k01J06K05k7j9j68N9j23K99j22o8J43j37j54L94k05M4K6n5j36J39K52l02
$$ 29 -172 -66 139 112 93 -75 -16 -139 160 38 -30 113 -24 -178 216 11 55 81 26 -110 29 281 -21
5440b1O0j23J2j2J20L6k1o3NJ00k6j99J75j03J15J05k81q8L10J08%k77%L13n31
$$ -21 39 -84 -72 -84 36 72 51 -12 -7 93 67 -132 43 -60 55 160 -121 -209 101 209 209 -68 -68 245 -286
5465b86L46k46J41J71j13p4N8R1k13K71l54K37q1k2J55M8k3j67j91J50J07M4K8
$$ -286 60 -186 -45 126 13 -61 -3 88 -125 146 -208 29 -52 -74 81 129 106 -61 -252 -102 5 49 77
5488G7j03j51J45j00J93j65J55j68p0K19J93k69m5K18k24J04l5N2K55l11q6J64
$$ 77 -26 -177 -32 -132 61 -104 51 -117 -187 32 225 -44 -89 129 -95 9 -26 26 281 -30 -116 48
5510D8j32j08J79j5j25k45J69L08l00J12J0Q9J49M0r8O6l02L13k32K19j92R2j08
$$ 48 -84 -192 -13 -28 -153 -398 -229 79 -221 -109 -99 -10 139 179 81 147 -155 158 -74 145 -47 45 -63
5533f3L9j60K82J04l06Q4K58l40j28J23N9Kq6K59J27j19j70K93m80L35Q6j61M1
$$ -63 -24 -184 98 202 -104 -20 238 -102 -230 -107 -48 -46 -132 127 254 135 -35 258 -222 113 199 38 79
5556G9k73l0M15jl24L46k22ll6j66J49K50k07K9N0k59K93j55J38J40j76k39R0
$$ 79 -194 -224 191 190 -134 212 -10 -13 -49 -215 -66 184 -23 6 56 -203 90 -65 73 213 37 -202 -112
5579a12K65l58K86Q1k05J18j82M5n4J15j91P1p9j32J26L47m50K20Q8J74n9l2o3
$$ -112 153 -205 81 162 -43 75 -107 -62 -116 -1 -192 -121 -200 -332 -206 141 -309 -89 -1 173 114 82 19
5602A9j16PN9j35M55p7l62L58k4j7k44J29o5O8o8q6R1j81QK32J34k31j40K29k75
$$ 19 -97 -90 -31 -166 289 212 -150 208 184 167 -77 52 -13 55 -13 -99 -8 -189 -181 51 185 -46 -186 43 -232
5627b32M47p7k39L8n0j60m5K68K7j11J88k76L41j00k16J52K6k2k47L84j88K97
$$ -232 215 138 -101 -63 -113 -273 -318 -50 -23 -134 54 -222 119 19 -197 -45 -19 -41 -288 96 -92 205
5649B05j75k33J88k9K1J61l22L02l04K84j56p1j77L34J33l59K26j35J09M6K2j14
$$ 205 30 -203 -15 -44 -23 138 -184 118 -186 98 -58 -129 -306 28 161 -198 28 -107 2 48 70 -44
5671d4q3J56k4j98j37K40M08o10L93O1j07j52r6K70q4J92j38J13l91O2M4K01J38
$$ -44 -127 29 5 -193 -330 -90 318 -292 101 162 55 -97 -193 77 -7 185 47 160 -231 -169 -125 76 214
5694B14l15L34ll98K96k9k35O9L04l54K85j47O8p5n7J57j18j76J60j13L99k28
$$ 214 -101 233 230 -168 128 99 -136 -67 237 -117 168 21 89 14 -43 114 -4 -180 -20 -133 266 38
5716C8j91K5K13j4M7R1p7k40q8K36k23K50k30K79R2p3k36Q5J24k89J65k3k44K65
$$ 38 -153 -128 85 71 118 209 132 -108 -196 40 -183 67 -163 116 208 135 -101 -16 108 -181 -16 -39 -283 -18
5740a8L1m5j33J78p5L0j22j64j6M15l51J09L0J43P1q4j84J55LJ34p5J15j75L25
$$ -18 13 -32 -165 13 -62 -32 -154 -318 -334 81 -270 -161 -131 12 83 -1 -185 -30 -27 107 32 147 -28 297
5764B97k27j25J17Q5k65M1O0J48m7j84K40k26kP6L4l36M58p5j09j40M7K55k54
$$ 297 70 -55 62 147 -118 -77 -17 131 84 -100 140 -86 -88 -12 22 -314 144 69 -40 -180 -133 122 -132
5787a32J53p9J97k99j00l8L48j74l1N5j00J71J4K30n6l63J87r7K08Kj75J28L9
$$ -132 21 -58 139 -160 -260 -298 50 -124 -155 -100 -200 -29 -15 215 159 -204 -17 -114 94 96 -79 49 88
5810H8j47O2M8J75j31k14K93j22K43l25J48k3Q7J86l03n8J81j29J90k95P4q2J73
$$ 88 -59 3 51 226 95 -119 174 52 295 -30 118 95 182 368 65 7 188 59 249 -46 28 -54 119
5833A19l38K46j26k0k4M1K4K63k01K7L8J24o71L38J86J00n1OJ68j00m72L53M6
$$ 119 -219 27 -99 -119 -143 -102 -78 185 -16 11 49 173 -498 -160 26 126 75 81 249 149 -323 30 76
5856G6k70K35o2m4K80k37P4j22L15m8j06qq5K4j38J22j98L09k92K47k36L44j48
$$ 76 -194 41 -21 -65 215 -22 52 -70 245 197 91 83 -2 22 -116 6 -192 117 -175 72 -164 180 32
5879C2k73J75J18j31M4l9j76K80J76l24J94k71P7j74J74K55j61M5k61K1L75m2
$$ 32 -241 -66 52 -79 -35 -74 -250 30 206 -118 76 -195 -118 -292 -118 137 -24 21 -240 -219 156 114
5901A14m05K32R1K8p2mjJ11j07P5J6J0M6L8j22M7j51P8R7l58N03j89j9N6l07M20
$$ 114 -291 -59 32 60 -12 -16 -17 94 -13 62 78 88 134 172 50 97 -54 24 121 -237 266 77 58 114 -193 227
5927B27p9l53J43pJ10Q6k28K2J24J7k36R0L51k98O3p5J36P7j68L54k20k64L12
$$ 227 148 -205 -62 -69 41 127 -101 -79 45 62 -174 -84 267 -31 32 -43 93 170 2 356 136 -128 184
5950A84l50j9L52q3J38l83JM9L67o53K07K56j34j42K90p5j09J12K66n61L04q6
$$ 184 -166 -185 167 84 222 -161 -160 -111 256 -397 -190 66 -68 -210 80 5 -104 8 274 -287 17 -69
5972f9k41M97l08j14J10K62p3n2j91L1L71l72J41R8j6p1J66j4N5j55J51k24k23
$$ -69 -310 187 -121 -235 -125 137 64 12 -179 -148 223 -149 -8 90 74 3 169 155 210 55 206 -18 -241
5995b41J74j11J78n7M3J11k00K6L03r4n5k31J97J31k77J26Kn8k42M54j93j49J
$$ -241 -67 -178 0 -57 -14 97 -103 -77 226 132 77 -154 43 174 -103 23 25 -33 -275 179 -14 -163 -162
6018a62K53l8j09J46J3k35K84Q0r1j38j69K74j92J26j1J63l14J03K34l35J09o1
$$ -162 91 53 -56 90 103 -132 152 232 141 3 -166 108 -84 42 31 194 -120 -17 217 -118 -9 -70
6040g0R5Rj56mR4NN7J14k53n9K78m2l07J3K92K2j05j36K08O8l52L15j61J21K2
$$ -70 25 34 -122 -126 -32 -27 30 144 -109 -168 110 68 -239 -226 66 88 -17 -153 55 123 -229 86 -75 46 68
6065F8m7M9n6N9l8k02K55n0j33o3M41m12J39R2J01l04R0J73l7k35Q9k1J92j67
$$ 68 21 70 14 73 35 -167 88 38 -95 -158 283 -129 10 102 203 -101 -11 162 125 -110 -21 -42 150 -17
6089a7J82N8j65q7j67K52l3K32k04j59N6r9P3m8J78j67P2J88j31J11J51k89l2
$$ -17 165 223 58 -29 -196 56 23 255 51 -108 -52 -151 -78 -126 52 -115 -43 145 14 125 276 -13 -45
6112d5j56J19K87m6k57N5J04k17L3K36P7k42jJ41j28J52k25J97j30K24k64r3L26
$$ -45 -201 -82 205 159 -98 -43 61 -156 -123 113 190 -52 -53 88 -40 112 -113 84 -46 178 -86 -179 147
6135A47j00K64j69k83M6J48K9l01K08k84L36k03K45j0r2R4j04J05j15O6kk4L7
$$ 147 47 311 142 -141 -95 53 82 -219 -11 -295 41 -162 83 73 -19 75 -29 76 -39 27 25 1 38
6158C8K15l90J11RK14Kk58o2j2M4QK27k09J10j69J66Qq0J64q0O0j79J06K11j82
$$ 38 253 -137 -26 -17 197 199 -59 -121 -133 -89 -81 146 -63 47 -122 44 52 -28 136 56 116 -63 43 254 72
6183G2j88m9J4L4J88K6k32j1J56J9j82J48j82L54L3k23OQ9r2K91k95P4l8n2P6
$$ 72 -116 -165 -151 -117 71 97 -135 -146 10 29 -153 -5 -187 167 200 -23 -17 72 -20 271 -24 50 12 -40 36
6208C6O3l26K53N2j18p1k4K66O5k51J19k17J33k74M30k48q2L9K73j28j28N5K76
$$ 36 99 -227 26 78 -40 -111 -135 131 196 -55 64 -153 -20 -294 136 -112 -194 -155 118 -10 -138 -83 193
6231A93j37l88M91L5k96P7q0Qq8K46L7j55M64k72j62J71q7L03l69J37j79L28m83
$$ 193 56 -332 159 194 -102 -25 -105 -97 -185 61 98 -57 407 135 -27 144 57 360 -9 128 -51 277 -206
6254b06K38P8k13n9M52j41l15J37j17K5N3K44l65L22j07J3K42k09j16L09o8k54
$$ -206 32 110 -103 -162 290 149 -166 -29 -146 -121 -68 176 -189 133 26 39 281 72 -44 265 197 -57
6276e7n1J50J39k85j31L44k86J94j18K04r3L4J2M7j49k57L14n9p9O8L3j6j29M31
$$ -57 -108 42 181 -104 -235 109 -177 17 -101 103 10 44 56 103 -46 -303 11 -48 -127 -59 -26 -42 -171 260
6300B60l21r7M17J99o04K36l00M9R4n2K21J43k48k63L18R5j44L56l13k17K47J9
$$ 260 -61 -158 259 458 -146 90 -210 -161 -67 -119 102 245 -3 -266 52 147 3 359 46 -171 76 95
6322I5j56j00J79k43K56o2J45j06M0k80J35J33j32J43j4j99K91j14J47K4k09J78
$$ 95 -61 -161 18 -225 31 -31 114 8 48 -232 -97 36 -96 47 33 -166 125 11 158 182 -27 151
6344A51p8M3j7k25J09J41j87J40l49L98k99j1J97j6j04J41P6j58k05K47j32L5
$$ 151 73 116 99 -126 -17 124 -63 77 -272 126 -173 -184 13 -3 -107 34 110 -48 -253 -6 -138 -103
6366a03K95j58j64L6K10j38J14j40M61n12l7j02K06j34J58J3q6J68j23O5J52k95
$$ -103 192 34 -130 -94 116 -22 92 -48 413 -99 -136 -238 -32 -166 -8 5 -81 87 -36 29 181 -114
6388a14K44k55K36j30J46k24j6K71l91J46K24j16k83M19k69J96L1O3o6r6N3l5
$$ -114 130 -125 111 -19 127 -97 -113 158 -233 -87 137 21 -262 157 -112 84 115 178 112 16 69 34
6410C4j83R0l18K62J94j22K36l16J1r3L76j25j55M0J63Q3l85L47j37L09l44O8
$$ 34 -149 -59 -377 -115 79 -43 193 -123 -112 -205 171 46 -109 -69 94 177 -208 139 2 311 -33 35
6432C5o0L01m67M49k40q6N9Q5Q7l08M02m28O6J58J74k20J92m7j40j00J68J24j26
$$ 35 -25 276 -191 258 18 -68 -9 76 163 -145 257 -171 -105 53 227 7 199 152 12 -88 80 204 78
6455G8Mj62K66r8j94k54L42N8K3j0r4J20k43O1K27L5L9j11Q1j20J0p1M9M7k51
$$ 78 82 -80 186 88 -106 -360 -18 40 63 53 -41 79 -164 -103 124 159 198 87 168 48 58 -13 36 83 -168
6480a68K06k8n9K87P9l91M6nl2L32j01k26l2j52J59O0k11K72K8n3o5J14Q1k11
$$ -168 38 10 -49 238 317 -74 -28 -33 -65 267 166 -60 -92 -244 -85 -25 -236 36 64 11 -54 60 141 -70
6504g0K9R1R6k10K08j96m6Q3o5L55l22k92N74k06J49j72p5m7Q4Q8M7M7l29J68
$$ -70 -41 50 146 -64 144 -52 -98 -15 -80 275 -47 -339 235 29 178 6 -69 -116 -32 56 103 150 -179 -11
6528a1J22o4O3k85N0L66o1k70K02R4k66k0J03Q1O5j53K5p6J26q3k58J98M9J43
$$ -11 111 47 110 -175 -125 241 180 -90 112 206 -60 -80 23 104 169 16 41 -35 91 8 -250 -52 -3 140
6552A40l55L27j13q7q5L86l81o3L9L83k80JJ68r9p1K53k66J14J55l93N49jk59
$$ 140 -215 112 -1 -88 -173 213 -168 -231 -192 191 -89 -88 80 -19 -90 163 -103 11 166 -227 322 321 62
6575F2l1MJ77m88K50j85L99r6k13L49l99j53L71j34j15J61R8j65N8J8k4l22L15
$$ 62 31 35 212 -276 -26 -211 188 92 -121 228 -171 -324 47 -87 -202 -41 57 -108 -50 -32 -56 -378 -63
6598f3J79o5qJ12j38j75K31r1o5K55l48K32j50J57P3k48q2K44l04J69M10j8j57
$$ -63 116 51 43 155 17 -158 73 -18 -83 172 -176 56 -94 63 136 -112 -194 50 -254 -85 325 307 150
6621A50k12j45J74J09j72N2K47j98M7j33l2J84k86K59j05RQ9K6J5j89O5j21L09
$$ 150 -62 -207 -33 76 -96 -44 203 5 52 -81 -113 71 -215 44 -61 -52 37 63 78 -111 -46 -167 142
6644A42J5r9k0p3m3J57j46n0K40O9J1k31J94j47j04Q2nJ4k32J75k0J59l7Jk38
$$ 142 157 58 38 -35 -78 79 -67 -117 123 192 203 -28 166 19 -85 -3 -8 6 -226 -51 -71 88 51 52 -186
6669a86R5j16L24m1n3r9Q8j61n2L7K95j73p2J96j22R6p2j74L1J74j83M59l67J05
$$ -186 -91 -207 117 76 23 -76 12 -149 -201 -164 131 -42 -114 82 -40 56 -16 -190 -159 15 -168 291 -76 29
6693B9K2j95J91r5j2J78j42j14J54j40P5j52N36l04J19j92j0L6J2ko9q8J58M5
$$ 29 51 -144 47 -48 -60 118 -24 -138 16 -124 -49 -201 335 31 150 -42 -52 -16 -4 -6 -75 -163 -5 40
6717D0l4R8k03L45k55l2P4L6k9j33o5K37l9j05RJ08n8j19O2k03K88j13P5j93Q7
$$ 40 6 104 -99 246 -9 -41 33 69 40 -93 -158 79 40 -65 -56 52 -6 -125 -63 -266 22 -91 -16 -209 -122
6742a22j6PK2j61P06k12j77j28Q4K3K06k10j10K40k82J84j45J45m6j38J53m3J43
$$ -122 -138 -131 -109 -270 436 224 47 -81 3 26 232 22 -88 152 -130 54 -91 54 8 -130 23 -20 123
6765A23n1k23K73J08k7k63J40k03J40O5L8j60K36j50m42O95j53l94L10j77K13
$$ 123 72 -151 122 230 203 -60 80 -123 17 82 120 -40 196 46 -396 299 146 -248 62 -115 98
6786I8j53J74n0k87J66m8J23j80K16j94L62M3k24j8qj1P1k6k48j2J14L9R5j24
$$ 98 -55 119 69 -218 -52 -100 23 -157 59 -135 227 270 46 28 20 9 80 54 -194 -206 -92 -53 42 -82
6810h2K04j62j02K8J07j14N2K72j60k61M0J48j99k31M78J30k03K17k41J02m2k1
$$ -82 122 -40 -142 -114 -7 -121 -69 203 43 -218 -178 -30 -229 -460 18 148 -55 162 -79 23 -19 -40
6832d0j3k3K3R2pk05J33J6m4R2j19J21M5Q2k19l22J64K58L7l14M09p2k33J31q2
$$ -40 -53 -76 -53 39 32 -173 -40 -24 -68 24 -95 26 71 153 -66 -388 -224 34 71 -243 166 94 -139 -8 -90
6857i0j3j5m7J98nm3r5k2K41L9o8k03J23j29J84j48J76K47k99j41k02L19k5j49
$$ -90 -103 -118 -165 33 28 -15 -110 -132 109 148 80 -123 0 -129 55 -93 83 330 31 -110 -312 7 -18 -167
6881a67J13P1P8m9j31R6j33L27j56j56L05j43r8j39K80j08J69K8l63K88P0p02
$$ -167 -54 17 95 46 -85 11 -122 205 49 -107 198 55 -43 -182 98 -10 159 187 -176 112 182 -520
6903e20M93N4j8J31q8J32k70Q0j45J37j2M3q2k6j53L84J28k51r3R7Nmj34p3K36
$$ -520 -27 27 9 140 52 184 -86 -6 -151 -14 -26 17 -65 -91 -244 140 268 17 -76 21 26 22 -112 -185 51
6928E1RM7j0j37K23k42m17M79M0j5n7J57j84J53j36N8j01j64L16p5M42n44L9K62
$$ 51 60 107 97 -40 183 -59 -476 3 43 28 -29 128 -56 97 -39 19 -82 -246 70 -5 437 -107 -68 194
6952A94J61l17k4L1k2n3L1O4j9k01J11k85L21q0K39n5N2k65L31m31K53J48n62
$$ 194 355 38 14 45 23 -30 1 65 46 -155 -44 -329 -8 -88 151 96 148 -117 214 -217 36 184 -378
6975c78K69K12k22J85k53K66J6l86L32L7j25q8J10P5QM2l07M27k90j19L71k9K00
$$ -378 -109 103 -119 66 -187 79 95 -291 41 78 -47 -135 -25 50 58 100 -207 220 -70 -189 182 153 353
6998C53m36j4Q3P1j55k51L33N9k57L46k51K87J72l15j58Lj20K10r7K0M2L23n42
$$ 353 -83 -97 -14 57 -98 -349 -16 43 -214 132 -119 168 340 25 -133 -130 -250 -40 -137 -117 -75 248 -294
7021b94M40k68K66j45k69j10M54J43j19Q4m89K46L71k59j37K4L3P4k79N11j53
$$ -294 146 -122 144 -1 -270 -380 74 217 98 182 -307 -61 310 51 -86 -62 -29 45 -234 277 124
7042A24l4Jo1J09l72q0M78o4k48J89J18j10k76L46j86J89J20j99j53K5L46l92
$$ 124 90 91 30 139 -233 -313 165 101 -147 42 160 50 -226 120 -66 123 243 44 -109 -84 262 -130
7064a30r4K57r9J85j67Q5J10k78k79M36R2j86l31K76J09J11m7O4j20R8N9l16J26
$$ -130 -224 33 -66 119 -48 37 147 -131 -410 26 118 -68 -399 -123 -14 97 50 114 -6 92 151 -165 -39
7087c9j87M71m46L33l63K03j50J45r9K08M6l06K92k4J50k32K89n07N6L05l5l03
$$ -39 -226 245 -201 132 -231 -28 -178 -33 -132 76 122 -184 108 84 234 2 291 -216 -160 145 110 -193
7109a93K42M7R4k39O0l42N35j04J1N7j49Kl99L58m8K7k5L0Jo4J77k16L13j66r1
$$ -193 49 96 190 -49 11 -331 204 100 111 168 19 21 -378 -20 -68 -41 -66 -36 -35 -99 78 -138 175 9 -82
7134h2p6K28l03L32j40k01L48r1j24J07O1J91n8R8j96k09M2R4R4or8M3J11j38
$$ -82 -158 70 -233 99 -41 -242 106 15 -109 -2 59 250 192 290 94 -115 -73 21 115 109 11 54 165 27
7158B7K47k69O3p7P7l5J60m17K84j07O8NJ51j07j08K82j78k5M2l39M11j22j02
$$ 27 274 5 68 -9 68 33 193 -224 60 -47 21 26 177 70 -38 244 66 41 83 -256 155 33 -69
7181f9L61j82m7r1J26m14K98L47k16j69P4j3K06m8J15l53J20j35K9j63K20L7j19
$$ -69 292 110 63 -28 98 -316 -18 329 113 -56 18 5 211 163 278 -75 45 -90 -61 -224 -4 33 -86
7204h6J02M8k01L25n5m57N9J40K13o4K7r1J60j83K67l55J07K88m15P2J0o4L19
$$ -86 16 64 -137 188 133 -324 -265 -125 88 24 51 -40 120 -63 204 -151 -44 244 -171 -99 -89 -153 166
7227A66l33j84M18o2J82j24m20K02N4R4k1r7P8K18q8j85K84j52k0J40k12L48l87
$$ 166 -167 -351 67 5 187 63 -357 -155 -101 -7 -28 -125 -47 171 83 -102 182 30 10 150 -62 286 -101
7250a01J3j24M52l40lM00l95j35L29o9J94o8m7j06j2p3N8Nr5J44j20L3l7%J91
$$ -101 -88 -212 240 -100 -103 297 -98 -233 96 27 221 153 106 0 -12 -85 -27 -22 -117 27 -93 -60 -97 -97 94
7275I4m3J29j29k76J51J42k30R3J31p3K1k32M14j13j08r1K48M3k42J11K6j68k5
$$ 94 51 180 51 -225 -74 68 -162 -69 62 -11 10 -222 192 79 -29 -120 128 171 -71 40 66 -102 -127
7298a27K44N1r4q7l4J69R2m11J75j51J34J18j88L24k65N5j12J61m37M32R5M5j67
$$ -127 117 168 74 -13 -47 122 214 -197 -22 -173 -39 79 -109 215 -50 5 -107 54 -383 49 144 189 22
7321B2K14n01J89J87p2R1j76J50l25K57k27K30k25K92k62J23L07m66o6M40j92
$$ 22 236 -265 -76 111 39 130 -46 104 -221 36 -191 39 -186 106 -156 -33 274 -192 -258 182 -10
7342a0j32R2M21m38K39J09m14K66j38J01j95K38k44L97m6j21k63R7J89m5J88l22
$$ -10 -142 -50 371 -67 172 281 -133 133 -5 96 -99 139 -105 292 246 125 -138 -41 148 103 291 -31
7364c1R5q9M4j23K52n9j46J75R2k87O2kL35n51M40k19J90k3l48J22K5J63j07k56
$$ -31 64 -25 19 -104 148 89 -57 118 210 -77 -15 -17 318 -233 207 -12 178 155 -193 -71 -46 117 10 -246
7388b46N44l46o3K00j47LL7J85j06N8k80K25M7o3j52n6J31j81O0K13m6k07P9o5
$$ -246 298 -48 -111 89 -58 -55 -18 167 61 119 -161 64 111 48 -104 -160 -29 -210 -150 63 17 -190 -111 -176
7412a76J37L31k06Q8k70J60l8L7j61J08J09j07r2J27K01j87k03K11j0L3j38j29
$$ -176 -39 292 86 174 -96 64 26 63 -98 10 119 12 -80 47 248 61 -142 69 59 92 -46 -175
7434a75M51j57r5k7J01J92j80j30P7L1K36m00J57J49j80j10k12L21j24J27J01
$$ -175 276 119 24 -3 98 290 110 -20 57 88 324 -76 81 230 50 -60 -272 49 -75 52 153
7455A53q9J3p5n5J40k52O6L45l46k7J22J57O7k04R7J35k87K18j41j74J55j27J13
$$ 153 64 77 2 -53 87 -165 -99 246 -100 -127 -5 152 219 15 112 247 -40 178 37 -137 18 -109 4
7478DJ26l45K70p9K11p7Q9j42m0O6p7q5k27K43K72n15L26p2Lo0J4q6K08k07K37
$$ 4 130 -215 55 -24 187 110 199 57 17 83 6 -79 -306 -63 209 -306 20 -52 -49 -109 -95 -181 27 -180 57
7503E7j1k63L22l91K74q8j46N54k58J63k00J11l25J92RR3j14n7J78j29O2p8K78
$$ 57 46 -217 105 -286 -12 -100 -246 308 50 213 13 124 -201 -9 0 93 -21 -78 100 -29 33 -45 233
7526B33j26j5j15q0O8j31K56l97J46j1L69l63K75k93J42Q8j96K3J52L00j86J7
$$ 233 107 92 -23 -103 -35 -166 90 -307 -161 -172 197 -166 109 -184 -42 46 -150 -127 25 325 139 156
7548A56l03J10L58l29J84L5l08N2q2J20l32L93K07l02M1l2j4K02L0O4n8j22o7
$$ 156 -147 -37 321 -8 176 211 -97 -45 -127 -7 -339 54 261 -41 0 -32 -46 156 186 250 192 70 3
7571Ck12K69j29J21k22JL14k27J60k01N43m30k2j79J79L7p5M3J92o72N83M04j58
$$ 3 -209 60 -69 52 -170 -169 145 -82 78 -123 420 -10 -32 -211 -32 5 -70 -27 165 -507 76 480 322
7594C22k28n85K38J93J8M0P1k1Q6k46l9J8L37l21M39l42M49l92k3k1L32m01j24
$$ 322 94 -491 -253 -60 -42 -2 69 48 134 -112 -151 -133 204 -117 322 -20 429 37 14 -7 325 -76 -200
7617b00K60j46rJ43k06J42k6K25J00l28M9n5K49k76R9p0L4J3K4L7j99J81J53j72
$$ -200 60 -86 -95 48 -158 -16 -42 183 283 -45 4 -51 198 -78 21 -49 -15 -2 22 59 -140 41 194 22
7641B2n3K4k97L87k45J07J92J46l59J4l3J35N9m31M29j84J25k63J10O6K24k09
$$ 22 -31 -7 -304 83 -162 -55 137 283 -76 -62 -95 40 99 -332 97 -87 38 -225 -115 -49 175 -34
7663c4L25m18R7m8p5J5K60R1j39J81j21l20J02L12k24P1K26m67O4J19k7k92L30
$$ -34 291 -127 -30 -78 -153 -138 122 213 74 255 134 -186 -84 228 4 75 301 -166 -102 17 -10 -302 28
7686B8O0j83J8j00K58Qj1mO9J8j14m30L23K34j03k7O6M8j50k2J65k57r2K92n4
$$ 28 88 -95 -77 -177 81 89 78 74 143 161 47 -383 -60 174 71 44 110 158 8 -14 151 -106 -198 94 40
7711D0M5m56M61n9K3K54k80J28k06J75j17j09M1J14l8J68j20j22j37K25m1n1K91
$$ 40 85 -371 90 31 54 308 28 156 -50 125 8 -101 -60 54 16 184 64 -58 -195 30 -11 -62 229
7734B29j82j80J09K21O0k23k64L88k06l5j23M0M10l41M4k5J99k79O8m9J12j19
$$ 229 47 -133 -24 197 257 34 -230 158 -48 -83 -206 -166 244 -97 -53 -78 121 -158 -90 -139 -27 -146
7756a46K8J23j87J87j39K87j21k65K18o2j0K12j22J34k33J42n8K06j18j29J92
$$ -146 -118 5 -182 5 -134 153 32 -233 -15 -77 -87 125 3 137 -96 46 -12 194 76 -53 139
7777A39m4j25R7J75n13M11j54r8k8K75qq9J4K23m89J24J00n2J50j88RK7Q1p1r6
$$ 139 95 -30 67 242 -271 140 -14 -112 -140 135 127 38 52 275 -214 -90 10 -42 108 -80 -71 -44 37 -34 -130
7802a30J75J91M2m20J68J04K5m44K66J74J9j01J3m0K8k16J14m5m7q0N0r7R8K34
$$ -130 45 236 278 -142 26 130 155 -289 -23 151 170 69 82 42 70 -146 -32 -77 -124 -204 -154 -251 -153 81
7826H1o4R1K2m2J5m11M96l13Lr0P8J98L8J18j78N5k99K03J05n3Q3m4j0m5l60J44
$$ 81 17 108 130 88 103 -308 188 -125 -122 -212 -134 64 102 220 42 97 -202 1 106 53 136 92 82 37 -323 -179
7852a79K75j2M6j83j20L22l92J80p4K65l18J75N7L4j05k30L8M16l33O8o0K26j59
$$ -179 96 84 130 -53 -173 149 -243 -63 -137 128 -190 -15 42 76 -29 -259 -221 195 -138 -70 -130 96 -63
7875f3J88j12M6P7j02J97j75j53o3M32k31l1J63q6r5kK35j68k99M94l28J22j43
$$ -63 125 13 59 136 34 231 56 -97 -160 272 41 10 173 87 -8 -10 225 57 -242 252 -76 46 -97
7898i7m5J92M4j98J5J63l4P4k73l6N3J92N8o0j82O0j62J75O2R9J38k27J49l2k60
$$ -97 -142 50 94 -104 -89 74 40 114 -159 -195 -142 50 108 48 -134 -74 -236 -61 1 100 238 11 160 128 -132
7923a32K93j88j62L89l43J46j81L6J15J67Qpj62K83n9j50m5JK36j70J07q5N6q
$$ -132 161 -27 -189 200 -143 3 -178 -142 -27 140 148 141 -21 262 203 53 8 9 245 75 182 97 153 145
7947A45j7r2j34Q7J99j60J70l30M5J58J12j67R6k7j77J97q9l45K11J09nR2K96
$$ 145 128 36 -98 -11 188 28 198 -132 -87 71 183 16 112 85 -92 105 16 -329 -118 -9 -14 78 374
7970C74n83K54Q9q3R6J44p0k7k22J81j66K9j29J49j17K36O5k13j60K54j72J2J20
$$ 374 -209 45 134 51 147 291 221 194 -28 153 -13 16 -113 36 -81 155 220 7 -153 101 -71 -59 61
7993F1j44r3p0M84l21J32P7k02J62j08j0m2Q9J8mN5J16j63p1q5l5J12P1r1J48
$$ 61 -83 -176 -246 238 -83 49 126 -76 86 -22 -32 -74 15 33 29 84 200 37 -34 -119 -154 -42 29 -62 86
8018H6j84J88j23K6N0J12k7q7j9J0o3O3j6k75L99l67J51j97J13K43p0J94Lj76
$$ 86 -98 90 -33 -7 43 155 128 41 22 32 -31 32 16 -259 140 -227 -76 -273 -160 83 13 207 210 34
8042C4O0N7r9n4j81K43Q2O8j67lj58J90l73J67N47m51m1k6J21J17J5l33K74l45
$$ 34 94 151 52 -2 -183 60 142 210 43 40 -118 72 -301 -134 413 -38 -79 -105 16 133 148 -185 89 -256
8066b56K25Q5k08m7L95k1k51J37J92k72r5J80j01K19j52K84l62Q9R2j87R4M1k05
$$ -256 -31 54 -154 -201 194 173 -78 59 251 -21 -116 64 -37 182 30 314 -48 41 133 -54 40 81 -124
8089a24O0j53r9K33J62k11K57J22k95J19j29K43q5j94K05k76L14j37k53K01J18
$$ -124 -64 -217 -316 -83 79 -132 125 247 -48 71 -58 185 100 -94 111 -165 149 12 -241 -40 78
8110G8j81J54j12N9M7J80k53p6J50N6J70k44o5J77M6k46OJ30r0K20m1l64L81l7
$$ 78 -103 51 -61 -2 45 225 -28 -104 46 102 272 28 -37 140 186 -60 -54 76 -14 206 165 -199 182 145
8134A45l38L71k31K74m6k77J10J31j02K34m20J68m0N8l4j74L04k68K16j2j52j48
$$ 145 -193 178 -53 221 175 -102 8 139 37 271 -149 19 -21 37 3 -171 133 -135 81 69 -83 -231
8156b31M12j51n0OQpl0Q1j46J89J05j08l3k1K16l03q4J44l22K15L67j94P6j30
$$ -231 181 30 -20 -14 -6 -13 -43 38 -108 81 186 78 45 24 240 -63 -147 -3 -325 -110 257 63 139 9
8180Ik3K29J45k72Q6r4j66l08N40k32k6
$$ 9 -14 215 360 88 174 80 -86 -394 146 -86 -112
8191a12
$$ Imaginary data points
##PAGE= N=2
##DATA TABLE= (X++(I..I)), XYDATA
0@%%%%%%%%%%%Qj6J6j6K4l2M0m8N6o8P7r1J13j35J52j76K08k40K74l14L60m09
$$ 0 0 0 0 0 0 0 0 0 0 0 0 8 -8 8 -8 16 -16 24 -24 32 -36 41 -50 63 -72 80 -96 112 -128 146 -168 192 -217
33b17M64n26N93o65P45q35R32j038J154j279J417j569J734j914K111k326K563
$$ -217 247 -279 314 -351 394 -441 491 -547 607 -672 745 -824 910 -1004 1107 -1219 1344
50A344k824L111l429L782m177M621n125N702o368P151q083R218j0638J2467j4923
$$ 1344 -1480 1631 -1798 1984 -2193 2428 -2697 3005 -3363 3788 -4295 4923 -5715 6752 -8171
65h171J8415k3810L3310n4839J91807j4050l47612J84016Q1830r4876M8880O3928
$$ -8171 10244 -13566 19744 -35095 156712 142662 -204950 -20934 60896 -33980 14900 78828
77G8828j90875l4362J84707M3911j19598K5152m02q3161P4726J22407p8617o5321
$$ 78828 -112047 -146409 38298 82209 -37389 -12237 -12639 -95800 -21074 101333 22716 -42605
89d2605K6312J8353K6893L5963j5671n0946m6610M5332O2206l4555m3642J284
$$ -42605 -16293 2060 28953 64916 49245 -1701 -48311 -2979 59227 24672 -18970 -17686
101a7686k7221n88O5390K8023p2896m3461O3175K0025k9938N6464n885j07063
$$ -17686 -44907 -45495 19895 47918 -24978 -68439 -5264 14761 -15177 41287 35402 -71661
113g1661L6971R4901l5715j9517K7945n1087l5955P5364M6082o6942l6443K9580
$$ -71661 -34690 60211 24496 4979 32924 -18163 -54118 21246 67328 386 -36057 -6477
125f477k3646J549Q0325k1801q5916J9889M2904J592J6889l52l9740k3539L1355
$$ -6477 -30123 -28574 51751 29950 -55966 -36077 6827 8419 25308 24956 -14784 -38323 -6968
138f968M3877j8884l0207J0382j1317p448M2159J2005l8655k5554J4793K4526
$$ -6968 36909 18025 -12182 -1800 -13117 -20565 21594 33599 -5056 -30610 -15817 8709
150H709l426K694N154m0880j659N7726n231l3260J3531p150j7278K9000K2938
$$ 8709 5283 7977 13131 -27749 -29408 28318 23087 -10173 3358 -3792 -21070 7930 30868
163C0868k9252k9121K1566J4563k0902J9292J7359m3932m786L8385n375p302J1807
$$ 30868 1616 -27505 -5939 8624 -12278 7014 24373 -19559 -24345 14040 8665 1363 13170
176A3170j6148j8043J7669K9002q870k9597P141Q235j3451K0153J2187l2341q078
$$ 13170 -2978 -21021 -3352 25650 16780 -12817 -5676 2559 -10892 9261 21448 -10893 -18971
189a8971J7475K302J240L465k899j5155j919K9566J648k4792J0095L664j7623
$$ -18971 -1496 806 2046 5511 2612 -12543 -14462 15104 16752 -8040 2055 5719 -11904
202a1904J6618J5906j8745j2705O828R463k259o97N367j8069q447K8352J387j8991
$$ -11904 4714 20620 1875 -10830 -4002 5461 3202 2505 7872 -10197 -18644 9708 11095 -7896
216g896O955q36q286J1007J0023m506j2473o73J2018k948L38J1430j5942j2233
$$ -7896 -941 -1777 -10063 944 10967 6461 -6012 -6685 5333 2385 2723 14153 -1789 -14022
230a4022J6674K848m720L932n483q987J09J4664P977j8243m509J2904p296P33
$$ -14022 2652 5500 780 4712 -771 -9758 -9649 5015 12992 -5251 -9760 3144 -4152 -3419
244c419J4684r993r816Q244K350k088K092M416n210j1637J0588J0847j4491L94
$$ -3419 11265 1272 -8544 -300 2050 -38 2054 6470 1260 -10377 211 11058 -3433 -3039
258c039P398j0988K303J1437o067o767K426N399p03m595O429k391j0381J1476
$$ -3039 4359 -6629 -4326 7111 1044 -5723 -3297 2102 1399 -3196 3233 842 -9539 1937
272A937O291j3102K813N885o654Q70N968M86o670m073P539o26m086R707m842j2263
$$ 1937 8228 -4874 -2061 3824 -2830 -1960 4008 4494 -2176 -6249 1290 664 -3422 6285 1443 -10820
288a0820J0305O962o452L88P58l731k072M488P015p047o296Q298j948l613R895
$$ -10820 -515 6447 -5 383 1141 -2590 -4662 -174 6841 -206 -6502 1796 -152 -3765 6130
303F130k422q378M170K041j994m72K628J120q235J351J0711m830m672N842m117
$$ 6130 3708 -4670 -500 1541 -453 -925 1703 2823 -5412 -4061 6650 1820 -2852 2990 -1127
318a127j899O570j322m835J71L514J216m808K877M038p752J552P783o620k097
$$ -1127 -3026 3544 2222 -2613 -2442 1072 2288 -2520 357 4395 -3357 -1805 5978 -642 -2739
333b739N690l123k587K848K931j226m488L307J970m726M291J937r249K191O828
$$ -2739 2951 -172 -2759 89 3020 1794 -2694 613 2583 -2143 2148 4085 -5164 -2973 3855
348C855l251j832J183R50o95j384L898n35n375M339J076o037M662K595n478O57
$$ 3855 604 -1228 -45 905 210 -1174 2724 2189 -3186 1153 2229 -3808 854 3449 -2029 -1372
364a372K522K69j377m76K588k987k969O627j695n227M050Q96k980L324O55k737
$$ -1372 1150 1419 42 -434 2154 -833 -3802 2825 1130 -4097 -47 849 -2131 1193 1848 -889
380h89r40K158K125l274j061M843l482l097N973j013k713K475j202k033J241K063
$$ -889 -1829 329 2454 -820 -1881 2962 -520 -3617 2356 1343 -1370 1105 -97 -2130 -889 1174
396A174L26l743J7L674k697K33M128m144j448L962o87j564P55M97k10j957J471
$$ 1174 1500 -2243 -2226 1448 -1249 -1016 3112 -1032 -2480 1482 795 -769 -14 483 273 -1684 -213
413b13J572k713J592J807m675J251L671k542j228J094O08Mj744J683O47k615L028
$$ -213 1359 -1354 238 2045 -2630 -1379 2292 -250 -1478 -384 224 228 -1516 167 814 -1801 1227
430A227O44m243K084J995k217N36M35r23r5j49J896q10k345L211l51l230K907
$$ 1227 1871 -2372 -288 1707 -510 26 461 -462 -557 -706 1190 380 -1965 1246 895 -2335 572
447E72J054k562J090k43q59L93J652O13k267j057L202j062j871L168r58k688K170
$$ 572 1626 -936 154 -89 -948 -555 1097 1710 -557 -1614 1588 526 -1345 1823 865 -1823 347
464C47N9p47Q28j10k2j316K59K225j738o77K500k163p51K708p47j380J099k51
$$ 347 406 -341 487 377 355 -961 -702 1523 -215 -892 1608 -555 -1306 1402 655 -725 374 123
482A23L64q65J82J149j517N10J219k561N36K423j592n77Q22k22M90o85M99Q22
$$ 123 487 -378 -196 953 -564 -54 1165 -1396 -860 1563 -29 -606 216 -6 484 -201 298 1120
500A120j881R15Q85k021Q15J513j514l9M47p78N47j00L65l31j338J595Q56k225
$$ 1120 -761 154 1039 -982 -167 1346 -168 -207 240 -538 9 -91 274 -57 -1395 200 1056 -1169
518a169J388O83j816N99R63r64J3P42N6j149n16K114o45j480J741N2j394P22L47
$$ -1169 219 902 -914 -315 648 -316 -303 439 495 -654 -1170 944 299 -1181 560 612 -782 -60 287
537B87q16M80L08k16k83k62Q71k53p45J560j029p37J372l30q49M74N31m9q00K1
$$ 287 -529 -49 259 43 -240 -502 369 116 -629 931 -98 -835 537 207 -642 -168 363 314 -486 -465
557d65J141r54PJ154j399o92J987o83p35O32J7j57m18O76L54r39O41M29j303M03
$$ -465 676 -278 -271 883 -516 -1208 779 96 -639 -7 10 -147 -565 111 465 -474 167 596 -707 -304
577c04J171j247KM12n78J13O72q2l47k60O26K96j245Q68N76j066P96m47k07O24
$$ -304 867 -380 -378 34 -544 -431 241 159 -188 -448 178 474 -771 97 673 -393 403 -44 -251 373
597C73j27n3n1n32M78L31j204P51M91p02N2N66m62K86k9j7j81p05J176p2p30M68
$$ 373 246 193 142 -390 88 419 -785 -34 457 -245 -193 373 -89 197 168 151 -30 -735 441 369 -361 107
619A07n3q78J272J51q23K38J60k28r5K6L14j42o13J096o69l12J338o05p65M52
$$ 107 54 -824 448 599 -224 14 174 -54 -149 -123 191 49 -564 532 -137 -449 889 284 -481 -29
639b9J46k52M82n48L52k7n40J025r71rR84o77m8Q8k73M59j2j08rl50J87Q15j077
$$ -29 117 -135 347 -201 151 124 -416 609 -362 -371 613 -64 -112 -24 -297 162 150 42 33 -317 -130 685 -392
662c92mJ029j000K17J44l3k50K33J41p1n31K82N12o23L40l7m27N76J97r53O25
$$ -392 -396 633 -367 -150 -6 -39 -289 -56 85 14 -517 -235 277 -346 -6 -43 -470 106 303 -650 -25
683b5J63km4k22N23o7m77J86P3k88K98p3j66J00P4M37m32k94L32j80j12N24j48
$$ -25 138 136 92 -130 393 326 -151 35 108 -180 118 45 -121 -21 53 490 58 -236 96 -84 -196 328 180
706A80o18O83n7m39K60K03n00L81J5K35k79r3L38k09m66Q59k77l84N96p64J85
$$ 180 -438 245 188 -251 9 212 -288 93 108 343 64 -29 309 100 -366 493 216 -168 428 -336 -151
727a51O11n42j74j3K73K85n80L17K99j80l41L18j68K40K5l92J04J78k59M06l10
$$ -151 460 -82 -256 -269 4 289 -291 26 325 145 -196 122 -46 194 219 -173 -69 109 -150 256 -54
748e4k15M59l49M28L21p74N56n20K85p3j16K14K76k66L25l47k07P16K21o04k69
$$ -54 -269 190 -159 269 590 -184 372 -148 137 64 -52 162 438 172 497 150 -57 659 880 276 7
769GM85j248N74J34p90Q26K74n97L44p57Q36L31o85j37MO13l54j06j69M64l65
$$ 7 492 -756 -182 -48 -838 -12 262 -335 9 -748 88 419 -266 -403 -399 214 -140 -246 -415 49 -316
790c16N12m78K5Q7J74M35n73L08n55L42K02Q9j00n95Q25k47n37L31J21j72j17
$$ -316 196 -282 -257 -170 4 439 -134 174 -381 -39 163 252 152 -443 382 135 -402 -71 50 -122 -239
811b39K82j96L38k70K4K22j32k02L8q2M93n97M23l25j71O28n28N41j29j11l07
$$ -239 43 -153 185 -85 -61 161 29 -173 -135 -217 276 -321 102 -223 -394 234 -294 247 118 7 -300
832c00J075j170L0N38k63j06K90k46o33J268j01m54L2Q69n12m69j61M70l90P57
$$ -300 775 -395 -365 173 -90 -196 94 -152 -785 483 382 -72 -40 829 317 -152 -313 157 -233 524
852E24o55L64n66N24j79J5J7q5Q0l5j18K34k3jj21l93N71l59K48Or3K77j31O7
$$ 524 -131 233 -333 191 12 27 44 -41 39 4 -114 120 97 96 -25 -418 153 -206 42 48 -45 232 101 168
876A68K33l77k5Q5o2r9N6O2p0J64k19K06k90l0K20J22K1k40k9j40K04J45j38J0
$$ 168 401 24 -1 84 22 -77 -21 41 -29 135 -84 122 -168 -198 22 144 165 -75 -104 -244 -40 105 -33 -23
900b3R1J38q7q9j33j13j0L37l6k3K8m25K99K9J6N9k90J60l9L4Jm0N9J71J26j45
$$ -23 68 206 119 30 -103 -216 -226 111 75 52 80 -345 -46 -17 -1 58 -232 -72 -111 -77 -76 -116 -57 114 240 95
926I5k21J56K20kj24l61J16J73j9K0k01L5J26k2J27j7k13K02j10N9l97L7L73k56
$$ 95 -126 30 250 248 124 -237 -121 52 33 53 -148 -113 13 -9 118 101 -112 90 -20 39 -358 -321 52 -204
950b04J23J34m6j62j80L21mJ09j5J4l29J71m5L29l69L13m13J69M45j74l75j06
$$ -204 -81 53 7 -155 -335 -14 -18 91 76 90 -239 -68 -113 216 -153 160 -253 -84 361 187 -188 -294
972b94N05r8l14J74j65J3j58L38o3J31J5k38J52j99J78j08N8mj22J48Q7L06l13
$$ -294 211 113 -201 -27 -192 -179 -337 1 -62 69 84 -154 -2 -201 -23 -131 -73 -77 -199 -51 36 342 29
995B9k43K22j88K33j50K81j96J10K1j60r5K97P2j19r7m5L4J46p8m7j79K26o4l
$$ 29 -214 8 -180 53 -97 184 -12 98 119 -41 -136 161 233 114 17 -28 6 152 74 27 -152 74 10 7
1019Gpn3l9J2J8J32L5j23J36o12M23J38J79j78m8lJ20J31k68k22q6J85J34QM5
$$ 7 0 -53 -92 -80 -62 70 105 -18 118 -494 -71 67 246 68 20 17 137 268 0 -222 -308 -123 11 19 64
1044F4l45J91J11n1J65K26m08N4J8j98K17m4J96m93L23j72J60J60k70k71M66n0
$$ 64 -281 -90 21 -30 135 361 -47 7 25 -173 44 0 196 -297 26 -146 14 174 -96 -367 99 49
1066D9l6k18J05K15j45J16p4Q1j01o2J1K30j41j09O1j74J91o6K23j14p0m75N76
$$ 49 13 -205 -100 115 -30 86 12 93 -8 -70 -59 171 30 -79 -18 -192 -1 -67 156 42 -28 -503 73
1089G3k9j39M58m56M50n17j91O07q0j40r7k0Q4P0j16lm7K99m44K54j46J52L0Q9
$$ 73 44 -95 363 -93 357 -160 -351 256 176 36 -61 -81 3 73 -43 -46 -93 206 -238 16 -130 22 52 141
1113A41o2J75j25k87J66k20M39j93j10Q9Kq6j12L22r5R0j90K9mp2N6K48k70J13
$$ 141 79 254 129 -158 8 -212 227 34 -76 13 15 -71 -183 139 44 134 -56 -27 -31 -103 -47 201 -69 44
1137D4M1k8l18N73l92J00P6m3j6n1j02k6L40l35L30m26L13k11k05O54k24l70J98
$$ 44 85 57 -261 312 -80 20 96 53 37 -14 -116 -142 198 -137 193 -233 80 -131 -336 318 94 -276 -78
1160g8n3M33k65r1O6j83M13j67lr6l18J72L07k29L56j01k66R0k05O17m43K76l57
$$ -78 -131 302 37 -54 12 -171 242 75 72 -24 -342 -170 137 -92 264 163 -103 -13 -218 399 -44 232 -125
1183a25K35O2n47K62R2N4Lj52K78N0n9j15R5l5j71M4k29J66J55k8J29l2J2k9j69
$$ -125 110 172 -375 -113 -21 33 36 -116 162 212 153 38 133 98 -73 -29 -258 -92 63 35 164 132 144 115 -54
1208e4m38M71k2Ko4j11K97O3O2k41J31j60O0J48J8j91l7j5K9k71M37P7j5j87K6
$$ -54 -492 -21 -43 -41 -105 -216 81 144 206 -35 96 -64 -4 144 162 -29 -66 -81 -52 -323 114 191 176 -11 15
1233A5j65J81M33m84l7K39l1k21Q1p9J65j0l21L84j58kK4k18L28j15j68L25k05
$$ 15 -150 31 464 -20 -57 182 151 -70 11 -68 97 87 -234 150 -8 -10 14 -204 124 9 -159 166 -39
1256c9J17l04K33j40K35L5k45P2K13m16J78r9L14j12K70k79K2j41K86j10M1j87
$$ -39 78 -226 7 -133 102 137 -108 -36 177 -239 -61 -160 154 42 312 33 55 -86 200 90 131 -56
1278e6L50n19K10j55J92j77J58Q8l24K6J25m0K68q7K3J3j05K63k38J98j78J66
$$ -56 294 -225 -15 -170 22 -155 3 91 -233 -207 -82 -122 146 59 82 95 -10 253 15 213 35 201
1300B01k28J13j95L49k16j40j95K08oL17n36L57p7K32k66M31j41o0rl59J56J2
$$ 201 -27 86 -109 240 24 -116 -311 -103 -109 208 -328 29 -48 184 -82 349 208 148 139 -220 -64 -52
1322e2q7J62K4r6K35k90OkpP4J41M7j8j45M26n19K95m31P9J24o0n46M5P27n48
$$ -52 -139 23 47 -49 186 -104 -98 -100 -107 -33 108 155 137 -8 418 -101 194 -237 -158 -34 -94 -640 -595 132 -416
1347d16K74M71r08Q86n02o1j04k32J222j219P00j49j9k03K51L69l99P55j384J091
$$ -416 -142 329 -579 307 -195 -256 -360 -592 630 -589 111 -38 -57 -260 -9 360 -39 716 -668 423
1367D23m97m25J59m94R0M27Q66j265R99l03k65K37L10J58p60O13j105L31J43N70
$$ 423 -74 -499 -340 -834 -744 -317 549 -716 283 -20 -285 -48 262 420 -340 273 -832 -501 -358 212
1387B12O97q52r1k32m3J55O30n47J24K26n41L37kj86P2J01j13j61q2J51J95k1
$$ 212 909 57 -34 -266 -309 -154 476 -71 53 279 -262 75 73 -113 -41 60 -53 -214 -296 -145 50 29
1409B9j64K60K98n93P9L88k83O9k11J45j72Q8K76pj47pk61m0J05K16q1J64k95
$$ 29 -135 125 423 -170 -91 297 14 83 -128 17 -155 -67 209 202 55 48 -213 -253 -148 68 -13 151 -144
1432a44K24k76K49j13m1J30r5j52M50k20L43n31L41m35M11J12m24L07n17M40j22
$$ -144 80 -196 53 -60 -101 29 -66 -218 232 12 355 -176 165 -270 141 253 -171 136 -381 59 -63
1453f3J6qJ66k59K57j75m8Oo8L24K1j43J74n66RP69j15m92M08k46P61r07K36K72
$$ -63 -47 -55 111 -148 109 -66 -114 -108 -176 148 169 26 200 -366 -357 412 297 -195 213 -33 728 -179 57 329
1477C29n51k66J313l33k30N3K22q63j79M54j98j44K42M18k99m8l32q3M94J66l6
$$ 329 -222 -488 825 492 262 315 537 -326 -505 -51 -249 -393 -151 267 -32 -80 -412 -495 -1 165 129
1498A29q8p3q6J8p4K42Q2o62N62l11N06k49N54L37j269J40M57j89n05M82Q6r0
$$ 129 41 -32 -118 -100 -174 68 150 -512 50 -261 245 -4 550 887 -382 -242 215 26 -479 3 89 -1
1520apo9J71R1K23m27K0L88n17K97l8j43J30j05Q8j61J34j05R8Jk71j03K72M0
$$ -1 -8 -77 94 185 408 -19 1 389 -128 169 131 -12 118 13 101 -60 74 -31 67 68 -203 -306 -34 6
1544FK4j51j7J48j66O3R8j40J28L4j83J99O0j39M23k19l33K69n3j11j16K0Q9k3
$$ 6 30 -121 -138 10 -156 -93 5 -135 -7 27 -156 43 103 -36 387 168 -165 104 51 -60 -176 -156 -67 -90
1568i0J7M5k7L5J88l12p7L15p6Q9M6k57K38k59j3p7L39k78K3q0K11k26K8J49k06
$$ -90 -73 -28 -55 -20 168 -144 -221 94 18 107 153 -104 134 -125 -138 -215 124 -154 -131 -211 0 -226 -198 -49 -255
1593b55K48km7l12L10J88r1j35M8J78j6n6j5O0j27j45K49N3j59J31q0J0J4J20
$$ -255 -7 -9 -56 -368 -58 130 39 -96 -48 130 114 58 43 103 -24 -169 80 133 -26 105 25 35 49 169
1617A69k38KO5O9K44l09M6nK96j8n06L30j07p1j43K19k43K56j40J81k86N3K56
$$ 169 -69 -67 -2 67 311 2 48 43 339 321 -185 145 38 -33 -176 43 -200 56 -84 97 -189 -136 120
1640A20k96K37L54m32J42m6k11K02n5k2j01n3o4K07K37k86o5Q7J50l24J85J26
$$ 120 -176 61 415 -17 125 79 -132 70 15 -7 -108 -161 -225 -18 219 -67 -132 -45 105 -219 -34 92
1662I2j49j10K85j38K68k09j54J9Q5k41O02m63L7j78Q8N3J30j18N8j05K42l22
$$ 92 -57 -167 118 -20 248 39 -115 -96 -11 -252 350 -113 -76 -254 -166 -113 17 -101 -43 -148 94 -228
1684b28N1K01O7l53J45K65l96J40J30P8j32L49n01Q6NQ8K90l61R4K15m09J69j49
$$ -228 -177 24 91 -262 -117 148 -248 -108 22 100 -32 317 -184 -98 -93 -5 285 -76 18 233 -176 -7 -156
1707a56L25j26J64k38k87M08k96K01l79M71j08L83m91K74l20K31K04m22L41j24
$$ -156 169 43 207 -31 -318 90 -206 -5 -384 87 -21 362 -129 145 -175 56 260 -162 179 55
1727E5l45K49k14J75J26k68O49n92J04p8J52Rj72O2J63k64M76m14J6L82j6j84
$$ 55 -290 -41 -255 -80 46 -222 427 -165 -61 -139 13 22 -150 -88 75 -189 287 -127 -111 271 255 71
1749G1j89J06K07k07O1J3l30M69k10J53m4r4J99l08K61j81J61j8q1n6j28K65j29
$$ 71 -118 -12 195 -12 49 62 -268 201 -9 144 100 6 205 -103 158 -23 138 120 39 -17 -145 120 -9
1772ij49p0K68M8k8j42k38M75p8k51J49r6K36p4k19L17k99J40L29j25j50n3j61
$$ -9 -158 -228 40 88 60 -82 -320 155 77 -174 -25 -121 115 41 -178 139 -160 -20 309 184 34 -19 -180
1795a80Q4J73j2j9m15L81q2j48J96N7j90J36j08J81j51J17K23m96K04L8r4N7J37
$$ -180 -96 77 65 46 -369 12 -70 -218 -22 35 -155 -19 -127 54 -97 20 243 -253 -49 -11 -105 -48 89
1818H9j40J98k12M2j58J88k21L27m33O5L89k69K26j39p7J05j34L56J16k04l59
$$ 89 -51 147 -65 -23 -181 7 -214 113 -320 -255 134 -135 91 -48 -125 -20 -154 202 318 114 -245
1839b45K86l94O63k60J48k6j34N0k12K75j54j53K99n0l80J89n4N3J21n7J7m13
$$ -245 41 -353 310 50 198 172 38 88 -124 151 -3 -156 143 93 -287 -98 -152 -99 22 -35 -18 -431
1861d31N01j34L23n3k3j83j05r5K77M5k07K64k00j27J90Q1j20KN0k75M02l09Q2
$$ -431 70 -64 259 206 183 0 -105 -200 77 122 -85 179 -21 -148 42 123 3 5 55 -220 182 -127 -45
1884d5n5J41J35p3m4K4J6mj46K29j42M8l15N5K39Q8l58J83Q7k6k7J35k45j1J71
$$ -45 -100 41 176 103 59 83 99 95 -51 178 36 84 -231 -176 63 151 -207 -24 63 37 10 145 -100 -111 60
1909F0J24k61p9P0oJ67j01j75K16K56m7k92L19n3k0j80K11l33L02j28p0L5p9J86
$$ 60 184 -77 -156 -86 -92 75 -26 -201 15 271 224 -68 251 198 178 -2 209 -124 178 50 -20 15 -64 122
1933A22j05j64K89k17R5j32Q0Kp4R8K68j72m6j73K11K49k88j84J46o9J62rj93
$$ 122 17 -147 142 -75 20 -112 -32 -30 -104 -6 262 90 44 -129 82 331 43 -141 5 -64 98 89 -104
1956a04J92rJ07R4l02P6N9o3l3j05J78l84J21K90l57K45J64k67QJ08lJ35j67q6
$$ -104 88 79 186 280 -22 54 113 50 17 -88 90 -294 -173 117 -240 5 169 -98 -90 18 15 150 -17 -103
1980a03n7L04j47r9J23J8J09l51Q9r4L13k52M7k3P7O8L8l44N32k52Q7j9l04J40
$$ -103 -160 144 -3 -102 21 39 148 -203 -114 -208 105 -147 -100 -123 -46 22 60 -284 248 -4 83 64 -240 -100
2004a00L89k79K36j94k94K50o4m3%J10l6n3R7qo4N0J4N6j21r4J50j6J05Q5k37
$$ -100 289 10 246 52 -242 8 -56 -99 -99 11 -25 -78 19 11 -53 -3 11 67 -54 -148 2 -14 91 176 -61
2029f1J61o8n0L2k77J40L23o0j21J20k8j9rk60K06m7m2R7M1n7j0k07J23l2L4K07
$$ -61 100 32 -18 14 -263 -123 200 140 19 139 111 92 83 -177 29 -18 -60 37 78 21 11 -196 -73 -105 -71 136
2055A36n9r1J53m3k20L2j54J36j63M27p2J20k30QJ92k48M3K9j22J31M5pm5k4n1
$$ 136 77 -14 139 96 -124 -92 -246 -110 -273 154 82 202 -28 -20 172 -76 -33 -4 -126 5 50 43 -2 -26 -77
2080g7R0J5j27J09L8m2K9j76O8Q4j52J20J9j25K47rk93J36j0O3k79K34J25R8l13
$$ -77 13 28 -99 10 48 6 35 -141 -73 11 -141 -21 -2 -127 120 111 -182 -46 -56 7 -272 -38 87 185 -128
2105a28J05M1l61L28j49J18l2j10J60L25m02J39j01L16k12j53L2K89j69K23r4
$$ -128 -23 18 -343 -15 -164 -46 -78 -188 -28 297 -105 34 -67 249 37 -116 -84 205 36 259 165
2126A65j5J10l38R5P2j87j7K29k02N6r1k50J78L91l75J56P7j12L2p4L30j73J50
$$ 165 150 260 -78 17 89 -98 -115 114 -88 -32 -123 -373 -195 196 -179 -23 54 -58 -26 -100 230 57 207
2149B07j27r6k0Nj41K52p7Rm7K53n2j80k7K80j39Pj05m3j6J33l34J81K33j32J80
$$ 207 80 -16 -36 -31 -172 80 3 12 -35 218 166 -14 -41 239 100 107 2 -41 -57 76 -258 -77 156 24 204
2174B04k66p4L6Q1Q2R2j37R3j91J32o3J55l35N9p4L33m0K6J2j84o0J09N6j65n0
$$ 204 -62 -136 -100 -19 63 155 18 111 -80 52 -11 144 -191 -132 -206 127 87 113 125 -59 -119 -10 46 -119 -169
2199a69L30r3j90J20n3N8R4k14k21L87J56j93R9r3K45k74L4o7P5k53N1K03q7K1
$$ -169 161 68 -122 -2 -55 3 97 -117 -338 49 205 12 111 18 263 -11 23 -44 31 -222 -171 32 -55 -34
2223c4j78J09j13K39q4p3J7L3k72M21j94n9L89j69mJ16L7k30k96L54j79m6M02
$$ -34 -212 -103 -216 23 -61 -134 -117 -84 -356 65 -129 -188 201 32 28 144 181 -49 -345 9 -170 -216 186
2246A86k36P0J18l07L20J33k20r1kK07m65K57J11j27rk1j29K22n1M0j74K45l0
$$ 186 -50 20 138 -169 151 284 64 -27 -29 178 -287 -30 81 -46 -55 -76 -205 17 -34 6 -168 77 47
2269D7k44J59J39K8k13K84j66J65o8p9J05k4m02R6J91j27OK36J03j88K53j73r9
$$ 47 -197 -38 101 129 -84 200 34 199 131 52 157 133 -269 -173 18 -109 -103 133 236 48 301 128 29
2292B9j63K49q3K42l11K44j90j21j11J96k34L34K27l82M90k99r8l8j78K50K3j62
$$ 29 -134 115 32 274 -37 207 17 -104 -215 -19 -253 81 308 -74 416 117 19 -19 -197 53 76 -86
2314h6Q8o8J33k59M76m38K96K27l82m6M8J7j1J72k41J02N2LJ40l71Q2N5j62j11
$$ -86 2 -66 67 -192 284 -154 142 369 -13 -59 -11 6 -5 167 -74 28 80 83 223 -148 -66 -11 -173 -284
2338b84N68j20K52O2K4J06m71R8m84M06l93k44K67L5M35J81r45J130j110L47m5
$$ -284 284 164 416 478 502 608 137 235 -249 157 -236 -480 -213 -178 257 438 -507 623 -487 -140 -185
2359a85N29K77j077M60p34R40n6L56j03o06M1K39L3k50K81n80O02J02p63j09Q27
$$ -185 344 621 -456 4 -730 210 154 510 407 -199 -158 81 114 -136 145 -435 167 269 -494 -603 224
2380B24N71j39o72N64m89l69K23k99Q70L8o24K6l86L73l79M62K50n81J050j01
$$ 224 795 656 -16 548 59 -310 -87 -386 484 522 -102 -76 -462 -89 -468 -6 244 -337 713 612
2400F12m52K35r30N0L73KN85q49Q42q90k90q1J090l8j22N70j441R10j52k03Q29
$$ 612 160 395 -535 -485 -112 -110 475 -374 468 -422 -712 -793 297 259 137 707 -734 176 24 -179 650
2421F50m18k70K35n43r0O49J99m69K34l76O1N20r6n77K02L61Q8n21J15L1J33m01
$$ 650 232 -38 197 -346 -436 213 412 -57 177 -199 -138 382 286 -291 -89 272 360 -161 -46 -15 118 -283
2443b83M88l47p5K05J06p7K3q1P8j38J10R6j38N5q8L1OJ53J56j53L7j88j6pj03
$$ -283 205 -142 -217 -12 94 17 40 -41 37 -101 9 105 -33 22 -66 -35 -29 124 280 127 164 -24 -40 -47 -150
2468a50J26L9J33l4j4K68m40J77k28P1O7j29k7QJ46N1K1J7j05k73L29j66j3J16
$$ -150 -24 15 148 114 100 368 -72 105 -123 -52 15 -114 -141 -133 13 64 85 102 -3 -276 53 -113 -126 -10
2492a0m1qP6lj8J22j0K03n31L09nk19K67l40L68k60O7j10L48j87Q4k51J78M4J41
$$ -10 -51 -59 17 14 -4 118 108 311 -220 89 84 -135 132 -208 160 -100 -33 -143 205 18 102 -149 29 73 214
2517B14k64PJ15l06L02k13L14o8l65K48p7Q5K53l35m4K40K52l27J62j27O6k1l12
$$ 214 -50 -43 72 -234 68 -145 169 101 -264 -16 -93 -8 245 -90 -134 106 358 31 193 66 132 111 -201
2540b01K35k3N4j94J37j48J40q0%J34m7j39K45p2j92K83j00j73K87l4k27K57l19
$$ -201 34 11 65 -129 8 -140 0 -80 -80 54 7 -132 113 41 -151 132 32 -141 146 112 -115 142 -177
2563a77L71j15j46J00k82M26l68L13m26K84j62R5J56J30j54l35J15K58o1j83J08
$$ -177 194 79 -67 33 -249 177 -191 122 -304 -20 -182 -87 69 199 45 -290 -175 83 22 -161 -53
2584e3K5j45J18P2m8lK07j31k4j73q8PN29k31PR7k85O01m37k20L37k39J01k28
$$ -53 -28 -173 -55 17 -31 -34 173 42 18 -155 -243 -236 293 62 69 166 -119 482 45 -175 162 -77 24 -204
2608b04J85N7Oj13J05k84K22J54J18k38m4l6L37k90j00O3NM18k20l55K03k9N45
$$ -204 -19 38 44 -69 36 -248 -26 128 246 8 -36 -72 265 -25 -125 -62 -57 361 141 -214 -11 -40 505
2631E05k33m16R8K73j52p1j68Q5J70J4K7j33O9k01MJ86k22O1K78j43O6Rj05k51
$$ 505 272 -144 -46 227 75 4 -164 -79 91 105 132 -1 68 -133 -129 57 -165 -104 174 31 97 106 1 -250
2655b50O24m58J46L7k24J84j31K14j34j01Q6J08m7k88J63K43k02J28p4j46J83
$$ -250 374 -84 62 99 -125 59 -72 142 8 -93 -7 101 54 -234 -71 172 -30 98 24 -122 61
2676F1m0J51j83j26m2M59l05Ok20L10k51P0J32L7j67L7p5j77M42k1k78M1J13J06
$$ 61 21 172 -11 -137 -179 280 -25 -19 -239 71 -180 -110 22 59 -108 -71 -146 -323 119 98 -180 -139 -26 80
2700H0K02l07j9j34J40J8j22K17j94K35J21k89p2J51j54L6k90K25K31q7K0L55
$$ 80 282 -25 -44 -178 -38 -20 -142 75 -119 116 237 -52 -124 27 -127 -91 -381 -156 75 -12 8 363
2722C63k50k40K56j78kL04j42k7r5J71o7k18L05j98L5J14j31P4k62J13n0J23J92
$$ 363 113 -127 129 -49 -51 253 111 84 -11 160 93 -125 180 -18 17 131 0 74 -188 -75 -125 -2 190
2745A90n1r9j50J51m2n1R9p7J14J49k82J05K42j64k05J44L13m18R3k64K66j71
$$ 190 139 40 -110 41 -1 -52 47 -30 84 233 -49 56 298 134 -71 73 386 -32 61 -203 63 -108
2767a08J30M2k01K75%K5l40J32k54M38l28J61j75J64K44j80k13L75J06n60L49
$$ -108 22 64 -137 138 138 163 -177 -45 -299 139 -189 -28 -203 -39 205 25 -188 187 293 -267 82
2788H2k33K29N9l03L46q2l91K72J77k91K95j30J03l1L5J38m94K92oj11J38l4O1
$$ 82 -151 78 137 -166 180 98 -293 -21 156 -135 160 30 133 102 137 275 -219 73 67 -44 94 60 121
2811A21q1o3n0j79J92lPj24L13j34k1J1m2N8P6k63M51l14J40j22K29k11j64M6
$$ 121 40 -23 -73 -252 -60 -63 -56 -180 133 -1 -22 -11 -53 5 81 -182 269 -45 95 -27 202 -9 -173 -127
2835a27K02K53j88K16k53q2o2j42M34k02j95R4l1K21m9j41r5J68O0l10O8K28J54
$$ -127 75 328 140 356 103 21 -41 -183 251 49 -146 -52 -83 138 89 -52 -147 21 81 -229 -161 67 221
2858B21o5o7K9o7Q8N4k86l6L01J55k04N3l1k60K2M2J23m8k00K80j49k6K04j49
$$ 221 156 89 118 51 139 193 -93 -129 172 327 123 176 145 -115 -93 -51 72 24 -176 104 -45 -71 133 -16
2882a6MJ12k18L03r5Lk7M8j07r1K9K35m34K29n0P7j79J98l7l71M60J35l04J15
$$ -16 -12 100 -118 185 90 93 66 114 7 -84 -55 180 -254 -25 -75 2 -177 21 -16 -387 73 208 -96 19
2906A9q1p8K19n2l43K92j71K69K87k70k7k57K92K0P9n1l8j74ML51k68p9J02J84
$$ 19 -62 -140 79 27 -316 -24 -195 74 361 91 64 -193 99 119 198 147 109 -65 -61 290 22 -57 45 229
2930B29n15K21J93J7k73r7j15L98q4P3j59OP5j10K48m07K06j3K56j5m5M5j42j38
$$ 229 -286 -65 128 145 -128 -225 -340 58 -26 47 -112 -106 -31 -141 107 -300 -94 -107 149 134 89 134 -8 -146
2954a46O7K41J53n72L20k95L00r8k35L98K01k71k76L54o6q7j45M4q0L23J49j64
$$ -146 -79 162 315 -257 63 -232 68 -30 -265 133 334 63 -213 141 75 -12 -157 -113 -193 130 279 115
2976A15l25K49N8Rk12K2J10N8j24J66J36k47k95J65K53J9m04M69j00k06p9K70
$$ 115 -210 39 97 106 -106 -84 26 84 -40 126 262 15 -280 -115 138 157 -247 222 122 -84 -163 107
2998A07J81l70J50k33R4K41r0R5k51K19P1o1Rk95N1k11N18k10J3Rj01MJ06l16
$$ 107 288 -82 68 -165 -71 170 80 175 -76 143 214 153 162 -133 -82 -293 225 15 28 37 -64 -60 46 -270
3022b70L29N6K8j17J77k94J60j55J49Rk2N3m27L91j76R5Oj9P6nK66L9j81j91L1
$$ -270 59 115 143 26 203 -91 69 -86 63 72 50 103 -324 67 -109 -14 -8 -27 49 44 310 349 168 -23 8
3047HK25k66P2n9K6L6K29j82o1j88O2K02Q6O2k99o5K59n5j15K62m34l5K11K56
$$ 8 233 -33 39 -20 6 42 271 89 28 -160 -98 104 190 252 -47 -112 147 92 -23 239 -195 -230 -19 237
3071B37k7r1kj65j81J23j27M83k13o5k12J68J3J18j09p7R6q2M62l96j75M63j91
$$ 237 210 119 117 -48 -229 -106 -233 250 37 -28 -240 -72 -59 59 -50 -127 -31 -113 349 -47 -222 241 50
3094E0j70L28j70J61m49K75J13k92L22k10L51k97L6M3j22R2m15L28J13l37N93
$$ 50 -120 208 38 199 -250 25 138 -154 168 -42 309 12 48 91 -31 61 -354 -26 87 -250 343
3115C43j67k80M73k70p4j83K05j03j8K2J99k11J88j06R2j30O0J48M2l13Q1l0K85
$$ 343 176 -104 369 99 25 -158 47 -56 -74 -52 147 -64 124 18 110 -20 40 188 230 -83 -2 -32 253
3138B53j54R8l70j32K15j4P2j98K96m4o0k00K51m4j22j29K87p1m1J29R0J98q5
$$ 253 99 197 -173 -305 -90 -104 -32 -230 66 22 -38 -238 13 -31 -153 -282 5 -66 -107 22 112 310 225
3161B25j79k46J86j24J52l42R5K52OJ49k90L08k8j07O0Lj80K1J36q1M8L0k00o2
$$ 225 46 -200 -14 -138 14 -328 -233 19 25 174 -116 192 164 57 117 120 -60 -39 97 16 64 94 -106 -168
3185a68K96k81J89J38m3j54P5p5qJ81j50k85N66l47K16j1q7PL3L4j80K13j33j37
$$ -168 128 -153 36 174 131 -23 52 -23 -31 150 0 -285 281 -66 150 139 52 59 92 126 -54 159 26 -111
3209a11L5L1Q2J92L2l93J12Q5rR7j85K57j00L3j14j24J93j42J19r5j64J07J91
$$ -111 -76 -45 37 229 261 -132 -20 65 56 153 -32 225 125 158 44 -80 113 -29 90 -5 -169 -62 129
3232A29j53M10l98m2K14j77k78M18j33j42L13j3j92PL6Q7r3P5j39k6rK4j18j57
$$ 129 -24 386 -12 -54 160 -17 -295 123 -10 -152 161 148 -44 -37 -1 86 -7 68 -71 -97 -106 -82 -200 -357
3256c57K43j0P3o0J10K62l75J10Q3o1j01m7J13Q5k60K29J30m05M52k81p6K98Q0
$$ -357 -114 -124 -51 -111 -1 261 -114 -4 79 18 -83 -130 -17 68 -192 37 167 -238 214 -67 -143 155 235
3279B35k27P2j25j43J36j68K93p3p0O6K5mK55j91k9J60m4k96J97q1J27k05K79
$$ 235 8 80 -45 -188 -52 -220 73 0 -70 -4 21 17 272 81 52 212 168 -128 69 -12 115 -90 189
3302A89k60N1Qj48P8J74J75o60M25l7K69j91k5M9j62K4k4J13k39K03l4J09j16
$$ 189 -71 -20 -12 -160 -82 92 267 -393 32 -5 264 73 48 97 -65 -41 -65 48 -191 12 -22 87 -29
3325b9K8J80J5N6p4j61J03r7p1j74J54J44M6pl88L92j4P9K59l76l8j33K91k7r5
$$ -29 -1 179 194 250 176 15 118 21 -50 -224 -70 74 120 113 -275 117 103 182 441 65 27 -106 185 158 63
3350F3j0J21j73R3J4N1j42J5J69p6k71J38J75n46L26kl0j13N8J43k57J91K43P9
$$ 63 53 174 1 94 108 159 17 32 201 125 -146 -8 167 -379 -53 -55 -85 -198 -140 3 -254 -63 180 259
3374B59q2j85j21J20n0j56M53k31P3j67K63k96J88n8J2l5J60j80M2J4J83j25p0
$$ 259 177 -8 -129 -9 -59 -215 238 7 80 -87 176 -120 68 10 22 -13 147 -33 9 23 206 81 11
3397A1K0L3j03J60Kk8j72l4J97M5j02K56k24l70K03K99n36L09J20J17k45J01j26
$$ 11 31 64 -39 121 123 95 -77 -111 86 131 29 285 61 -309 -106 193 -343 -34 86 203 -42 59 -67
3420f7J30K0Kj94M6M18l28K27l42J68M1k56L39l37J54p9Rj22L32m06K38M1J14
$$ -67 63 83 85 -109 -63 355 27 254 -88 80 121 -135 204 -133 21 -58 -49 -171 161 -245 -7 34 148
3443A48k27N1P9M6l71K71j7r7L8j99K65J57J74k01k75l4L46j05j93L65n25K16
$$ 148 -79 -28 51 97 -274 -3 -20 -117 -79 -278 -13 144 318 117 -158 -192 154 49 -144 221 -304 -88
3465h8L84k00p4J11j45L6o8l58L46o4m1J97j96K29m6r0J02k1J27m2J18j84l48
$$ -88 296 96 22 133 -12 24 -44 -402 -56 -120 -161 36 -160 69 23 -67 35 14 141 99 217 33 -315
3488c15L09K33l57J30J75j63J6J0J00m32J23J71j16P4j34Q8J26K4l94N77j05l07
$$ -315 -6 227 -130 0 175 12 28 38 138 -294 -171 0 -116 -42 -176 -88 38 62 -332 245 140 -167
3510a67J85Q9l32oK00l5Q7n0r1J48M7N9P0n32L89J24k81L25j24M7j69l5J36k07
$$ -167 18 107 -225 -231 -31 -66 21 -29 -120 28 75 134 204 -328 61 185 -96 229 105 152 -17 -52 84 -123
3534a23K2M5O6j46J68j6o6K57k35O3n7rj18L78j99Nk8R1k94P3M56k19q2J4k44
$$ -123 -101 -56 10 -136 32 16 -50 207 -28 35 -22 -31 -149 229 30 35 7 98 -196 -123 333 114 32 46 -198
3559a98J4K31J0K28m51J24K5K30j01j84J03n3Mj13J01j15k9k2J87J90m6j57j88
$$ -198 -184 47 57 285 -166 -42 -17 213 112 -72 31 -22 -18 -131 -30 -145 -174 -196 -9 181 135 -22 -210
3582b10N15l46M5J34m61J21J52k0%K2j80J90J3R6k62J36J70Q5m58K24r9K22k4
$$ -210 305 -41 4 138 -323 -202 -50 -70 -70 -48 -228 -38 -25 71 -191 -55 115 200 -258 -34 -133 89 65
3605F5j46K86l29J06O6M5j67Q8j17J98k32J56j09L3r9L39Q4k80J37J29Om31L29
$$ 65 -81 205 -124 -18 48 93 -74 14 -103 95 -137 19 -90 -57 -156 183 267 -13 124 253 259 -172 157
3628A57L7m95N8M60P3o5k31j2Np9J78j90K24k23K53k89L29j16j75J12l64M22j26
$$ 157 194 -301 -243 217 290 225 -6 -18 -13 -92 86 -104 120 -103 150 -139 190 74 -101 11 -353 69 -57
3651e7L3k56J18L75j94rj65L12L4o4k12p3M27k50k7J53Rk60J01j26J89J17k06
$$ -57 -24 -280 -162 213 19 10 -155 157 191 127 -85 -158 269 19 -8 145 154 -106 -5 -131 58 175 -31
3674c1q6K9q0p1Q4k0L31l79K78k13R9K32l28K20m4q4pPr1nJ79j99L38r2N5j67
$$ -31 -117 -88 -168 -239 -155 -175 156 -223 55 -158 -59 173 -155 65 21 -63 -70 -63 -154 -159 20 -179 159 67 122 -45
3700d5K59l73R9q5j22L26k28J01R4k50J68r4L48j46j14j33Q3L1KK67j65K1J6j06
$$ -45 214 -159 -60 -145 -267 59 -169 -68 26 -224 -56 -150 198 52 -62 -195 -112 -81 -79 188 23 44 60 -46
3724d6J56j78L47l62J03oK63m00K12j99p9K58j14j93L54j21n0O3r4L43m04J30
$$ -46 110 -68 279 -83 20 14 277 -123 89 -110 -189 69 -45 -238 116 -5 -55 8 -86 257 -147 -17
3746a7r7m7L59l1j81k54L51m3j64K07j81O4K14k28j27n1O35l22RJ12l78K27r8
$$ -17 -114 -161 198 167 -14 -268 83 40 -124 83 -98 -34 180 -48 -175 -226 409 87 96 208 -170 57 -41
3769d1J31j64K85l5j79P1J65j35j36k6N3N1k29L27j56P2j84k10N52j58j88L1M8
$$ -41 90 -74 211 176 -3 68 233 98 -38 -64 -11 40 -189 138 -18 54 -130 -340 212 54 -134 -103 -55
3792e5J81j48J9j42o9P7M7M8J8r3O6m1KJ86j00j04K63l46P2J11j05j0L62j51j99
$$ -55 126 -22 -3 -145 -214 -137 -90 -42 -24 -117 -51 -92 -90 96 -4 -108 155 -191 -119 -8 -113 -123 239 88 -111
3817a11J59J68l03N7l8K99k70n5J69j08JO2l01J89M0j7p1J19k47J71P8j27J86
$$ -111 48 216 -87 -30 -68 231 -39 -94 75 -33 -32 30 -271 -82 -42 -59 -130 -11 -258 -87 -9 -136 50
3840E0J6N7j81J42K55k17j36J58k06j09K07J13l03K28k89J02J64j8J26n3J19k01
$$ 50 66 123 -58 84 339 122 -14 144 -62 -171 36 149 -154 74 -215 -113 51 33 159 106 225 24
3862B4J15j74lk60M00K43k50J19j97j9j81J31j07L63k84L36j24r1j30K18l82K28
$$ 24 139 -35 -38 -298 102 345 95 214 17 -2 -183 -52 -159 204 -80 256 132 41 -89 129 -253 -25
3884b5P1k83M52k44M8j93K79J42j68k81K02L7q7J31j5kJ12k80j0J91J67j93R9
$$ -25 46 -237 215 -29 19 -174 105 247 79 -202 0 37 -50 81 66 64 176 -104 -114 77 244 51 150
3907A50r7j11k08J85K23r0j19J20J84k70J30j93K95k20K37m04o4M83l66N9j12
$$ 150 53 -58 -266 -81 142 52 -67 53 237 -33 97 -96 199 -21 216 -188 -252 231 -135 -76 -188
3928a88J59P8j61K3N5j15J54J16j55J46j73j63J54L23j03l2j5N4L0m39J83j0J01
$$ -188 -29 49 -112 -89 -34 -149 5 121 -34 112 -61 -224 -70 253 150 118 103 157 187 -252 -69 -79 22
3951B2l2J96n9m00M61j47J65j90O3k12m1J53m3R6q3J37k1j6M4NJ2m1k20K19J42
$$ 22 -10 186 127 -273 188 41 206 16 79 -133 -174 -21 -64 32 -51 86 65 49 93 98 110 69 -151 68 210
3976B10k07P4J46j99j77J8K08k08L24k60L06q7j02k94M17k81j7K52n2Q0k32O7
$$ 210 3 77 223 24 -153 -135 73 -135 189 -71 235 148 46 -248 169 -112 -129 123 71 151 -81 -14
3998a4Q5j00l4K13k52j50mJ83L13l57K96l0k11Qj81K90J40k92q7J15k90N83j70
$$ -14 71 -29 -63 150 -102 -252 -256 -73 240 -117 179 149 -62 -54 -235 55 195 -97 -184 -69 -359 224 54
4021E4LM1j82J20K00l8l44J32j43j5J08q7K10k39j94L20j23J25K03k48m2K52j24
$$ 54 57 98 -84 36 236 198 -146 -14 -157 -172 -64 -151 59 -180 -374 -54 -177 -52 151 -97 -139 113 -11
4044a1l7K87n25L15m5N2l7pL06k07n7j23R9j6k88L83J93j55j39k7K04m54M31k90
$$ -11 -48 239 -286 29 -16 36 -1 -8 298 91 34 -89 10 -6 -294 89 282 127 -12 -39 165 -289 142 -148
4068a48K42k36K43J11k39J20k04Q2Pk28K97j65K71k73K39p5n00N60j20j02M9J15
$$ -148 94 -142 101 212 -27 93 -111 -29 -22 -250 47 -118 153 -120 119 44 -456 104 -16 -118 -69 46
4090D6o5l21J70M01k25k01L62k75N6J18j13K5K02p9r6K60l46M5K4R4L9r4J13l43
$$ 46 -19 -340 -170 231 6 -195 167 -108 -52 66 -47 -22 180 101 5 265 -81 -36 -12 82 121 27 140 -203
4114b03J3N8J12j0p9J81R0p5k89L60j71J73j54o5j3j65R9n9R1K22M9p7k7j81J41
$$ -203 -190 -132 -20 -30 -109 72 162 87 -202 158 -13 160 6 -59 -72 -237 -138 -197 -106 116 165 88 61 -120 21
4139B1J73k78J33k54L33r9q4o3M06l74K33l96J12J12QK98l25K0N6r7R4j42J74
$$ 21 194 -84 49 -205 128 29 -55 -118 288 -86 147 -249 -137 -25 -17 281 -44 -24 32 -65 29 -113 61
4162F1o0m4K26n7k52R3K23m15K25K6j09q0K40o4l88L56j77M16l01m4Q2j17K26
$$ 61 1 -43 183 126 -126 -33 190 -225 0 26 -83 -163 77 13 -375 -19 -196 220 -81 -125 -43 -160 66
4185F6N8J45l98K25j92j0O8J14K17k72m5K25m40R9L50l29K32K96k60K06k45q0
$$ 66 124 269 -129 96 -96 -106 -38 76 293 21 -24 201 -239 -140 210 -119 113 409 149 355 110 30
4207C0N9j31M3k67M25j43K96k38K10j92n7m6k69L17l92L65j37O4K6L59k98q6R6
$$ 30 89 -42 1 -266 159 16 312 74 284 92 35 -11 -280 37 -355 10 -127 -63 -37 322 24 -62 34
4230C4r2k9R4j23J22J61l91J57O6J41k44J77J89q0l35K67j76K0K40l64K54j1n2
$$ 34 -58 -87 7 -116 6 167 -224 -67 -1 140 -104 73 262 182 -153 114 -62 -42 198 -166 88 77 25
4253B5J10j23j33R1J83l99K28J35j08q2k1k17L70p2J43k39K09N1L4q6j11j65K02
$$ 25 135 12 -121 -30 153 -246 -18 117 9 -73 -94 -311 59 -13 130 -109 100 151 185 99 -12 -177 25
4276B5j17J91J40j19k39j4K28l80L97M0k43Q9J6K00k58R7j58P0K39m20J84l59
$$ 25 -92 99 239 120 -119 -133 95 -285 112 152 -91 -2 14 214 -44 53 -105 -35 204 -216 -32 -391
4298c91L48m7J02J78k18jLk39L93m54L67J76m80L4R7n8K85m21L52L8m4RJ14k00
$$ -391 -43 -90 12 190 -28 -29 -26 -265 128 -326 41 217 -263 -229 -132 -190 95 -326 26 64 20 29 143 -57
4322e7K8j50R1N2O6P5l08J42l0K61k23K66k29J24J57j83k04O4n0O7n2K44j08j05
$$ -57 -29 -179 -88 -36 30 105 -203 -61 -91 170 -53 213 -16 108 265 82 -122 -58 -108 -41 -93 151 43 -62
4346f2j89M67n39K00J16J34j12k73J67R9J13j09L2l8J15k5K5m8j95K08Ok31J82
$$ -62 -251 216 -323 -123 -7 127 15 -258 -91 8 121 12 44 6 121 96 121 73 -122 86 92 -139 43
4369D3n6r8k7J31K06k23P0P8l12K96M8k02q8L25O6m29P1J11l8r5K25j40J32j7
$$ 43 -13 -111 -138 -7 199 -24 46 124 -188 108 156 -46 -134 191 257 -172 -101 10 -28 -123 102 -38 94 77
4393G7P3o2J0M4l19J11K03k13J50j04J71j86j7l5P2QR5j07k79L92j25P9k18J84
$$ 77 150 88 98 142 -177 -66 137 -76 74 -30 141 -45 -62 -97 -25 -17 78 -29 -308 84 -41 38 -180 4
4417DPQ7J3k4k97M90j65J43j57O4k55M9P6Q3o7p0m9j1R0j10n2q4R1J96l72J73
$$ 4 11 98 111 87 -210 280 115 258 101 165 -90 -41 35 118 51 -19 -68 -79 11 -99 -151 -235 -144 52 -320 -147
4443a47M95l86lL34j18K2k25J45j61J59k1L0j23j09J99R1j36j7j38J80j68L5L43
$$ -147 348 -38 -41 293 175 197 -28 117 -44 115 94 124 1 -108 91 182 46 29 -109 71 -97 -62 281
4466B81k65j18j7K76j93J68K2q9j19J50j26j18K37k42Q6J22j57j24J65j98M70
$$ 281 16 -102 -119 157 -36 132 154 65 -54 96 -30 -148 89 -153 -67 55 -102 -226 -61 -259 211
4487B11k52J98k34r1J10J14J68l89R6K7j09K9K05j28J18J20k12K79k41K81l36
$$ 211 -41 157 -77 -168 -58 56 224 -165 -69 -42 -151 -122 83 -45 73 193 -19 260 19 300 -36
4508c6j08R0q1L00r7q1O4K53l11K0m1J71JJ45k78J13k00j82J92J73k21q4J60l7
$$ -36 -144 -54 -135 165 68 -13 51 304 -7 13 -28 143 144 289 11 124 -76 -258 -66 107 -114 -198 -38 -75
4532g5j74R5K42j10J66j22P4j12j04Q3J6K94m96J33J00j55J53L2J83n40L76j66
$$ -75 -249 -154 88 -22 144 22 96 -16 -120 -37 -21 273 -223 -90 10 -145 8 40 223 -317 59 -107
4554a07K65l29m1J29Q3nr1J30j75j21J83J59k19K5J65p4n5m9Q4P2j13p9q8K85
$$ -107 158 -171 -212 -83 0 -5 -96 34 -141 -262 -79 80 -139 -114 51 -23 -78 -127 -43 29 -84 -163 -251 34
4578C4J63j66J09k6k66J58mP7L17j67j59j90o8J29L0J02L01k22J43n97K17L26
$$ 34 197 31 140 114 -152 6 2 79 396 229 70 -120 -188 -59 -29 73 374 152 295 -302 -85 241
4600B41l12M63l29k14J14j95J78r2J21K08k80J78n4j26m7l9MN25l28pR2j89K51
$$ 241 -71 392 63 -151 -37 -232 -54 -146 -25 183 -97 81 27 -99 -146 -185 -181 344 16 9 101 -88 163
4623A63j51N1K05l31N3r0J76kJ67k16k28J22K57l59K23K35m73R4k5j0oJ54J99
$$ 163 12 63 268 -63 -10 -100 76 74 241 25 -203 -81 176 -183 40 275 -198 -104 -129 -139 -145 9 208
4646B08l42J65K08m22J79k8j4K9O5p8nl9l9Qj8J19K37m56K18L5J76Mk94J08j66
$$ 208 -134 31 239 -183 -4 -32 -46 -17 48 -30 -35 -74 -113 -105 -123 -4 233 -223 -5 30 206 210 -84 24 -142
4671a42J19M0Q0j87K30k96L33p2k3j89N4R3OJ90l48M2r6J36oj81L04R2k63j33
$$ -142 -23 17 97 -90 140 -156 177 105 82 -107 -53 40 46 236 -112 -70 -166 -30 -36 -217 87 179 -84 -217
4695b17L41k57nQ3j60L39jo8q3J59j66n2k7k7N8K17j1l85K65N3Pl23L62n3Lk9
$$ -217 124 -133 -138 -55 -215 124 123 55 -28 131 -35 -87 -114 -141 -83 134 123 -262 3 56 63 -260 102 49 52 23
4721B3j9R6q4rk53Q5J25Mj27J94K97m80K1K06p1LJ7j29L7p4Q5j60J87j00K34k83
$$ 23 4 100 16 7 -246 -161 -36 -32 -159 35 332 -148 -127 79 8 11 28 -101 -64 -138 -53 -213 -26 -126 108 -175
4747a75K11J13j51q2P2K98r2k13k9r0j2L8n2K62j2K09n11K00Q4m5p9O1q4Nj22
$$ -175 36 149 -2 -84 -12 286 194 -19 -48 -138 -150 -112 -164 98 86 295 -216 -16 68 23 -56 5 -79 -74 -196
4772a96R9N9J72O3j71k0n5O1M2j80M74j93m6j85j93N14k7k63j82R0J68J08j98
$$ -196 -97 -38 134 197 26 6 -49 12 54 -126 348 155 109 -76 -269 245 218 -45 -227 -137 31 139 -59
4795e9J05j96J07m1l0r5L43r3j83P3R2o8J03j67j64M86Nj16j77K42q0j37L5J9
$$ -59 46 -150 -43 -84 -114 -209 134 41 -142 -69 23 -45 58 -109 -273 213 218 102 -75 167 87 -50 -15 4
4819Dl90M87j62L5K75m33M35l18j76L27j04j01J20L8l9J10j39j00J08K19k21J29
$$ 4 -386 101 -61 -26 249 -184 251 -67 -243 84 -20 -121 -1 37 -2 108 -31 -131 -23 196 -25 104
4841A04l50J45J57M2k38OJ29j1k19K76o0Mo1J44k11k0J08P7j3j44J54oj2j25K70
$$ 104 -246 -101 56 98 -140 -134 -5 -16 -235 41 -19 -15 -76 68 -143 -163 -55 22 9 -135 19 13 1 -124 146
4866A46q5k89k8J00M23k79O7k15%P6j57M34k19k8K15j05J5J62o53L75m7k00J05
$$ 146 61 -228 -256 -156 267 -12 55 -160 -160 -84 -241 193 -26 -54 161 56 71 233 -420 -45 -92 -292 -187
4889a87N5P7M7J59j97J98k07j49L10j14j1j39L41j40l8k30M37k96Q4O4O2J16k53
$$ -187 -132 -55 -8 151 -46 152 -55 -204 106 -8 -19 -158 183 43 5 -225 212 -84 0 64 126 242 -11
4912a1j74L02j1M0j20N8Q3m39K11R9j77K22q1j24N09m10r2J63q1n5L1M8K5o1k75
$$ -11 -185 117 106 146 26 84 167 -272 -61 38 -139 83 2 -122 387 -23 -115 48 -33 -88 -57 -9 16 -45 -320
4937c20M48Qj17L7k12J48J92Qj48q3k52L70j28rL74k43J60p5m72L38J34K2j8k30
$$ -320 128 136 19 56 -156 -8 184 192 44 -39 -291 79 -49 -58 316 73 233 158 -314 24 158 180 162 -68
4961f8KJ51k33K89j88m2J35J41n04M05K54j39l07O7l8oK82k61K4M4N6l1j09O9
$$ -68 -66 85 -148 141 -47 -89 46 187 -317 88 342 203 -104 -37 -75 -81 201 -60 -36 8 64 33 -76 -7
4985gQ7j59q7P4L90k6j40j07qP2p4L3j54k1K47K8n3k31J53L5P3Jk61l54O07j33
$$ -7 80 -79 -166 -92 298 272 132 25 17 89 15 48 -106 -127 120 148 95 -136 17 52 125 126 -135 -489 118 -15
5011a5K27m12L49j81J03q2j34j30K69j30J72q4J38J17k90J3j2M3j80K73n8M1k66
$$ -15 212 -200 149 -32 71 -11 -145 -275 -6 -136 36 -48 90 207 -83 -70 -82 -39 -219 54 -4 37 -229
5034b29O0J71j14o1J63j23L06k46M4K05j62l62M39j77J52k29J67L20m73M04m06
$$ -229 -169 2 -112 -173 -10 -133 173 -73 -29 176 14 -348 91 -86 66 -163 4 324 -149 255 -151
5055a51M81m12O4K05J0l80J76L5P4k10m5K88j99J09n1K26k73r1K55Q8j75pkP4
$$ -151 330 -82 -18 187 197 -183 -7 28 102 -108 -153 135 -64 45 -6 220 -53 -144 111 199 24 17 15 89
5079H9k09J22K46m4j55J06o8L0j22L5j06J89j03n6o0r3K08k9J78k65L31k8n35
$$ 89 -120 2 248 204 49 155 87 117 -5 30 -76 113 10 -46 -106 -199 9 -20 158 -107 224 196 -339
5102c39L19N9QK39l14r5J2J53j53n9J04R4q1j8L51k60K6L7l8k18J88j17J3Q0q7
$$ -339 -20 39 47 286 -28 -123 -111 42 -111 -170 -66 28 -53 -71 280 20 46 83 45 -173 15 -102 -89 -9 -96
5127i6J03k36Q1O7J69J3j13M8j22K43r9j37K21j48j3j1j44L62j08r7p4j10J97
$$ -96 7 -229 -148 -81 88 101 -12 36 -86 157 58 -79 142 -6 -19 -30 -174 188 80 -17 -91 -201 -4
5150dJ01j5N4k65j11K78J6k54J01M5P9r5j57K01l94M79k97J22K84r7J28l20%L12
$$ -4 97 82 136 -129 -240 38 54 -200 -99 -54 25 -70 -227 -26 -420 59 -238 -116 168 71 199 -121 -121 191
5174A91k44J46j51L1o2L4j72L07j88J70k01J54j9J57j28k41J10L32j68k76L04
$$ 191 -53 93 -58 -27 -89 -55 -227 80 -108 62 -139 15 -4 153 25 -216 -106 226 58 -218 86
5195H6j16r5J02l84L40J56R1l57J82J17r5N8j72k42O0K50J20r2m2N4J1K7J9m7
$$ 86 -30 -125 -23 -407 -67 89 180 -177 5 122 27 85 -87 -329 -269 -19 101 9 -33 21 32 59 78 31
5219C1J68m18K35j75K57n5r5O4m05L32j54J78L16q7k69L88k67j12l5j0j51L04
$$ 31 199 -219 16 -159 98 43 -52 12 -393 -61 -215 -37 279 192 -77 311 44 -68 -103 -113 -264 40
5241D0k87L62j68P9K03L7k36j93J42p3L18m89J71J04j59J80J1k24M90l86J98j7
$$ 40 -247 115 -53 26 229 266 30 -163 -21 -94 224 -265 -94 10 -149 31 42 -182 308 -78 120 103
5263A03K28l79p3jr9L47l63K45J38l07R2J45m66L30R7M4q3j65K86L8L6k02m7j16
$$ 103 331 -48 -121 -122 -221 126 -237 8 146 -161 -69 76 -390 -60 37 81 -2 -167 119 157 193 -9 -56 -172
5287a72l6K85k57J61M9jk36J18j50K73J2J14l96L02K02j37k15R7l04L12m7M0J0
$$ -172 -208 77 -180 -19 30 29 -207 -89 -239 34 46 160 -236 66 268 131 -84 13 -291 21 -26 14 24
5310B4j9k0j62K84l34L69j89J46mj15r7L8J71k8k61J61J78k3q3o3j69J70k42L04
$$ 24 5 -15 -177 107 -227 142 -47 99 95 -20 -117 -79 92 64 -197 -36 142 119 36 -27 -196 -26 -268 36
5334C6j16K54m20R4K80j30J37j70r7J72n2j44K73k22L31l97q1J61J51p4K4j5j37
$$ 36 -80 174 -246 -152 128 -2 135 -35 -132 40 -12 -156 117 -105 226 -171 -252 -91 60 -14 10 -5 -142
5357a42J69J9k54K90j25J01o9j46L1P6K58l64K33k1k10J30Q7k06J96l15K04J76
$$ -142 27 46 -208 82 -43 58 -11 -157 -126 -50 208 -156 77 56 -154 -24 63 -143 53 -262 -58 118
5379A18Q2j34n6K76k92L00m39K23P8r5j64K85o5M0K5m4J6j53j75M24k71j26J6
$$ 118 200 66 10 286 -6 294 -145 78 156 61 -103 182 117 157 182 138 154 1 -174 250 -21 -147 -131
5402a31J22K11lj94L1J12P1k80K42k10K50k07j28j31J76p8K12k74J63k66L16J81
$$ -131 -9 202 199 5 36 148 219 -61 181 -29 221 14 -114 -245 -69 -147 65 -209 -46 -312 4 185
5424A85k18K0j66K93l09L77K5m9J81l42M9l7k54j95K33K84J0l1j90K44k09K07
$$ 185 -33 -13 -179 114 -195 182 207 158 339 -3 46 9 -245 -440 -207 77 87 56 -134 110 -99 108
5446A08l64O2J57j55K37L0jj55L28j00p2j40Jo9J64k5q9l8L4J06l45K82k13J97
$$ 108 -256 -194 -37 -192 45 75 74 -81 247 147 75 -65 -64 -133 31 6 -83 -121 -87 19 -326 -44 -257 -60
5470f0L05l89m5J29o0n0L79l99O3q7O3Q2k4k0K14j23k0J34j56K0K6j55J78j40
$$ -60 245 -144 -189 -60 -120 -170 209 -190 -127 -214 -151 -69 -93 -113 101 -22 -42 92 -64 -44 -18 -173 5 -135
5494a35J51P9j75m2j67L10j5K23p7l67J14O4j32J92n4j0J97j95J00k03O1K32l0
$$ -135 16 95 -80 -122 -289 21 6 229 152 -215 -101 -37 -169 23 -31 -41 156 -39 61 -142 -81 151 121
5517A21l3j66K4L71m90J41J15j28J6O1K4k97J60r3Q2P3k57K53n7k5Q0K20Q1m3
$$ 121 88 -78 -54 317 -173 -32 83 -45 -29 32 56 -241 -81 -174 -92 -19 -276 -23 -80 -105 -25 195 276 233
5541B33k49k51J71J21j19J26J63j53Q3J3j48J0K23r8j1r3J5J9j2L21o42L55M2
$$ 233 -16 -267 -96 25 -94 32 195 42 125 138 -10 0 223 125 114 21 36 55 43 364 -278 77 119
5564A19r3Lj96J05J82l38m3J06K8K96l36K88j02r8k9J49j66K25l06O1J77j9O9
$$ 119 26 29 -167 -62 120 -218 -261 -155 -127 169 -167 121 19 -79 -108 41 -125 100 -206 -145 32 13 82
5587H2N2l68K49oj83L01k73K62k41J2K90l89k1K44j49J48k40L88j35J10l09M10
$$ 82 134 -234 15 9 -174 127 -146 116 -125 -113 177 -212 -233 11 -138 10 -230 158 23 133 -176 234
5609B34n3j9j63J50k18J45P4k10N2O0J34n7j74p0M9K10j69j03K63n3j63P7J9R7
$$ 234 181 162 -1 149 -69 76 150 -60 -8 52 186 129 -45 -115 -66 144 -25 -128 135 82 -81 -4 15 112
5633A12Q6q8j87P1L5L1j20jL20k44r3M9j26J45j90L01J2k71J52K59m61P9P9K50
$$ 112 198 110 -77 -6 29 60 -60 -61 259 15 -78 -29 -155 -10 -200 101 113 -158 -6 253 -208 -129 -50 200
5657B00j54j71K68J7q9j2j35j13J57j30K14l59L38j23L23J2k79J85K3j85j62J95
$$ 200 46 -125 143 160 71 59 -76 -189 -32 -162 52 -307 31 -92 231 243 -36 149 172 -13 -175 20
5679B0r9j38N5K19J19j78N9l4K3J50p7l2l54J92J01j19K4J29J41j29J43k29l5
$$ 20 -79 -217 -162 57 176 -2 57 23 46 196 119 87 -267 -75 26 -93 -69 60 201 72 215 -14 -49
5702d9J7j23K77j13m5Q5J49q3k25Q1J44j44K20l77L44l66L15K50m95J24j65L9
$$ -49 -32 -155 122 9 -36 49 198 115 -110 -29 115 -29 191 -186 158 -208 107 357 -138 -14 -179 -140
5724a40R0J28k62J00J54k07j17J44O4J48j26l1N7o2l2L7J05k33L56k01NJ93o7
$$ -140 -50 78 -184 -84 70 -137 -254 -110 -46 102 -24 -55 2 -60 -92 -55 50 -183 173 -28 -23 170 103
5747A03q5nk3k3j0q5J30k61J15J47k4K29l47J35j5K74k65o0J36l3N2k74L14j44
$$ 103 18 13 -10 -33 -43 -128 2 -259 -144 3 -21 208 -139 -4 -19 255 -10 -70 66 33 85 -189 125 -19
5771a9J84o3j34r9K5J46J4J43k8k17q3J30j58j7O9N4K72j44j30l0LL0O4K42k73
$$ -19 165 102 -32 -131 -106 40 54 197 169 -48 -131 -1 -159 -176 -107 -53 219 75 -55 -85 -82 -52 12 254 -19
5796a9J01k88L38M5j6j52nr9p4L67m59N0J12K00l7n9j63M31k02j39K03n8j4m1
$$ -19 82 -206 132 177 161 9 4 -95 -169 198 -261 -211 -99 101 64 5 -158 273 71 -68 135 77 63 22
5820B2J92l22J13K20j01L6n2N1k58k4J40P4n19N52j55p1k4L83k46o9q7K93J09
$$ 22 214 -108 5 225 124 160 108 159 -99 -123 17 91 -428 124 -31 -102 -126 257 11 -58 -145 148 257
5843B57j81m6j88J90j16N2j34K03P4j55L5q7J72l7J48n25J90J01K58J20m00M30
$$ 257 76 30 -158 32 -84 -32 -166 37 111 -44 -9 -96 76 39 187 -338 -148 -47 211 331 -69 361
5865C61j82k88n0N6J71r6r7J72j58j6J91n5j10j4K70l0k01K25r6k42K45j44j76
$$ 361 179 -109 -159 -103 68 -28 -125 47 -111 -127 64 9 -101 -115 155 125 -76 149 53 -189 56 -88 -264
5888b64L10K44m38J57N2J28k32O5J27k64J32k14k27L82J1k5J36k75N75m58J14
$$ -264 46 290 -148 9 61 189 -43 22 149 -115 17 -197 -424 -42 -31 -56 80 -195 380 -78 36
5909C6K83j83l51J13J21n6P8K3K22j84j72P3O6l0L1j73J27l1J61l36L2J07K1J05
$$ 36 319 136 -215 -102 19 -37 41 64 286 102 -70 3 69 39 70 -103 24 -7 154 -182 -150 -43 -22 83
5933H3K56k97J65l09N0NO4K7Q0j5j5j81K96j82j43K54j78J95n6k37J97k43j01
$$ 83 339 42 207 -102 -52 -47 17 44 124 109 94 -87 209 27 -116 138 -40 155 99 -138 59 -184 -285
5956b85J19K38j15o4J15NR7j09n7J39j04o8K45k21n9J84j82K54J97l95j5n0J07
$$ -285 -166 72 -43 -107 8 13 110 1 -56 83 -21 -89 156 -65 -124 60 -122 132 329 -66 -81 -131 -24
5979b4O5P6mK4m35L67j05J00l9J35q0J3l07L79l03Q2J34n1j96K42k15K40n6R8
$$ -24 41 117 113 137 -298 69 -36 64 25 160 80 93 -214 165 -138 -56 78 27 -169 73 -142 98 42 140
6003A40j88OJ08j74J85j11j77P4O5K93k86Q9L97m03kj24J12r8j18J91J37j36K39
$$ 140 -48 -42 66 -108 77 -34 -211 -137 -72 221 -65 24 421 18 16 -108 4 -94 -212 -21 116 -20 219
6026B19M8m86K70%l95L98N5K9J16l27K0J91l25j23K78L9J11l18L14j78k8M3J83
$$ 219 267 -219 51 51 -344 54 109 138 254 -73 -53 138 -187 -310 -32 7 118 -200 114 -64 -92 -49 134
6049A34j18o4K77k93K05k19p9L84r3l19J09J40P7l91M14j89K1P0K37k61r2O9J49
$$ 134 16 -48 229 -64 141 -78 -157 227 134 -185 -76 64 141 -250 164 -25 -4 66 303 42 -50 19 168
6072A68k47L89j60l35M19n31L04K9J01k64Q8k03J99r6L05k16J40j50K11j33m17
$$ 168 -79 310 150 -185 234 -297 7 36 137 -127 -39 -242 -43 -139 166 -50 90 -60 151 18 -399
6093c99N49l41RK37j45J09K82l84L33k80N5j46R9j54M55k8o0n40N75k1n23N77
$$ -399 150 -191 -182 55 -90 19 301 -83 250 -30 25 -121 -22 -176 279 251 191 -349 226 205 -318 259
6115B59k20o2j26J28j41J99j82K44j96J43jl9J85o2l75L79j99j7J80j12l53L82
$$ 259 39 -23 -149 -21 -162 37 -145 99 -97 46 45 6 191 129 -246 133 -66 -83 97 -15 -368 14
6137A4J2N9j22p1j24J55K49l59J77P6l7k45L12n2N2l52K08K29j51k04r2M14j82
$$ 14 26 85 -37 -108 -232 -77 172 -187 -10 66 29 -216 96 44 96 -256 -48 181 30 -174 -266 148 -34
6160c4j30K54J19j30j55J40R8l31O5N1R0N2J40k73K6p1l5L04nk84j59K29J29j28
$$ -34 -164 90 209 79 -76 64 162 -169 -104 -53 37 89 229 -44 -18 -89 -124 180 175 -109 -268 -39 90 -38
6184c8J57Q8j8l60K3K56J27k04o9P3K4q7k3K01k6j82J07l2N8r9M2J27j21j44M23
$$ -38 119 207 189 -171 -148 108 235 31 -38 35 59 -28 -51 150 124 -58 49 17 75 -24 18 145 24 -120 303
6209C03j55l46Q8K9O9R0q7P8m0P7k01nK49o5k9k2j02J53k6j67J42J62l42R7K96
$$ 303 148 -198 -110 -81 -12 78 -9 69 29 106 -95 -100 149 84 55 33 -69 84 58 -109 33 195 -147 -50 246
6234B46j52j41J02k7j31L81k95Qo0K42j83m8q1J77p2k3j71J50J76o8p6k43N98
$$ 246 94 -47 55 28 -103 278 -17 -9 -69 173 -10 -58 -139 38 -34 -57 -228 -78 98 30 -46 -289 309
6257C09n59K44J5M9j37J71j87J95k68K24l05K80J19j16L50l92p9J67R4k30K3J90
$$ 309 -250 -6 9 58 -79 92 -95 100 -168 56 -249 31 150 34 384 -8 -87 80 174 -56 -33 157
6279A57j34o3L2Q4k11K76j38K52j90j58K09l71J82k2l0J8J17J62k26K12p6J15
$$ 157 23 -40 -8 76 -135 141 3 255 65 -93 116 -255 -73 -95 -125 -107 10 172 -54 158 82 197
6301A97m10K22lj26K59j76j04L67k72J35r2n6l8k80L09L5J48k62J71K2j97O7K19
$$ 197 -213 9 6 -120 139 -37 -141 226 -46 89 -3 -59 -97 -377 -68 -33 115 -147 24 46 -151 -84 135
6324A35k54J77O9k40J3l8J9J60j12%J22j5J10k55j42N7M01m2m44M84j82n3j2q3
$$ 135 -119 58 127 -113 -100 -138 -119 41 -71 -71 51 36 146 -109 -251 -194 207 165 -279 205 23 -30 -42 -125
$$ [...]
8191b0
##END NTUPLES=NMR FID
##END=
