##TITLE=1H_DE-152k
 200.13Hz, D2O.
 8 sc
 26.6.2026
##JCAMPDX= 6.0         $$ Bruker NMR JCAMP-DX V2.0
##DATA TYPE= NMR FID
##DATA CLASS= NTUPLES
##ORIGIN= UXNMR, Bruker Analytische Messtechnik GmbH
##OWNER= pz
$$ XWIN-NMR		Version 3.5
$$ Fri Jun 26 13:15:59 2026 Russian Standard Time (UT+4h)  she@DPX200
##.OBSERVE FREQUENCY= 200.1313
##.OBSERVE NUCLEUS= ^1H
##.DELAY= (6, 6)
##.ACQUISITION MODE= SIMULTANEOUS
##.ACQUISITION SCHEME= undefined
##.AVERAGES= 8
##.DIGITISER RES= 18
##SPECTROMETER/DATA SYSTEM= spect
##.PULSE SEQUENCE= zg30
##.SOLVENT NAME= D2O
##.SHIFT REFERENCE= (INTERNAL, D2O, 0, 14.3821)
##AUDIT TRAIL= $$ (NUMBER, WHEN, WHO, WHERE, WHAT)
$$ ##TITLE= Audit trail, XWIN-NMR		Version 3.5
$$ ##JCAMPDX= 5.01
$$ ##ORIGIN= Bruker BioSpin GmbH
$$ ##OWNER= she
$$ F:/spectra/data/she/nmr/H-C/1/audita.txt
$$ ##AUDIT TRAIL=  $$ (NUMBER, WHEN, WHO, WHERE, WHAT)
(   1,<2026-06-26 13:14:33.93 +0400>,<she>,<DPX200>,
      <created by zg, POWCHK disabled, PULCHK disabled
       configuration hash MD5:
       00 E9 B6 7A A2 85 ED C7 34 08 36 98 17 FE 4E 26
       data hash MD5: 16K
       43 3E E4 96 1E B8 FD E9 FF F8 34 FD E8 41 19 8C>)
$$ ##END=
$$ 
$$ hash MD5
$$ 56 D0 F4 AD D7 30 7A BD AB 9E 60 BF A7 DD 65 99
##$RELAX= 
##$RELAX= 
##$RELAX= 
##$RELAX= 
##$RELAX= 
##$RELAX= 
$$ Bruker specific parameters
$$ --------------------------
##$DU= <F:/spectra>
##$EXPNO= 1
##$NAME= <H-C>
##$PROCNO= 1
##$TYPE= <nmr>
##$USER= <she>
##$AMP= (0..31)
100 100 100 100 100 100 100 100 100 100 100 100 100 100 100 100 100 100 
100 100 100 100 100 100 100 100 100 100 100 100 100 100 
##$AQSEQ= 0
##$AQ_mod= 1
##$AUNM= <au_zg>
##$AUTOPOS= <>
##$BF1= 200.13
##$BF2= 200.13
##$BF3= 200.13
##$BF4= 200.13
##$BF5= 200.13
##$BF6= 200.13
##$BF7= 200.13
##$BF8= 200.13
##$BYTORDA= 1
##$CFDGTYP= 0
##$CFRGTYP= 5
##$CHEMSTR= <none>
##$CNST= (0..31)
1 1 145 1 1 1 1 1 1 1 1 1 1 1 1 1 1 1 1 1 1 1 1 1 1 1 1 1 1 1 1 1 
##$CPDPRG= <>
##$CPDPRG1= <>
##$CPDPRG2= <>
##$CPDPRG3= <>
##$CPDPRG4= <mlev>
##$CPDPRG5= <mlev>
##$CPDPRG6= <mlev>
##$CPDPRG7= <mlev>
##$CPDPRG8= <mlev>
##$CPDPRGB= <>
##$CPDPRGT= <>
##$D= (0..31)
0 0.7 0 0 0 0 0 0 0 0 0 0.03 0 0 0 0 0 0 0 0 0 0 0 0 0 0 0 0 0 0 0 0 
##$DATE= 1782465273
##$DBL= (0..7)
120 120 120 120 120 120 120 120 
##$DBP= (0..7)
150 150 150 150 150 150 150 150 
##$DBP07= 0
##$DBPNAM0= <>
##$DBPNAM1= <>
##$DBPNAM2= <>
##$DBPNAM3= <>
##$DBPNAM4= <>
##$DBPNAM5= <>
##$DBPNAM6= <>
##$DBPNAM7= <>
##$DBPOAL= (0..7)
0.5 0.5 0.5 0.5 0.5 0.5 0.5 0.5 
##$DBPOFFS= (0..7)
0 0 0 0 0 0 0 0 
##$DE= 6
##$DECBNUC= <off>
##$DECIM= 32
##$DECNUC= <off>
##$DECSTAT= 4
##$DIGMOD= 1
##$DIGTYP= 9
##$DL= (0..7)
0 120 120 120 120 120 120 120 
##$DP= (0..7)
150 150 150 150 150 150 150 150 
##$DP07= 0
##$DPNAME0= <>
##$DPNAME1= <>
##$DPNAME2= <>
##$DPNAME3= <>
##$DPNAME4= <>
##$DPNAME5= <>
##$DPNAME6= <>
##$DPNAME7= <>
##$DPOAL= (0..7)
0.5 0.5 0.5 0.5 0.5 0.5 0.5 0.5 
##$DPOFFS= (0..7)
0 0 0 0 0 0 0 0 
##$DQDMODE= 0
##$DR= 18
##$DS= 0
##$DSLIST= <SSSSSSSSSSSSSSS>
##$DSPFIRM= 0
$$ [...]
##$SUBNAM0= <"">
##$SUBNAM1= <"">
##$SUBNAM2= <"">
##$SUBNAM3= <"">
##$SUBNAM4= <"">
##$SUBNAM5= <"">
##$SUBNAM6= <"">
##$SUBNAM7= <"">
##$SUBNAM8= <"">
##$SUBNAM9= <"">
##$SW= 18.0517328524113
##$SWIBOX= (0..15)
0 0 2 0 0 0 0 0 0 0 0 0 0 0 0 0 
##$SW_h= 3612.71676300578
##$TD= 16384
##$TD0= 1
##$TE= 0
##$TE2= 300
##$TE3= 300
##$TEG= 300
##$TL= (0..7)
0 120 120 120 120 120 120 120 
##$TP= (0..7)
150 150 150 150 150 150 150 150 
##$TP07= 0
##$TPNAME0= <>
##$TPNAME1= <>
##$TPNAME2= <>
##$TPNAME3= <>
##$TPNAME4= <>
##$TPNAME5= <>
##$TPNAME6= <>
##$TPNAME7= <>
##$TPOAL= (0..7)
0.5 0.5 0.5 0.5 0.5 0.5 0.5 0.5 
##$TPOFFS= (0..7)
0 0 0 0 0 0 0 0 
##$TUNHIN= 0
##$TUNHOUT= 0
##$TUNXOUT= 0
##$USERA1= <user>
##$USERA2= <user>
##$USERA3= <user>
##$USERA4= <user>
##$USERA5= <user>
##$V9= 5
##$VALIST= <valist>
##$VCLIST= <CCCCCCCCCCCCCCC>
##$VD= 0
##$VDLIST= <DDDDDDDDDDDDDDD>
##$VPLIST= <PPPPPPPPPPPPPPP>
##$VTLIST= <TTTTTTTTTTTTTTT>
##$WBST= 1024
##$WBSW= 4
##$XGAIN= (0..3)
0 0 0 0 
##$XL= 0
##$YL= 0
##$YMAX_a= 970253
##$YMIN_a= -758231
##$ZGOPTNS= <>
##$ZL1= 120
##$ZL2= 120
##$ZL3= 120
##$ZL4= 120
##$ABSF1= 10
##$ABSF2= 0
##$ABSG= 5
##$ABSL= 3
##$ALPHA= 0
##$AQORDER= 0
##$ASSFAC= 0
##$ASSFACI= 0
##$ASSFACX= 0
##$ASSWID= 0
##$AUNMP= <proc_1d>
##$AZFE= 0.1
##$AZFW= 0.1
##$BCFW= 1
##$BC_mod= 2
##$BYTORDP= 1
##$COROFFS= 0
##$CY= -3
##$DATMOD= 1
##$DC= 2
##$DFILT= <>
##$DTYPP= 0
##$F1P= 0
##$F2P= 0
##$FCOR= 0.5
##$FTSIZE= 0
##$FT_mod= 4
##$GAMMA= 1
##$GB= 0.15
##$INTBC= 1
##$INTSCL= 1
##$ISEN= 128
##$LB= 0.25
##$LEV0= 0
##$LPBIN= 0
##$MAXI= 10000
##$MC2= 0
##$MEAN= 0
##$ME_mod= 0
##$MI= 1.114404
##$NCOEF= 0
##$NC_proc= 0
##$NLEV= 6
##$NOISF1= 3.799351
##$NOISF2= 2.8
##$NSP= 1
##$NTH_PI= 0
##$NZP= 0
##$OFFSET= 14.38212
##$PC= 1
##$PHC0= -4228.979
##$PHC1= 21.1923
##$PH_mod= 1
##$PKNL= yes
##$PPARMOD= 0
##$PSCAL= 0
##$PSIGN= 0
##$REVERSE= no
##$SF= 200.129724274929
##$SI= 16384
##$SIGF1= 3
##$SIGF2= 2
##$SINO= 400
##$SIOLD= 16384
##$SREGLST= <1H.CDCl3>
##$SSB= 0
##$STSI= 0
##$STSR= 0
##$SW_p= 3205.1282051282
##$SYMM= 0
##$S_DEV= 0
##$TDeff= 0
##$TDoff= 0
##$TI= <>
##$TILT= no
##$TM1= 0
##$TM2= 0
##$TOPLEV= 0
##$USERP1= <user>
##$USERP2= <user>
##$USERP3= <user>
##$USERP4= <user>
##$USERP5= <user>
##$WDW= 1
##$XDIM= 8192
##$YMAX_p= 0
##$YMIN_p= 0
$$ End of Bruker specific parameters
$$ ---------------------------------
##NTUPLES= NMR FID
##VAR_NAME=  TIME,          FID/REAL,        FID/IMAG
##SYMBOL=    X,             R,               I
##VAR_TYPE=  INDEPENDENT,   DEPENDENT,       DEPENDENT
##VAR_FORM=  AFFN,          ASDF,            ASDF
##VAR_DIM=   8192,          8192,            8192
##UNITS=     SECONDS,       ARBITRARY UNITS, ARBITRARY UNITS
##FACTOR=    0.0002768,     1,               1
##FIRST=     0,             0,               0
##LAST=      2.2672688,     0,               0
##MIN=       0,             -758231,         0
##MAX=       2.2672688,     970253,          0
$$ Real data points
##PAGE= N=1
##DATA TABLE= (X++(R..R)), XYDATA
0@%%%%%%%%%%%%QqQj6J6k4L1l6M3m7N7o8Q1r7J12j29J46j70J99k27K59k91L31
35A78l76M21m74N28n92O61p31Q15r04J001j107J222j351J488j639J805j988K193
53A150k416K668k950L265l629M043m527N101n790O642p722R148j1119J4046j8900
68a0990K8745q0107L06939M51469O4151k14263m40698m34708l27269j01500J22575
79f35656L47921M56283M23420J98724j07701l86009m82112l82910j26715J48497
89e46258L53206M10594L28431J30492j08040l15102m03304l45990j58235Q0854
99e73352K89716L90570L53949J84400n9068k95751m21580l77946j74766R6546
109e87282L13630L88370L09061J32378o4085k23912l13453l09871j96504J1781
$$ y = [0, 0, 0, 0, 0, 0, 0, 0, 0, 0, 0, 0, 0, 8, 0, 8, -8, 8, -16, 15, -21, 22, -25, 32, -36, 45, -52, 60, -69, 77, -93, 106, -121, 138, -153, 178, -198, 223, -251, 277, -315, 346, -385, 430, -474, 527, -580, 642, -709, 779, -860, 945, -1043, 1150, -1266, 1402, -1548, 1717, -1912, 2131, -2396, 2705, -3085, 3557, -4165, 4983, -6136, 7910, -10990, 17755, -62352, 244587, 696056, 760207, 545944, 105246, -329462, -656731, -758231, -635656, -287735, 168548, 591968, 790692, 682991, 296982, -185130, -568040, -694755, -546258, -193052, 217542, 545973, 676465, 568425, 253323, -149981, -495971, -654206, -573352, -283636, 106934, 460883, 645283, 586215, 290464, -131116, -509062, -683828, -587282, -273652, 114718, 423779, 556157, 492072, 268160, -45293, -355164, -551668, -539887]
119e39887K46292L95523L71749J76246r2229l02133l64359k81111j17705N2136
129d55478J86189K66120K72484J86420J5028j84913l21230l19475j76642M0981
139d90516K31348L17629K79731J47200k4468j79903k70744k68835j72505j2601
149d43664J55257K66253K76892J83385J7813j58752k80068k92955j87445k186
159d65470J83398K87511K67081J44772j7655j52498k23756k23371j60873m4371
169d05232J01839K31499K79833K06324L3056j58135k70132k55553j37432J2707
179c61226J31209J88891J91133J45456N6959o5621j85722k46517k03973o5131
189d14542J08115K31620K51186J67160K7541j06035j88469k03652j53048n2909
$$ y = [-539887, -293595, 101928, 473677, 649923, 557694, 255561, -108798, -389909, -507614, -455478, -269289, -3169, 269315, 455735, 470763, 285850, -35380, -354855, -531497, -490516, -259168, 58461, 338192, 485392, 460924, 281021, 10277, -258558, -431063, -443664, -288407, -22154, 254738, 438123, 455936, 297184, 17116, -275839, -463284, -465470, -282072, 5439, 272520, 417292, 399637, 247139, 23383, -199988, -360861, -405232, -303393, -71894, 207939, 414263, 447319, 289184, 19052, -236501, -373933, -361226, -230017, -41126, 150007, 295463, 352422, 286801, 101079, -145438, -349411, -414542, -306427, -74807, 176379, 343539, 371080, 265045, 76576, -127076, -280124, -333033]
199c33033O7202J68601K11354J75380O9102o8098j82884k28582j84029o5034Q1979
210b88042J92679K20745J56631L5840q5777j60746j73045j33497n7529L5049J27440
221a30252J88776J84895R9564m0300j68843k20381j69047m7052P8084J51265J58028
232H4737J16618N2182k2796j00352j60988j72413j10427J2352J40144K06660J77817
243B23534P2576n3074j41181j64094j26520n2550L0615J02529J44638J41256Q6390
254B64119o133j04089j67257j64378r4652J5329J17930J68049J47032O6845l3440
265B09355j10200j38206j15905o0869P106P2708J22332J38160J04579K1214q2824
276A67450j58165j62344r0152K0344J11746J43477J14755N2445j2009o3775j00547
$$ y = [-333033, -265831, -97230, 114124, 289504, 358606, 290508, 107624, -120958, -304987, -370021, -288042, -95363, 125382, 282013, 317853, 232076, 71330, -101715, -235212, -292741, -257692, -130252, 58524, 243419, 342983, 302683, 133840, -86541, -255588, -302640, -224556, -73291, 84737, 201355, 253537, 230741, 130389, -30599, -203012, -313439, -301087, -160943, 45717, 223534, 296110, 243036, 101855, -62239, -188759, -241309, -210694, -108165, 36473, 177729, 264119, 257986, 153897, -13360, -177738, -272390, -257061, -139131, 28918, 175950, 242795, 209355, 99155, -39051, -154956, -215825, -208719, -136011, -13679, 124481, 229060, 250274, 167450, 9285, -153059, -243211, -222867, -111121, 32356, 147111, 199556, 187547, 123772, 23225]
287B3225j16465r7767l6110N3698J32641J54892J04608M160r3627j41583j24062
298a36390o1252J2731P0740J00110J02173P7683K9281l7609r9116j28131j04523
309a74303l1715N8495J23749J32349Q2368J027p3154j10476j03619o4442j2823
320a72544L8546P7651R8778R0036M4814k6063r4688j26866r9666k4098O2395J15260
332a6445J14714O7382L587m7962p5877q2739p0987m0813Q428O5039J04627J00744
344A29698M6365l5720j02373j19195p9530j0182N3135Q4517Q2320N8500K6455
355A33990r913m8880q0685q8196n6963P369P4890J11045R2870L1285m0821q7048
367C8943r0261n9700j5793K2200M9128O4703O6748M7866N615m8750r0481r4165
$$ y = [23225, -93240, -191007, -227117, -173419, -40778, 114114, 218722, 222882, 129255, -12328, -136390, -197642, -184911, -114171, -14061, 88112, 165795, 195076, 157467, 58351, -69780, -174303, -206018, -147523, -23774, 108575, 190943, 191970, 118816, 8340, -95279, -159721, -172544, -133998, -56347, 42431, 132467, 177281, 151218, 56530, -70336, -170002, -194100, -131705, -16445, 98269, 165651, 169238, 121276, 45399, -37340, -108327, -149140, -140712, -75673, 28954, 129698, 176063, 140343, 37970, -81225, -160755, -170937, -117802, -33285, 49035, 107535, 133990, 124077, 75197, -5488, -93684, -150647, -143278, -68388, 42657, 135527, 166812, 125991, 38943, -51318, -111018, -126811, -104611, -55483, 9220, 75968, 123834, 129449, 80699, -9782, -103947]
379a03947n3382J4694P4568R7417P5513K5063k5766n6839o3694n1460k9742q32
391i8407L2891O4165P6775N8192P803n3166r3728r0350m4202J7895O3914P4158
403A5940N2699J9353r679k9411m4210n2930m8348j9995K8303P4664Q9172N8990
415A34548j873n9671q3310o5095k3764J5428L7251M3633M1994L5878J7747j3746
427G9020n1557p3160o0877j5845M0605P6157P4122L7530r966m4996n5300m5441
439d9708k5731l444J7937L7505N0357M7503K4160j6076n4828p0886n3845r198
451a06254L8248O4285N7969K7459o516k8619l4325l2475k9790k1326m48L1544
463d0248N9871O1341K9000k3605o5605p1637m0230M660L5777M2371L2238J9764
$$ y = [-103947, -157329, -142635, -68067, 29350, 104863, 129926, 104160, 47321, -16373, -67833, -97575, -98407, -65516, -1351, 75424, 133616, 141419, 88253, -5475, -95825, -140027, -122132, -58218, 15940, 68639, 87992, 78313, 48902, 4692, -48238, -96586, -116581, -88278, -13614, 75558, 134548, 132675, 73004, -10306, -75401, -99165, -83737, -46486, -2853, 39141, 75019, 92766, 79020, 27463, -45697, -106574, -122419, -81814, -5657, 68465, 105995, 96029, 51033, -4267, -49708, -75439, -78883, -60946, -23441, 26916, 74419, 98579, 82503, 27675, -43211, -97056, -106254, -68006, -3721, 54248, 81707, 75191, 46572, 12247, -20228, -50018, -71344, -71792, -40248, 19623, 80964, 109964, 86359, 20754, -50883, -91113, -86453, -50676, -8305, 23933, 43697]
475D3697J1116m3j9602m2256n1181l2615Q308N0736O6987M8129O952l1042m7438
488A1748m1598k2527l289J0704K1632L0251L3634K5740M626k4548m6941m9434
500e0002k8460P579L9848N1900L6784O470k2436l5667l2452k1011j1162j891J1872
513d8628L1711M6975M3525J2984k8459n6221n1245j6427K4084M4265L6690J3875
525E3129m703j1652j3438k0072l1653l4115j7271J6869M5948N1736K8205q451
537E4532l5354l8331k1903j033J2028J6146J7167J8600J8652J1583o215k7555
549A8317l9728l4105r391K1458M2640M2715K1962p334k8129l2134k2822q725J400
562c3876O132J2407K0298K4869J7023p401l4211m6002l0333L245L5618M4788L0221
$$ y = [43697, 54813, 54770, 35168, -7088, -58269, -90884, -82576, -31840, 35147, 83276, 90228, 59186, 11748, -29850, -52377, -55666, -44962, -23330, 6921, 40555, 66295, 70921, 46373, -568, -50002, -78462, -70883, -31035, 20865, 57649, 64119, 41683, 6016, -26436, -47447, -58609, -60500, -48628, -16917, 30058, 73583, 86567, 58108, 1887, -49358, -65785, -41701, 2564, 39254, 53129, 48426, 36774, 23336, 3264, -28389, -62504, -79775, -62906, -16958, 34778, 62983, 54532, 19178, -19153, -41056, -42089, -30061, -13915, 3252, 21852, 40504, 52087, 45872, 18317, -21411, -55516, -64907, -43449, -809, 41906, 63868, 56534, 28405, -3729, -26551, -35276, -33876, -27744, -15337, 4961, 29830, 46853, 39452, 5241, -40761, -71094, -67849, -32231, 12557, 42778]
575D2778M703j2004j2849p776p634j4786j8722r289J2823L1880L2568J0609j9609
588C2692l7815l4398j3714Q446J9321J8415J4277J2548J1880P886p075k2796l1219
601b1552k2591J195K5775L6551K6921L060k1332l1763k5645r788N009J1738J2426
614i996J1897J3934J4849P260r857k6837l1305j6771R292K9532L1113J4171p244
627C0038j7572j4028m966q73m948r488k523J3119K7827K6188N356k1161l5790
640h821k8903o758J3899K1294J4947N761O50J387L83p201j6426j9304p895J1997
654b4990K9256L1396J5483q098k5035k6861j4847P89J0581R819N584K079L427
667H583M913R81r016j9880k0042p101J2841K6647K4420Q486r415j6935j1362j753
$$ y = [42778, 47481, 35477, 22628, 14852, 7218, -7568, -26290, -35579, -22756, 9124, 41692, 52301, 32692, -5123, -39521, -53235, -44789, -25468, -7053, 7224, 19772, 31652, 39538, 32463, 9667, -21552, -44143, -42948, -17173, 19378, 46299, 49359, 28027, -3736, -29381, -39169, -34160, -22422, -9996, 1901, 15835, 30684, 37944, 28087, 1250, -30055, -46826, -37534, -8002, 23111, 37282, 30038, 12466, -1562, -6528, -7401, -12349, -21837, -24360, -11241, 16586, 42774, 48130, 26969, -8821, -37724, -44482, -30583, -9289, 5658, 11419, 12069, 13456, 13839, 6638, -9788, -29092, -36987, -24990, 4266, 35662, 51145, 43047, 18012, -8849, -23696, -22907, -12326, -2507, 3077, 5156, 8583, 13496, 14477, 5461, -14419, -34461, -41562, -28721, -2074, 22346, 30832, 21417, 4482, -6880, -8633]
681h633K863n77m456p0J1837K1744J7519j513k3913l1160k0141K686K0903K2463
695I552J0038l723r388o109k515m189r679j0924k551J3118K3796K0857N236j3132
709B0387k1995j6446k461R931J2938P665Q17j211J870K893l1r375j6439j4884
723b6341k932J3513K1713J6271J519j3368j7405j0463P53N841L833N97J942Q975
737D448J4271R458n300k0151k2668r565J0062K2535J8692L966j0519j3524p366
750e661L37J391l882q105k855P957J7023J4358Q82j3635j9064j1536L342J2916
764f532J3064N239j988k808J726L708m24q871j4088r741K569J4773J7535Q478
778B2640o053j6273j5248n889M497Q553N297J307O35M991Q187L903n367j3981
$$ y = [-8633, -5770, -6347, -10803, -10873, 964, 22708, 40227, 38714, 14801, -16359, -36500, -33814, -12911, 9552, 19590, 15867, 6479, 370, -2145, -6334, -16013, -26937, -29488, -16370, 7426, 28283, 33519, 20387, -1608, -18054, -20515, -10584, 2354, 10019, 10836, 9625, 11495, 14388, 14357, 4982, -11457, -26341, -29273, -15760, 5953, 22224, 23743, 10375, -7030, -17493, -16740, -10899, -7066, -6469, -4527, 4448, 18719, 28177, 22877, 2726, -19942, -29507, -19445, 3090, 21782, 25748, 15229, 1705, -5661, -5324, -3933, -7815, -15920, -18775, -10818, 6205, 20563, 21445, 7810, -11254, -22790, -19448, -6532, 6532, 11771, 9783, 6975, 8701, 12409, 11985, 3114, -10974, -20715, -18146, -3373, 14162, 22640, 16587, 314, -14934, -20823, -16326, -7773, -2476, -1169, -534, 4457, 12644, 16547, 11180, -2801]
792b801j3906l073J1519J8381J2645r65j2189j3496n339K836M255q57o101l480
806a2571N417J3113J1095o37j3369j7513q463N873J4838J2132K727n529n375J70
820A908L468O28o111r990m961O271J4970J3328K827j0054j5763j1151n58P466
834g722P633K442k182k632J349M537K409m673j0225q270P20J1838J5658R741k188
849A8435j0535j0770l163M607N149J59n601m233K638Q834O987l400j3189j4563
863a8645m897Q063J5525J0882N93p332o339M0M726K788l311p479l554N359J1421
878G840R232o88j1102j3157o771K973Q934P215J358m206l241J149M028J513m167
893I10q739o917J916R873J2255N777m548j1184q713k36O788P158J310l705l446
$$ y = [-2801, -16707, -19780, -8261, 10120, 22765, 21800, 9611, -3885, -9224, -6388, -2133, -2990, -9091, -12571, -7154, 5959, 17054, 16417, 3048, -14465, -22928, -17055, -2217, 9915, 12642, 7113, 1738, 1908, 5376, 6004, -107, -10097, -15058, -8787, 6183, 19511, 22338, 12284, -3479, -14630, -15188, -7722, -89, 2353, 171, -2461, -1112, 3425, 5834, 1161, -9064, -17334, -16614, -4776, 10882, 20623, 18435, 7900, -2870, -6033, -1426, 3723, 3882, -1719, -5952, -3314, 5520, 12507, 9107, -4082, -18645, -23542, -15479, 46, 10928, 11521, 4189, -2150, -2110, 2616, 5404, 2093, -5386, -8940, -3581, 7840, 17072, 16384, 5282, -7875, -14646, -11673, -2739, 4476, 5834, 1628, -1613, -464, 3564, 5077, 910, -7829, -14746, -12830, -2957, 9298, 15075, 10527, -657, -9370, -9606, -2818, 4340, 5650, 1945, -1501]
908a501K266P344N231l446j1971j1772k515Q294J2103P083k904r817o757L31O146
923a885M268k155n548k340N071J0335P484j300j0079j0869l948M492Q856N650
937H032j191n415m005J11L248J717l489o571m435K315R010R511L371n796r375
952b962o893J730P411O813J022m004m254J139N524L982l024q976r277j282Q285
967d766J0844M756m849r625o093J568O603M279j618n014k618M146Q846N629k172
982I916r079r234j341O365Q208M621k457n437l857L59L327K014k522n641l614
997h372K100O776P093N63o133r157n178K655P215O663O95m155l648J407N820M539
1013H883j320p319o899N38P765Q951K168o227j0071o132J989O040L646k534n532
$$ y = [-1501, 765, 8109, 13340, 9894, -2077, -13849, -16364, -8070, 4033, 11116, 8212, -1605, -8362, -8031, -1885, 2383, 228, -5320, -7660, -2589, 7746, 15230, 13930, 3851, -7018, -10966, -6474, 2382, 8032, 6841, 1426, -2579, -2468, 780, 2497, -992, -7563, -11998, -9683, -673, 8838, 12209, 6413, -2962, -9855, -8125, -714, 6099, 7121, 3117, -1137, 2, 5526, 9508, 6484, -2492, -11769, -13051, -4766, 6078, 10834, 5985, -3640, -9733, -8165, -1562, 2717, 1099, -3915, -6533, -2387, 6459, 12088, 9916, 837, -8397, -9738, -3373, 4835, 9456, 6999, 1562, -2295, -1936, 1391, 3405, 883, -4758, -8372, -6272, 504, 7597, 8160, 2027, -7130, -12308, -9653, -2438, 4225, 4920, 765, -2883, -1476, 4344, 8883, 7563, 244, -6655, -6117, 1648, 10599, 12767, 6540, -3531, -9663, -7674, -1634, 2012, -522, -6054]
1028f054k241L444P372M573k227p426n939O02O918P699L134l164n501l655O88
1043a777L250J998k273m294k653J790O115N698J50o271p772l670L560P428N097
1058F376j241n135m818N14M743L870j491o397m595J354P898P460J359n722p837
1073c662l144L817O329K990l272n581k683K876N254L132l037o921n526J282O101
1088b045P004K475k815n614k219J282L785K011j356l653k911K141M610L248j194
1103D749o089o612j591M601P247M080j609o146l582J311N186M340j184n740m205
1118e244J381O423N730l7o414o846j829L708N999J863l383m594j679L093N015
1133C186K275l876o138m019J992O741N872N44l995n176k212K133M307K617j134
$$ y = [-6054, -8295, -4851, 2521, 7094, 4867, -2559, -8498, -7896, -978, 6721, 9855, 6691, 1190, -2465, -1777, 1473, 3471, 1198, -3096, -5749, -3959, 2156, 7854, 8004, 1733, -6039, -9709, -6149, 1279, 6376, 5135, 0, -4818, -4304, 439, 4309, 2818, -3579, -8174, -6820, 1078, 8538, 9897, 4175, -3662, -6806, -2989, 3340, 6330, 3058, -2523, -5206, -2330, 2924, 6056, 3019, -3902, -9428, -8146, -2045, 4959, 7434, 4619, -995, -3214, -1932, 1853, 3864, 2508, -1145, -4056, -1915, 2695, 5943, 4749, -1340, -7952, -9543, -4942, 2305, 6385, 4776, -1370, -4952, -3641, 1545, 5885, 4701, -1039, -5244, -3863, 2560, 8290, 8253, 1839, -5007, -6836, -3128, 2871, 4734, 1351, -3243, -4922, -1829, 3186, 5461, 1585, -4553, -8572, -6580, 161, 6033, 6577, 2582, -2594, -4806, -2673, 1634, 4251, 3117]
1148C117l154j703J416L706K354j467n237m655n07M298N136J853l247n490l045
1163f625K042N160L459j574n290l661K063O285N555j62n652n948j292M271N625
1178D256J773l212m392j469K343M171O94l659m998k762K907N479M267p87m807
1193a96m913p77L012M492K406j295l323j578R45L383K505q58l659l685m23L486
1209d78M275J019l076m555k433K071M232K622k279m996l041K882N775M225r68
1224E275n505n457l14M792N942J337k836m840j700K419L516Q59l097m109j261
1239d979K609M224K613j974m292l360O9L798L554J498k549k930j312J705L403
1254B077K126o00l354l467k45L435L491J195k327m203j893J277L414K064j814
$$ y = [3117, -37, -1740, -324, 3382, 5736, 4269, -968, -5623, -6130, -1832, 3304, 5157, 1910, -3580, -6625, -4583, 577, 4036, 2462, -2828, -6489, -4426, 1859, 7414, 7252, 1600, -4348, -5640, -1369, 4256, 6029, 2817, -1575, -3044, -701, 3470, 4164, 505, -4493, -7255, -4348, 1131, 5398, 4611, -196, -5109, -5886, -2874, 1618, 4024, 2729, -594, -2172, -1227, 2156, 4661, 3803, 144, -3541, -3964, -478, 3797, 4816, 1740, -2815, -5248, -3177, 1055, 3677, 1398, -3598, -6639, -3757, 2018, 6243, 5275, -230, -5687, -6001, -1209, 4733, 6070, 3234, -1606, -3306, -887, 2629, 3488, 391, -3718, -4979, -2370, 1854, 4467, 2493, -1799, -5159, -5090, -1292, 2262, 3760, 1211, -1719, -3031, -1326, 2077, 4203, 3603, 249, -3218, -3463, -28, 3463, 4658, 2331, -1872, -3765, -2488, 926, 2990, 1176]
1269A176m062k417K417M700K922j470n384m058N09N397N622Q15l989m701r55K593
1285h85M329J433k982l406j666J764L618J712j621m273k996R88K757L068j38j692
1301A0l032j79K205L020J519j061l379k473Q26L615L307P08k961l924j575J436
1317a938L263J736j546l519k055J678L933K061j548m172l175J031M379M078J78
1332D384l599l918o34L051L903J297k541l707j891K230M099J637j584l821k408
1347c502L48K510K912M62k818k659k47J746K558R97j544k462j608J233L356K575
1363C857k33k879l121o51K322L385J098j548l460k010J536K931J781j438l375
1378a805k451R63L369L052j29l037l323k93K709L690Q47k310k885j166K414L226
$$ y = [1176, -2886, -5303, -2886, 1814, 4736, 3266, -2118, -6176, -5667, -270, 5352, 6167, 2178, -2523, -3478, -885, 3444, 4877, 1895, -1511, -3177, -1413, 2205, 3917, 2296, -1977, -4973, -3985, -1228, 1840, 1702, 10, -3022, -3201, -996, 2024, 3543, 2482, -897, -3370, -2544, 1071, 4378, 5086, 2125, -1799, -3374, -1938, 1325, 3061, 1515, -2004, -4059, -2381, 1552, 3613, 2065, -2107, -5282, -4251, 128, 4206, 4384, 785, -3133, -3767, -716, 3187, 4484, 1943, -1764, -3655, -1425, 2674, 4311, 2727, -1094, -3502, -3154, -644, 2268, 2730, -88, -2747, -2994, -1248, 1310, 2307, 763, -1699, -3307, -2074, 1282, 3857, 3624, 745, -2376, -3027, -705, 2680, 3778, 2230, -1230, -3240, -1704, 1227, 3008, 1570, -1805, -4256, -3293, 76, 3128, 2999, -38, -3361, -3654, -945, 2745, 3592, 1282, -1603, -2769, -355, 2871]
1394B871J270j561l590k172N97K684K267N2k193k832l55J601K224Q83j525j821
1410a600j522J717K559J823k77k374k563j34K275K949K53j885k571j492J761K717
1426A636J371j428k950k202R28L321K275k93k604k594o26K104L138N77j970k645
1442a962q40J624L231R73q15l159j832R65K730K243l42k240k508n74J767K015
1458A276Q82j564k388j058J043K401J649m47k197k067L80K021K385N25j502k600
1474a261p44J492K281R92j623k713j561J062K334K101n53k373k258j35K326K473
1490A840N38j478k120j111J377K520J054j055k285j527M25K617J841m88k226j970
1506b048j18J872J710O26j687k196j009J413K213J588p67k350j572J12K132K070
$$ y = [2871, 4141, 2580, -1010, -3182, -2585, 99, 2366, 2418, 225, -2607, -2962, -1361, 863, 1746, 221, -1600, -3122, -1405, 1154, 2977, 2700, 326, -2237, -2371, -96, 2853, 3106, 1221, -1350, -2842, -1081, 1636, 3007, 1579, -1371, -3573, -2645, 676, 2951, 2658, 54, -2540, -3166, -1062, 2076, 2653, 683, -1962, -2802, -1178, 2053, 3026, 2211, -948, -2780, -1815, 915, 3158, 2816, 576, -1932, -2506, -739, 1276, 2158, 594, -1794, -2852, -1809, 592, 2241, 1794, -403, -2470, -2090, -69, 2316, 2841, 1339, -1261, -2005, -513, 1768, 2760, 1137, -1576, -3137, -2075, 259, 2360, 1807, -566, -2824, -2959, -633, 1840, 2378, 900, -1220, -2331, -954, 1566, 2620, 1565, -720, -2247, -1822, 795, 2636, 2148, -78, -2048, -2166, -294, 1416, 2042, 355, -1841, -2850, -1437, 776, 2364, 1597, -753, -2325, -2213, -81, 1989]
1522A989N84j463k435k12J216K188P36j217k762r51J133J817J838j153k215j443
1538b350j88J740K030O61j593k090j81J038J980J116p83j890j271M23K174J674
1554B490q7j880j629n05J453J606K94j085j877r14P62K049J168p90k143j621M80
1571b229J996J867N7j286j747n19J566K168N51j255j960l69N67J851Q67n52j981
1588d08j737L63J474J235L66j249j965%Q01J795R24p65j366j160M53J593J284
1605A638p8j147j481l96J330J888O8j131j445p28L85J919J059o75j575j296j44
1622a809J538J596O9j361j806k13J311J728N36r28j310p66R49J607Q54k88j771
1639f4j031p2J694J075p7j529j382l14R56J749K4n20j380q21N23J148J325J1j348
$$ y = [1989, 2573, 1110, -1325, -1537, -321, 1867, 2603, 1386, -1376, -2327, -1194, 623, 2461, 1308, -907, -2350, -2538, -798, 1232, 1893, 300, -1790, -1971, -933, 1047, 2163, 1380, -510, -1781, -1358, 816, 2490, 2403, 523, -1106, -1611, -158, 1448, 1742, 657, -1220, -2134, -1372, 677, 1845, 1055, -1088, -2709, -2229, -233, 1634, 1691, 405, -1342, -1861, -295, 1873, 2424, 1169, -791, -1160, -593, 1258, 2125, 1573, -408, -2145, -1782, -308, 927, 1293, 44, -1921, -1921, -1120, 675, 1599, 834, -532, -1692, -1239, 354, 1638, 1560, 413, -1068, -1464, -134, 1754, 1822, 691, -754, -1482, -1097, 822, 1881, 1206, -369, -1665, -1809, -271, 1325, 1394, 33, -1773, -1986, -675, 1053, 1589, 661, -649, -1415, -466, 1141, 1995, 1707, -64, -1095, -1167, 527, 1602, 1525, -4, -1386, -1700, -744, 1005, 1029, 509, -871, -1692, -1169, -21, 1304, 1315, -33]
1658c3r26l76J341J026N50r12j541n19R04J185Q21j17j935j012K11J188J643k90
1676A208j134j370k61J147J259P51j103j326q30J029J477Q33m81j632r70N86R47
1693A30J145M1j503r28j70J073J080J003j365j195q39P51R32R18oj016j143p4
1711a166J189J016J51n81q53q64P59J163O00o69j673m44K09J293J025j27j071
1728d3j181k03J039J193N69r00j299o76O38J496Q37o39r51r91M74O94J204pr66
1747B88j231p6J086R70j13p45j018l65O61P98Q16k14j217n67K33L72J090M12n54
1766F26j283k84L86J388M41o52m83r91K59J170N12n77p21o86k41O69J082L64o29
1785C50j253n50N30J391O51k43j163p97N46Q85O57J36q42p64m07R41O81J16o20
$$ y = [-33, -959, -1335, 6, 1032, 1582, 670, -871, -1390, -486, 699, 1520, 1403, -532, -1544, -1333, -145, 1498, 1208, 74, -1296, -1557, -410, 849, 1600, 497, -829, -1659, -630, 847, 1680, 1199, -433, -1403, -817, 130, 1275, 1316, -187, -1115, -1285, -212, 868, 1871, 506, -689, -1528, -777, 155, 1073, 1067, 51, -1092, -1166, 23, 1039, 1190, 609, -244, -1108, -349, 814, 1414, 745, -928, -1372, -1163, 130, 1155, 1028, -43, -1224, -1427, -388, 805, 1374, 474, -825, -1501, -863, 633, 1470, 831, -120, -1111, -637, 57, 1261, 1254, 288, -943, -1019, 67, 1037, 924, 179, -839, -1204, -543, 255, 1071, 857, -360, -927, -694, -322, 768, 1180, 626, -657, -941, -555, 833, 1274, 622, 139, -852, -593, 577, 1089, 512, -209, -895, -1136, -467, 615, 979, 350, -903, -1453, -923, 468, 1119, 876, -287, -1084, -538, 347, 1004, 1140, 298, -466, -873, 68, 749, 865, 245]
1804B45j041j98L43Q82M71k79m84p85KO06J070L00q87p88l78M48J148L63k35p12
1824I1o89K52N39O34N6m33j103k36O19Q39m7k86q95m51K68J028N75j41q12p39
1844i31K71O01J172p4p81n45j27M80O22M88o15o47p12O02N37L95j80r26p25L43
1864g52P64P42J12p70p72l01P73O57N30m36n92o25Q7Q74O98j39o05o96k47N73
1884a25Q59N5l35r55k8J47P89L94n63o49o83K05P35Q34P3p92p58o6P90N43M52
1905I22j60r50n11M02O12N84k63n90q88K71O77L41O2l82o75m73O44P08J41n4q82
1926d64J9l7N37M49R0o84l17j4J17R92J25l17j030l79N65O93K1J60n75m36K0O97
1948B32L19J22o47l83n04P10O25M5j78q24j44k91J217L71R9p35n18J7L87P12j10
$$ y = [245, -796, -994, -651, 231, 702, 423, -61, -846, -844, -238, 832, 1132, 245, -543, -921, -473, 675, 1038, 803, 91, -598, -346, 193, 827, 883, 450, -653, -889, -270, 569, 522, 236, -659, -1110, -842, 186, 761, 620, -192, -931, -660, -59, 1113, 1039, 258, -287, -414, 66, 688, 1176, 561, -86, -798, -196, 341, 736, 556, -370, -1095, -752, 12, 754, 866, 96, -676, -977, -204, 453, 983, 547, -45, -670, -583, 291, 989, 850, 245, -451, -698, -125, 734, 789, 454, -501, -529, -382, 407, 801, 238, -411, -1094, -889, -154, 680, 753, -39, -797, -863, -73, 470, 922, 762, -188, -699, -297, 315, 899, 636, 46, -842, -571, 106, 447, 509, 127, -548, -1021, -377, 331, 472, 418, -464, -445, -482, 55, 504, 594, -90, -407, -421, -304, 688, 813, 496, -534, -913, -348, 345, 366, 526, -49, -485, -465, 232, 551, 673, 26, -357, -861, -151, 474, 519, 341, -483, -627, -918, 299, 670, 769, 34, -484, -467, -80, 632, 522]
1969E22k11p38l00M00M01N06l33o29j79J12M23P79M3o80m21l9Q2O23J88j28o38
1990b17p46M95O73M14j3o90p04J33M45N23J76l08o13k88L88N65L57j46n96k26
2010c78J16N06M98k72o17l43j04K41R60J04j68q34l15L60L81O16k60q10k18L55
2030a82L16N8J74m42r8l58M55L97K54l01k20n95J60N66M71p8n43p10J03M45N39
2051D11J89m54l43k68m8R08K36j75q86k16P5O47L95o2l13m05k51N69M43K56m17
2072B91m38l91N7Q58J14P7q22n14J06N32O75j39n01r1n19M56O97n9j23n23j59
2093d16m6O25M09j19k94o15pK49P19r3j6o64k56K94M49J63j08l46m30J43L22M28
2115C91J49m89o66k5O99M62j11j42n07m76o3O63N72j45k76m68k63M66M39K68n79
$$ y = [522, 311, -427, -727, -327, 74, 580, 247, -382, -561, -449, -26, 753, 796, 116, -305, -344, -262, 361, 549, 421, -217, -963, -468, 205, 619, 606, -84, -788, -655, -210, 313, 489, 181, -432, -720, -332, 233, 590, 444, -152, -378, -262, 244, 742, 470, -147, -490, -594, -353, 607, 711, 543, -291, -606, -246, 135, 751, 491, -319, -537, -182, 134, 192, 366, -76, -174, -532, -77, 320, 574, 273, 53, -542, -382, 184, 655, 577, 34, -676, -573, -128, 411, 600, 146, -197, -465, -513, 395, 631, 456, -430, -646, -571, 76, 471, 409, 96, -309, -560, 9, 452, 708, 291, -147, -538, -481, 377, 491, 568, -254, -768, -662, -130, 545, 406, -95, -186, -705, -249, 448, 389, 266, -257, -416, -462, 163, 572, 453, 159, -456, -463, -214, 505, 412, 396, -268, -524, -230, 219, 382, 274, -72, -502, -359, -37, 391, 540, 51, -615, -640, 59, 521, 410, 268, -239, -715, -778, -115, 457, 312, 36, -432, -695, -229, 210, 478, -101]
2136a01o70J95K87N52L53n04j62p29M01N21L56N9m11o12J31L89Q4N21m43l61m84
2157f28M36M14K60j01m25p11J28M67N30N9k43n90J13j3O00M89m86o46l80M60M00
2178A33L51L6n60l35q2M32L59M93m84r59r1M49L89L03l4p27j46J10N01M30k54
2199C14j86m50j05K72N39K17l27o05PJ44N00J70q8m40m44m04Q21K88N6l36l72
2220d29m1L17Q1P46j72p08l04L26M67J03J66n58m34j02K67P58l59J55o88l81M43
2241c47P03K66m63l68l73L13M63K06J79n19k58qJ21N02N0l61l05m04L34O65K41
2262F37j80n65m01J22J94M35K20l74l40k83K98M71O49m71o61m61O8Q97J47O9l47
2283A24n64L70o2M02L14m98m80j6J35M53J98J33n65o08L02L10L15J90m89m17k28
$$ y = [-101, -771, -576, -289, 263, 616, 112, -50, -779, -378, 143, 499, 558, 147, -465, -334, 55, 139, 660, 217, -144, -628, -192, 222, 482, 381, -44, -755, -627, -160, 370, 429, 186, -404, -291, -304, 296, 785, 299, -347, -727, -267, 133, 484, 520, -40, -375, -457, -25, 334, 827, 343, -616, -707, -258, 131, 434, 400, -327, -473, -363, 138, 568, 314, 128, -322, -427, -155, 384, 601, 274, -331, -324, -180, 320, 490, 402, -38, -482, -886, -65, 223, 279, -57, -429, -470, -153, -72, 674, 502, -206, -510, -184, 283, 386, 552, -6, -440, -542, -275, 483, 124, 279, -409, -790, -347, 356, 622, 159, -209, -582, -269, 194, 400, 579, 60, -198, -206, -85, 417, 467, 106, -199, -603, -269, 396, 637, 457, -108, -509, -387, -193, 242, 462, 88, -252, -535, -237, 234, 883, 412, -249, -710, -642, 255, 402, 471, 124, -440, -70, -132, 270, 584, 86, -394, -410, -275, 178, 376, 509, -56, -664, -362, -52, 263, 453, -36, -453, -681]
2304f81N44N13J51m09m94p4O7N54N03n04l52J28r4L59L27j96j1q37Q0K13M09L74
2326E70l32m71j79M3J86P20l02l02j05k20L85K68J97k43p26J97nN08O60n48m88
2347a87n7l63N28J20O65o39k88k12K20O29M8m25k39j71N1M60L70j75m69n33J26
2368e41J88P55M1j45p43J36K4O17O5Q7p97O3k74O28L27J16n64l13k89L78O02K12
2390E73n48n10j45L65N77K20J79q65j17m6J20N67J85n71l20k04Q27n0M48k90o00
2411b05k61L21J99N14r8n01l12R1L33M30k7m41n49j76L22N37p2jm47j17j38O84
2433H6O72k77n31l87M4N73L29J83m51m48k15N8N07K29N2n78l80R0M18N38M1n27
2455B6m66k4J86N70M11l81o08j17M24J36L52j00n11m81M7O73J27J20j52o3p18
$$ y = [-681, -137, 376, 527, 118, -376, -450, -383, 171, 674, 170, -182, -54, -148, 211, 538, 342, 331, -506, -426, -213, 196, 570, 238, -233, -412, -369, -183, 537, 235, -67, -172, -392, -7, 261, 458, 215, -511, -314, -319, 189, 849, 301, -187, -244, -607, -79, 41, 706, 67, -221, -433, -213, 416, 464, 39, -200, -371, -320, 140, 510, 335, -134, -667, -541, -353, 402, 443, 298, -445, -309, -285, 332, 397, 484, -313, -250, -524, 104, 431, 547, -17, -330, -619, -241, 361, 573, 25, -485, -630, -265, 312, 532, 711, -154, -271, -317, -197, 370, 555, -16, -336, -540, 287, 237, 685, 395, -205, -466, -145, 54, 568, 470, -31, -343, -252, 81, 511, 484, 43, -506, -682, -360, 177, 105, 104, -343, -460, -598, 86, 758, 481, -50, -437, -393, 180, 509, 692, 241, -207, -422, -364, 143, 372, 424, -154, -534, -444, -26, 512, 553, 26, -440, -464, -278, 292, 703, 322, -286, -403, 21, 157, 509, 409, -102, -583, -536, 137, 264, 384, 232, 169, -549]
2476e49M31N14J54m33m01k64k4N63L68j65n97j25n3N67N80K3n69l03p0K63N65
2497D75K18p1o30k89J53L11K78r7p01r1J55J14L50J39m92m31N9M7N31O02m05l69
2519a44j96q7L16O81n4j49p01N4K72L96K37l32l53q12N93L75L37o5l18o22QO31
2541F7N33j65m26n69j47M95L89K40r7m18m50J95N65N63m37m9q98N3L44O47K93
2562G28l29o02l56K89M93K72no61q7k42L46O94j23n12o43J42L07P56q0k46k70
2583a29l69LO22N38l55m92l21N4M73N23j91l32k31l05L57N06M4J72o57l37J88
2604b39M86J13J07o67l68r9P31J36M30p70j42l21M36N39K27l67k96l56M5M68O38
2625G31m30k85j47l96M38M27K82m24k54o92O01P68J23m48o15j60k14P30L48j5
$$ y = [-549, -118, 396, 550, 117, -284, -548, -572, -9, 359, 194, -403, -528, -581, -14, 566, 589, 20, -283, -353, -90, 475, 693, 622, -8, -297, -144, 167, 445, 348, -353, -444, -289, -175, 175, 314, -178, -609, -550, -503, 28, 630, 225, -144, -340, -427, -111, 570, 516, 367, -334, -280, -8, 388, 625, 293, -60, -872, -279, 96, 433, 368, 50, -572, -564, 67, 600, 435, 9, -560, -707, -212, 177, 417, 320, -98, -548, -353, 212, 775, 338, 289, -609, -556, -212, 435, 728, 399, -203, -559, -270, 223, 495, 490, -171, -258, -500, -154, 540, 417, -95, -738, -596, -289, 467, 387, 141, -129, -498, -495, 127, 665, 310, -182, -503, -449, 24, 547, 356, 24, -207, -512, -155, 351, 395, 567, -90, -427, -239, 247, 360, 467, -200, -568, -667, 64, 200, 630, -140, -282, -603, -167, 372, 599, 232, -64, -420, -375, 93, 731, 301, 16, -131, -527, -89, 338, 620, 196, -58, -750, -149, 619, 742, 294, -321, -481, -695, 35, 383, 368]
2645C68k85o06M13k95O96J15j59n22K0J71L3L82P9o26k45J64M73K66nj30r14J62
2667d45J52K57L91j51j33p02k1N11M71j08q3n77J32J5P64O0j17m77m96N92L47
2688C82K37m85n40j42p1N95N68j64k95m76j74M41K31N1J03q49o5K34L82L44Q0
2709C87n42k03k26O38O74k40j69n56k88K22O05K91k16o09m01K3Q22J52l6j76o93
2730e41J76Q8O27J00o38k10K2K54O00P8j36m59l74J34N25K44q8l26o73k4L53N54
2752B86P3l44m66l98N53K18N68k96l78j97J32L35N97r0n11k55j68L79M04K70l89
2773C23o14k75N59J82L53j78n77n17K59J92N78J80n40k78m61M91M56K37O8n15
2793g7m14J16O88M4K34m37o16L68J29O99l1m15o31p4m0M68M19l93p7m77L9M71
$$ y = [368, 83, -523, -110, -405, 291, 406, 247, -275, -255, -84, -51, 331, 410, -216, -461, -297, 176, 442, 437, 307, -607, -445, -293, -36, 355, 204, 71, -631, -652, -141, 330, 222, 139, -438, -306, -291, 473, 533, 416, -61, -557, 35, 382, 619, 134, -406, -548, -619, -24, 544, 380, 85, -391, -565, -124, 107, 158, 261, -588, -653, -419, -37, 307, 387, -155, -358, -584, 54, 728, 488, 319, -237, -525, -303, 302, 593, 377, -232, -633, -610, 212, 364, 328, 152, -541, -365, -277, 350, 450, -188, -398, -376, -122, 478, 556, 420, -39, -413, -279, 246, 490, 402, 76, -597, -621, -268, 286, 359, 15, -451, -849, -296, -78, 490, 194, -184, -381, -249, 86, 683, 593, 82, -173, -341, 38, 442, 712, 323, -291, -566, -7, 175, 528, 350, -227, -744, -485, -293, 285, 465, -75, -353, -814, -323, 133, 370, 438, -77, -491, -375, 313, 357, 591, 154, -462, -94, 35, 734, 703, 288, -343, -417, -457, 11, 430, 37, -40, -517, -478, -7]
2815gM47k87k22k10j72p5O79K23k25l47l88N60L33J76N2o23l29J63P03j47K15
2836E19m61p58L57Q3Q24j94j09m76o2j57Q13O5j62j19m24k48K15O92M2l57m39
2857c56k24L03K99N66m28m08l16K44L39M05j13j09m74j78Q33r1L17l65n28k55
2877e39K04K88L44j43l32l38Q6O92M93r4m93m50j64K65M59L68l70p55K60r6N45
2898B30L06m38j86k33j13L93L86l6j38l57l32L16K58M18m50l09k31K02Q27j37
2918C76k46J30q27L01P8N76j15j83m43JL62M89j26q3l24m25J72L16M65k28m45
2939a79l92J43L85L44L64m30o46m9J64M35L05L0l05o61J50M07L98J57n59m20l4
2960c93L99M49L29n08n77q1k2N82K67l05j73l10j01O01O2L91p21k16K4L76J31
$$ y = [-7, 440, 153, -69, -279, -451, -526, 153, 376, 151, -196, -584, -24, 309, 485, 537, -86, -415, -252, 451, 304, 519, 58, -700, -343, -260, 564, 370, 261, -215, -277, -434, 379, 444, 282, 163, -261, -509, -294, 398, 440, 83, -356, -580, -277, 22, 588, 160, -248, -564, -320, 19, 424, 311, 202, -272, -450, 383, 292, 609, 244, -284, -539, -335, -47, 297, 154, -178, -516, -430, 262, 755, 661, 168, -282, -446, -181, 278, 646, 276, -479, -219, -315, 230, 536, 98, -88, -321, -434, -41, 345, 309, 171, -186, -518, -202, 56, 474, 24, -285, -516, -314, 513, 376, 130, 260, -567, -266, -188, 388, 273, 90, -353, -352, 10, 499, 373, 290, -34, -459, -287, 29, 494, 266, -179, -571, -428, -43, 301, 665, 235, -411, -460, -296, 139, 444, 474, 169, -492, -342, 65, 463, 620, 61, -359, -393, 6, 455, 784, 276, -301, -382, -404, 178, 445, 140, -33, -343, -444, 157, 219, 610, -111, -327, -303, 73, 204]
2981B04M3nm15l93J52N26K50l8j81k50l21O66K04Q7m83j64n10K47N78K21N8q79
3003d03J2n7K73N85N3k37m98K12p8M72L2l62l16p4L01J94J80Jm76n80L27L01N87
3026D49Jm90l16j56N53J83N89n13p20L8J26J45N34l2n20k41m47P55L82J44p06
3047b42m08M05J77O14l8l25l84Mq2K02L93Ok36l39j92J18Q80P5k66n17n17M88
3069a84M68Qk26k18k30J34M29P3L60m09n16j09L6Q26rj27l13j41k76P36L93n22
3091A83j46k59K3K72L32j48q2n24j13J71R6N62m8p84o1K08L30L57J14n26m74J27
3113c90L72J09L28l28j20j81J02L18K64k82j85j99k91M56M42n06J0j95l7K71L18
3134B76J67l34j98l22J85O01p1o3l05m47J37M28M08n13k3o80K07K91N26J25m22
$$ y = [204, 247, 242, -173, -566, -414, 112, 362, 324, 143, -107, -428, 238, 442, 529, 46, -118, -628, -381, 197, 418, 476, -403, -391, -448, -175, 410, 463, 226, -272, -60, -138, 334, 366, 4, -312, -386, -85, 109, 289, 290, -186, -766, -439, -138, 449, 450, -40, -356, -512, 41, 224, 813, 300, -420, -382, -256, -111, 423, 391, -129, -370, -817, -62, 320, 464, -242, -650, -245, -68, 546, 508, 183, -201, -197, -279, -77, 316, 322, 86, -253, -445, -327, 553, 628, 362, -155, -672, -184, 284, 292, 66, -152, -382, -248, 181, 254, 614, 205, -311, -420, -384, 442, 433, 306, -7, -148, -424, 312, 705, 183, 37, -222, -199, 73, 405, 257, 175, -349, -462, -291, -195, 367, 319, -465, -526, -318, 12, 369, 483, -43, -517, -390, -18, 91, 419, 91, -29, -210, -108, 210, 474, 192, 7, -192, -483, -27, 415, -91, -81, -276, -313, -42, 276, 443, 109, -89, -411, -226, 375, 304, 241, -64, -511, -374, 54, 462, -51, -74, -754, -547, -256, 270, 395, -27]
3155b7j58j91K93K31J87J65n61Jk23J61N70k1j82m77j24J12L92N80m96m10j0j08
3177b96N43M7N5p28J6k78O91K80q7j5n21j87Q7P28R8j21m68k81J32K60L84R6n03
3200f8l63R6K20N54n5m45m45J41J10L65O0n6k94l76L27L99J71Q1o77K32k75L84
3222H6K44J85m02j22j50j03L60L62j91o24p9K58L07K46j84j85l78pO1M37J61k47
3244C5j17l73M28j43M83L9n60m56M47M27J65n8o1m12o0j73M46K70l56j12k63K72
3266a32J81L20R7n96J07k02K28K68m1q4m17n7J42L24lm8k61k05J24K64J78Q2k57
3289A2k00m04L22N76j72km07N7k05L66K49J96m94l40L29L44L22k00j13n26l02
3310e92O02L0K34L0p45J13L52Q6mJ86l48j23J04J0N34n9m13j47R7P0N20m05j73
$$ y = [-27, -185, -376, -83, 148, 335, 500, -61, -60, -283, -122, 448, 427, 245, -232, -356, -244, 148, 728, 232, -178, -188, -296, 247, 294, 349, -379, -363, -641, 50, 330, 243, 228, -293, -480, -393, 335, 433, 312, -156, -437, -305, -45, 339, 435, -68, -431, -335, -115, 439, 384, -61, -506, -365, -255, 110, 170, 114, -180, -556, -229, 170, 341, 422, -255, -23, -298, 86, 330, 515, 113, -9, -159, -262, 98, 460, 269, -355, -434, -176, 131, 377, 193, 8, -370, -377, -316, 121, 282, 35, -82, -455, -27, -170, 313, 352, -208, -664, -217, 210, 375, 317, 256, -156, -216, -389, 57, 327, -29, -141, -404, -132, 49, 369, 466, -130, -23, -225, 3, 271, 230, 146, -271, -328, -186, 138, 135, 87, -174, -379, -255, 9, 187, 269, 12, -188, -592, -270, 306, 134, 132, -275, -218, -423, -57, 192, 388, -106, -446, -117, 227, 549, 349, 236, -290, -592, 10, 40, 274, 304, -441, -328, 24, 110, 106, 292, -56, -179, -75, -65, 469, 410, -3, -150, -53, 17, 537, 132, -41]
3333d1j60O0k21K36K64L57l38m56R9L67K85J1j91m69j00j26N34J21M9l56l92K47
3355b20K48L43J61o68k47K68K08J09L72k65l27l89K83J92kJ03k88m54J17K61N10
3376C15j88Q7m62k37M90J76J96l18K9m25j23M62N30l81j32j20l43L85L96J17l19
3397A35j06k76j19M45K56j25k38m11J20K05K85J7m65J54l39M39J30L72n08l3l88
3418d50R3N13KJ65j71l69K49j98O07r5r0m86k05L86j21P13l15k09l40J61K04L20
3440C64j50j32l15k63N73L68kj74m59R4J29L9K34j39k62k47l5L42K52M8m67j67
3462c69M34j27K78K58l83m71R1J78K41J53L18n83k96K43j6L78k13j46k46J65r1
3483b04M35J25k81j73j45j32N39K0J04m56k60L27j76Q78n12k04l10p8M15L10J39
$$ y = [-41, -201, -141, -362, -126, 138, 495, 157, -299, -200, 167, 452, 463, 272, -197, -297, -423, 111, 232, 281, -75, -467, -220, 28, 371, 532, -136, -383, -115, 93, 202, 574, 309, -18, -407, -124, 68, 66, 169, -119, -573, -456, -195, 315, 127, 214, -248, -485, 5, 181, 377, 59, 88, -337, -460, 2, 532, 151, 19, -101, -444, -59, 337, 454, 135, 29, -247, -366, 79, 335, 210, -28, -439, -319, -114, 171, 188, -277, -123, -462, -23, 107, 479, -29, -62, -450, -357, 156, 158, 323, 152, -217, 32, -166, 441, 346, 256, -230, -435, -49, -170, 543, 228, 19, -321, -160, 44, 364, 214, 82, -233, -496, 77, 445, 443, 269, -190, -96, 33, 72, 306, 167, -95, -342, -377, -35, 217, 265, -202, -369, 65, -62, 216, 474, 91, -380, -289, -111, 130, 283, 601, 18, -278, -35, -51, 327, 114, -32, -278, -113, -204, 231, 356, 75, -98, -243, -375, 164, 184, 288, -168, -428, -101, -277, 601, 89, -115, -425, -503, -88, 222, 361]
3504C61q0n0p71L45M45j19N3O0k53l18K68M46j9j54n18J65q8M44QJ54m36n67M21
3527b03J33J80K66l04n48P0M49J35J81k37j83l58J67L18L09l00k02n9R6J74M3
3548A27L28m27l20j11O94o5J21q7n34j2J23J25M07J45o29l36M19k94M46R7qm30
3570b21K9J22L54o1k6l42m55M88P6N53k99j75j74J7K32L26j8k75k37l21K96L71
3592B60n8j66m59L83p2J94L21K7l27m78j78L71N69o8m27r3l3K77R2L27k61k70
3614f9j80J06K3n2R9kl23J2L49K03M33l17m77j04q9L98K43k57J22k52J11R5K9
3637A01O7p5l48N1K8K95oL8j7k88K8J16J82R4l41k37J08O0K97J71k47k66J9R6
3661g4L92k86J62l82m2j78K39M78j55L4m19J85J02J56q5k93P9j85k68P00L0Q1
$$ y = [361, 281, 231, -540, -195, 250, 131, 184, 244, -9, -327, -59, 387, 368, 214, -304, -139, -227, 217, 225, 379, -57, -624, -203, -70, 110, 376, 72, -476, -406, 43, 178, 359, 122, -61, -419, -252, 66, 375, 75, -127, -186, -90, 84, 127, 455, 28, -292, -403, 291, 226, 347, 260, -274, -286, -163, -38, 369, 514, -115, -451, -32, -326, 120, 217, 209, -221, -192, -70, 284, 223, 197, -145, -600, -112, -36, 517, 218, 43, -131, -114, 118, 444, 426, 151, -86, -407, -111, 260, 202, 36, -423, -40, -112, 82, 403, 430, 103, -375, -553, -182, 387, 319, -108, -201, -234, 43, 135, 462, 201, -69, -249, -143, -120, -172, -73, -75, -398, -386, -37, 166, 599, 282, -195, -299, -388, 10, 253, -4, 118, -134, -23, 72, 101, 168, 93, -255, -204, -176, 119, 113, 151, 134, -154, -126, -10, 172, 266, -75, -312, -204, -144, 153, 324, 77, -189, -170, -74, 318, 32, 194, -188, -230, -408, -169, 309, 154, 188, -231, -46, 56, 212, 127, -166, -87, -272, -540, 160, 190, 271]
3683B71j89k06l8J97J63j7j42l40o5K79j24M55P4n12nm6L03J05K23p15q0K11N5
3706a43L33P6l12j10P3k18K87J51j94j98J76k27M97Qj13j27k23Jk6N43n4m45j0
3729b55r4J86N73m5j38j69m03L43n9K32j13j7m00N9J51L41r9P0q8k73M27j75J89
3752B43n2l85j34J34L9L11K19k47l3m00N07NK63n43l1J7j05L05K94k41j65n1j92
3775b42J97M01k52k15j7j86L69M2r7K02n39J22J68J28J09J85k63q5m91L98L46
3796B80q2k05k21p8J86L7L15k20j80Q9k23J22N39l82J55k36k03K65K11K53j55
3817B67n71r5L45J13J30O7k61l82K61l9J60j8l5m1R5R5N2j18K2p7k23K80l68L44
3841CL79n52q4R6K91m7K61k02k13p7n9J61L84l08m0m67L85K26P4rk69j84p4N55
$$ y = [271, 82, -124, -162, 35, 198, 181, 39, -301, -366, -87, -211, 244, 318, -194, -199, -245, 58, 163, 386, -329, -409, -198, -143, 190, 266, -46, -156, -83, -301, -14, 137, -57, -255, -79, -306, 191, 199, 86, -41, -264, -263, -289, 254, 200, -245, -255, -349, -163, 410, 365, 227, 58, -345, -2, -61, 171, 58, 41, -359, -300, -149, 192, 93, 163, 75, -198, 229, 54, 243, 191, -194, -328, -194, -155, 156, 375, 128, 95, -305, 202, 207, 470, -73, -104, -87, -192, 113, 407, 166, 1, -50, -242, -45, 356, 104, -111, -128, -314, 55, 97, 0, 202, -337, -215, -47, 81, 190, 375, 112, 27, -464, -66, 280, 198, -7, -228, -306, -120, -83, 232, 12, -168, -79, -302, -180, 359, -23, 132, -104, -307, -42, 169, 422, 267, -304, -399, -54, 59, 189, 256, -5, -387, -126, -165, -5, -23, -58, -99, -4, 91, 143, 25, 47, -30, -253, 27, -341, 3, 382, -170, -254, -158, 133, 86, 347, 145, -68, -145, -204, -43, 341, 33, -7, -474, -89, 137, 211, 202, -67, -251, -325, 230]
3865B30J42q0k55j28k40J77J61J96r6k66k4j14J20L70M4l17P3l39N20k09J15R
3887H9k91n4J41L74O7k85Q9j99j72J20K76p9k15j50K53K8K4J32j53K92l14j5m7
3910h9L72k37p0k76QJ89J66K47P0k91m03K38M72l09j27K6Q9j01n6L41o7k61J09
3933D0j01qJ31K40j23j62p9RK04n7j16K1l42J21M19O6l26P6k23K09j12k20N97
3956B64j97l02O0K52k1P1j71q8j18p7K29K59O8J2j82l8jK58p0k43L5j88l71M16
3980a43L12R2m49N0n6J58K69n7J93n35J71J9J58k01J11j6k50M1K83n3Q4n44K56
4003a07r0L70j6p7l6M0m63K31K62N5k6j30j11N6J06N2P6j96M6k45K88O9M1q5l5
4028G5m36Q5J44L73l6m81j14K21J36K64O2k62l96L6K44L60l38M0k26K19j38J92
$$ y = [230, 372, 292, 37, -91, -331, -154, 7, 203, 107, -159, -183, -297, -177, 193, 237, -80, -7, -346, 174, -35, 80, 89, -202, -256, -115, 259, 326, 41, 130, -69, -241, -121, 155, 76, -139, -289, -36, -8, 16, 148, -5, 287, -27, -42, -89, 283, 46, -24, -300, -292, -103, 63, 310, 380, 89, -314, -76, 396, 87, -40, -14, 75, -26, -82, 259, 192, -69, 40, -61, -69, 62, 302, 179, 17, -62, -53, 151, 94, -22, -1, -343, -222, 197, 263, -63, 13, -210, -1, -113, -333, 264, 67, -235, -175, 77, 56, 127, -44, -132, -250, -327, -98, 161, 229, 241, 59, 21, 20, 278, 208, -35, 0, -188, -559, -143, 169, 261, -188, -138, -194, -36, 233, 176, 369, -166, 5, 24, 182, -19, 92, 76, -174, -133, 150, 97, 181, -363, -107, -197, 173, 157, 80, 44, 84, -379, -148, 114, 169, 143, 13, -98, -42, 64, 116, 192, -4, 42, -203, 85, 154, 195, 110, 75, -361, -276, -132, 241, 205, -276, -390, -169, -33, 231, 293, 31, -365, -329, -85, 275, -63, -23, -249, -30, -168, 24]
4050B4J92k36J67l53J22K53j74JK01L8n21M42q8R0l41j3k57L66J09J25K59l40
4072F6l8j60N1L57j77j41nk38L67j50J66j07M7k75J92j40L79j68J69n01k7L52
4094A9K54j80j97m4m2J43K01k00K84n6m44J12PL79lk71R1j62o9K08L29l74j93
4117b08j23K71K90k86J69l53j66L37K20m3n7J75m01J06p1J92R3k26J90j04r1J77
4139I1P5o0J81l65N4J78j25J55j74j7k64K63l6K00n5j23J2m1N0K66j40k68K05
4162F2l34J59J26J35j83j92K81O3K03q6r8j85r3P2rK39j79o9L29l98J18K46j05
4185A02k28K7j91R7J81J69j94j0j1k93J94M56m9l04j05J37K1L82k99o5k33K25
4207IjL10l31n4J59m07r0K00K74K68k78k08j12L02J31m1M5j81r9J68m7Q5J60l97
$$ y = [24, 216, -20, 147, -206, -84, 169, -5, -4, 197, 235, -286, 156, 68, 158, -183, -196, -453, -87, 22, 147, 406, 66, 28, -132, -81, 276, 99, -42, -47, -285, 82, -68, 98, -9, 38, -237, -45, -185, 194, 26, 195, -306, -333, 19, 273, 93, -104, -148, -190, -47, 154, -46, 238, 182, -262, -150, -143, 236, 233, -38, 53, -109, -178, 30, 359, -15, -208, -331, -60, 230, -56, 113, -240, -406, -69, 151, 108, 51, 226, -175, -69, -140, 52, 145, -81, 109, 5, -86, 91, 166, 106, 287, -78, -24, 154, 29, 184, 10, -7, -271, -8, -44, 156, 101, -22, -10, -51, -1, 265, 125, -143, 62, -272, -113, 13, 148, -35, -227, 54, 117, 320, 234, 136, -49, -142, -70, -79, 160, -19, -88, 241, -157, -39, 207, 102, -126, -99, -290, -193, -12, 157, -37, -47, -58, -351, -157, 299, 250, -54, -159, -22, -1, 381, 82, 17, -216, 9, 8, 318, -13, -67, 92, -315, -405, -205, 69, 337, 59, -149, -261, 41, 172, 131, 176, -5, -104, 64, 17, 102, 262, -135]
4231a35K55o3j9J85qr8k48k5pJ70J53k73QP2m5j96K87R7J23m71M15l80L03j19
4255a9q5%Ll1L71k08J56K4l50K4Q7m1K11k24m6J09r1K58Q1Pn14PL68J10j48J23
4281A82j94K8Q6k2J03j52J58p3j85J27k7L3p6l02J61J9o6K3L75k22j07J91p9k5
4305d4m6K49j23O0n34N91j23K87j95k97K2K67J6r2o4O2J57k56K36jm08K43k26
4328b19R2p3J69N4j7N0j54O2PK09k55P0j70J51J37R8k44r2K23l59M16j76J97k28
4352e2J54k06J61O7PJ6l07J98j9l00R6M69l63j36M45l25Q7K36k68k31j96M49K78
4375B60l59K28k86o4K08k9J11k73L62l39M95n7o9p9rk03R0j12K68k21j6K27l81
4398b48J39K27k5p4lj45R2R9m4J4k50K2NJ03K09r0K27j22k75q7L22J17j70j41
$$ y = [-135, 120, 57, 38, 223, 215, 117, -131, -156, -163, 7, 160, -113, -105, -33, -78, -274, 13, 110, 233, -238, 177, -203, 100, -19, -104, -104, -101, -132, 239, 31, 187, 211, -139, -115, -28, -69, 142, -82, -128, -19, -110, 148, 229, 236, -278, -271, 97, 207, 59, 182, -12, 16, 102, 80, 183, 31, 189, 116, -69, 58, 31, 64, -12, -314, -153, -134, -200, -177, 198, -24, -131, 60, -19, -44, -90, 159, 36, 96, -438, 153, 30, 317, 122, -175, -153, 114, 130, 38, -26, 36, 193, -63, 173, 172, -236, 7, -219, -127, -200, -31, 23, 6, 56, -98, -36, -29, 180, -75, -5, -175, -24, 113, 211, -33, -125, 98, -261, 155, -21, 176, -52, 102, -104, 57, 124, 131, 147, -160, 38, 19, -281, -185, 284, -79, -215, 230, -95, -8, 228, -40, -271, -467, -18, 260, -99, 129, -157, -221, -13, -42, 69, -204, 158, -181, 314, 257, 188, 109, 100, -103, -13, -125, 143, -78, -94, 133, -248, -109, 118, 93, 19, 16, -129, -37, 62, 18, 32, -218, -196, -191, -88, 121, 31, 258, 136, -139, -226, 96, 213, 43, -98]
4422i8j71jK85j22q6M83k21l05K11L85k41p7k3j46L7K42nj73j29R6J01q6K22k49
4446g1K36l66K44l34K61P8k11M05n79L13r3L06j3j89k61J38O5J27K06l25o5L21
4468A93o7n18P73m19n9j96L73J13j20j24J30r0p4J54J05J3l04K78l01J19n9K8
4490e2N7j87J21J58N6r7R0j18J06j87M3j07Q1pJ53j15k36K32K2P6J15j29j57J11
4514B9m5lJ70k08j08L07k46J13J51m2k37q3R8J00J08J87n36K25j42L63p8N5j93
4537a5j35K98k41o6K80N5k96L1j13K31J97l81O3J05j50K69j40o2J43k16J9n3M83
4560C06m76M30k07Lj61J94M1p8k05JJ61k8l3j0j6o2N0Q0K35l07J48l7j37K97l84
4585a95K74M4n4o9L9l58L55K20k56j36K04J47l58Q6j03oJ27p3N7r2K7k34K94n0
$$ y = [-98, -269, -270, 15, -107, -193, 290, 69, -236, -25, 360, 119, 42, 19, -127, -90, 152, 147, -26, -155, -59, 42, -44, 178, -71, 165, -201, 43, -291, -30, 48, -163, 242, -337, -24, -117, 189, 176, -13, -274, -136, -71, 56, 262, -63, -128, 193, 126, -392, 381, -38, -97, -293, 80, 193, 73, -51, 79, -11, -85, 69, 174, 187, -117, 161, -140, -21, -80, -52, 5, -182, -61, 97, 153, 56, 146, 28, 134, -53, -10, -117, -36, -43, 110, -5, -241, -9, 13, 89, 204, 75, -82, 29, -16, -19, 151, -57, -165, 142, -104, 9, 160, 118, -119, -202, -104, -4, 104, 291, -245, -20, -162, 201, 123, 178, -15, -150, 148, -93, -159, 121, 176, -120, -89, -202, 29, 226, -155, -92, 13, -137, 132, -8, -70, 73, -143, -124, -177, 306, -170, 260, 53, 56, -105, 89, 130, 52, -153, -152, 9, -19, -52, -62, -78, -140, -90, -10, 225, -82, 66, 29, -108, 189, -195, 79, 123, 69, 0, 39, -319, 36, 256, 0, -136, 68, 215, -143, -57, -160, -166, -39, -112, -55, -147, -120, -354, -60, -110]
4609a10J78nO1k55L94k24m5J67n6N3p6m43M97j75K5Q0k66n7K16k27K67m2M6J3
4633A6nj49kJ98j77J0j14M53Mk10q8j4J79j73p3J00J27j50j12J15K29O7j66j1
4657E4j08m47M38K10m6L0j23L0j34Q3J92j96j21L40n30M89j5J8k56L3K32j80j12
4680a19j10P88n89o6k21K76K31n0k51J71j28L6R7k57L83o7l86o2K48K49k47P5
4702AJ36j67k7m8M6N5O7k63K54m3rN2R6j00j40m4L40j6j76j02K4K04j45k27L19
4727H7l07J45K23l56R9J18j28m9K46K0k20k36M90j2j29j58J74M2q4K14l92J19
4749i4K53j86O9kl7LK98k47n4M48n24o1K64k00K53k02K51l0l44R6Q6m4k5k00j55
4774c84M61M7q7j76o6J93j42O9m0L14l65O7L26l22J29K16K0m62K62j53j60L29
$$ y = [-110, 68, 63, 124, -131, 263, 39, -6, 161, 105, 158, 82, -361, 136, -39, -14, 66, -200, -257, -41, -268, -1, -43, 3, 16, 11, -138, -140, 58, -119, -109, -223, 230, 234, 24, -64, -78, 101, -72, -145, -45, 82, -68, -180, -65, 164, 231, 65, 54, -54, -501, -63, 147, 101, 131, 8, 38, -96, -13, 179, -17, -138, 202, -328, 161, 146, 164, -92, -59, 173, -7, -119, -229, 559, -30, -96, -317, -41, 190, 140, -111, 60, -68, -32, 65, -192, 191, 124, -262, -324, -76, 173, -74, 1, 137, -30, -57, -105, -59, -4, 63, -200, 54, 11, 2, 54, 150, 50, -90, -134, 206, 190, 14, -88, -64, 140, -5, -232, 87, -220, -75, 148, -208, -109, 9, -119, -168, 78, 98, -122, -358, 132, 120, -9, -167, 7, 49, -35, 179, -213, -94, 159, -27, 42, 40, 3, 6, 304, 57, 3, 451, -73, -134, 130, -70, 183, -19, 232, 202, -142, -46, 40, -4, -29, -229, -384, 77, 124, 37, -139, -205, -12, -154, -85, -125, 189, -176, -109, 217, -105, 24, 240, 260, -202, 60, -93, -253, 76]
4796G6m8j63L11k45O3K21k90k6Lm1L65k44Q2k5k69O1M0J97J84qk82j24n0K87p0
4821Ej34Q9%p7J92Nl4o4m1J60lj88l3K19j06L4K5l28L84j56q4J93K2l07L18o3
4847B8j41J66j04K06r6j21J27k90L56Q9j45R3J14n85J86K86l21L73l01OM0k49
4869b83M4K48N2K6J25l91J20o6pk3j9K41l5k42J75j45QL77l2l00K66j8l57K52
4893A6j40O5J72k53j06J84j14M98l53J70k12Q0q1R5j25J75J4n0LJ3k01L6K91j95
4917a8J12j3M3p1j69L58km51M54j00k02J25J23k55j30J48K33n58L12M27l71o7
4939g2J61j16J57R6j33k35RJ03L63l31K02k50k33M14k4k0j93J18j3j22J44q2L8
4962a9Q9Q1k95L30j80J84m2k95m8K86Q9k39n5m8L27m70K95q1J02o7Q4K01p7n7
$$ y = [76, 28, -135, 176, -69, -6, 215, -75, -101, -98, -139, 226, -18, 64, 39, -230, -169, -129, 68, 252, 244, -38, -162, -212, 75, 5, -129, -40, -40, -117, 75, 80, 46, -18, -59, 101, 98, -90, -123, 96, -10, 24, 49, -279, 105, -51, -135, 58, 80, -227, 91, 28, -113, 53, -51, 155, 59, -62, 65, -225, 131, 220, 75, 168, 282, -303, -117, 169, -152, 221, -80, -74, -34, -283, -239, 9, 61, 87, 212, -179, -59, -125, -132, -155, -174, 67, 32, -210, -35, -180, -172, 205, 173, -127, 139, 121, -236, 16, -124, -59, 113, -140, -246, -62, -176, 322, -31, 139, -73, 7, -74, 21, -104, 71, 85, 35, 38, 51, -150, -114, 177, -18, 94, 81, 124, 53, -116, 242, 240, -211, 243, 143, -59, 66, 189, -66, -196, -48, 185, -373, -61, 366, -5, -72, 89, -27, 130, 226, 93, -142, -133, -30, 333, 2, 204, -46, -279, 135, 111, 91, -102, 16, 3, -119, 25, -57, -19, 70, 151, -144, 186, 6, 190, 148, -147, -195, 91, 180, -59, -114, -162, 165, -305, -10, -91, 11, -56, 28, 229, 152, 95]
4986I5O9N0j34P0j88J63%l4j53j21l3QN46k78j41k10M57j57j1n8j03N32m78J55
5010D6o1j46J57r1j50L13Kj99L14k55Q6j00j62J43L74j70p1o7m6K19%j28J58k09
5034d3J33k08J20K8j48J79j10k38L38j11J06j71O5N4m0l20M13K93o17K57J02P2
5056A54k70K08j95K72n9j78K78l15J01j89K6RJ10Q4O7j69j4R9o3K38o1k75J71
5079B9k10K02LJ28k39J1J1J49j29M04k91j33J53j45J44k5J3k01j76M36lk12L44
5102B63j10j77J30j68L99j43j98n0K46J17k63%J50l77J36j1L76m2n34K61L21m34
5124a08l01O60r1m33L47L9j17Q0j0j84J20L7j39P2J13k05K09j65l07M89k77K92
5146A21j61k32J17K40P5k58J34K7qq6J50j02j95K44K11k87nN4j81N9m6m7L17l95
$$ y = [95, 164, 214, 80, 150, -38, 125, 125, 91, -62, -183, -216, -208, 338, 60, -81, -291, 166, 9, -2, -60, -163, 369, -109, 46, -15, -161, -4, -95, -245, 68, 70, -129, 185, -70, 16, -84, -246, -103, 271, 101, 30, -37, -83, 136, 136, 8, 166, -43, 90, -118, 2, 30, -118, 61, -49, -287, 51, -60, 46, -125, -60, -6, -46, -366, 47, 340, -277, -20, 82, 154, -116, 92, -103, 169, 110, -68, 210, -105, -4, -193, -167, -158, -48, 36, 103, -66, -80, 19, -44, 194, 133, -142, 29, -181, 21, 24, 152, -87, -76, -65, 84, -45, 359, 68, -65, 88, -57, 87, 62, 75, -126, -302, 134, 131, -81, 263, 153, -24, 106, -62, 337, 194, -4, -54, 192, 309, 46, 46, 196, -181, -45, -56, 320, 278, -256, 5, 326, -108, -409, 251, 160, -273, 74, 113, -4, 76, 66, -118, 2, 39, -100, -28, 85, -120, 89, -76, -383, 106, -171, 121, -40, -272, -155, 85, 160, -98, 36, 63, 55, -31, 119, 17, -178, 66, 277, -10, -15, 39, -142, -83, -129, -176, 141, -254]
5170b54J1K34j91K16j34M50k03j79L60k76k80K47J04J05j68N9k10J84m77L54J35
5191H7j25N96j98l14L85l85o1j25o3J94o1K36pL3n34J97K31K25l23q0j00OK66
5214H0j02J89k19J31k7m41J85K40J9k36R2k7R2J71l65N84n50o1J21K46J42k94
5236c0n3K17M7o1j26l8L95k00Nk38j35L88k72k3J53q4j49J29o8J62M0j45O7M6
5260B7l02R6L47k13J51l95O36k93j90L4J58J41o0l46N07k38j49J74N2k69Q6N7
5282A1n2K5K1o9O3q4L41j6l47R7J72Q2k30k0m0k49N10k85J35q4Po4mL7J21j40
5308f2J25m6m8l1l3j09J62K90k28K8n4M8J59k11k55J74J22J2l1R3R1k95J13j15
5332a01j79R6O4J1J44l6M5l9j26p2L54j89k72J64N0l11M54r7J8L2m1k44L64k11
$$ y = [-254, -243, -9, -200, 16, -118, 332, 129, -50, 310, 34, -246, 1, 105, 210, 42, 101, -109, 75, -402, -48, 87, -38, 558, 360, 46, 431, 46, -15, -140, -203, -9, -70, 166, 159, 192, -342, -145, 86, 311, -12, -92, -192, -186, 80, -22, 167, -52, 79, 52, -389, -204, 36, 55, -181, -89, -116, -24, 147, -218, 366, -184, -245, -124, 122, 264, -30, -83, 134, 181, 120, -6, -44, 351, 151, 156, -82, -217, 171, -101, -124, 29, -55, -204, -75, -143, 19, 59, -86, -19, 27, -275, -179, 168, -45, 106, -289, 347, 54, -136, -102, 56, 197, 137, -209, 298, 60, -89, 85, 137, -132, -46, 11, -41, -16, 5, -64, -1, -85, 256, 240, -107, -10, 162, 244, 14, -6, -46, -295, 215, -70, 65, -19, -12, -76, -80, -43, 78, -62, 63, 17, -31, -62, -95, -204, -42, 248, 20, 48, -6, 42, 201, -10, -265, -91, 31, 43, 12, 105, 196, -99, 14, -101, -280, -184, -120, -109, 35, -1, 44, 5, -121, -193, 161, -28, -300, -136, -86, -397, 57, -40, -22, 10, -31, -275, 89, -122]
5356a22J18J21k40P4J02j08K11j07k30K96m26L65o5j7m9j1J60j24K26o7L9j42
5378Dj11k1J65mj42M00m37K13l43K47J07jo4p9J79l17J51k07L50k90J80J18j18
5401b0n1K05k34L97n02J63M18m51j0M5j12J12K28j10K0j58jo6K06Pk12N00j71
5424B03n6j01j79Q3jk9N8K1k38J15n1L32l62K15r8M9j46J21k4J00j22J75j34p6
5448a45R0l9L36k99J91Nl37J21M2j52J58O6j02R2L00n84L75j80P3L7m6l5k16o5
5472c14J61N1Q6j39M0J04J98m52L65j83m2K75j66Q3j16K37j25K43l58L13l03J44
5494A02P0k51N2Q7j42N7o2M86j70j76J44r0k54K24N7r6j39L3N7J37o2j69M30n44
5518b19J42j5R9K62j07k8k83J82Q8n9p5lK47k14k69K96m9J56k91NL77k84N7j17
$$ y = [-122, -4, 117, -123, -49, 53, -55, 156, 49, -181, 115, -311, 54, -11, -28, -77, -88, 72, -52, 174, 107, 146, 4, -107, -128, 37, 33, -109, 291, -146, 67, -276, -29, 78, 77, 13, -66, 113, -204, -53, -260, 90, -200, -20, 98, -20, -71, 134, -100, 297, -205, -42, 376, -75, -85, -40, -152, -40, 188, 78, 98, -60, -61, -127, 79, 86, -126, 374, 203, 147, 46, -133, -50, -51, -80, -22, -1, -239, -124, -175, 157, -205, 10, -88, -39, -185, -64, -88, 12, -110, 65, -69, -145, -55, -94, 242, -57, 134, 139, -198, -77, -35, -187, -29, 37, -65, 27, 327, -257, 118, -62, 11, 48, 2, -33, -249, -314, -153, -102, -16, -155, -115, -11, 187, -265, 100, -83, -125, 150, -16, 67, -49, 188, 63, 306, -52, 261, -42, 102, 172, -79, -27, 60, -82, -25, -87, 399, 229, 53, 197, 107, -147, 77, 134, 38, -101, -68, -11, 126, 64, -105, 325, -219, -77, -92, 7, 269, 162, 134, -149, 33, 121, 62, -13, -16, 231, 17, -252, 44, -5, 151, -140, -135, 242, -42, 15, -102]
5542a02L01l33o3K24J04j79j08L80j88L4m39K68K86j31k15L20j82J66l36jK25
5563C1p5P9j75O5j37N76m75J49q5p3J66K48k80k17j3K23J60k35j33J28J65j64
5585g2j4J23k88o3J51K59j24p0J54J2l6j74P3k8J79n4J13j97M6j31%K11O7k51
5609a14n0j39K27O7n8M4j55K38R6r2j6K99o21K71L9J10k01j01q9k5N20o47L98
5632Ak92J49K33J31k47Pj30J50jm1l8J56j38j7M5j18N6j76J94R7k37R1M35l47
5656c7N2l7K59j48N4l43K43j02J43J49m48M17j09l04L75j33k43L25o5o1m8J89
5678A28k76j33J05J85l2o8J80k02l7K46K63m74O3J43q4j10M07k97q1k6P9k00K77
5701E6J0k7j08l8K10l13K94O3q4k57J06O6J17J27l18J96k04J06j26K42N4j89J23
$$ y = [-102, 199, -134, -197, 27, 131, -48, -156, 224, 36, 70, -369, -101, 185, 54, -161, 159, -23, 143, -193, -194, 31, -44, 35, -140, -75, -212, 364, -111, 38, -47, -120, 46, 294, 14, -203, -216, 7, 167, -68, -201, -73, 92, -72, -86, 37, -251, -314, -163, 96, -28, -98, 56, 68, 32, -142, -69, -97, 82, 28, 141, -56, -10, -141, -141, 70, 137, -114, -164, -303, -76, -9, -67, -23, -178, 60, 156, 64, 48, 347, -274, -3, 36, 146, -55, -156, -245, -270, 250, -397, 1, -291, -142, 91, 222, -25, -18, -148, 2, 1, -40, -78, 78, -60, -77, -32, -150, -94, -270, -76, 21, -216, -125, 310, -37, 15, -22, 237, 89, 143, -200, 43, -59, 84, 233, -215, 202, 93, -211, 164, 31, -212, 113, 48, -13, -61, 128, -148, -281, -176, 9, -23, -91, 89, -113, -150, 96, 359, -115, -52, 91, 7, -103, 304, 7, -74, -100, -21, -221, 56, 66, 39, -69, -107, 103, -210, 84, 147, 63, -194, -88, -22, 95, 222, -96, 100, -104, 2, -124, 118, 172, -17, 106]
5724A06j01J25j15j81Q9J25J66l22R7j12J88o9K7J26j54J83k0j62n0K46k48R8
5746D2j25j08J28k9M20l49j63K72j17q7J37J49n6j49J16k01L03J59n73L23P3k35
5768g0q8K37r4j79L35k13j14Q6p1K13J20m6N0k45J03R7r1j80K88k41K06q4N3j65
5792i3K5Q9k23L2L94k7J38k98m4J05J8l15N0J16n5J87J43l02lJ53j55Q1l2k45
5816b61k1L85K36k32j75K16O5k08O7k23L31o9k00Q1j96L26k08K11n8L6k57O4Q5
5839ek04L15k25%%J40J36l83L93k51J9J89k29J0k13J37J57J9j13J38j1R7j53q2
5863a19m9l7K28j51J53j16R3P0J73l40P4k79K24J23j18J66k81L67k64j36j60M83
5885A04l2pk41J76k0j20L32q1k32L52j76p4J26n8kJ39k26n4LK13l57J75j27K84
$$ y = [106, 5, 130, 15, -166, -77, 48, 214, -108, -11, -123, 65, -4, 23, 149, -5, 178, 158, -4, -54, 192, -56, 42, -83, -191, -63, -92, 328, -21, -184, 88, -29, -116, 21, 170, 114, -35, 81, -120, 183, 342, -231, 92, 165, -70, -158, 79, -15, -194, 141, -72, -186, -100, -171, 42, 162, 116, 166, -79, 24, 121, 30, -150, 138, -103, 103, 19, 72, -93, -68, 21, -202, -170, 224, 197, 335, 37, -7, 98, 116, -199, -149, -33, -88, 99, 242, -60, -63, 90, -65, 16, -16, -261, -282, 103, 339, 107, -68, 148, 213, 5, 72, -151, 180, 111, -89, -8, -204, 122, -86, 125, 67, 103, -154, -90, -5, -209, 106, -119, -119, -119, 21, 157, -226, 167, -84, -65, 124, -105, -95, -308, -171, -14, 5, -108, 30, 19, 116, -37, -119, -168, -205, 23, -128, 25, -91, 2, 72, 245, -95, -21, -300, -76, 47, -71, 95, -186, 181, -83, -219, -379, 104, 72, 65, -176, 0, -20, -140, 192, 111, -121, 231, 55, -19, 107, 49, 47, 186, -40, -94, -91, 122, -235, -60, -187, 97]
5909I7Pl71K50J06Q6j92L79j27l90J24K0qO3m4J51j54j44J54p3o2J97j59k6N6
5933f0p1rRP9M5j6j12J6K88l9p7j29J90r9L9m2j13K71j35J2N1J89j42q2l34n7
5959c28L03r3K26L1j66R2j58K58o7j35j76L03k19J5J23k86L34M5k9J0j15J97k66
5982a01J08j49L52j78J6j16K72n0k70K29j48j0K4J76k81J93n3p5K18l69L09l5
6004F2j46m0K06P4q3l6P7m58K51J29Q5j63k73K46J0l6L05l90q3K62j82J50J97
6027A64k34q4J35k04K81k54L88l53K58j93L67l84p3K97l4o7J1K40p1q5j07k44
6049b46K36J60l07L04l11J47l1O8j35k8J4M3P9J26k37Q9J69j02K98k14L11l26
6071A07j29n2O0j2j24K96k04J07r2K1j5N2k8k55L86O1K8L0r3l7k5J40p8L20l22
$$ y = [97, 104, -267, -17, 89, 175, -17, 362, 235, -155, -31, -11, -19, 44, 0, 151, -3, -147, 7, -66, -128, 69, -90, -116, -60, -131, -140, -131, -52, -7, -23, -135, -119, 169, 130, 53, -76, 114, 15, 54, 12, -101, 170, 35, 47, 98, 287, 145, 63, -271, -328, -25, -118, 108, 139, -27, 65, -93, 165, 98, -37, -213, 90, -129, -114, 9, -277, 57, 102, 73, 83, -32, 165, -101, 7, -142, 210, 32, 48, -68, 204, 154, -116, 113, -35, -45, -21, 155, -126, 67, 14, -61, 157, -212, 97, 62, -84, -124, 82, 156, 73, 37, 114, -344, -93, 36, 121, -42, -315, -69, -59, -95, 210, -180, -263, -1, -183, -33, 164, -70, -154, -19, -223, 58, -196, 192, -161, 97, -96, 271, -113, -186, 111, 77, 10, 21, 261, 190, 105, -2, -246, -10, 150, -157, 147, -164, -17, -48, 20, -115, -143, -129, -86, -7, 119, -118, -29, 140, 38, 336, 122, 433, 107, -22, -74, -14, -26, -150, 146, -58, 49, -43, -22, -37, 15, -13, -268, 118, 179, 207, 237, 144, 107, 82, 222, 144, 464, 142]
6096A42j77j74n2K99K31j89j1J14J4l41O1m1J87j58M8Q8N4j77J42J9j02j32q5
6119b40L61r4o4o6r6L78j88J58l71L57j75MR1J85j52O5L5l76P7J00k01j06J54
6142a64O2j53K73L39n58K64k50J9L36k98K71k72K74l92L13Lo0j72K02j78q9L97
6164A67k11l8j12M91n8Mn34L11j02K40j19j55M27j97j79N8R3j26n8M3m0M5J24
6187G4MOR5k80r8J29J19q0P4j58J11o8K1o6M86k03j48K63l76J34J45k84M8R6M2
6212H6k04q2K17k13L46k39K14P9m29P5K36pj71j50N46l70qJ32L7l29K11O5O4m3
6236F3j72L7O3L7l26N09Kj94j01P8j6j05K92k16N2J3j60kK67j39j04L12k10N9
6260C9J69p9k39J49J82j23j59J96k05O0j46l2O4K51j78N1j1j1J02k35M12k93n1
$$ y = [142, -35, -209, -261, 38, 269, 80, 69, 183, 197, -144, -83, -124, 63, -95, -47, 41, 95, -82, 60, 79, -23, -155, -240, 121, 27, -37, -103, -199, 179, -9, 149, -222, 135, -40, -36, 55, 240, 88, 153, 188, -188, -111, -11, -212, -318, -164, -102, -255, 18, 357, -201, 63, -187, -168, 168, -130, 141, -131, 143, -249, 64, 67, 7, -165, 37, -141, -230, 167, -44, -82, -194, 297, 239, 243, -291, 20, -82, 158, 39, -116, 311, 114, -65, -7, 86, -40, -98, -55, -95, -50, 74, 78, 84, 179, -101, -199, -70, 49, -31, 43, -115, -4, -72, -51, -117, 369, 166, 18, 281, -95, 39, 184, -100, -52, 44, 86, -118, -200, 17, -196, 150, -89, 125, 204, -225, -150, 86, 79, -92, -242, 304, -66, -74, 58, 95, -234, -23, 42, 106, 63, -109, -72, -9, 28, -298, 211, 213, 19, -82, -4, -20, -125, 167, -49, 3, 16, -144, -146, 121, -18, -122, 190, -20, 39, 208, 129, -110, 39, 221, 98, -61, 135, -70, -10, -156, -188, -124, 127, -51, 0, -11, -22, 80, -155, 257, -36, -87]
6283h7K7J5O9j30L70l39j5R8J24l36L22k52P3J27j96Q5k6K5m0P0j20L51k82j43
6307b10K80K33m48K40k53j53N82m44K35j75K03Qn0l78O01j98J87l25J71k98M07
6328B15m08J19L43l00k64L41N1j03j26L30j85j37M85m57pJ15J59k91R6k7k05M74
6350B18j13o5l34K38L4m6J48mk66J46K0j28J20J97r5J55l22o3J1J49K34q7j57
6373a0O5oJ31j40r5O0k57L77O7j02Mj50j01P8J59m8j83k61N46r8K40l36R5q4p2
6398a21K17n2n1l07M79J72m83K19J44l71J48j60J27j32j08L64j98n2R3r5K72q1
6420B4pk20L67q8P8j18lP7l91N32m82K44j08Q5J60j18J16l95J4J95P9N7O1k58
6444i9O0J39j17n2J27k10l6J52l01M24m8k09J29p6r2L37j36k24L98j43k13l4L81
$$ y = [-87, -60, -45, 24, -106, 264, -75, -90, 8, 132, -204, 118, -134, -61, 66, -130, -45, -71, -46, -86, -16, -136, 215, -67, -210, 70, 303, -145, 95, -158, -311, 271, -173, 62, -113, 90, 98, 48, -330, 271, 73, 260, -65, 106, -192, 215, -193, -74, 269, -31, -295, 46, 97, -6, -132, 198, 13, -124, 361, -96, -103, 12, 171, -120, -24, -51, -256, 218, 105, 40, -294, -56, -22, -68, 80, 76, -190, -44, -24, -152, -32, 165, 70, 225, -97, -160, -149, 0, 234, 147, -10, 55, 49, 180, 40, -55, 5, -252, 125, 192, 90, 94, -56, -157, -79, 80, 32, -151, -412, 134, 36, 276, -60, 35, -49, -121, 96, 44, -7, -314, 165, 337, -146, 73, 217, -154, -6, -166, -39, -171, -279, 85, -113, -165, -72, -167, 105, 24, 17, -203, 164, 76, 154, 36, 33, 110, -281, 251, -231, 13, -95, -10, 150, 32, 148, -247, -233, -38, 41, 98, 159, -99, -39, 100, -17, -69, 58, -152, -188, -36, -337, 87, 39, -170, -41, -117, -209, 128, -8, -232, 166, 23, -190, -224, 157]
6467A57O0qL02l22k75J06j4m1K2K82j09k67r2L10k3j82Oj14j91O74l75J75P0k37
6491h6O2JO6J33J42j08j84j31R5j45J58k79L2J93j00L62n35J80O7J47j26M3j9
6514c2j63J33N8K1k0o9o4K84j66K47k62J9k6RK07K32l97K8K00l67q0K84r3J97
6538A80l85J32J5L28j76n7o6L07k28J13l01J1J35K69m62K07j77p7L41k59K09j80
6560a21k73M26J63l35K19q9J39o3j17J15k32J18M87k77j05J58k88j6k6L39j78
6581D4j00p9K51k16j97L50k5j06K1O06n73J96K06m26J36j03M0OQ2m99K63QP5J19
6605G9Q1jk84J15J28m4j40j4n4J46k42NM08l81K19j87k4L42j84n8J21P3J17l59
6629a38J63n9l02J42K23j4O7p3j3k25K93JJ25m03J66K10J30n51K17K05R9j48j78
$$ y = [157, 217, 209, 511, 189, -86, 20, 6, -35, -13, 269, 160, -107, -199, 111, 88, -94, -88, -202, -393, 281, -94, 81, 151, -86, -24, -23, 43, 176, 318, 210, 26, -105, -10, -155, 3, -276, -244, -51, -151, 211, -324, -144, -77, 70, -56, -13, -32, -195, -62, -4, 17, -3, -72, -136, 148, -18, 229, -33, -14, -40, -31, 176, 408, 11, 39, 239, -128, -208, 76, -17, 180, -205, -73, -58, 270, 94, 37, -29, 278, 50, 163, -138, -127, 8, 277, -185, 22, -155, -232, 109, -150, 59, -121, -394, 32, 195, -140, 79, -10, 129, 66, -51, 64, -168, -50, 437, 160, 55, 213, -75, -91, -117, 222, 44, -56, -135, 116, -100, -297, 53, 28, -78, -57, 549, -24, 172, 378, -48, 88, -15, 25, 31, 113, -386, -123, -115, -40, 79, 160, 159, -125, -10, 118, 74, -66, -80, -134, 12, -230, -225, 183, -198, 21, -166, -190, 152, -32, -90, 31, 104, 221, -138, 25, -34, -336, -194, 29, 15, 82, 9, -4, -229, 64, 65, 190, -213, -47, 163, 293, -258, -41, 164, 263, 115, -63]
6652f3O0j21K07Q7m5j80k60J46K04k40J62k26Q7n3O6K37j46K39Mk8k61K20Q8j16
6676F8J07j54J94K4l93K38l54J12L64r1M5k92K50k85J45M2J61q8j87J04M1k62
6698b11L23m05K65J38R7r3j81j44N95m04N3j21k24K84MR0m28M74k04O2J33J9l12
6721a90M63m55R3L09%k93M5Q5j16l7L51l69J34Q7q7q9O0Q8L7l47J58K7j89P18
6745D83m84q5N14j054J040j98k48R8j18j5l6J77j7J2k16L80k29m0L1O6o0J37j62
6768b4j9OK24k14J08k22K0K17j54J50k12K11q2J8j28M5K09l90J91J25k98Q6J37
6791Dk07K38l0q3p1J97R8m5%l3J75j71j32KN6N0j46L10j74j81Q4k27N54k50Q7
6816A05l23J73o1K20j80M9k6L74j56k25k24L92k94j0k55M79N2k77K40j31J76k94
$$ y = [-63, -3, -124, 83, 170, 125, -55, -315, -169, 35, -205, -43, -269, -182, -235, -169, 68, -78, 161, 165, 137, -124, 96, 184, 68, 175, 21, 215, 239, -154, 84, -270, -158, 206, 115, 160, -132, 118, -167, -22, 20, 181, 93, -94, 10, 51, -211, 112, -293, -28, 110, 207, 114, -67, -211, 384, -20, 33, -88, -312, -28, -24, 66, -362, 112, -92, -30, 103, 122, -190, 273, -182, -89, 220, 220, -73, -28, 57, -59, -96, 255, -114, 20, 107, 20, -69, -9, 79, 116, -231, -73, -46, -235, 483, -1, -86, 428, -626, 414, 216, -32, 66, -52, -67, -103, 74, 57, 69, -147, 233, 4, -36, -5, 61, 1, 138, -24, -43, -37, 187, -27, 81, -141, -121, 96, -58, 92, -120, 91, 9, 27, -101, -56, 153, -237, -46, 79, -219, -133, 4, -203, 35, 5, -78, -149, 48, 146, 101, 101, 68, 243, 72, -60, -58, -2, 48, -98, 212, 38, -143, -59, -286, 268, 18, 105, -218, -45, -106, 114, -66, -17, -43, 331, 175, -50, -274, 118, -176, -186, -441, 38, 90, -187, 53, -78, 98, -196]
6838a96J25k6L2K8K13j34M8J11k16J91k18j9K2k5K85j80j2n7J49l11J05J21k74
6861b38M29k83j71K17ll0J70Mp7j15J48l4J52L3p9j28j9j31K58Mn6l26J87L63
6885B75j69j0j27OJ92j92k39J85l0J71JPMJ65l01JM8J16k35k3n6P2J75j57J35
6910A4p0J75j34l18M98J01k79J23j84Q8N9r5J66m7m9k41M50K4l58J86k51J88r5
6933d9j96L16l34J68J01j31K91j41k3J50l5j23k48J46K26l9k45J15K6j36J63P8
6955H0k1j22l6k8K00l16L43k71K42k24j95K83K15j58j0k09L10j14l8J37Kj80j32
6978b42L76O7l35J11j80L25l7l6n1J38l49K76m4m0P4m2q9M5k72K53j13J2K96l22
7002a79o0J09K47j32m5P3Nq0n2K93M4k08j94Q3J5K1Q8J7m6j59j46M02j47L24j83
$$ y = [-196, -71, -97, -65, -37, 176, 42, 90, 201, -15, 176, -42, -61, -39, -64, 221, 41, 29, -28, 121, -190, -85, 36, -238, 191, -92, -263, -46, -49, -79, 91, 95, 18, -97, 51, 17, 169, 202, 123, -5, -24, -155, 103, 107, 51, -275, -88, 275, 106, 96, -31, -25, 167, -25, -264, -79, -109, 62, 63, 70, 74, 239, -62, -61, -13, 103, -132, -155, -211, -139, 36, -121, 14, -56, 119, -15, -333, 165, 266, -13, 110, -74, 14, 73, -22, 144, 97, 48, -193, 257, 281, -77, 109, -142, 46, -49, -245, 71, -263, -95, 6, -125, 166, 25, 2, 152, 117, -6, -254, -108, 118, 79, -166, -51, -25, -161, 2, 80, 59, -63, -99, -127, 73, -243, 100, -171, 71, -153, -348, -65, 150, -8, -18, -227, 83, -31, -69, 68, 70, -110, -242, 134, 201, -134, -23, -203, 122, 85, 49, -2, 136, -213, 63, 19, -21, 53, 11, -78, -33, -305, -52, -165, -153, 143, -179, -239, -130, 117, -15, -60, 13, 18, -62, -114, 179, 223, 15, -179, -96, -81, -60, 28, 45, -1, -160, -306, 96, -51, 273, 90]
7027I0k4J10j15q7R0j90K11k24J82J67J25k60j58j70L64%o7l33J63K38l50K65
7049B7n8J00j0J28m07J79J36l9M7r9J48j41Q6m8k18qL79j73K46k11j27RJ11j23
7073f6k1J66l54N63m05Q2L8K90k20j7J74l67L46r2k8J52n13J10K22j18R4J96o5
7096A67p4k33J59j58K75k56J25K25k27J50j65j99L5P8J40J14m60K31K91k67j62
7117b11J5J30J73k32L75l72K43l41J78L24j24n0N7j28OJ38r0j05M5%M3r1J94k95
7141a18K6K75p8l1k25n8J96K54k52L5k2M39o40K49k29K83m0j35K36p1J4k19P0
7164d1q3K2Q2J28Rl22J97NR4J1k20l2O0K08m5q7Rj6L19J84l83Nj80r9J03R4j03
7191h1J80o3K18k44J87j03O8l09L07j70J6k54J39M70m68j0R9J50n6k62J26L81
$$ y = [90, 66, 176, 61, -26, 64, -126, 85, -139, 43, 210, 335, 75, -83, -253, 111, 111, 44, -289, -126, 112, -238, 27, -31, 69, 59, 187, -220, -41, 95, 56, 103, 4, 152, 11, 97, 49, -169, -177, 202, 29, 275, 64, -63, -54, 57, -66, -87, 79, -275, 288, -117, -35, 3, 293, 73, 56, 230, -137, 209, 117, 89, 241, -272, -162, 60, -58, 36, 232, 167, 93, -140, 19, -139, 136, -120, 5, 230, 3, 153, -12, -211, -176, -98, 42, 156, -304, -73, 218, -49, -211, -196, -66, 107, -125, 250, -122, 121, -220, -42, 282, 158, 108, 165, 37, 43, 181, 91, -14, 31, 31, 74, -17, 177, -118, -92, 183, 105, 74, -151, -209, -13, 241, -11, 24, 2, 441, -199, 50, -179, 104, 64, -71, 165, 94, 108, -111, -41, -124, -102, -20, 108, 117, -205, -8, -3, 91, 102, -118, -150, -90, 118, 73, -14, -5, -21, 298, 482, 99, 104, -76, -175, -72, 22, -81, 99, 36, 254, 10, 197, 94, 162, -147, 160, -10, 6, -248, -109, 361, -107, -117, -18, 132, 76, -186, -60, 321]
7213C21k13j17j30K69k59j03J71K1J33q4J69k87n8M87m01J35j40L67j44j94j19
7234a76L42l98J36M9L5J18J83l43L20n51L16o1j92L71m20P5O9K10L0k09q0L75
7256A99m64K33N7L9j38J71k37jJ36r6K94l1k78J75l87N02Mj44l7K52k46k27K25
7279AK4j17K4M2L9J24j03m2M3k78p2K98M9j72P7J8j31K19q8K84k25k99L76p3J12
7304A30J22j72q4j08K99k34P2j6J68k9k33L65j96L77m86q5R6m1R5j68J81q5J83
7327A51l01R1J30r6M2k4K06j07q7J92l60J30K20j04l12j29L77l2J66r0l2k75J03
7350a41P9Mn5P9J9J61j24o3M5J89l11J06Jj64J56J33L2k0j95m33O02n4L36l43
7374C9j17K38k00k38M28L1k81j52L34R6j87M19m05k34L09K18l28m5Q2j09K37K10
$$ y = [321, 108, -9, -139, 130, -129, -232, -61, -40, 93, 9, 178, -109, -167, 320, -81, 54, -86, 281, 137, -57, -176, 166, -232, -96, -47, -12, 106, 289, -54, 266, -285, 31, -30, -222, 149, -271, -196, -127, 83, 113, -96, -176, 199, -265, -32, 25, 64, -74, 97, -140, -141, -5, -101, 193, 162, -116, 59, -328, 174, 178, 34, -3, 249, 3, -224, 1, 25, -92, -68, -26, 13, 137, 34, -8, 35, -243, -315, -17, 32, -140, -63, -45, -176, 43, -45, 239, 14, -285, 91, 18, 130, 252, 80, -4, -112, 187, -47, 25, 9, 177, 148, -85, 280, 84, 461, -25, -110, -14, -55, 40, -128, 53, -32, 151, -150, -59, 71, -25, 17, -7, 199, 92, 5, 197, -163, -33, 187, 83, -229, -358, 19, -13, 153, 63, 31, -244, -141, -62, -58, -113, -34, -15, 146, 22, -41, 4, 193, -118, -12, -11, -175, -19, 114, 146, 126, -69, -502, 100, 46, 382, 39, -78, 160, -40, -278, 150, 181, -100, -252, 82, 178, -9, 410, 5, -229, 80, 298, -30, -75, 7, -102, 135, 345]
7396C45l31m7K20j55n02M53k10K98l47L03j37j76M29j73L0K38m13K35j04J03J3
7417G2q3j32Q7J56n8qj19M7k51J45J48P7j1K03k39J1r1k2J12L3J86k70K44j60
7441G7j2PM7j06j71R5J34l50K48R6m32K05J11J5j21L12l25K51o2j70P4Q1q0J35
7465E9N9j20J02k91J56K74J6j23l58L13R0l11M8K09j55P8K11l63J41r8N3j4L26
7488C02m07kj25L49j91K7J99j93p2K14J48k30k32M51l3k29j55K31k86J51J97J32
7510B46k1m06L87l14K41l54L47k38M2J9NJ42l8l89J90J44Pj01K97k38K43k96K7
7533e8O0N3N4K33m58K43k81K49J30k47RK9q0O8m3n2Q8j6K58k83j22K54p5J24J04
7558B41k82K54k52Q4M0k26K15J68j87O3k00J01k7K81n37K75p5J92k28M8l2K9j14
$$ y = [345, 14, -33, 187, 32, -470, -17, -227, 71, -276, 27, -110, -286, 143, -30, 0, 238, -175, 60, -44, 59, 72, -11, -143, -56, 100, 42, 34, -85, -38, -289, -144, 4, 81, 70, 273, 34, 45, -46, -68, 44, 77, 263, -7, 237, 77, 65, 72, 119, 13, -158, -63, 71, -279, -31, 65, -367, -162, -51, -36, -157, 155, -170, 81, 19, -151, -77, 4, -76, 59, 118, -2, 100, -191, -35, 239, 255, 132, -226, 87, 177, -134, -86, 123, -32, 46, 257, -106, 35, -63, -10, -24, 302, -105, -107, -232, 117, -74, -47, 152, -41, -113, 101, 249, 19, -213, 238, 205, -24, -179, 52, -234, -83, 114, 246, 225, -181, 206, -108, 133, -221, 126, -112, -70, -51, -46, 96, 58, -331, -141, 3, 10, -91, 206, -32, 211, -85, -58, 2, 55, 109, 342, -116, 127, -154, 95, 225, -22, -13, 16, -64, 4, -39, -91, -3, -19, 239, -44, -166, 88, 13, 137, 241, -41, 213, -39, 45, 85, -141, 74, 242, 55, 118, -82, 19, -8, 273, -264, 11, -64, 128, -100, -52, -84, -55, -169]
7581a69K15J68k53K6J53L7j14K3L4k03kJ30j41K3QJ19m87L82j1J07k89K87j92
7604a49K08k16M0K53j73J49Lj42R6l2j71K30j12oJ27k6J35k48J12j24N3J7k61
7627b37J97k40J50L76R0k54j45J63P8k02l40K23k30O22l65K7k8L88q3l71j10N46
7649B55k74K04k59J01Q5j47L14l42L99l36Q0j52J33K6J27k97J20J08q9J3p2J24
7671A21n01J54K68l68J51q5J25O8O5l32K78m9J11P5k56J57R8K78P0l03o5q0K42
7694B22o0m34J79J37j60M1L6K93m36K38P9p8j52LJ25pk11J11L11k01j62j70mK91
7718iJ38q7K18k61j8J73n95J87M01j57J91p0n3j39P2N4K20j94j28L01l37O3J09
7741G9l29L01L0r9J00k21o0J35P6j19N0r6K05l2%n1p1P1J45j83JL57n46L56j09
$$ y = [-169, 46, 214, -39, -13, 140, 177, 63, 86, 120, -83, -85, 45, -96, -73, -65, 54, -433, -51, -62, 45, -244, 43, -149, 59, -157, -117, 136, -37, 112, 115, -27, 69, 37, -134, 96, -16, -22, 105, 79, 214, -34, 78, -46, 7, 24, -237, -40, -280, -130, 246, 336, 82, -63, 100, 178, -24, -364, -141, -371, 251, -114, -87, -115, 273, 190, -181, -291, 255, -19, 185, -74, 27, 112, -35, 279, -63, 336, 0, 80, -72, 61, 87, 214, -83, 37, 145, 56, 69, -3, 121, -380, -226, 42, -326, -175, -260, -135, -67, -2, -334, -56, -105, 6, 81, -175, -18, 80, 358, 428, 125, 60, -20, 222, 162, -272, -93, 44, -116, -75, -39, 254, -182, 56, 135, 57, -95, -92, 33, 26, -185, -74, 237, 36, -126, -296, -300, -9, 129, 42, 260, -1, -19, 154, -441, -254, 147, -10, 181, 111, 58, -81, -9, 45, 265, 71, -57, 244, -93, -30, 79, -250, 51, 81, -18, 82, -139, -199, -64, 12, -107, -57, -153, 52, 20, 20, -31, -102, -31, 114, -69, -68, 289, -257, 99, -10]
7766a0o8nM8j09N0K50k87J84j33J85nk9k4J49M0l00J51J8Q6j70J9l06L53j10j66
7791a89J09j0J70n4LK9j21o2K73l2k94K13k66K20R8J34m32m7L59K32o27L91ol77
7815b86J69j64L79j82P9R9M6k44J77j73J86k1J4m8j05L51l03KJ24k39J75K1j76
7838a19J48j13J85k00J35J67l74R5J30j85K63m7k16R6j29K31j18l7J52J3N5j33
7860ak7K4m5Q9j24M7l2j2Q0k55K03J22J19O4k56o8j35L9J69K02L0n20P4K93m10
7885c30M38j72L9J01L7j42J46J06k02K13k84j2J12j14O1j6M00m18p5N6M9j4j52
7908a73J57j46M48l90j39L58R2k90K6R5n7J41j75L35j72j63N5J17M2l04K55k31
7930a19J10j45O1q2M5R7j06J14k0J77J76l03K61j53l9L8n8r3Q6j37K31lP4l55
$$ y = [-10, -78, -83, -35, -144, -94, 156, -131, 53, -80, 105, 100, 71, 47, 196, 236, -64, 87, 105, 191, 21, 40, -266, 87, -23, -189, -80, -90, 80, 26, 29, 58, -63, -125, 148, 116, -178, 35, -231, -11, 87, 221, -211, -258, 101, 333, -294, 97, 91, -286, -117, -281, 98, -84, -5, 94, 140, -104, 73, -100, 86, 65, 79, 31, -74, 277, -26, -24, 100, -139, 36, 57, -119, 29, -84, 101, -99, 36, 203, -171, -76, 54, -131, 132, 85, -131, -35, -164, 67, -51, -88, 64, 77, 132, -1, -28, -4, -49, 40, -84, -37, -69, -81, -1, -256, -53, 69, 188, 252, -4, -72, -207, -168, 1, 203, 233, -287, -213, 80, -330, 108, -64, -25, 76, 113, -29, 117, 223, 21, 234, -50, -62, 50, -64, -3, -19, 381, -37, -112, -56, -7, -21, -173, -16, -162, 286, -104, -243, 115, 207, -83, -57, 38, -19, 122, -53, 282, 110, -53, 2, 119, 161, -143, 112, -119, -9, -154, -93, -175, -130, -33, -139, -25, -45, 132, 308, 5, 266, 113, 74, 112, 54, -39, 47, -90, 141, 138, 212, -143]
7954a43N5n4J74k13L70m08L71J31k89j26J08J71l13K33J78m97M01j58J24k10J94
7975I9j87Q4R3k40M96l55J16p1o7j29J21j87K23l7p0l3j14L03j1K6J4j57K19M1
7999A77m12L98n6l74K01o4L60j05j48K96j83K8l45J95k22N14J9k43q0J78J13m28
8021a81K28PLk55K40l15J55J93k26M30k34N2m7o8r8K03k30j13J19J50j7jN6L9
8045I0j51m1K45n4l02O3K17l6o4k10L23K3k41J10m8J08K3M0p9K1k12L61l08M8
8069g4j08M8O3J00R7k28J13o4J31m3r2L34n10M37j40j92L12l05K17j24r2K19k5
8092G4N3J90k59k93L47j67p1j75K24j24o6M67k50mJ08k4j24K68j65R5j61M7k43
8115b53K50R3j11J25j11J35J6m97M09K10l14m6K22j92J34j20K37j50m3N7j45k9
$$ y = [-143, -88, -142, 32, -181, 189, -219, 152, 283, -6, -132, -24, 147, -166, 67, 245, -252, 149, -9, 115, -95, 99, -88, -4, 89, -151, 345, -10, 106, 35, -32, -161, -40, -227, -4, -41, -111, -144, -258, 45, 34, 60, 74, -83, 136, 177, -235, 163, 107, -267, -66, -130, 230, 125, -23, 273, 90, 118, -227, -32, -254, 260, 279, 36, -44, 134, 247, -181, 47, 54, 57, -198, 42, -273, -118, 75, -151, 279, 45, 97, 50, -18, -116, 87, -143, -256, -137, 13, -4, -5, 51, 90, -61, -102, 143, 89, -213, -150, 67, 31, -33, -243, 80, 103, -138, -28, -76, 32, 55, 95, 16, 37, -175, 186, -122, -74, -182, -134, -71, 29, 126, -102, 11, -53, 78, 35, -57, 277, -233, 204, 64, -128, 184, -121, 96, -28, -120, 99, 74, 127, 317, 58, -235, 112, -55, -126, -301, -77, -201, -267, 200, -50, -54, 54, 30, -94, 174, 9, 104, -57, -10, -253, -3, 90, -21, 104, -7, 128, 144, -353, 56, 266, -48, -94, 128, -64, 70, -50, 187, 37, -6, 51, -94, -123]
8137a23K54j6r6ML5l61M94l09o0J84K69j12l47L59k79o1L89k1J31j28j25p1O9
8160G9J43Ml14K4J17j5oJ35j49K9nr7K61j41j10Q2q4K9j14L93k83m6j07K28q7
8185c4m4j85j32M64k49N19
$$ y = [-123, 131, 115, 19, 23, 58, -303, 191, -118, -178, 6, 275, 163, -184, 175, -104, -165, 224, 203, 334, 206, 81, 10, 79, 222, 226, -88, -64, 53, 38, 32, 167, 18, 47, 42, -55, 206, 65, -45, 37, -47, -18, -132, 261, -22, -68, -175, 53, -34, -78, -263, -395, 69, -180, 339]
8191C39
$$ Imaginary data points
##PAGE= N=2
##DATA TABLE= (X++(I..I)), XYDATA
0@%%%%%%qQqJ6j6K4l2L2m0N6p2Q8j04J28j52J84k18K50k97L47m10M80n52O32p20
31c84Q24r36J058j197J349j520J704j906K130k371K639k928L244l592L967m381
47b300M833n325N869o464P123p850Q658r565J0579j1734J3057j4587J6385j8526
61i847K1138k4403K8620l4314M2466n5211P8152j32574N12102N44124n09714m67252
73f713n25987j96933O230K95814L67711M19900K59615O1798k45652m24352m78846
84d67415k84358k178L07446M47469M34833K42093K592k43528l77161l95922k57354
95e93483l9072K07361L62503L91561K67879N7045j81908l53647m05854k97235
105e84850o8888K00657L82754M01523K47421P569k12438l31039l31788k35047
$$ y = [0, 0, 0, 0, 0, 0, 0, -8, 0, -8, 8, -8, 16, -16, 16, -24, 32, -40, 48, -56, 72, -80, 104, -114, 136, -161, 186, -224, 256, -296, 336, -384, 440, -496, 562, -635, 714, -806, 898, -1008, 1122, -1249, 1390, -1538, 1706, -1886, 2081, -2300, 2533, -2792, 3077, -3387, 3736, -4114, 4544, -5021, 5558, -6176, 6881, -7706, 8679, -9847, 11291, -13112, 15508, -18806, 23660, -31551, 46601, -85973, 426129, 970253, 460539, -6713, -532700, -729633, -723403, -427589, -59878, 360022, 619637, 681435, 435783, 11431, -467415, -751773, -753951, -446505, 964, 435797, 677890, 680482, 436954, 59793, -336129, -593483, -632555, -425194, -62691, 328870, 596749, 653794, 471886, 118239, -287615, -584850, -653738, -453081, -70327, 331196, 578617, 586186, 373748, 42709, -289079, -524126]
115e24126p3993J20661K96576L82871L16841J06230j63191l55915l77495k31086
125e02627n491J89675K86543K79717J96082O2634r8061k47757l27468k82817j13317
136e62887J13687K91086L38195K42381N9474j26858k50847k78684k12133p4110
146d60696R1196K28685K86173K38059J00257p6446k26786k95798k54459j13589
156d83404P6409K40616L06015K41827P9256j06036k32228k57961j92330p4079
166d01915N6284J69000K37547K32968J35791l2345k03444k91051k45543q9209
176d31917R3649K15507K35812J71576O8715l8471j32336j99181k11705j44723
186c73074n185J52930K52484K39167J20542m3976j77490k29058j91896r2707K9656
$$ y = [-524126, -598119, -477458, -180882, 201989, 518830, 625060, 461869, 105954, -271541, -502627, -508118, -318443, -31900, 247817, 443899, 506533, 408472, 160715, -166753, -449570, -562887, -449200, -158114, 180081, 422462, 481936, 355078, 104231, -174453, -386586, -460696, -369500, -140815, 145358, 383417, 483674, 407228, 180442, -115356, -369815, -483404, -406995, -166379, 139636, 381463, 460719, 354683, 122455, -135506, -327836, -401915, -345631, -176631, 60916, 293884, 429675, 397330, 193886, -97165, -342708, -431917, -338268, -122761, 113051, 284627, 353342, 314871, 182535, -16646, -228351, -373074, -378259, -225329, 27155, 266322, 386864, 342888, 165398, -63660, -255556, -348263, -318607]
197c18607J36988J99456J96133J24062L281j23455k07388k13023j34459n66J36669
208b00909K19279K11445J16034k4655j48734k04384j77388r0990J3680J02139
218a84483J55918J66918J28383L7032q4362j86262k13489j41384m40J36469K02521
229A6821J75956Q8071j2329q9107j33249j45883j21829n2282N3173J53617J96291
240A29250J47610K6801j07335j87223j81393j04456J608R2404J42826J46927J08119
251B15138L6646n1482j26768j59451j30614m5401O2928J48769J72668J25195K5034
262B72662q2083j50738j55118r9993j6595O0454J09993J24133J03925N2492k4468
273A94664j05633j54921j40889n8633N6099J44929J64238J09831J7455o4443j07651
$$ y = [-318607, -181619, 17837, 213970, 338032, 341313, 217858, 10470, -202553, -337012, -337578, -200909, 18370, 229815, 345849, 321194, 172460, -31924, -209312, -300302, -286622, -184483, -28565, 138353, 266736, 303768, 219406, 33144, -180345, -321729, -322169, -185700, 16821, 192777, 280848, 268519, 179412, 46163, -99720, -221549, -273831, -220658, -67041, 129250, 276860, 303661, 196326, 9103, -172290, -276746, -275138, -182734, -39908, 107019, 215138, 251784, 200302, 73534, -85917, -216531, -261932, -199004, -50235, 122433, 247628, 272662, 190579, 39841, -115277, -215270, -231865, -171411, -61418, 62715, 166640, 219132, 194664, 89031, -65890, -206779, -265412, -209313, -64384, 99854, 209685, 227140, 162697, 55046]
284E5046j11475q7274m5006J3276P9076J29864J33889P3851k7580j22441j60451
295f9225j23510l5907N4534J09888J16028Q5070L4987j9832p0130j04051j07127
306a29275o7861N093Q6033J35685J27697O3142k8057j03212j27433r9105l5529
317a72822L0401P6069R2387Q2726N0518O22n7523j05032j17166p9299r23Q2329
329a17713J28997J15941N0990k7099q2748r5583p3987l4494P630M6143P9118R3302
341I0497P5151J9406n5543j13826j21258p1838Q816P8139J04207Q2350L4354j4666
353A15789m8681o6320p0207n7399k2497L1703Q4968J08559Q2053J4480o1306j05247
365E895r7204m8716J2411N6482P1955O4367M3319J3952k2271n9566q2711p6021
$$ y = [55046, -56429, -143703, -188709, -175433, -96357, 33507, 167396, 241247, 213667, 91226, -69225, -192735, -228642, -174108, -64220, 51808, 136878, 171865, 152033, 81903, -22148, -129275, -197136, -192043, -106010, 29675, 157372, 220514, 192457, 89245, -38188, -137293, -172822, -142421, -66352, 26035, 108761, 159279, 159901, 102378, -2654, -119820, -199119, -200042, -117713, 11284, 127225, 178215, 151116, 68368, -27215, -101202, -135696, -128066, -81923, -2805, 90497, 165648, 185054, 129511, 15685, -105573, -177411, -168595, -90456, 13751, 96101, 130455, 115789, 67108, 788, -69419, -126818, -149315, -117612, -32644, 75915, 157968, 172448, 111142, 5895, -91309, -140025, -127614, -71132, 823, 65190, 108509, 122461, 100190, 40624, -42087, -118108]
377a18108l1730L2184Q6185J00060O6204L658n5439q3124p4496m0781k112L0592
389h6907N2151O3591N9451L5090q742n7452q7080p6596k7072L7379Q2829Q5257
401G1899M8563l248m3468n8597n4383m0556k2906K206L6547O7443P4875M5037
413A23412j3044o8614q8695o3100q633M2442O5047N7042L3987R626j0215l0960
425D8295m9966n9349m3846k912M8364P8753P1692K8123k6899o3784o7242m3235
437h2006q103K1568L8048M3679M0249K7192L555k8119n5162o2557m1567L126M8716
450e1381P1566N9315J9245k4621n0472m9065l1829j1895M323J7645L3915M7771
462C4517M6060J8115k7226o4805p0033l6191J5647N4695N9662L5988N591j5847
$$ y = [-118108, -149838, -117654, -31469, 68591, 134795, 138453, 83014, -110, -74606, -115387, -117499, -86907, -34756, 28835, 88286, 123376, 114634, 57182, -29898, -106494, -133566, -96187, -13358, 71899, 120462, 117214, 73746, 15149, -39234, -79790, -102696, -100490, -63943, 3500, 78375, 123412, 110368, 41754, -46941, -110041, -118674, -76232, -11185, 45857, 79844, 89470, 79255, 48295, -1671, -61020, -104866, -107778, -59414, 19339, 91031, 119154, 92255, 28471, -38771, -82006, -90109, -68541, -30493, 13186, 53435, 80627, 84182, 56063, 901, -61656, -103223, -100097, -51381, 20185, 79500, 98745, 74124, 23652, -25413, -57242, -69137, -64814, -47169, -13254, 34517, 80577, 98692, 71466, 6661, -63372, -99563, -83916, -29221, 30441, 66429, 72020, 56173]
474E6173k3765k8196l3964l5623j9578J3455M9402O4167M4286K01m1954n9130
486a4526m5378j4088J4814L0533L2535K7664J9429Q208r403k9232m1875l8784
498f0103j5741J8662M7732N5151L6837N19l2680m7182l8842j7359K640J3751J7985
511a8630K2667K5493K1066k70l1352n3788m8167j2510L3614N9943N3395K1542
523G3003j0764k5684k2395j5546j4526j4909p123J3775L5643M0935J9112j7995
535E3526m7608m9954k7228N084K7106L0982K2549J3917P336N89j0259k3371l1273
548b8604k4688k869K4574M1562L8993J5687j4858l7066l8323k1835J812J8792
560b6823K4018J9869J6454J2427M992j0996l1751m1542l1032M19L2434M5014L0194
$$ y = [56173, 32408, 4212, -29752, -65375, -84953, -71498, -22096, 42071, 86357, 86558, 44604, -14526, -59904, -73992, -59178, -28645, 3890, 31554, 50983, 59191, 49788, 20556, -21319, -60103, -75844, -57182, -9450, 45701, 82538, 83057, 50377, 3195, -35647, -53006, -50366, -36615, -18630, 4037, 29530, 50596, 50326, 18974, -34814, -82981, -95491, -61877, -1934, 51461, 73003, 62239, 36555, 14160, -1386, -15912, -30821, -37944, -24169, 11474, 52409, 71521, 53526, 5918, -44036, -71264, -66180, -39074, -8092, 14457, 28374, 35710, 36299, 26040, 2669, -28604, -53292, -56161, -31587, 9975, 48968, 64655, 49797, 12731, -25592, -47427, -45615, -26823, -2805, 17064, 33518, 45945, 50937, 39941, 8190, -33352, -64384, -63965, -31531, 13483, 43677]
573D3677j206k5203k9138j6517j255L857K093L234J5000K8700L0500J1988j8529
586D7201m0326l9162j6783J0261K6242K3262J0285k67m576n629r063j6316j9888
599c4759j2142P795K9147L8789K8430J520k4523l6989k9430r263J1284J9991J7695
612G545R366L376R57k409r998k0207k3088j1909J1078L0983L4496J7286r238k6123
626A2115k5392j0956L174O570J870Q9P991J8393K0655O778j6622l2885k8100n449
640d1769J9497K9976K1707M224r730j3067j0063q666j1461j3103n870R855K4767
653c703K7943J4864q408k5660k7747j2585P129K0566K1104J1406J028m021l856
666A8060l519p307j4855j5850o717R382K2886K2640P336j2763k3481j9801m998
$$ y = [43677, 42471, 17268, -11870, -28387, -29642, -25785, -23692, -20458, -5458, 23242, 53742, 65730, 47201, 6875, -32287, -49070, -38809, -12567, 10695, 20980, 20713, 16137, 10508, 1445, -14871, -34759, -46901, -39106, -9959, 28830, 57260, 58780, 34257, -2732, -32162, -41425, -30141, -10150, 7545, 16911, 20287, 21244, 18835, 8837, -11370, -34458, -46367, -35289, -4306, 30190, 47476, 38238, 12115, -13277, -24233, -21059, -14489, -12619, -12530, -4539, 13854, 34509, 41287, 24665, -8220, -36320, -41769, -22272, 7704, 29411, 33635, 23905, 10838, 775, -7891, -19352, -32455, -38325, -28470, -3703, 24240, 39104, 30696, 5036, -22711, -35296, -28167, -7601, 13503, 24909, 25937, 21916, 18060, 14541, 7234, -7621, -23471, -30188, -20806, 2080, 24720, 32056, 19293, -4188, -23989, -28987]
679b8987P733R639M666J297N554J3056J3921Q94j7025k7296j9163M085K4357K9625
693B2356J6070m944j6680j6185p283j447k048m923k574P248J6616J6406L081j3990
707A1703k4250j9440l062J3867J9924J4575L227m286m852p59M14l631r365r725
721a5660j629J1126J9778J6013Q61j5368k1906j5807j076R823J0972M657m82J519
735B821N264N578k789j4882j9273r280R304K3831K3231Q554j0180j9002j3027
748i850j218O372M801j092l454L008R849J1096Q61j2938k0408j4776Q37J4060
762a2852J7275Q771k372p921m807J034K373k108o956o581K817J3129J7225J0092
776B9119n193j6773j8860q747M323J1821R584K207l739k811R33J873l000r842
$$ y = [-28987, -21254, -11615, -6949, -5652, -98, 12958, 26879, 27773, 10748, -16548, -35711, -31626, -7269, 22356, 38426, 33482, 16802, 617, -6666, -8113, -10161, -15084, -17658, -10410, 6206, 22612, 25693, 11703, -12547, -31987, -35049, -21182, -1258, 13317, 16544, 12258, 7406, 6647, 7061, 3430, -5935, -15660, -17289, -6163, 13615, 29628, 30489, 15121, -6785, -22592, -23668, -13845, -2873, 1784, 1302, 2821, 8085, 13663, 10874, -4008, -23281, -32561, -23257, 574, 23805, 32359, 22179, 3177, -9850, -11068, -4696, 105, -987, -4441, -1433, 8416, 19512, 20373, 7435, -12973, -27749, -26912, -12852, 4423, 13194, 10822, 2901, -1906, -872, 1501, -607, -7563, -14144, -11327, 1802, 19027, 29119, 23926, 7153, -11707, -20454, -16131, -4310, 5274, 7481, 3742, 931, 1864, 3737, 737, -9105]
790i105j1185l077J0370J8543J6178K548j1644j6248r208K822R201O469j124m738
804a98o67P183Q347R31j1083j7245j0960K770J5665J5641N730n946j0883o068
818f783J258L570j71n188m804L395J1844J3333M582q279j5818j2368p48R794J2565
833F182P207j710n649m160J11J615k654p549q297k136P546J3111J0107j010j0841
848A873j3002n411N343J0837P539l84l448r15N378O995J21r760j4697q309M624
863a3216J3874J2349J511r602j2304n309K973O253K263l402l200K054R557J0075
877A3876J908q258j3337q439J988J0200J1075L401m180o780l673J556L181p03
891A815n314n379j109P410J0790O200l758j1338j1922l448N795R907N790j589
$$ y = [-9105, -20290, -23367, -12997, 5546, 21724, 24272, 12628, -3620, -12828, -10006, -805, 5664, 4540, -198, -865, 6318, 14665, 15596, 4513, -12732, -23692, -20922, -5257, 10384, 16114, 10168, -715, -6783, -5525, -1955, -2126, -7314, -12118, -8723, 3121, 16454, 21036, 12757, -3061, -15429, -16177, -6383, 6182, 13389, 11679, 6030, 1870, 1981, 3596, 942, -6607, -14904, -17040, -9494, 3617, 13724, 12714, 1873, -11129, -16540, -11197, -360, 7179, 6795, 3347, 2432, 7810, 14805, 14926, 5166, -9531, -17840, -13216, 658, 13007, 14518, 4916, -7388, -12697, -9724, -3471, -1208, -4610, -7810, -5756, 3801, 13876, 15784, 7526, -5811, -14250, -12262, -2062, 9013, 12414, 8234, 1454, -2219, -663, 2518, 1815, -3499, -8878, -9987, -2577, 8213, 14413, 10655, -683, -12605, -16053, -10258, -351, 5439, 3850]
905C850m518j722L614O060J054o620r727l719O048J2857R898j109j0699j1491
919f224m324L922O548J917m174n251O90P250P800J229p557j0838n115M246J0779
934H98R714J861n017p071k658K185L594m56m380m847l58N904P837L630m650j0342
950d156q817j500P342R342M586k109n739k836L180N762J538m843p728k780N991
965b767J0586P260k235j0470j0167k463N334P321J460m351n321j47N724O592L22
980F678p146q915l497N581R737P492L9o532o008j895L214M040J076l462l321K08
996b711M860O522J590m215q850p292k20O901P761K554m345p162l142K673N093
1011A7J899l739n764j777O255J0548N973k591q743p977Q4O474P097R01n397o044
$$ y = [3850, -668, -2390, 1224, 7284, 8338, 1718, -8009, -11728, -5680, 7177, 17075, 15966, 5267, -6224, -10548, -6626, -78, 1839, -2335, -7586, -6896, 354, 8154, 9383, 1826, -9012, -14127, -9881, 898, 10612, 12473, 7456, 385, -2273, -88, 3506, 3050, -1330, -6177, -6535, -631, 7206, 10836, 6186, -4156, -12973, -14473, -7131, 2211, 6797, 4688, -1051, -3887, -707, 5055, 6593, 1750, -5978, -8758, -2767, 7819, 15079, 12844, 2374, -7793, -10256, -4922, 2399, 3859, -492, -5813, -5960, -236, 6356, 6678, -468, -9383, -12880, -7299, 2438, 9930, 9969, 3437, -2571, -4466, -1252, 2788, 3864, 402, -2919, -2711, 2149, 8671, 10261, 6046, -2804, -10096, -10316, -3415, 4346, 6900, 2555, -4607, -7749, -5076, 17, 1916, -1823, -7587, -9364, -3109, 7439, 13412, 10821, 2078, -5899, -5815, 659, 7756, 8657, 3260, -2784]
1027b784j057M165M510p86o703p168k248N235Q623N248q93n874n463k50M029M194
1043B778Q78k617l418l14M148N264J092m358p654n073J916P232P402J713m867
1058D122o680l114L350N000J417m052n832j627M738P207L638l813q374n741J924
1073g837P476O883k75m464m714L47M961M265n54n886o582j528M378P042L569k694
1089D387n866n224M89L510M518J395k316k831M52L280M028J013m349o343l313
1104g170K326O531N414o14n821o646j332L980N233J671l614n141p76M562O870
1119E473K729l970p105m127K222O588M826p51m949m389Q77M332L630j187n620
1134a421n281L8M983O325K258l374o792l881N46M287M295J080k640k906j36K709
$$ y = [-2784, -3841, 324, 4834, 4048, -2655, -9823, -12071, -6836, 1787, 7035, 6142, 268, -5195, -5445, -1416, 2778, 3656, 1039, -2379, -2693, 1455, 6719, 7811, 3453, -4201, -9274, -7358, -126, 7276, 8989, 4122, -2558, -5672, -2322, 2678, 4095, 43, -5789, -7416, -2678, 4529, 8167, 4354, -4020, -9761, -7837, -361, 6522, 6247, 1783, -2931, -2584, 2377, 6642, 6088, 202, -6380, -7908, -3530, 3512, 7081, 4387, -1479, -6703, -6214, -2704, 1814, 3209, 893, -1938, -1486, 1794, 5822, 6835, 2486, -3857, -7170, -4844, 1687, 7101, 6487, 666, -5980, -7312, -3332, 1901, 3572, -42, -5183, -5959, -1397, 5473, 8202, 4232, -2873, -7000, -4778, 1810, 6636, 5885, 936, -3453, -2576, 1756, 5386, 4199, -1421, -6702, -6664, -1681, 4644, 6902, 3528, -3264, -7145, -6599, -2312, 1983, 3063, 423, -2483, -2619, 90]
1150I0L330R26k910m295j573K869N718L751j850n827m870l71L937M641P26m664
1166c72n256r13M295N918K033l744o600l399K733O463M504o68m425l762R25L972
1182A704L325j320m604l348N37M785M985L28m128o288k598K051M301L571r9l542
1198c40l307p2K425L183J309k496l439j152K309M549K997j315m356l899l7M056
1214D15L618l0l965m557m09M377N068R67m773o525k008L041O665M150j808m721
1230d95l859R34M182L322n66l857k919J028M441K815o86l850m221j608L013M011
1246A685J839j421l449k775M38K863L082M41k524l163j356K682L809K697j073
1261C775l713l372K88L484L476n2l206l647m65L778L923j70m111n093j565L556
$$ y = [90, 3420, 4346, 1436, -2859, -4432, -1563, 4155, 7906, 6056, 229, -4641, -5012, -1075, 3566, 4292, -372, -5628, -6541, -2246, 3672, 5705, 1961, -4639, -8038, -5305, 1158, 5662, 4994, 569, -3193, -2268, 1704, 5029, 3709, -895, -4243, -3706, 1079, 6064, 6392, 2264, -4024, -6622, -4571, -270, 3301, 3202, -340, -3647, -3719, -1294, 1889, 3198, 702, -2737, -3889, -1580, 2969, 5966, 4651, 295, -3604, -3641, 415, 4033, 4003, 38, -4519, -4928, -551, 4517, 5484, 711, -5814, -7822, -4781, 1884, 6034, 4226, -495, -4354, -3420, 762, 4084, 3518, -339, -3258, -2230, 2211, 5026, 4340, 490, -3731, -5339, -2326, 1685, 3524, 2103, -1346, -4121, -3683, -820, 2262, 2703, 179, -2984, -4340, -1658, 2151, 4848, 3775, 62, -3310, -3022, 462, 3938, 3886, 680, -2967, -3432, 346, 4269, 4099, -12, -5105, -6670, -3114]
1277c114N741L180k804n464l342J516M503L546n65l430l000R40L825L121j16l400
1293A137l590q76K676L247J098j998l110k221Q18K933J937n26l011k434k19K684
1309a455L677J993j553l796k291N83L311L425P1k741l262m93K570L309J63l392
1325A19l952j136L405M386J812k396n110k381J869M104L044j126l798k287N97
1340b850L298L323J92l271l291n99K535L364J180j549l043k035Q43K568J574n35
1356A704k603k498J53K323L072R84k609k893j741J287L471K734r6k820k783N8
1372b257K853K650L12k395l307r19K296L277J470k421l770k093J651L323J982
1387B652r60l113k186Q30L123K603m6k876k763j88K338L206J292j321l555j381
$$ y = [-3114, 2627, 5807, 3003, -2461, -5803, -4287, 216, 3762, 3197, -233, -3233, -2293, 1532, 4653, 4537, 1137, -2453, -3329, -653, 2594, 3692, 1694, -1416, -3637, -2819, 114, 2051, 1525, -1486, -3920, -4139, -1455, 2222, 4215, 2662, -1134, -3425, -2842, 469, 3894, 3965, 1224, -2038, -2531, 39, 3348, 3511, 119, -3833, -4969, -1564, 2822, 4634, 2238, -2872, -5253, -3384, 720, 3764, 2638, -1160, -3447, -2850, 448, 3771, 3963, 692, -2599, -3198, -663, 2701, 3881, 2332, -711, -2746, -1903, 665, 2239, 1704, -899, -3397, -3244, -921, 2151, 3135, 526, -2367, -4108, -2821, 650, 3384, 3288, 468, -2315, -2257, 596, 3246, 3558, 1163, -2144, -3063, -767, 2510, 3980, 1559, -2211, -4304, -2653, 670, 2652, 1692, -1421, -3607, -2777, 346, 2949, 2903, 27, -2736, -2924, -586, 2620, 3912, 2591, -964, -2345]
1403b345P84K373J553m57k308k575J26K328K607M07k336k700p14J299L041K028
1419C111j046k548j906L38K351K653Ok741k713k85K260K972J298k246l176j702
1435c374J588K849J895j081k782k029O31K614J822M6k422k370n13K817K440J025
1451C156j702k625j427J082K808J664o23k363k204L55J892J810L36j929k068j522
1467c360J534K524J621r60k388j465O98K518J481K31k351j955l9J916K646L10
1483B961k044k907j186J447K384J824j063k173j565J11K090J899J66j995j853
1498a904n71K177K271R39j442k591j027J027K635Q67o25j963j914K49K032J872
1514B032Nk062k012p95J377K432J428j214k182j495N46K338J871k93j840j835
$$ y = [-2345, -1561, 812, 2365, 1908, -400, -2975, -2849, -521, 2086, 2493, 157, -2543, -3257, -1958, 1083, 3111, 2065, -483, -2389, -2051, 300, 2953, 2959, 218, -2495, -2780, -520, 2452, 3750, 1504, -1672, -3374, -1786, 1063, 2958, 1877, -905, -2934, -2303, 311, 2133, 2179, -243, -2613, -3126, -309, 2131, 3156, 1454, -1171, -2598, -1516, 1292, 2956, 2333, -30, -2234, -1879, 13, 1823, 2159, 230, -1838, -3360, -1826, 698, 2319, 1359, -1029, -2494, -1796, 722, 2203, 2434, 83, -1872, -1911, 5, 2651, 2961, 917, -1990, -3176, -1729, 655, 2479, 1416, -757, -2322, -2211, -121, 1778, 1944, -51, -1904, -2475, -298, 1973, 2912, 1470, -1121, -2148, -1121, 1514, 2381, 1756, -207, -2121, -1872, 160, 2032, 2037, -25, -2037, -2832, -1455, 977, 2405, 1191, -991, -2486, -1940, 398, 2269, 1976, 136, -1699]
1530a699O27J263J778M07j495k226q20J272K014J331j104j910j671L30J494J889
1546A480j97j575j754m63J953J778J011j312j622j464J004K267J230m92j937j308
1562a401M6K156J296L51k016k247j41R06K048Q35r21k300j149O89J731J744o74
1579I53j610r85J47J614J915Q7j387j709n27J267J828O89r67j894j004K87J738
1596D42R37q3j703j418k26J185J796O67j208j521p05O72J764Q37j54j409j244
1613a371r3J920J279J97j443j831m62J578J572Q47j197j932r05P43J571Q04l37
1630I40j488j384J99J405J528J71j323j201n37J406J659O13r58j352p05J22J691
1647G86O55l26q80j452j89J108Q72P19q99j358n83Q44J028Q89l12r83j202P5J303
$$ y = [-1699, -1072, 191, 1969, 2376, 881, -1345, -2165, -893, 1121, 2452, 1348, -562, -2233, -1903, -409, 1480, 1283, -292, -2046, -2509, -556, 1222, 2233, 921, -701, -2165, -1161, 1106, 2336, 1844, -93, -1401, -1355, 801, 2097, 2448, 432, -1815, -1956, -1050, 998, 1833, 912, -1388, -2537, -1848, -117, 1627, 953, -657, -1642, -1495, 119, 2034, 2121, 734, -975, -1502, -235, 1593, 2282, 1315, -579, -1583, -1296, 442, 1379, 1296, -407, -1825, -2051, -866, 930, 1597, 389, -1132, -1837, -1165, 599, 1436, 1282, -127, -1371, -1464, 456, 1735, 1932, 489, -1342, -1804, -226, 1346, 2193, 996, -936, -1841, -1098, 473, 1277, 940, -548, -1932, -1733, -328, 1200, 1371, 48, -1153, -1690, -284, 1375, 1988, 1030, -322, -1027, -905, 786, 1441, 1115, 235, -1217, -1406, -298, 574, 1293, 394, -964, -1547, -703, 325, 1214, 902, -81, -1283, -1208, 95]
1666I5J099K24r14j663k68R63J644J044j187j939p36N87J526J204r31j236j137
1683a625M13J032J604j37j284j189j60J118J248L93q53j400n00O31J243J100n03
1700A131j316p31m62J189J187%o61j120n67N50J021N65j44j079p83J70J263R82
1718A195O8j379q36j19Q05J321J67n17j576o12O56J447P78k73j556r15Q5J080
1736a81J197p2j061j013j02Q33J200M32o38j150o21N18J117P54l23j211n95qJ139
1755B15R08M1r03q23o49O17Q35O38j91j008q97L81O97J036N6p40j141L2P96R39
1775H39K23m9j198r17L35J142P98m73j107p97j67J522Q78l85m93j018m08O16J189
1794E30L78k08j161m71N67R23L77o1r37o91L06O59L98M20q22q98j85N77Q33M19
$$ y = [95, 1194, 1418, 504, -1159, -1427, -464, 1180, 2224, 1037, -902, -1638, -1051, 475, 1679, 748, -488, -1625, -1212, -180, 1424, 1287, 3, -1186, -1346, -228, 1020, 1413, 560, -840, -1340, -709, 534, 1634, 1131, -185, -916, -1378, -189, 998, 998, 337, -783, -1350, -800, 221, 786, 642, -437, -1220, -1050, 213, 1195, 1263, -116, -952, -1071, -266, 1055, 1222, 705, -871, -1483, -827, 620, 1398, 1125, -431, -1346, -1261, -181, 1016, 944, -117, -1130, -1232, -399, 801, 1233, 595, -555, -1176, -658, 459, 1213, 890, -321, -916, -924, 215, 1123, 1164, 261, -562, -1211, -594, 241, 879, 688, -320, -1217, -836, -139, 897, 953, 213, -928, -896, -100, 839, 1062, 1013, -185, -1102, -767, 375, 1173, 700, -407, -1204, -1371, 151, 1029, 644, 151, -867, -1275, -659, 530, 908, 700, -461, -932, -365, 558, 935, 874, -63, -754, -448, 211, 609, 1029, 207, -691, -876, -299, 534, 953]
1814I53o04o94o42K53O19R23R1q94q93pN50Q73M53n46p32o08M38J265O75n76q74
1835B3n91l70Q74Q51r1n43j078l76N36J539j45m74l76r84L16J069Q17l26p30l86
1855d45JP96M59L9n74q22k34N82Q86j11j88r10p27P83N28N53j84n25n59j95N66
1876b81M97O68m87o56m40J72O76N27K1p13n78M7N75Q71j10l95o25p86R43R97J23
1897A046q15n96o90K40O71R01p4q86p44L45O33N18N6j24q71k68N33P24N68m28
1917G39o68o05l7L99P00K0n51o85PK50J102j03l40p39j91L22O74J01L20o30o87
1938f02O0L24O63K12l77p21k72J38Q56N48l56n96p66M78P13K03J94q10p01N1O75
1959h6N89J89k02j094l34N46R50LM6p94n09K39O78K46L44q26l86lJ64O76J38m51
$$ y = [953, 349, -345, -987, -734, -115, 808, 899, 5, -888, -895, -345, 528, 981, 435, -297, -905, -467, 798, 1473, 897, 23, -568, -938, -64, 787, 696, 153, -925, -1301, -765, 774, 629, 155, -221, -1205, -889, 180, 997, 671, -59, -445, -444, 352, 811, 850, 276, -546, -780, -198, 688, 577, 389, -521, -1248, -465, 63, 616, 432, -93, -652, -847, -281, 216, 884, 397, -259, -699, -527, 149, 676, 697, -16, -594, -547, 28, 899, 789, 394, -231, -1017, -74, 923, 1046, 231, -365, -1055, -815, -144, 757, 683, -203, -947, -602, 31, 549, 605, 481, -390, -658, -125, 599, 1167, 739, 71, -534, -571, -172, 528, 548, -3, -688, -681, -431, 671, 568, 228, -511, -702, -380, 294, 395, 715, 85, -602, -542, -218, 445, 657, 280, -441, -713, -575, 281, 829, 473, -123, -889, -411, 302, 505, 699, -111, -812, -761, -86, 503, 692, 490, -604, -938, -392, 558, 561, 607, -187, -696, -457, 221, 467, 811, -15, -401, -404, -240, 436, 574, 123]
1981A23q22K26J0O35K78L60p39l19j50N56M46J68k61r63j54L20O90K28m09m67
2001b44m80J61M00O11K70o16p15j93Q58K54K89Q0j049m6LP50N26m62l73l78q5
2022d39O83M93l3p93n54LJ96O79J96o9q25q4j33Q08L87m07j85o13J26Q25j3L89
2044F37m75l26m21L53O26K94l54m50k87kN64M04K8o39o34J82Q7Q92j51j14o50
2065d36L1J96K10K77L00p56m08J76L63P85K82p44p36jJ83N08L45ro03l98J29L72
2087F6K97K2l77l74k65L43P44m9m14m25q1K38N25L39m11j75o03j24P32O65j79
2108D94j18q43j69M14O10K12k85n31m49N68J21O58j52m48n22kM49O40j93n31k99
2129c76k42O50O81j09j10m54p41K87M28L39J01k75p45j53O14N29j55o4n01r9o8
$$ y = [123, -699, -473, -463, 172, 450, 810, 71, -248, -398, 158, 604, 772, 511, -452, -606, -286, 404, 632, 223, -244, -724, -563, -163, 448, 718, 102, -613, -806, 52, 306, 595, 675, -374, -420, -417, 333, 859, 397, 24, -354, -439, 244, 737, 704, -89, -643, -640, -444, 235, 431, 362, -463, -547, -680, 128, 515, 108, -77, -690, -564, 261, 248, 637, 162, -164, -585, -232, 394, 688, 334, -116, -403, -405, 159, 563, 591, -48, -682, -500, -413, 479, 328, 214, -436, -405, -209, 1, 278, 578, -178, -586, -410, -47, 738, 1020, 276, -460, -461, -278, 230, 575, 566, -37, -435, -306, 66, 363, 385, 8, -366, -631, -288, 456, 407, -7, -432, -513, -275, 250, 589, 178, 3, -600, -724, 8, 673, 494, 376, -467, -636, -222, 388, 600, 315, -216, -665, -97, 24, 682, 530, 82, -440, -442, 7, 647, 454, -77, -376, -618, 32, 713, 604, 494, 40, -701, -414, 14, 353, 454, 179, -566, -719, -105, 424, 269, 205, -296, -395, -463]
2150d63N67N38m44j28n47R4O39n7N69n90n14j65J58N21J17M4m48m66q4O17M01
2171C59J41o13k66J73L28K67K88m17m34l19K99M38M83l37m77o16M44M49M58j44
2191E04n21m30o9N59M78K4l29n95n0j59R09K81l14n64k22J06N54L47J32o56m81
2212d96L35M4J15O65l62p19j76m8M91L88Q0j59n93k44M19O28r4l2m83q3J29O87
2234D92K90m85n91P4J3M03M08k91k50o40J46J55Q65n3l93m34l80K21L85Q03o39
2255I9j81n39J7M36L24J04r8m90j22L91K57O76l83q32k36M6M30N93Ok36p06k31
2277f75K37P32M5q0p07qj72P76M14k26n22m14K24O66K80j77l70m01Q8J36L62K01
2299D09k06m49k20K68M76J01k53q7n83j00M00N23J64n02j62m83N47K92M64o0r35
$$ y = [-463, 104, 642, 198, 70, -477, -383, 256, 199, 768, 178, -336, -501, -343, 178, 295, 339, -109, -575, -659, -42, 359, 500, -113, -379, -206, 122, 389, 677, 260, -174, -493, -194, 244, 727, 390, -87, -703, -259, 190, 648, 504, -17, -447, -516, 43, 521, 545, 216, -379, -429, -588, 321, 602, 288, -276, -498, -392, 162, 509, 641, -15, -496, -161, -117, -2, 663, 301, -418, -594, -642, -151, 237, 317, 158, -435, -679, -260, 368, 274, 242, -241, -324, -195, 492, 782, 297, -294, -220, -207, 196, 604, 313, 63, -577, -431, -276, 589, 536, 143, -291, -671, -450, -65, 738, 99, -82, -621, -604, -168, 156, 260, 162, -328, -450, -59, 198, 874, 491, -341, -577, -531, -101, 492, 498, 262, -444, -675, -438, 294, 339, 259, -448, -456, -628, 148, 562, 336, -186, -600, -376, 290, 570, 393, 23, -378, -290, -154, 208, 409, 203, -246, -466, -198, 278, 379, 126, 39, -544, -644, -244, 279, 443, -59, -221, -704, -157, 135, 599, 539, -396]
2320c96O7j26M49O02L2l45q73J83J59M89J30k49o97RJ75N35M16j01o82k58p3Q00
2342B46j1M34n62n04j09L96N50j49n9m61r5r5N07N38j35q41k31K48J56N55J90
2363E68n54q2m97L68L65K48p6n65j90K87J06L90J68n42n83J68K76N54K42m30j58
2384F3p19L94O41J80k60k48n13l9O81J86j88k90k68l7M10M19J67k42n36l24M39
2405h4J9P12k92l38n28J71N03L44o6l31l03n37O85L66K06k55m46n31M08M74K8
$$ y = [-396, -329, -455, -6, 596, 628, 283, -590, -407, -248, 241, 371, 122, -575, -566, -391, 144, 560, 459, -223, -481, -554, 246, 235, 669, 107, -397, -506, -110, 440, 291, 232, -229, -324, -419, 88, 626, 491, -350, -581, -333, -177, 378, 568, 14, -68, -565, -197, 168, 416, 340, -225, -415, -128, -22, 368, 536, -6, -589, -421, -145, 409, 651, 221, 63, -656, -262, 379, 559, 299, 51, -462, -501, 180, 366, 178, -112, -380, -417, -7, 412, 579, 337, -199, -523, -84, -65, 647, 355, 17, -511, -340, 163, 507, 441, 110, -193, -730, -45, 321, 527, 272, -174, -705, -297, 177, 205]
$$ [...]
8191a88
##END NTUPLES=NMR FID
##END=
