##TITLE=1H_DE-152K_HCl
 200.13Hz,D2O.
 8 sc
 1.6.2026
##JCAMPDX= 6.0         $$ Bruker NMR JCAMP-DX V2.0
##DATA TYPE= NMR FID
##DATA CLASS= NTUPLES
##ORIGIN= UXNMR, Bruker Analytische Messtechnik GmbH
##OWNER= pz
$$ XWIN-NMR		Version 3.5
$$ Mon Jun  1 14:17:12 2026 Russian Standard Time (UT+4h)  she@DPX200
##.OBSERVE FREQUENCY= 200.131
##.OBSERVE NUCLEUS= ^1H
##.DELAY= (6, 6)
##.ACQUISITION MODE= SIMULTANEOUS
##.ACQUISITION SCHEME= undefined
##.AVERAGES= 8
##.DIGITISER RES= 18
##SPECTROMETER/DATA SYSTEM= spect
##.PULSE SEQUENCE= zg30
##.SOLVENT NAME= D2O
##.SHIFT REFERENCE= (INTERNAL, D2O, 0, 14.3821)
##AUDIT TRAIL= $$ (NUMBER, WHEN, WHO, WHERE, WHAT)
$$ ##TITLE= Audit trail, XWIN-NMR		Version 3.5
$$ ##JCAMPDX= 5.01
$$ ##ORIGIN= Bruker BioSpin GmbH
$$ ##OWNER= she
$$ F:/spectra/data/she/nmr/H-C/1/audita.txt
$$ ##AUDIT TRAIL=  $$ (NUMBER, WHEN, WHO, WHERE, WHAT)
(   1,<2026-06-01 14:16:04.35 +0400>,<she>,<DPX200>,
      <created by zg, POWCHK disabled, PULCHK disabled
       configuration hash MD5:
       00 E9 B6 7A A2 85 ED C7 34 08 36 98 17 FE 4E 26
       data hash MD5: 16K
       5F 65 7A 88 66 91 15 C3 8B 09 D6 DF BE E4 2C 99>)
$$ ##END=
$$ 
$$ hash MD5
$$ 5C 1A F1 63 B0 05 98 15 D5 1C 98 6E 0E 4C 47 53
##$RELAX= 
##$RELAX= 
##$RELAX= 
##$RELAX= 
##$RELAX= 
##$RELAX= 
$$ Bruker specific parameters
$$ --------------------------
##$DU= <F:/spectra>
##$EXPNO= 1
##$NAME= <H-C>
##$PROCNO= 1
##$TYPE= <nmr>
##$USER= <she>
##$AMP= (0..31)
100 100 100 100 100 100 100 100 100 100 100 100 100 100 100 100 100 100 
100 100 100 100 100 100 100 100 100 100 100 100 100 100 
##$AQSEQ= 0
##$AQ_mod= 1
##$AUNM= <au_zg>
##$AUTOPOS= <>
##$BF1= 200.13
##$BF2= 200.13
##$BF3= 200.13
##$BF4= 200.13
##$BF5= 200.13
##$BF6= 200.13
##$BF7= 200.13
##$BF8= 200.13
##$BYTORDA= 1
##$CFDGTYP= 0
##$CFRGTYP= 5
##$CHEMSTR= <none>
##$CNST= (0..31)
1 1 145 1 1 1 1 1 1 1 1 1 1 1 1 1 1 1 1 1 1 1 1 1 1 1 1 1 1 1 1 1 
##$CPDPRG= <>
##$CPDPRG1= <>
##$CPDPRG2= <>
##$CPDPRG3= <>
##$CPDPRG4= <mlev>
##$CPDPRG5= <mlev>
##$CPDPRG6= <mlev>
##$CPDPRG7= <mlev>
##$CPDPRG8= <mlev>
##$CPDPRGB= <>
##$CPDPRGT= <>
##$D= (0..31)
0 0.7 0 0 0 0 0 0 0 0 0 0.03 0 0 0 0 0 0 0 0 0 0 0 0 0 0 0 0 0 0 0 0 
##$DATE= 1780308963
##$DBL= (0..7)
120 120 120 120 120 120 120 120 
##$DBP= (0..7)
150 150 150 150 150 150 150 150 
##$DBP07= 0
##$DBPNAM0= <>
##$DBPNAM1= <>
##$DBPNAM2= <>
##$DBPNAM3= <>
##$DBPNAM4= <>
##$DBPNAM5= <>
##$DBPNAM6= <>
##$DBPNAM7= <>
##$DBPOAL= (0..7)
0.5 0.5 0.5 0.5 0.5 0.5 0.5 0.5 
##$DBPOFFS= (0..7)
0 0 0 0 0 0 0 0 
##$DE= 6
##$DECBNUC= <off>
##$DECIM= 32
##$DECNUC= <off>
##$DECSTAT= 4
##$DIGMOD= 1
##$DIGTYP= 9
##$DL= (0..7)
0 120 120 120 120 120 120 120 
##$DP= (0..7)
150 150 150 150 150 150 150 150 
##$DP07= 0
##$DPNAME0= <>
##$DPNAME1= <>
##$DPNAME2= <>
##$DPNAME3= <>
##$DPNAME4= <>
##$DPNAME5= <>
##$DPNAME6= <>
##$DPNAME7= <>
##$DPOAL= (0..7)
0.5 0.5 0.5 0.5 0.5 0.5 0.5 0.5 
##$DPOFFS= (0..7)
0 0 0 0 0 0 0 0 
##$DQDMODE= 0
##$DR= 18
##$DS= 0
##$DSLIST= <SSSSSSSSSSSSSSS>
##$DSPFIRM= 0
$$ [...]
##$SUBNAM0= <"">
##$SUBNAM1= <"">
##$SUBNAM2= <"">
##$SUBNAM3= <"">
##$SUBNAM4= <"">
##$SUBNAM5= <"">
##$SUBNAM6= <"">
##$SUBNAM7= <"">
##$SUBNAM8= <"">
##$SUBNAM9= <"">
##$SW= 18.0517599122864
##$SWIBOX= (0..15)
0 0 2 0 0 0 0 0 0 0 0 0 0 0 0 0 
##$SW_h= 3612.71676300578
##$TD= 16384
##$TD0= 1
##$TE= 0
##$TE2= 300
##$TE3= 300
##$TEG= 300
##$TL= (0..7)
0 120 120 120 120 120 120 120 
##$TP= (0..7)
150 150 150 150 150 150 150 150 
##$TP07= 0
##$TPNAME0= <>
##$TPNAME1= <>
##$TPNAME2= <>
##$TPNAME3= <>
##$TPNAME4= <>
##$TPNAME5= <>
##$TPNAME6= <>
##$TPNAME7= <>
##$TPOAL= (0..7)
0.5 0.5 0.5 0.5 0.5 0.5 0.5 0.5 
##$TPOFFS= (0..7)
0 0 0 0 0 0 0 0 
##$TUNHIN= 0
##$TUNHOUT= 0
##$TUNXOUT= 0
##$USERA1= <user>
##$USERA2= <user>
##$USERA3= <user>
##$USERA4= <user>
##$USERA5= <user>
##$V9= 5
##$VALIST= <valist>
##$VCLIST= <CCCCCCCCCCCCCCC>
##$VD= 0
##$VDLIST= <DDDDDDDDDDDDDDD>
##$VPLIST= <PPPPPPPPPPPPPPP>
##$VTLIST= <TTTTTTTTTTTTTTT>
##$WBST= 1024
##$WBSW= 4
##$XGAIN= (0..3)
0 0 0 0 
##$XL= 0
##$YL= 0
##$YMAX_a= 727256
##$YMIN_a= -980696
##$ZGOPTNS= <>
##$ZL1= 120
##$ZL2= 120
##$ZL3= 120
##$ZL4= 120
##$ABSF1= 10
##$ABSF2= 0
##$ABSG= 5
##$ABSL= 3
##$ALPHA= 0
##$AQORDER= 0
##$ASSFAC= 0
##$ASSFACI= 0
##$ASSFACX= 0
##$ASSWID= 0
##$AUNMP= <proc_1d>
##$AZFE= 0.1
##$AZFW= 0.1
##$BCFW= 1
##$BC_mod= 2
##$BYTORDP= 1
##$COROFFS= 0
##$CY= -3
##$DATMOD= 1
##$DC= 2
##$DFILT= <>
##$DTYPP= 0
##$F1P= 0
##$F2P= 0
##$FCOR= 0.5
##$FTSIZE= 0
##$FT_mod= 4
##$GAMMA= 1
##$GB= 0.15
##$INTBC= 1
##$INTSCL= 1
##$ISEN= 128
##$LB= 0.25
##$LEV0= 0
##$LPBIN= 0
##$MAXI= 10000
##$MC2= 0
##$MEAN= 0
##$ME_mod= 0
##$MI= 1.114404
##$NCOEF= 0
##$NC_proc= 0
##$NLEV= 6
##$NOISF1= 3.799351
##$NOISF2= 2.8
##$NSP= 1
##$NTH_PI= 0
##$NZP= 0
##$OFFSET= 14.38212
##$PC= 1
##$PHC0= -4379.896
##$PHC1= 10.59229
##$PH_mod= 1
##$PKNL= yes
##$PPARMOD= 0
##$PSCAL= 0
##$PSIGN= 0
##$REVERSE= no
##$SF= 200.129724274929
##$SI= 16384
##$SIGF1= 3
##$SIGF2= 2
##$SINO= 400
##$SIOLD= 16384
##$SREGLST= <1H.CDCl3>
##$SSB= 0
##$STSI= 0
##$STSR= 0
##$SW_p= 3205.1282051282
##$SYMM= 0
##$S_DEV= 0
##$TDeff= 0
##$TDoff= 0
##$TI= <>
##$TILT= no
##$TM1= 0
##$TM2= 0
##$TOPLEV= 0
##$USERP1= <user>
##$USERP2= <user>
##$USERP3= <user>
##$USERP4= <user>
##$USERP5= <user>
##$WDW= 1
##$XDIM= 8192
##$YMAX_p= 0
##$YMIN_p= 0
$$ End of Bruker specific parameters
$$ ---------------------------------
##NTUPLES= NMR FID
##VAR_NAME=  TIME,          FID/REAL,        FID/IMAG
##SYMBOL=    X,             R,               I
##VAR_TYPE=  INDEPENDENT,   DEPENDENT,       DEPENDENT
##VAR_FORM=  AFFN,          ASDF,            ASDF
##VAR_DIM=   8192,          8192,            8192
##UNITS=     SECONDS,       ARBITRARY UNITS, ARBITRARY UNITS
##FACTOR=    0.0002768,     1,               1
##FIRST=     0,             0,               0
##LAST=      2.2672688,     0,               0
##MIN=       0,             -980696,         0
##MAX=       2.2672688,     727256,          0
$$ Real data points
##PAGE= N=1
##DATA TABLE= (X++(R..R)), XYDATA
$$ [...]
1124g64K06O18Q28P62L46j88m51p15o31l58o5J16K94L59J52J52j92j28j51J74
1144C64R9j70m20m89k11k71R5K33M73N86L63lk88p53p16n58j80L12O19N63N20
1165A68L29L8j93m53n34k72p8J57K20K42Q9K51J50K15J47Nj42k02j80k14k90j25
1187f72L86M64N54L98J94j79k95m55m57k86j25P0K46M42N70J55k2j01j91j89m09
1208I8l79k57l4K49L96L05J95J70j07k11l37l76m12k11J21J55L26J99J29L6J10
1229A65P9k26k11j82k01k70l0N9J49L08N23M34K62k46n39n06m95j81J04K16N39
1250b49O43M13J22j53l33m96k88l3R8P8J75J47R0J83J23q3J19K8mk43l33l77r5
1273d68n4K89M51N11L21k1j37m38n98m61l18J47L98M40L55J77N3j85l31l01k27
$$ plain form
1124 -764 -558 60 888 1650 1996 1808 1357 642 11 -347 -412 -296 -2 357 509 661 469 341 190 364
1144 364 463 293 -127 -616 -827 -1098 -1003 -770 -297 289 652 649 361 -392 -1108 -1666 -1846 -1534 -915 -352 168
1165 168 497 535 342 -111 -645 -917 -995 -838 -618 -376 -287 -36 114 329 476 481 339 137 -43 -257 -547 -672
1187 -672 -286 178 732 1130 1324 1145 850 395 -62 -348 -473 -403 -157 285 855 1010 988 887 696 507 98
1208 98 -281 -538 -572 -323 73 378 573 743 636 425 88 -288 -700 -911 -790 -635 -309 -110 19 55 165
1229 165 244 18 -193 -375 -576 -846 -876 -817 -668 -360 163 597 859 613 74 -432 -927 -1108 -1004 -788 -249
1250 -249 394 807 929 776 443 -53 -341 -374 -276 -198 -23 124 214 397 520 437 556 584 580 337 4 -373 -468
1273 -468 -522 -233 218 729 1050 1029 892 454 -144 -605 -923 -776 -378 62 417 594 647 462 131 -170 -397
1294c97j15j1R2R7J25J3N0J64J91J97o5k09l19l06k46j72J07K47M45N18K05L4
1316F45j82l76m04l63r8J22J89L10L75L32J13j22j77j52k73j85j32o0J02K01L27
1337A92K89J24K9j47j54n3k73j80j29O6O5J39J03J31J97R6M5j39k19l47l07k10
1359f82O5K08L43L57K60J69j84j83n25l33l75L4K79K90M03K45J71j10k95j52m69
1380d84N2J36o3K38j16Q7J04R2l7N3J53J68j82k72l20k13j95j48O25M58M85R7
1402G18O1k19n65k56m14J7J20K99N13L03K08k05k96l67L10l68l4N0j75M05k02
1423i7L07j17K57J07%m48Q7l23J61l65K6p5J03N01K75J39k01l8k09n73j38L8J83
1446d00j11N17K72J98N6l9j55m80l13M75n54L61J17r2J00K40L18m22q1M78m25
$$ plain form
1294 -397 -512 -523 -431 -334 -209 -196 -146 18 209 406 341 132 -187 -493 -739 -911 -804 -557 -112 406 611 645
1316 645 463 87 -317 -680 -778 -656 -467 -157 218 550 663 541 364 212 -61 -246 -378 -438 -336 -135 192
1337 192 481 605 634 487 333 280 7 -173 -302 -236 -171 -32 71 202 399 495 540 401 182 -165 -472 -682
1359 -682 -617 -409 -66 291 551 720 536 353 -172 -505 -880 -846 -567 -277 126 371 542 432 137 -15 -484
1380 -484 -432 -296 -359 -121 -237 -150 -46 46 9 62 215 383 201 -71 -391 -604 -799 -947 -322 136 621 718
1402 718 779 560 -5 -261 -675 -658 -538 -239 274 577 785 580 284 -83 227 -141 -175 -125 -300 105 -97
1423 -97 210 93 350 457 457 9 96 -227 -66 -431 -405 -480 -377 124 399 538 337 299 90 -483 -621 -583 -400
1446 -400 -511 6 278 476 532 493 338 -142 -455 20 -534 -173 -56 -148 -48 192 510 88 7 485 60
1467F0j69j81k22k7K51J83L73K55N2j74k20jj15k80j72j21L5M68L18J24J13p7
1489D73j53j77k90k15j21O9K01K58J44Q5P6n5n9j51j35j49j6J3j6J4J21L1J88
1512A36J07J66j00p8k04l23j65r7J6K42L59L57J16%j74l26l19j29j00R3J54J97
1534g2K17J85J2j14j30m6j74J9r0mm2P0L6K09R8L0K5N8m2k16k00j29j08j8K07
1559b19K26J99J49J59p3j96l14k37j97J09J05K67J53R9J20J1q4j59j85j51n4N4
1581b18J1J25P6M8J71N8l0q6j37n0j02j00ol1N4J02J82J75L7N0j42j51k18j59
1605c41r0n5K27K39K79J41k6j06j94j47j26j46m3J19J76J34J67rl0l6J2j08j52
1628a15L8n1m2N9M3P9J6O2J82N1q3j17j18k45j59O4J33J20K62J42J00k4j95k20
$$ plain form
1467 60 -109 -290 -512 -539 -288 -105 268 523 575 401 181 180 65 -215 -387 -508 -473 -5 313 437 550 473
1489 473 320 143 -147 -362 -483 -414 -213 45 189 274 350 295 236 85 -50 -199 -215 -202 -218 -204 -83 -52 136
1512 136 243 409 309 231 27 -296 -461 -558 -542 -300 59 416 532 532 358 32 -287 -416 -516 -423 -269 -72
1534 -72 145 330 342 228 98 52 -122 -103 -193 -197 -239 -169 -133 76 174 204 229 287 245 29 -171 -300 -408 -426 -219
1559 -219 7 206 355 514 441 245 -69 -306 -503 -394 -289 -22 131 230 350 361 277 118 -67 -218 -272 -218
1581 -218 -207 -82 -6 42 213 271 241 155 18 -32 -134 -234 -240 -271 -217 -115 67 242 279 329 187 36 -182 -341
1605 -341 -431 -486 -259 -20 259 400 374 268 74 -73 -199 -345 -388 -269 -93 41 208 199 169 133 145 37 -115
1628 -115 -77 -128 -170 -111 -68 11 27 89 271 322 239 122 4 -241 -400 -336 -203 -83 179 321 421 397 202 -18
1652a8k42j40P2P8J40J40R9O3J4o9j22j05k7n1J00l7m9OR6J23J11P4L4j12j28
1677E0p3j75j46oO6K40J53J76R1j11j47n3k03j18q5R9J57J13J07J5L8M5j33m1
1701E9j18p3Jl2M2P9k7R3P9J19N2r8j33m6j54l0n9O7M1K08J41P2K0p1j18k37p6
1728a99j07O3MK20J79N4Q4n4j36r1j47r4J5L4P7N4N6J00O4k4q9K0n7j1p7j42%
1755b04K8J3J33J36N3J15nq9j20j85j54m5M5K12J34J18O8L2m9j70j95r3M1K9O7
1780h5P6J07O7J6k9r0J9o2m6k7Km5l9K6M1J54N0O7Mo2q1j20j18k1l4J13J36J63
1808A82Q8l5n4j06j06r1n9q3P0J19P4P9O5k2N1r4j20m9l4K7p1M8Q8M9K8O4N7j6
1836A49l3j23n3j30J8N5J29l6Q8J05N6pp6j19j44m2k8K1P3J00N3J29J4k9j25q1
$$ plain form
1652 -18 -260 -400 -328 -250 -110 30 129 192 206 137 15 -90 -117 -168 -68 -105 -154 -148 -52 71 182 256 290 178 50
1677 50 -23 -198 -344 -350 -284 -44 109 285 376 265 118 65 -138 -256 -341 -242 -85 28 135 150 188 233 100 59
1701 59 -59 -132 -131 -163 -121 -42 -69 24 103 222 274 176 43 -3 -157 -187 -246 -179 -138 70 211 283 303 232 114 -123 -199
1728 -199 -306 -243 -239 -19 160 214 298 244 108 17 -130 -224 -209 -175 -98 -44 12 112 176 152 63 83 26 15 -62 -204 -204
1755 -204 -176 -163 -30 106 159 274 269 180 60 -125 -279 -324 -279 -67 67 185 253 285 236 66 -129 -222 -181 -152 -85
1780 -85 -9 98 165 181 152 62 81 19 -27 -54 -52 -97 -136 -110 -69 85 135 202 206 144 63 -57 -175 -196 -230 -117 19 182
1808 182 270 235 181 75 -31 -122 -181 -264 -194 -75 -1 78 143 121 172 78 -42 -91 -125 -98 -169 -121 -33 16 44 108 165 149
1836 149 116 -7 -60 -190 -172 -117 12 -24 64 169 225 218 142 23 -121 -163 -191 -170 -97 3 56 185 199 170 45 -36
1862c6p1j3k5J6J11K4J6P2K8k2m1m8J8Kj07l6l3r1J51J03P8J32oq5m3j69j18q8
1890b81J14L0J01J58L5Ko3n7j2r9m5m7L6O1Q8J6M6j1Rl4l4MNl2m2j0l8k1R2N7
1920B8J59KK5j20q1j88m5L4RJ25R2J56J6j8j46l6j36J8M4o2O3Q3N3nK4M3n7n6
1948B4K8j26N6q7rK2L1R7j1P3rj9K1j11o6oj29R9L2J11J31k2n0Mm9o6o0m2J6M7
1978g0KJ18L6l7L4j3k7m3r4k8PN3P4j3qN8k2Q9m6j16J43j62N2j49J19l7%J57M4
2007A21J7k8K9j25P1l38M7r5J52M36j01rl7O5k25K15l72j91J31L98j61j15K18
2030A03K1j07J30K5k26n0j44K05k11J16l5M0J74R8r7J50l7p4j34r5k2R1jR3L3
2055D6P7J8r6l0k2n6j4oM7J3N1n0N0K7j0N0r6Qk1n5J0J7k3M0jR1O6p1j7o1J8o8
$$ plain form
1862 -36 -107 -120 -145 -129 -18 6 22 94 122 100 59 11 29 31 -76 -112 -145 -236 -85 18 96 228 222 137 94 -75 -193 -281
1890 -281 -167 -137 -36 122 157 159 96 39 27 -72 -117 -164 -128 -67 21 37 83 72 81 47 13 17 22 -10 -52 -62 -100 -121 -29 28
1920 28 187 189 214 94 13 -175 -220 -186 -177 -52 40 196 212 194 48 12 -124 -106 -62 -124 -61 22 75 70 94 137 80 24
1948 24 52 -74 -18 -105 -114 -92 -61 36 25 98 89 70 91 -20 -86 -92 -221 -122 -90 21 152 130 80 84 35 -31 -91 -133 -117 -70
1978 -70 -68 50 86 49 83 70 43 0 -94 -122 -115 -62 12 -1 -9 49 27 116 70 -46 97 -65 -13 -162 -43 -80 -80 77 121
2007 121 138 110 139 14 85 -253 -206 -301 -149 287 186 177 140 205 -20 195 -177 -368 -237 161 0 -115 103
2030 103 124 17 147 172 -54 -104 -248 -43 -254 -138 -173 -133 41 139 42 192 155 81 -53 -148 -170 -79 -80 13 46
2055 46 123 141 45 15 -7 -63 -77 -83 -36 -23 28 -22 28 55 45 95 -1 7 -14 -69 -59 -42 -65 -25 -26 65 131 60 43 -18 0 -68
2087f8n7L4N0M5Q2j4L2o2l4M0j21k4k4PR7J7K6K6nKMk7l0o0mJ0Q0k8l9N1k1R0
2119G5m1Q0l8o8n8K1jk6j3lJ61MK6l0K6j73J5k0%J6M7N0N3j3m9Rn7M2r5P2o9M6
2151a1jK7nj6N5n1%l6O0j1n7n7K9m1Q0O0P0Rq2O3m8j52M6J7qK1J01K7m9j8Pm2
2183a3r3J09m8k2P9k0N3q4R7o7NJ7j4J1p0P3q2J0NJ55o1oM7Kn4Lo3q2J07l5kM4
2215AJ8RP1l7k6j4L8r3k3J5l7O3M3O8o6OK6l2m6L3m6l8M1p8L5J01m2N9j2k1%k9
2247a3On6J6L4rK6%M3J1k2m1Nn7j7O2l3O6k1J2K8%l1K8J4m4l3m0K9M3l5kN5Q0
2280A04j7n3K6q2k3K5m4J2J6L6Q2K0k9lk5n6lk2l0QL9L1J1qM8j4j4j5k1mj3o2
2312h0O0L0m6O5k3O3j5m2M5k9q4M3o9jO7N7k9K4l9Ok1J0q2P9m9N6k1O0J5k3J1
$$ plain form
2087 -68 -125 -91 -41 4 86 72 104 42 8 48 -73 -97 -121 -114 -17 0 26 52 47 49 53 26 -4 -64 -68 -58 22 -6 -45 6 -15 75
2119 75 34 114 76 8 -50 -29 -30 -56 -69 -72 89 93 119 89 115 -58 -43 -63 -63 -47 0 50 103 90 41 50 -7 35 -60 12 -57 -11
2151 -11 -12 15 10 -6 49 -2 -2 -38 22 11 -46 -103 -74 -115 -35 25 95 104 22 85 37 -115 -69 -52 -60 -39 62 89 40 22 29 -13
2183 -13 -106 3 -45 -67 12 -8 45 -39 58 -9 -4 13 -1 10 -60 13 -69 -59 -54 101 40 34 81 83 29 32 -31 -113 -6 -41 -43 1
2215 1 19 28 99 62 36 22 60 -33 -56 -41 -78 -15 28 96 30 36 62 30 -16 17 -29 -67 -26 -104 -69 32 -10 49 37 16 16 -13
2247 -13 -7 -63 -47 -13 -22 4 4 47 58 36 -5 0 -57 -74 -12 -45 21 0 12 40 40 9 37 51 7 -26 -66 -37 6 -29 -31 24 104
2280 104 87 34 60 -22 -45 -20 -64 -52 -36 0 82 102 73 70 45 -11 -14 -36 -66 -58 -19 12 23 15 63 49 35 20 -1 -5 -18 -80
2312 -80 -20 10 -36 29 6 69 54 12 57 28 -56 -13 -82 -83 -16 41 12 36 -3 3 -18 -8 -90 -11 -60 -4 -25 35 50 27 38
2343C8k5K1k0l3ml5L2k4J19j51J94q3n39O73o31N87r9j51M10j20j3K58J7r5m62
2368a36J11L9J7o7JK1n2J9K9M0K0lj7Ql3k7J5mp2J03k5l6M8jn6Q5Kl3j0L4o3k6
2400f9O0k3L7M2k6J8K4n2l3k8M1n2j6J03kpj6J7L9q3O3n1jLm3Q1m2N1n0K6O4o7
2432Hk7oMLj7O1n3M3K4p3R0k0l7M7o5k0j0M3Jk2M3K1L9j04L9o1J2l2JQ4m8PRK2
2466FqQ2o5o8L1QJj7K1J0j8K7mK9J6l7k1k4j0qL1o4R4jl7O4j1j8k3LJ1m9qL5j2
2501c4O9j3N0p4K9k1Nl7j1Q0j5J1J3j5m0L0Lnk2oJ3l9L4n7L6J7L6mm2l0M0Nl2
2534b6j6K0k6O6n0Q4j9k2%j4j8M5p3J5O1J6k3L2j4o1K9l5J2RK7k5jJ4o7JM5j8
2566c2nN5M5j1m4p2O3jJ2%Nk6M1L5n4o3K9l7N4k1L0J0j0J4J1k3k7N4k5l9k1M3
$$ plain form
2343 38 13 34 14 -19 -23 -58 -26 -50 69 -82 112 29 -510 163 -468 119 20 -131 279 159 146 404 421 326 -136
2368 -136 -25 14 31 -36 -35 -14 -66 -47 -18 22 42 39 22 30 -3 -30 -15 -19 -91 12 -13 -49 -1 -2 -58 27 29 -4 -14 20 -43 -69
2400 -69 -9 -32 5 47 21 39 63 11 -22 -50 -9 -61 -77 26 24 17 1 18 57 -26 37 -14 -15 -12 -55 26 -16 35 -15 11 75 8
2432 8 -19 -25 -21 -18 -35 26 -27 16 40 -33 57 37 0 47 -18 -38 -48 -5 -4 -26 17 38 77 -27 12 -49 -37 -69 -68 16 -32 -25 -16 6
2466 6 -2 80 15 -53 -22 -14 -13 -30 -9 1 -17 10 6 35 51 14 -7 -31 -41 -49 -18 -82 12 11 -26 38 27 9 -14 -11 0 -49 -57 -22 -34
2501 -34 35 22 72 -2 27 6 11 -26 -37 43 28 39 52 37 -3 27 30 25 3 -3 10 -29 5 -52 -16 1 37 33 -9 -39 1 6 -26
2534 -26 -42 -22 -48 18 -32 52 33 11 11 -3 -21 24 -49 -34 27 43 20 52 38 -23 6 -29 -17 -8 19 -6 -7 7 -60 -59 -14 -32
2566 -32 -37 18 63 52 8 -64 -1 -2 10 10 15 -11 30 65 11 -52 -23 -60 -6 -27 3 13 3 17 28 5 -22 32 7 -32 -53 -10
2598a0j3j7J23j36R9q9N5R%qk5m0m1J05m4N4m5O4j9l2M0o0JK9k6j9O9jqj1J9l6
2630a3J9jj9n1N7m6M2nN7Mn9Q9kn9J9p1j1J5lN0j6L4P9m8Ln9N0q5l2O1n9J0R3
2663D3mn2Q3n7j2L0l9J4n2L3l4P7J2k5k3l5P6k3%K1o9k6K4l5N1K0O3m6%J7L9p8
2695gp2J2J4JRR5o1O9k3m5Npl1p8Q5nNM8Km2OK7l7j5pL4Pp1K9Q0q1Q1o6P3qjJ5
2732D0j28N0k2j2j0J00N5l6l3Mk1Ln1J3J3m9R8k9N1njJ9l5L1m1k2qK0Jo2K9N7
2764A9jMJ9Ok5p2MJ8RL0k4K7M2N0r6j9n8K5kK5j4L8N7n0j3J3l2jO9j31M1O6m0
2797a6L3n0L3J7k6J27r1m3Q3j9j9j43J39m8Q6nn3M8n8MJ5Kk7m1M7LN4m8M6Rm8
2828A1QQr2N9j1q7J25j7l9K6N6k9k8M6o2L8j7j7RK2m9L7J2J4L2o5N6l7l7MlRk4
$$ plain form
2598 -10 -23 -40 83 -53 46 -43 12 21 21 13 -12 -52 -93 12 -32 22 -23 41 22 -10 30 -30 -29 0 -26 -45 24 23 15 4 23 -13
2630 -13 6 5 -14 -65 -8 -54 -12 -17 40 44 -15 74 72 13 32 -39 -50 -35 -38 12 -4 30 109 61 64 5 55 -30 -62 -1 -60 -50 43
2663 43 39 -13 70 13 1 31 -8 6 -46 -13 -47 30 42 17 -6 -41 35 12 12 33 -36 -62 -38 -73 -22 -2 61 15 15 32 71 -7
2695 -7 -79 -67 -53 -52 -43 52 -9 60 37 -8 -3 -10 -41 -119 -34 -39 -34 14 16 -26 -20 7 -30 -45 -52 -18 -11 -82 -53 27 -54 27 -39 34 26 25 40
2732 40 -88 -38 -60 -72 -82 18 73 37 4 8 -13 -10 -61 -48 -35 -84 14 -15 36 31 30 49 14 45 4 -18 -26 -6 -5 -67 -38 19
2764 19 18 22 41 47 22 -50 -46 -28 -19 11 -13 14 56 106 10 -9 -67 -42 -44 -19 -33 5 62 12 -1 12 -20 -21 48 -83 -42 24 -16
2797 -16 17 -33 0 17 -9 118 27 -16 67 48 29 -114 25 -23 63 58 5 53 -5 -1 14 16 -11 -52 -5 -2 52 4 50 59 11
2828 11 19 27 -65 -6 -17 -104 21 4 -35 -9 47 18 -10 36 -26 12 -5 -22 -13 9 -40 -3 9 23 55 -10 46 9 -28 -24 -27 -18 -42
2861d2N2N0qk0mo5l7L9k9JK6J1Q1pm6lj0k8L8k0k4J09j56M2M2qM2j5LMj3J1l0
2894a4J7r9J2N8P8m7k9J12m6o6j9KO5m1j6L7K8m3m4N1l2N4j8k0lk2j0N6kj4MJ8
2926Gk8R0Kl6q4%mJ6JPM1K2M0o1k8l5L9n0L1J5lK8K5K5l2l8N5o1l6J7l6J26o9
2959a4L9n1j7M4RrJNl1O6o0Ok6M2K1j1l0O2Km4k4o9MM3L1L3o1Q7k4lm8K7J4m5
2993c1L0p6M7J7K1k5K1k5Q3k5p8J8Qm3J4NO6l3K6mmQ5j08oN3q1k7M9k5O7J7j1
3025B5J4k8kj1Lj7j0KM3L6l7Mm4N8o0l4J1j9O3q7P7J0L4l4QM2l0k5J6m4l4N7%
3058a3K4M4j8Lnok1m6k9L0L4K0j0L7J8%k3j4mn0J8K6m2J5l2K%L2L1m2kM3n4O3
3092B9k5n8J6kN8J5j8ML9Lj00qo1O1L1P2j1j0m1O8l8nk0p3LR0l1N7r5P2m7J8K2
$$ plain form
2861 -42 10 60 52 32 28 -37 -74 -35 -64 -63 -37 -26 55 48 2 -1 -11 -39 -1 -21 -45 64 -92 -50 -8 -16 26 11 14 18 5 16 -14
2894 -14 3 -96 -84 -26 52 5 -24 88 42 -24 -43 -41 24 -17 -33 4 32 -11 -55 -4 -36 18 0 -20 -23 -45 -55 1 -1 -15 -11 7
2926 7 -21 69 71 35 -49 -49 -53 -37 -36 -29 12 34 74 13 -15 -50 -11 -61 -30 -15 -18 10 35 60 28 -10 45 -16 -52 -35 -71 55 -14
2959 -14 25 -26 -43 1 10 1 2 7 -24 42 -18 -12 -38 4 25 14 -16 46 48 4 -20 -89 -85 -42 -11 22 -39 48 24 21 -27 0 14 -31
2993 -31 -1 -77 -30 -13 8 -17 4 -21 62 37 -41 -23 -15 -58 -44 -39 27 -6 20 16 12 97 -11 -17 36 -45 -72 -23 -48 19 36 25
3025 25 39 11 9 -2 1 -16 -26 -24 19 55 18 22 -22 36 -24 -58 -47 -66 -3 -90 -13 -3 31 -3 5 47 17 -8 8 -36 -70 -13 -13
3058 -13 11 55 37 40 35 29 8 -38 -67 -37 -3 17 7 44 62 62 39 25 21 -29 -11 15 -27 -12 -44 -42 -42 -10 21 -21 -23 20 -34 29
3092 29 4 -54 -38 -40 18 33 15 19 58 61 -39 -47 -108 -47 -16 56 45 35 -6 62 24 19 -1 -74 -71 19 -12 45 -50 22 -25 -7 15
3125A5rl5K7L0m9J4p1L2L4K8L0K9m9L0m6pp7M3J1M3K1j4K3J0l1rk1j3k1j2L2L8
3157B6j9NP1ro8l2R0m8n7PL9q3O8M1Qj05J07k7K8j1p7Ql6O6n2L6K2M0qO0o1j2
3189A7r0O8j3N5m5N6m2J7K7l0j0m7lN8l9K4k8j6M7pJRO7p7L4M6j14Rj3K2M4P7
3221A04l4p2J14r1p1P2l6J1n0N3K5j5N2q6J08q4M8j06P0kkM1O5o2l6J60Lj73p5
3250f9J4k6K0K4P5K7J2j04KJ53j71K05q6j52P4k4q8R8kn2J75o1k9lnm2K9l5J0
3279c1K4M9o5rL5K0J8k4K5m3m9Q7j08RO1K4J8n7O6Kk9j8j1m1m8R8N5n6O6l5l6
3310cRl2M7p6J8nL1J8o0J06o9J1N3M2q2J9l8J16k47O1J16kK5q7J5Q6j4j51L7N3
3340cp2M6M7KJ2J0qL1n9Jm7l9kJ04r1J08L9Kr5P5R1j37K9q0N8o7Q0m2L3j%J3K1
$$ plain form
3125 15 6 -29 -2 28 -21 -7 -78 -46 -12 16 46 75 26 56 10 3 -74 -31 -20 23 44 30 53 63 32 23 2 -11 -32 -44 -12 26
3157 26 7 12 83 74 6 -26 64 16 -41 -34 5 -78 -10 31 39 -66 41 14 42 31 -46 -38 -74 -8 -60 -24 -2 38 30 90 29 17
3189 17 -73 -5 -18 37 -8 48 6 23 50 20 10 -37 -40 18 -21 3 -25 -41 6 -1 0 9 76 -1 33 79 -35 -26 -39 -17 27 104
3221 104 70 -2 112 21 -50 22 -14 -3 -53 0 25 10 62 -24 84 0 48 -58 12 10 8 49 114 52 16 176 179 6 -69
3250 -69 -55 -81 -61 -37 38 65 77 -27 -25 128 -43 162 76 -76 -2 -26 -114 -16 -18 -70 105 44 15 12 7 -35 -6 -41 -31
3279 -31 -7 42 -23 -32 3 23 41 17 42 -1 -50 37 -71 -62 -1 23 41 -16 50 52 23 5 -6 -47 -95 3 58 2 68 33 -3
3310 -3 6 -26 21 -55 -37 -42 -11 7 -53 53 -16 -5 48 90 8 27 -11 105 -142 -81 35 33 58 -29 -14 72 58 -93 -56 -3
3340 -3 -75 -29 18 20 32 42 34 65 6 7 -40 -79 -81 23 -68 40 79 81 -14 61 152 15 44 -36 22 -45 35 -7 26 25 25 38 59
3373E9N1j02l4Pm4N0J1J7J7J1Lp5K8k4Mn0M0KJ6M5K0n0L3J6om9J9l7mK1K7l9M0
3406B3j58J82l7j10L38j93j52O8k04J72K75j74R8nj07l91K05J98n22R33l93P9
3428A25l83M27n2j3M8m43N36l00j21L55j2J04l88K70Q5k34m5l3J98r6j57L1q5
3451a83K05N2m48M73m94R2K28J44j9j12p8L21J27o01K24K35J96n53o9M10l56K43
3473C7k36L20m27M48l36J86J37K82o26J8J13L98j67O7l72l9P3n1q2O44o0m14L23
3496B36k10k20q9K66k3k36K22p4K75M7j24K15l99J32l44j4K18J8J02J09k46O35
3518D96l75l3j29J60j94OJ57j77j06J84P7j07j76R5M54l20J04k89n3K26JjN3J5
3542F8k87M01J9m60K58k20J84K45k55J20n4N2L58p10J43P1R4Pj30j1n7j40K45
$$ plain form
3373 59 110 8 -26 -19 -63 -13 -2 15 32 43 46 -29 -1 -25 -21 -71 -31 -29 -13 32 52 2 35 51 45 -4 15 -22 -26 -5 22 -17 23
3406 23 -135 47 10 -100 238 45 -107 -39 -243 -71 204 30 128 123 16 -375 -170 28 -494 439 46 125
3428 125 -258 169 117 104 152 -291 245 -55 -176 179 167 271 -117 153 238 4 -41 -74 124 28 -129 -98 -183
3451 -183 22 74 -374 99 -395 -303 -75 69 50 -62 -140 181 308 -293 -69 166 362 -191 -260 150 -206 37
3473 37 -199 121 -306 142 -194 -8 129 411 -215 -197 -84 314 147 214 -158 -197 -124 -175 -257 387 327 -87 236
3496 236 26 -194 -283 -17 -40 -276 -54 -128 147 194 70 285 -114 18 -326 -340 -122 -104 -2 107 -139 496
3518 496 121 88 -41 119 -75 -69 88 -89 -195 -11 66 -41 -217 -122 332 12 116 -173 -226 0 1 0 53 68
3542 68 -219 182 201 -259 -1 -221 -37 208 -47 73 19 71 429 -281 -138 -67 27 34 -96 -107 -164 -304 -59
3565e9j62n6J70K34J34j73k8j3O9k84K95j55J94q4l1R0l5k28l07R9J19L36k37
3588a12J90j08mo9K1m0j17K81k21Q9J04m76N31j51L71o85K81rk8L1K1N5Q8J0p6
3613b3O8M7n4P5q1J0j04Q9N82p23q7j4M47k18r8N20n00q9J51K3l43L56m18M9M85
3638A50J52Nm97J2M33j39p7K95l85R9j64J0K11j22J8m0k09K88j18P1k40L64l04
3661a87K57l4J59l75K31j43J75po0k0m3M4pj4Q5j13M2pn1J62q4l7J2l6p8M0J9
3688g0Lk40L39MJ76k15o4lmj9J10K4K3j04J2P6R4r0N0M9l37J30j36J70J73k35
3714h4O8%k1O9q7P4j87M15k22l0j14J59j4j49n1P3J88j97M6L29n9k57J43j65K03
3739A30l3o2P4k4r6q6J01k7q2J27J35j21j95J18L1J40k54J19j31j6J95l12M30
$$ plain form
3565 -59 -221 -277 -107 127 261 88 60 47 116 -168 127 -28 166 82 51 141 106 -122 -429 -330 -211 125 -112
3588 -112 78 -30 -34 -103 -82 -122 -239 42 -179 -90 14 -462 69 -82 289 -396 -115 -124 -152 -121 -100 -45 43 53 -23
3613 -23 45 92 38 113 32 42 -62 27 609 -114 -201 -215 232 14 -84 436 -64 -153 -2 21 -322 34 -384 -335 150
3638 150 302 307 -190 -178 255 116 39 334 -51 48 -116 -106 105 -17 1 -39 -248 40 -78 -7 -247 117 -187
3661 -187 70 36 195 -180 51 -92 83 76 16 -4 -47 -3 -10 -24 61 -52 -10 -17 -68 94 10 -27 -15 -51 -129 -89 -70
3688 -70 -67 -307 32 36 212 -3 -67 -70 -74 -93 17 41 64 -40 -28 48 142 52 102 151 -186 -56 -192 -22 151 -84
3714 -84 -16 -16 -37 32 -55 19 -168 247 25 -5 -119 40 26 -123 -174 -101 87 -110 -64 265 206 -51 92 -73 130
3739 130 97 35 109 85 -11 -97 4 -23 -105 22 157 36 -159 -41 -10 130 -124 -5 -136 -152 43 -269 161
3762A61k12K00j65k1k3n0J26j16P1L06j06j71n4Q6j43K28Q2l11k8K55J21k70J50
3785A16l33N0J94J30j53n7J57j32J6Q4o0K2O2l6j06R8j52K22k61J40R4Q8k63k09
3809b89J27K05J74k79K30j35k38K23o7o0MJ22k27M4oJ25L6K0p7R0j20J1P8J38
3833A29k64J03M4q8J97j27r3n1K02l5k8q5J05j6m6j0Q0k4M5K3l1j1K0kj25K2M5
3860b1l4N2J2m2P2m2LP0j19J00m3o4R6m0k4Q2J6n5o6J4rK5j9rN7l6j2P9k2m2M6
3891B5p7M1M0Jm7K8k7K7LN0p9%L0K7j02L9J6k5K8J7JJ7opn9L3J0m2J5M1o6O7K1
3924D0o1olR7j08M9J0lQ5m8m6k1m1J00M4j34QK3k43k9L64L21n37j74M36j01M4
3951F6l81M43l41J26J09j28K4K11q2m8J54j49p6O0J61R1k00O2m89K54o5J20K51
$$ plain form
3762 161 -51 149 -16 -37 -60 -110 16 -100 -29 277 171 0 -54 32 -111 117 199 -112 -140 115 236 -34 116
3785 116 -217 -167 27 157 4 -53 104 -28 -12 72 12 34 96 60 -46 52 -100 122 -139 1 95 183 -80 -289
3809 -289 -162 43 217 -62 168 33 -205 18 -49 -109 -105 17 -210 -166 -172 -47 -11 9 -68 22 -98 -87 -9 129
3833 129 -135 -32 12 -76 121 -6 -99 -150 52 17 -11 -96 9 -7 -53 -63 17 -7 38 61 30 19 39 37 -88 -66 -21
3860 -21 -55 -3 9 -33 39 -3 0 70 -49 51 8 -56 40 0 -24 58 74 19 -47 -33 -42 -17 -36 -45 12 -24 -36 43 21 -21 25
3891 25 -52 -11 29 30 -17 11 -16 11 14 64 -15 -15 15 42 -60 -21 -5 -30 -2 15 16 33 27 20 -39 -6 4 -38 -23 18 -48 19 40
3924 40 -21 -27 -30 67 -41 8 18 15 100 52 6 -15 -56 44 88 -46 -38 -15 -258 -287 77 398 -139 -313 123 22 66
3951 66 -315 128 -213 -87 22 -106 -82 129 47 -1 153 4 -72 -12 149 240 40 102 -387 -133 -198 -78 173
3974A73j32L7p8J38k62l9Q6O9j04J71j62J07k7J81j23l06N07j59j29j26J12J80
3996A14K2J1k46P9J46j25l43L81j22J34m46O63j39k47M15l20n2N18n30O8R0l22
4018b51p3J89K24o6j73L26r4k90K96j54J37j10o6J39m1M0p2n5K67k90K28j46k68
4041c03N72j92k21J42N7P3j11Q8j45K09k7m6QK1j07Q1j57q4L15j86M2L8o0L1P6
4066A14k15O2M6m4p3K7J00j5J7j0L7k2n4N2m9L7k5K8qNM3o1N3j07P6k7m5P3l3
4095a8j8LJ4JO8j8p3R3k3Op2j4L7m4N9K5J5r2K7p0Q0j22O6K9m7K55Q1m88J2K66
4125C8k06K19L98m48K11k38K54m64K04p3K76j7j01n6n5L84q41J37Q4L72J4k95
4147b03J97k0K07%k65K57k43M11k96J06k41J13Q0j63Q5K14n51L92k91J52NK18
$$ plain form
3974 173 41 78 0 138 -124 -163 -77 -8 -112 59 -103 4 -23 158 35 -271 236 77 -52 -178 -66 114
3996 114 136 147 -99 -20 126 1 -342 39 -83 51 -395 268 129 -118 297 -23 -75 443 -87 -19 71 -251
4018 -251 -324 -135 89 23 -150 176 82 -208 88 -66 71 -39 -105 34 -7 33 -39 -94 173 -117 111 -35 -303
4041 -303 269 77 -144 -2 55 128 17 105 -40 169 142 96 104 125 18 99 -58 -142 173 -13 29 67 7 38 114
4066 114 -101 -39 7 -37 -110 -83 17 2 19 9 46 24 -30 22 -27 10 -15 13 5 10 53 -8 45 -62 14 -13 -58 15 -18
4095 -18 -36 -33 -19 -18 50 32 -41 52 29 35 -37 -51 -14 -58 1 26 41 -51 -24 -94 -14 -136 -70 -41 -88 167 248 -240 -228 38
4125 38 -168 51 449 1 212 -26 228 -236 -32 -105 171 154 53 -3 -58 326 -515 -378 -294 78 92 -203
4147 -203 -6 -26 181 181 -84 173 -70 341 45 151 -90 23 103 -60 25 239 -312 80 -211 -59 -54 164
4169A64j57k09M15k75J47No4M38o97p4J26n5N1J84J03j51p2M56l00k62J81mJ91
4192A41Jn16P90j36j53m0n1jJ41k6m12J49m0L95k57j56J34K16n8J41k75L3o8j45
4216a93K52o7M9q3J5j47K07J63m20L65k07j20J23J71k12O6M6J40n7p1j52l7P7
4239i2N5M8n2mJ33j78J31O6J9r7o8L7R6p2k31P8M4J5K3j42K46K73p80O88k15l7
4265a6j26J07J45o2j22J01L8p4J44l11J51J18l1k10j03J60K58m36L13Q0k12j82
4287b70M24l66K35K67n28R3O5J76R5n30L70K5j97M5J40Mr4K16l32J81J66J25m90
4310a80k97O94j77K0k81K37K70r2l01N16l48k26q6K71l6k6K65r7j08l6m7J20j27
4333g2l0M7L1P1j70J91L7k0m3p1R0n6J01j7j73K49j01j86J68j83R9Q9l4J01j55
$$ plain form
4169 164 7 -202 213 -62 85 90 26 464 -233 -307 -181 -236 -185 -1 102 -49 -121 335 35 -227 -46 -50 141
4192 141 142 -374 416 280 127 87 36 35 176 150 -262 -113 -153 242 -15 -171 -37 179 121 262 -13 20 -48 -193
4216 -193 59 -8 41 -42 -27 -174 33 196 -224 141 -66 -186 -63 108 -104 -38 8 148 91 20 -132 -169 -92
4239 -92 -37 11 -41 -45 88 -90 41 107 126 29 -39 -2 94 22 -209 -131 -87 -72 -49 -191 55 328 -452 236 21 -16
4265 -16 -142 -35 110 48 -74 27 65 -9 135 -176 -25 93 62 -148 -251 -91 167 -269 44 124 -88 -270
4287 -270 154 -212 23 290 -238 -145 -80 96 191 -339 31 56 -141 -96 44 48 -46 170 -162 19 185 310 -180
4310 -180 -477 217 40 60 -221 16 286 194 -107 409 61 -165 -251 20 -16 -42 223 126 18 -18 -65 55 -72
4333 -72 -102 -55 -24 47 -123 68 105 85 42 -29 61 5 106 89 -84 165 64 -122 46 -137 -38 51 17 118 -37
4358c7M2Q6o2r3P0K3l3J3o0P9n3J50j40q6J32J3j29M3q7L5K25kj83K37j39K5J46
4385B15j59N4J16m01K07J06j42M1o4J93k37J36j36j28J76M4k03K03O0Qj28j33
4407a72K25k13Q2j19L26j7J22k29j12r0K17j97K55j61j3J75p4L5j04j99L63j99
4429i9J49Qj28j1N9Pj01P0J6J8m1oM3P8n5L1k4l1Q6q5n0O4J9r8Q2N2m0o4j5L1
4459c5rqN4m6P1k6m2P6o3jL4m9O8j5l1O5n0P5j11Q0m8M3rJ6p9J12j42P1l5L9L2
4490C7Q9j20j17pJ68k83O8K47N7q2j47K9K25M7l92K1K93O2l15k46N69K60m02j27
4514f6L14l29j33M36l52O9M5j6J82j47M5k26N6J01J12p9o8J01j9k8N5l7n3j8J36
4539H1j35R2QO9r3J19n4j21J99k06M4M8l8J55j00j29J29o9k04q5L07r3K73j43
$$ plain form
4358 -37 5 91 29 -64 6 29 -4 9 -51 28 -25 125 -15 -101 31 44 -85 -42 -129 -94 131 129 -54 183 44 69 215
4385 215 56 110 226 -175 32 138 -4 37 -27 166 -71 65 -71 -199 -23 21 -182 21 81 89 -39 -172
4407 -172 53 -160 -78 -197 129 112 234 5 -107 -197 20 -177 78 -83 -96 79 5 40 -64 -263 100 -99
4429 -99 50 58 -70 -81 -22 -15 -116 -46 -30 -12 -53 -59 -16 62 7 38 14 -17 69 -16 -66 -2 17 -81 1 53 13 -51 -66 -35
4459 -35 -44 -52 2 -44 27 1 -41 35 -28 -29 5 -44 24 9 -22 43 -7 68 -43 37 -11 32 23 39 -40 72 -70 1 -34 5 37
4490 37 126 6 -111 -118 50 -233 -165 82 139 57 -90 -61 164 211 -181 -160 133 195 -120 -366 203 463 61 -66
4514 -66 248 -81 -214 222 -130 -61 -16 -32 150 3 48 -178 -122 -21 91 12 -56 45 26 -2 53 16 -37 -55 81
4539 81 -54 38 46 115 22 141 87 -34 165 -41 3 51 13 168 68 -61 68 -1 -205 -290 17 -76 197 54
4563E4j25Q3q0L34l78m0L49n53K1q2J039o13m06P39n88J31M68o8j24l49p9N43
4585B76k91l28J58Q9j40J23J17M09l74L26o96J00Q1K62o4m5P9l2k29J27l7o5q3
4608b37L37l0o7J34j55P1j08P0n4L0N4m7J2j7j0K5O4j19M0N4m5LJK6o0j2K6O2
4636D8o1L7oJ4n0O5n1Mj4j5j1JL7K3M5o1J6m3K3J3l4Qrj1L6Qj7J2k9K6lL0l1K2
4670B2m3k2N3mk1J0K6Oj6lJ5m7j3K7m7k3P4L0J8o2K1NmOo3O1l9J7K3l2O0n3LO
4704iM4n2P6o8M6m2j2mNJ8j5O5p3N1k5k9J3j6m6J01rj4J6jj6RN5q4J8l1jM4l7
4737b3N4o5O8p8L4k7qk5N6o5P0L3n1K2P2o7J3k4RNn3M2J3j06J56n4M5k1k4n4O2
4768Il0L7l0kJ8Om5M3kLk7k6KL7L1j12P5j5N9rj01J59m4j01R1r1k4K5J75m7j82
$$ plain form
4563 54 -71 12 -68 266 -112 -152 197 -356 -335 -417 622 9 -397 342 -246 -115 353 285 161 -188 -267 276
4585 276 -15 -343 -185 -96 -236 -113 4 413 39 365 -331 -231 -150 112 48 3 82 50 -179 -52 -89 -154 -237
4608 -237 100 70 3 137 -18 53 -55 15 -39 -9 45 -2 10 -7 -17 8 72 -47 -7 47 2 5 6 32 -28 -40 -14 48
4636 48 -13 24 18 32 -18 47 -4 0 -14 -29 -40 -39 -2 21 66 5 21 -22 1 14 -20 -12 -21 -32 4 12 -5 7 -22 4 1 31 0 22
4670 22 -21 -43 10 6 -15 -5 21 27 11 8 23 -24 -37 -10 -57 -80 -6 24 42 -20 1 6 2 8 -55 6 -33 -16 7 -25 35 -18 -15 -9
4704 -9 35 -17 59 -9 37 -5 -17 -21 -16 2 -13 52 -21 30 5 -24 -11 -27 -73 28 19 5 21 20 4 13 68 -16 2 -29 -30 14 -23
4737 -23 31 -34 34 -44 -10 -37 -45 -70 -14 -79 -9 24 -27 -5 67 0 13 -11 -2 3 -50 -8 5 -101 55 1 46 25 1 -53 9
4768 9 -21 16 -14 -16 2 8 -37 6 4 7 -20 -46 -44 -7 24 -88 -13 -28 31 22 -79 80 36 -65 26 -65 -89 -64 111 64 -118
4799a18R0J42j96K5J0PR2o9J6l3P3Q4j48M4P5j82P9Q7p3n5N5K2J8k1j0r0j2J15
4827B7n4k0J9J5K8O7j51MN7OL9o4L0L8p0k7O0l3R1j47J12k8p8P7p7Q5J70j71k7
4856b2J50k08J62j83P6k4m9M0J65k79K12N1p5l17L05O3Rl4p0PJ00k33J69n6L3
4881hr9Oo9J53K53j68J07p4P2j57M1J1J02k10o6K41m1j34K34%k21Kk0k7N0k4p3
4908a19O0K2M9k4J15jo7Pp6K6O4J4j01J09k08L1Q2J79m9j52O2k02R0J12K02k38
4934a3q5j84m5J51N7Q1k7R9M05l81n4J15q7l47M80j15m27L60J60l15K9m7J02l28
4958d16K90j5N1N0J6NJ00n2n4J32j61K51k28JK2j45L31l48J42K12l45K91j68j29
4982a67K47m9r4J06J93j92j6J40Jl61J13Q4J03j85m4L43j78k8q3J07j00J13o3
$$ plain form
4799 -118 -28 114 -82 -57 -47 -40 52 -17 -1 -34 39 123 -25 19 94 -88 -9 78 5 -50 5 27 45 24 14 -76 -88 27
4827 27 -27 -47 -28 -13 15 82 -69 -65 -8 -2 37 -27 3 41 -29 -56 4 -29 62 -85 27 -1 -79 -2 -79 6 176 5 -22
4856 -22 128 -80 82 -101 -25 -49 -98 -58 107 -172 40 91 16 -301 4 67 76 42 -28 -21 79 -154 15 -41 -8
4881 -8 -107 -101 -170 -17 236 68 175 101 173 16 57 68 170 -40 -106 135 94 -40 194 194 -27 -25 -45 -72 -22 -46 -119
4908 -119 -59 -37 12 -12 103 102 35 42 -34 -8 56 70 -31 78 -130 -99 -17 162 113 -39 23 -179 -89 23 225 -13
4934 -13 -98 -282 -327 -176 -119 -38 -65 34 439 58 4 119 32 -315 165 50 -377 -17 143 -172 -143 -190 -88 -416
4958 -416 -126 -141 -90 -40 -24 -19 81 29 -25 107 -54 197 -31 -30 -8 -153 178 -170 -28 184 -161 130 -38 -167
4982 -167 80 31 -63 43 236 44 28 168 169 -192 -79 5 108 -77 -121 222 44 16 -67 40 -60 53 -10
5005a0L3l2L9j30J74N8m4J38k81l25L42q9P4j42M22m21K28m1J0P8J48k96J64L0
5029A27p4n7j8O9l5R5j07R1k00P9J2N2p3LK0O0m3J1k2K9m8L1koN0o3L5l5O9j1
5059C9j6Kk6j1O8l1l2J2n9M8NPoj4O4o4JJ2J4oKo3J3O7p0P0m8K8k7jj8J9M1k8
5093hQ7j9j7O2o9qjq1K0K5L7M7j37N2q8J06J00j15j52K86k55K17Q9m7j60k76J92
5120a13m6J43j4L0j10j21M57l16J14j18j58K87n4j05J21qo73J103l89OK3J46n3
5143A52J53L4q0N6n69L71JK99n27J55P5n32N88m9m7K0j21kr9N47k96J05k48p2
5167h6k0k0J54k43K99k15L27k53K43nj17k58N3L94l85q8K86j05R2J1k4L30m86
5190a16L15k78J9L08l50J57l7QO7k13l3K9K71m2L1l45N70k61K8k51M2Q3N5j11
$$ plain form
5005 -10 23 -9 30 -100 74 132 88 226 -55 -380 -38 -127 -53 -195 227 -194 34 -7 3 81 229 -67 97 127
5029 127 53 -4 -22 47 12 107 0 91 -109 -30 -18 34 -39 -36 -16 44 1 12 -10 19 -29 2 0 -6 44 -19 16 -19 50 39
5059 39 23 25 -1 -12 56 25 -7 5 -54 -6 -1 6 0 -14 50 -14 -13 -1 13 7 9 -54 -41 26 -44 26 -22 6 -21 -22 -40 -21 20 -8
5093 -8 79 60 43 105 36 28 27 -54 -34 -9 28 75 -62 -10 -98 8 108 -7 -159 127 -128 89 178 131 -29 -305 -113
5120 -113 -159 -16 -30 0 -110 -231 226 -90 24 -94 -252 35 -19 -124 -3 -11 -684 419 30 36 59 205 152
5143 152 305 339 259 315 -254 117 118 417 -110 45 120 -412 176 127 80 100 -21 -23 -122 425 129 234 -14 -86
5167 -86 -106 -126 28 -215 84 -131 196 -57 186 181 64 -194 -141 253 -132 -220 66 -39 53 64 40 370 -116
5190 -116 199 -79 -60 248 -102 55 18 26 93 -120 -153 -124 147 105 136 -209 361 100 128 -123 -81 2 57 -54
5214e4K07k73N2K16k18o9K08m5k00J20O68n87k06J04J00k16L48J92n88P95n14
5235D0O2j1n14M38J78j60J31k41q7J81M5j9J8K3j56R6O4k33m6J81n4K57l45M8
5259a04K21n0J03k36J41NR5p5r8Q2k23M07j26J66o12L93K41p2k30j8L33m73K98
5282A68M9k34j08L16m32K56J32l79K46L8K68j68J05k7k41j64K80n1l2j16K20j42
5304a6q3j90L71j4k5pJ9j20P40m60k81K98m73P4L05k20J62K03k92k4k32J41J09
5327a5lk49J78o6K64k74K89lp6k26L1K62k33Qj63K73Q8M5k02k1J68j14K9pjm7
5353f5J50j52J47m5J4r4M2K8j0l1J6j0OqM2pl3LMk7kNK9j4K4jrJ2m1P1o3M9mk2
5387DqJ6N2o9J3j8K4n1Q4p3KN5n2L9n5O3m3qj8N3oqm5mK3K3K4o5N4JK7k3K3o4
$$ plain form
5214 -54 153 -120 -68 148 -70 -139 69 24 -176 -56 612 25 -181 -77 23 -193 155 347 -241 554 40
5235 40 102 91 -423 15 193 33 164 -77 -164 17 62 43 61 84 -72 24 88 -145 -191 -10 -64 193 -152 -104
5259 -104 117 67 170 -66 75 80 175 100 2 84 -139 268 142 308 -304 89 330 258 28 10 343 -130 168
5282 168 217 -17 -125 191 -241 15 147 -232 14 52 320 152 257 230 -11 -175 105 54 22 -94 126 -16
5304 -16 -99 -289 82 68 43 36 55 -65 675 215 -66 232 -241 -167 138 -82 80 283 -9 -33 -265 -124 -15
5327 -15 -18 -267 -89 -155 109 -165 124 121 45 -181 -150 112 -121 -113 -276 -3 85 130 -72 -93 75 -39 -10 -17 -18 -65
5353 -65 85 -67 80 35 49 -45 -3 25 15 -16 0 -10 -4 -12 30 23 -10 -7 -3 -30 -32 -27 2 -12 12 11 2 14 -27 44 -19 30 26 4
5387 4 -4 12 64 -5 8 -10 14 -37 47 -26 -24 31 -21 18 -37 26 -17 -25 -43 10 4 -4 -49 -53 -30 -7 17 -48 6 7 34 11 34 -30
5421c0O7j06NpL6j2RR4j37L7n0J61j00P6L2o8q9Q3k4nR1q9K3R5Lq0p7L0K2o1J62
5452I1N6l01J46q6KJ1l9Q6N7m0K5l7J5L3l4l7K4j7P6pj5j4mJ1j7j9J11k9l2j1
5482Ek9k6R3j4PK50m03K69k17J6J76pK4k04O0j30J22M1R8l61N23l48N4n6j07K25
5508F1j71J56j9NJ1j72Ml8J73l2l7K23j93o7N9J2L56k14k7j54K9P5k1j7J3j02
5534h7j7M6J37m3l6n9o7J87j60k0J9j7J26j1J25q9M1j79K28M2q2q8j35K28n1J90
5560B28j88J61l90K34O1j10N1r6J04l7p5P2k81L98j48j89K00k9K12k08k58J27
5582a61Q7L80k80j30Q0P2N7k56J46K10j49j11lK11m88J59J24l15K22N5K38j92
5604d4j6L03k44j43K53j28q1nK91l05K17j3k76Qq7J01M73rk64J11k40j4K69j20
$$ plain form
5421 -30 37 -69 -64 -71 -35 -47 -38 56 -81 -44 -94 67 -33 43 75 7 -82 1 -23 -28 63 -26 -3 92 95 15 -62 -32 -10 -71 91
5452 91 147 -154 -8 -94 -92 -81 -120 -34 23 -17 8 -29 -14 19 -15 -52 -28 -45 31 24 9 -5 -9 2 -15 -34 77 48 16 5
5482 5 -24 -50 43 29 36 286 -117 152 -65 -49 127 120 144 -60 0 -130 -8 33 131 -230 293 -55 -1 -57 -164 61
5508 61 -110 46 27 32 43 -129 -125 -163 10 -22 -59 164 -29 -96 -37 -25 331 117 90 -64 -35 40 19 2 15 -87
5534 -87 -104 -58 79 36 0 -59 -126 61 -99 -119 -100 -117 9 -2 123 34 75 -104 124 166 84 -4 -139 89 38 228
5560 228 40 201 -189 45 106 -4 47 -49 55 18 -57 15 -266 132 -16 -205 -5 -34 178 -30 -288 -161
5582 -161 -74 306 26 -104 -24 48 105 -151 -5 205 56 -55 -58 153 -335 -176 -52 -367 -145 -90 148 -44
5604 -44 -60 243 -1 -144 109 -19 -100 -105 186 -119 98 85 -191 -183 -270 -169 304 295 31 142 -98 -112 157 37
5628C7O4k8q4M9j96L46k04k86L76k1Q9K01n96L35J7l2K24n11J82J83m12K45J17
5651I5p6o0K44j32m69J082l75j64k71n6K04Q8k87N90M25j373L37J19p2M91k95
5672D5J19k85j50J59l1K01q7J31K33m24J09J0M9n46O05j86j99k14M01K23k99K74
5694A38m63J16PN49m06L2K73P8l65j1K6m4j13Q5oL27k74Q4m2J41o1q5lr3l0j18
5720b58J71J10m4P9r1q3M7J95j65J8p1J25rj08l3R7J08k6qp8K13L0j15j46oR0
5746D2L4J76l25l51N83j47N5j85J64Q8K32o5n05K75J65j28m63L76o2L67l76K11
5768A61j93j67L90J52p77M69l0j41J57K39l91J89r7J04k21M36j22n43Q10m31N
5789ao2K80J26o02J21J29J66Pk44j35J16k70K69J36K31o41L41k45o4N80l97L88
$$ plain form
5628 37 101 73 -11 38 -158 188 -16 -302 74 53 142 343 -253 82 99 67 291 -220 -38 145 -267 -22 95
5651 95 19 -41 203 71 -398 684 309 145 -126 -182 22 110 -177 413 838 -535 -198 -79 -151 340 45
5672 45 164 -121 -271 -112 -143 58 -29 102 335 -89 20 30 79 -467 138 -48 -247 -461 -60 163 -136 138
5694 138 -325 -209 -202 347 -59 -27 246 324 -41 -52 -26 -70 -183 -98 -104 223 -51 33 -9 132 71 -14 -17 -110 -140 -258
5720 -258 -87 23 -21 58 -33 -116 -69 126 -39 -21 -92 33 24 -84 -117 -20 88 62 54 -24 189 219 104 -42 -48 42
5746 42 76 252 -73 -424 159 12 67 -118 46 134 366 301 -204 71 236 108 -355 21 -41 326 -50 161
5768 161 -32 -199 191 343 -434 35 5 -136 21 260 -131 58 -39 65 -156 280 158 -385 425 -6 -1
5789 -1 -63 217 343 -259 -138 -9 157 164 -80 -215 -99 -369 -100 36 267 -374 -33 -278 -342 238 -159 229
5811B29l94K79n15J84N31m01N61k16Q5j86L10o33K89j66m5L75k34q3J92l18k31
5832c87M80o00J00M44K6O0j64J19j18MJ25l97l58N79J28R7k0m9k13K91l05J05
5854e3J24l61K85L1j28J36J37k13K4k32M84j00j65n3L33j51oK18k38l22j94M03
5876d1j42J19J72m35N13Q3j0m11L77l74M0O5K15k1j72M2k23L09k17r4J05J19J15
5899A34o6j50K72l74J29J99l81R9L98m66pj7N72l44J60K7j80j25J73k21M27k22
5921C7j0j12N6J49m4J99k43j7m9L0j2k3L6PkOMMM%k3O0l8J1m7L7k4nj9j0P9k8
5953A3mm6mK5nJ7K5o6N3rK3l3M0o2j2R0n9m1O1N3l2j2o3K6Oj2R1r4K4Pl2K7K0
5986A5m2K4nqPJ4k8J3L6m4O3r3L8LK1l8N1k4lj1J2pJ9km9jN0J9p5N6n6L3M2k4
$$ plain form
5811 229 -165 114 -401 -217 314 -87 474 258 343 157 467 -166 123 -43 -88 287 53 -30 162 -156 -387
5832 -387 93 -507 -407 37 63 123 -41 78 -40 -36 89 -308 -666 -87 41 138 118 69 -144 147 -158 -53
5854 -53 71 -290 -5 26 -102 34 171 -42 -18 -250 234 134 -31 -84 249 98 92 310 72 -250 -444 -41
5876 -41 -183 -64 108 -327 186 269 259 -152 225 -149 -109 -44 171 150 -22 20 -203 106 -111 -205 -100 19 134
5899 134 68 -82 190 -184 -55 144 -237 -138 260 -206 -213 -230 342 -2 158 185 5 -120 53 -168 259 37
5921 37 27 -85 -29 120 76 275 32 15 -34 -4 -16 -39 -3 4 2 8 12 16 20 20 -3 57 19 30 -17 20 -4 -9 -28 -38 41 13
5953 13 9 -37 -41 -16 -21 -4 21 -45 8 -1 22 -11 29 -33 -45 45 -14 -55 6 59 27 15 -48 -22 -16 -28 63 -31 -7 0 -32 -5 15
5986 15 -27 -3 -8 -16 -9 5 -23 -10 26 -18 45 -48 -10 -7 14 -24 27 3 0 -11 1 -6 13 11 -38 -39 11 30 -45 11 -45 -12 30 6
6020F%J7k7k0qLrk8J34p0kk8O0j6n6lN3K3m4M5o5M8n1N8j1l7j4M6l4Mj4K6K0R
6054A5J9jp2L2OL3p1L7K2j9oJ3K0m5K2jJJ0j1m0oK0O2k4kK5j4m5N7m6k0j0N7j14
6088i6J17k5Pj3K9j2o1K0QL6n5O8l3L1J4o4QM5o0O9On3Pl4N7m7J5Oj6KJ3RnL9
6122C2l7Ok7L8P6j52O7l3KK4N7p7R0rj09L7N3k1L4q7kO3l7j1M2J0k6p8J54p5k1
6153a7ON9j0n5K5n3N3o5lM6M7q1R3m3J0Qp6M6J6%n5NM8m2J6j3mK3M0m2pj1J02
6186F6o8qL0j3j6OK1k5l4L0N7m2L1j7j0pn4K5J8j6K1l3j8M9K4m0N5Kn6l0O4Qk2
6219bM0r6%N6m7K7j0nK5m9R3l1K1r0O3NK0j1j5j3nK6Nk4J2K2m0N8j5m4L3Nk7L7
6253B4n4J3j2M8k2L4J0K8j4m1k5M2j9k5m1N5o3O5J4n1L5km1LM8K5ML0o2k1k2L4
$$ plain form
6020 6 6 23 -4 -24 -32 -29 -38 -66 68 -2 -4 -32 28 12 -44 -47 6 29 -15 30 -35 13 -38 20 9 -28 -42 4 -30 -26 -40 -14 6 15
6054 15 34 33 -39 -7 -1 32 -39 -2 20 1 -5 8 28 -17 5 4 5 15 4 -36 -42 -22 40 16 14 39 25 -20 37 -9 -29 -39 18 -96
6088 -96 21 -4 3 -10 19 7 -54 -34 -26 10 -45 23 -10 21 35 -29 -21 24 -36 33 39 -14 -7 -41 16 -31 -16 -10 -26 -24 -11 -2 -7 32
6122 32 -5 1 -26 12 88 -64 3 -30 -28 -4 53 -24 66 57 -52 -15 38 17 51 -36 -38 25 -12 -23 19 29 3 -75 79 4 -17
6153 -17 -11 48 38 -17 8 -45 8 -57 -60 -14 33 -48 45 2 12 20 -56 -10 6 6 -49 -44 4 -38 -22 -35 -39 -16 24 -18 -25 -36 66
6186 66 -2 -10 20 7 -9 -3 18 -7 -41 -11 46 4 35 18 8 1 -53 -28 -10 -26 -5 -38 -56 -7 17 -23 32 34 -22 -52 12 20 -2
6219 -2 38 -58 -58 -2 -49 -22 -32 -37 -12 -61 32 1 22 -68 -5 0 20 9 -6 -19 -24 2 7 -17 -5 17 -23 35 20 -24 9 14 -13 24
6253 24 -30 -17 -29 19 -3 31 41 69 55 14 -11 31 12 -13 -54 1 -62 3 17 -34 1 -1 -42 -39 9 34 38 68 6 -15 -37 -3
6285cljlL0l6L4nJ7n3K8l5%P5l4JM8l8J9n7O5m7l1N6n6J6lL0n3L5L6n7k2O8q1
6319f0L7Ql3J7K9L4p3O0j7l8L3M9p4L8M5l9K1m0j7P8q7PM9o0N6n0LOJ0Q4q5K3
6351A4k3kL7n7K5L8o4O6k4l8rJ5M2MQk9m9N2j1rM7p5j1N7k2K0K8k5%Qm0p%K9k6
6386c1J4J6mK5k6M4p0M2N4j3k4ml2K2l5P4o3K8K0j5K5j15P3pL2ok4m3M7K6Km6
6418a4o1Q4m0K8m2LM0K4m6JJ1N4n5l4O7p1R2j00L1L0Lk6N7p3N3kk8M1jj6l4m6
6450g0Q1olJ0k1LL2kJK0m5NJ2Rom5L6Mm4N1j06P1O1q8M5mJ2n5N1l4J2K9l8KP0
6485E0n6KLKM5p3J4L4J1Pm5n9N7rM6l5k2%K2K7l4N0j5l5K6j0rl8R8n4n7J40jj35
6519e3O1K8p7QmlO3q0L3J5N6j4o0RN5k1M8p1J2k4J7O8m9q0L9O4r4L4k5N2qlJ8
$$ plain form
6285 -3 -6 -7 -10 20 -16 18 13 30 -23 5 -30 -30 45 11 12 60 22 41 -16 49 2 -29 27 -29 -13 -16 14 -39 -4 32 -25 -47 21 -60
6319 -60 -23 -15 -48 -31 -2 32 -41 19 2 -36 -3 46 -28 10 55 16 37 -3 -20 58 -29 -22 27 -33 23 -27 -24 -18 -8 76 -9 14
6351 14 -9 -11 26 -31 -6 32 -32 34 10 -28 -37 -22 20 24 32 3 -46 6 -5 -14 33 -42 -53 4 -18 2 30 5 5 13 -27 -34 -34 -5 -31
6386 -31 -17 -1 -5 20 -6 38 -32 10 64 51 27 23 -9 13 -22 52 -11 17 37 22 47 -68 5 -2 30 24 0 -43 4 30 32 -14
6418 -14 -75 9 -31 -3 -45 -42 -2 22 -24 -23 -12 42 -13 -47 20 -51 41 -59 -28 2 5 -21 36 -37 16 14 -14 27 26 10 -24 -70
6450 -70 11 5 2 12 -9 -6 26 24 25 45 0 5 17 26 20 -25 11 15 -29 22 -84 -13 48 -40 5 1 13 -42 9 -25 -13 16 -22 -20 50
6485 50 -6 -4 -1 1 46 -27 -13 21 32 39 -6 -65 -8 -17 29 -6 -28 -28 -6 21 -13 37 22 -13 13 3 -6 -44 54 0 -57 83 82 -53
6519 -53 8 36 -41 -33 -37 -40 23 -57 -24 -9 47 33 -27 -18 37 16 64 -7 5 -19 -2 66 17 -63 -24 40 -54 -20 -45 7 -1 -4 14
6552A4k2J5j5l4L8K4l6N7k7j6oQk8M1N7r8k7P6j5m0J0j9M7m8J6P6j9J8k3k1j9
6583a6M4p9Q4n4PL7n3N3p4R0L1j08L0k7rK5j5J5N5o9K9J1j7M4j7o5K8M7j0K3o6
6614b6N5j1p2K3M6opJ1K4o4M7k0k8O4K1j17L7L3j1l3Q5m0l3NL9m3M5J0o2K8K4
6645B4qklk6L1m2O5m7L7k9M2m6J2Rj1K3k1L1k5m8J3J3M2n3K4pK4k8k9QM1k5k4
6678c5P4o9Jk3j5J02p2K3j9pN8m6ML7J7m4J2j9J1N4oOl7l1O5n3N6n0o7R4l1k4
6710c4%O7M7r5O1j12N0M4q4J20o0L6J1m9J25k32L05k63k9J07k64K37j48L80k48
6735b8J40n2P5j12O3q1qR3O3r9m0k00m5J18J51P1l4q5K03j67qN2K9m5j12N5j96
6762a99L00j60L3l5J03k7L4q1pJ9K4m2Q3j22J14j9K2ml7K1j7K2MJ2l4OJ9n6LN6
$$ plain form
6552 14 -8 7 -8 -42 -4 20 -16 41 14 -2 -8 0 -28 13 70 -28 -55 21 6 -34 -24 -43 4 -44 -28 48 29 47 24 3 -16
6583 -16 28 -51 33 -21 -14 23 -30 23 -51 39 70 -38 -8 -35 -44 -19 -34 -19 36 -33 -4 7 -10 34 17 -48 -20 27 17 40 -26
6614 -26 29 18 -54 -31 15 9 2 13 37 -27 20 0 -28 36 57 -60 -23 10 -1 -34 51 11 -22 -17 22 -21 24 34 -28 0 24
6645 24 16 14 11 -15 16 -26 39 -8 29 0 42 -4 8 17 6 29 8 39 14 -34 -21 -8 34 -19 5 -2 22 -6 -35 -27 14 -11 -35
6678 -35 39 -30 -29 -52 -67 35 -37 -14 -33 -40 18 -28 -24 13 30 -14 -2 -21 -10 44 38 44 7 -24 41 -12 44 -6 -73 21 -10 -34
6710 -34 -34 33 80 -15 46 -66 -16 28 -56 64 4 40 51 2 127 -105 200 -63 -92 15 -249 -12 -160 220 -28
6735 -28 112 60 135 23 86 5 -3 90 153 54 14 -186 -231 -113 38 109 75 -10 193 26 18 70 99 54 -58 -3 -199
6762 -199 101 -59 -26 -61 42 15 49 -32 -39 -20 4 -38 45 -77 37 18 40 36 -1 20 3 25 29 41 7 13 32 -24 -21 35
6792C5M4p6K4n3k7K5j4m3J28l7ll9L6L4n2O1p2RN1k9L1k2j5jJ1K7qk7l3m7Q7%
6824Ej3L8lJj9QQm1J8o%j8MJ7onJ3J2p0L5j1K8Rl2l9lJ07o9j45L6J29j86J88j9
6858b9J10j10J02j44N1Q7lk4J43j26o9m6j4R1L8n8%LJ9k8Pl1L8k7J4k9L8m7J1
6887c3L4Q3k0k03K26j15K9R0K04o4j87P6j69L1l1k77L42j63P8j48J48J90k59J81
6911D3LK17j60j62J2N6L7Q5L8k98J27j53J80r5J81r3l7p6J54o5K0OQ3r5k8L1o7
6938e6m6J21n4k1Q9q2N7J2K7k0m4L4L3p2m0P3k2L7Rj03N2rL0k2M4n1J6NM9k0J0
6969C6M1q8k0M6J2o3P8p2K6O2q7M0rK7j6Jrk1K2Qm4KOj9L3j4K1oJ3Rol7L7n5M0
7004fMk0L4q7R5n5jL4j6M9o5rM3rJJJP0j02L0L7%n9L5k7N3o7j1J4N4j1k5K6l6
$$ plain form
6792 35 79 3 27 -26 -53 -28 -42 -85 43 6 3 -36 0 34 -18 43 -29 -20 31 2 33 11 -4 -5 6 33 25 -2 -35 -82 5 5
6824 5 -8 30 27 28 9 17 25 -16 2 -4 -4 -22 -18 -1 -7 -12 1 13 -57 -22 -33 -5 4 -28 -67 -70 37 -32 -177 -141 -12 -198 -10 -29
6858 -29 81 -29 73 -71 -20 67 64 40 183 57 -12 -58 -72 19 57 -1 -1 2 21 -7 0 -31 7 -20 -6 -35 3 -44 -33
6887 -33 1 84 64 -139 87 -28 1 91 295 231 44 120 -49 -18 -49 -326 16 -147 -69 -217 -69 121 -138 43
6911 43 46 263 103 -59 -47 9 46 131 169 -129 -2 -155 25 -70 111 18 -19 -95 59 -6 14 20 103 8 -20 11 -56
6938 -56 -102 19 -35 -56 33 -49 8 20 47 27 -17 17 50 -22 -62 11 -11 26 35 -68 -16 -25 5 -17 27 -24 -8 -3 46 26 36
6969 36 77 -11 -31 15 27 -36 42 -30 -4 58 -29 11 2 29 13 14 5 -16 6 14 -30 -28 -22 -41 -8 -22 -1 -7 6 15 9 -28 9 -46 -6
7004 -6 -2 -22 12 -75 20 -35 -36 -2 -18 31 -34 -43 0 -9 -8 -7 -6 64 -38 -8 29 29 -30 5 -22 31 -36 -47 -33 21 10 -15 11 -25
7038b5j1L5P8j00l7J1O1j8L5jn2K2MLJ3J0l3k8j9O4J2J6q4L1K6m7jJ2J1L5JkO
7071B8r0oR2J33j5j59L52n22K98J59j86J7k1l63M81l13J13J29j07O7P0l90L50
7094A17j31j6L0k3o6R9M1O1j33P1j01K4K2n3N1o3R1k0MJ9qJ8o1L8Rk2j7M3K1l8
7124GRPnl4J6pJ2nKN7l4N4o9k3%J6k4M9%l0l3O3m0j4Q4n3p3M8J3lL0p7L2j3j3
7159e1P7n9L8jk2j4K3J7J7o4M1k8M5j4K5q7J14p5K3J7k2k9J31j94Q3k7J9K5q3
7188g5J91j22J07k77J15k67L78J46j33j41j64K42Q3Q4l63K16r0L1J7M3j0M3Pl8
7212B3m5j9N6m2J1Jk0L4P0j23O6K0o6K9JQm5Q1l1O9j5j21J32j6j18j73Q5J17K12
7241A81j87n8K35j36j78J82K54q2l02K41J94j14k42j22J99j3j17J64p9P8l6j66
$$ plain form
7038 -25 -36 -1 77 -23 -60 -49 12 -6 29 28 -24 -2 2 5 18 28 -5 -33 -52 12 24 40 -44 -13 13 -34 -35 -23 -12 23 24 22 28
7071 28 -62 -68 24 157 142 -17 335 -187 111 270 84 101 80 -283 198 -115 -2 127 20 87 157 -233 117
7094 117 -14 -30 0 -23 -89 10 51 112 -21 50 -51 -27 -5 -58 -7 -70 21 1 5 24 16 34 -27 11 20 -2 -19 24 45 7
7124 7 16 23 18 -16 0 -7 5 0 2 59 25 79 10 -13 -13 3 -21 28 28 -2 -35 28 -12 -26 58 5 -68 -20 -7 -10 20 -57 -25 -38 -51
7159 -51 26 -33 5 4 -18 -32 -9 8 25 -39 2 -26 19 5 30 -57 57 -18 5 22 0 -29 102 -92 -9 -36 -17 8 -75
7188 -75 116 -6 101 -176 -61 -328 50 196 63 -78 -242 0 83 167 -196 20 -70 -39 -22 21 11 54 61 23
7212 23 -22 -41 15 -27 -16 -15 -35 -1 69 -54 12 32 -34 -5 -4 4 -41 40 9 78 63 -58 74 58 -60 -233 -148 -31 181
7241 181 -6 -64 171 35 -143 39 293 211 -91 150 344 230 -12 -134 65 52 -65 99 20 98 62 -104
7263a04J31J2j5n4K96j36l8j01j0q0P7J2o8j30K89l50J86J49M5O9j59J20k77K05
7287F9j07oJ07k15L66l35K62j05n6J30r6o6K7qr4K44k03rM1k8Q5JN5j9j27K3n5
7314a19O2q4J74pp1R5j11j1K20j83J11j42Lr4K3J31J85O4j29L3p8k57l6N00l81
7339a02j0J72o8O8r7j73K26j0OJ3m3J9j4j1J4k7N7m3N7j14R8m8Jj0j8L4LJ6o4
7368f8J36l6m4m3N0O2m1k9L9k2Mm7K5K5rol6P1m3oJ1L9M9j29RP4p0qM6n9O8oQ
7401A4n4K9K2j8Ok4J4QJ1K7k0k5J8om8LM5m8L1J6Jj3j5l1J2M5j5nN3ll0K7n6K4
7435elj7K0J3K7p9J05n7J1l8R4p1m5N5qm6J6Pk8M5j3J0mK1K4Pq4M6K5m6O0l1L2
7468D3k4p8J02m9qk6L5O1l4o4M4NL7p5K4l3PN3k8Ok3jM9q4N0NQj7k4M4J0olk0
$$ plain form
7263 -104 27 39 24 -30 266 130 92 -9 -19 -99 -22 -10 -78 -208 81 -269 -83 66 111 180 21 141 -136 69
7287 69 -38 -44 63 -152 214 -121 141 36 -20 110 14 -52 -25 -33 -127 117 -86 -95 -54 -82 3 4 59 40 -87 -64 -119
7314 -119 -57 -141 33 26 -45 50 -61 -72 148 -35 76 -66 -63 -157 -134 -3 182 246 117 150 72 -185 -221 279 -102
7339 -102 -112 60 -8 60 -37 -210 16 6 12 25 -18 1 -13 -24 -10 -37 20 -23 34 -80 18 -30 -29 -39 -57 -23 -20 -4 -68
7368 -68 68 32 -12 -55 -5 57 16 -13 26 4 8 -39 -14 11 2 -4 -40 31 -12 -18 -7 32 81 -48 -39 35 -35 -43 3 -56 12 6 14
7401 14 -40 -11 11 -7 -1 -25 -11 -3 8 35 15 -10 8 2 -46 -43 2 -46 -15 1 2 -11 -26 -57 -45 0 -15 -20 33 30 0 27 -29 -5
7435 -5 -8 -25 -5 8 35 -44 61 4 15 -23 71 0 -45 10 2 -44 -28 -21 -49 -4 -17 -7 -11 10 34 41 -43 3 28 -18 42 11 43
7468 43 19 -59 43 -6 -14 -40 -5 56 22 -42 2 7 44 -31 -7 -40 -33 20 -8 -2 -25 -26 23 -61 -11 -6 2 -15 -39 5 15 9 6 -14
7502a4k6J8j5M8M6k9q8P6k1JK2j9J9nqj6m5K4P0p3jM5pRK6j01r3J37q3J36Q0k59
7534a46L00l03k6K37J51j25k45P4j3p9j7J45j16%J09J0J1Q2j3l1qK0l8J8mO8p0
7561iJ3n4L4J7Rkl1K8l9L3M0m4K5q4K9lM8Pk3j1PL5q0M0J8l5O0q5Q7r3M7Q3k7
7594D0l0pJ4q3L3J5J1m1Q3k2k9N6l4nj6l4M3J8roJ2l5O5m2J2O9J2j54J57m4j43
7625i4J27n1qq5L12j86p6k0J63j0P3k24p2K84k34K20j27J60oJ03m1k22P4k67K58
7650E1J00k90K38k6j65p5R9q7R1M9O2Kl3j8J8mj7l2N7q7O7l9K5J1o4O9J65j29
7678C8J39n6k87K20j12R5j04R7j2o1K9k6k0K02l2j15O4J9p9J06l53M02k84M5J94
7703A09j13N8M6j94O2L3l07L33J31n05K77n1L3K08j50N2K4m9k24J43K52l04K0
$$ plain form
7502 -14 -40 -22 -37 11 57 28 -60 16 -5 -4 18 -1 18 13 5 -11 -56 -32 38 -35 -36 9 2 11 37 -64 -157 -20 -103 33 113 -146
7534 -146 154 -149 -175 62 213 88 -157 -83 -96 -175 -192 -47 -163 -163 -54 -44 -33 49 36 5 -3 17 -21 -3 -7 61 -9
7561 -9 4 -50 -16 1 10 8 -23 5 -34 -1 39 -5 20 -64 -35 -38 10 17 -6 -17 -10 25 -55 -15 3 -32 28 -57 30 -63 -16 67 40
7594 40 10 3 17 -66 -33 -18 -7 -48 35 13 -16 40 6 1 -15 -49 -6 12 3 -3 9 -26 39 -3 9 78 90 -64 93 49 -94
7625 -94 33 -18 -26 -111 201 15 -61 -81 82 72 145 -79 -151 133 -101 119 -8 152 146 249 208 -14 60 -207 51
7650 51 151 -139 99 73 -92 -167 -68 -155 -64 -15 47 49 16 -2 16 12 -5 -37 20 -67 0 -39 -14 -3 -67 2 167 38
7678 38 177 121 -166 54 -58 37 -67 30 18 -43 -14 -40 -60 142 110 -5 59 78 -1 105 -248 154 -130 -85 109
7703 109 -4 54 100 -94 -32 1 -306 27 158 -347 -70 -121 -88 120 -30 22 46 -3 -227 -84 168 -136 -116
7726a16nJ01q6P7M5r4j8M3k6r3P5K2K08j43R5j41o1K44m83K13J73n45J62M48q5
7751A0Q3j16K00l78n6J61K94m5n59N08p3o3M23l22l32K37p7p2p9K04L40k02K5
7774A11o4m1R3l81K95k04J47q9j00L0J48N10m31k98L43R4n46J43j24L48%j44K21
7797F1L47Ok98m4j50k97N62j82K88m29kk11L97m5k4Q8j78L6J47m8n7o4L03r9K27
7822C34k10l3k42L8J82j98j95L72OK62m36J28Q9l32O28m25l02N72K2k42O9k23
7844a36L29k49r1J00J8J22n7J79n68L13L56m29J43j47k26M15k1j84J40K64m31
7865a60K30R9rk56j44K74Q0J93k71k01K39q3K27o55N40l4L2j05k37K23l84J63
7887b39j27N97r0m06K98K03j40l24J05J31k47K08j47M3K48k15O9J33P6k12M0j38
$$ plain form
7726 -116 -121 -20 -106 -29 16 -78 -96 -53 -79 -172 -97 -75 133 -10 85 -56 -117 127 -356 -143 30 -515 -353 95 10
7751 10 93 -23 177 -201 -257 -96 198 153 -406 102 29 -34 389 67 -265 -28 -105 -177 -256 -52 288 86 111
7774 111 47 6 99 -282 13 -191 -44 -133 -233 -203 -55 455 24 -274 69 163 -383 -240 -364 -16 -16 -160 61
7797 61 408 414 116 72 -78 -375 187 5 293 -136 -138 -349 48 3 -21 67 -111 -75 72 24 -33 -97 206 107 334
7822 334 124 91 -151 -113 69 -129 -324 48 54 316 -120 8 97 -235 393 -32 -334 238 260 18 87 -136
7844 -136 193 -56 -147 -47 -29 93 36 215 -353 -40 316 -113 30 -117 -343 72 51 -133 7 271 -160
7865 -160 70 169 160 -96 -240 34 114 307 36 -165 74 -9 218 -437 103 69 101 -4 -241 -18 -402 -239
7887 -239 -366 231 141 -265 33 236 96 -228 -123 8 -239 -31 -178 -135 113 -102 -33 100 176 -36 4 -134
7909a34R1J62P7k44L4J10r6j3N5M7k4m0Ll9Ok9n9K7J67r3O7r0K9o5Q2p1L7K3m7
7938b7K2O1k4l3k5mk0O5j8j8N0Mk4Pq7O9rJ3l3RN8j3k7o5k4J18j5K0l9j1M2j7
7970Eo1Q3m0M5p6O7n4O3l7k6M9lk5N5n5k4Q5j13M7k4M3j2M1n6%k7O4l8K3jl9O6
8002B5m0JK0J1l5n4L8O3Nk4NJ4K0l6J39p9j54R2l93M28m15N22K5m45O8J50J96
8029A47j26o4N11l98O0j21j23K34l16O9M35o04M06k00j27m98Q13L91j88j1j71
8050A19K80n85K29q8j09K86m51o4L17j22l8J62k08j08O33r1m54J64L38o9j76L43
8072C08k02k45P5J45k25J59J23n2l63Q1o4J33k17L11p5p9M39l29J74k27L33j64
8094C9R3k15k20K33lp7N7q0M87l00Q1k4oR2k78L34J38m99J94o8L51j31l99L15
$$ plain form
7909 -134 -43 119 196 -48 -14 96 0 -13 42 89 65 25 28 -11 -5 -34 -93 -66 101 8 75 -15 14 -51 31 -40 -3 20 -27
7938 -27 -5 56 32 -1 -26 -30 -50 15 -3 -21 29 33 9 16 -71 -2 -11 2 -31 -22 36 23 -4 -69 -93 25 10 30 -9 -20 22 5
7970 5 -56 27 -13 32 -44 23 -31 32 -5 -31 18 15 -10 45 -10 -34 51 -62 -15 -39 4 -8 33 -23 -23 -50 14 -24 -1 -2 -41 25
8002 25 -15 -14 6 17 -18 -72 -34 29 34 10 15 29 49 13 152 73 -81 11 -382 46 -369 153 178 -267 -199 -49 147
8029 147 21 -43 468 70 130 9 -114 120 -196 -127 308 -296 110 -90 -217 -715 98 489 301 290 119
8050 119 399 -186 43 -45 -154 132 -319 -383 -66 -188 -226 -64 -272 -380 253 162 -292 -128 210 141 -35 308
8072 308 106 -139 -64 81 -144 15 138 86 -277 -196 -260 -127 -344 -33 -108 -187 252 -77 97 -130 203 39
8094 39 132 -83 -303 -70 -73 -150 -93 -173 314 14 95 71 65 157 -121 213 351 -148 46 -22 329 198 -201 114
8118A14j4j44J86m5j06r7J19Mj77K42q6ql07M20j59prJ55K9j90L43l10j35J40
8142d2pj08P3m76O25N3p72M19N25m44j56O79l94J38k17j73k57O23ol15N43m42
8164a31R0Q0J74l43k7N1M1J16r8N2k41J51Q0J16m9N4j26Q6k0q7L0l5J18m4Pk3
8190B2j2
$$ plain form
8118 114 100 -44 142 97 -9 -106 13 17 -160 82 -4 -12 -319 101 -58 -65 -74 81 110 -80 263 -47 -182 -42
8142 -42 -49 -157 -84 -560 65 118 -654 -235 290 -154 -310 369 -25 113 -104 -277 -534 89 83 -232 311 -131
8164 -131 -41 39 213 -130 -157 -106 -65 51 -47 5 -236 -85 -5 111 62 116 -10 76 56 -31 -1 -36 82 38 45 22
8190 22 10
8191A0
$$ Imaginary data points
##PAGE= N=2
##DATA TABLE= (X++(I..I)), XYDATA
0@%%%%%%QqQqQj6K4l2M0m8N6p2Q8j04J28j52J84k23K60l01L51m07M67n39O16p04
32c76Q01r09J027j156J299j459J634j824K031k259K508k779L076l400L753m141
48b174M565n029N540o103O727p420Q194r067J0057j1189J2499j4034J5870j8104
62i668K0896k4505K9373l6343M7242o6876J13629m43703n70523Q8312q7734K6746
74i13154n4319J5765k8988K6952l328L7883J6873N0852L1785N7712M4885O7640
86f49442N6162P6021O8138Q0515O7488P6518O9261P9194P3551P9850P0889P2101
98B20246O4853O7417O0777O1053N1334M6899L5447L0884K4990K2446J5937J3234
110G15517O902M837o020j1893j8679k3945k7222l2552l8267m1755m6044m7840
$$ plain form
0 0 0 0 0 0 0 0 8 0 8 0 8 -8 16 -16 24 -24 32 -40 48 -56 72 -80 104 -119 141 -160 191 -216 251 -288 328 -376
32 -376 425 -484 543 -613 686 -773 861 -963 1068 -1191 1317 -1462 1614 -1786 1967 -2174
48 -2174 2391 -2638 2902 -3201 3526 -3894 4300 -4767 5290 -5899 6600 -7434 8436 -9668
62 -9668 11228 -13277 16096 -20247 26995 -39881 73748 -369955 -940478 -852166 -939900 -913154
74 -913154 -967473 -951708 -980696 -953744 -957072 -919189 -902316 -851464 -819679 -761967 -717082 -649442
86 -649442 -593280 -517259 -449121 -368606 -301118 -224600 -155339 -76145 -2594 77256 148145 220246
98 220246 285099 352516 413293 474346 525680 572579 608026 638910 663900 686346 702283 715517
110 715517 722419 727256 721236 709343 690664 666719 639497 606945 568678 526923 480879 433039
122D33039m8015m8298m6491m9458n3910n7636o1586o3367o1934n6851n1499m4667
134b10673m2127m1582m2029m1153l7973l5080k8455k2509j7152j4054r381o424
146e48592k629K411R010J4248J8343K0637K1815K3058K5846K9310L3091L7338
158c16114M0088M2741M3581M4059M4683M4391M3583M1597M1013L9675L7992L5969
170A83258L4565L3146L2846L2063K8391K3628J9614J4419R580N451L054M29j247
183D19197k024l793o429r371j5749k0733k4274k8556k8391k9730k9725k9306k8434
196A62682k9547l1829l3872l5525l6023l4973l2777l0484k9815k8453k6972k6077
208b13665k4567k0840j9257j3051j1334q663p744p290o208n028r32K694Q486J2027
$$ plain form
122 433039 385024 336726 290235 240777 186867 129231 67645 4278 -57656 -114507 -166006 -210673
134 -210673 -252800 -294382 -336411 -377564 -415537 -450617 -479072 -501581 -518733 -532787 -542168 -548592
146 -548592 -551221 -548810 -539800 -525552 -507209 -486572 -464757 -441699 -415853 -386543 -353452 -316114
158 -316114 -276026 -233285 -189704 -145645 -100962 -56571 -12988 28609 69622 109297 147289 183258
170 183258 217823 250969 283815 315878 344269 367897 387511 401930 411510 416961 420015 420444 419197
183 419197 417173 413380 406951 397580 381831 361098 336824 308268 279877 250147 220422 191116 162682
196 162682 133135 101306 67434 31909 -4114 -39087 -71864 -102348 -132163 -160616 -187588 -213665
208 -213665 -238232 -259072 -278329 -291380 -302714 -311377 -319121 -326411 -332619 -337647 -338579 -335885 -327399 -315372
222c15372J5223J7551J9111J8475J8019J7882J8683K1508K4731K6474K7709K8887
234f1119K9983K8739K7435K5417K3564K2242K1056K0215J9662J8734J8587J7513
246B12028J5941J4026J1051P049L728J551m93j296k897m079o657q270r872j1717
260B20093j4088j4914j5584j6696j7531k0320k2551k3898k3585k1362k0377j7925
272h738j7006j6528j7894j9406k0667k0303j8871j6778j3207r990o707n470n103
285a96668m941m309k931k297l91J426M684P006Q357R643J0342J2073J3651J4856
299a29499J5315J5363J5309J4817J4680J4971J5470J6242J7655J9152J8936J7608
311F6019J5593J2840J0471Q985Q657Q578Q790Q837Q372P089N080K587m01k152
$$ plain form
222 -315372 -300149 -282598 -263487 -245012 -226993 -209111 -190428 -168920 -144189 -117715 -90006 -61119
234 -61119 -31136 -2397 25038 50455 74019 96261 117317 137532 157194 175928 194515 212028
246 212028 227969 241995 253046 260095 263823 265374 264881 263585 260688 256609 249952 241682 231810 220093
260 220093 206005 191091 175507 158811 141280 120960 98409 74511 50926 29564 9187 -8738
272 -8738 -25744 -42272 -60166 -79572 -100239 -120542 -139413 -156191 -169398 -179388 -186095 -191565 -196668
285 -196668 -201609 -205918 -208849 -211146 -211537 -210111 -205427 -198421 -190064 -180421 -170079 -158006 -144355 -129499
299 -129499 -114184 -98821 -83512 -68695 -54015 -39044 -23574 -7332 10323 29475 48411 66019
311 66019 81612 94452 104923 113908 122565 131143 139933 148770 157142 164231 169311 171898 171497 169345
325A69345l007l553m593n821p300q369r069r589r868j0065j0137j0485j2031j3855
339E1603j5480j6384j6252j4706j2266j0136r240r287r976j0765j1149j1025j0360
352a05423r165p027m828l300k256j084J30J270K130K251J905J873K898M266O106
367a10254P985R506J0362J0522J0514J0133R716R668R956J0085J0076R994R477
380A7740R168R635J0458J0811J0155Q764O745M989L408K715K083J912K469K779
394A03831K483J383j16j667l061m275n382o723p358p275o750o028n439n447o522
409D1654p984q914r618r765r643q997q335p535o833o653o721n819m498l507l424
424f6592m074m923n269m623k827o04J789L547M239L537K563J709J308J890L504
$$ plain form
325 169345 166338 162785 158192 152371 145071 136702 127633 118044 108176 98111 87974 77489 65458 51603
339 51603 36123 19739 3487 -11219 -23485 -33621 -42861 -52148 -62124 -72889 -84038 -95063 -105423
352 -105423 -114588 -121615 -126443 -129743 -131999 -133083 -132953 -131683 -129553 -127302 -125397 -123524 -120626 -116360 -110254
367 -110254 -102269 -92763 -82401 -71879 -61365 -51232 -41516 -31848 -21892 -11807 -1731 8263 17740
380 17740 26908 36543 47001 57812 67967 76731 83476 88465 91873 94588 96671 98583 101052 103831
394 103831 106314 107697 107581 105914 102853 98578 93196 86473 79115 71840 65090 59062 53623 48176 41654
409 41654 33670 24756 15138 5373 -4270 -13267 -21602 -29137 -35970 -42623 -49344 -55163 -59661 -63168 -66592
424 -66592 -70666 -75589 -80858 -85481 -88308 -88912 -87123 -83576 -79337 -75800 -73237 -71528 -70220 -68330 -64826
439f4826N462O474O737O388O113O246O969P593P635P221O652N598M730M188M256
454B7436M978N995O807O669N377L853K542J109J57m94q46p63j09M54P17K51o45
471F3488k200l897m843n349n601n652m891m086l734m031m541n116n244m845n021
486e563n486o044o015n655m739l584k415j833j436j299j633k112k368k252j443
501e3877m77N37J205J419J928K496L041L451L653L353K790K504K443K554K738
516b0242L625N164O377O821O202M794L148J842Q00Q97J703L368M444M807M345
531C8095L094J100n81j172p05K8M66K21o55j139j685j998k105j568j035j308k113
548B6940l325m469n333n034l956k758k102j727j877j972k366k902l735m356l975
$$ plain form
439 -64826 -59364 -52890 -46153 -39765 -33652 -27406 -20437 -12844 -5209 2012 8664 14262 18992 23180 27436
454 27436 32414 38409 45216 51885 57262 61115 63657 64766 64923 64429 63583 62820 62711 63165 63882 64133 63488
471 63488 61288 57391 52548 47199 41598 35946 31055 26969 23235 19204 14663 9547 4303 -542 -5563
486 -5563 -11049 -17093 -23108 -28763 -33502 -37086 -39501 -41334 -42770 -44069 -45702 -47814 -50182 -52434 -53877
501 -53877 -54354 -53817 -52612 -51193 -49265 -46769 -43728 -40277 -36624 -33271 -30481 -27977 -25534 -22980 -20242
516 -20242 -16617 -11453 -5076 1745 7947 12741 15889 17731 18531 19428 21131 24499 28943 33750 38095
531 38095 41189 42289 41708 40536 39831 39859 40325 40546 39891 38752 37067 35069 32964 31396 30361 29053 26940
548 26940 23615 19146 13813 8779 4823 2065 -37 -1764 -3641 -5613 -7979 -10881 -14616 -18972 -22947
563b2947l358k441j279o1N22N47J05m02j153j583j309m81Q36J565J548J294J512
580b7085K348K949L189L215K747J848R34N08J018K078L429M510M659L982K658
595A2987J086K61M80J335J810J785J609J187O99O47Q43J125J202R65P7j133k289
612B4676k749k516j511l02Q5k35q42j328j939k583k969l143k937k696k180j622
628d791j126o04n01o18r78j712k590l126k649j387m88pJ68O12M81N61L33P1p2
647a8423o4n3P5M53J245J795K207K796K584J818R62N09N85J087J409J678J496
664B159J282J222J249J651K186K334J898J278L97p66j661j322j20J407K172K236
680A7602J322J70j216k370k743k388j473k90k27O61K65p96j766j583r42j641j343
$$ plain form
563 -22947 -26305 -28746 -30025 -30086 -29564 -29017 -28912 -29314 -30467 -32050 -33359 -33840 -33004 -31439 -29891 -28597 -27085
580 -27085 -24737 -21788 -18599 -15384 -12637 -10789 -9855 -9347 -8329 -6251 -2822 1688 6347 10329 12987
595 12987 14073 14334 14814 16149 17959 19744 21353 22540 23239 23886 24729 25854 27056 28021 28098 26965 24676
612 24676 21927 19411 17900 17598 17683 17448 16606 15278 13339 10756 7787 4644 1707 -989 -3169 -4791
628 -4791 -5917 -6521 -7022 -7640 -8618 -10330 -12920 -16046 -18695 -20082 -20570 -20577 -20409 -19797 -19316 -18755 -18422 -18351 -18423
647 -18423 -18487 -18540 -18465 -18012 -16767 -14972 -12765 -9969 -7385 -5567 -4605 -4096 -3511 -2424 -1015 663 2159
664 2159 3441 4663 5912 7563 9749 12083 13981 15259 15656 14890 13229 11907 11787 13194 15366 17602
680 17602 18924 19094 17878 15508 12765 10377 8904 8614 8387 9048 9313 8517 6751 5168 4226 2585 1242
697A242j941j538p12j137j429q44j416k89l06l0K9l84j408j884j012j316k44j91
715a4810J643J551K067R17O18n93j242m59J01N36J392J392J905J272J826R50P44
732a90L98Q34L66N36J58K98P34J378J778J653J392P89M70m98j062m69l87l80p4
751G724Q40O21P20J36l4p29o89j453j231j021r39p80m54M6k66j81l18l56j126
770E10j108j715j635r92n61m21j31n5M92L43J30o64l91q32q08n66l97m0L18J108
790g415P74J243J207M58l05j68p1q63k18J64J200J554K230J808J006J69k13o54
808A906m27j15O11P15J158R83O21M13q3KJ82K90NN6n97q33o59k73J80L95N03O19
830E652K62m5j241j525j710j301p98k32O38P28P53J38l93j169j376j722j242k13
$$ plain form
697 1242 -699 -2237 -2949 -4086 -5515 -6359 -7775 -8064 -8370 -8400 -8371 -8755 -10163 -12047 -13059 -14375 -14619 -14810
715 -14810 -13167 -11616 -9549 -8632 -8014 -8607 -9849 -10308 -10207 -9671 -8279 -6887 -4982 -3710 -1884 -934 -190
732 -190 208 1042 1408 1944 2102 2400 3134 4512 6290 7943 9335 10124 10594 10096 9034 8565 8178 7798 7724
751 7724 8564 9185 9905 10041 10007 9278 8589 7136 5905 4884 3945 3165 2711 2757 2491 2310 1992 1636 510
770 510 -598 -2313 -3948 -4940 -5501 -5922 -6053 -6108 -5616 -5273 -5143 -5807 -6198 -7030 -7838 -8404 -8801 -8841 -8523 -7415
790 -7415 -6641 -5398 -4191 -3733 -4038 -4206 -4277 -5140 -5358 -5194 -3994 -2440 -210 1598 2604 2773 2560 1906
808 1906 1479 1364 1975 2690 3848 4831 5452 5865 5782 5784 5966 6256 6261 6317 5720 4887 4228 3955 4135 4530 5033 5652
830 5652 5914 5869 4628 3103 1393 92 -706 -938 -300 428 1181 1319 926 -243 -1619 -3341 -4583 -4796
848d796L88R6N52J03K80k28j57l62k49k5l3j28m26k21o81R04J242J511O65O76
868h89Ml63r64m39J15K17M62J387J328R66L10N70k27K4k1l3q05k17P9P82J100
889C386P67N02K90l8n45q04p32o61j87K38K73J18J61P5o1m0j27n25p10r96r86
910f02n67l34K80M09N70L96K04m41q70j130q41n46k62L5K58N85P18O90K19k52
930a481o10p34n43l44J34M56P70P09N06J65n8k5K07L90M26K45l17o10n23O3O24
951e50J204J381J092L98k02j004j390j025k42O50J152J146Q60K08k63m79n85o55
969A696n28j97j34P2K44K08R0O9N6l5l01m48n80m68l46k19l31k18N0L25N46M63
991A4J45l55p04p67q02o05m7M61P53P88O71K26k75n04l84l88k51j29N9K48N08
$$ plain form
848 -4796 -4408 -4312 -3760 -3657 -3377 -3605 -3762 -4124 -4373 -4398 -4431 -4559 -4985 -5206 -5887 -4983 -3741 -2230 -1565 -889
868 -889 -885 -1248 -2212 -2651 -2536 -2319 -1857 -470 858 1824 2134 2704 2477 2501 2480 2447 1642 1425 1504 2286 3386
889 3386 4153 4655 4945 4907 4362 3558 2826 2165 1978 2216 2489 2607 2768 2843 2782 2742 2615 2090 1380 384 -602
910 -602 -1169 -1503 -1223 -814 -244 152 356 -85 -955 -2085 -2926 -3472 -3734 -3699 -3441 -2856 -2138 -1448 -1229 -1481
930 -1481 -2091 -2825 -3368 -3712 -3578 -3122 -2352 -1643 -1137 -972 -1030 -1055 -848 -458 -32 213 -104 -714 -1237 -1174 -550
951 -550 654 2035 3127 3525 3323 2319 929 -96 -338 312 1464 2610 3470 3678 3415 2936 2351 1696
969 1696 1168 971 837 909 1153 1361 1451 1520 1576 1541 1240 792 212 -256 -602 -821 -1152 -1370 -1320 -995 -449 14
991 14 159 -196 -900 -1667 -2469 -3074 -3121 -2660 -1907 -1119 -448 -222 -497 -1001 -1385 -1773 -2024 -2153 -2094 -1846 -1338
1012a338P11O68M04K18ll15n07l58l33M0N18O95O31L69J43L4KM0j59l05l39k18
1034E98j59n6K86M97M77N38L22j18n85r65q92n46kL99N58N77M77K00l22n90o94
1055@o59l08n8K08J42%m0M0N7J91J63L6q7k26n10o33m87r7L47P79Q92P57K25l33
1079C99o14p91p04m12Q4O14R66R18N06J8k81l83m58k52L4J57K82K57J53Q2o1O1
1101E75K51M02L22K6l55o52n72l35j48L24O47P89O51K04k41p81r09o84l32O6L85
1122c67N01L84L56J15j88m06m52l87l04j65o6M7J00K45K67L59K59r3l08l85k08
1143f96k80k16j89J33M28L91L04J50J45%j53j52l66l51k02j3L08N71N27M23K78
1164A040R9k59n15n78n54n8K72M33N67M13L37Q8j65m01l11m12j29P0K33K38o0
$$ plain form
1012 -1338 -627 41 445 663 660 345 -162 -520 -853 -813 -295 400 1031 1400 1543 1577 1579 1619 1460 1155 816 598
1034 598 439 383 669 1166 1643 2181 2503 2385 1800 835 -57 -603 -605 -206 352 929 1406 1606 1284 694 0
1055 0 -659 -967 -1025 -817 -675 -675 -715 -675 -618 -427 -264 -228 -315 -541 -1051 -1684 -2171 -2268 -1921 -1142 -250 507 732 399
1079 399 -215 -1006 -1710 -2122 -2038 -1424 -458 460 966 984 703 320 -138 -390 -356 -199 83 340 493 575 514 575
1101 575 826 1228 1550 1576 1221 569 -3 -338 -486 -162 485 1274 1925 2129 1888 1107 198 -486 -818 -752 -367
1122 -367 134 518 874 989 801 395 -57 -444 -748 -913 -979 -932 -832 -587 -320 39 298 205 -103 -488 -696
1143 -696 -976 -1192 -1381 -1248 -820 -429 -125 25 170 170 17 -135 -501 -852 -1054 -1067 -759 -188 339 762 1040
1164 1040 1139 880 365 -213 -767 -825 -553 -120 447 860 1197 1285 1120 719 408 -4 -133 -63 170 408 348
1185C48L1Q0K07J34L2jl22l28l84m20k48K7L41O16O53M37j22n50o29o30m62j04
1207a294J53N00N28N24K40k65l34m04k75j14Q4R5l8O1J1J34J65J91J87K33J33
1228E15j52m70m68l88l5K62M72N91M79K25K5l18n18n90l25J7K82L52L64K84J83
1249G87J21k9k18k90k43k26r3p5J32J14J56K76K64J43j36k72k88k96j34j72j05
1270e84J83K83L20K45J43p5k17k29l83k30k42q2O6L40M64K96J13m3q4k02m27k51
1292e96k07k1J51L82L34L21Q9j16j24r4k49j82j21m2J62J95L7Q5J69K88J47R5
1314G03j01l13l73l94j92O2L40M14M92M25P0k97n08n53l94n4J68L52L19J93K87
1335F46l7j87k43k00n2l0N6l6j59j12R4O0L04J50K17k1m5k88m08l52j86M7K16
$$ plain form
1185 348 379 459 666 800 832 831 509 181 -203 -623 -871 -844 -503 113 766 1203 1081 531 -98 -728 -1190 -1294
1207 -1294 -1141 -641 -113 411 651 386 52 -352 -627 -741 -657 -562 -600 -539 -528 -394 -229 -38 149 382 515
1228 515 363 -107 -575 -963 -998 -736 -264 327 806 1031 1056 738 220 -370 -695 -678 -396 -44 320 604 787
1249 787 908 879 661 371 128 -98 -191 -266 -134 -20 136 412 676 819 683 411 123 -173 -307 -479 -584
1270 -584 -401 -118 202 447 590 515 298 69 -314 -544 -786 -868 -802 -462 2 298 411 368 284 82 -345 -596
1292 -596 -803 -824 -673 -291 43 364 453 337 213 119 -130 -312 -433 -475 -313 -118 -81 4 173 461 608 703
1314 703 602 289 -84 -478 -670 -608 -268 146 638 1063 1133 836 328 -225 -619 -673 -505 -153 166 359 646
1335 646 609 422 179 -21 -73 -103 -47 -83 -242 -354 -260 -200 104 254 471 450 405 117 -291 -643 -829 -782 -566
1358e66M83L77L69j1j23l03m59l62k42k7K73M81K74K21N7p0k20j60j68j7n9l7
1380b89L3J28J17P4K49M2J28j15n4l08k23r5k02J27J29L52Q2M23O1j02j09q7o74
1403c13p8K9km7N69J02K19kqj56k51m54j23K64l34L91K54L64m6j01k36r9O4j50
1427a44p2J35j04j43j20J83L00J44l30N86M6k48k36k94k46L1l3K67L84L11K15
1448F32l05j34q3m78J59n37J88M97O84m95N32L57r99J11j01j76K0L3J38l70J19
1469b08K98M2J08N00k56o4j87J61n48k58K2n3L69K70M57j99J42l77k42k31j11
1490c65r7J30J23K76J74P2m8q3o0j12l9j00j68l1L6K7J20J01J68J24J14k0j12
1513B30k91k95q9l5J24K19K11K02J81Jp2k92l09j80o7N1J71J79K05J59J83m5j80
$$ plain form
1358 -566 -83 294 663 652 529 226 -233 -595 -837 -864 -591 -110 164 385 442 372 152 -8 -176 -193 -252 -289
1380 -289 -256 -128 -11 63 312 354 482 367 313 5 -218 -313 -515 -388 -259 93 175 598 659 557 448 361 -313
1403 -313 -391 -362 -364 -411 158 260 479 477 469 313 62 -392 -515 -251 -585 -194 60 424 378 277 41 -58 6 -144
1427 -144 -216 -81 -185 -328 -448 -265 35 179 -151 435 481 233 -3 -297 -543 -512 -545 -278 106 417 632
1448 632 327 193 110 -368 -209 -746 -558 -61 623 128 660 1017 18 129 28 -148 -128 -95 43 -327 -208
1469 -208 90 132 240 740 484 420 233 394 -154 -412 -390 -443 -74 196 653 454 596 219 -23 -254 -365
1490 -365 -462 -332 -209 67 241 313 265 182 122 10 -29 -129 -297 -328 -292 -265 -145 -44 124 248 362 342 230
1513 230 -61 -356 -445 -480 -356 -137 74 276 457 458 386 94 -215 -395 -462 -411 -240 -61 144 303 486 441 261
1536B61j66k47r4oQ0N3L0J20J07P8K6M6j41l4k5j52j24j30lR5K26J72J44P8L3
1561D27j68k31k69j48r4J18K37K11K73O7N6j80j81k51j54r1L0J78J59J60j5M8
1583A82l1j44Q1n2k8j19j25K3k7J7P8J92K14J72j1j81j88k12j89q1rK69J67K27
1607B25J60P5j01k88j80p6p6QR2R9J85J01L5nm9j40k0r1j9j31l6M3J15Q1J15J05
1633B27K7M5j31n4k74j69p8R5J52J70J91M4M8Lj04j46j62j75Mk8J47J32J14J37
1657B15j5Q8j23j61j59p6MK3R5O1J11j2J25J8K4r1j20m7pj85m1J22M4K02J29N6
1683B80L2j06r0j87j51n0k3P4K29J52J06O9o2q5j98j33j05R5M3KJ18O0P6j7L6
1708A65j6q1K8r2j23p0l1K1J00J25O3J46P5m7j55j85j42o9l7Q5K30Q9J71K8Kp0
$$ plain form
1536 261 95 -152 -246 -252 -172 -119 -89 31 138 216 242 288 147 113 88 -64 -188 -318 -321 -226 0 172 316 394 427
1561 427 259 28 -241 -389 -483 -365 -128 83 356 423 479 299 118 -133 -287 -378 -348 -170 -11 149 134 182
1583 182 151 7 88 36 8 -111 -236 -213 -240 -223 -145 47 261 433 422 241 53 -159 -348 -429 -438 -169 -2 225
1607 225 385 460 359 71 -109 -185 -261 -253 -161 -62 123 224 259 254 205 65 45 -46 -65 -196 -232 -189 -74 7 122 227
1633 227 254 299 168 114 -160 -329 -407 -312 -160 10 201 245 293 296 192 46 -116 -291 -287 -315 -168 -36 78 215
1657 215 200 288 165 4 -155 -231 -227 -204 -109 -48 63 51 176 194 218 127 7 -40 -47 -232 -273 -151 -107 95 224 280
1683 280 312 206 116 -71 -222 -272 -295 -221 8 160 266 335 273 188 -10 -143 -248 -153 -110 -108 10 70 146 129 165
1708 165 149 68 96 4 -119 -189 -220 -199 -99 26 89 235 310 263 108 -77 -219 -288 -325 -240 -10 79 250 278 280 210
1734B10k55r5j09n7J25R0J47K3K5R1q2l4m2K6l9j12K5r3k0O7J28N7J22O0L1j25
1760A64j02j75j56k5J5J28K12J44J19n1j02j04o6j26j52O0M2J67P7J17Mpp9k0
1784H4r8m4j12%R9n1R4J1P4L1R8p8Ml9j00j25k9m4J18R5O5J63O6m6j16j44j23
1811a47j21L3O8P1J40J49O3p5q0j4j52l8lm1N2O3N4j3J12m4J6j0L0k4q0q4j55
1838b30L7N5K5J35K75o3o3M1r2k00j35j12J50Q8J28J09j0O8p5j31n0j07j9J9O9
1863h8O7mM1L7k4J01Lj0j37M1j34k9k8j8J60M7J31O2J4m2j93p7k0p5j3j2J87J32
1891A19K6N2k6p8q2q2l6k8l9J09O9Q1o3P6Nl6K9p3n7K7j14l0N4P8N7K6R8Qk0q4
1921F6j09j9q0n4J16K8L7M2J32N1q9n8j20n0o6J8L1N8J22j3O3Rn2j16M9j07O8
$$ plain form
1734 210 -45 -140 -249 -306 -181 -91 56 79 104 195 113 79 37 63 24 -88 -63 -156 -176 -109 19 76 198 258 289 164
1760 164 62 -113 -269 -294 -279 -151 61 205 324 273 171 67 1 -125 -277 -217 -175 -8 69 186 190 183 104 84
1784 84 -14 -58 -170 -170 -71 -122 -28 -17 57 88 186 108 112 73 -27 -152 -181 -225 -107 -12 53 216 282 236 120 -24 -147
1811 -147 -268 -235 -167 -96 44 193 256 181 101 87 -65 -103 -106 -147 -95 -32 22 9 121 77 93 83 113 89 9 -75 -230
1838 -230 -193 -138 -113 22 297 234 171 212 120 -80 -215 -327 -177 -89 39 148 138 206 131 0 -50 -157 -176 -157 -88
1863 -88 -21 -25 16 53 29 130 133 123 -14 27 -107 -136 -164 -182 -22 25 156 218 232 190 -3 -80 -100 -175 -188 -200 -13 119
1891 119 145 197 171 93 11 -71 -107 -135 -174 -65 4 85 22 98 103 67 96 23 -34 -7 -121 -151 -97 -19 38 64 162 170 150 66
1921 66 -43 -62 -142 -196 -80 -52 -15 27 159 210 121 63 -57 -107 -173 -155 -124 -66 56 43 106 115 63 -53 -4 -111 -43
1948d3j2J8J1l8O1L6R3k4opm2p2n2k4n3OJ36Q2J22QPj15l9j69q3L7J05j1J52p
1978G7K9N3r4o8l6o5L8m0P7J7R3n7L9k2M1mKm1n9q5J15k04J08PJ64j9J04l9P3
2007B04k00j24J06k71N4J20J02l52L14J55q8j45J2n9P4l53N27q2J43j71R2L31
2029C89m32L32J53l73p5P7j52pj51K02L7O2O6j17Q9p6q8m8L3m3O0MM4P1O2o4L9
2056I4j02Pj25L1j0O2P6j1R4m2k9jm7n3Qmj8jP0o7N4P8K8mOm5l3Nr1J2m3K8Q9
2089A6R3M0on9p0l9m5n8L0O0P1MM2O8q9k3rm4k9J7K2n6L1M1J3K4P%M5K8j46K1
2121@p8kL4L4N1oP6Nj2n4q9n1J1K9L2P3J1MJ3j2l4l1po5k0L6J8K1P7p8K1O1qk0
2155D0Ok0k1l2nl1N0m0J12Rm4Q7l4p8Pn4J5n0Q2O7k1Pk0L6p2P8j08n1mQ4m2Q6
$$ plain form
1948 -43 -55 -37 -26 -64 -3 33 126 102 96 89 47 -25 -77 -101 -154 -148 -12 70 192 200 207 92 53 -116 -199 -162 -57 -68 84 77
1978 77 106 159 65 -3 -39 -104 -66 -106 -29 -12 81 24 63 41 82 78 80 39 -20 -105 10 -194 -86 -79 85 66 170 131 204
2007 204 4 -120 -14 -285 -231 -111 -9 -361 -47 108 20 -125 -113 -172 -98 -451 76 -6 137 -34 58 389
2029 389 -43 289 442 69 -6 71 -81 -88 -239 -37 0 62 128 11 100 24 -64 -112 -79 -122 -62 -58 -14 57 119 55 94
2056 94 -8 -1 -126 -95 -105 -43 33 22 116 74 45 44 -3 -56 -48 -52 -70 -71 -1 -68 -14 64 92 88 94 49 16 21 -70 -58 -101 -73 16
2089 16 109 149 143 84 14 -25 -70 -128 -98 -38 33 37 79 147 58 35 26 -18 -47 -30 -8 -64 -33 8 21 45 52 52 97 125 -21 0
2121 0 -78 -80 -46 -12 39 33 109 114 102 48 -41 -92 -81 -52 -20 53 64 68 81 69 35 4 -3 -68 -88 -52 -34 -13 64 -14 7 68 60 40
2155 40 46 26 5 -27 -32 -63 -13 -53 59 68 24 111 77 -1 6 -48 -33 -83 -1 66 45 52 32 68 -4 74 -34 -85 -89 -5 -47 39
2187C9l8L2m4RpL2m5M8k8o0L0K8o9J32m3P0No3K3j00K1m3J8J5LO3N1Nj8l8Mo7
2219c5Pm8P0l6R3n5N4qml4k5J9pj4j6J9n4Q7m2M0O7J2jp4k1n4j0P9n9J3K0P0j2
2252D1kK4m8j7p4O7j7l7L1P1l5Q4m2j8k3nM3j01K0K0J2J7PkL9n6MK4m6nL0k2p5
2285i1P8J1oL8N4j0l1p9rQKj7K0LL7rL9M3n9K0n5l5JO3k0L4K3k1m9j7N9J4jm6
2319hk1k1O0n5N5M9n8N2j6j8okk4k5k7O6l7O4kJ2k3k6J8n8k4M5PQ7o7O2o5N1k23
2352a78J55l0p0L20j15j87l33J09K52K90m78M63J49Qm51j13P3O5N7rJ7M1KK7m9
2377A5mL1m2j0k3j4kN3N7n3P7q9J06n5j5k0j9Om2K9j0nJ2Q7k8pj9jom3l1K9nq
2411d9Q5j8L6pL1n5j3m4L3J1KK9loMk1K2Oj32J23l4Jj6k2J1K1N8p9j0R6n6j6M0
$$ plain form
2187 39 1 33 -11 -2 -9 23 -22 26 -2 -62 -32 -4 -73 59 16 86 91 28 51 -49 -28 -71 -53 -38 -35 28 79 84 66 28 32 -35
2219 -35 -28 -76 -6 -42 51 -4 50 42 38 4 -21 -2 -9 -23 -39 -20 -74 13 -29 11 78 90 89 15 -6 -60 -70 9 -50 -37 -17 53 41
2252 41 39 63 15 -2 -76 -9 -26 -63 -32 39 4 88 46 28 5 0 43 -58 -38 -18 -6 11 18 16 55 -1 3 27 -19 -24 6 -16 -91
2285 -91 -13 -2 -8 30 84 74 43 -36 -45 -37 -35 -52 -32 -29 8 -1 38 81 22 42 -13 -48 -47 16 -4 30 53 32 -17 -34 25 39 38 -8
2319 -8 -29 -50 10 -45 10 59 1 53 37 19 13 11 -13 -38 -65 1 -36 28 26 38 15 -11 7 -51 -75 -30 -23 64 -3 59 -6 45 -178
2352 -178 -23 -53 -123 197 82 -105 -438 -329 -77 213 -265 198 347 355 -96 -209 -136 -71 -14 -23 -6 35 37 64 15
2377 15 11 42 0 -10 -33 -47 -49 4 61 8 85 -4 102 47 32 12 -7 -1 -43 -14 -24 -29 -17 70 42 35 16 15 9 -34 -65 -36 -41 -49
2411 -49 36 18 54 47 78 23 10 -34 -1 10 12 41 38 32 36 15 37 43 -89 34 0 1 -15 -37 -26 -5 53 -26 -36 60 4 -12 28
2444B8k0j6LOL2J0j1j2K7L3j58R0l5M7o1lJ28j01K5K9n3kJ1m0JK2J5kO5o4rL5
2476B0%L8n8m1P6k3l8L3Lp%MO3r3K9j1J6l1k5K7M3kO9o0nmp6P3m0M2o0K0M6o2
2510c4O4Ln4j9O0Mj3pJ1p8J02q7L7J9l5M5j7Q1m2o4j7K3j1K4j8L4O9n4lR6j35
2541a6j8K7j6j0M7l6J08r5K4N7q8K5K2p2J09q1J5K0l2j8Q7n1qK3nk4J5m3%N5l4
2572a3jJ2N6j2l2kM5o8Ql2%O6p9N5N2n2N2m9r8L2L3jK3l8nJ4Q2n1J6J0Ok3nj7
2606a6k3j7L0m9P2L5k0N2p6J3%o0PL1k7M4m2J29l2Ol5jl3k0L6p1Q0k3L9j8l1L8
2638A8k0J0N6l3n5j4K9l6m2R1K5k6M4m3Q4n4m9j8q0J46l5J9qK4J1k9K8m9j1J9
2668Bo7L5K1K6QM1n3l8K2OL6r5J0R7j13O6o9P6K6Rj4M4n0Kn8k3M7r7J49K5k1j8
$$ plain form
2444 28 8 -8 -5 1 33 43 32 20 47 80 -78 12 -23 24 -37 -40 88 -13 12 41 -12 -14 -3 -43 -42 -20 -5 -7 58 -6 -15 20
2476 20 20 58 0 -41 35 12 -26 7 10 3 3 7 70 -23 6 -5 11 -20 -45 -18 25 23 92 32 27 23 -53 20 -20 22 -38 -18 28 -34
2510 -34 30 33 -21 -40 20 24 11 4 15 -63 39 -48 -11 8 -27 18 1 82 40 -24 -41 -18 -29 -5 -23 11 80 26 23 119 -16
2541 -16 -34 -7 -23 -33 14 -22 86 -9 15 72 -16 9 31 -41 68 -13 2 22 -10 -28 59 8 0 23 18 -6 9 -34 -34 21 -13
2572 -13 -14 -2 54 42 10 8 53 -15 -7 -39 -39 27 -52 3 55 3 55 6 -92 -60 -27 -28 -5 -43 -48 -34 48 -3 13 23 29 6 1 -16
2606 -16 -39 -56 -26 -75 -3 32 12 64 -12 1 1 -59 -52 -21 -48 -4 -46 83 51 57 22 21 -12 -32 4 -67 13 -10 29 11 -20 18
2638 18 -2 8 64 31 -24 -38 -9 -45 -87 4 29 3 47 4 88 34 -15 -33 -113 33 -2 17 9 33 44 15 43 -6 -17 2
2668 2 -65 -30 -9 17 25 66 13 -25 -3 3 39 -56 -46 51 -62 4 -65 11 37 46 32 76 26 28 -30 -53 -6 -103 46 71 50 32
2700C2mk3O6r2nJ2J2L7l9L3L1l4P5j49P2mk2L6o2NM0J4K8pp4P3qNn3k9k7M3%l2
2734e0L8L4J4m5P2j12N2k2qrJ1N7%lj9Qj3k2L1r8Q5l9J0O5j00J10KNp5O8p2J9
2766fOn4J3O8j04L7L7K5j7L5l7On5L4l3M4j6O7Mj7k6J1n8K3k2k2J4L5J0P1m1k7
2798Ek0K6K8n2K1J6oJq2O5l6N1J53j08Nj02L7Ro0J6M0m3j1J5L7K4J5n5nj1k1L4
2830a4l4M4L3K9J8k6qk1J0k1O3l5p5K6K7Jj5L4k8K6J4p0N9o9m4O3k5l3M0Q4j8
2861C5jk0l3n9K2O0n6M7KL2K3P2r7K6q9M9n5M1j6k8J14l6j6pj6M6o8M7n5J3k3
2892d6K6M2p3P2n1N4K1L4l9l3j4l9k6J3J07J2j6l0L4q4M4RL5p2K9J7L6r7N4OL7
2923F2jr1K6L0j2o4O5n9L3l3Q1o7R4J0j02L9k7l3NN4l2J17p8J9L1o4l5n2Q9p8
$$ plain form
2700 32 28 5 71 -21 -26 -14 -2 35 -4 29 60 26 101 -48 24 20 -2 34 -28 -23 17 31 59 52 -22 51 43 48 -5 -34 -61 -18 -18 -50
2734 -50 -12 22 36 -9 63 -49 3 -19 -27 -36 -25 32 32 29 10 18 5 -17 14 -84 1 -38 -28 37 -63 47 49 54 -21 47 -25 -6
2766 -6 0 -54 -41 27 -77 -40 -3 22 5 40 3 9 -46 -12 -45 -1 -17 50 54 37 11 22 -36 -13 -35 -57 -43 -8 2 73 32 5
2798 5 -15 11 39 -13 8 24 18 19 -63 2 -34 17 170 62 67 -35 2 11 -49 -33 7 -36 -47 -32 5 29 44 -11 -16 -27 -48 -14
2830 -14 -48 -4 29 58 76 50 42 21 31 10 73 38 -37 -11 16 17 2 36 8 34 48 -22 37 -32 -76 -13 -38 -71 -31 53 35
2861 35 34 14 -19 -78 -56 4 -52 -5 -3 29 52 124 27 53 -36 13 -42 -1 -17 -45 69 33 17 10 -6 40 -28 19 -36 -23 -46
2892 -46 -20 22 -51 21 -30 24 45 79 40 7 -7 -46 -72 -59 48 60 44 14 48 -36 8 17 52 -20 9 26 62 -35 19 25 62
2923 62 61 -30 -4 26 14 -50 15 -44 -11 -44 37 -30 64 74 -28 11 -16 -49 -44 10 -22 95 17 36 67 3 -32 -84 5 -73
2953g3J01Pp8P9J1mJ4K1m8k7rOL2n5k1O4n9P9KJ4K9n7J1k7n1K1l3L0PK1Q3j06
2985a6R1j3m5p8m0N4J4L0mN6k1m1N1Kom4kk7N0m0L5J0OK6k5j8M4n2k8J5j6l0M3
3018a9l3Q7P5n2l1K8q5J3o4L5Rm4J19J4J2n2J1n6L9j2k5K5J1LJ5q0P9JL4j3J2
3049E6n8k7K7n0J15j27P1O8m3J5j7J8n9J7l1n5O6M5Pn3L3M6n5J5l9no3M0J4j6
3079d5Q0K3l8O1o7M9l0n8O0o1J0j8j7L4oQ9qn0j2P9q7JL6j0J6l4K8LJ5m6J2l1
3111b2j3pJ9J1J5m5P3k8K9m1lJK0j8k8K2Mj6K6jQ3k0l0P5q5Mm1l7J2kL7%k6J37
3145A05m1j3o3o8N3J3l8O1JJ4O4m8k3K0kn8J6K6k8J0k1j3L2O4n9N5Pl3k8k9l7
3176f1pM6K7K8K7M8qPl3l8j08K9K8j8L2K0K5K5m0j8lm9M1j0M4q6L4N2m6N5MlJ4
$$ plain form
2953 -73 28 35 -43 36 47 43 57 78 30 3 -6 0 32 -23 -44 20 -39 40 42 56 85 28 39 12 -39 -18 -51 -21 -14 7 90 -16
2985 -16 75 62 17 -61 -101 -47 -33 -3 -7 49 28 -13 38 40 34 -10 -12 -39 11 -29 6 16 22 48 23 5 49 -3 -31 -16 -32 -62 -19
3018 -19 -52 35 110 58 27 55 -30 -17 -81 -46 -37 -81 38 52 64 12 23 -33 6 -6 -31 -6 5 8 23 -57 22 23 57 44 56
3049 56 -2 -29 -2 -52 63 -64 7 75 32 47 30 48 -11 6 -25 -80 -14 31 38 -15 18 64 9 24 -15 -20 -83 -43 -29 -45
3079 -45 35 58 20 81 14 63 33 -25 35 -26 -16 -34 -51 -17 -23 66 58 8 -4 75 -12 -11 25 15 31 -3 25 28 43 -3 9 -22
3111 -22 -35 -42 -23 -12 3 -42 31 3 32 -9 -12 -11 9 -9 -37 -15 -11 -27 -1 -2 81 61 31 106 21 25 -16 -53 -41 -43 -6 -6 -32 105
3145 105 64 51 -12 -80 -27 -14 -52 9 10 24 88 40 17 37 35 -23 -7 19 -9 1 -20 -33 -1 63 4 59 66 33 5 -24 -61
3176 -61 -68 -22 5 33 60 108 100 107 74 36 -72 -43 -15 -33 -1 19 44 69 29 11 8 -41 0 -10 34 -52 -18 34 -12 43 47 44 58
3209E8J0m1k0l4l6M7K4M7o8J05j2rr8QM0l6l2MM6J0L6j6J1p1J18j22K6q6J6J27
3239E2j57J57j47J13j03J32j21Mq6OQ4J29k11J64m9O3J2K1k9J3m4J9k13P9PJ49
3265D4N7o7J1k5K8J6j14k6L3K7k0M7Pk9O8l0Mq2M1Nl1P4J0q2K3j0j8M1L3k5N4
3296F4j9Mo3J6m2J8J3N5rL7J0o6o4M6m8J7M0l9J0L4K8J2j13L5M1Kj25J24k9lK7
3327A3J31l44K95j88M9J37j60R2K2o7j01J33l5Q2l7MN1p8k7K6m3qPM1L9L8n3j8
3355Ak0K9r5P0J55l9j57P3o8kL0J09r0O7l4l4MM8j5m2p3j8J08K5lmM1o5oL1p5
3386d9pJ0R5l7O6nl4L0p2k3J8l1M9o7J04l0m6L8m6J7kJ7L4m2q9K05j87n6N6N4
3416c0K45k44k8j62L35l72J61P1K37l6n33N47k13k72L28K82l11L3N1o0m78K71
$$ plain form
3209 58 68 27 7 -27 -63 -16 8 55 -13 92 80 71 -27 -19 21 -15 -47 -43 3 13 49 33 44 -27 91 -31 -5 -91 -75 52
3239 52 -105 52 -95 18 -85 47 -74 -70 -156 -150 -66 63 -148 16 -33 30 42 63 34 47 3 22 -191 -112 -105 44
3265 44 101 34 45 20 48 64 -50 -76 -43 -16 -36 11 18 -11 57 27 31 -51 -10 -5 -36 38 48 -34 -11 -21 -39 2 35 10 64
3296 64 45 49 -14 2 -40 -22 -9 46 37 74 84 18 -46 0 -48 -31 9 -30 -20 14 42 54 -59 -24 17 19 -106 18 -11 -14 13
3327 13 144 -200 95 -93 -44 93 -67 25 47 -20 -121 12 -23 59 22 26 77 -1 -28 -2 -45 -53 -46 -5 34 72 19 1
3355 1 -19 10 -85 -15 140 101 -56 17 -51 -53 -23 86 -4 63 29 -5 -1 47 32 -10 -83 -101 7 32 29 25 66 1 -5 26 -49
3386 -49 -56 -46 49 12 78 73 39 69 -3 -26 -8 -39 10 -57 47 17 -29 9 -37 -20 -22 -5 29 -13 -102 103 -84 -140 -84 -30
3416 -30 215 -29 -57 -219 116 -256 -95 -24 213 177 -356 191 -22 -294 34 316 5 38 89 29 -449 -178
3438a78K20m0j21J21J17O5k34L8J7K81j25j93N1PJ19r8m8m0o0L2k7J95q3J61k92
3463a15r2K98j35j16P8R7j34K25k55K70q2K9n7J48m1Q7r1l19n5K42r4j35K38L50
3487C41n9m2o18M61Q6k12L07k25K00j53ol12k7K31p0J28q8Q2o2k6l38M21jnn2
3512c9j55K53k98K2J53l01K75l6J70r7m9J82m7J88j08j02L9P3J21k03J19j90j12
3535a42J02P1j27l6K08k25K04n1J0J03k23o7M29l74J80j96K40k2m3q0Nj13k6M91
3559C18k37j19K23j74n1J09j29K1j16J75J39j70K1O6j67J63j45J03j15P0J01m2
3581D4j48l6O4L1K7j84J60J41k2k6k98J93K2K09m0k14J73pk85mJ17K60k62J27
3605D2J63k14L46k59J33l96P7M2J3J07j82M6O9K8L3l02K42j68l12M84n3j06N5
$$ plain form
3438 -178 42 2 -119 2 119 184 -50 -12 5 286 161 -32 19 26 145 47 -1 -41 -101 -69 -96 99 16 177 -115
3463 -115 -207 91 -44 -160 -82 15 -119 106 -149 121 39 68 11 159 118 205 114 -205 -260 -18 -112 -247 -9 341
3487 341 282 240 -378 83 169 -43 264 39 239 86 80 -232 -259 -28 -98 30 -58 24 -38 -64 -402 19 18 13 -39
3512 -39 -194 59 -239 -217 -64 -365 -90 -126 44 -53 -102 80 33 221 113 11 50 123 244 41 160 -30 -142
3535 -142 -40 31 -96 -132 76 -149 55 4 14 117 -106 -173 256 -118 62 -134 106 84 41 -39 -34 -147 -173 318
3559 318 81 -38 185 11 -40 69 -60 -39 -155 20 159 -11 10 76 -91 72 -73 30 -85 -15 86 44
3581 44 -104 -140 -76 -45 -18 -202 -42 99 77 51 -247 -54 -32 177 137 -77 96 89 -196 -200 -83 177 -85 42
3605 42 205 -9 337 78 211 -185 -108 -66 -53 54 -128 -82 -13 15 48 -254 -12 -180 -492 -8 -61 -167 -112
3628a12J87M3k99L10j3j12j98K06K36n84K56j76K53j53K02J25j27L8P5J24m92
3649b11K26J5J43m45L10j4r9Q3J01k7K06l75n5K4J27j26L5J93j17p9J15o7L8p7
3673g6J86j06L2j41J27o1J6P1j06J14k63K48K6l6r8Q4l7KO6r8J13r5N0L4k76L34
3699A10j17L0R2j50J81j70j22J37j40M8N6J00O9q3M0nN0j38Q0K22l99l1Q6L9k48
3724b63L37K1l10K62O3j58K16k08L12m36l7L07k04J47Mj2j57L2r5K19p1L2O5j03
3748c7m2k0L01p6j83J92j44R5j22j34K75m5j31J09K7p2m8N6k11Q6N9J91k60l4
3772a68M09j57l2MJ74m0j88R0J1j58r2K03J00j29N1K4k7j67K3O5j6Ll0j3N1J61
3798A52k11J58j32k8J83l43L8J93k09R4R3j46K00j89L12j33L5j20JpK52o3l25
$$ plain form
3628 -112 75 118 -181 129 116 4 -194 12 248 -336 -80 -256 -3 -156 46 171 44 82 157 281 -211
3649 -211 15 30 173 -272 38 24 -75 8 109 82 288 -87 -142 -118 9 -117 -82 111 -6 -85 30 -37 1 -76
3673 -76 110 4 36 -105 22 -39 -23 48 -58 56 -207 41 67 31 -67 17 -20 -18 48 -50 63 -32 18 52 -224 110
3699 110 -7 23 115 -35 146 -24 -146 -9 -149 -101 -45 55 124 41 81 76 126 -12 68 290 -109 -140 -54 -15 -263
3724 -263 74 95 -215 47 110 -48 168 -40 272 -164 -201 106 -98 49 53 41 -116 -84 -179 40 -31 1 66 -37
3748 -37 -79 -99 202 126 -57 135 -9 86 -36 -170 105 60 -71 38 65 -7 -55 1 -210 -124 -65 126 -134 -168
3772 -168 241 84 52 56 230 190 2 92 103 -55 -147 56 156 27 78 102 75 -92 -69 -4 -20 -17 -47 -60 -9 152
3798 152 -59 99 -33 -61 122 -221 -183 10 -199 -105 -12 -158 42 -147 165 32 67 -53 -52 -59 193 130 -195
3821a95J02o3K19M7j72J80Jl73K10p4k3J62R0r1m5P3q2p3K12j14k1oL8J5o0K4
3847a9L2K4NJ0l9J4n4L7no0J00m1Nj0K9m8O9n9%k5L9j8J4PMlK8p5K8ROo5M0k5
3881d6J9K8J4J8k3L2j8l2LP5k1k4n2P7k6N6q0O8m5k5r1O4M9l7m2J46j34J11n2
3910A2J2ork2k4k5J6N3p4R6k7J4n0L9k0r6J09k8k0R1k4Lj09K3J44l5o6k4P8P1
3940A02j35J32j60j42j7J63N4L0l08p1K70J37l1j54K74j78pK94m10L28j87j88
3962b04K85p2j60P9jK54j10l33K07k37J68N25n74M32l7l43j6O02n15l01M02j31
3984h0K36Q9j31l41J70J73k25N4o7K7J24k1l27L33L79l78k82K2O00p20K07k3M40
4007B59j78l07N32j69J81k82J68l63J58j51o0J54K24j13K37l67j16J13K55k95
$$ plain form
3821 -195 -93 -156 63 110 -62 118 119 -254 -44 -118 -141 21 111 20 -25 48 -34 -107 105 -9 -30 -36 2 17 -43 -19
3847 -19 13 37 42 52 13 27 -27 10 5 -55 45 4 9 -1 28 -20 49 -10 -10 -35 4 -14 0 7 11 8 36 -39 -11 -2 4 -61 -21 -46
3881 -46 -27 1 15 33 10 42 24 -8 -5 70 49 25 -27 50 24 80 0 68 23 -2 -93 -29 20 -17 -59 87 -47 64 12
3910 12 24 18 9 -13 -37 -62 -46 7 -67 29 2 16 -34 5 -15 -111 -2 -30 -50 41 17 20 -89 -66 78 43 -23 -47 31 102
3940 102 -33 99 -61 -203 -220 -57 -3 27 -281 -352 -82 55 24 -130 144 -34 -41 253 -157 171 -16 -204
3962 -204 81 9 -151 -72 -73 181 71 -262 -55 -292 -124 401 -173 259 222 -121 -137 465 -50 -351 51 -80
3984 -80 156 245 114 -227 -57 116 -109 -55 -122 -95 29 8 -319 14 393 15 -267 -245 355 -365 -158 -181 259
4007 259 81 -226 306 137 318 36 204 -159 -1 -152 -212 -58 166 53 290 -77 -193 -80 175 -120
4027a20M4m1K66N1j10q9J13k5q6j37JkJ71j08J15j28M6k4r2M95m67o7L36j94l
4052e5k5J49k31L35k54O5J22p9j37K37k14J37j67N3K76j56R4j60m8NQ7o9Q1L8
4076H4n4m0L8J2K3l2J1o0J4l6OM7m1qj1Q2p0Q5p5N4m6J6J9l9L8o8L6KkK5M1n4
4108cJ5N4q0O6j80O7J45k48L83j70j35m0J15O3j61K52j16J20l08N2J67Q3k30j13
4132b02k2L04j91%K23K77j47m70P40l36o8kK71l16l05L62Q5m47M44o7k99K83k9
4155H8N8j95L90m01J37M9j10M10m56j93M71n48K15L07p9m27J76j65P07p35L66
4176F5j99k0J81oj56L12k38L40l3k57o5J17j9j75j00K64N2k60M94j76j0J93K2
4199C26J93n67K9j81J72Q3r1o0pK24l06L31l65Q9L36k70k14M67j94K3o1j05L18
$$ plain form
4027 -120 -76 -117 149 200 90 1 114 89 3 -134 -133 -135 36 -72 43 -85 -39 -63 -155 340 -127 -194 142 -52 -55
4052 -55 -80 69 -162 173 -81 -16 106 27 -110 127 -87 50 -117 -64 212 56 150 -10 -58 -53 34 -35 46 84
4076 84 30 -10 28 40 63 31 42 -18 -4 -40 -34 13 -28 -36 -47 35 -35 50 -25 29 -17 -1 18 -21 17 -51 -15 -13 -15 10 51 -3
4108 -3 12 66 -14 52 -128 -61 84 -164 219 49 -86 -126 -11 52 -109 143 27 147 -161 -109 58 141 -89 -202
4132 -202 -224 80 -111 -111 112 389 242 -228 512 176 108 106 377 61 -244 118 203 -244 200 133 -166 117 88
4155 88 146 -49 341 -60 77 126 16 426 -30 -223 248 -300 -85 222 143 -284 -108 -273 434 -301 65
4176 65 -134 -154 27 21 -135 177 -61 279 246 -11 -76 41 22 -153 -253 11 63 -197 297 121 111 304 326
4199 326 519 -48 -19 -200 -28 55 -36 -96 -103 121 -185 146 -219 -130 206 -64 -278 189 -5 18 -43 -148 170
4222A70k06J89k27P3k20K05R7k23L1M6J41k1O8j16J0O7q2P3j75J06k4l4L1j70
4246a91K80q0m1M3j4K3L7J24j28j32l8J92M5Q6j50j07J23j35J41M6k16O9J01j14
4270c6J53nk5J00l93J31J72j46l4J5J12j05N2n6R9k20K18QJ4J73J91n74P6j76
4294b56N14k13j09o5k1J9J87l6O2j31j12M81m26R7M22n78K67J33l40J07J91l40
4316a47j71J71j28J93K04k24L5M9k2K75l21Q%J09j43o4K70j11l9n7J5L3Q3j2j2
4341fJ6O5j2L8m1k6o3k9R7n6m6Q6N4p6jK1m1jP1o7k1kN1k8kJ7O7j24J04p3K7M4
4373D3j10Q2m3L0J14j56m8K05j30M8J00l9k0j31P3P5j06J6j12K14k20J16l5r3
4397a27L3qK05j20m4K21j20j05J08M3k18J89j55L82j03j60j45O5J88j69K4k11
$$ plain form
4222 170 -36 153 -74 -1 -221 -16 81 -142 -111 -65 76 55 123 7 17 84 2 75 -100 6 -18 -52 -21 -191
4246 -191 89 9 -32 11 -3 20 57 181 53 -79 -117 75 120 206 56 -51 72 -63 78 124 -92 -23 78 -36
4270 -36 117 112 87 187 -206 -75 97 -49 -83 -68 44 -61 -9 -65 34 -186 32 40 54 227 418 -156 -80 -256
4294 -256 258 45 -64 -129 -150 -131 56 20 82 -49 -161 320 -106 -9 413 -165 102 235 -105 2 193 -147
4316 -147 -318 -147 -275 -82 122 -102 -67 -18 -40 235 -86 -78 -78 31 -112 -176 94 -17 -56 -113 -98 -65 18 6 -6
4341 -6 10 75 63 101 60 34 -29 -58 39 -17 -63 23 77 1 0 21 -20 -21 50 -17 -38 -40 11 -17 -19 -2 65 -59 45 -28 -1 43
4373 43 -67 15 -28 2 116 -40 -88 117 -13 35 135 96 76 -55 18 93 -13 3 -109 105 -115 1 -34 -127
4397 -127 -94 -102 103 -17 -61 160 40 -65 43 86 -132 57 -98 284 181 21 -124 -59 129 -40 -16 -227
4419b27J02m0L33o6O4k22j36L42l07Q4K09k72J38j14k1J41n9P6j8l7R4l5m2Nj9
4444b7Mm8J28k5j6m3K9n0O9m7L9L6J3l0m3J2m1l7P3jLO6o5nK4jk9MQj4J5pk4K7
4478cO0p4rJ8K4k1pmJ6J18j40M8l1p2R6M0l26J33J65n0n0K78m92K21J3K03j96
4505d2J20l1m54L72j75J72jK42j38k06Q6O2%l9O6q5J0J61k12L8K8J72r4p8M5K2
4531D1p7O8L5p0N1n9qK2L5j0Q3o3K4M6k28J59k9o0kQJ75j65J03j33L37k96J8j90
4559a85K64j32q3km5K21M11o25J20J8J43M3K81o4l91m6J81k29j6L9m6j04q1J72
4583a56J52L8l83J94k59K66K18l28O0L41l49J32P5k69j28P24l34N2l25L69k06
4604a16P5J78k28J63p0%r1J30n2L5l0o8R7Jn6KJ0Rl1L0K2pK0k1L5K7n3p0J4K2
$$ plain form
4419 -227 -125 -165 168 102 166 -56 -192 150 -157 -73 136 -136 2 -112 -133 8 -51 25 7 -30 64 29 -13 -8 -27
4444 -27 -23 -71 57 32 16 -27 2 -48 21 -26 13 49 62 32 -11 1 -40 -77 -4 -5 -2 64 -1 -6 18 17 -12 -8 0 -14 1 -6 -30 -3
4478 -3 57 -17 -26 -8 16 -5 -12 -16 0 118 -22 26 -5 -77 19 59 -267 -134 31 -19 -69 209 -283 -62 -49 154 -42
4505 -42 78 47 -407 -35 -210 -38 -39 203 65 -141 -55 7 7 -32 34 -51 -41 120 -92 -54 -26 146 52 -26 19 41
4531 41 -36 32 67 -3 48 -11 -19 3 38 28 111 48 72 118 -110 49 20 -40 -42 -34 141 -24 79 -54 283 -13 5 -185
4559 -185 79 -53 -136 -138 -183 38 449 -176 -56 -38 105 148 429 365 -26 -72 109 -120 -136 -97 -143 -247 -328 -156
4583 -156 -4 34 -349 -155 -414 -148 70 -258 -198 143 -206 -74 1 -268 -396 328 -6 46 -279 90 -116
4604 -116 -41 137 -91 72 2 2 -89 41 -11 24 -6 -74 23 24 -32 -30 -20 -11 -42 -12 10 3 23 2 37 64 11 -59 -45 -23
4634b3L1o6P4j5l3N3k4M1l7m3J4j6N2J0l4oM5m0O6k0k6KJ4m4N1n4K8N0p5M8k6
4665cN6j2l4pM9n4Qm2P0k5MRl6nM0k5olK3M1J2n2j7L4Mk4M7o2K6o3M2L7l3lk6
4700c0K3K3J9k4j8k0N8LQml4k6L8k8N1o0M9mk9j9JJ3oqN4M5j21K7J4k3j2K3O3
4733D6j5m3P0n0Kk2lK9J1Lq7M7o6Q2k1ML8k3M3l7k2M9q6N1qLj2O1q6P6m2K2m9
4766c5Om5N4j9NN6m3P6j5k7l4K6J8M6o0M0m2rl2O5n4J9N3j2L0p5K8q7O6M8j17
4797g0J33K5j72N7N6r4m5Q3MR9j06O2J04j54k9L4l1J09o5k09J41K1J13m5l6M6
4823C1j6m2J2l5Q7Rr1P9K2p2J2R8p8Oj1p2O6l6JK2p6J09M7j64P1k8N8r0J41q5
4853b5N9j88J34k2m7J02j00%J15J28p7n3J47k27K67j53P1l31K49J05j85j28mO3
$$ plain form
4634 -23 8 -58 16 1 -32 21 -3 38 1 -42 -28 -44 8 18 -16 -22 23 -17 49 29 3 5 19 -25 26 -28 0 50 -25 23 -3
4665 -3 53 41 7 0 49 -5 3 -39 31 6 10 19 -17 -22 18 -7 -13 -16 7 48 60 8 -9 25 29 5 52 -10 16 -47 -5 32 -1 -4 -30
4700 -30 -7 16 35 11 -7 -27 31 34 42 38 4 -22 16 -12 39 -21 28 24 -5 -24 -23 -10 -16 -24 30 75 -46 -19 -5 -28 -40 -17 46
4733 46 31 -12 58 8 10 -12 -15 14 25 28 -59 -12 -78 4 -17 -13 25 2 45 8 -14 35 -51 0 -8 -5 -17 44 -42 34 -8 14 -35
4766 -35 -29 -74 -20 -39 -34 22 -21 55 40 13 -21 5 23 69 9 49 7 -2 -34 31 -23 -4 49 37 67 -8 20 -67 -1 47 -70
4797 -70 63 88 -84 -27 29 -65 -110 -27 -23 76 -30 32 136 -18 -47 -13 -44 65 0 -209 -68 -47 66 21 -15 31
4823 31 15 -27 -15 -50 37 46 -45 34 56 -16 -4 94 16 22 11 -61 5 -31 -30 -8 -84 25 72 -92 -21 -49 9 -81 60 -25
4853 -25 34 -154 -20 -42 -89 13 -87 -87 28 156 79 26 173 -54 213 60 131 -200 49 154 -31 -159 -163 -100
4877a00M8j5P0J36k89K3K0K00j91J64j80J52L0m0o6k4N1r0K87l15n4K89l2J0j59
4902g5lJ4M5O2l4m0j5O7M4q5P3l1m8O5j6j6J9l5n0R8N7l6j35J70j00M6q5N3j66
4931a57r0J19J06K29j94N3j22l51J26L99p5j46r6L42q8o6J99L7n06K55J15n97
4953e08Q66k57m99L57J58j27Q3K1l5j18l5p0Q1J26J21l04lK91p2k88K2L34j11
4976C3j27m3K30m16M25J16k49M9m9L15k44l13M08m96K08P6P3r3P6J82k05j26Q7
4999h3K10n6n8n7m7K01j57Q7Q6p4k58L16o2m0%j01K7J67k18jR5Q0L15m29N1j02
5025a08R6K58q3k05J8j17R7K19j92l9J02n1Pk1Pj4N1kj0k2k1N7Mk5j6n2O7J5n
5054A5N0j03N4k9K1K3m0j3j8O2l1J8kJk9M0lJ5k6j7m3L5M9Np8M9mMJ5j1J0K2m6
$$ plain form
4877 -100 -52 -67 3 139 -150 -127 -107 93 -98 66 -114 38 68 28 -38 -62 -11 -101 186 -129 -183 106 74 84 -75
4902 -75 -78 -64 -19 43 9 -31 -46 21 65 -20 53 22 -26 39 23 7 26 -9 -59 39 96 60 -75 95 -5 41 -44 9 -157
4931 -157 -247 -128 -22 207 13 66 -56 -407 -281 118 43 -103 -199 143 55 -11 188 225 -281 -26 89 -508
4953 -508 358 101 -398 -41 117 -10 73 94 59 -59 -94 -164 -83 43 164 -140 -143 148 76 -212 -190 144 33
4976 33 -94 -137 93 -323 102 218 -31 18 -31 284 40 -273 135 -361 -153 -77 -4 -97 -21 161 -44 -170 -83
4999 -83 127 71 13 -44 -91 110 -47 40 126 52 -206 110 48 8 8 -93 -66 101 -117 -118 -23 57 372 -57 -6 -108
5025 -108 -12 246 163 -42 -24 -141 -44 175 -17 -56 46 -5 2 -19 -12 -26 25 23 13 -9 -30 27 31 6 -10 -62 5 20 15
5054 15 65 -38 16 -13 8 31 -9 -22 -40 22 -9 9 7 8 -21 19 16 31 5 -12 -55 -20 29 34 -44 5 1 5 20 9 19 41 -5
5087el6K3K7p1J47q2M4j07p5K36q8n2J7nO4lm9J5L7m3k1J15r7O3r1P6J39k77J38
5116C9j91lP7P2J60m88K11J34P9j96k6J22J38k22K3K64l10J25l02M32q0j09k92
5139c43K22K13R2o41J68P54n95J12j25j68j86O07j77j87J2N74p55N48j72l5K83
5160B01k55j45N80k99n9r2j5K35O7m1j0p9j06j31K42K9j66%J38o0K28j85j98J78
5184E7n4l4n2K46j36l1k01j28N14k86o5R6K48r8l26L46k58J22K39j28L87k6m26
5207Fo7J77k45Q3k56K57p2L90k25l32M2K73k8L41m10m8J46K75n92J71J05l58M2
5230c25M16j58K42q5k25J79P7N27q37Q5J22k6j1K18m02R6J50J99m23M17k21o4
5252d9k4J25K82m32MJ38k13L02m9j54J09Nk3k8j51J3L86j63m47N99j41rk84K01
$$ plain form
5087 -5 -41 -18 9 -62 85 3 47 -60 -135 101 13 -39 -22 -27 37 34 -15 0 37 -6 -27 88 -9 54 -37 39 178 -99 39
5116 39 -152 -155 -78 -6 154 -334 -123 11 90 -106 -132 -10 128 -94 -71 193 -117 8 -294 138 58 -51 -343
5139 -343 -121 92 184 -457 -289 465 -130 -18 -143 -311 -497 110 -67 -254 -242 332 -423 125 -47 -82 201
5160 201 -54 -199 381 82 23 -69 -84 151 218 177 167 88 -18 -149 93 122 -44 -44 94 34 262 77 -121 57
5184 57 3 -31 -83 163 27 -4 -205 -333 181 -105 -170 -74 174 76 -250 96 -162 -40 199 71 458 432 6
5207 6 -61 116 -129 -46 -302 -45 -117 273 48 -284 -242 31 3 344 -66 -114 32 307 -285 -114 -9 -367 -325
5230 -325 91 -67 175 90 -135 44 121 648 -189 -104 18 -8 -19 199 -203 -107 43 242 -181 236 15 -49
5252 -49 -73 52 334 -98 -94 44 -169 133 84 -70 39 44 21 -7 -158 -145 241 78 -369 230 89 80 -204 -3
5276crK08k12J97Nk63J01k98J58m6Q8K14N7j20j62pO1J54j17q8L01R1k21R4k92
5301a09J86l2L6J62k31J17q8j22J78o2J24Nl13mR1K09K7j24l7K26K4n00K72rj99
5326a73N7J93k46K74J73n09L60R3l29%J52l40M98o6m4k09J44Lp2J5LL4L5ooj3
5352B1L3nn8n1J04J8j33M3k0K4NL5J5rm5N3m4KN0l3j2Q9q9K9N1j00RqKM8N5j77
5384i8Q8MOK6k1p6J11l9k3K9kj8k6k1O7J1Jm6J3L7pj7m5J9Pl2PP1n4K3lJ8JJo9
5419e7P4pj1M1q3J82j67l0K5L6N6m7rrK2l3j4Nk9J0Q1k6m0J6J73o6j32Q3r0O0
5449A4qPj29K50j31p7l2J1M1L3RN1j8J1m3M3l6M6k3j2mK0qL9o2J3j4J2j4L9J5
5480D3n0M9m6k0m0M3J12M0k71j36M57k42j8J09Jj80J3J90j45K75l51J79jO2J85
$$ plain form
5276 -3 -12 196 -16 181 186 -77 24 -274 -116 -162 -74 140 197 77 -85 -92 -31 123 6 -82 219 310 89 183 -109
5301 -109 77 45 81 243 12 129 41 -81 97 35 159 164 -149 -153 -62 147 174 50 13 239 263 -237 35 26 -173
5326 -173 -116 77 -169 105 278 -231 129 222 -107 -107 45 -295 203 137 93 -116 28 31 -41 -26 -23 11 46 40 34 21
5352 21 54 49 -9 -60 44 62 -71 -28 -48 -24 -19 16 31 22 -23 30 -14 -12 38 5 -7 82 -7 22 73 -27 -18 -26 -24 24 79 -98
5384 -98 -10 -6 0 26 5 -71 40 1 -22 7 5 -13 -39 -60 7 18 19 -27 -14 23 16 -1 -46 -27 -20 -52 -45 26 -28 -5 -8 10 11 12 -57
5419 -57 17 10 -1 40 -43 139 -28 -58 -33 3 59 12 3 -6 16 -17 -31 -26 -55 -45 36 10 -30 -14 159 93 -39 44 -46 14
5449 14 6 13 -116 134 3 -74 -106 -95 -54 -21 -12 39 21 32 -11 32 -4 42 19 7 3 23 15 54 -8 5 -9 3 -11 28 43
5480 43 -7 42 -4 -24 -64 -21 91 131 -140 -276 181 -61 -79 30 31 -149 -136 54 -91 184 -167 12 11 73 258
5505B58j93m4J16j9o7K8j42M1M5o2K4J43j09q5K8P3l10J55K78k68p3L54k31J33
5529G3Q9m0j81O2p5j77K74RRk9l5R0j17m0L8j18LN6m9J35M0Jo2m7P2N3j2n7n7
5558i2J9n0l4J68J38rp2j08NK08j73J06j19l9M2j90J89r9K05j05m8N4l8j61L5
5583a68j76L35j71J23p1L4K45k94L1j95K12P1P3J14J03k22j87J80j03M12j41J8
5605B23l9rq9k88K65L2J4j62R8Prk19P0J38r8K56q1K7O1j40k3l8K2l55K62j7J13
5632B1k1k03J84M2j38L79l63j69K70j84M87m03L6j5j9j02K13j78K95k36m27O85
5654A54l51j2n1J15K40j46J27J26M25o43n25K59P5j43N86m95J21K10k58r4L82
5675A02l45K30J01q6K32j79pP2J97o90L43l3k2K14j63j97L58j36l42J89K01K62
$$ plain form
5505 258 65 21 137 118 51 79 -63 -22 23 -39 -15 128 19 -66 -38 35 -275 -120 158 -110 -183 171 -60 73
5529 73 162 122 -59 3 -72 -249 25 34 43 14 -21 69 -48 -88 -50 -168 -165 -109 -158 -23 17 18 -44 -91 -19 34 22 -35 -92
5558 -92 -73 -123 -157 11 149 140 68 -40 -35 173 0 106 -13 -52 -10 -200 -11 -110 95 -10 -58 -4 -42 -203 -168
5583 -168 -344 -9 -180 -57 -128 -94 151 -143 -112 -307 -95 -24 49 163 266 44 -143 37 -66 346 205 223
5605 223 184 175 86 -202 63 95 109 -53 45 52 43 -176 -106 32 -66 190 109 136 197 57 34 -4 18 -337 -75 -92 21
5632 21 0 -203 -19 23 -115 264 -99 -268 2 -182 305 -98 -62 -77 -96 -198 15 -163 132 -104 -531 154
5654 154 -197 -209 -260 -145 95 -51 76 202 627 -16 -541 -282 -207 -350 236 -259 -138 72 -186 -280 102
5675 102 -243 -13 88 2 234 55 48 120 317 -373 -30 -63 -85 129 -34 -231 127 -9 -351 -162 39 301
5697C01j59m9k37J69M76o97L7L5K31j67O2J87j34j98J16L8j1K1J23k00M4j72J19
5720f5kL2J06Kj54Q5N2J04k2Jj15k4n7J24k5%K10k59O4Ol0%L6K71l29l17K02N3
5748e1J32k4R8J63j62J10m06J86O0k65m6K49j16Q7j21L91J70o82K88J51Oj17L1
5771A32J50K39o93M70l09Kj8K86l18l2J79j07L16l2j47j42m53P96k26j02j52J57
5793dJ52k36l11P33k62K20k66j45J38m5K4J84l32R5O65m69o8n1m1j02j33K43j48
5816a59k3K25J46K3J56o80N38k54M05o16J80N1j59J15J40m4k13k09M61q7j91N59
5838C64Q4l91k33O18m37J68k63J1k18L63R7m18q2M19K8J2J92j93n48N46J75m88
5860a94j6Q5R6k03P2K87ml8J00n75J00N35k13q4j30M42k43J81K4k48lj37l9N2
$$ plain form
5697 301 142 93 -144 25 501 -196 -159 -124 107 -60 2 189 55 -143 -27 11 0 21 144 -56 -12 -184 -65
5720 -65 -67 -35 71 73 -81 4 56 160 138 139 24 0 -57 67 42 42 252 -7 57 63 33 33 69 340 11 -306 -104 -51
5748 -51 81 57 155 318 156 266 -140 46 106 -159 -205 44 -72 15 -106 285 455 -227 61 212 218 101 132
5771 132 282 521 -172 298 -11 -9 -27 259 -59 -91 88 -19 297 265 118 -24 -477 319 93 -9 -161 -4
5793 -4 148 -88 -399 334 72 292 26 -119 19 -26 -2 182 -150 -55 610 141 73 22 -19 -121 -254 -11 -159
5816 -159 -182 43 189 212 368 -312 226 -28 377 -239 -59 -8 -167 -52 88 44 -169 -378 83 -4 -195 364
5838 364 448 57 -176 442 5 173 -90 -79 -297 66 163 -255 -337 82 110 122 314 121 -427 119 294 -194
5860 -194 -210 -125 -29 -232 -160 127 123 85 185 -390 -290 245 32 -52 -182 260 17 198 222 -26 -29 -166 -205 -153
5884a53j16M96k31l35M0K64m6L68k99J55MJ82l47o7K06j89J02R6k09K58k34K01
5906A46k36J2n0j73M25K17l32j98Q2j28N87k58k93K40J12j77l54J11N05k64K40
5927B14k81J42o5RjL7O2p0j4Op0QQ0p3MJ2l2M5K7qj00Q6J4k3m6O5m0R7r2M7m9
5958iK3j2K8rl4j7J0N5k6L1l5J0K2m6J4O1o7k4Q2p8J2L1j3N2n2n4M3j8N1p0L7
5989bK1k4mj7LQJ7M8Mlk9n6N3jl0J7%l6L8M7n6K5Kk4JJJ5j7Q6q1k6K9RL2l0m1
6025b1L2q2P2K2L3n1Jo5O8k5J4l5J9J2k0j9M2J5Mk0L5m8N1l3J3K0n0N0qQl1L4
6057C7K2o0m6P7p2P8m2L2m9M1n5P6m0l8P0k2o2N0Nk7n1Q0kj7O3m1K7j3m4L8M6
6088F1n2Lo0N1j8j5M2J5Mn9K4n0P1mM4m4p2M7J2K1j5j8k1N5k0l7jL2j7KLQ1m4
$$ plain form
5884 -153 -269 227 -4 -339 -299 -35 -81 287 -12 143 147 329 -18 -85 121 -68 34 130 -79 179 -55 146
5906 146 -90 -78 -128 -301 124 341 9 -189 -107 -235 352 94 -199 41 153 -24 -378 -267 238 -26 214
5927 214 -67 75 10 19 18 55 117 47 33 39 -31 -23 57 -16 -12 0 -32 13 40 32 -68 18 32 9 -37 28 -12 85 -7 40 -9
5958 -9 14 2 30 21 -13 -30 -20 35 9 40 5 15 37 -9 5 66 -1 -25 57 -21 -9 22 9 61 9 -45 -2 -20 31 -39 -2
5989 -2 19 -5 -9 -26 -23 -15 2 50 54 51 22 -34 19 18 -12 5 5 -31 7 54 -2 23 25 1 2 3 18 1 87 6 -20 9 18 50 20 -21
6025 -21 11 -71 1 23 56 5 6 -59 9 -16 -2 -37 -18 -6 -26 -45 -3 12 16 -4 31 -17 34 1 14 34 -16 34 26 34 3 37
6057 37 59 -1 -47 30 -42 36 -6 26 -23 18 -37 39 -1 -39 31 9 -53 -3 2 -25 -76 4 2 -15 48 7 34 21 -23 15 61
6088 61 9 12 -48 3 -15 -30 12 27 31 -28 -4 -54 17 13 57 13 -59 -12 0 21 6 -12 -33 22 2 -35 -36 -4 -21 -19 -16 65 21
6121B1M5n9p3K8n9J26K9n5j5K7lk4L3km4j3K4KL4j1lJ7j8nL4l1jLl9K5j7O4l0
6154A0K9m9j7N0q2P6l1K8o7N0Qk1j9JN5Oon5N0k1J3L8k6L0o1P8p2l1L5J2nk1p8
6187i3J34k0Ok2l6K7j5M8pl5k0M7l0K1J1l8K3k0qN5J1o6KJ8J6j5j4K4M3n2k2P9
6219E2j0p0K4j7O3m5k0M2M4n0j5M5l3Qln2N6k9K1j9NJ2L5j27N8J6pk1N0J3j6k9
6251a9K1J8j3N3l9on1M5j3k9N4KK8l1rM5m7%QL0o2l1J17qj16K8LRK8jj2n0K7R
6285a2l6N0m3M4m3O2kk6K1L8q1lj7J33q4J6m7O5k5N6p8l1L5MN5j13R9p9O5K2p2
6316b7J2L2L8r1mM5p7N7n5N8J5l7K8m5J2O4m9J4k1K7K2J0J6l3k5J4K5l9rJ7Rj1
6348hMlM1j4l0L9n9kM9%k7n6L9l2K2K5L3k3Rjm1L5j1PJ5jn3M5M8m8jj0qm0P3m5
$$ plain form
6121 21 66 7 -66 -38 -97 29 58 3 -12 15 12 -12 21 19 -25 -38 -14 -12 22 11 8 25 7 2 36 5 4 7 -32 -7 -24 40 10
6154 10 39 -10 -27 23 -59 17 -14 14 -53 -3 5 -16 -35 -34 21 27 21 -34 16 -5 8 46 20 50 -11 67 -5 -36 -1 11 6 -15 -93
6187 -93 41 21 27 5 -31 -4 -19 29 22 -13 -33 14 -16 5 16 -22 1 -19 -27 28 39 -27 -25 -7 9 -6 -20 4 47 -5 -27 52
6219 52 42 -28 -4 -21 42 -3 -23 19 63 13 -2 43 10 18 15 -37 19 -10 11 -8 -3 9 44 -83 -25 -9 -16 -37 13 26 10 -19
6251 -19 2 20 7 60 21 15 -36 9 -4 -33 21 23 51 20 11 56 9 9 17 47 -15 -46 71 63 -53 -25 -22 -13 15 14 2 -48 -21 -12
6285 -12 -48 2 -41 3 -40 22 20 -6 15 53 -28 -31 -48 85 1 17 -30 35 10 66 -12 -43 -8 -4 51 -62 37 -42 23 45 -27
6316 -27 -15 17 55 -36 -40 5 -72 -15 -70 -12 3 -34 -6 -51 -39 25 -24 -10 -31 -4 18 28 44 11 -14 0 25 -14 -23 -6 3 -8
6348 -8 -4 -7 34 20 -10 29 -30 -32 17 17 -10 -66 -27 -59 -37 -12 21 -2 7 6 -35 0 -11 -4 11 10 -43 2 50 2 1 -9 -17 -57 16 -29
6384b9K1jJ0k1L4M6n8M3l4Nl1L1k6M5l6m0L1j5j9K6M6k5l2J4J5L5m6k5k1J3O6
6415B2j8qO4j12P5rj7jK9J7o1O3j9nrm9M9J5M9j01M3j1L8n7LO8m1j7k5L7jk5j6
6448c0K3J4K8n2k9OM3Kj5LL4J6r2J0L0mN8m2j8j3N7K0k0L1k8J9n3O4k9l4j2L2
6480A9j6m6P0l5O0o1L8o9k4P6j7K5Kj6j9nK3M5n1l0j4M8pl3L5kJ2rL5m5J1k6M3
6513A7n0O7r6J71p7l2l7P5j2q5M4K8m0L0J9l2j2jn3J22lj8Pj0l1L5kk9J5l3K9
6544Fj6L0j0M1m6K2K1K1p1M3k6n8P2Jo2O3nrLj6QQp4J3LJ07r0j0O8l5LlRK6o7
6579c0M2p4P0l2J4L5j5j3J4j8PlJ1J6j0o3O9o4L7pjN2l1J0J1m8J1L1l4Q1j8q6
6611c6J4J0L1J8J9m8l5MM0l5k9JmM2j0J5k7L1N5l8o6P4l0J3l0l0M0J4K8l6Rk2
$$ plain form
6384 -29 -8 -9 1 -20 14 60 2 45 11 16 -15 16 -10 35 -1 -41 -10 -25 -44 -18 28 3 -29 -15 0 35 -11 -36 -57 -44 22
6415 22 4 -4 60 -52 23 14 -3 -4 25 42 -19 44 25 20 11 -38 11 26 75 -26 17 6 44 -13 -10 58 17 0 -25 12 11 -14 -30
6448 -30 -7 7 35 -17 -46 -40 3 5 -10 -7 27 43 -49 -39 -9 -13 45 3 -15 -28 29 49 29 60 32 51 -2 62 33 -1 -13 19
6480 19 3 -43 27 -8 52 -9 29 -40 -64 12 -5 20 22 6 -13 -18 5 50 -1 -31 -45 3 -4 -37 -2 -4 8 -1 34 -11 0 -26 17
6513 17 -33 34 -62 109 32 0 -37 38 26 -59 -15 13 -27 3 22 -10 -22 -23 -76 46 43 25 32 22 -9 26 24 -5 10 -23 6
6544 6 -10 20 10 51 5 27 48 69 -2 41 15 -43 29 30 -32 31 26 17 20 4 12 20 -54 -41 -38 69 -21 -31 37 2 5 2 11 37 -30
6579 -30 12 -62 8 -24 -10 25 10 -3 11 -7 0 -3 8 24 14 -49 20 -44 -7 -14 -15 37 6 16 27 -21 -10 21 -13 68 50 -36
6611 -36 -22 -12 19 37 56 8 -27 -23 17 -18 -47 -46 -50 -8 -18 -3 -30 1 56 18 -48 26 -4 9 -21 -51 -11 3 31 -5 4 -18
6643a8L8k3m8P8k3j9J5J7%K4p4J2j6N3k8NRjkm1OL2J9L1q4O2n3K5l0m5J03m1J2
6676eJ7j0N4r7M4Qm9P5n0L7pj1M2q7L2k0O7j2m0M4o4j8N0j0l7k4R6q8J18q3K3
$$ plain form
6643 -18 20 -3 -51 27 4 -15 0 17 17 41 -33 -21 -37 16 -12 -7 2 1 -1 -42 -36 -4 15 46 -38 24 -29 -4 -34 -79 24 -17 -5
6676 -5 12 2 56 -41 3 11 -38 37 -13 24 17 6 48 -39 -7 -27 40 28 -12 32 -32 -50 0 -10 -47 -71 25 -63 55 -28 -5
$$ [...]
8191C
##END NTUPLES=NMR FID
##END=
