##TITLE=1H_DE-150kj
 200.13Hz, D2O.
 8 sc
 25.6.2026
##JCAMPDX= 6.0         $$ Bruker NMR JCAMP-DX V2.0
##DATA TYPE= NMR FID
##DATA CLASS= NTUPLES
##ORIGIN= UXNMR, Bruker Analytische Messtechnik GmbH
##OWNER= pz
$$ XWIN-NMR		Version 3.5
$$ Thu Jun 25 13:16:49 2026 Russian Standard Time (UT+4h)  she@DPX200
##.OBSERVE FREQUENCY= 200.1313
##.OBSERVE NUCLEUS= ^1H
##.DELAY= (6, 6)
##.ACQUISITION MODE= SIMULTANEOUS
##.ACQUISITION SCHEME= undefined
##.AVERAGES= 8
##.DIGITISER RES= 18
##SPECTROMETER/DATA SYSTEM= spect
##.PULSE SEQUENCE= zg30
##.SOLVENT NAME= D2O
##.SHIFT REFERENCE= (INTERNAL, D2O, 0, 14.3821)
##AUDIT TRAIL= $$ (NUMBER, WHEN, WHO, WHERE, WHAT)
$$ ##TITLE= Audit trail, XWIN-NMR		Version 3.5
$$ ##JCAMPDX= 5.01
$$ ##ORIGIN= Bruker BioSpin GmbH
$$ ##OWNER= she
$$ F:/spectra/data/she/nmr/H-C/1/audita.txt
$$ ##AUDIT TRAIL=  $$ (NUMBER, WHEN, WHO, WHERE, WHAT)
(   1,<2026-06-25 13:14:27.89 +0400>,<she>,<DPX200>,
      <created by zg, POWCHK disabled, PULCHK disabled
       configuration hash MD5:
       00 E9 B6 7A A2 85 ED C7 34 08 36 98 17 FE 4E 26
       data hash MD5: 16K
       C2 70 9B 67 EA CF 68 F0 0A 30 3E 9C 03 11 B2 42>)
$$ ##END=
$$ 
$$ hash MD5
$$ AA B5 6E C0 3F DF 8E 86 6D 6C F8 98 40 D8 E3 1F
##$RELAX= 
##$RELAX= 
##$RELAX= 
##$RELAX= 
##$RELAX= 
##$RELAX= 
$$ Bruker specific parameters
$$ --------------------------
##$DU= <F:/spectra>
##$EXPNO= 1
##$NAME= <H-C>
##$PROCNO= 1
##$TYPE= <nmr>
##$USER= <she>
##$AMP= (0..31)
100 100 100 100 100 100 100 100 100 100 100 100 100 100 100 100 100 100 
100 100 100 100 100 100 100 100 100 100 100 100 100 100 
##$AQSEQ= 0
##$AQ_mod= 1
##$AUNM= <au_zg>
##$AUTOPOS= <>
##$BF1= 200.13
##$BF2= 200.13
##$BF3= 200.13
##$BF4= 200.13
##$BF5= 200.13
##$BF6= 200.13
##$BF7= 200.13
##$BF8= 200.13
##$BYTORDA= 1
##$CFDGTYP= 0
##$CFRGTYP= 5
##$CHEMSTR= <none>
##$CNST= (0..31)
1 1 145 1 1 1 1 1 1 1 1 1 1 1 1 1 1 1 1 1 1 1 1 1 1 1 1 1 1 1 1 1 
##$CPDPRG= <>
##$CPDPRG1= <>
##$CPDPRG2= <>
##$CPDPRG3= <>
##$CPDPRG4= <mlev>
##$CPDPRG5= <mlev>
##$CPDPRG6= <mlev>
##$CPDPRG7= <mlev>
##$CPDPRG8= <mlev>
##$CPDPRGB= <>
##$CPDPRGT= <>
##$D= (0..31)
0 0.7 0 0 0 0 0 0 0 0 0 0.03 0 0 0 0 0 0 0 0 0 0 0 0 0 0 0 0 0 0 0 0 
##$DATE= 1782378867
##$DBL= (0..7)
120 120 120 120 120 120 120 120 
##$DBP= (0..7)
150 150 150 150 150 150 150 150 
##$DBP07= 0
##$DBPNAM0= <>
##$DBPNAM1= <>
##$DBPNAM2= <>
##$DBPNAM3= <>
##$DBPNAM4= <>
##$DBPNAM5= <>
##$DBPNAM6= <>
##$DBPNAM7= <>
##$DBPOAL= (0..7)
0.5 0.5 0.5 0.5 0.5 0.5 0.5 0.5 
##$DBPOFFS= (0..7)
0 0 0 0 0 0 0 0 
##$DE= 6
##$DECBNUC= <off>
##$DECIM= 32
##$DECNUC= <off>
##$DECSTAT= 4
##$DIGMOD= 1
##$DIGTYP= 9
##$DL= (0..7)
0 120 120 120 120 120 120 120 
##$DP= (0..7)
150 150 150 150 150 150 150 150 
##$DP07= 0
##$DPNAME0= <>
##$DPNAME1= <>
##$DPNAME2= <>
##$DPNAME3= <>
##$DPNAME4= <>
##$DPNAME5= <>
##$DPNAME6= <>
##$DPNAME7= <>
##$DPOAL= (0..7)
0.5 0.5 0.5 0.5 0.5 0.5 0.5 0.5 
##$DPOFFS= (0..7)
0 0 0 0 0 0 0 0 
##$DQDMODE= 0
##$DR= 18
##$DS= 0
##$DSLIST= <SSSSSSSSSSSSSSS>
##$DSPFIRM= 0
$$ [...]
##$SUBNAM0= <"">
##$SUBNAM1= <"">
##$SUBNAM2= <"">
##$SUBNAM3= <"">
##$SUBNAM4= <"">
##$SUBNAM5= <"">
##$SUBNAM6= <"">
##$SUBNAM7= <"">
##$SUBNAM8= <"">
##$SUBNAM9= <"">
##$SW= 18.0517328524113
##$SWIBOX= (0..15)
0 0 2 0 0 0 0 0 0 0 0 0 0 0 0 0 
##$SW_h= 3612.71676300578
##$TD= 16384
##$TD0= 1
##$TE= 0
##$TE2= 300
##$TE3= 300
##$TEG= 300
##$TL= (0..7)
0 120 120 120 120 120 120 120 
##$TP= (0..7)
150 150 150 150 150 150 150 150 
##$TP07= 0
##$TPNAME0= <>
##$TPNAME1= <>
##$TPNAME2= <>
##$TPNAME3= <>
##$TPNAME4= <>
##$TPNAME5= <>
##$TPNAME6= <>
##$TPNAME7= <>
##$TPOAL= (0..7)
0.5 0.5 0.5 0.5 0.5 0.5 0.5 0.5 
##$TPOFFS= (0..7)
0 0 0 0 0 0 0 0 
##$TUNHIN= 0
##$TUNHOUT= 0
##$TUNXOUT= 0
##$USERA1= <user>
##$USERA2= <user>
##$USERA3= <user>
##$USERA4= <user>
##$USERA5= <user>
##$V9= 5
##$VALIST= <valist>
##$VCLIST= <CCCCCCCCCCCCCCC>
##$VD= 0
##$VDLIST= <DDDDDDDDDDDDDDD>
##$VPLIST= <PPPPPPPPPPPPPPP>
##$VTLIST= <TTTTTTTTTTTTTTT>
##$WBST= 1024
##$WBSW= 4
##$XGAIN= (0..3)
0 0 0 0 
##$XL= 0
##$YL= 0
##$YMAX_a= 815387
##$YMIN_a= -739973
##$ZGOPTNS= <>
##$ZL1= 120
##$ZL2= 120
##$ZL3= 120
##$ZL4= 120
##$ABSF1= 10
##$ABSF2= 0
##$ABSG= 5
##$ABSL= 3
##$ALPHA= 0
##$AQORDER= 0
##$ASSFAC= 0
##$ASSFACI= 0
##$ASSFACX= 0
##$ASSWID= 0
##$AUNMP= <proc_1d>
##$AZFE= 0.1
##$AZFW= 0.1
##$BCFW= 1
##$BC_mod= 2
##$BYTORDP= 1
##$COROFFS= 0
##$CY= -3
##$DATMOD= 1
##$DC= 2
##$DFILT= <>
##$DTYPP= 0
##$F1P= 0
##$F2P= 0
##$FCOR= 0.5
##$FTSIZE= 0
##$FT_mod= 4
##$GAMMA= 1
##$GB= 0.15
##$INTBC= 1
##$INTSCL= 1
##$ISEN= 128
##$LB= 0.25
##$LEV0= 0
##$LPBIN= 0
##$MAXI= 10000
##$MC2= 0
##$MEAN= 0
##$ME_mod= 0
##$MI= 1.114404
##$NCOEF= 0
##$NC_proc= 0
##$NLEV= 6
##$NOISF1= 3.799351
##$NOISF2= 2.8
##$NSP= 1
##$NTH_PI= 0
##$NZP= 0
##$OFFSET= 14.38212
##$PC= 1
##$PHC0= -4214.295
##$PHC1= -3.207698
##$PH_mod= 1
##$PKNL= yes
##$PPARMOD= 0
##$PSCAL= 0
##$PSIGN= 0
##$REVERSE= no
##$SF= 200.129724274929
##$SI= 16384
##$SIGF1= 3
##$SIGF2= 2
##$SINO= 400
##$SIOLD= 16384
##$SREGLST= <1H.CDCl3>
##$SSB= 0
##$STSI= 0
##$STSR= 0
##$SW_p= 3205.1282051282
##$SYMM= 0
##$S_DEV= 0
##$TDeff= 0
##$TDoff= 0
##$TI= <>
##$TILT= no
##$TM1= 0
##$TM2= 0
##$TOPLEV= 0
##$USERP1= <user>
##$USERP2= <user>
##$USERP3= <user>
##$USERP4= <user>
##$USERP5= <user>
##$WDW= 1
##$XDIM= 8192
##$YMAX_p= 0
##$YMIN_p= 0
$$ End of Bruker specific parameters
$$ ---------------------------------
##NTUPLES= NMR FID
##VAR_NAME=  TIME,          FID/REAL,        FID/IMAG
##SYMBOL=    X,             R,               I
##VAR_TYPE=  INDEPENDENT,   DEPENDENT,       DEPENDENT
##VAR_FORM=  AFFN,          ASDF,            ASDF
##VAR_DIM=   8192,          8192,            8192
##UNITS=     SECONDS,       ARBITRARY UNITS, ARBITRARY UNITS
##FACTOR=    0.0002768,     1,               1
##FIRST=     0,             0,               0
##LAST=      2.2672688,     0,               0
##MIN=       0,             -739973,         0
##MAX=       2.2672688,     815387,          0
$$ Real data points
##PAGE= N=1
##DATA TABLE= (X++(R..R)), XYDATA
$$ plain form
0 0 0 0 0 0 0 0 0 0 0 0 0 0 8 0 8 -8 8 -9 12 -16 16 -24 29 -31 40 -44 52 -61 68 -82 91 -104 121 -133 154 -171
36 -171 193 -217 241 -272 299 -337 372 -410 459 -503 557 -616 676 -748 820 -904 998 -1099
54 -1099 1216 -1342 1490 -1656 1847 -2077 2342 -2671 3076 -3595 4292 -5269 6761 -9309 14694
69 14694 -47996 271233 692811 720304 472492 50329 -297062 -491107 -493679 -386441 -190766
80 -190766 53621 334343 551598 597293 379337 -43120 -495872 -739973 -645930 -251532
90 -251532 233660 578577 639474 442579 117869 -183935 -381310 -454684 -417973 -269415 -17087
101 -17087 292057 540994 596349 387363 -19728 -440123 -664722 -585952 -253593 157191
111 157191 457698 542941 424262 187511 -71671 -289550 -426898 -449065 -326271 -64158
$$ packed form
0@%%%%%%%%%%%%QqQj6J6j7K1k8L2m0N3o0P1q4R6j13J29j50J73j95K25k54K87l25
36a71L64m10M58n13N71o36P09p82Q69r62J060j173J292j424J568j724J902k097
54a099K315k558K832l146L503l924M419n013N747o671P887r561J2030j6070K4003
69A4694o2690L19229M21578K7493k47812m22163l47391j94045k572J07238J95675
80a90766K44387K80722K17255M5695k17956m22457m52752k44101R4043L94398
90b51532M85192L44917O0897j96895l24710l01804j97375p3374L6711J48558K52328
101a7087L09144K48937N5355k08986m07091m20395k24599P8770L32359M10784
111A57191L00507Q5243j18679k36751k59182k17879j37348k2167J22794K62113
$$ plain form
121 -64158 261622 517385 570817 374351 5614 -365273 -568928 -523250 -270914 60735
131 60735 333700 461929 429109 266322 27307 -225600 -417252 -476068 -357828 -86507
141 -86507 238937 479442 524706 350808 36982 -278203 -466773 -468088 -300441 -39997 220596
152 220596 398415 443456 335317 101054 -182037 -407791 -481852 -363085 -92987 209254
162 209254 420093 458841 323064 78414 -179161 -362803 -420218 -337523 -136638 123602
172 123602 354805 462604 390672 153030 -154966 -398696 -472069 -351836 -98298 169428
182 169428 350889 394663 307714 133158 -78744 -273371 -392697 -384778 -222616 49419 325534
193 325534 477744 425011 183134 -133255 -374445 -443020 -326604 -107152 115963 269289
$$ packed form
121f4158L25780K55763N3432j96466l68737l70887k03655M5678K52336L31649
131F0735K72965J28229l2820j62787k39015k52907j91652n8816J18240K71321
141h6507L25444K40505M5264j73898l13826l15185j88570j315J67647K60444K60593
152B20596J77819M5041j08139k34263k83091k25754p4061J18767K70098L02241
162B09254K10839L8748j35777k44650k57575j83642n7415Q2695K00885K60240
172A23602K31203J07799p1932k37642l07996k43730p3373J20233K53538K67726
182A69428J81461M3774q6949j74556k11902j94627j19326P919J62162K72035K76115
193C25534J52210n2733k41877l16389k41190o8575J16416K19452K23115J53326
$$ plain form
203 269289 330284 302036 194133 16571 -197958 -376240 -426931 -292883 -7072 304056
213 304056 482917 439452 198872 -111427 -338270 -398303 -301541 -125456 50898 187644
223 187644 276874 310423 258056 97473 -143788 -370433 -458300 -335418 -41433 280690 466707
234 466707 424935 202259 -78334 -281309 -340314 -277037 -154237 -19247 113643 238700
244 238700 323529 308757 154621 -107200 -360461 -466989 -351567 -62641 250831 429263
254 429263 397871 202090 -38358 -213113 -279393 -258665 -189812 -88250 50464 212485 338496
265 338496 346645 190832 -82980 -345516 -455303 -347141 -78411 207974 372762 358864
275 358864 208875 16558 -138647 -227216 -256337 -232481 -145783 9666 201290 347965 360478
$$ packed form
203B69289O0995k8248j07903j77562k14529j78282n0691J34048K85811L11128
213C04056J78861m3465k40580l10299k26843o0033R6762J76085J76354J36746
223A87644Q9230L3549n2367j60583k41261k26645q7867J22882K93985L22123J86017
234D66707m1772k22676k80593k02975n9005O3277J22800J34990J32890J25057
244B38700Q4829j4772j54136k61821k53261j06528J15422K88926L13472J78432
254D29263l1392j95781k40448j74755o6280K0728O8853J01562J38714J62021J26011
265C38496Q149j55813k73812k62536j09787J08162K68730K86385J64788j3898
275C58864j49989j92317j55205q8569k9121K3856Q6698J55449J91624J46675J2513
$$ plain form
286 360478 203461 -64901 -314743 -419293 -328786 -99550 147443 302357 319871 225957
296 225957 81177 -65139 -185636 -263131 -272985 -189765 -15943 193777 346033 356086 204091
307 204091 -43781 -269186 -368488 -306360 -128242 77323 229035 286504 251800 145523 -2570
318 -2570 -157948 -274710 -302759 -213166 -26565 184731 326408 331011 195709 -15011 -207798
329 -207798 -307289 -285603 -166173 820 159651 264877 283664 203629 43712 -144105 -285618
340 -285618 -316542 -217353 -28316 168225 289938 292726 186522 22485 -137556 -244952 -271479
351 -271479 -209334 -72590 101294 251723 313190 247722 73437 -136783 -287621 -312277 -207367
362 -207367 -29400 139970 239287 249317 183653 70061 -63976 -189647 -266941 -254278 -134964
$$ packed form
286C60478j57017k68362k49842j04550R0507K29236K46993J54914J7514r3914
296B25957j44780j46316j20497p7495r854Q3220J73822K09720J52256J0053j51995
307B04091k47872k25405r9302O2128J78118K05565J51712N7469l4704j06277j48093
318b570j55378j16762k8049Q9593J86601K11296J41677M603j35302k10720j92787
329b07798r9491K1686J19430J66993J58831J05226J8787q0035j59917j87817j41513
340b85618l0924R9189J89037J96541J21713K788j06204j64037j60041j07396k6527
351b71479O2145J36744J73884J50429O1467o5468j74285k10220j50838k4656J04910
362b07367J77967J69370R9317J0030o5664j13592j34037j25671p7294J2663J19314
$$ plain form
373 -134964 58621 246122 334218 272275 87130 -129266 -274114 -289378 -189464 -38014 98082
384 98082 181692 210417 190063 121163 1800 -146301 -267875 -292093 -181332 28932 239974
395 239974 341411 278998 91800 -117212 -246868 -255229 -170184 -53487 48016 122965 177202
406 177202 203486 171819 57709 -115906 -272575 -318804 -209097 12013 230756 331126
416 331126 268465 92411 -94508 -204216 -214354 -157293 -80856 -6333 72865 158555 222371
427 222371 211275 94265 -97555 -271329 -325095 -217267 -314 208002 301530 247336 97093
438 97093 -58256 -152945 -175425 -154467 -114633 -56217 35121 149852 239295 236808 114342 -85944
450 -85944 -262072 -314259 -212047 -12578 174639 259528 220923 106907 -14257 -98619 -142407
$$ packed form
373a34964J93585J87501Q8096o1943j85145k16396j44848j5264R9914J51450J36096
384I8082Q3610K8725k0354o8900j19363j48101j21574k4218J10761K10264K11042
395B39974J01437o2413j87198k09012j29656q361Q5045J16697J01503P4949N4237
406A77202K6284l1667j14110j73615j56669m6229J09707K21110K18743J00370
416C31126o2661j76054j86919j09708j0138N7061P6437P4523P9198Q5690O3816
427B22371j1096j17010j91820j73774n3766J07828K16953K08316R3528n4194j50243
438I7093j55349r4689k2480K0958L9834N8416R1338J14731Q9443k487j22466k00286
450h5944j76128n2187J02212J99469J87217Q4889l8605j14016j21164q4362m3788
$$ plain form
461 -142407 -158670 -148573 -95635 11318 146211 245710 243193 118240 -74165 -234722 -279667
472 -279667 -194185 -30375 126381 208260 197560 126313 35125 -49332 -122085 -172865 -179782 -121193
484 -121193 2757 147978 244874 234678 114393 -59369 -202077 -247458 -185120 -57613 72828
495 72828 158512 183657 154527 85089 -10444 -112693 -189080 -202440 -132297 1846 144483
506 144483 228296 213135 107938 -36009 -154482 -203918 -176247 -92046 15405 113805 177157
517 177157 184270 126164 14852 -111402 -200035 -208091 -128935 3285 129577 196950 184070
528 184070 105928 -1509 -99864 -162560 -174354 -130863 -38091 78429 177051 210777 155666
539 155666 29283 -112188 -202527 -201722 -117144 4014 106090 156962 152121 106830 36881 -45674
$$ packed form
461a42407j6263J0097N2938J06953J34893R9499k517j24953j92405j60557m4945
472b79667Q5482J63810J56756Q1879j0700p1247r1188q4457p2753n0780o917N8589
484a21193J23950J45221R6896j0196j20285j73762j42708m5381O2338J27507J30441
495G2828Q5684K5145k9130o9438r5533j02249p6387j3360P0143J34143J42637
506A44483Q3813j5161j05197j43947j18473m9436K7671Q4201J07451R8400O3352
517A77157P113n8106j11312j26254q8633q056P9156J32220J26292O7373j2880
528A84070p8142j07437r8355o2696j1794M3491R2772J16520R8622L3726n5111
539A55666j26383j41471r0339Q05Q4578J21158J02076N0872m841m5291o9949q2555
$$ plain form
551 -45674 -126719 -177687 -167086 -81199 55058 179495 227047 168519 32350 -110669 -191663
562 -191663 -180539 -101246 -3173 71815 113368 127110 117811 78271 -56 -102788 -186764 -196716
574 -196716 -109957 41441 180868 232080 167912 31458 -100886 -167805 -152438 -87403 -18070
585 -18070 34058 72762 107357 130775 111532 33191 -86150 -189648 -209565 -118562 34812
596 34812 172550 218055 153581 28465 -84213 -134123 -121720 -79649 -40684 -4197 40870
607 40870 100300 148482 141028 54130 -79981 -194488 -215663 -123993 28922 159597 198935
618 198935 140620 34227 -56902 -99468 -99608 -84962 -68157 -38842 20186 101716 163835 157541
630 157541 64025 -76172 -188743 -206122 -119934 19873 133262 169437 126431 47131 -22927
$$ packed form
551d5674q1045n0968J0601Q5887J36257J24437M7552n8528j36169j43019q0994
562a91663J1124P9293R8073P4988M1553J3742r299l9540p8327j02732q3976r952
574a96716Q6759J51398J39427N1212o4168j36454j32344o6919J5367O5035O9333
585a8070N2128L8704L4595K3418j9243p8341j19341j03498j9917R1003J53374
596C4812J37738M5505o4474j25116j12678m9910J2403M2071L8965L6487M5067
607D0870N9430M8182p454q6898j34111j14507k1175R1670J52915J30675L9338
618A98935n8315j06393r1129m2566j40J4646J6805K9315N9028Q1530O2119o294
630A57541r3516j40197j12571j7379Q6188J39807J13389L6175m3006p9300p0058
$$ plain form
641 -22927 -62936 -83326 -95112 -95558 -63149 10804 105507 170364 158915 63341 -71264 -170314
653 -170314 -183588 -109660 4755 98147 133928 113482 65235 13865 -33283 -74932 -109059 -116100
665 -116100 -76101 9881 107191 164530 147234 59108 -57681 -141371 -155609 -104094 -18741 57742
677 57742 102411 110751 90289 47665 -11334 -76032 -124329 -129372 -78429 13523 105243 151296
689 151296 129986 53920 -38370 -106079 -126717 -102076 -48230 16723 75172 112793 116378 76310
701 76310 1487 -80884 -134575 -130839 -70780 17708 93252 126228 108689 54767 -10516 -66385
713 -66385 -101783 -107480 -79364 -19030 57470 119837 135674 91677 4454 -85504 -134523 -121929
725 -121929 -59198 16885 74395 96451 88147 60432 19898 -29652 -82047 -116368 -108011 -46526
$$ packed form
641b2927m0009k0390j1786m46L2409P3953R4703O4857j1449r5574j34605r9050
653a70314j3274P3928J14415R3392L5781k0446m8247n1370m7148m1649l4127p041
665a16100L9999Q5982R7310N7339j7296q8126j16789q3690j4238N1515Q5353P6483
677E7742M4669Q340k0462m2624n8999o4698m8297n043N0943R1952R1720M6053
689A51296k1310p6066r2290o7709k0638K4641N3846O4953N8449L7621L585m0068
701G6310p4823q2371n3691L736O0059Q8488P5544L2976j7539n3922o5283n5869
713f6385l5398n697K8116O0334P6500O2367J5837m3997q7223q9958m9019J2594
725a21929O2731P6083N7510K2056q304k7715m0534m9550n2395l4321Q357O1485
$$ plain form
737 -46526 46853 127472 149255 98282 2267 -87129 -126546 -104943 -47370 10668 48162 64976
749 64976 72658 72292 51722 322 -70667 -127794 -128960 -62571 43238 131333 151250 94637 -1517
762 -1517 -81067 -108408 -84559 -40030 -3038 19403 39260 65528 86977 77280 20420 -66246
774 -66246 -135434 -139817 -68464 42037 127941 142585 85239 -1831 -67231 -84577 -65645 -38779
786 -38779 -21796 -7631 20155 64513 101628 95111 31216 -65212 -138410 -140582 -66542 39933
798 39933 116657 125412 73466 2262 -46081 -58775 -50992 -44613 -42778 -29649 10118 68715 111880
811 111880 102689 32949 -64203 -132096 -130464 -61498 31938 96252 103563 65273 14290 -20654
823 -20654 -35645 -44648 -55400 -61092 -42441 7868 73130 114529 99854 29611 -59329 -116936
$$ packed form
737d6526R3379Q0619K1783n0973r6015q9396l9417K1603N7573N8038L7494J6814
749F4976P682l66k0570n1400p0989n7127j166O6389J05809Q8095J9917n6613r6154
762a517p9550k7341K3849M4529L6992K2441J9857K6268K1449r697n6860q6666
774f6246o9188m383P1353J10501Q5904J4644n7346q7070o5400j7346J8932K6866
786c8779J6983J4165K7786M4358L7115o517o3895r6428p3198k172P4040J06475
798C9933P6724Q755n1946p1204m8343j2694P783O379J835J3129L9767N8597M3165
811A11880r191o9740r7152o7893J632O8966R3436O4314P311l8290n0983l4944
823b0654j4991r003j0752n692J8651N0309O5262M1399j4675p0243q8940n7607
$$ plain form
835 -116936 -113080 -55704 18775 69459 80436 60614 31537 5859 -17475 -43869 -68922 -75114
847 -75114 -47647 11220 75531 108938 89845 25882 -48266 -94667 -93880 -53966 -1228 40671
859 40671 61243 62768 50781 27499 -7793 -48283 -78812 -80126 -44399 15723 71558 95273
871 95273 75040 24248 -31857 -68235 -74931 -56738 -24097 12875 46763 68828 70404 44128
883 44128 -4003 -55910 -86130 -78095 -35886 19992 62709 75802 58799 25661 -10164 -40374
895 -40374 -59462 -63517 -47349 -10088 39036 77738 84802 52040 -6447 -61021 -84568 -68340
907 -68340 -25997 18480 46515 53701 47113 33124 12673 -16844 -50740 -73873 -66963 -24730 36454
920 36454 85291 92492 52610 -10855 -62192 -76881 -54952 -17618 12569 27138 33111 39225 43883
$$ packed form
835a16936L856N7376P4479N0684J0977j9822k9077k5678k3334k6394k5053o192
847g5114K7467N8867O4311L3407j9093o3963p4148m6401P87L9914N2738M1899
859D0671K0572J525j1987k3282l5292m0490l0529j314L5727O0122N5835K3715
871I5273k0233n0792n6105l6378o696J8193L2641L6972L3888K2065J576k6276
883D4128m8131n1907l0220Q035M2209N5878M2717J3093j7003l3138l5825l0210
895d0374j9088m055J6168L7261M9124L8702P064l2762n8487n4574k3547J6228
907f8340M2343M4477K8035P186o588j3989k0451k9517l3896k3133O910M2233O1184
920C6454M8837P201l9882o3465n1337j4689K1929L7334L0187J4569N973O114M658
$$ plain form
933 43883 34822 1731 -46512 -83429 -81424 -33470 37045 89481 92537 47878 -14368 -57561 -63368
946 -63368 -40645 -13720 1223 6789 16406 36950 55994 51926 12618 -46331 -90525 -87409 -34420
959 -34420 37689 86607 85176 40350 -14140 -46367 -46807 -29135 -15314 -12791 -10614 6798 39277
972 39277 66456 62179 16916 -47549 -91566 -85746 -31520 36378 77582 72612 33288 -9375 -30959
985 -30959 -29562 -21850 -21640 -27982 -23674 2992 43984 73123 64750 15163 -47448 -86600 -77303 -27572
999 -27572 30542 62695 57710 28849 301 -13318 -15855 -20116 -30865 -39337 -29991 4084 47975
1012 47975 73582 60693 12658 -43591 -74773 -65449 -25056 19285 44008 43851 28710 13738
1024 13738 3443 -6840 -22868 -40731 -47326 -29828 8615 49473 67813 51440 9154 -34817
$$ packed form
933D3883r061l3091m8243l6917K005M7954P0515N2436L056m4659o2246m3193n807
946f3368K2723K6925J4943N566R617K0544J9044m068l9308n8949m4194L116N2989
959c4420P2109M8918j431m4826n4490l2227m40J7672J3821K523K177J7412L2479
972C9277K7179m277m5263o4465m4017N820N4226O7898M1204m970l9324m2663k1584
985c0959J397P712K10o342M308K6666M0992K9139q373m9587o2611l9152R297M9731
999b7572N8114L2153m985k8861k8548j3619k537m261j0749q472R346L4075M3891
1012D7975K5607j2889m8035n6249l1182R324M0393M4341K4723j57j5141j4972
1024A3738j0295j0283j6028j7863o595J7498L8443M0858J8340j6373m2286m3971
$$ plain form
1036 -34817 -58018 -51504 -25369 4179 24161 32678 32965 28654 17259 -2942 -28847 -48330 -48756
1049 -48756 -24918 12967 45548 56474 40890 9183 -21816 -39783 -40696 -29531 -12327 7063
1061 7063 25933 40112 41430 25952 -4031 -35042 -51656 -44367 -17211 15389 37708 42079 30612
1074 30612 11887 -6033 -21366 -32753 -37227 -28953 -6334 23891 48444 51017 29023 -8235
1086 -8235 -40024 -50274 -36226 -9466 14587 26209 26636 23101 18458 9998 -6247 -28934 -45595
1099 -45595 -42116 -14299 25146 54148 55102 26845 -12348 -40123 -43175 -25921 -4208 8877 12093
1112 12093 13880 19662 27301 24204 3374 -28781 -53364 -50144 -17497 27476 57393 53387 22027
1125 22027 -15896 -36671 -33427 -16208 -2106 368 -1549 4042 20201 36137 35439 8883 -30342
$$ packed form
1036c4817k3201O514K6135K9548J9982Q517K87m311j1395k0201k5905j9483m26
1049d8756K3838L7885L2581J0926j5584l1707l0999j7967r13J1165J7204J9390
1061G063J8870J4179J318j5478k9983l1011j6614P289K7156L2600K2319M371j1467
1074C0612j8725j7920j5333j1387m474Q274K2619L0225K4553K573k1994l7258
1086h235l1789j0250J4048K6760K4053J1622M27l535m643q460j6245k2687j6661
1099d5595L479K7817L9445K9002R54k8257l9193k7775l052J7254K1713J3085L216
1112A2093J787N782P639l097k0830l2155k4583L220L2647M4973K9917m006l1360
1125B2027l7923k0775L244J7219J4102K474j917N591J6159J5936o98k6556l9225
$$ plain form
1138 -30342 -57885 -52775 -16581 29054 55093 47677 16662 -15734 -28982 -21907 -9231 -4785 -9654
1151 -9654 -12164 -786 23333 43311 40194 9380 -32544 -58272 -50240 -13578 27776 48177 39115
1164 39115 11948 -11534 -17766 -11782 -6137 -10163 -19116 -19054 -1331 27393 46985 40136 7165 -32386
1178 -32386 -53792 -43284 -10203 23294 37247 28759 9728 -3708 -6177 -3666 -6600 -17156 -26185
1191 -26185 -20850 1622 30139 45657 35644 4180 -29458 -45025 -35263 -9003 15446 25071
1203 25071 20771 11415 5459 3916 59 -10406 -23629 -29289 -19005 5495 30394 40375 28563
1216 28563 2419 -22831 -33302 -26501 -10469 4370 12446 15038 15925 16090 11518 137 -16046
1229 -16046 -28945 -28615 -13360 9100 27472 31635 20625 2550 -13296 -20739 -19837 -14528 -6988
$$ packed form
1138c0342k7543N110L6194M5635K6039p416l1015l2396j3248P075J2676M446m869
1151i654k510J1378K4119J9978l117l0814m1924k5728Q032L6662M1354K0401r062
1164C9115k7167k3482o232N984N645m026q953O2J7723K8724J9592o849l2971l9551
1178c2386k1406J0508L3081L3497J3953q488j9031j3436k469K511k934j0556r029
1191b6185N335K2472K8517J5518j0013l1464l3638j5567R762K6260K4449R625
1203B5071m300r356n956j543l857j0465j3223n660J0284K4500K4899R981j1812
1216B8563k6144k5250j0471O801J6032J4839Q076K592Q87J65m572j1381j6183
1229a6046j2899L30J5255K2460J8372M163j1010j8075j5846p443R02N309P540
$$ plain form
1242 -6988 1864 12659 22152 24368 15480 -2560 -20619 -29774 -24074 -7542 10515 21203 21435 14860
1256 14860 5608 -2365 -9570 -16697 -20528 -17319 -5009 13644 28127 29417 15513 -6384 -24143
1269 -24143 -27685 -17228 -2004 9183 12275 11018 10283 10630 8513 -481 -15394 -27279 -26074 -8701
1283 -8701 15987 32782 31501 12433 -10551 -24364 -22228 -9696 1473 4852 3064 3285 9076
1296 9076 16985 17256 4197 -16755 -32502 -29997 -8746 18402 34262 28886 8556 -12986 -21166
1309 -21166 -15513 -3773 1972 -1063 -5391 -2360 10468 23245 23275 6233 -19175 -35333 -30612 -6841
1323 -6841 19821 32713 24535 4027 -12611 -15694 -7423 160 -219 -7684 -11818 -3983 13246 26996
1337 26996 25045 5113 -20704 -35278 -27557 -3968 19562 27287 18216 1908 -9286 -8340 -1671
$$ packed form
1242f988Q852J0795R493K216q888j8040j8059r155N700J6532J8057J0688K32o575
1256A4860r252p973p205p127l831L209J2310J8653J4483J290j3904k1897j7759
1269b4143l542J0457J5224J1187L092j257p35L47k117q994j4913j1885J205J7373
1283h701K4688J6795j281j9068k2984j3813K136J2532J1169L379j788K21N791
1296I076P909K71j3059k0952j5747K505K1251K7148J5860n376k0330k1542q180
1309b1166N653J1740N745l035m328L031J2828J2777L0j7042k5408j6158M721K3771
1323f841K6662J2892q178k0508j6638l083Q271P583l79p465m134P835J7229J3750
1337B6996j951j9932k5817j4574P721K3589K3530P725r071j6308j1194R46O669
$$ plain form
1350 -1671 1506 -4271 -12413 -14706 -3454 15374 28831 23771 3153 -19978 -30743 -22511 -2041
1363 -2041 15116 19423 11694 1415 -3877 -1480 2329 -638 -8799 -16599 -14362 -699 17756 26421
1377 26421 19017 1477 -17626 -25425 -15856 -1814 9658 12366 7060 3649 2383 4248 3540 -3820
1391 -3820 -13121 -16376 -10873 3106 17008 22069 15046 -83 -12545 -16701 -11337 -2882 3198 4818
1405 4818 5160 6205 8585 7876 2174 -7594 -15643 -16191 -7702 5110 14810 15602 9348 18 -6916 -8734
1421 -8734 -8071 -6493 -4611 -1143 4736 11265 13735 9222 -964 -11229 -15830 -12289 -2922 6174 9843
1436 9843 9150 5137 2411 475 -2362 -6793 -10947 -10770 -4522 6422 15075 15761 8168 -4226 -13049
1451 -13049 -13389 -6993 815 4538 4058 2843 3308 6423 6949 2213 -6933 -15113 -15462 -5632 8851 17832
$$ packed form
1350a671L177n777q142k293J1252J8828J3457n060k0618k3131j0765Q232K0470
1363b041J7157M307p729j0279n292K397L809k967q161p800K237J3663J8455Q665
1377B6421p404j7540j9103p799R569J4042J1472K708n306l411j266J865p08p360
1391c820r301l255N503J3979J3902N061p023j5129j2462m156N364Q455O080J620
1405D818L42J045K380p09n702r768q049n48Q489J2812R700P92o254r330o934j818
1421h734O63J578J882L468N879O529K470m513j0186j0265m601L541R367R096L669
1436I843o93m013k726j936k837m431m154J77O248J0944Q653O86p593j2394q823
1451a3049l40O396P808L723m80j215M65L115N26m736r146q180l49R830J4483Q981
$$ plain form
1467 17832 16241 5298 -7017 -12999 -9522 -2044 2773 1626 -2010 -1939 3225 10523 12307 4944 -8494
1482 -8494 -18584 -17175 -4619 10831 18769 14310 2008 -8893 -10352 -4739 1732 2921 -2030 -6733
1496 -6733 -4627 4345 14021 15118 4796 -10033 -19726 -16540 -2809 11693 17025 10651 -787 -8205
1510 -8205 -7051 -549 4120 949 -5992 -10085 -5072 6694 16043 15448 3431 -11219 -19135 -13972
1524 -13972 -531 11173 13711 6543 -2375 -6274 -2484 3266 4062 -1228 -8874 -11038 -3658 8033
1538 8033 16302 13858 1987 -11004 -16297 -10543 766 8928 9123 3054 -2524 -2791 1222 4801 2990
1553 2990 -4070 -10388 -9985 -1601 9147 14332 10726 19 -9078 -11876 -6484 1041 5310 4155 805
1568 805 -1067 1200 4454 4652 138 -6615 -10367 -7590 745 8591 11143 6618 -544 -6347 -6717 -3880
$$ packed form
1467A7832j591j0943j2315n982L477P478M817j147l636P1N164P298J784p363j3438
1482h494j0090J409J2556J5450P938m459j2302j0901j459N613O471J189m951m703
1496f733K106Q972R676J097j0322j4829r693L186J3731J4502N332o374j1438p418
1510h205J154O502M669l171o941m093N013J1766R349n95j2017j4650p916N163
1524a3972J3441J1704K538p168q918l899L790N750P96n290p646k164P380J1691
1538H033Q269k444j1871j2991n293N754J1309Q162J95o069n578k67M013L579j811
1553B990p060o318M03Q384J0748N185l606j0707r097k798N392P525M269j155l350
1568H05j872K267L254J98m514o753l752K777Q335P846K552m525p162n803l70K837
$$ plain form
1584 -3880 -351 655 40 -116 1564 4508 5958 3215 -2330 -7286 -8302 -4544 1708 6446 6697 3830
1600 3830 29 -2155 -2163 -2013 -2444 -3242 -2996 -133 4483 6871 5787 839 -4411 -7059 -5323 -1188 2282
1617 2282 3227 2169 1375 1313 2296 1812 -1333 -5205 -6805 -4354 1526 6892 8001 4309 -1430 -5384
1633 -5384 -5439 -1953 940 1473 -38 -1665 185 3508 5660 4342 -1705 -7704 -9044 -4512 3064 8393
1649 8393 7553 2271 -3576 -5320 -2591 1344 2247 -228 -3624 -4370 42 6000 8614 5040 -2857 -9279
1665 -9279 -9326 -3350 4407 8355 5938 -79 -4355 -3991 175 3701 2543 -2217 -6162 -5554 678 7587
1681 7587 9431 4866 -3556 -9258 -8619 -1862 5211 7227 3793 -1774 -4238 -2053 2884 4907 1690
1696 1690 -3990 -7775 -5532 1762 8196 9208 4056 -4094 -8691 -6829 -431 4881 5215 1247 -3034
$$ packed form
1584c880L529J006o15j56J680K944J450k743n545m956j016L758O252M738K51k867
1600C830l801k184qJ50m31p98K46K863M616K388j084m948n250k648J736M135L470
1617B282R45j058p94o2R83m84l145l872j600K451N880N366J109l692n739l954
1633e384n5L486K893N33j511j627J850L323K152j318o047n999j340M532P576N329
1649H393q40n282n847j744K729L935R03k475l396p46M412N958K614l574p897o422
1665i279m7N976P757L948k417o017m276L64M166L526j158m760l945O08O232O909
1681G587J844m565q422n702O39O757P073K016l434n567k464K185M937K023l217
1696A690n680l785K243P294O434J012n152q150m597J862O398N312L34l968m281
$$ plain form
1711 -3034 -3160 218 4657 4886 267 -5508 -8052 -4736 2499 7926 8049 2433 -4047 -6725 -4474 173
1727 173 3681 2381 -825 -2938 -1351 2687 4957 4233 -1200 -6106 -7007 -3066 2669 7272 5483 1103
1743 1103 -3746 -3552 -1883 144 1631 -207 -1259 -2408 1773 3406 5322 3654 -1942 -5028 -6201
1758 -6201 -1480 3033 5115 2586 925 -1546 -908 -400 455 -959 -2725 -3043 -1036 2044 4066 3830
1774 3830 1072 -1693 -4389 -3248 -572 1103 1653 1258 372 1019 786 1304 -17 -2341 -3296 -1933 103
1791 103 3397 4600 2442 349 -1197 -1785 -1705 406 -469 -615 607 1004 4231 3573 1860 -1263 -4429
1808 -4429 -3607 -1679 1082 3079 3338 244 -950 -831 -258 43 -563 -2059 -2612 -2086 1396 4116 4770
1825 4770 1254 -2279 -4929 -3835 -843 1582 2905 1881 -744 -624 268 1577 1661 -699 -3920 -4015
$$ packed form
1711c034j26L378M439K29m619n775k544L316P235N427J23n616o480k678K251M647
1727A73L508j300l206k113J587M038K270p24n433m906r01L941N735M603j789m380
1743A103m849J94J669K027J487j838j052j149M181J633J916j668n596l086j173
1758f201M721M513K082k529j661k471O38N08Q55j414j766l18K007L080K022k36
1774C830k758k765k696J141K676J675N50l95q86O47k33N18j321k324r55J363K036
1791A03L294J203k158k093j546n88Q0K111q75j46J222L97L227o58j713l123l166
1808d429Q22J928K761J997K59l094j194J19N73L01o06j496n53N26L482K720O54
1825D770l516l533k650J094K992K425J323j024k625J20Q92J309Q4k360l221r5
$$ plain form
1841 -4015 -1725 2973 6346 4992 1416 -2863 -5006 -3690 -149 1912 2410 188 -838 -542 1629
1856 1629 3790 2502 -1654 -5454 -4873 -2041 3051 5512 4740 1368 -2533 -4694 -2009 435 1932
1871 1932 841 -1144 -1472 476 3170 4255 1840 -2589 -5941 -5615 -1662 3596 5912 4594 412
1886 412 -2880 -3431 -1898 650 1167 -733 -2009 -1348 1221 4359 4595 1552 -3146 -5969 -4869 -1155
1902 -1155 3159 5105 3667 569 -1545 -1846 -607 64 -471 -1679 -2478 -824 2278 4701 4137 953
1918 953 -3011 -5618 -4350 -985 2313 3819 2756 881 -444 -257 -298 -381 -1430 -2938 -2425 -244 2935
1935 2935 4468 3946 565 -2702 -4549 -3600 -969 1043 2106 1931 1418 1052 1209 33 -1005 -3125
1951 -3125 -3610 -2128 419 3334 4198 3064 592 -1688 -3012 -2793 -1682 -350 831 1306 1967 2446
$$ packed form
1841d015K290M698L373j354l576m279k143J316L541K061M98k222j026K96K171
1856A629K161j288m156l800N81K832N092K461p72l372l901k161K685K444J497
1871A932j091j985l28J948K694J085k415m429l352L26L953N258K316j318m182
1886D12l292n51J533K548N17j900j276O61K569L138K36l043m698k823J100L714
1902a155M314J946j438l098k114l01J239O71n35j208p99J654L102K423n64l184
1918I53l964k607J268L365L298J506j063j875j325J87m1q3j049j508N13K181L179
1935B935J533n22l381l267j847R49K631K012J063j75n13l66J57j176j038k120
1951c125m85J482K547K915Q64j134k472k280j324K19J111J332J181M75O61M79
$$ plain form
1967 2446 1900 330 -1946 -3770 -3525 -1968 1185 3031 3494 2281 489 -952 -1691 -1982 -2054 -1751 -744
1984 -744 1116 2726 3873 2843 147 -2842 -4019 -3549 -1276 1187 2684 2525 1660 751 123 -528 -1478
2001 -1478 -2607 -3341 -2214 949 3755 4660 3414 -24 -3141 -4271 -3115 -907 1439 1811 1347 1165
2017 1165 1165 1642 685 -1027 -3257 -4517 -3046 673 4406 5278 3668 -258 -3409 -4063 -2720 -725 958
2034 958 937 981 818 1745 2735 1955 -1223 -4111 -4948 -3313 910 4449 5698 3464 -8 -2993 -3585 -2103
2052 -2103 -525 206 38 -7 937 2584 3633 1878 -1098 -4002 -5545 -3369 621 4950 4987 2691 -43
2069 -43 -2568 -2780 -1425 -750 -473 -793 -422 1292 3355 4021 2342 -1193 -4354 -5343 -3305 653 3859
2086 3859 4317 2600 77 -1587 -1777 -1482 -1008 -1435 -1517 -537 1904 3772 4104 2153 -1414 -4447 -5214
$$ packed form
1967B446n46j570k276j824K45J557L153J846M63j213j792j441p39k91p2L03J007
1984g44J860J610J147j030k696k989j177M70K273K463J497j59q65r09o28o51r50
2001a478j129p34J127L163K806R05j246l438l117j130J156K208K346L72m64j82
2017A165%M77r57j712k230j260J471L719L733Q72j610l926l151o54J343J995J683
2034I58k1M4j63R27R90p80l178k888q37J635M223L539J249k234l472k985n92J482
2052b103J578P31j68m5R44J647J049j755k976k904j543K176L990M329L7k296k734
2069d3k525k12J355O75K77l20L71J714K063O66j679l535l161r89K038L958L206
2086C859M58j717k523j664j90K95M74m27q2R80K441J868L32j951l567l033p67
$$ plain form
2103 -5214 -2710 235 2850 3302 2418 829 -325 -301 -1395 -1820 -2971 -2149 -440 2010 4070 4088 2009
2120 2009 -1386 -3821 -4465 -2334 -270 2307 2581 2137 1413 887 49 -1385 -2587 -3466 -2888 -490 2375
2137 2375 4146 3935 1846 -1251 -3240 -3567 -2253 -746 672 1393 2198 2680 2239 992 -1720 -3611
2153 -3611 -4052 -2485 402 2804 3915 2922 1396 -659 -2085 -2178 -2069 -2063 -800 790 2426 3741 3223
2170 3223 1296 -2086 -4269 -4428 -1696 685 2695 3350 2241 1115 -86 -703 -1269 -2232 -2621 -2322 115
2187 115 2875 4326 3842 1615 -2279 -4329 -4023 -1906 1132 2315 2335 1325 954 845 527 -674 -2518
2204 -2518 -3613 -3033 -272 3200 5118 4547 1230 -2511 -4598 -3606 -1242 940 1948 1148 913 1054
2220 1054 1737 1692 -301 -2793 -4796 -3904 -500 3761 5544 4362 981 -2508 -4090 -3124 -822 862
$$ packed form
2103e214K504K945K615M52q84j589j154K4j094m25j151Q22J709K450K060J8k079
2120B009l395k435o44K131K064K577K74m44p24n26q38j434j202q79N78K398K865
2137B375J771k11k089l097j989l27J314J507J418P21Q05M82m41j247k712j891
2153c611m41J567K887K402J111r93j526k055j426r3J09OJ263J590J636J315n18
2170C223j927l382k183j59K732K381K010O55j109j126j201o17n66r63l89K99K437
2187A15K760J451m84k227l894k050L06K117L038J183K0j010l71j09l18j201j844
2204b518j095N80K761L472J918n71l317l741k087R92K364K182J008q00k35J41
2220A054O83m5j993k492k003Q92L404M261J783j182l381l489j582R66K302J684
$$ plain form
2236 862 1004 499 714 1548 2724 2265 -89 -3613 -5325 -3828 -121 3652 5281 4247 585 -2375
2252 -2375 -3105 -2097 -822 72 -30 -305 635 2005 3778 3128 -403 -3753 -5646 -3750 -105 3266
2268 3266 4932 3361 467 -1823 -2418 -1707 -981 -1041 -1135 -639 1030 3042 3917 2468 -881 -4130 -5101
2285 -5101 -3269 32 2916 4073 2617 850 -696 -1381 -1092 -1588 -2163 -2055 -661 1856 3766 4164
2301 4164 2151 -1055 -3849 -4118 -2488 -5 2223 2845 2279 1500 648 170 -1090 -2182 -2811 -2224 -571
2318 -571 2069 4097 3737 1530 -845 -3243 -3134 -2368 -649 683 1473 1840 2073 2042 925 -1197 -3035
2335 -3035 -3560 -2277 106 2595 4058 2794 1022 -870 -1839 -2312 -1915 -1356 -783 389 1834 3285
2351 3285 3116 973 -1573 -3598 -3866 -2483 821 2749 3342 1907 785 -622 -984 -979 -1782 -2150 -1955
$$ packed form
2236H62J42n05K15Q34J176m59k354l524j712J497L707L773J629j034l662k960
2252b375p30J008J275Q94j02k75R40J370J773o50l531l350j893J896L645L371
2268C266J666j571k894k290n95P11P26o0r4M96J669K012Q75j449l349l249r71
2285e101J832L301K884J157j456j767j546o85K89m96n75J08J394K517J910L98
2301D164k013l206k794k69J630K483K228O22n66p79q52m78j260j092o29N87J653
2318e71K640K028l60k207k375k398J09P66J719J332P90L67K33l1j117k122j838
2335c035n25J283K383K489J463j264j772j892r69m73L97N59N73J172J445J451
2351C285j69k143k546k025k68J383L304J928N93j435j122j407l62Nq03l68J95
$$ plain form
2368 -1955 -407 2211 4084 3995 1200 -2053 -4174 -4189 -1901 1249 2916 2336 1270 391 142 709 -200
2385 -200 -1882 -3507 -3128 -736 2710 4821 4576 1152 -2318 -4423 -3360 -952 1375 2088 1142 589
2401 589 721 1471 1636 260 -2229 -3981 -3886 -736 3343 5375 4194 990 -2931 -4147 -2847 -330
2417 -330 1239 860 852 -9 815 2300 2612 254 -2708 -4748 -3930 -534 3464 4922 3626 483 -2362
2434 -2362 -3484 -2102 -256 390 176 -555 121 1661 3239 2451 28 -3226 -5005 -3440 -201 3441
2450 3441 4613 2953 -54 -1794 -2168 -1281 -543 -446 -1074 -860 319 2472 3680 2382 -488 -3412 -4511
2467 -4511 -3315 -145 2778 3466 2301 481 -835 -1050 -893 -1125 -1661 -1712 -768 1025 2951 3360 2022
2484 2022 -828 -3114 -4018 -2474 64 2120 2292 1631 923 392 0 -735 -1490 -2408 -2168 -753 1881
$$ packed form
2368a955J548K618J873q9k795l253k121j5K288L150J667n80j066q79k49N67r09
2385b00j682j625L79K392L446K111k45l424l470k105J063K408K327P13r46n53
2401E89J32P50J65j376k489j752R5L150M079K032j181l204l921j216J300K517
2417c30J569l79qq61Q24J485L12k358k962k040Q18L396L998J458j296l143k845
2434b362j122J382J846O46k14p31O76J540J578p88k423l254j779J565L239L642
2450C441J172j660l007j740l74Q87P38R7o28K14J179K153J208j298k870k924j099
2467d511J196L170K923O88j165j820j316k15J57k32n36n1R44J793J926M09j338
2484B022k850k286r04J544K538K056J72o61p08n31l92p35p55r18K40J415K634
$$ plain form
2501 1881 3292 3279 1117 -1266 -2653 -2743 -1878 -187 800 1289 1374 1549 1796 695 -816 -2741 -3201 -2155
2519 -2155 59 2683 2976 2536 617 -985 -2101 -1722 -1390 -1047 -591 189 1240 2365 2703 1417 -1219
2536 -1219 -3473 -3692 -1882 747 2437 2959 1532 321 -664 -887 -468 -779 -1595 -1837 -525 1697 3396
2553 3396 3705 1401 -1890 -3939 -3673 -1360 1323 2797 2080 589 188 291 672 258 -1106 -2632 -2694
2570 -2694 -942 2190 4302 3914 815 -2497 -4035 -3036 -796 1395 2063 938 -116 191 1253 1658
2586 1658 455 -1569 -3705 -3577 -668 2907 4660 3643 494 -2685 -3815 -2360 -76 1288 916
2601 916 132 5 698 1825 2132 574 -2467 -4205 -3344 -300 2966 4657 3001 66 -2499 -2824 -1761
2618 -1761 -65 825 148 -717 -223 1095 2275 2688 -341 -2008 -4059 -3183 230 3223 4272 2670
$$ packed form
2501A881J411j3k162k383j387r0Q65J691R87M89Q5J75K47j101j511j925m60J046
2519b155K214K624K93m40j919j602j116L79L32L43M56P80J051J125L38j286k636
2536a219k254k19J810K629J690N22j427j211r85k23M19l11q16k42J312K222J699
2553C396L09k304l291k049K66K313K683J474p17j491m01J03L81m14j364j526o2
2570b694J752L132K112l88l099l312j538R99K240K191O68j125j054L07J062M05
2586A658j203k024k136J28K909L575J753j017l149l179j130J455K284J364l72
2601I16p84j27O93J127L07j558l041j738Q61L044L266J691j656k935k565l25J063
2618a761J696Q90o77q65M94J318J180M13l029j667k051Q76L413K993J049j602
$$ plain form
2634 2670 -358 -1943 -2060 -420 -155 496 -400 -667 595 1883 3511 2898 -676 -2387 -3613 -2458
2650 -2458 373 2609 3364 1190 729 -163 -1103 -395 -522 -1997 -1108 -383 848 2597 3044 2185 -1089
2667 -1089 -3242 -3139 -1475 -208 1297 1953 1324 835 57 32 -627 -1266 -2092 -1870 -492 1570 2896 2379
2685 2379 1186 -1277 -2724 -2040 -859 -197 647 802 785 1238 1664 1034 -378 -2051 -2728 -1813 469 2027
2703 2027 2759 2118 104 -1167 -1352 -1140 -396 -458 -651 -304 1010 2044 2130 1271 -1142 -2986 -3011 -1190
2721 -1190 967 2409 2187 890 -217 -635 -237 121 -382 -1676 -1715 -454 1499 2920 2827 950 -1761
2738 -1761 -3423 -2907 -656 1422 1916 1516 23 -454 -47 924 459 -959 -2379 -2471 -794 1885 3614
2755 3614 2978 645 -2185 -3416 -2295 -6 1629 1663 600 -586 -207 751 1409 518 -1325 -3042 -2672
$$ packed form
2634B670l028j585j17J640K65O51q96k67J262J288J628o13l574j711j226J155
2650b458K831K236P55k174m61q92r40P08j27j475Q89P25J231J749M47q59l274
2667a089k153J03J664J267J505O56o29m89p78k5o59o39q26K22J378K062J326n17
2685B379j193k463j447O84J181O62Q44J55j7M53M26o30j412j673o77R15K282J558
2703B027P32o41k014j271j85K12P44o2j93L47J314J034Q6q59k413j844k5J821
2721a190K157J442k22j297j107m18L98L58n03j294l9J261J953J421r3j877k711
2738a761j662N16K251K078M94m00j493m77M07R71m65j418j420r2J677K679J729
2755C614o36k333k830j231J121K289J635L4j063j186L79R58O58q91j843j717L70
$$ plain form
2772 -2672 -414 2256 3884 2650 -86 -2342 -2937 -1603 246 1222 988 -300 -602 505 1713 1818
2788 1818 518 -2012 -3487 -2668 -292 2745 3738 2542 -487 -2354 -2525 -1073 705 808 13 -776
2804 -776 -210 1079 2551 2105 52 -2530 -3585 -2371 429 2675 2858 1730 -342 -1582 -1303 -345
2820 -345 186 83 -1066 -934 -71 1774 2570 1803 -468 -2737 -3205 -1364 603 2310 2361 900 -603
2837 -603 -943 -329 69 -281 -744 -1428 -872 470 2200 2506 1292 -878 -2509 -2476 -969 522 1612 1311
2855 1311 819 83 149 574 -106 -1372 -1913 -1680 -369 1550 2302 2039 391 -1122 -1774 -1505 -471 203
2873 203 161 561 658 779 1023 639 -315 -1642 -2036 -1369 485 1925 1981 1310 -50 -1010 -1130 -660 -458 -158
2893 -158 -517 -75 698 1667 1916 936 -1077 -2362 -2526 -951 1110 1875 1428 406 -596 -514 -130 315
$$ packed form
2772b672K258K670J628j234k736k256n95J334J849R76k34j288l02J107J208J05
2788A818j300k530j475Q19K376L037R93j196l029j867j71J452J778J03p95p89
2804g76N66J289J472m46k053k582j055J214K800K246J83j128k072j240K79R58
2820c45N31j03j149J32Q63J845P96p67k271k269m68J841J967J707N1j461j503
2837f03l40O14L98l50m63o84N56J342J730L06j214k170j631L3J507J491J090l01
2855A311m92p36O6M25o80j266n41K33J311J919P52k63j648j513o52K69J034O74
2873B03m2M00R7J21K44l84r54j327l94O67J854J440N6o71j360r60j20M70K02L00
2893a58l59M42P73R69K49r80k013j285j64J575K061P65m47j022j002Q2L84M45
$$ plain form
2911 315 -313 -1157 -1336 -471 1269 2268 2294 551 -1654 -2589 -1796 -137 1353 1618 779 -154 -685 44 780
2930 780 569 -525 -2045 -2062 -71 1814 2940 2307 32 -2005 -2746 -1488 305 1438 1084 177 -585
2947 -585 24 842 1451 291 -1135 -2981 -2164 -227 2054 3261 2120 -521 -2173 -2214 -872 534 1188
2964 1188 470 -590 -697 317 1386 1612 348 -1675 -2716 -1835 188 2320 2989 1524 -737 -2325
2980 -2325 -1597 -338 778 522 -523 -852 -376 827 1989 1537 -121 -2273 -2872 -1831 482 2476
2996 2476 2210 772 -843 -1126 -876 154 276 -176 -766 -742 -160 1285 2357 1376 -514 -2274 -2430 -989
3014 -989 1019 1912 1552 425 -572 -757 -516 203 69 -611 -1064 -748 831 1954 1989 696 -1019 -1965
3032 -1965 -1791 -622 642 1006 746 -100 85 390 488 -14 -713 -1259 -1302 -37 1107 1735 1160 118 -723
$$ packed form
2911C15o28q44j79Q65J740R99K6j743k205r35P93J659J490K65q39r33n31P29P36
2930G80k11j094j520j7J991J885J126o33k275k037p41J258J793J133l54r07p62
2947e85O09Q18O09j160j426j846Q17J937K281J207j141k641j652m1J342J406O54
2964A188p18j060j07J014J069K26j264k023j041Q81K023K132O69j465k261j588
2980b325P28J259J116k56j045l29M76J203J162m52j658k152n99J041K313J994
2996B476k66j438j615k83K50J030J22m52n90K4N82J445J072r81j890j760j56J441
3014i89K008Q93l60j127r97j85K41P19j34o80m53L16J579J123L5j293j715r46
3032a965J74J169J264L64k60q46J85L05R8n02o99n46m3J265J144O28n75j042q41
$$ plain form
3051 -723 -1392 -799 -306 235 97 175 355 604 1071 699 34 -1506 -1690 -862 620 1524 1506 859 -297 -782
3071 -782 -425 -157 -161 -503 -245 -273 600 1505 1219 775 -918 -1933 -1894 -218 1136 1625 880 -273 -494 -403
3091 -403 -28 33 -25 -840 -1145 -574 903 1882 2074 442 -1136 -2007 -1661 28 1023 1559 396 -246 -514
3110 -514 258 647 319 -325 -1506 -1627 -104 1381 2112 1473 -340 -1736 -2279 -785 470 1108 932 -254
3128 -254 -583 77 1020 1318 335 -995 -2136 -1647 -49 2025 2389 1324 -563 -1485 -1520 -617 716 731
3146 731 151 -713 -766 211 1182 1066 137 -1441 -2158 -1628 374 1992 1422 1100 -975 -1469 -911 -229 679
3165 679 439 -411 -1073 -478 761 1577 1464 -570 -1938 -2360 -920 687 1972 1682 248 -1136 -101
3182 -101 442 -277 186 -136 -1013 -782 253 708 1630 406 -422 -1796 -1352 -799 638 1444 1146 181 -750
$$ packed form
3051g23o69N93M93N41j38P8J80K49M67l72o65j540j84Q28J482R04j8o47j156m85
3071g82L57K68ml42K58k8Q73R05k86m44j693j015L9J676J354M89p45j153k21R1
3091d03L75O1n8q15l05N71J477R79J92j632j578q71L46J689R95N36j163o42k68
3110e14P72L89l28o44j181j21J523J485P31o39j813j396n43J494J255O38j76j186
3128b54l29O60R43K98r83j330j141M89J598K074L64j065j887r22l5R03J333J5
3146G31n80q64n3R77R71j16r29j578p17N30K002J618n70l22k075m94N58O82R08
3165F79k40q50o62N95J239Q16j13k034j368m22J440J607J285k90j434j384J035
3182a01N43p19M63l22q77K31J035M55R22j224q28j374M44N53J437Q06k98r65r31
$$ plain form
3201 -750 -258 -90 105 110 -363 -893 -184 615 1394 1457 499 -654 -1398 -1100 65 875 1162 524 333 -26
3221 -26 598 536 -169 -611 -650 -1093 -31 993 1409 1156 -260 -953 -739 -322 257 351 313 -83 143 499 784
3242 784 444 -359 -1134 -985 -839 504 925 1083 286 -322 -754 -653 -25 -3 -316 -347 -235 320 1116 867
3262 867 179 -1120 -1410 -1013 -43 976 1291 520 -107 -381 -343 109 222 -78 -632 -819 -445 648 1643
3281 1643 1253 -173 -1216 -1383 -881 324 1265 965 105 -454 -261 -142 735 326 -584 -1122 -1221 -275 1154
3300 1154 1890 1220 -457 -1241 -1432 -255 701 980 349 -401 -856 -146 716 1131 402 -1159 -1482 -861 295
3319 295 1446 1551 812 -761 -1553 -1055 -317 716 966 87 -654 -675 250 1106 696 -37 -1103 -1777 -889
3338 -889 503 1939 1555 367 -723 -944 -512 290 736 -5 -317 -771 -345 771 1556 1031 -345 -1520
$$ packed form
3201g50M92J68J95Nm73n30P09P99P79O3r58j153p44K98J165Q10K87o38j91l59
3221b6O24o2p05m42l9m43J062J024M16k53j416o93K14M17N79R4l8l96K26L56K85
3242G84l40q03p75J49J46J343M21J58p97o08m32J01O28K2l13l1J12N55P96k49
3262H67o88j299k90L97R70J019L15p71o27k74L8M52J13l00n54j87L74J093R95
3281A643l90j426j043j67N02J205R41l00q60n59J93J19Q77m09r10n38r9R46J429
3300A154P36o70j677p84j91J177R56K79o31p50m55P10Q62M15p29j561l23O21J156
3319B95J151J05p39j573p92M98P38J033K50q79p41k1R25Q56m10p33j066o74Q88
3338h89J392J436l84j188j090k21M32Q02M46p41l12m54M26J116P85n25j376j175
$$ plain form
3356 -1520 -1556 -687 722 1545 1025 -92 -928 -930 -1 474 220 -74 -701 -794 140 1085 1284 537 -621 -1715
3376 -1715 -1176 -138 687 1053 796 -102 -314 -165 122 189 -75 -203 -879 -180 593 950 1007 8 -793 -1012
3396 -1012 -646 217 636 345 206 -123 -78 346 385 93 -255 -715 -448 -62 866 795 339 -420 -871 -326 3
3417 3 255 290 7 -45 62 273 801 413 -119 -1005 -745 -437 659 1187 703 -183 -505 -545 -164 344 139
3438 139 -231 -510 -168 339 790 881 182 -567 -1252 -732 34 702 828 335 -271 -347 -239 200 156 -49 -530
3459 -530 -463 -411 393 783 713 72 -773 -985 -506 454 773 434 300 -463 -183 263 731 340 -154 -937 -836
3480 -836 -180 890 1252 401 -156 -676 -920 -39 757 298 271 -360 -627 -98 619 643 74 -644 -1219 -648
3500 -648 -70 1233 1082 423 -529 -931 -634 -35 919 495 78 -511 -490 130 687 881 269 -885 -861 -485
$$ packed form
3356a520l6Q69J409Q23n20j117q36kR29M75k54k94o27r3R34R45J99p47j158j094
3376a715N39J038Q25L66k57q98k12J49K87O7k64j28o76O99P73L57N7r99q01k19
3396a012L66Q63M19k91j39l29M5M24L9k92l48m60K67L86R28p1m56p59m51N45L29
3417CK52L5k83n2J07K11N28l88n32q86K60L08J096N28m84q86l22m0L81N08k05
3438A39l70k79L42N07M51R1o99p49o85N20P66O68J26m93o06p6J08M39m4k05m81
3459e30O7N2Q04L90p0o41q45k12M79R60L19l39j34p63K80M46M68l91m94p83J01
3480h36O56J070L62q51n57n20k44Q81P96m59k7o31k67N29P17K4n69p18n75N71
3500f48N78J303j51o59r52m02K97N99R54m24m17n89K1O20N57J94o12j154K4L76
$$ plain form
3520 -485 421 937 875 383 -595 -822 -489 268 652 261 -301 -671 -314 605 845 468 -370 -1125 -768 -258
3540 -258 250 801 651 -87 -728 -311 -144 429 134 42 -519 -387 -183 587 933 195 -204 -966 -926 43 844
3561 844 563 35 -348 -353 -7 261 356 -194 -349 -537 -402 341 628 567 -7 -403 -765 -355 143 355 220
3582 220 -41 -434 -204 -151 226 89 -128 -741 -253 137 503 754 -87 -379 -614 -489 35 378 110 -17
3602 -17 -76 -286 347 116 423 -65 -366 -511 -103 523 545 334 39 -507 -299 -118 18 108 -126 -540 -243
3623 -243 381 553 520 123 -520 -644 -447 341 751 773 141 -367 -436 -89 466 146 -174 -314 -640 -32 486
3644 486 594 528 -250 -446 -481 -298 246 477 60 -226 -468 -174 -341 449 -82 12 -610 -323 401 597 616
3665 616 549 -483 -699 -588 176 561 441 -53 -166 -340 -11 555 527 -154 -403 -868 -541 199 425 599
$$ packed form
3520d85R06N16o2m92r78k27L33P57L84l91n62l70L57R19K40l77q38p55L57N10
3540b58N08N51j50p38o41M17J67N73k95r2n61J32K04P70L46p38l99p62M0R69Q01
3561H44k81n28l83nL46K68R5n50j55j88J35P43K87o1n74l96l62M10M98K12j35
3582B20k61l93K30N3L77j37k17o13M88L90L66K51q41k92k35J25N24L43k68j27
3602a7n9k10O33k31L07m88l01j45M08O26K2k11k95n46K08J81J36R0k34m14K97
3623b43O24J72l3l97o43j24J97P88M10K2o32n08o9L47N55l20l20j40l26O08N18
3644D86J08o6p78j96l5J83N44K31m17k86k42K94j67P90n31R4o22K87P24J96J9
3665F16o7j032k16J11P64L85j20m94j13j74L29N66k8o81k49m65L27P40K26J74
$$ plain form
3685 599 206 -450 -673 -127 60 405 301 -381 36 -1512 -279 852 338 103 -720 -447 -151 619 750
3704 750 829 103 -21 184 -351 -380 657 -1 123 -358 -87 323 709 335 29 -730 -649 -114 339 721 205
3725 205 76 -541 -284 -63 275 155 131 -599 -420 348 328 348 -41 -105 -554 -699 131 275 36 210 -172
3746 -172 -431 -44 102 194 -5 -265 -645 38 508 227 624 -208 -252 -75 157 197 334 111 34 -339 -453
3767 -453 173 124 -93 -197 -610 -116 120 384 352 -1 -242 -499 -248 303 196 199 105 -127 -89 227 521 155
3789 155 -196 -150 -362 -43 201 393 -8 -128 -222 35 17 132 422 99 -317 -4 151 422 381 87 -503
3810 -503 -299 -315 230 473 701 261 -223 -290 -336 307 435 147 -417 -556 146 255 609 225 -29 -410 -457
3831 -457 -141 272 674 -8 -40 -466 -166 49 122 318 -242 -452 -228 22 249 482 132 -215 -616 -147 161
$$ packed form
3685E99l93o56k23N46J87L45j04o82M17j548J233J131n14k35q23K73K96P70J31
3704G50P9p26j24K05n35k9J037o58J24m81K71M10L86l74l06p59Q1N35M53L82n16
3725B05j29o17K57K21L38j20k4p30J79P68k0K0l89o4m49j45Q30J44k39J74l82
3746a72k59L87J46R2j99k60l80O83M70k81L97q32m4J77K32M0J37k23p7l73j14
3767d53O26m9k17j04m13M94K36K64l2l53k41k57K51N51j07Lr4k32L8L16K94l66
3789A55l51M6k12L19K44J92m01j20r4K57j8J15K90l23m16L13J55K71m1k94n90
3810e03K04j6N45K43K28m40m84o7m6O43J28k88n64j39P02J09L54l84k54l81m7
3831d57L16M13M02o82l2m26L00K15P3J96n60k10K24K50K27K33l50l47m01M69L08
$$ plain form
3852 161 648 400 -26 -441 -554 75 391 440 102 -238 -348 -53 222 485 476 60 -519 -525 -134 169 532 416
3874 416 -226 -662 -169 211 323 333 -143 -180 -505 -132 -27 480 390 -84 -495 -148 -78 192 252 110 -78 -210
3896 -210 -157 94 524 622 -396 -327 -394 -165 444 210 395 47 -411 -188 277 402 304 -210 -247 -95 158 638
3918 638 437 149 -96 -378 -130 320 238 101 175 -354 -227 -62 74 353 466 93 -245 62 207 340 7
3939 7 207 -350 -178 -404 22 120 67 -300 -21 -131 409 344 364 -61 -144 11 -162 164 484 37 -257 -67
3961 -67 -93 156 435 194 -63 -126 -282 223 187 307 101 -142 25 306 241 223 154 20 -34 -234 197 201 -40
3984 -40 -389 -417 -199 27 179 342 193 -364 -179 -212 406 117 134 -103 -67 -231 -93 371 286 45 -274 -390
4006 -390 97 166 145 235 48 -353 -403 35 131 341 48 -267 -185 1 341 312 198 -161 -294 -371 -141 133 121
$$ packed form
3852A61M87k48m26m15j13O29L16M9l38l40j10K95K75K63rm16n79oL91L03L63j16
3874D16o42m36M93L80J12J0m76l7l25L73J05N07r0m74m11L47P0K70O0j42j88j32
3896b10N3K51M30R8j018O9o7K29O09k34J85l48m58K23M65J25r8n14l7J52K53M80
3918F38k01k88k45k82K48M50q2j37P4n29J27J65J36K79J13l73l38L07J45J33l33
3939GK00n57J72k26M26R8n3l67K79j10N40o5K0m25q3J55j73L26L20m47k94J90
3961f7k6K49K79k41k57o3j56N05l6J20k06k43J67K81o5j8o9j34n4k00M31Mk41
3984d0l49k8K18K26J52J63j49n57J85l3O18k89J7k37L6j64J38M64q5k41l19j16
4006c90M87O9k1R0j87m01n0M38R6K10k93l15Q2J86L40k9j14l59j33p7K30K74j2
$$ plain form
4029 121 142 -12 -456 -94 -26 53 142 94 -221 -375 32 425 31 467 -16 -596 -197 76 415 273 -82 -272
4051 -272 -371 -503 249 873 352 370 -279 -114 136 231 179 -1 -83 -183 82 286 339 247 -171 -449 -142 106
4073 106 182 31 -238 65 38 47 -300 656 282 -161 581 -189 -164 846 187 248 -458 -19 -592 -66 246 -211
4095 -211 -125 -268 -222 -191 329 -92 -110 -49 -57 -413 -40 -97 186 -98 -450 -273 -33 134 270 348 -250 -386 -262
4118 -262 -14 414 387 59 -208 -19 218 -53 43 51 219 -97 -25 220 643 259 313 -79 -233 44 58 138 -63
4141 -63 83 114 178 -209 269 14 60 -275 -95 48 75 160 -51 -212 -150 -1 6 154 142 -131 -227 -156 -217 372
4165 372 72 177 245 -217 -184 -60 92 78 -219 -262 -341 99 51 204 -113 7 -73 118 101 121 260 34 -279
4188 -279 -146 -62 172 276 394 -144 -453 168 409 380 82 122 -118 -37 -31 188 118 -18 -367 -99 -415 88
$$ packed form
4029A21K1j54m44L62O8P9Q9m8l15j54M07L93l94M36m83n80L99K73L39j42l55j90
4051b72r9j32P52O24n21J8o49J65K50R5n2j80q2j00K65K04N3r2m18k78L07K48
4073A06P6j51k69L03k7Rl47R56l74m43P42p70K5J010o59O1p06M39n73N26L12m57
4095b11Q6j43M6L1N20m21j8O1ql56L73n7K83k84l52J77K40J67J36P8n98j36J24
4118b62K48M28k7l28k67J89K37k71R6QJ68l16P2K45M23l84N4l92j54K77J4Q0k01
4141f3J46L1O4l87M78k55M6l35J80J43K7Q5k11j61O2J49PJ48j2k73r6P1o1N89
4165C72l00J05O8m62L3J24J52j4k97m3p9M40m8J53l17J20q0J91j7K0J39k26l13
4188b79J33Q4K34J04J18n38l09O21K41k9k98M0k40Q1OK19p0j36l49K68l16N03
$$ plain form
4210 88 101 166 121 -281 -268 -163 163 266 -84 -191 -363 -92 47 466 362 -19 -311 -266 -122 270 165 -166
4232 -166 -119 -474 -147 199 251 -34 -156 -126 -329 241 327 244 225 -259 -296 -121 1 12 94 78 -155 -92 48 373
4256 373 26 199 -92 -603 -326 -129 231 212 90 -46 -5 -252 89 327 -40 -279 -46 -173 -4 675 156
4277 156 64 -439 -323 -92 109 248 34 -51 -68 -72 194 371 52 -110 -127 -249 -37 155 -24 132 -311 -203
4299 -203 -229 -24 369 146 82 48 -75 -368 -224 101 -138 155 -137 -343 -109 354 294 -109 -145 -201 222 151
4321 151 49 247 370 34 -135 33 285 -16 -66 -224 -1 256 360 129 26 -43 -181 -80 68 135 310
4342 310 -146 -218 -3 -282 141 88 -122 -351 -214 -265 229 447 252 -354 -236 93 -32 156 113 -62 -73 -215
4364 -215 -210 224 555 -178 160 -200 -46 16 122 223 -5 74 -163 -178 133 246 123 68 -389 -206 159 8
$$ packed form
4210H8J3O5m5m02J3J05L26J03l50j07j72K71J39M19j04l81k92M5J44L92j05l31
4232a66M7l55L27L46N2k85j22L0k03N70Q6q3j9m84l7J75J22J1Q2j6k33O3J40L25
4256C73l47J73k91n11K77J97L60j9j22j36M1k47L41K38l67k39K33j27J69O79n19
4277A56r2n03J16K31K01J39k14q5j7mK66J77l19j62j7j22K12J92j79J56m43J08
4299b03k6K05L93k23o4l4j23k93J44L25k39K93k92k06K34M63o0m03l6n6M23p1
4321A51j02J98J23l36j69J68K52l01n0j58K23K57J04k31j03o9j38J01J48O7J75
4342C10m56p2K15k79M23n3k10k29J37n1M94K18j95o06J18L29j25J88m3j75j1j42
4364b15NM34L31p33L38l60J54O2J06J01k28P9k37j5L11J13j23n5m57J83L65j51
$$ plain form
4386 8 7 16 45 -96 -99 177 106 134 -146 -134 -241 124 -119 222 -30 27 -98 -360 -9 281 81 -193 -295 -101
4410 -101 -164 272 115 -75 64 -196 -205 198 -102 -112 -152 -209 -429 -52 61 241 228 -129 -297 150 82 174 -198
4433 -198 -82 -212 -66 467 156 305 -74 -247 -309 -306 185 104 271 111 186 -201 -320 -214 212 76 -49 -229
4455 -229 111 69 299 333 -97 -158 152 -57 48 24 152 202 -99 -104 -79 25 -151 -46 -404 -272 -124 -83 8
4478 8 -305 -109 126 -324 -87 -43 245 191 -249 -181 -31 255 115 12 -227 -175 -69 1 175 269 87 -235 129
4501 129 -118 -255 20 150 -89 117 -4 -75 90 110 -112 -123 -62 118 169 327 127 -48 41 -12 -32 -45 -5
4524 -5 77 112 156 -60 -84 258 6 -98 -306 -128 242 327 355 24 195 71 121 11 129 -162 -124 -221 18 -163
4548 -163 219 -50 -353 -39 -10 -30 25 -68 -25 -47 9 -189 -81 422 54 -110 -133 13 -14 130 42 1 -232 -152
$$ packed form
4386HjRK9j41lK76p1K8k80J2j07L65k43L41k52N7j25k62L51K90k00k74j02J94
4410a01o3M36j57j90J39k60rM03l00j0m0n7k20L77J13J80j3l57j68M47o8R2l72
4433a98J16j30J46N33l11J49l79j73o2LM91q1J67j60P5l87j19J06M26j36j25j80
4455b29L40m2K30L4m30o1L10k09J05k4J28N0l01nK5J04j76J05l58J32J48M1R1
4478Hl13J96K35m50K37M4K88n4m40O8J50K86j40j03k39N2J06P0J74R4j82l22L64
4501A29k47j37K75J30k39K06j21p1J65K0k22j1O1J80N1J58k00j75Q9n3k0j3M0
4524eQ2L5M4k16k4L42k52j04k08J78L70Q5K8l31J71j24N0j10J18k91L8r7K39j81
4548a63L82k69l03L14K9k0N5r3M3k2N6j98J08N03l68j64k3J46k7J44q8m1k33Q0
$$ plain form
4572 -152 111 -42 288 153 308 80 -66 103 233 -212 177 -159 60 72 165 101 75 -41 -44 -188 -214 248
4594 248 -29 -59 -101 -8 -146 -136 228 223 -239 -67 -12 -175 275 -10 -41 80 -134 -62 -317 64 72 -432 187 -101
4618 -101 -14 147 -22 185 42 -97 -40 177 230 178 3 -494 -123 -313 273 -53 28 -113 -138 38 25 396
4640 396 172 -291 -207 -237 -61 29 47 215 73 -33 -31 139 -59 20 -236 -157 -2 135 -40 210 144 80 50 9
4664 9 180 -219 16 300 -71 -14 -441 -41 72 -168 -293 67 -287 -12 114 94 -107 -193 -266 -79 74 53
4686 53 154 -14 174 -96 36 162 41 -62 -119 -397 -12 142 231 -28 -21 -45 31 -7 3 -61 106 -153 128
4709 128 124 68 -26 216 -128 102 -129 221 277 173 107 -294 -254 103 -88 -62 73 -157 -255 -26 138 187 -76
4732 -76 -134 -38 -88 -21 204 355 149 83 75 -78 -179 -68 -351 79 -156 -21 483 42 138 90 -58 -152 -253 94
$$ packed form
4572a52K63j53L30j35J55k28j46J69J30m45L89l36K19J2R3o4k6j16lj44k6M62
4594B48k77l0m2R3j38J0L64nm62J72N5j63M50k85l1J21k14P2k55L81Qn04O19k88
4618a01Q7J61j69K07j43j39N7K17N3n2j75m97L71j90N86l26Q1j41k5J76j3L71
4640C96k24m63Q4l0J76R0J8J68j42j06KJ70j98P9k56P9J55J37j75K50o6o4l0m1
4664IJ71l99K35K84l71N7m27M00J13k40j25L60l54K75J26k0k01q6p3J87J53k1
4686E3J01j68J88k70J32J26j21j03n7k78L85J54Q9k59Pk4P6l8J0o4J67k59K81
4709A28mn6r4K42l44K30k31L50N6j04o6m01M0L57j91K6J35k30r8K29J64M9k63
4732g6n8R6n0O7K25J51k06o6qj53j01J11k83M30k35J35N04m41R6m8j48r4j01L47
$$ plain form
4756 94 42 -18 -247 -85 14 -70 -90 150 -242 -126 -483 -89 -20 62 -24 130 -175 -15 -310 291 282 72 -101 -89
4780 -89 -33 69 131 -72 -28 -68 -58 109 233 157 41 28 -33 -100 14 -30 -35 51 78 152 -4 -171 -57 106 -159
4805 -159 -529 -225 -10 238 286 61 -37 -122 -32 207 -65 -71 192 -47 -198 -14 221 159 -148 -148 -294 204 -180
4828 -180 169 93 -219 61 -45 118 -208 -182 41 -141 -299 -48 134 -39 148 47 210 -65 88 -14 155
4849 155 -39 -451 -80 135 6 132 -174 -253 -14 -111 100 146 57 8 19 115 19 -3 -114 -40 -61 -157 -5 46
4873 46 -143 23 160 -138 -286 -13 -20 177 187 -175 -120 179 59 198 103 93 -5 20 -115 -148 -81 14 -272 -284
4897 -284 -30 -84 91 119 6 -210 133 -39 -134 -73 120 -86 -59 12 324 -40 -18 -62 -257 273 91 232 191
4920 191 -54 -85 187 9 81 -108 2 -150 83 -76 74 -272 -163 -3 -178 -259 -9 -222 106 132 -186
$$ packed form
4756I4n2o0k29J62R9q4k0K40l92J16l57L94O9Q2q6J54l05J60k95O01rk10j73J2
4780h9N6J02O2k03M4m0J0J67J24p6j16j3o1o7J14m4nQ6K7P4j56j67J14J63k65
4805a59l70L04K15K48M8k25r8q5R0K39k72oK63k39j51J84K35o2l07%j46M98l84
4828a80L49p6l12K80j06J63l26K6K23j82j58K51J82j73J87j01J63k75J53j02J69
4849A55j94m12L71K15j29J26l06p9K39r7K11M6q9m9J1R6r6k2j11P4k1r6J52N1
4873D6j89J66J37k98j48K73pJ97J0l62N5K99j20J39r5j0r8K5j35l3O7R5k86j2
4897b84K54n4J75K8j13k16L43j72r5O1J93k06K7P1L12l64K2m4j95N30j82J41m1
4920A91k45l1K72j78P2j89J10j52K33j59J50l46J09J60j75q1K50k13L28K6l18
$$ plain form
4941 -186 4 144 -102 2 -29 63 -144 -345 67 286 -69 -16 -74 -214 -113 -131 -16 -78 109 -49 -61 -44 -130
4964 -130 97 376 142 46 56 337 110 297 20 30 -235 -52 -180 77 -81 164 -144 -281 110 78 -73
4985 -73 51 -50 -56 -48 146 1 4 -27 -164 -148 -40 -358 -187 -2 -306 19 11 153 542 -47 110 -136 -165 151
5009 151 -55 200 -28 83 -78 141 15 96 -55 103 -203 -123 227 46 44 289 -3 95 -61 -35 111 9
5031 9 393 182 58 -19 -57 -101 50 -50 -198 10 46 49 20 -266 127 -319 117 53 180 18 115 128 2 384
5055 384 -374 6 -120 153 -277 36 74 154 -105 -32 -71 9 -32 100 -20 248 -103 -166 -67 47 157 -120 -285
5078 -285 -288 47 -51 72 207 -33 -391 -188 25 -214 -224 -101 -257 -80 -98 343 226 131 -143 -116 60 79 429
5101 429 117 88 19 220 -244 62 -209 -191 284 -120 159 30 281 202 -221 -232 -242 -121 170 157 25 -116
$$ packed form
4941a86J90J40k46J04l1R2k07k01M12K19l55N3n8j40J01j8J15o2J87j58j2J7q6
4964a30K27K79k34r6J0K81k27J87k77J0k65J83j28K57j58K45l08j37L91l2j51
4985g3J24j01oQJ94j45Ll1j37J6J08l18J71J85l04L25qJ42L89n89J57k46k9L16
5009A51k06K55k28J11j61K19j26Q1j51J58l06Q0L50j81kK45k92R8j56K6J46j02
5031IL84k11j24p7l8m4J51j00j48K08L6Lk9k86L93m46M36o4J27j62R7J3j26L82
5055C84p58L80j26K73m30L13L8Q0k59P3l9Q0m1J32j20K68l51o3R9J14J10k77j65
5078b85lL35r8J23J35k40l58K03K13k39j0J23j56J77j8M41j17r5k74K7J76J9L50
5101D29l12k9o9K01m64L06k71J8M75m04K79j29K51p9m23j1j0J21K91j3j32j41
$$ plain form
5123 -116 206 -40 -39 57 -35 258 -19 -128 36 46 290 -22 -152 -18 -4 -142 25 84 -192 -178 42 -55 -133
5146 -133 -112 230 146 36 -76 118 -20 197 -46 -109 -152 -35 -17 200 235 28 293 -98 130 -33 171 -7
5168 -7 -2 -164 -20 -44 168 66 34 -94 -83 -67 306 9 111 40 -99 41 232 107 -27 -94 -255 14 -32 69
5192 69 -25 -211 58 19 93 -148 204 291 -204 47 -243 -26 -10 69 250 81 -186 234 242 60 32 5 -310 154
5216 154 -243 140 -120 -342 -186 -115 -108 387 180 245 -119 -222 -127 -75 95 355 50 48 119 -13 72 363 130
5239 130 -48 -124 -112 98 -16 351 212 -264 -22 29 168 -77 269 -159 -288 127 64 403 55 -126 -288
5260 -288 81 88 -434 -125 -38 -82 -41 -30 -22 -68 280 4 -159 -230 -226 313 238 124 -227 -168 -164 -81 233 -213 306 219
5286 219 -23 -90 58 -112 -50 122 189 117 -72 146 -13 74 -91 -62 221 122 279 183 -255 -216 -151 -212 -9 -114
$$ packed form
5123a16L22k46JR6r2K93k77j09J64J0K44l12j30J34J4j38J67N9k76J4K20r7p8
5146a33K1L42q4j10j12J94j38K17k43o3m3J17J8K17L5k07K65l91K28j63K04j78
5168gNj62J44k4K12j02l2j28J1J6L73k97J02p1j39J40J91j25j34o7j61K69m6J01
5192F9r4j86K69l9P4k41L52Q7m95K51k90K17J6P9J81j69k67M20Qj82k8k7l15M64
5216A54l97L83k60k22J56P1PM95k07O5l64j03R5N2J70K60l05kP1j32Q5K91k33
5239A30j78p6J2K10j14L67j39m76K42N1J39k45L46m28j29M15o3L39l48j81j62
5260b88L69Pn22L09Q7m4M1J1Qm6L48k76j63p1MN39p5j14l51N9MQ3L14m46N19q7
5286B19k42o7J48j70O2J72O7p2j89K18j59Q7j65K9K83r9J57r6m38L9O5o1K03j05
$$ plain form
5310 -114 -84 -146 85 6 -139 222 150 -7 -7 -139 -70 -29 -204 -21 197 -81 -114 17 -179 89 -259 -62 70
5333 70 -44 -171 128 212 61 48 133 82 111 118 144 -95 90 -56 -104 290 -54 -250 -118 -164 -7 5 66 -215
5357 -215 -160 -242 -90 -60 275 125 182 -125 110 111 -75 82 200 157 -124 -164 53 37 -84 -147 -22 -48 -74 196
5381 196 -14 277 -276 -110 -62 -64 19 90 76 -42 -158 104 270 -14 105 -170 -42 60 -48 45 -5 248 -14
5404 -14 95 187 303 108 -183 100 -171 -40 346 -61 116 26 -33 92 -15 94 -73 -117 -14 -61 111 -115
5426 -115 347 -74 -156 55 16 -119 -3 158 -6 -123 -180 244 -20 -116 -34 -24 210 -49 129 91 306 175
5448 175 -341 -113 75 -85 467 106 -49 -244 -109 -57 200 -127 -259 -194 -206 293 -12 113 80 -94 -41 -324
5470 -324 67 279 -13 -86 309 -100 37 123 -134 107 40 -212 -21 -62 277 -151 -106 -196 -11 181 -45 -126
$$ packed form
5310a14L0o2K31p9j45L61p2j57%j32O9M1j75J83K18k78l3J31j96K68l48J97J32
5333G0j14j27K99Q4j51j3Q5n1K9PK6k39J85j46m8L94l44j96J32m6J57J2O1k81
5357b15N5q2J52L0L35j50N7l07K35Jj86J57J18m3k81m0K17j6j21o3J25k6k6K70
5381A96k10K91n53J66M8kQ3P1j4j18j16K62J66k84J19k75J28J02j08R3n0K53k62
5404a4J09R2J16j95k91K83k71J31L86m07J77r0n9J25j07J09j67m4J03m7J72k26
5426a15M62m21q2K11l9j35J16J61j64j17n7M24k64r6Q2J0K34k59J78l8K15j31
5448A75n16K28J88j60N52l61j55j95J35N2K57l27j32O5j2M99l05J25l3j74N3k83
5470c24L91K12k92p3L95m09J37Q6k57K41o7k52J91m1L39m28M5r0J85J92k26q1
$$ plain form
5492 -126 100 -170 -318 -398 -53 99 -59 39 -142 -40 -273 30 40 6 87 -182 139 136 183 -297 -130 113 92
5515 92 -10 181 20 -266 -35 -36 -183 -223 59 291 54 -187 20 17 151 -176 -102 151 54 -46 -68 -217 64
5538 64 -83 -183 161 -148 -238 14 -45 128 -21 -26 68 321 -141 115 243 -81 -36 29 -146 108 35 -299 -25
5561 -25 -107 -214 -340 -118 108 -60 249 131 -98 51 -93 -179 -72 81 108 141 163 84 243 -138 81 -70
5583 -70 -83 -52 -134 66 -90 36 -219 -23 -234 -88 115 -71 339 30 101 -38 -66 56 -140 185 -62 -23
5605 -23 -144 -160 91 87 -13 202 -118 -65 -42 156 -25 -3 -20 -60 96 -117 109 64 -163 200 -226 102 94 -71
5629 -71 33 -14 -133 12 -71 -51 64 -285 -9 314 253 2 -233 -27 -117 24 285 -162 292 -85 -92 -89 -39 -52
5653 -52 112 146 264 -168 -82 -38 110 291 144 125 -68 -91 -40 -26 128 97 -212 31 -23 110 -38 -6 -15 -136
$$ packed form
5492a26K26k70j48q0L45J52j58R8j81J02k33L03J0l4Q1k69L21lM7m80J67K43k1
5515I2j02J91j61k86K31jj47m0K82K32k37k41K07lJ34l27P4K53r7j00k2j49K81
5538F4j47j00L44l09r0K52n9J73j49nR4K53m62K56J28l24M5O5j75K54p3l34K74
5561b5q2j07j26K22K26j68L09j18k29J49j44q6J07J53K7L3K2p9J59l81K19j51
5583g0j3L1q2K00j56J26k55J96k11J46K03j86M10l09P1j39k8J22j96L25k47L9
5605b3j21j6K51mj00K15l20N3K3J98j81K2j7m0J56k13K26m5k27L63m26L28qj65
5629g1J04m7j19J45q3K0J15l49K76L23o1k51k35K06r0J41K61m47M54l77pLN0j3
5653e2J64L4J18m32Q6M4J48J81j47j9j93k3N1J4J54l1l09K43n4J33j48L2rj21
$$ plain form
5677 -136 57 11 326 -41 -158 180 105 -27 67 -175 -97 68 -104 -86 110 -154 189 -144 -19 11 -231 -53
5699 -53 32 -124 201 -31 59 -157 -171 84 29 -94 180 27 89 13 65 -18 2 36 63 -22 -48 178 -47 -228 -242
5724 -242 26 -1 -42 52 98 116 37 -85 -65 98 -294 158 81 2 123 7 -64 -221 32 -26 -1 -179 -16 30
5748 30 94 -85 91 90 -180 -155 -150 105 62 359 178 95 -138 -114 141 92 91 -171 300 -15 -8 15 156 3 269
5773 269 -12 -82 124 88 -180 -365 -55 -127 35 6 -53 29 -51 -271 161 -256 5 -59 -190 -32 218 211 -14
5796 -14 168 70 154 -360 -158 -15 -120 -117 33 82 -441 -198 -44 247 145 255 -162 -243 -252 -104 38 -18 111
5819 111 13 155 -229 75 -35 61 87 -108 23 -244 -288 21 -107 -103 -116 99 101 15 253 129 134 240 -314 122
5843 122 -195 -112 -69 -49 12 18 211 -122 -96 229 51 -448 -293 142 -74 -277 91 106 161 -32 37 -29 -97 53
$$ packed form
5677a36J93m6L15l67j17L38p5j32R4k42P8J65j72J8J96k64L43l33J25L0k42J78
5699e3Q5j56L25k32R0k16j4K55n5j23K74j53O2p6N2q3K0L4K7q5k6K26k25j81j4
5724b42K68k7m1R4M6J8p9j22K0J63l92M52p7p9J21j16p1j57K53n8K5j78J63M6
5748C0O4j79J76jk70K5NK55m3K97j81q3k33K4K55m9jk62M71l15PK3J41j53K66
5773B69k81p0K06l6k68j85L10p2J62k9n9Q2q0k20M32m17K61o4j31J58K50pk25
5796a4J82r8Q4n14K02J43j05LJ50M9n23K43J54K91j02J10m17q1rJ48J42n6J29
5819A11r8J42l84L04j10R6K6j95J31k67m4L09j28Mj3K15Kq6K38j24NJ06n54M36
5843A22l17Q3M3K0O1OJ93l33K6L25j78m99J55M35k16k03L68J5N5j93O9o6o8J50
$$ plain form
5867 53 85 -327 -136 -26 -20 94 -27 25 53 183 -145 -107 67 402 109 3 -207 -84 -69 -23 52 19 40 -71
5891 -71 -3 59 73 229 -150 -211 129 -66 -32 261 -120 -104 -27 125 5 76 -413 -244 162 112 200 171 -43 -213
5915 -213 26 -132 -199 -129 -124 -265 40 -83 -185 166 32 165 4 195 185 -82 42 36 123 166 86 -28 156
5938 156 116 -66 145 -34 226 -42 34 239 192 129 37 121 175 -38 32 143 57 -262 -119 39 133 84 4 -87
5962 -87 -83 291 29 94 -137 -83 200 32 -3 48 -250 -113 127 45 -18 86 -91 60 -52 260 150 -251 -126
5985 -126 58 42 -32 10 42 124 -199 -83 44 64 -43 -69 -54 -226 11 -84 6 -59 -102 249 -7 -50 -176 47
6009 47 182 258 18 237 -21 80 -215 -124 -152 -9 31 76 -88 -98 -15 -77 -105 197 47 -148 158 6 50 -176
6033 -176 -72 -127 118 116 -102 26 12 108 38 38 20 -128 -31 3 -180 114 311 -177 -177 175 -19 -8 -81 -16 -64 -86
$$ packed form
5867E3L2m12J91J10OJ14j21N2K8J30l28L8J74L35k93j06k10J23J5M6P5l3K1j11
5891g1O8O2J4J56l79o1L40j95L4K93l81J6P7J52j20P1m89J69M06n0Q8k9k14j70
5915b13K39j58o7P0Nj41L05j23j02L51j34J33j61J91j0k67J24oQ7M3q0j14J84
5938A56m0j82K11j79K60k68P6K05m7o3r2Q4N4k13P0J11q6l19J43J58R4m9q0r1
5962h7ML74k62O5k31N4K83j68l5N1k98J37K40q2o3J04j77J51j12L12j10m01J25
5985a26J84j6p4M2L2Q2l23J16J27K0j07k6J5j72K37r5R0o5m3L51k56m3j26K23
6009D7J35P6k40K19k58J01k95R1k8J43M0M5j64j0Q3o2k8L02j50j95L06j52M4k26
6033a76J04n5K45kk18J28j4R6p0%j8j48R7L4j83K94J97m88%L52j94J1p3O5m8k2
$$ plain form
6059 -86 6 -28 -27 32 22 3 -162 24 -10 -180 230 57 54 -53 -17 228 -81 238 -259 -196 -232 101 72 93 -148
6084 -148 -256 -37 -293 -160 86 1 81 -145 63 -102 2 293 -254 81 -77 169 222 -2 187 185 215 -207
6106 -207 -25 -161 54 49 31 -240 3 30 116 37 150 85 -297 101 309 94 -53 161 -233 154 -23 95
6128 95 84 148 -188 0 224 -203 97 -2 -76 -372 140 44 -52 -42 -20 -10 -86 26 148 -162 -36 370 33 -49
6152 -49 31 -125 255 -108 145 -257 -125 -102 101 16 87 -102 -130 35 38 -175 48 -237 -277 -94 -141 196 -116
6175 -116 392 -228 -84 215 -44 357 90 32 -78 -111 -22 150 -155 -23 45 2 -112 -205 -22 71 -3 -71 -116
6198 -116 -10 -12 39 68 -228 -57 189 40 -79 -119 30 -64 -240 -128 -33 260 72 94 -99 86 -30 22 -53
6221 -53 -21 -30 -150 95 -156 136 64 -67 162 24 11 -38 -140 201 -27 -128 14 -33 88 180 -178 -180 244 -114
$$ packed form
6059h6R2l4JN9j0j9j65J86l4j70M10j73lj07L6K45l09L19m97O3l6L33k9K1k41
6084a48j08K19k56J33K46q5Q0k26K08j65J04K91n47L35j58K46N3k24J89kL0m22
6106b07J82j36K15nj8k71K43K7Q6p9J13o5l82L98K08k15j47K14l94L87j77J18
6128I5j1O4l36J88K24m27L00r9p4k96N12r6r6J0K2J0p6J12J22l10J26M06l37q2
6152d9Q0j56L80l63K53m02J32K3K03q5P1j89k8J65Lk13K23k85m0J83m7L37l12
6175a16N08o20J44K99k59M01k67n8j10l3Q9J72l05J32O8m3j14r3J83R3p4o8m5
6198a16J06kN1K9k96J71K46j49j19m0J49r4j76J12R5K93j88K2j93J85j16N2p5
6221e3L2rj20K45k51K92p2j31K29j38j3m9j02L41k28j01J42m7J21R2l58kM24l58
$$ plain form
6245 -114 125 -247 -152 -168 -120 78 -4 21 164 -68 -29 308 228 -140 18 -265 -44 157 -19 -15 -64 50 317
6268 317 -31 -90 24 -338 -36 316 119 -12 -205 -178 -205 -172 -121 13 -143 -170 -90 109 109 -5 -112 29 191
6291 191 129 -278 -138 339 104 71 32 1 36 33 -134 -78 11 93 -96 -69 169 -131 -290 -360 -131 -64 185 173 -123
6316 -123 56 -357 14 118 10 -12 -59 -117 -104 -17 -348 112 100 92 -148 7 -63 -72 2 -7 -147 -94 -147 -37 5 95
6342 95 302 30 57 4 -121 169 -154 -4 -128 34 251 119 198 102 282 27 -219 -207 -307 128 141 -77
6364 -77 -199 -325 -17 206 -79 88 66 56 63 -200 -177 -87 160 -22 -63 -101 50 310 146 -159 76 231 80
6387 80 140 -28 -16 136 136 -46 -72 -66 -108 46 -45 -51 254 -132 -40 6 115 161 141 247 53 -232 -63 228 339
6412 339 -180 185 67 92 46 -118 -157 132 16 203 -44 -198 85 40 -180 28 -54 -117 10 319 5 11 -91
$$ packed form
6245a14K39l72R5j6M8J98q2K5J43k32L9L37q0l68J58k83K21K01j76Mm9J14K67
6268C17l48n9J14l62L02L52j97j31j93K7k7L3N1J34j56k7Q0J99%j14j07J41J62
6291A91o2m07J40M77k35l3l9l1L5lj67N6Q9Q2j89K7K38l00j59p0K29O7K49j2k96
6316a23J79m13L71J04j08k2m7n8J3Q7l31M60j2qk40J55p0rP4rj40N3n3J10M2R0
6342I5K07k72K7n3j25K90l23J50j24J62K17j32P9r6J80k55k46J2j00M35J3k18
6364g7j22j26L08K23k85J67k2j0Pk63K3R0K47j82m1l8J51K60j64l05K35J55j51
6387H0O0j68J2J52%j82k6Om2J54r1oL05l86R2M6J09M6k0J06j94k85J69K91J11
6412C39n19L65j18K5m6j64l9K89j16J87k47j54K83m5k20K08q2o3J27L09l14Oj02
$$ plain form
6435 -91 30 315 59 46 125 33 34 -19 -12 -193 70 118 105 59 -372 51 -64 -50 42 -123 -68 -18 204 -98 151
6460 151 35 283 -174 31 21 -92 155 127 122 48 253 -102 -203 -234 98 68 -301 -206 276 143 -173 751 190
6483 190 31 4 -112 -154 -73 -29 -115 283 117 -17 -34 97 -135 -165 -66 152 32 71 -65 244 -120 -18 -204
6506 -204 12 -239 65 54 14 218 52 125 -189 251 16 -24 147 131 47 189 -111 38 -106 -107 -55 -93 76
6529 76 -38 67 119 26 -276 -31 61 3 20 -182 0 24 -96 -74 84 2 279 13 203 -432 20 -133 -51
6552 -51 -55 72 106 -9 -25 -211 -131 -84 206 158 -178 -138 -284 -164 120 110 144 -91 -72 -19 53 80 199 254 -11
6577 -11 -177 21 -5 -11 140 -164 -61 76 -48 100 25 261 -5 194 35 -229 -169 -28 162 -86 75 50
6599 50 174 255 -298 -35 128 29 49 175 205 138 -218 126 4 -81 47 83 25 93 -202 121 15 84 68 -16
$$ packed form
6435i1J21K85k56j3P9r2Jn3Pj81K63M8j3m6m31M23j15J4R2j65N5N0K22l02K49
6460A51j16K48m57K05j0j13K47k8np4K05l55j01l1L32l0l69R5M82j33l16R24n61
6483A90j59k7j16m2Q1M4q6L98j66j34j7J31k32l0R9K18j20L9j36L09l64J02j86
6506b04K16k51L04j1m0K04j66P3l14M40k35m0J71j6q4J42l00J49j44jN2l8J69
6529G6j14J05N2r3l02K45R2n8J7k02J82K4j20K2J58q2K77k66J90o35M52j53Q2
6552e1mJ27L4j15j6j86Q0M7K90m8l36M0j46J20K84j0L4k35J9N3P2K7J19N5k65
6577a1j66J98k6oJ51l04J03J37j24J48p5K36k66J99j59k64O0J41J90k48J61k5
6599E0J24Q1n53K63J63r9K0J26L0o7l56L44j22q5J28L6n8O8k95L23j06O9j6q4
$$ plain form
6623 -16 185 -34 -104 -17 246 -34 -64 111 155 16 159 17 108 277 -3 101 71 -190 -71 -161 -100 -101 -15 2
6647 2 474 -167 -78 120 -294 46 -33 124 154 -33 5 161 240 -115 -100 -49 -160 2 71 -274 -148 126 -107
6670 -107 266 87 42 212 16 -175 -102 -205 155 15 231 -52 43 32 -1 205 420 102 46 150 286 30
6692 30 226 119 23 126 74 -129 -260 29 -44 126 138 252 -38 22 206 -107 -50 118 124 262 121 -487 58
6715 58 89 -78 -124 73 -247 116 38 96 -62 84 353 128 334 202 -138 -130 199 -42 -171 28 76 -45 -117
6738 -117 16 132 158 -100 -45 -35 87 138 228 -25 121 -44 -100 0 -101 -167 -315 57 -105 40 39 -107 135
6761 135 -106 -218 155 135 206 78 213 19 -6 96 -69 -70 12 107 291 -82 -57 41 52 322 92 -2 271 -115
6785 -115 -313 -63 -24 204 -126 -101 -101 131 59 -22 101 204 -75 -485 -126 11 193 148 115 -96 -344 225 558
$$ packed form
6623a6K01k19p0Q7K63k80l0J75M4j39J43j42R1J69k80J04l0k61J19r0O1jQ6J7
6647BM72o41Q9J98m14L40p9J57L0j87L8J56P9l55J5N1j11J62O9l45J26K74k33
6670a07L73j79m5J70j96j91P3j03L60j40K16k83R5j1l3K06K15l18n6J04J36k56
6692C0J96j07r6J03n2k03j31K89p3J70J2J14k90O0J84l13N7J68OJ38j41o08N45
6715E8L1j67m6J97l20L63p8N8j58J46K69k25K06j32l40QL29k41j29J99M8j21p2
6738a17J33J16K6k58N5J0J22N1R0k53J46j65n6J00j01o6j48L72j62J45jj46K42
6761A35k41j12L73k0P1j28J35j94k5J02j65jQ2R5J84l73K5R8J1K70k30r4K73l86
6785a15j98K50L9K28l30K5%K32p2q1J23J03k79m10L59J37J82m5l3k11k48N69L33
$$ plain form
6808 558 -180 121 70 222 204 -777 -889 -634 -250 648 -201 -334 365 356 474 877 -119 391 208 218 -284 -192
6830 -192 6 166 393 -106 -156 523 161 -71 19 -98 37 66 -172 -162 -167 119 83 -13 54 36 -75 17 -41 11
6854 11 176 30 -357 71 -202 175 46 6 32 107 156 -3 -284 114 93 -232 -73 76 -256 38 120 -186
6876 -186 -183 -299 126 36 1 67 125 -15 -218 8 67 -48 187 77 -203 -229 4 -227 -132 86 75 1 89 138
6900 138 -8 105 79 -31 39 -57 16 339 37 -39 -207 35 152 64 -143 -13 -94 -30 -155 -13 48 -182 142
6923 142 136 135 -406 45 -147 -75 -77 81 196 155 -6 -27 181 -59 289 123 203 80 -106 -148 1 7 110 -103
6947 -103 103 -455 54 -128 175 -37 20 11 -34 -151 145 172 243 -195 -29 -111 248 333 -1 -95 -104 -65 -94 -28 -147
6972 -147 102 -174 -124 -341 -37 140 -8 -205 -2 -313 -29 -37 284 -72 33 72 -1 -128 126 -286 -16 -152
$$ packed form
6808E58p38L01n1J52j8r81j12K55L84Q98q49j33O99rJ18M03r96N10j83J0n02R2
6830a92J98J60K27m99n0O79l62k32R0j17J35K9k38J0nK86l6r6O7j8j11R2n8N2
6854A1J65j46l87M28k73L77j29m0K6P5M9j59k81L98k1l25J59J49l32K94Q2l06
6876a86Lj16M25r0l5O6N8j40k03K26N9j15K35j10k80k6K33k31R5K18j1p4Q8M9
6900A38j46J13k6j10P0r6P3L23l02p6j68K42J17q8k07J30q1O4j25J42O1k30L24
6923A42ojn41M51j92P2kJ58J15m1j61k1K08k40L48j66Q0j23j86m2J49OJ03k13
6947a03K06n58N09j82L03k12N7rm5j17K96K7P1m38J66q2L59Q5l34r4rL9k9O6j19
6972a47K49k76N0k17L04J77j48j97K03l11K84qL21l56J05L9p3j27K54m12K70j36
$$ plain form
6994 -152 99 90 63 113 194 22 252 -160 142 8 6 161 -89 -141 -36 369 -285 73 162 210 -128 -184 -39 0
7018 0 -151 -123 -52 214 -96 -151 103 -100 -133 160 -72 32 -13 245 -184 -61 52 -20 166 68 54 235 -89
7041 -89 -100 -30 -74 -18 9 -207 -106 103 -112 -74 207 24 -251 187 85 -87 -121 -9 42 96 -60 84 -149
7064 -149 177 62 121 33 -53 88 180 -104 123 151 -263 141 19 -10 -72 139 7 -10 132 64 22 49 -109 -13
7088 -13 143 53 60 30 -264 -67 309 248 -5 -90 -17 -38 188 -157 -71 3 -118 -172 124 288 89 40 -78 -156 -111
7113 -111 -69 79 205 131 -67 -189 -20 226 81 171 240 117 -225 -43 61 25 -70 -68 -196 199 -29 83 6
7136 6 -115 160 -211 -76 234 -11 -93 -23 194 -148 67 -188 -106 101 54 -74 -50 -46 118 57 36 -261 39 -162
7160 -162 122 -76 -136 -54 -170 89 8 -139 86 -164 -28 -305 44 68 211 424 165 29 150 14 244
$$ packed form
6994a52K51rk7N0Q1j72K30m12L02j34kJ55k50n2J05M05o54L58Q9M8l38n6J45L9
7018@j51K8P1K66l10n5K54k03l3K93k32J04m5K58m29J23J13p2J86r8j4J81l24
7041h9j1P0m4N6K7k16J01K09k15L8K81j83k75M38j02j72l4J12N1N4j56J44k33
7064a49L26j15N9q8q6J41R2k84K27K8m14M04j22k9o2K11j32j7J42o8m2K7j58R6
7088a3J56r0Pl0k94J97L76o1k53q5P3k1K26l45Q6P4j21n4K96J64j99m9j18p8M5
7113a11M2J48J26p4j98j22J69K46j45R0O9j23l42J82J04l6r5Kj28L95k28J12p7
7136Fj21K75l71J35L10k45q2P0K17l42K15k55Q2K07m7j28K4MJ64o1k1k97L00k01
7160a62K84j98o0Q2j16K59q1j47K25k50J36k77L49K4J43K13k59j36J21j36K30
$$ plain form
7181 244 -44 97 84 80 -3 114 329 -271 121 33 94 -27 -11 -181 -291 -97 167 45 -41 -190 -238 -3 53
7204 53 -23 -310 -113 -93 8 -23 -221 -108 60 -12 39 -72 -257 1 37 -144 -127 -50 74 49 145 245 -103 -54
7228 -54 -198 -212 41 107 153 -102 -183 -101 -320 171 66 28 20 -11 91 -13 71 17 -26 228 146 -45 218 37 -7
7253 -7 170 179 116 -44 128 319 -5 -60 199 -142 -56 -125 173 -84 -231 51 -128 0 262 54 -150 327 86
7276 86 219 225 -177 -99 -155 72 -1 183 -2 179 -44 219 -85 -70 -141 -56 -117 16 168 -30 98 137 283 15
7300 15 -25 -166 -128 319 -14 -130 93 -224 2 -79 209 -165 -24 62 -168 172 211 148 267 -143 -234 170 -33
7323 -33 205 -83 -185 75 75 -51 -157 -21 -70 139 -2 -8 -62 -137 -93 -145 -97 -37 191 -19 -176 217 66 290
7347 290 81 -5 -18 -145 -61 -251 151 -296 32 -82 -19 115 163 -8 -235 228 -146 234 43 16 155 78
$$ packed form
7181B44k88J41j3mq3J17K15o00L92q8O1j21J6j70j10J94K64j22q6j49m8K35N6
7204E3p6k87J97K0J01l1j98J13J68p2N1j11j85K58L6j81J7P7J24k5R6J00l48M9
7228e4j44j4K53O6M6k55q1Q2k19M91j05l8ql1J02j04Q4n4m3K54q2j91K63j81m4
7253gJ77Ro3j60J72J91l24n5K59l41Q6o9K98k57j47K82j79J28K62k08k04M77k41
7276H6J33Om02P8n6K27p3J84j85J81k23K63l04J5p1Q5o1J33J52j98J28L9J46k68
7300A5m0j41L8M47l33j16K23l17K26q1K88l74J41Q6k30L40L9o3J19m10r1M04k03
7323c3K38k88j02K60%j26j06J36m9K09j41on4p5M4n2M8O0K28k10j57L93j51K24
7347B90k09q6j3j27Q4j90M02m47L28j14O3J34M8j71k27M63l74L80j91k7J39p7
$$ plain form
7369 78 132 277 -301 -320 123 108 34 199 -76 4 143 -74 -20 -206 172 -171 146 102 61 -177 58 128 -41
7392 -41 119 59 -3 -12 -8 -182 95 -177 111 37 -170 126 148 24 101 77 -18 86 147 28 -52 78 -38 24 191
7417 191 -46 68 236 172 -118 264 -28 146 62 -49 -99 -191 102 -227 -23 -42 -293 -107 37 -16 11 196
7439 196 -72 -91 -110 35 3 -45 244 42 -176 128 -11 73 148 -13 73 180 108 -132 127 408 2 160 88
7462 88 -51 167 34 -56 178 67 -204 -319 -25 169 165 226 -234 -263 -139 283 243 35 77 75 173 -7 144 -66
7486 -66 -126 -272 -199 -155 187 199 -85 55 158 -5 339 88 -180 -39 186 -52 41 268 147 215 -142 49
7508 49 153 -54 -11 -204 116 -89 236 -167 -112 523 -278 286 3 -480 -753 584 191 -95 958 -530
7528 -530 80 -171 -596 -437 82 79 231 -217 -349 158 362 513 -146 409 -129 -60 -49 -353 -3 -69 384 -246
$$ packed form
7369G8N4J45n78j9M43j5p4J65k75Q0J39k17N4j86L78l43L17m4m1k38K35P0j69
7392d1J60o0o2rMj74K77k72K88p4k07K96K2j24P7k4r5J04O1j19q0J30j16O2J67
7417A91k37J14J68o4k90L82k92J74q4j11n0r2K93l29K04j9k51J86J44n3K7J85
7439A96k68j9j9J45l2m8K89k02k18L04j39Q4P5j61Q6J07p2k40K59K81m06J58p2
7462H8j39K18j33r0K34j11k71j15K94J94mO1m60k9J24M22m0k08M2kR8j80J51k10
7486f6o0j46P3M4L42J2k84J40J03j63L44k51k68J41K25k38R3K27j21O8l57J91
7508D9J04k07M3j93L20k05L25m03N5O35q01N64k83m83k73J337l93k86J053j488
7528e30O10k51m25J59N19lJ52m48j32N07K04J51o59N55n38O9J1l04L50o6M53o30
$$ plain form
7550 -246 -495 -864 -222 220 198 49 -116 -301 -7 261 -427 204 20 368 6 360 109 161 -256 44 155
7571 155 -196 66 -396 -17 393 62 -22 -223 47 41 71 -49 224 -221 -170 -60 -203 -76 196 19 -169 -19
7593 -19 101 213 354 -314 392 88 203 397 87 -144 283 -55 143 463 -119 286 231 127 -355 57 -320
7614 -320 462 -167 -234 334 470 256 222 -324 365 -167 10 -68 522 84 76 -632 -464 615 236 134 157 -56
7636 -56 -385 214 -169 -100 321 232 -276 157 300 -136 -386 -139 -175 -235 -171 103 90 -509 -602 396 418 66 525
7659 525 194 216 313 51 154 74 156 115 -417 191 -393 -545 198 215 -127 -512 309 3 -525 -331 191 -164
7681 -164 68 104 -565 79 -325 17 -316 49 59 -310 195 200 -103 -331 -115 151 363 -364 -845 131 158 -430
7703 -430 -293 215 -176 -326 120 -46 198 282 -446 157 48 -398 -136 171 -9 -186 157 -219 -21 223
$$ packed form
7550b46k49l69O42M42k2j49j65j85K94K68o88O31j84L48l62L54k51N2m17L00J11
7571A55l51K62m62L79M10l31q4k01K70oL0j20K73m45N1J10j43J27K72j77j88J50
7593a9J20J12J41o68P06l04J15J94l10k31M27l38J98L20n82M05n5j04m82M12l77
7614c20P82o29o7N68J36k14l4n46O89n32J77p8N90m38qp08J68J079l79j02K3k13
7636e6l29N99l83O9M21q9n08M33J43m36k50K47l6o0O4K74j3n99r3R98K2l52M59
7659E25l31K2R7k62J03q0Q2m1n32O08n84j52P43J7l42l85Q21l06n28J94N22l55
7681a64K32L6o69O44m04L42l33L65J0l69N05Nl03k28K16K66K12p27m81R76K7n88
7703d30J37N08l91j50M46j66K44Q4p28O03j09m46K62L07j80j77L43l76J98K44
$$ plain form
7723 223 64 -284 -345 -168 -70 36 222 -25 98 -14 -43 102 -77 78 -8 -6 3 21 -70 -43 26 141 134 -180 262
7748 262 164 -61 74 277 -171 87 -391 10 -225 211 -93 -33 225 -171 -291 764 -44 358 470 -283
7768 -283 309 -252 122 190 -617 -520 32 -273 -122 -53 249 24 23 177 58 -12 145 -84 -124 -64 75 -19 -151
7791 -151 147 -17 35 104 -28 -136 169 -5 -137 -77 103 204 -26 21 -35 -173 -23 -224 -125 -34 -110 -78 -111
7814 -111 51 91 -37 -20 42 15 147 233 -11 -98 -60 15 -78 -139 -350 -42 -93 272 94 -48 150 -77 1 185
7838 185 -90 -195 21 -181 92 -25 -3 -347 214 -182 158 65 -223 108 -120 51 -100 -99 42 -7 -72 -109
7860 -109 102 175 -180 51 -54 304 117 -162 156 -57 163 6 198 101 -87 -5 63 -104 79 19 127 -158
7882 -158 -97 -53 298 -22 -84 58 112 24 14 8 -49 -63 -99 -6 -334 196 -190 58 -261 196 69 132 -24 34 8
$$ packed form
7723B23j59l48o1J77R8J06J86k47J23j12k9J45j79J55q6KRJ8r1K7O9J15pl14M42
7748B62r8k25J35K03m48K58m78M01k35M36l04O0K58l96j20J055q08M02J12p53
7768b83N92n61L74O8q07R7N52l05J51O9L02k25jJ54j19p0J57k29m0O0J39r4j32
7791a51K98j64N2O9j32j08L05j74j32O0J80J01k30M7n6j38J50k01R9R1p6L2l3
7814a11J62M0j28J7O2k7J32Q6k44q7L8P5r3o1k11L08n1L65j78j42J98k27P8J84
7838A85k75j05K16k02K73j17K2l44N61l96L40r3k88L31k28J71j51JJ41m9o5l7
7860a09K11P3l55K31j05L58j87k79L18k13K20j57J92r7j88Q2O8j67J83o0J08k85
7882a58O1M4L51l20o2J42N4q8j0on7j4l6R3l28N30l86K48l19M57j27O3j56N8k6
$$ plain form
7907 8 115 334 -84 19 199 63 118 376 -60 217 154 359 -40 30 -188 83 -128 2 -264 26 307 134
7929 134 192 66 143 -105 70 -132 23 43 -88 137 -184 240 499 35 -55 -134 -71 22 -74 -150 88 -149 4
7952 4 56 4 18 -212 -205 161 101 408 28 -41 203 128 -69 -44 -49 -145 -87 5 155 -508 -42 267 23 -599 -310
7977 -310 344 616 181 1177 -17 -281 -91 55 -328 399 -762 22 124 -760 -77 69 404 -279 165
7996 165 -43 346 112 324 -533 310 -419 -90 192 54 703 151 603 -145 605 -216 269 -154 -107 -110 278
8017 278 282 -149 242 143 237 -223 507 -155 19 -145 -165 -351 155 -188 -452 -186 -134 27 199 122 -100 1
8039 1 213 -138 79 -265 -270 150 232 -22 -309 67 225 -370 14 -437 36 -252 -942 -112 -100 -285 -263 -330 667
8062 667 603 -360 -1151 -186 195 -191 92 -816 -595 -153 294 198 -1102 -166 387 -23 -624 -271 -12 -394
$$ packed form
7907HJ07K19m18J03J80j36N5K58m36K77o3K05l99P0k18K71k11J30k66K90K81j73
7929A34N8j26P7k48J75k02J55K0j31K25l21M24K59m64r0p9O3R3r6p6K38k37J53
7952DN2n2J4k30PL66o0L07l80o9K44p5j97K5nr6N8R2J50o63M66L09k44o22K89
7977c10O54K72m35R96j194k64J90J46l83P27j161P84J02q84O83J46L35o83M44
7996A65k08L89k34K12q57Q43p29L29K82j38O49n52M52p48P50q21M85m23M7lL88
8017B78Mm31L91r9R4m60P30o62J74j64k0j86N06l43k64K66N2J61J72p7k22J01
8039AK12l51K17l44nM20Q2k54k87L76J58n95L84m51M73k88o90Q30J2j85K2o7R97
8062F67o4r63p91R65L81l86K83r08K21M42M47r6j300R36N53m10o01L53K59l82
$$ plain form
8082 -394 -23 5 82 -514 206 -267 35 215 -61 -227 2 254 65 39 102 -33 -170 -87 -142 -6 -99 -156 -17
8105 -17 -161 134 -143 41 -143 -17 143 107 10 -102 -37 -55 9 -185 1 -46 176 74 2 104 38 106 -111
8128 -111 134 -67 -88 -94 -18 -181 -85 -270 51 -222 -92 3 145 -124 87 209 199 -106 10 50 165 242 133
8151 133 -377 64 166 80 -142 -105 192 132 77 99 -66 -262 102 17 -237 92 23 -127 -227 -421 -378 47 -680
8174 -680 -757 642 871 703 -204 -522 -314 -216 -472 -159 -549 673 -71 -255 -237 548 -844
$$ packed form
8082c94L71K8P7n96P20m73L02J80k76j66K29K52j89k6O3j35j37Q3n5J36r3n7J39
8105a7j44K95k77J84j84J26J60l6r7j12O5j8O4j94J86m7K22j02p2J02o6O8k17
8128a11K45k01k1oP6j63R6j85L21k73J30R5J42k69K11J22j0l05J16M0J15P7j09
8151A33n10M41J02q6k22L7K97o0n5K2j65j96L64q5k54L29o9j50j00j94M3M25p27
8174f80p7J399K29j68r07l18K08R8k56L13l90J222p44j84J8P85j392
8191h44
$$ Imaginary data points
##PAGE= N=2
##DATA TABLE= (X++(I..I)), XYDATA
$$ plain form
0 0 0 0 0 0 0 0 -8 0 0 8 -8 8 -11 16 -24 24 -32 40 -48 56 -72 88 -96 120 -138 160 -188 216 -249 288 -324
31 -324 372 -421 478 -540 606 -684 764 -855 952 -1058 1179 -1306 1446 -1598 1766 -1951
47 -1951 2147 -2369 2609 -2872 3168 -3489 3854 -4259 4715 -5237 5835 -6535 7361 -8354
61 -8354 9579 -11125 13162 -15965 20092 -26810 39620 -73136 362567 815387 337896 -103046
73 -103046 -541317 -631704 -525497 -223181 47049 296107 433163 505430 415129 179507 -203738
84 -203738 -552116 -714211 -542115 -114722 388297 695461 683317 366713 -57796 -402598
94 -402598 -536508 -475912 -283960 -49835 189764 392161 508687 460025 217621 -163292
104 -163292 -517615 -667612 -515369 -125129 314639 591328 595782 357550 17476 -276945
$$ packed form
0@%%%%%%qQ%Qj6J6j9K7m0M8n6P2q8J04j28J60j84K16k58K98l48M04m65N37o12
31c24O96p93Q99j018J146j290J448j619J807k010K237k485K752l044L364l717
47a951M098m516M978n481O040o657P343q113Q974r952J1072j2370J3896j5715
61h354J7933k0704K4287k9127L6057m6902O6430j12756M35703M52820m77491m40942
73a03046m38271r0387J06207L02316K70230K49058J37056P2267r0301k35622l83245
84b03738l48378j62095J72096M27393N03019L07164j2144l16604m24509l44802
94d02598j33910O0596J91952K34125K39599K02397J16526m8662k42404l80913
104a63292l54323j49997J52243L90240M39768K76689M454k38232l40074k94421
$$ plain form
114 -276945 -436739 -447986 -337562 -137667 115576 362147 511606 476033 233788 -134616
124 -134616 -466341 -602247 -474263 -145865 224568 475294 518511 368792 109492 -159332
134 -159332 -360514 -445798 -393223 -205791 71244 346100 505573 467483 231717 -106671
144 -106671 -400559 -523561 -431810 -177730 125380 361475 456189 392293 198879 -60606
154 -60606 -304982 -448612 -432420 -246393 45642 327063 477876 435087 219915 -70086
164 -70086 -317856 -433485 -391886 -218970 21947 254861 407829 422142 278996 17502
174 17502 -267531 -454778 -457099 -268045 28493 302087 434529 393349 214606 -19543 -226214
185 -226214 -352696 -369837 -272036 -76911 169530 378649 455094 341952 72963 -241086
$$ packed form
114b76945j59794j1247J10424J99895K53243K46571J49459l5573k42245l68404
124a34616l31725j35906J27984L28398L70433K50726M3217j49719k59300k68824
134a59332k01182q5284N2575J87432K77035K74856J59473l8090k35766l38388
144a06671k93888j23002R1751K54080L03110K36095R4714o3896j93414k59485
154f0606k44376j43630J6192J86027K92035K81421J50813m2789k15172k90001
164g0086k47770j15629M1599J72916K40917K32914J52968J4313j43146k61494
174A7502k85033j87247k321J89054K96538K73594J32442m1180j78743k34149k06671
185b26214j26482j7141R7801J95125K46441K09119P6445j13142k68989l14049
$$ plain form
195 -241086 -451042 -459505 -271147 12391 258221 375064 347180 215861 41265 -133404
205 -133404 -277467 -357607 -327242 -163878 99250 359438 482148 388244 109760 -218656
215 -218656 -435057 -443163 -263998 -6701 206214 309594 305336 229787 109297 -46728 -221413
226 -221413 -359000 -378769 -229921 53064 343343 488541 404051 129552 -188764 -394523
236 -394523 -406189 -253321 -39878 137907 239350 271723 252179 173780 22675 -181789 -361134
247 -361134 -410341 -268111 22662 322773 473946 396199 139878 -152596 -339297 -357346
257 -357346 -243000 -79916 65577 173161 248165 279218 230587 75245 -155504 -361464
267 -361464 -424145 -284323 2443 292365 436971 372452 151153 -100974 -269384 -308528
$$ packed form
195b41086k09956q463J88358K83538K45830J16843k7884j31319j74596j74669
205a33404j44063q0140L0365J63364K63128K60188J22710r3904k78484l28416
215b18656k16401q106J79165K57297K12915J03380m258p5549j20490j56025j74685
226b21413j37587j9769J48848K82985K90279J45198q4490k74499l18316k05759
236c94523j1666J52868K13443J77785J01443L2373j9544p8399j51105k04464j79345
247c61134m9207J42230K90773L00111J51173p7747k56321k92474j86701j8049
257c57346J14346J63084J45493J07584P5004L1053m8631j55342k30749k05960
267c61464o2681J39822K86766K89922J44606o4519k21299k52127j68410l9144
$$ plain form
277 -308528 -245182 -131900 -5174 123798 241221 307106 268503 103337 -140267 -350538
287 -350538 -412410 -281467 -18424 244692 380765 341821 171613 -34815 -193082 -265809
297 -265809 -257903 -187772 -67190 88340 241306 328141 289397 116818 -125687 -325762 -382893
308 -382893 -269351 -44097 183411 314896 312369 199932 36389 -120597 -233375 -277568
318 -277568 -237723 -112835 68446 242830 333287 288693 117728 -106511 -282740 -336746 -253371
329 -253371 -78806 110384 245383 289525 236969 108131 -59474 -214699 -300346 -276005 -139379
340 -139379 60263 239998 321457 270271 113414 -77709 -226520 -283513 -241128 -121704 34207
351 34207 181849 274519 275546 170176 -13027 -204248 -317584 -296902 -149431 56632 226389
$$ packed form
277c08528O3346J13282J26726J28972J17423O5885l8603j65166k43604k10271
287c50538o1872J30943K63043K63116J36073l8944j70208k06428j58267p2727
297b65809P906P0131J20582J55530J52966Q6835l8744j72579k42505k00075n7131
308c82893J13542K25254K27508J31485k527j12437j63543j56986j12778m4193
318b77568L9845J24888J81281J74384R0457m4594j70965k24239j76229n4006Q3375
329b53371J74565J89190J34999M4142n2556j28838j67605j55225q5647K4341J36626
340a39379J99642J79735Q1459n1186j56857j91123j48811n6993M2385J19424J55911
351C4207J47642R2670J027j05370j83203j91221j13336K0682J47471K06063J69757
$$ plain form
362 226389 292245 241427 112076 -37471 -160543 -230933 -236894 -170921 -38226 129908 269981
373 269981 310967 216208 16311 -197756 -321572 -297693 -146947 48304 196770 249302 211397
384 211397 120171 12064 -94752 -187808 -241314 -218006 -97561 91809 267498 334276 244231
395 244231 34100 -188286 -311075 -282893 -138681 33754 155997 199703 183197 135483 65392
406 65392 -33779 -154165 -251390 -259354 -141658 66995 265610 343514 252851 42663 -171613
417 -171613 -282942 -255021 -131690 7209 104488 151251 166579 159946 115369 12008 -134963
428 -134963 -260771 -283487 -165309 50850 252814 331200 245702 51681 -140582 -239764 -223154
439 -223154 -132495 -29898 50318 110326 160280 187284 155605 42831 -124424 -265226 -291697
$$ packed form
362B26389O5856n0818j29351j49547j23072p0390n961O5973J32695J68134J40073
373B69981M0986r4759j99897k14067j23816K3879J50746J95251J48466N2532l7905
384B11397r1226j08107j06816r3056n3506K3308J20445J89370J75689O6778r0045
395B44231k10131k22386j22789K8182J44212J72435J22243M3706j6506m7714p0091
406F5392r9171j20386r7225p964J17696K08653J98615P7904r0663k10188k14276
417a71613j11329K7921J23331J38899R7279M6763J5328o633m4577j03361j46971
428a34963j25808k2716J18178K16159K01964P8386q5498j94021j92263r9182J6610
439b23154R0659J02597Q0216O0008M9954K7004l1679j12774j67255j40802k6471
$$ plain form
450 -291697 -172699 39225 230963 303121 228279 62691 -99547 -188808 -191133 -139668 -71725
461 -71725 383 80042 160544 208894 179303 57327 -116829 -255595 -278390 -165113 22902
472 22902 190375 259007 207710 82286 -47731 -135753 -168390 -157539 -114469 -38754 65377
483 65377 169564 225510 189140 59441 -109918 -236381 -254945 -157849 1630 145338 213416
494 213416 193649 111585 6846 -88242 -155758 -181097 -152790 -65436 59875 176660 228522
505 228522 183040 55766 -95799 -202581 -219893 -148934 -29151 89584 166794 184933 145316
516 145316 59083 -51220 -151684 -202976 -177844 -77056 60146 174697 214981 165861 54000
527 54000 -69701 -157161 -182742 -147189 -67939 32392 126469 184369 180446 103197 -24655 -152053
$$ packed form
450b91697J18998K11924J91738P2158p4842j65588j62238q9261k325N1465O7943
461g1725P2108P9659Q0502M8350k9591j21976j74156j38766k2795J13277J88015
472B2902J67473O8632n1297j25424j30017q8022l2637J0851M3070P5715J04131
483F5377J04187N5946l6370j29699j69359j26463j8564R7096J59479J43708O8078
494B13416j9767q2064j04739r5088o7516k5339K8307Q7354J25311J16785N1862
505B28522m5482j27274j51565j06782j7312P0959J19783J18735P7210J8139l9617
516A45316q6233j10303j00464n1292K5132J00788J37202J14551M0284m9120j11861
527E4000j23701q7460k5581L5553P9250J00331R4077N7900l923p7249j27852j27398
$$ plain form
539 -152053 -218130 -189371 -78556 60846 163801 189670 142082 54037 -36990 -107022 -146101
550 -146101 -149914 -107452 -19925 94833 187762 208484 133240 -10973 -152718 -221189 -184947
561 -184947 -71359 56869 139704 155538 120250 63865 2968 -59437 -120642 -160149 -145349
572 -145349 -59077 75570 193291 226352 148344 -4896 -148457 -211643 -169881 -63366 43982
583 43982 105603 118663 102994 78277 41443 -19732 -102037 -168559 -168754 -82357 63728 189437
595 189437 225803 145964 -2016 -135751 -186094 -146198 -57949 21901 67039 84617 94600 99651
607 99651 76322 7472 -95785 -181162 -187995 -94675 57773 185564 218053 139795 2591
618 2591 -114657 -158148 -127276 -62843 -6392 31998 62923 98140 122697 104459 23890 -94019
$$ packed form
539a52053o6077K8759J10815J39402J02955K5869m7588q8045r1027p0032l9079
550a46101l813M2462Q7527J14758R2929K0722p5244j44213j41745o8471L6242
561a84947J13588J28228Q2835J5834l5288n6385o0897o2405o1205l9507J4800
572a45349Q6272J34647J17721L3061p8008j53240j43561o3186M1762J06515J07348
583D3982O1621J3060j5669k4717l6834o1175q2305o6522j95Q6397J46085J25709
595A89437L6366p9839j47980j33735n0343L9896Q8249P9850M5138J7578R983N051
607I9651k3329o8850j03257q5377o833R3320J52448J27791L2489p8258j37204
618B591j17248m3491L0872O4433N6451L8390L0925L5217K4557j8238q0569j17909
$$ plain form
630 -94019 -186435 -191596 -97008 50844 170201 197520 129656 14132 -81918 -122030 -109598 -75395
642 -75395 -39663 -614 48542 105401 141139 118722 27865 -93041 -180520 -180557 -90596 40027
654 40027 141923 167506 116696 31719 -43451 -86592 -99280 -92957 -69099 -23904 44417 113953
666 113953 148864 118698 25513 -87013 -162499 -161135 -85565 21031 105677 136013 112607 57252
678 57252 -4907 -58730 -97827 -113527 -94810 -36293 47291 121498 148852 110248 21160 -76265
690 -76265 -136101 -135728 -81518 -4553 64337 105684 113178 86899 32538 -38221 -102381 -132647 -109851
703 -109851 -38629 52046 120437 136358 94451 19752 -54984 -101749 -110390 -85508 -36273 24677
715 24677 83700 119452 113466 59489 -26727 -108039 -143325 -113769 -34781 54041 110556 116227
$$ packed form
630i4019r2416n161R4588J47852J19357K7319o7864j15524r6050m0112J2432L4203
642g5395L5732L9049M9156N6859L5738k2417r0857j20906q7479l7Q9961J30623
654D0027J01896K5583n0810q4977p5170m3141j2688O323K3858M5195O8321O9536
666A13953L4911l0166r3185j12526p5486J364P5570J06596Q4646L0336k3406n5355
678E7252o2159n3823l9097j5700J8717N8517Q3584P4207K7354l8604q9088r7425
690g6265n9836L73N4210P6965O8890M1347P494k6279n4361p0759o4160l0266K2796
703a09851P1222R0675O8391J5921m1907p4699p4736m6765q641K4882M9235O0950
715B4677N9023L5752n986n3977q6216q1312l5286K9556P8988Q8822N6515N671
$$ plain form
727 116227 78033 22523 -28745 -66010 -89477 -92769 -67903 -9576 67167 128110 136376 77747
739 77747 -22431 -113118 -146174 -108201 -26610 52162 92170 89870 63598 31794 2164 -33963
751 -33963 -75332 -105211 -95904 -34129 59730 136615 148567 83477 -23427 -112148 -137456 -94634
763 -94634 -20323 41428 67370 65222 55598 47447 31073 -9304 -69417 -117377 -114883 -47090 56760
776 56760 139087 149565 81573 -22911 -103256 -120459 -79975 -19655 24013 40656 45280 54599
788 54599 64709 54719 6303 -68359 -126614 -124934 -51638 55039 134721 140621 74333 -19765
800 -19765 -86020 -97459 -65427 -24393 1770 14948 32171 59481 81647 70387 12302 -69961
812 -69961 -129282 -123474 -49681 50624 120540 123820 66494 -9548 -61666 -73412 -57412 -36854
$$ packed form
727A16227l8194n5510n1268l7265k3467l292K4866N8327P6743O0943Q266n8629
739G7747j00178r0687l3056L7973Q1591P8772M0008k300k6272l1804k9630l6127
751c3963m1369k9879R307O1775R3859P6885J1952o5090j06904q8721k5308M2822
763i4634P4311O1751K5942k148r624q151j6374m0377o0113m7960K494O7793J03850
776E6760Q2327J0478o7992j04484q0345j7203M0484O0320M3668J6643M624R319
788E4599J0110r990m8416p4662n8255J680P3296J06677P9682N900o6288r4098
800a9765o6255j1439L2032M1034K6163J3178J7223K7310K2166j1260n8085q2263
812f9961n9321N808P3793J00305O9916L280n7326p6042n2118j1746J6000K0558
$$ plain form
824 -36854 -21511 -4132 27427 67782 92949 75782 11619 -70385 -122460 -112530 -44825 41357
836 41357 98433 102079 61177 6710 -33538 -51092 -54630 -53065 -43319 -16098 28995 76372 97710
849 97710 72966 7548 -65797 -107905 -96614 -41696 25036 71383 81270 60970 27656 -6379
861 -6379 -35962 -58331 -68650 -57435 -19759 33903 79742 92910 63399 4009 -55250 -86048
873 -86048 -79123 -42097 4209 42246 63627 65858 50130 17347 -26082 -65682 -82888 -65123
885 -65123 -17094 40159 78949 81424 50136 2441 -38515 -60683 -62290 -46683 -19719 15641
897 15641 51566 74337 69920 33227 -23527 -73192 -89726 -64190 -10522 42466 69895 64716
909 64716 38258 7478 -18199 -37246 -51163 -56214 -42283 -4843 45563 83737 84538 41613 -24388
$$ packed form
824c6854J5343J7379L1559M0355K5167j7167o4163q2004n2075R930O7705Q6182
836D1357N7076L646m0902n4467m0248j7554l538J565R746K7221M5093M7377K1338
849I7710k4744o5418p3345m2108J1291N4918O6732M6347R887k0300l3314l4035
861f379k9583k2369j0319J1215L7676N3662M5839J3168k9511n9390n9259l0798
873h6048O925L7026M6306L8037K1381K231j5728l2783m3429l9600j7206J7765
885f5123M8029N7253L8790K475l1288m7695m0956k2168j607J5607K6964L5360
897A5641L5925K2771m417l6693n6754m9665j6534K5536N3668N2988K7429n179
909F4716k6458l0780k5677j9047j3917n051J3931L7440N0406L8174Q01m2925o6001
$$ plain form
922 -24388 -77843 -89744 -57237 -3696 39583 54934 46699 29828 16327 3824 -16225 -44678
934 -44678 -67170 -61495 -18973 43826 91266 92192 43443 -26940 -77704 -82496 -46964 412 31193
947 31193 37035 30126 26501 28560 24046 -1907 -43882 -77421 -73797 -25214 44686 93638 91125
960 91125 39846 -27215 -70216 -69560 -36800 -664 17406 18919 18920 28805 41857 38455 5697 -45991
974 -45991 -83769 -78195 -25625 44102 89729 83441 34151 -24511 -57470 -53544 -28996 -6376 1261
987 1261 2779 12894 34748 53686 46810 6693 -48681 -84655 -75122 -22617 41194 78718 71132
1000 71132 29625 -15980 -39884 -38480 -25498 -16513 -14525 -7634 12352 41801 59903 48086 4416
1013 4416 -48694 -78694 -66581 -19614 33297 62945 57223 28239 -2728 -20991 -26154 -27178 -28896
$$ packed form
922b4388n3455j1901L2507N3541M3279J5351q235j6871j3501j2503k0049k8453
934d4678k2492N675M2522O2799M7440R26m8749p0383n0764m792L5532M7376L0781
947C1193N842o909l625K059m514k5953m1975l3539L624M8583O9900M8952k513
960I1125n1279o7061m3001O56L2760L6136J8070J513JR885J3052l402l2758n1688
974d5991l7778N574N2570O9727M5627o288m9290n8662l2959L926K4548K2620P637
987A261J518J0115K1854J8938o876m0117n5374l5974R533N2505O3811L7524p586
1000G1132m1507m5605k3904J404J2982Q985J988O891J9986K9449J8102j1817m3670
1013D416n3110l0000J2113M6967N2911K9648n722k8984l0967j8263n163j024j718
$$ plain form
1026 -28896 -27280 -12577 16684 47927 60970 42725 -133 -44925 -66271 -54166 -17984 20645
1038 20645 43373 44188 30276 12953 -3087 -18326 -32513 -40938 -35426 -12015 22036 50229 55942
1051 55942 34557 -2173 -36000 -51076 -43145 -20357 5185 24648 35304 36356 28561 10419
1063 10419 -15138 -39444 -49461 -37528 -7415 26710 47927 46308 25184 -1675 -23469 -33461
1075 -33461 -33003 -25483 -12016 7469 29395 44912 42599 19031 -16497 -46559 -54025 -34563 -987
1088 -987 28636 40558 33246 16965 2003 -8367 -17479 -27276 -33905 -27810 -4375 28449 52817
1101 52817 51381 22069 -19727 -50059 -52170 -28106 4252 26037 29396 20937 12614 9617 6287
1114 6287 -5273 -25521 -42603 -39631 -11139 29627 58116 55358 20937 -23151 -49887 -46276 -20198
$$ packed form
1026b8896J616J4703K9261L1243J3043j8245m2858m4792k1346J2105L6182L8629
1038B0645K2728Q15j3912j7323j6040j5239j4187q425N512K3411L4051K8193N713
1051E5942k1385l6730l3827j5076P931K2788K5542J9463J0656J052p795j8142
1063A0419k5557k4306j0017J1933L0113L4125K1217j619k1124k6859k1794r992
1075c3461M58P520J3467J9485K1926J5517k313k3568l5528l0062p466J9462L3576
1088i87K9623J1922p312j6281j4962j0370r112r797o629O095K3435L2824K4368
1101E2817j436k9312m1796l0332k111K4064L2358K1785L359q459q323k997l330
1114F287j1560k0248j7082K972K8492M0766K8489k758l4421m4088k6736L611K6078
$$ plain form
1127 -20198 7271 19996 16943 10580 11520 18916 19664 3065 -27105 -49939 -46484 -13485 31467
1140 31467 59828 53264 17399 -23733 -44321 -36831 -13323 5866 9963 4791 4349 14962 28049
1153 28049 27841 5543 -29422 -53785 -48115 -12312 31837 56251 46863 13546 -20662 -35007 -26441
1166 -26441 -9054 891 -1014 -4236 2493 19713 35074 31384 4663 -31721 -53613 -44131 -8851
1179 -8851 29534 48192 37952 10476 -14427 -22530 -17320 -8772 -7460 -10774 -9068 4381 25170
1192 25170 38386 30109 1242 -31787 -48218 -37223 -6992 23737 36937 29422 10805 -4823
1204 -4823 -11010 -10468 -11306 -15453 -17821 -10538 8486 28678 37295 25118 -1998 -28431 -39287 -28977
1218 -28977 -6581 14161 24358 21370 13701 6283 -286 -7676 -16831 -23900 -21529 -7498 13616
$$ packed form
1127b0198K7469J2725l053o363R40P396P48j6599l0170k2834L455L2999M4952
1140C1467K8361o564l5865m1132k0588P490K3508J9189M097n172m42J0613J3087
1153B8049k08k2298l4965k4363N670L5803M4149K4414r388l3317l4208j4345Q566
1166b6441J7387R945j905l222O729J7220J5361l690k6721l6384k1892R482L5280
1179h851L8385J8658j0240k7476k4903q103N210Q548J312l314J706J3449K0789
1192B5170J3216q277k8867l3029j6431J0995L0231L0729J3200p515j8617j5628
1204d823o187N42q38m147k368P283J9024K0192Q617j2177k7116k6433j0856J0310
1218b8977K2396K0742J0197k988p669p418o569p390r155p069K371J4031K1114
$$ plain form
1231 13616 30034 31698 18238 -3965 -21750 -27739 -21110 -8817 3283 11917 17219 19192 16671
1244 16671 7343 -7751 -22328 -28813 -21075 -2708 16312 26983 24272 11739 -2663 -12373 -16364
1257 -16364 -16442 -13681 -7983 2067 15593 25746 25023 11013 -10228 -27841 -30370 -17358 2543
1270 2543 17915 21463 14804 5718 665 -2312 -6022 -13265 -19993 -18350 -4459 16336 31797 30292
1284 30292 11439 -14150 -30311 -28160 -11927 6388 15457 13540 6801 3896 6432 7602 627
1297 627 -13657 -25924 -25161 -7033 18644 34985 31353 9254 -16541 -29483 -23416 -6197 7505
1310 7505 10657 5276 881 4318 12675 15101 4550 -15282 -31101 -28849 -7191 20462 36082
1323 36082 28755 5892 -17274 -25434 -17078 -1953 6455 4491 -2167 -2334 7292 18438 19663 5009
$$ packed form
1231A3616J6418J664j3460k2203j7785n989O629J2293J2100Q634N302J973k521
1244A6671r328j5094j4577o485P738J8367J9020J0671k711j2533j4402r710l991
1257a6364p8K761N698J0050J3526J0153p23j4010k1241j7613k529J3012J9901
1270B543J5372L548o659r086n053k977l710p243o728J643J3891K0795J5461j505
1284C0292j8853k5589j6161K151J6233J8315R069j917o739k905K536J170o975
1297F27j4284j2267P63J8128K5677J6341l632k2099k5795j2942O067J7219J3702
1310G505L152n381m395L437Q357K426j0551j9832j5819K252K1658K7653J5620
1323C6082p327k2863k3166q160Q356J5125Q408j964o658j67R626J1146J225j4654
$$ plain form
1337 5009 -17964 -33074 -27967 -5040 20885 32968 24226 2996 -14633 -18416 -10461 315 2624
1350 2624 -2886 -7439 -2742 10371 21771 20786 2692 -19749 -31597 -24226 -1612 19192 25918
1363 25918 17381 727 -10543 -11492 -5615 -578 -4123 -6995 -9511 -661 15196 22656 17576 -362
1377 -362 -18610 -26955 -18607 -1117 14149 18484 13162 1901 -3490 -3668 -1317 -3359 -8546 -11033
1391 -11033 -8589 3447 16442 21443 14356 -1585 -15831 -20126 -13613 -1267 8537 11682 8642
1404 8642 5055 2981 1933 -1499 -7605 -13154 -12923 -4911 6477 16297 17106 8603 -2717 -11536 -12974
1419 -12974 -9240 -3251 797 4089 6603 9120 9826 5745 -2686 -12042 -15673 -11339 -1128 8897
1433 8897 13657 11181 4229 -1809 -5094 -6082 -6338 -6991 -6192 -1193 6786 13636 14470 7023 -5352 -14768
$$ packed form
1337E009k2973j5110N107K2927K5925J2083q742k1230j7629l783P955J0776K309
1350B624n510m553M697J3113J1400r85j8094k2441j1848P371K2614K0804O726
1363B5918q537j6654j1270r49N877N037l545k872k516Q850J5857P460n080j7938
1377c62j8248q345Q348J7490J5266M335n322j1261n391j78K351k042n187k487
1391a1033K444J2036J2995N001p087j5941j4246m295O513J2346R804L145l040
1404H642l587k074j048l432o106n549K31Q012J1388R820Q09q503j1320q819j438
1419a2974L734N989M048L292K514K517P06m081q431r356l631M334J0211J0025
1433H897M760k476o952o038l285r88k56o53P99M999P979O850Q34p447j2375r416
$$ plain form
1449 -14768 -15902 -8185 2340 9454 9348 5039 1418 940 1624 -195 -5611 -11518 -12048 -4217 7731
1464 7731 17726 16877 5653 -8252 -16484 -13752 -3751 5455 7792 3921 -26 146 4358 7504 3802
1479 3802 -5969 -15308 -15741 -4909 10217 19590 16732 3614 -10260 -15259 -10017 23 6209 4735
1493 4735 -1095 -3506 694 8475 11644 5280 -7775 -17847 -16983 -4332 11702 19422 14550 996
1507 996 -10761 -12788 -5722 2767 5067 406 -5198 -4855 2863 11655 13771 4729 -9462 -18469 -15708
1522 -15708 -2286 11895 17166 10712 -1314 -9297 -8248 -1749 3573 2556 -3375 -7633 -4298 5083
1536 5083 13417 13308 3099 -10062 -17319 -12846 -631 10763 13195 7427 -1680 -6177 -3955 1438
1550 1438 2922 -836 -6676 -8036 -2250 7213 13550 10978 1159 -9960 -14109 -9160 702 7744 8582
$$ packed form
1449a4768j134P717J0525P114j06m309l621m78O84j819n416n907n30P831J1948
1464G731R995q49j1224j3905q232K732J0001R206K337l871l947J72M212L146l702
1479C802r771r339m33J0832J5126R373k858j3118j3874m999N242J0040O186j474
1493D735n830k411M200P781L169o364j3055j0072Q64J2651J6034P720m872j3554
1507I96j1757k027P066Q489K300m661n604L43P718Q792K116r042j4191r007K761
1522a5708J3422J4181N271o454j2026p983J049O499N322j017n931m258L335R381
1536E083Q334j09j0209j3161p257M473J2215J1394K432n768r107m497K222N393
1550A438J484l758n840j360N786R463O337k572r819j1119m149M949R862P042Q38
$$ [...]
8191A89
##END NTUPLES=NMR FID
##END=
