##TITLE=1H_DE-14sh-TFA
 CDCl3
 8 sc, 
 4.10.2023
##JCAMPDX= 6.0         $$ Bruker NMR JCAMP-DX V2.0
##DATA TYPE= NMR FID
##DATA CLASS= NTUPLES
##ORIGIN= UXNMR, Bruker Analytische Messtechnik GmbH
##OWNER= root
$$ XWIN-NMR		Version 3.5
$$ Wed Oct  4 16:15:13 2023 Russian Standard Time (UT+4h)  she@DPX200
##.OBSERVE FREQUENCY= 200.13135
##.OBSERVE NUCLEUS= ^1H
##.DELAY= (6, 6)
##.ACQUISITION MODE= SIMULTANEOUS
##.ACQUISITION SCHEME= undefined
##.AVERAGES= 8
##.DIGITISER RES= 18
##SPECTROMETER/DATA SYSTEM= spect
##.PULSE SEQUENCE= zg30
##.SOLVENT NAME= D2O
##.SHIFT REFERENCE= (INTERNAL, D2O, 0, 15.7039)
##AUDIT TRAIL= $$ (NUMBER, WHEN, WHO, WHERE, WHAT)
$$ ##TITLE= Audit trail, XWIN-NMR		Version 3.5
$$ ##JCAMPDX= 5.01
$$ ##ORIGIN= Bruker BioSpin GmbH
$$ ##OWNER= she
$$ F:/spectra/data/she/nmr/H-F/1/audita.txt
$$ ##AUDIT TRAIL=  $$ (NUMBER, WHEN, WHO, WHERE, WHAT)
(   1,<2023-10-04 16:14:19.71 +0400>,<she>,<DPX200>,
      <created by zg, POWCHK disabled, PULCHK disabled
       configuration hash MD5:
       00 E9 B6 7A A2 85 ED C7 34 08 36 98 17 FE 4E 26
       data hash MD5: 16K
       3D 72 B3 BE BD 7F D4 9A 3D DB 3A A6 E2 07 A7 FD>)
$$ ##END=
$$ 
$$ hash MD5
$$ F5 AE 5A 2C A4 F7 9E E5 F8 3C 9C EE B9 2D A9 AB
##$RELAX= 
##$RELAX= 
##$RELAX= 
##$RELAX= 
##$RELAX= 
##$RELAX= 
$$ Bruker specific parameters
$$ --------------------------
##$DU= <F:/spectra>
##$EXPNO= 1
##$NAME= <H-F>
##$PROCNO= 1
##$TYPE= <nmr>
##$USER= <she>
##$AMP= (0..31)
100 100 100 100 100 100 100 100 100 100 100 100 100 100 100 100 100 100 
100 100 100 100 100 100 100 100 100 100 100 100 100 100 
##$AQSEQ= 0
##$AQ_mod= 1
##$AUNM= <au_zg>
##$AUTOPOS= <>
##$BF1= 200.13
##$BF2= 200.13
##$BF3= 200.13
##$BF4= 200.13
##$BF5= 200.13
##$BF6= 200.13
##$BF7= 200.13
##$BF8= 200.13
##$BYTORDA= 1
##$CFDGTYP= 0
##$CFRGTYP= 5
##$CHEMSTR= <none>
##$CNST= (0..31)
1 1 145 1 1 1 1 1 1 1 1 1 1 1 1 1 1 1 1 1 1 1 1 1 1 1 1 1 1 1 1 1 
##$CPDPRG= <>
##$CPDPRG1= <>
##$CPDPRG2= <>
##$CPDPRG3= <>
##$CPDPRG4= <mlev>
##$CPDPRG5= <mlev>
##$CPDPRG6= <mlev>
##$CPDPRG7= <mlev>
##$CPDPRG8= <mlev>
##$CPDPRGB= <>
##$CPDPRGT= <>
##$D= (0..31)
0 1.2 0 0 0 0 0 0 0 0.06 0 0.03 0 0 0 0 0.0002 0 0 0 0 0 0 0 0 0 0 0 0 
0 0 0 
##$DATE= 1696421659
##$DBL= (0..7)
120 120 120 120 120 120 120 120 
##$DBP= (0..7)
150 150 150 150 150 150 150 150 
##$DBP07= 0
##$DBPNAM0= <>
##$DBPNAM1= <>
##$DBPNAM2= <>
##$DBPNAM3= <>
##$DBPNAM4= <>
##$DBPNAM5= <>
##$DBPNAM6= <>
##$DBPNAM7= <>
##$DBPOAL= (0..7)
0.5 0.5 0.5 0.5 0.5 0.5 0.5 0.5 
##$DBPOFFS= (0..7)
0 0 0 0 0 0 0 0 
##$DE= 6
##$DECBNUC= <off>
##$DECIM= 32
##$DECNUC= <off>
##$DECSTAT= 4
##$DIGMOD= 1
##$DIGTYP= 9
##$DL= (0..7)
0 120 120 120 120 120 120 120 
##$DP= (0..7)
150 150 150 150 150 150 150 150 
##$DP07= 0
##$DPNAME0= <>
##$DPNAME1= <>
##$DPNAME2= <>
##$DPNAME3= <>
##$DPNAME4= <>
##$DPNAME5= <>
##$DPNAME6= <>
##$DPNAME7= <>
##$DPOAL= (0..7)
0.5 0.5 0.5 0.5 0.5 0.5 0.5 0.5 
##$DPOFFS= (0..7)
0 0 0 0 0 0 0 0 
##$DQDMODE= 0
##$DR= 18
##$DS= 0
##$DSLIST= <SSSSSSSSSSSSSSS>
$$ [...]
##$SUBNAM2= <"">
##$SUBNAM3= <"">
##$SUBNAM4= <"">
##$SUBNAM5= <"">
##$SUBNAM6= <"">
##$SUBNAM7= <"">
##$SUBNAM8= <"">
##$SUBNAM9= <"">
##$SW= 18.05172834244
##$SWIBOX= (0..15)
0 0 2 0 0 0 0 0 0 0 0 0 0 0 0 0 
##$SW_h= 3612.71676300578
##$TD= 16384
##$TD0= 1
##$TE= 0
##$TE2= 300
##$TE3= 300
##$TEG= 300
##$TL= (0..7)
0 120 120 120 120 120 120 120 
##$TP= (0..7)
150 150 150 150 150 150 150 150 
##$TP07= 0
##$TPNAME0= <>
##$TPNAME1= <>
##$TPNAME2= <>
##$TPNAME3= <>
##$TPNAME4= <>
##$TPNAME5= <>
##$TPNAME6= <>
##$TPNAME7= <>
##$TPOAL= (0..7)
0.5 0.5 0.5 0.5 0.5 0.5 0.5 0.5 
##$TPOFFS= (0..7)
0 0 0 0 0 0 0 0 
##$TUNHIN= 0
##$TUNHOUT= 0
##$TUNXOUT= 0
##$USERA1= <user>
##$USERA2= <user>
##$USERA3= <user>
##$USERA4= <user>
##$USERA5= <user>
##$V9= 5
##$VALIST= <valist>
##$VCLIST= <CCCCCCCCCCCCCCC>
##$VD= 0
##$VDLIST= <DDDDDDDDDDDDDDD>
##$VPLIST= <PPPPPPPPPPPPPPP>
##$VTLIST= <TTTTTTTTTTTTTTT>
##$WBST= 1024
##$WBSW= 4
##$XGAIN= (0..3)
0 0 0 0 
##$XL= 0
##$YL= 0
##$YMAX_a= 166840
##$YMIN_a= -174865
##$ZGOPTNS= <>
##$ZL1= 120
##$ZL2= 120
##$ZL3= 120
##$ZL4= 120
##$ABSF1= 10
##$ABSF2= 0
##$ABSG= 5
##$ABSL= 3
##$ALPHA= 0
##$AQORDER= 0
##$ASSFAC= 0
##$ASSFACI= 0
##$ASSFACX= 0
##$ASSWID= 0
##$AUNMP= <proc_1d>
##$AZFE= 0.1
##$AZFW= 0.1
##$BCFW= 1
##$BC_mod= 2
##$BYTORDP= 1
##$COROFFS= 0
##$CY= 11.3945322036743
##$DATMOD= 1
##$DC= 2
##$DFILT= <>
##$DTYPP= 0
##$F1P= 15.7292609196834
##$F2P= 12.9074282941183
##$FCOR= 0.5
##$FTSIZE= 0
##$FT_mod= 4
##$GAMMA= 1
##$GB= 0.15
##$INTBC= 1
##$INTSCL= 1
##$ISEN= 128
##$LB= 0.24
##$LEV0= 0
##$LPBIN= 0
##$MAXI= 10000
##$MC2= 0
##$MEAN= 0
##$ME_mod= 0
##$MI= 1.114404
##$NCOEF= 0
##$NC_proc= 0
##$NLEV= 6
##$NOISF1= 3.799351
##$NOISF2= 2.8
##$NSP= 1
##$NTH_PI= 0
##$NZP= 0
##$OFFSET= 15.70392
##$PC= 1
##$PHC0= -21709.86
##$PHC1= 10.85271
##$PH_mod= 1
##$PKNL= yes
##$PPARMOD= 0
##$PSCAL= 0
##$PSIGN= 0
##$REVERSE= no
##$SF= 200.130013532006
##$SI= 16384
##$SIGF1= 3
##$SIGF2= 2
##$SINO= 400
##$SIOLD= 16384
##$SREGLST= <1H.CDCl3>
##$SSB= 0
##$STSI= 0
##$STSR= 0
##$SW_p= 3612.71676300578
##$SYMM= 0
##$S_DEV= 0
##$TDeff= 0
##$TDoff= 0
##$TI= <>
##$TILT= no
##$TM1= 0
##$TM2= 0
##$TOPLEV= 0
##$USERP1= <user>
##$USERP2= <user>
##$USERP3= <user>
##$USERP4= <user>
##$USERP5= <user>
##$WDW= 1
##$XDIM= 8192
##$YMAX_p= 0
##$YMIN_p= 0
$$ End of Bruker specific parameters
$$ ---------------------------------
##NTUPLES= NMR FID
##VAR_NAME=  TIME,          FID/REAL,        FID/IMAG
##SYMBOL=    X,             R,               I
##VAR_TYPE=  INDEPENDENT,   DEPENDENT,       DEPENDENT
##VAR_FORM=  AFFN,          ASDF,            ASDF
##VAR_DIM=   8192,          8192,            8192
##UNITS=     SECONDS,       ARBITRARY UNITS, ARBITRARY UNITS
##FACTOR=    0.0002768,     1,               1
##FIRST=     0,             0,               0
##LAST=      2.2672688,     0,               0
##MIN=       0,             -174865,         0
##MAX=       2.2672688,     166840,          0
$$ Real data points
##PAGE= N=1
##DATA TABLE= (X++(R..R)), XYDATA
$$ plain form
0 0 0 0 0 0 0 0 0 0 0 0 0 0 0 0 0 0 0 -8 8 -8 8 -8 8 -11 16 -16 16 -22 24 -27 32 -35 40 -44 50 -55 62 -69 76
39 76 -85 95 -105 115 -128 141 -155 172 -188 206 -228 252 -278 305 -339 375 -417 468 -524 591 -676
60 -676 778 -911 1085 -1325 1676 -2225 3191 -5191 10858 -56531 -174865 90952 48963 -150559
74 -150559 60557 148741 -86952 -59978 51652 -47507 -4660 102545 -6990 -39510 37293
85 37293 -28357 -58625 21990 18042 16687 34360 -46506 -55484 26337 132 -8086 53512 -1468
98 -1468 -42127 18039 -22943 -48484 56540 41023 -33578 19874 -3705 -64455 40854 58898
110 58898 -46436 21910 60726 -69842 -33202 58839 -35480 -14318 89891 -35558 -89947
121 -89947 57765 17990 -71355 47167 52855 -64490 -2971 34987 -58439 -10943 65518 -11651
$$ packed form
0@%%%%%%%%%%%%%%%%%qJ6j6J6j6J6j9K7l2L2l8M6n1N9o7P5q4R4j05J17j31J45
39G6j61J80k00K20k43K69k96L27l60L94m34M80n30N83o44P14p92Q85r92J115j267
60f76J454j689J996k410L001l901N416q382J6049o7389j18334K65817m1989j99522
74a50559K11116Q8184k35693K6974J11630r9159M2847J07205j09535l2520P6803
85C7293o5650l0268Q0615l948j355J7673q0866q978Q1821k6205q218O1598n4980
98a468m0659O0166m0982k5541J05024j5517p4601N3452k3579o0750J05309J8044
110E8898j05334O8346L8816j30568L6640R2041r4319K1162J04209j25449n4389
121h9947J47712l9775q9345J18522N688j17345O1519L7958r3426M7496P6461p7169
$$ plain form
133 -11651 -29661 21285 -16486 -19603 32467 5873 -10732 24050 2615 -21765 -1100 -562 10599
146 10599 25774 -12269 -17942 16043 -8265 -14368 27139 2240 -19042 24065 -3280 -44356
158 -44356 14727 25498 -25880 5116 16878 -35896 -3831 31322 -21756 -8700 39731 -10958
170 -10958 -26791 23934 -2834 -21732 32538 12888 -32814 9673 19104 -22564 2412 23814
182 23814 -11137 -3219 16232 -13944 -14774 15318 4943 -8582 319 -3107 -5681 51 -3649 182
196 182 5648 -2562 -1815 -128 -9977 2056 14229 -4712 -5669 11816 -2465 -8819 12751 3932
210 3932 -7745 12466 5797 -15157 3383 10145 -9152 1164 9513 -11119 -5897 8720 -7551
223 -7551 -7880 9334 -1146 -9427 3363 -1970 -8354 5740 4981 -6347 642 4964 -2196 316
$$ packed form
133a1651j8010N0946l7771l117N2070k6594j6605L4782k1435k4380K0665N38J1161
146A0599J5175l8043n673L3985k4308o103M1507k4899k1282M3107k7345m1076
158d4356N9083J0771n1378L0996J1762n2774L2065L5153n3078J3056M8431n0689
170a0958j5833N0725k6768j8898N4270j9650m5702M2487R431m1668K4976K1402
182B3814l4951P918J9451l0176q30L0092j0375j3525Q901l426k574N732l700L831
196A82N466q210P47J687r849J2033J2173j8941r57J7485j4281o354K1570q819
210C932j1677K0211o669k0954J8540O762j9297J0316Q349k0632N222J4617j6271
223g551l29J7214j0480q281J2790n333o384J4094p59j1328O989M322p160K512
$$ plain form
237 316 3640 1330 3804 3094 -1428 780 2105 1059 3344 -36 -2621 2534 420 -5783 315 1837
253 1837 -5195 -670 1287 -7184 -2315 4237 -4328 -3846 4652 -1797 -4284 4479 427 -3180 5520
268 5520 3321 -3416 3177 4189 -2214 2464 4759 -2450 -190 3952 -1754 -1803 2118 -1596 -1803 1130
284 1130 -2432 -2983 1012 -1188 -3036 -647 -911 -1077 438 -2216 -1959 2830 536 -2613 1873 2511
300 2511 -583 1571 2768 37 1563 2694 -224 638 2369 -485 -158 1663 -951 -1267 1002 -719
316 -719 -1728 47 -893 -2395 -503 -1087 -2751 -1045 -531 -1479 -489 198 -893 1017 1710 -90 698
333 698 2687 676 -606 1805 1435 -375 937 1427 -139 238 2193 933 -889 513 1315 -823
349 -823 -1616 -494 -486 -1797 -1554 -1666 -1483 -156 -1068 -1227 293 293 -723 -311 1096 684 -70 -62 805 1221
$$ packed form
237C16L324k310K474p10m522K208J325j046K285l380k585N155k114o203O098J522
253A837p032M525J957q471M869O552q565M82Q498o449k487Q763m052l607Q700
268E520k199o737O593J012o403M678K295p209K260M142n706m9L921l714k07K933
284A130l562n51L995k200j848K389k64j66J515k654K57M789k294l149M486O38
300B511l094K154J197k731J526J131k918Q62J731k854L27J821k614l16K269j721
316g19j009J775r40j502J892n84j664J706N14r48R90O87j091J910O93j800P88
333F98J989k011j282K411l70j810J312M90j566L77J955j260j822J402Q02k138
349h23p93J122Qj311K43j12J83J327r12j59J520%j016M12J407m12p54QQ67M16
$$ plain form
369 1221 124 440 2519 1811 104 1684 1564 -426 633 1468 -1674 -1277 13 -2805 -3146 443 -871
386 -871 -2472 232 -544 -2538 1015 1510 -2416 712 2823 -2699 -1220 3849 -370 -1005 4075 1725
402 1725 -1731 3157 3066 -2097 1477 3407 -2162 -1773 1619 -2056 -3134 1081 -327 -2722 -451 -524
418 -524 -2297 -471 748 -678 -1180 -857 -212 -496 -1455 1249 2418 -581 34 3388 987 28 4474
435 4474 1749 -1348 2986 1315 -4371 1614 3629 -4808 -1044 4287 -4507 -5000 4855 -1413 -5936
450 -5936 4531 774 -8359 1220 3904 -6742 -159 6742 -4060 -3206 6564 -509 -3629 7205
464 7205 3367 -4944 2730 3974 -3812 -17 4335 -866 -1187 1438 -1126 -1603 788 345 -149 -882
480 -882 -1363 -589 -2405 -2751 2204 264 -4297 1052 1768 -5141 284 5587 -2778 -528 6531 -3367
$$ packed form
369A221j097L16K079p08j707J580j20j990J059Q35l142L97J290k818l41L589j314
386h71j601K704p76j994L553M95l926L128K111n522J479N069m219o35N080k350
402A725l456M888r1n163L574J930n569L89L392l675j078M215j408k395K271p3
418e24j773J826J219j426n02L23O45k84r59K704J169k999O15L354k401r59M446
435D474k725l097M334j671n686N985K015q437L764N331q794m93R855o268m523
450e936J0467l757r133R579K684j0646O583O901j0802Q54R770p073l120J0834
464G205l838q311P674J244p786L795M352n201l21K625k564m77K391m43m94p33
480h82m81P74j816l46M955j940m561N349P16o909N425N303q365K250P059r898
$$ plain form
496 -3367 -3778 8005 261 -5737 7796 3801 -8780 2928 6429 -7095 194 8613 -6048 -4703
510 -4703 7507 -4124 -7491 7259 1061 -8822 2989 2930 -8039 550 5651 -4223 -939 5051
524 5051 -2571 -2953 3748 582 -1185 2623 1346 -285 345 46 1531 1556 -812 1739 1260 -3671 -47
541 -47 3025 -4544 -825 5130 -4392 -5369 5069 -1821 -7072 5576 1995 -8033 3218 4324 -8676
556 -8676 1273 8912 -5316 -2407 9816 -3245 -6108 8586 1998 -6184 6641 4085 -7728 1286
570 1286 5535 -5319 -960 6217 -2980 -4706 2547 -1340 -3906 1614 1151 -2665 -1081 -357 -1400
585 -1400 -1052 503 2260 656 -1574 1190 1746 -2219 1458 5142 -1096 -701 4582 -1943 -3593 5632
601 5632 1513 -4477 3587 1823 -7220 332 4292 -4671 -888 4757 -4762 -4836 4304 -1680 -4588 5026
$$ packed form
496c367m11J1783p744n998J3533l995j2581J1708L501j3524P289Q419j4661J345
510d703J2210j1631l367J4750o198r883J1811n9j0969Q589N101r874L284N990
524E051p622l82O701l166j767L808j277j631O30k99J485K5k368K551m79m931L624
541d7L072p569L719N955r522r77J0438o890n251J2648l581j0028J1251J106j3000
556h676R949P639j4228K909J2223j3061k863J4694o588q182J2825k556j1813R014
570A286M249j0854M359P177r197j726P253l887k566N520m63l816J584P24j043
585a400L48J555J757j604k230K764N56l965L677L684o238L95N283o525j650R225
601E632m119n990Q064j764r043P552L960q963L783N645r519p4R140n984k908R614
$$ plain form
617 5026 1775 -6049 1358 3082 -3878 944 5694 -1035 -1553 3482 -353 -2397 3203 3656 -1426 -130
633 -130 2183 -1464 -2842 1923 2450 -2269 -1034 1817 -3030 -4013 2877 814 -4450 1347 2281 -5291
649 -5291 -1791 4449 -1304 -1877 4587 -29 -3849 2807 2333 -2619 2325 4098 -2089 -1044 2868 -425
665 -425 -1130 2605 1047 -1628 -526 49 -1466 -188 938 -294 -1888 -881 -154 -2035 -1383 2069
681 2069 246 -2830 1112 974 -2790 1080 3383 -1675 -95 3872 -1857 -2339 4573 1064 -2594 3428
697 3428 1495 -4103 1241 3182 -3450 -159 3115 -2684 -2782 2066 -1308 -2551 1228 -444 -2093 391
713 391 -848 -1384 1610 185 -1058 1256 160 -852 1832 777 -445 2870 791 -1741 2162 1987
729 1987 -1894 1219 2189 -2464 -371 1594 -2778 -1015 2477 -2529 -2216 2480 -1815 -2869 2349 -388
$$ packed form
617E026l251p824P407J724o960M822M750o729n18N035l835k044N600M53n082J296
633a30K313l647j378M765N27m719J235K851m847r83O890k063n264N797R34p572
649e291L500O240n753n73O464m616l820O656m74m952M944J773o187J045L912l293
665d25p05L735j558k675J102N75j515J278J126j232j594J007P27j881O52L452
681B069j823l076L942j38l764L870K303n058J580L967n729m82O912l509l658O022
697C428j933n598N344J941o632L291L274n799r8M848l374j243L779j672j649K484
713C91j239n36K994j425j243K314j096j012K684j055j222L315k079k532L903j75
729A987l881L113R70m653K093J965m372J763L492n006L13M696m295j054N218k737
$$ plain form
745 -388 -2507 1933 387 -2805 1852 1480 -2370 1709 2543 -2107 973 3570 -1464 239 3475 -754
761 -754 -1085 2385 -503 -1576 1641 -589 -1902 1283 -873 -2427 1116 -89 -2782 110 294 -2364
777 -2364 -54 244 -1637 564 1132 -1606 569 2538 -1185 -371 2814 257 -501 2162 261 -636
793 -636 1858 159 -1508 1458 636 -1946 639 385 -1789 35 445 -1930 -3 552 -1954 -836
809 -836 1233 -1398 -1170 1093 -436 -780 1194 487 -492 1347 666 -204 1127 1063 -310 540 677 11
827 11 732 440 -649 212 398 -860 -286 104 -1117 -929 -221 -1115 -1094 513 -538 -863 630 63 -314
846 -314 269 567 278 591 478 490 912 628 85 693 674 81 415 308 -281 37 -41 -478 -483 -26 -659 -717
868 -717 -412 -262 -484 -993 -329 -289 -664 -196 76 -218 -207 505 363 -218 705 682 75 406 1293 81 55
$$ packed form
745c88k119M440j546l192M657l72l850M079Q34m650L080K597n034J703L236m229
761g54l31L470k888j073L217k230j313L185k156j554L543j205k693K892J84k658
777b364K310K98j881K201N68k738K175J969l723Q14L185k557p58K663j901q97
793f36K494j699j667K966q22k582K585k54k174J824M10k375J927N55k506J118
809h36K069k631K28K263j529l44J974p07r79J839o81q70J331o4j373Q50J37o66
827A1P21k92j089Q61J86j258N74L90j221J88P08q94K1J607j051l25J493n67l77
846c14N83K98k89L13j13J2M22k84n43O08j9n93L34j07n89L18p8m37nM57o33n8
868g17L05J50k22n09O64M0l75M68K72k94J1P12j42n81R23k3o07L31Q87j212k6
$$ plain form
889 55 922 359 252 455 -120 -644 315 -92 -805 -353 -173 -716 -893 -553 -601 -363 -636 -282 -353 50 -470
910 -470 -100 184 225 106 304 594 643 598 650 879 797 376 419 128 -164 469 668 -417 -237 192 -617 -1141
932 -1141 -291 -156 -820 -478 -445 -1134 -757 133 -497 -208 911 94 -797 348 948 -81 621 1614 59
951 59 -380 825 465 4 1408 840 -645 -695 352 -684 -341 549 52 -963 -247 -612 -1250 236 663
970 663 -606 -643 37 -762 -786 788 1047 214 430 124 -167 29 980 985 1015 455 13 -511 -569 877 603
991 603 62 245 -244 -1345 -768 152 -550 148 803 -1161 -1715 110 -55 -1051 1123 1083 -1455 -729 521
1010 521 -735 542 2464 333 -601 967 74 -1018 1896 1872 -408 376 516 -1506 -885 1074 117
1027 117 -300 582 -815 -2009 -1020 482 206 121 -333 -568 -1212 -785 525 998 616 900 -62 -1447 -65
$$ packed form
889E5Q67n63j07K03n75n24R59m07p13M52J80n43j77L40m8K38k73L54p1M03n20
910d70L70K84M1j19J98K90M9m5N2K29q2m21M3k91k92O33J99j085J80M29q09n24
932a141Q50J35o64L42L3o89L77Q90o30K89J119q17q91J145O00j029P02R93j555
951E9m39J205l60m61J404n68j485n0J047j036L43Q90m97j015P16l65o38J486M27
970F63j269l7O80p99k4J574K59q33K16l06k91J96R51NL0n60m42n24n8J446k74
991F03n41J83m89j101N77R20p02O98O55j964n54J825j65r96K174m0k538P26J250
1010E21j256J277J922k131r34J568q93j092K914k4k280P84J40k022O21J959r57
1027A17m17Q82j397j194R89J502k76q5m54k35o44M27J310M73l82K84r62j385J382
$$ plain form
1046 -65 1389 615 887 1851 -203 -1485 675 454 -387 1698 1316 -1713 -757 250 -2148 -133 2009
1063 2009 -718 -2058 -50 -1054 -1751 852 1418 -703 289 227 -1898 -245 2033 840 375 1264 -277
1080 -277 -1057 805 1097 693 1059 518 -810 -848 -342 237 430 175 210 -527 -1766 -874 403 -198 -296 733
1100 733 -971 -1748 -69 24 -1 1412 1250 -1177 -106 1033 -551 255 2516 405 -593 878 -693
1117 -693 -1056 1723 1012 -960 152 148 -1755 -678 1177 -427 -513 750 -1065 -1524 103 327 -542 522
1135 522 528 -914 -627 307 479 591 762 390 60 -319 131 606 708 527 871 -347 -815 289 93 -678
1155 -678 551 571 -1371 -1213 218 -1013 -580 869 -793 -1071 440 -401 -1233 1039 813 -886 45
1172 45 1028 -918 185 1467 333 149 1020 150 -673 493 620 -183 361 354 -1002 -323 -63 -652 -70
$$ packed form
1046f5J454p74K72R64k054j282K160k21q41K085l82l029R56J007k398K015K142
1063B009k727j340K008j004o97K603N66k121R92o2k125J653K278j193m65Q89j541
1080b77p80J862K92m04L66n41j328l8N06N79J93k55L5p37j239Q92J277o01r8J029
1100G33j704p77J679R3k5J413j62k427J071J139j584Q06K261k111r98J471j571
1117f93l63K779p11j972J112mj903J077J855j604q6J263j815m59J627K24q69J064
1135E22Oj442K87R34J72J12J71l72l30l79M50M75J02j81L44j218m68J104j96p71
1155f78J229K0j942J58J431j231M33J449j662k78J511q41q32K272k26j699R31
1172D5R83j946J103J282j134j84Q71q70q23J166J27q03N44pj356O79K60n89N82
$$ plain form
1191 -70 256 -715 -821 -148 -552 -263 212 154 -150 -140 -188 -59 364 248 497 703 83 122 747 216 155 977
1213 977 403 -681 40 383 -526 518 46 -761 -145 2 -1017 -441 639 -506 -1032 151 -471 -727
1231 -727 179 80 -445 288 343 -296 151 759 275 488 929 153 109 504 -63 89 407 9 -246 -44 284
1252 284 -258 -417 -174 -213 -334 -821 -753 -85 -63 -453 263 84 -81 -176 104 -130 325 479 45 416 660
1273 660 165 137 412 222 157 264 258 -174 227 28 -385 -243 -194 -505 -777 -79 -267 -521 -229 -291 -168 -300
1295 -300 -283 -188 212 -53 -74 75 64 482 629 341 339 494 187 290 338 225 162 36 -194 -299 -66 -38 -89
1318 -89 -434 -221 -419 -636 -549 -322 -183 -436 -485 69 -126 -79 34 53 339 227 27 259 661 336 186 131
1340 131 398 -7 123 208 230 -83 -76 -199 -309 193 -492 -467 -278 -278 -474 -283 -355 -547 -302 67 -539 -20 82
$$ packed form
1191g0L26r71j06O73m04K89M75n8l04J0m8J29M23j16K49K06o20L9O25n31o1Q22
1213I77n74j084P21L43r09J044m72q07O16J47j019N76J080j145n26J183o22k56
1231g27R06r9n25P33N5o39M47O08m84K13M41p76m4L95n67J52L18l98k55K02L28
1252B84n42j59K43l9j21m87O8O68K2l90P16j79j65r5K80k34M55J54m34L71K44
1273F60m95k8K75j90o5J07om32M01j99m13J42M9l11k72O98j88k54K92o2J23j32
1295c00J7R5M00k65k1J49j1M18J47k88kJ55l07J03M8j13o3j26k30j05K33K8n1
1318h9l45K13j98k17Q7K27J39k53m9N54j95M7J13J9K86j12k00K32M02l25j50n5
1340A31K67m05J30Q5K2l13Pj23j10N02o85K5J89%j96J91p2j92K45L69o06N19J02
$$ plain form
1363 82 -97 19 335 218 385 783 71 291 511 336 364 519 191 108 36 45 -165 101 -250 -548 -88 -68
1385 -68 -526 -448 87 -391 -87 -112 -268 42 222 40 -147 333 -26 -12 397 391 17 661 380 -193 573 328
1407 328 -159 524 193 -443 -96 -174 -323 -172 151 -816 -537 232 -594 -662 164 -111 -370 182 -103 -476 468
1428 468 282 -53 70 478 85 282 792 373 218 404 176 3 38 87 52 -65 -222 -237 -349 -62 96
1449 96 -431 -490 -42 -288 -388 -540 127 -394 -107 172 -171 -426 411 480 -327 180 476 -85 -36 466 289
1470 289 -62 508 42 -471 336 259 -698 -15 686 -440 -676 398 -193 -652 -56 39 -406 -18 -10 -335 -229
1491 -229 673 13 -415 463 531 22 24 572 189 48 568 180 -434 545 320 115 64 424 -324 -335 287 -133
1513 -133 -579 75 -107 -540 -218 38 -483 -352 432 -59 -460 465 245 -275 -96 667 65 -296 706 228
$$ packed form
1363H2j79J16L16j17J67L98p12K20K20j75K8J55l28q3p2Rk10K66l51k98M60K0
1385f8m58P8N35m78L04k5j56L10J80j82j87M80l59J4M09ol74O44k81n73P66k45
1407C28m87O83l31o36L47p8j49J51L23r67K79P69q26o8Q26k75k59N52k85l73R44
1428D68j86l35J23M08l93J97N10m19j55J86k28j73L5M9l5j17j57j5j12K87J58
1449I6n27n9M48k46j00j52O67n21K87K79l43k55Q37O9q07N07K96n61M9N02j77
1470B89l51N70m66n13Q07p7r57O83P01j126k36J074n91m59N96R5m45L88Ql25J06
1491b29R02o60m28Q78O8n09KN48l83j41N20l88o14R79k25k05n1L60p48j1O22m20
1513a33m46O54j82m33L22K56n21J31P84m91m01R25k20n20J79P63o02l61J002m78
$$ plain form
1533 228 -176 510 443 -358 -46 762 -171 -301 484 134 -577 -4 184 -761 -313 322 -637 -808 482 -102
1553 -102 -693 534 25 -740 -4 466 -63 309 721 -87 -207 544 572 -64 262 618 -321 -289 374 18
1573 18 -339 181 53 -494 -83 171 -843 -147 245 -39 -626 137 -46 -690 109 308 -107 -134 680 -108
1593 -108 -171 475 385 -178 421 744 -226 -54 566 81 -244 283 108 -232 -24 78 -343 -211 135 -337 -417
1614 -417 52 47 -754 152 479 -263 -292 484 -347 -216 512 386 -166 492 694 157 -76 795 85 -379 368
1635 368 -13 -147 291 251 -580 104 404 -438 -660 43 -134 -582 -357 12 -608 10 88 -467 -8 315 -86
1656 -86 -62 155 656 -106 310 453 94 -170 322 513 -90 146 94 -289 -51 314 -272 -387 -122 -115 -578 -153
1678 -153 77 -526 -294 266 -401 -17 136 -326 -209 250 323 -83 295 529 340 221 661 296 302 372 266
$$ packed form
1533B28m04O86o7q01L12Q08r33j30P85l50p11N73J88r45M48O35r59j71J290n84
1553a02n91J227n09p65P36M70n29L72M12q08j20P51K8o36L26L56r39L2O63l56
1573A8l57N20j28n47M11K54j014O96L92k84n87P63j83o44P99J99m15k7Q14p88
1593a08o3O46r0n63N99L23r70J72O20m85l25N27j75l40K08J02m21J32L46m72q0
1614d17M69nq01R06L27p42k9P76q31J31P28j26n52O58K02n37k33Q71p10m64P47
1635C68l81j34M38m0q31O84L00q42k22P03j77m48K25L69o20O18P8n55M59L23m01
1656h6K4K17N01p62M16J43l59k64M92J91o03K36n2l83K38L65n86j15K65Pm63M25
1678a53K30o03K32N60o67L84J53m62J17M59P3m06L78K34j89j19M40l65OP0j06
$$ plain form
1699 266 -292 157 268 -133 -29 255 63 -353 -67 -181 -395 -346 -365 -313 -169 -66 64 -31 75 320 -36
1720 -36 -38 303 -21 103 236 369 -128 286 84 -69 235 416 150 58 439 -185 -112 92 -230 -129 -309 -236
1742 -236 84 -212 155 -226 -242 -26 -149 -263 118 219 215 105 288 108 352 376 132 107 225 277 90 85 324
1765 324 114 -353 38 -79 -217 -107 196 -346 -217 134 36 -246 33 -282 -282 163 64 -47 264 280 287 192 321
1788 321 392 27 141 267 168 512 361 102 111 128 -12 63 -138 -130 -281 -238 -150 -274 -306 -306 -14 -199 -117 -111 -69 -166
1814 -166 94 91 17 181 369 241 211 538 238 167 168 296 384 208 -20 38 86 68 -239 -243 -326 -308 -206 -244 -210 -199
1840 -199 -112 78 -38 -232 -344 92 -3 54 280 -98 160 137 189 179 216 110 235 82 192 104 305 -157 -25
1863 -25 -13 101 -215 132 -27 -188 -146 -487 133 -193 -202 -298 69 41 -78 121 -14 -165 47 135 217 54 104
$$ packed form
1699B66n58M49J11m01J04K84j92m16K86j14k14M9j9N2J44J03J30r5J06K45l56
1720c6kL41l24J24J33J33m97M14k02j53L04J81k66r2L81o24P3K04l22J01j80P3
1742b36L20k96L67l81j6K16j23j14L81J01mj10J83j80K44K4k44k5J18N2j87nK39
1765C24k10m67L91j17j38J10L03n42J29L51r8k82K79l15%M45r9j11L11J6Pr5J29
1788C21P1l65J14J26r9L44j51k59RJ7j40P5k01Qj51M3Q8j24l2%K92j85Q2OM2r7
1814a66K60lp4J64J88j28l0L27l00p1JJ28Q8j76k28N8M8j8l07mq3J8J02l8L4J1
1840a99Q7J90j16j94j12M36r5N7K26l78K58k3N2j0L7j06J25j53J10q8K01m62J32
1863b5J2J14l16L47j59j61M2l41O20l26rr6L67k8j19J99j35j51K12Q8Q2j63N0
$$ plain form
1886 104 205 156 -52 318 -111 233 90 165 -25 -258 -251 -50 -67 -222 -420 12 -281 -150 74 -270 -37 -20
1908 -20 -311 71 50 -67 -166 254 -171 35 416 301 -197 -53 285 -85 6 102 38 102 129 134 -124 -164 -12 -180
1932 -180 40 -140 50 65 -296 -314 -16 -128 -73 140 -158 103 160 -363 278 413 133 31 260 45 237
1953 237 125 397 -285 106 639 -38 -197 274 -278 -269 29 -19 -440 55 -171 -494 -110 -186 -71 -252 -107
1974 -107 5 8 88 151 233 122 -4 222 79 49 440 251 -121 243 131 -99 93 175 -79 -53 91 212 -189
1997 -189 -141 -154 -413 233 177 -520 -217 218 -305 -107 37 -39 96 39 -31 -209 367 174 61 69 354 -167 104
2020 104 -1 27 58 149 -13 15 -235 254 -158 -109 -162 -203 -209 103 116 -44 -74 87 -257 -159 194 -161 -9 -28
2044 -28 304 -172 69 548 288 -12 324 -38 -73 -7 357 128 -83 275 -75 -157 18 -74 -326 107 -83 -430
$$ packed form
1886A04J01m9k08L70m29L44j43P5j90k33PK01j7j55j98M32k93J31K24l44K33J7
1908b0k91L82k1j17r9M20m25K06L81j15m98J44L38l70R1R6o4O4K7Nk58m0J52j68
1932a80K20j80J90J5l61j8K98j12N5K13k98K61N7n23O41J35k80j02K29k15J92
1953B37j12K72o82L91N33o77j59M71n52RK98m8m21M95k26l23L84p6J15j81J45
1974a07J12LQ0O3Q2j11j26K26j43l0L91j89l72L64j12k30J92Q2k54K6J44J21m01
1997a89M8j3k59O46n6o97L03M35n23J98J44p6J35n7p0j78N76j93j13QK85n21K71
2020A04j05K8L1R1j62K8k50M89m12M9n3m1oL12J3j60l0J61l44R8L53l55J52j9
2044b8L32m76K41M79k60l00L36l62l5O6L64k29k11L58l50q2J75r2k52M33j90l47
$$ plain form
2066 -430 -255 -110 -275 -186 84 187 -214 26 159 -158 -76 185 425 38 193 164 -1 140 203 -101 272
2087 272 285 -249 -128 -142 -197 -114 -43 -120 -232 -56 -215 -181 317 108 -56 -236 18 12 -78 -143 346 -161 -49 61
2111 61 79 297 173 -8 89 -8 238 -111 121 347 37 -55 44 -226 -291 95 -67 19 -168 39 -142 -217 122
2134 122 -22 -166 -102 111 -244 49 -118 249 3 112 147 -83 307 260 32 -42 134 19 -63 49 175 -57
2156 -57 -103 3 -105 76 -1 -289 -212 107 66 -159 -240 271 -20 19 29 -200 -125 -130 309 156 123 -28 106 105 71
2181 71 90 -153 223 -96 295 -28 -12 -120 -117 -214 -191 -270 35 -155 -356 -65 -131 -34 51 -136 78 -50 10 93
2205 93 -53 106 220 231 33 53 -60 -29 124 88 146 24 171 78 26 228 -279 -165 -292 -130 -384 -98 -265
2228 -265 -49 -37 84 -312 -124 6 -83 -76 94 254 24 10 266 229 8 215 164 -136 399 -13 149 8
$$ packed form
2066d30J75J45j65Q9K70J03m01K40J33l17Q2K61K40l87J55k9j65J41O3l04L73
2087B72J3n34J21j4n5Q3P1p7j12J76j59L4M98k09j64j80K54or0o5M89n07J12J10
2111F1J8K18j24j81R7r7K46l49K32K26l10r2R9k70o5L86j62Q6j87K07j81p5L39
2134A22j44j44O4K13l55K93j67L67k46J09L5k30L90m7k28p4J76j15q2J12J26k32
2156e7m6J06j08J81p7k88P7L19m1k25q1N11k91L9J0k29P5nM39j53l3j51J34jl4
2181G1J9k43L76l19L91l23J6j08Lr7K3p9L05j90k01K91o6R7Q5j87K14j28O0Q3
2205I3j46J59J14J1j98K0j13L1J53l6N8j22J47r3n2K02n07J14j27J62k54K86j67
2228b65K16J2J21l96J88J30q9PJ70J60k30j4K56l7k21K07n1l00N35m12J62j41
$$ plain form
2250 8 15 30 -181 26 -131 18 -96 34 -95 66 18 -452 -153 -18 28 16 -172 135 86 156 83 -170 147 51
2274 51 164 163 446 116 132 234 39 204 -160 305 -167 -2 -66 -62 -98 -226 -92 -284 -66 35 -296 -194 183
2297 183 -100 175 -210 177 110 -53 157 213 363 125 49 -1 393 239 245 -46 -22 -67 8 38 -70 -176 -249 -76
2321 -76 -133 -96 -50 -105 -182 -141 -176 64 -145 180 -60 -190 -110 11 -162 171 192 273 -136 154 -25 152 -71 121
2345 121 -35 -161 117 -10 -71 94 -296 -42 -319 -57 -122 -7 -75 -275 78 -68 -179 -133 25 -38 150 -2
2367 -2 43 236 20 -97 34 110 128 -60 67 -127 11 28 -4 -103 -44 -150 -44 -48 -122 -278 -95 -407 -178 -112
2391 -112 58 -253 -267 -81 -153 94 -67 151 23 152 187 115 -109 217 -194 174 187 41 101 -126 -65 84
2413 84 89 -466 7 82 -78 -21 49 -55 53 -70 -67 279 -106 -136 25 35 177 -186 19 282 297 273 -113 98
$$ packed form
2250HPJ5k11K07j57J49j14J30j29J61m8m70K99J35M6j2j88L07m9P0p3k53L17r6
2274E1J13jK83l30J6J02j95J65l64M65m72J65o4Ml6j28J34j92K18J01l31J02L77
2297A83k83K75l85L87o7j63K10N6J50k38p6n0L94j54Ok91K4m5P5L0j08j06p3J73
2321g6n7L7M6n5p7M1l5K40k09L25k40j30Q0J21j73L33K1Q1m09K90j79J77k23J92
2345A21j56j26K78j27o1J65l90K54k77K62o5J15o8k00L53j46j11M6J58o3J88j52
2367bM5J93k16j17J31P6J8j88J27j94J38J7l2r9N9j06J06mp4j56J83l12K29O6
2391a12J70l11j4J86p2K47j61K18j28J29L5p2k24L26m11L68J3j46O0k27O1J49
2413H4Nn55M73P5j60N7P0j04J08j23LL46l85l0J61J0J42l63K05K63J5k4l86K11
$$ plain form
2437 98 138 266 165 262 -32 185 164 -95 24 130 -261 -206 -141 -4 -27 -33 43 -108 169 130 -152 197 78 -97
2461 -97 88 -164 124 165 101 -51 -41 173 18 -11 -31 -23 -115 201 -148 66 281 -88 -276 -261 -24 -262 33
2484 33 -148 185 53 -198 8 -102 61 -81 166 -164 246 -55 115 241 0 293 -12 -2 181 -185 -86
2505 -86 -74 -225 -150 140 120 -371 -147 158 -98 12 -205 -328 -53 -119 -209 -20 -24 -253 54 74 60 -35 -24 8
2529 8 121 315 29 36 176 -120 -121 32 -75 150 101 -64 -286 94 -191 -153 255 -178 -190 -57 -78 -223 31
2552 31 240 -135 -35 -143 -267 -271 358 -27 43 56 60 34 262 281 -32 147 181 137 -33 2 229 82 178 247 -144
2577 -144 -360 -51 99 -54 -151 -61 -157 -164 -95 -102 -151 -11 -67 -346 1 363 -50 140 337 52 -110 371 77
2600 77 -58 176 310 -118 152 96 124 -206 -142 172 -92 -72 -122 -245 -107 -209 -97 -64 -3 172 -203 180 295
$$ packed form
2437I8M0J28j01R7k94K17k1k59J19J06l91N5O5J37k3oP6j51K77l9k82L49j19j75
2461i7J85k52K88M1o4j52J0K14j55k9k0Qr2L16l49K14K15l69j88J5K37k38K95
2484C3j81L33j32k51K06j10J63j42K47l30M10l01J70J26k41K93l05J0J83l66R9
2505h6J2j51P5K90k0m91K24L05k56J10k17j23K75o6r0J89mk29L07K0j4r5J1L2
2529HJ13J94k86PJ40k96jJ53j07K25m9j65k22L80k85L8M08m33j2J33k1j45K54
2552C1K09l75J00j08j24mO29l85P0J3Mk6K28J9l13J79L4m4j70L5K27j47R6O9l91
2577a44k16L09J50j53r7R0r6pO9pm9J40n6k79L47L62m13J90J97k85j62M81k94
2600G7j35K34J34m28K70n6K8l30O4L14k64K0n0j23J38j02J12L3O1J75l75L83J15
$$ plain form
2623 295 -170 -70 18 -162 -111 54 108 76 284 -146 -292 -55 -38 56 8 178 -163 37 -266 -68 -263 -163
2645 -163 -67 -214 53 -231 -240 -147 128 -93 -139 51 -150 -142 -93 172 118 -13 435 -37 270 -86 -135 -157 42 62
2669 62 25 -130 44 -52 -78 75 -22 -200 -377 42 -160 -113 -59 149 -71 -53 81 109 14 98 129 133 -166 3 102
2694 102 -101 100 8 42 96 168 -153 84 95 99 -245 -128 45 -47 -106 99 -17 -118 4 -330 -16 122 -17
2717 -17 -126 -77 82 -252 -108 -185 88 11 99 -74 115 -53 21 194 118 54 34 134 -27 -37 191 125 -72 -104
2741 -104 68 -6 -144 -68 -102 114 -233 65 237 -146 37 291 57 86 -38 -22 121 89 223 99 61 234
2763 234 90 74 97 73 60 40 134 -6 -138 -409 -118 248 -224 75 -78 -245 -10 -231 -296 209 -177 237
2785 237 37 -153 83 104 238 128 -64 96 86 55 150 -123 -143 -2 -74 -54 -94 -113 151 -188 -107 -286 61
$$ packed form
2623B95m65J00Q8j80N1J65N4l2K08m30j46K37J7R4m8J70l41K00l03J98j95J00
2645a63R6j47K67k84rR3K75k21m6J90k01QM9K65n4j31M48m72L07l56m9k2J99K0
2669F2l7j55J74r6k6J53r7j78j77M19k02M7N4K08k20J8J34K8r5Q4L1Mk99J69R9
2694A02k03K01r2L4N4P2l21K37J1Ml44J17J73r2n9K05j16j01J22l34L14J38j39
2717a7j09M9J59l34J44p7K73p7Q8j73J89j68P4J73p6o4k0J00j61j0K28o6j97l2
2741a04J72p4j38P6l4K16l47K98J72l83J83K54k34K9j24J6J43l2J34j24l8J73
2763B34j44j6K3k4j3k0R4j40j32k71K91L66m72K99j53j67K35k21o5N05l86M14
2785B37k00j90K36K1J34j10j92J60j0l1R5k73k0J41p2K0m0j9K64l39Q1j79L47
$$ plain form
2808 61 165 174 97 -324 -135 -85 84 37 -250 -82 54 -92 185 200 101 241 -6 163 -84 155 152 -85 -260
2831 -260 143 91 -138 18 113 -359 -165 -7 -264 -107 -233 32 -365 9 -231 -47 -134 153 -116 15 -60
2852 -60 229 200 213 99 -198 152 8 31 221 322 25 85 -139 -137 279 88 53 -64 -69 -148 10 51 -332 131
2876 131 299 -259 -43 9 117 -76 -50 87 225 3 -34 113 148 -79 -69 126 193 38 322 158 -220 -39
2898 -39 -83 -156 -338 -128 30 -42 -251 -79 -160 197 -106 51 -26 217 141 205 3 54 -85 2 -305 215 54
2921 54 146 -335 1 301 -121 107 -6 -78 -128 -258 25 -91 -66 19 -162 2 -242 -22 3 -196 -33 -71 -93
2944 -93 49 -39 23 48 -99 -58 85 -101 -20 145 -7 -9 217 -16 43 -19 27 101 -25 -214 194 -187 -141 -73 -75
2969 -75 -334 155 62 -351 -327 77 33 -283 40 154 -94 -148 122 -3 94 -104 138 -141 45 30 185 62
$$ packed form
2808F1J04Rp7m21J89N0J69m7k87J68J36j46K77J5r9J40k47J69k47K39lk37j75
2831b60M03n2k29J56R5m72J94J58k57J57j26K65l97L74k40J84q7K87k69J31p5
2852f0K89k9J3j14k97L50j44K3J90J01k97O0k24KM16j91l5j17np9J58M1l83M63
2876A31J68n58K16N2J08j93K6J37J38k22l7J47L5k27J0J95O7j55K84j64l78J81
2898c9m4p3j82K10J58p2k09J72q1L57l03J57p7K43p6O4k02N1j39Q7l07N20j61
2921E4R2m81L36L00m22K28j13p2n0j30K83j16K5Q5j81J64k44K20K5j99J63l8k2
2944i3J42q8O2K5j47M1J43j86Q1J65j52kK26k33N9o2M6P4j26j89M08l81M6O8k
2969g5k59M89r3m13K4M04m4l16L23J14k48n4K70j25R7j98K42k79J86j5J55j23
$$ plain form
2991 62 237 -163 161 160 -56 -124 7 -35 -326 -132 -55 -172 155 93 7 146 16 76 -68 110 -113 -63 83
3014 83 235 -211 -38 110 76 137 239 -80 -39 -90 -3 -417 -48 195 37 114 53 -57 -392 255 243 -285 -106
3037 -106 -134 -117 -177 168 109 -47 50 183 -166 182 150 -52 69 10 -95 72 249 48 138 153 209 226 -282 -25
3061 -25 -49 60 -35 -64 -212 -64 151 -127 -105 176 85 -211 110 -226 -122 -48 -86 102 -142 66 378 -105 177
3084 177 341 108 -174 -18 190 19 188 84 -30 -11 -105 -33 75 -12 26 -69 45 -138 -132 238 -8 -70 83
3107 83 -14 -116 -165 241 -145 -23 -150 -58 133 211 114 26 -64 21 189 -13 217 -58 -378 4 6 -59 -186 128
3131 128 137 -316 211 -123 -227 -45 112 152 56 31 -139 64 190 245 89 146 -14 -193 -39 123 -49 -196
3153 -196 308 -62 155 166 125 29 107 -110 -51 -109 -130 -157 -316 81 -39 -351 -202 351 -20 -192 -111 106 -13
$$ packed form
2991F2J75m00L24jk16o8J31m2k91J94P7j17L27o2q6J39j30O0j44J78k23N0J46
3014H3J52m46J73J48l4O1J02l19M1n1Q7m14L69K43j58P7o1j10l35O47j2n28J79
3037a06k8J7o0L45n9j56R7J33l49L48l2k02J21n9j05J67J77k01R0J5N6J7n08K57
3061b5k4J09r5k9j48J48K15k78K2K81r1k96L21l36J04P4l8J88k44K08L12m83K82
3084A77J64k33k82J56K08j71J69j04j14J9r4P2J08q7L8r5J14j83OL70k46o2J53
3107H3r7j02m9M06l86J22j27R2J91P8r7q8r0Q5J68k02K30k75l20L82Ko5j27L14
3131A28Rm53N27l34j04J82J57M0r6k5j70K03J26N5j56N7j60j79J54J62j72j47
3153a96N04l70K17J1m1r6P8k17N9n8k1k7j59L97j20l12J49N53l71j72Q1K17j19
$$ plain form
3176 -13 48 98 102 56 235 36 -23 380 -15 -95 -321 261 -176 35 83 84 -95 -78 -45 20 51 -102 -127 -110 212 -132
3202 -132 -106 139 96 -130 259 -128 -2 178 13 -143 -65 204 172 -149 -145 191 116 53 144 -148 63 -54 -241
3225 -241 -138 45 95 -90 -12 6 -338 -133 -83 -117 -27 159 71 -107 238 198 9 -33 -60 -161 86 110 77 83 93
3250 93 32 -108 65 13 -96 -68 -20 10 -29 -152 58 91 -49 -12 -276 61 183 97 -37 -71 84 -158 91 -209
3274 -209 7 162 -107 -147 64 -4 49 -105 21 280 211 -118 66 -32 -81 -10 -5 146 -15 -75 -118 -78 -161 -49
3298 -49 96 -67 91 10 -50 -37 304 337 49 66 100 -2 82 9 -151 62 42 39 233 94 21 35 13 -177 -109
3323 -109 -135 -52 202 31 20 -36 -43 187 -213 -177 196 14 -182 -115 -44 -2 257 214 -171 85 221 -150 132 32
3347 32 -67 155 21 -20 -44 -74 24 -157 32 -290 -298 -36 56 -79 192 -62 -318 -25 128 156 -212 -33 118
$$ packed form
3176a3O1N0Mm6J79j99n9M03l95q0k26N82m37K11M8Jj79J7L3O5L1j53k5J7L22l44
3202a32K6K45m3k26L89l87J26J80j65j56P8K69l2l21ML36p5o3R1k92K11j17j87
3225b41J03J83N0j85P8J8l44K05N0l4R0J86q8j78L45m0j89m2k7j01K47K4l3OJ0
3250I3o1j40J73n2j09K8M8L0l9j23K10L3j40L7k64L37J22q6j34l4J55k42K49l00
3274b09K16J55k69m0K11o8N3j54J26K59o9l29J84r8m9P1NJ51j61o0m3M0q3J12
3298d9J45j63J58q1o0J3L41L3k88J7L4j02Q4p3j60K13k0lJ94j39p3J4k2j90O8
3323a09k6Q3K54j71j1n6pK30m00L6L73j82j96O7P1M2K59m3l85K56J36l71K82j00
3347C2r9K22j34m1k4l0R8j81J89l22qK62R2j35K71k54k56K93J53K8l68J79J51
$$ plain form
3370 118 130 63 -100 -84 130 193 -128 47 -65 215 28 -53 -17 228 45 105 -207 -48 -23 -48 -61 -12 -30 79
3394 79 -64 -128 -147 42 -76 172 -134 -5 148 217 -66 32 239 80 -52 135 28 96 11 102 259 11 149
3417 149 340 102 -143 -110 -7 201 -67 -138 149 68 196 -47 -150 -12 100 63 -140 24 -85 182 -39
3438 -39 264 119 125 -359 -149 82 36 -122 -78 -157 -100 -107 97 -360 24 -105 -23 -149 -155 -40 -192 -8 192 -32
3462 -32 8 5 -184 -33 32 -126 -210 36 126 38 63 43 42 -119 -127 23 19 204 -135 -35 190 -103 -167 153 -88 -263
3488 -263 0 197 274 -79 -125 334 -106 35 142 -191 -99 -77 159 -93 222 95 79 116 269 151 130 386
3510 386 22 -155 -106 -55 -140 67 152 -242 -282 337 -151 -128 -237 -68 140 6 -140 -135 19 156 149 85 62 -3
3534 -3 -213 -190 211 178 -17 184 197 434 -61 76 121 -25 -104 -12 64 167 -284 -108 125 -35 -57 25 223 -276
$$ packed form
3370A18J2o7j63J6K14O3l21J75j12K80j87q1L6K45j83O0l12J59K5k5j3M9j8J09
3394G9j43o4j9J89j18K48l06J29J53O9k83R8K07j59j32J87j07O8q5R1J57k48J38
3417A49J91k38k45L3J03K08k68p1K87q1J28k43j03J38J12l7k03J64j09K67k21
3438c9L03j45Om84K10K31m6j58M4p9N7pK04m57L84j29Q2j26oJ15j52J84K00k24
3462c2M0lj89J51O5j58q4K46R0q8K5k0jj61qJ50mJ85l39J00K25k93o4L20k41j75
3488b63K63J97P7l53m6M59m40J41J07l33R2K2K36k52L15j27j6L7J53j18k1K56
3510C86l64j77M9N1q5K07Q5l94m0O19m88K3j09J69K08j34j46NJ54J37po4k3o5
3534ck10K3M01l3j95K01J3K37m95J37M5j46p9R2P6J03m51J76K33j60k2Q2J98m99
$$ plain form
3558 -276 -36 20 8 -257 92 54 87 37 46 -93 -137 177 -76 -283 -13 -83 83 46 263 -107 -32 -7 94 -132
3582 -132 -57 -188 -235 -301 30 -38 -156 12 154 176 77 92 -54 -53 -38 -131 174 86 13 -122 -21 35 -4 -18 127
3607 127 28 -26 162 90 -27 9 -117 -222 -96 62 67 -84 -16 -166 63 -86 101 28 213 296 -113 -185 164
3630 164 15 -213 233 379 -205 174 -167 153 -8 157 -85 72 179 -47 96 187 -144 -147 242 -20 47
3651 47 97 218 97 -67 14 121 -24 49 -28 -46 -32 236 -2 -94 137 -196 -241 298 -203 167 143 61 147 78
3675 78 173 -155 -103 136 -44 -206 96 8 -137 29 215 104 69 -4 202 -24 -57 -83 235 42 -131 -53 -170
3698 -170 114 -12 33 10 257 304 -242 5 29 77 -2 113 169 119 -13 -107 14 94 -316 28 134 136 -18 -20 150
3723 150 -326 -44 293 -45 160 5 -184 166 -42 -66 -51 -227 161 6 -128 22 160 -181 76 -126 13
$$ packed form
3558b76K40N6j2k65L49l8L3n0Rj39m4L14k53k07K70p0J66l7K17l70P5K5J01k26
3582a32P5j31m7o6L31o8j18J68J42K2r9J5j46JJ5r3L05q8p3j35J01N6l9j4J45
3607A27r9n4J88p2j17L6j26j05J26J58Nj51O8j50K29j49J87p3J85Q3m09p2L49
3630A64j49k28M46J46n84L79l41L20j61J65k42J57J07k26J43R1l31lL89k62O7
3651D7N0J21j21j64Q1J07j45P3p7j8J4K68k38r2K31l33m5N39n01L70k4q2Q6o9
3675G8R5l28N2K39j80j62L02q8j45J66J86j11l5p3K06k26l3k6L18j93j73P8j17
3698a70K84j26M5k3K47M7n46K47K4M8p9J15N6n0j32r4J21Q0m10L44J06Kj54kJ70
3723A50m76K82L37l38K05j55j89L50k08k4J5j76L88j55j34J50J38l41K57k02J39
$$ plain form
3744 13 4 -66 -159 -32 -62 43 -96 -135 -145 -9 103 -86 288 131 27 46 300 208 -163 1 97 291 56 1
3768 1 -28 38 138 0 208 -19 20 -12 -330 -13 -287 -99 -7 34 5 130 -5 28 488 123 -9 -196 179
3791 179 9 -62 -15 31 -2 151 74 46 92 -31 -136 61 177 -26 -251 100 -53 120 187 -88 -65 -247 -195
3814 -195 59 -76 37 0 -104 94 -15 -8 -266 -54 -174 -55 87 -33 96 -91 -11 222 27 134 -206
3835 -206 108 -77 -174 164 -155 -180 50 53 -26 -148 61 -336 24 -35 -42 121 40 87 -12 -71 9 2 77 222 -155
3860 -155 -76 -418 -107 -130 -174 -177 81 -117 193 211 257 44 -66 0 452 -178 -121 -84 -126 -79 -48 -229 103 236
3884 236 -76 122 29 200 148 -12 68 43 -152 43 76 0 -256 -35 -152 130 25 -105 -347 15 131 -186
3906 -186 -13 2 -155 25 -85 -279 -38 25 179 -178 35 -21 33 50 -89 113 192 -20 213 -159 -285 -255
$$ packed form
3744A3rp0r3J27l0J05j39l9j0J36J12j89L74j57j04J9K54r2l71J64R6J94k35n5
3768Ak9O6J00j38K08k27L9l2l18L17k74J88R2M1k9J25j35L3M60l65j32j87L75
3791A79j70p1M7M6l3J53p7k8M6j23j05J97J16k03k25L51j53J73O7k75K3j82N2
3814a95K54j35J13l7j04J98j09Pk58K12j20J19J42j20J29j87Q0K33j95J07l40
3835b06L14j85r7L38l19k5K30Lp9j22K09l97L60n9pJ63q1M7r9n9Q0pP5J45l77
3860a55P9l42L11k3m4lK58j98L10J8M6k13j10O6M52o30N7L7m2M7L1j81L32J33
3884B36l12J98r3J71n2j60Q0k5j95J95L3p6k56K21j17K82j05j30k42L62J16l17
3906a86J73J5j57J80j10j94K41O3J54l57K13n6N4J7j39K02P9k12K33l72j26L0
$$ plain form
3928 -255 -15 79 -62 73 -68 -48 -41 92 201 39 -100 158 -4 -21 74 -90 159 -210 20 -113 274 50
3950 50 60 -28 147 -66 28 237 -299 208 99 -43 101 174 -59 191 81 -102 -208 -42 -32 23 95 -247 62
3973 62 12 -23 -7 91 -181 -170 -157 168 67 168 13 82 149 134 151 -155 38 132 -92 2 43 140 -89 -6 111
3998 111 8 1 34 -117 -51 -129 -15 -11 -151 -85 -17 46 237 -40 113 -158 -75 1 -42 -116 165 -2 289 172 15
4023 15 -135 116 171 98 -30 -166 68 -15 195 35 -18 -47 -180 -150 -74 -192 -296 -8 -23 -141 -52 75 12 -23
4047 -23 -5 -1 21 224 -229 87 -94 -1 -97 199 -6 72 150 -62 61 -39 114 -14 139 -153 -27 -19 108 -343
4071 -343 108 -185 171 -47 -20 -53 -66 72 -125 21 -107 -63 -40 -61 3 -60 -29 -38 -138 177 189 -188 -133 103
4095 103 279 61 104 -91 -27 -473 66 8 -167 155 -84 -148 176 101 -83 -194 124 -9 -135 21 79 -2
$$ packed form
3928b55K40R4j41J35j41K0PJ33J09j62j39K58j62j7R5j64K49l69K30j33L87k24
3950E0J0q8J75k13R4K09n36N07j09j42J44P3k33K50j10j83j06J66J0N5P2l42L09
3973F2n0l5J6R8k72J1J3L25j01J01j55O9O7j5J7l06J93R4k24R4M1R7k29Q3J17
3998A11j03pL3j51O6p8J14Mj40O6O8O3J91k77J53k71Q3P6m3p4K81j67K91j17j57
4023A5j50K51N5p3j28j36K34q3K10j60n3k9j33L0P6j18j04K88j5j18Q9J27o3l5
4047b3J8MK2K03m53L16j81R3r6K96k05P8P8k12J23j00J53j28J53k92J26QJ27m51
4071c43M51k93L56k18K7l3j3J38j97J46j28M4K3k1O4o3L1rj00L15J2l77N5K36
4095A03J76k18M3j95O4m46N39n8j75L22k39o4L24p5j84j11L18j33j26J56N8q1
$$ plain form
4117 -2 -122 32 -101 154 48 177 -96 76 15 -201 62 -94 -82 -230 -106 -91 44 -120 -84 -5 -140 -64 -57
4140 -57 -34 201 197 50 -137 69 2 52 34 -145 62 -109 58 19 -154 -32 40 207 -4 59 22 38 102 -94
4164 -94 -227 -173 -133 212 -6 36 -130 -115 -118 -24 -95 -91 121 -81 -191 133 106 -27 13 96 -21 -158 52 -35 -60
4189 -60 -73 33 -162 57 7 38 -2 27 -94 -36 -47 -40 -86 -111 58 -64 -66 100 -9 -101 104 -235 -53 -45 -276 1
4215 1 -86 81 213 145 -43 58 72 130 -196 -60 -46 -41 -187 217 -52 -146 -75 -28 78 -18 186 52 177 25
4239 25 65 100 -128 198 170 193 77 283 -17 -258 -95 -186 -36 22 24 196 111 -67 -72 136 49 117 79 -134 -125 12
4265 12 -45 107 -72 -38 98 -255 148 -12 -81 92 48 -195 -76 13 -249 -117 -48 -19 -29 -125 27 -21 -231 123
4289 123 66 -124 -80 -184 -168 133 -135 163 -31 -177 92 -25 155 -96 94 -103 -92 56 -301 19 90 82
$$ packed form
4117bj20J54j33K55j06J29k73J72o1k16K63j56J2j48J24J5J35j64L6P9j35P6P
4140e7K3K35mj47j87K06o7N0j8j79K07j71J67l9j73J22P2J67k11O3l7J6O4j96
4164i4j33N4M0L45k18M2j66J5lR4p1MK12k02j10L24k7j33M0Q3j17j37K10q7k5
4189f0j3J06j95K19n0L1m0K9j21N8j1Pm6k5J69j22kJ66j09r2K05l39J82Qk31K77
4215Aq7J67J32o8j88J01J4N8l26J36J4Nj46M04k69r4P1M7J06r6K04j34J25j52
4239B5M0L5k28L26k8K3j16K06l00k41J63r1J50N8KJ72q5j78nK08q7O8l8k13RJ37
4265A2n7J52j79L4J36l53M03j60o9J73m4k43J19Q9k62J32O9K9j0r6J52m8k10L54
4289A23n7j90M4j04J6L01k68K98j94j46K69j17J80k51J90j97J1J48l57L20P1q
$$ plain form
4311 82 140 263 115 97 52 -90 -6 -12 -30 66 -4 169 54 -211 -328 -185 -147 63 229 -77 -138 -24 -85 -129 24
4336 24 116 -286 86 -71 68 -246 133 87 -79 -38 128 -145 98 44 -36 -2 -82 115 -129 -65 -66 100 -71 61
4360 61 -68 167 51 -148 -55 -40 -155 -178 119 290 -107 343 -9 -19 -143 -47 -68 -147 -78 -2 133 -117 -52 4
4384 4 117 52 146 -129 81 -115 179 211 -79 102 -59 2 99 -21 16 55 179 197 -1 243 257 -336 -96 -255
4408 -255 -116 38 76 166 -236 -157 -139 -27 58 -82 -97 175 -161 -296 -579 -159 273 27 -229 -164 -38 -199
4430 -199 -42 207 -96 -39 -11 137 -1 -112 -103 155 -28 166 3 -111 1 23 292 -128 -151 108 91 -243
4452 -243 29 101 -325 -90 63 -69 162 -75 -57 90 18 -123 183 -58 -27 -72 40 134 -56 97 -105 166
4474 166 -147 33 28 -10 -242 83 98 22 332 -124 -73 51 -85 -140 40 -145 120 82 -275 144 -41 -134 66
$$ packed form
4311H2N8J23j48j8m5j42Q4oj8R6p0J73j15k65j17J43L8K10J66l06o1J14o1m4J53
4336B4R2m02L72j57J39l14L79m6j66M1J66k73K43n4q0L4q0J97k44O4jJ66j71J32
4360F1j29K35j16j99R3J5j15k3K97J71l97M50l52j0j24R6k1p9O9P6J35k50O5N6
4384DJ13o5R4k75K10j96K94L2k90J81j61O1R7j20L7L9J24J8j98K44J4n93K40j59
4408b55J39J54L8R0m02P9J8J12Q5j40j5K72l36j35k83M20M32k46k56O5J26j61
4430a99J57K49l03N7K8J48j38j11RK58j83J94j63j14J12K2K69m20k3K59j7l34
4452b43K72P2m26K35J53j32K31k37J8J47p2j41L06k41L1m5J12R4j90J53k02K71
4474A66l13J80nl8k32L25J5p6L10m56N1J24j36n5J80j85K65l8l57M19j85r3K00
$$ plain form
4497 66 -177 46 34 10 56 -52 -76 13 -181 -302 28 198 -20 165 104 -70 104 -124 -87 -5 87 84 98 -8
4521 -8 25 174 56 -91 -307 -59 -190 115 61 92 -42 161 -25 -107 201 -287 -70 -3 68 111 -45 111 -51
4544 -51 -61 124 78 -92 20 -37 -20 -101 296 -165 138 55 75 276 -22 125 102 -383 -153 45 286 118 202
4567 202 -19 -103 -31 80 118 -130 39 12 25 34 -147 271 105 -72 53 81 96 -21 17 120 -71 -55 -202 130
4591 130 197 -86 -210 -47 -261 26 -8 -62 170 -96 143 -71 308 -75 -213 -22 0 237 196 110 49 265
4613 265 -129 -296 73 100 45 -50 223 62 77 176 117 9 -106 -17 31 -38 -42 63 -59 -38 -121 -268 -16 -113 134
4638 134 -93 30 -155 173 -33 73 -69 -36 -130 224 96 -52 95 -82 121 61 -132 146 85 -29 -228
4659 -228 77 -27 -298 -10 383 -65 14 -43 -63 -62 -111 -52 -229 -311 90 259 -30 -3 45 0 -103 2 109 60
$$ packed form
4497F6k43K23j2k4M6j08k4Q9j94j21L30J70k18J85o1j74J74k28L7Q2R2lJ4j06
4521hL3J49j18j47k16K48j31L05n4L1j34K03j86q2L08m88K17O7P1M3j56J56j62
4544e1j0J85m6j70J12n7J7q1L97m61L03q3K0K01k98J47k3m85K30J98K41j68Q4
4567B02k21q4P2J11L8k48J69k7J3Rj81M18j66j77J25K8J5j17L8J03j91J6j47L32
4591A30O7k83j24J63k14K87l4n4K32k66K39k14L79l83j38J91K2K37m1q6o1K16
4613B65l94j67L69K7n5r5K73j61J5R9n9j08j15Q9M8o9mJ05j22K1q3j47K52r7K47
4638A34k27J23j85L28k06J06j42L3r4L54j28j48J47j77K03o0j93K78o1j14j99
4659b28L05j04k71K88L93m48P9n7k0Jm9N9j77q2M01J69k89K7M8m5j03J05J07m9
$$ plain form
4683 60 30 -142 26 40 -160 -112 73 45 -203 2 -122 69 -11 -7 -108 77 -153 -59 97 34 5 8 -29 -42 -138
4708 -138 -70 -63 73 64 -5 -254 13 -268 -80 -276 1 -205 88 -133 -41 16 -43 37 -269 137 -12 -164 139
4731 139 -65 -152 -352 180 5 -133 -98 -4 19 54 -281 -2 -150 -57 77 171 -14 69 153 -137 213 15 -365
4754 -365 109 -89 -196 -34 -62 -56 90 47 -200 -195 0 156 39 -83 133 369 -192 253 -28 277 186 -90
4776 -90 -60 111 -114 -30 119 192 -66 23 86 133 -42 -42 -2 126 1 -161 220 -81 267 -36 -53 -132 227 -72
4800 -72 95 -35 -29 -54 173 183 -27 117 -30 -139 207 354 -202 -3 148 210 -55 72 -122 45 10 202
4822 202 -235 -168 145 91 54 -168 -19 236 -87 16 -51 92 -282 -174 -73 -238 206 -46 159 104 68 -113
4844 -113 422 162 79 68 73 84 -47 72 -17 -166 -39 -47 -105 -104 -71 329 -100 149 -90 163 53 -83 10 189
$$ packed form
4683F0l0j72J68J4k00M8J85k8k48K05j24J91q0Mj01J85k30R4J56o3k9Ll7j3r6
4708a38O8PJ36ro9k49K67k81J88j96K77k06K93k21R2N7n9Q0l06M06j49j52L03
4731A39k04q7k00N32j75j38L5R4K3L5l35K79j48R3J34R4j85Q3Q4k90L50j98l80
4754c65M74j98j07J62k8OJ46m3k47NJ95J56j17j22K16K36n61M45k81L05r1k76
4776i0L0J71k25Q4J49P3k58Q9O3M7j75%M0J28j25j62L81l01L48l03j7p9L59k99
4800g2J67j30Ok5K27J0k10J44j47j09L46J47n56J99J51O2k65J27j94J67l5J92
4822B02m37O7L13n4l7k22J49K55l23J03o7J43l74J08J01j65M44k52K05n5l6j81
4844a13N35k60q3j1NJ1j31J19q9j49J27qn8JL3M00m29K49k39K53j10j36R3J79
$$ plain form
4868 189 -449 223 23 -169 -260 -88 -109 -6 160 216 -167 163 -266 34 16 28 34 -92 -117 -165 214 0 213
4891 213 -77 -44 109 -42 77 95 -192 -83 -162 -154 87 218 30 -194 -41 258 -147 24 225 -26 174 -224
4913 -224 -14 35 20 -49 -22 190 -33 -24 -79 241 -162 -18 -52 -60 47 -21 237 33 183 -33 -173 4 -12 103
4937 103 174 -70 252 -155 -111 -11 211 -195 -105 -120 36 -60 25 -30 224 -7 34 36 -111 112 -100 74 40 -84
4961 -84 -158 -74 160 -52 108 -143 52 63 -70 -7 210 211 -60 193 -131 -4 116 256 158 114 172 -25 -80 -279
4985 -279 60 -281 -86 151 238 164 83 100 124 -137 -20 -22 -179 -196 15 195 170 -24 69 -201 -73 -108 -74 -76 109
5010 109 -138 -215 166 -71 -160 -186 29 -118 307 30 -209 16 299 135 134 186 57 85 313 22 62 -201 -110
5033 -110 1 85 46 245 -61 167 15 217 -174 -82 173 -72 -70 189 -229 164 -24 109 3 -33 300 27
$$ packed form
4868A89o38O72k00j92r1J72k1J03J66N6l83L30m29L00j8J2Oj26k5m8L79k14K13
4891B13k90L3J53j51J19J8k87J09p9QK41J31j88k24J53K99m05J71K01k51K00l98
4913b24K10M9j5o9K7K12k23Rn5L20m03J44l4qJ07o8K58k04J50k16j40J77j6J15
4937A03P1k44L22m07M4J00K22m06R0j5J56r6Q5n5K54k31M1Kj47K23k12J74l4j24
4961h4p4Q4K34k12J60k51J95J1j33O3K17Jk71K53l24J27J20J40r8m4N8j97n5j99
4985b79L39l41J95K37Q7p4q1J7K4k61J17kj57j7K11J80k5j94R3k70J28l5L4kJ85
5010A09k47p7L81k37q9k6K15j47M25k77k39K25K83j64jN2j29K8K28k91M0k63R1
5033a10J11Q4l9J99l06K28j52K02l91R2K55k45KK59m18L93j88J33j06l6L33k73
$$ plain form
5055 27 94 -113 -28 5 26 63 25 235 -118 88 -109 161 98 75 64 153 -58 174 18 -82 -213 19 -85 -99
5079 -99 37 84 111 -144 247 -150 44 -101 211 44 -95 40 131 -17 7 -99 274 7 199 50 99 71
5101 71 110 80 -50 -318 92 -35 -30 -85 -54 -23 -217 -222 120 94 103 -228 -177 30 -36 43 -18 -289 -189 186 127 50
5127 50 -127 70 -35 187 -332 132 -82 277 -123 209 -1 60 124 -261 141 -46 48 73 -211 -30 66 -323
5149 -323 141 125 178 92 142 -86 262 -49 -211 -93 50 118 176 35 -97 -13 -133 32 -85 -246 231 86
5171 86 50 56 -22 31 101 158 -195 -189 -20 -59 11 -27 174 120 210 104 -257 -174 -26 -189 -190 -78 154 439 28 -25
5197 -25 -15 -22 -132 121 3 -7 -25 -33 60 87 -235 126 104 99 -60 -47 69 -12 -9 -24 38 128 -220 -10 -83 152 69
5224 69 -1 192 126 -108 8 35 -197 -68 -91 -100 120 -101 -131 -179 106 1 53 31 -70 87 -200 -253 -39 61
$$ packed form
5055B7O7k07Q5L3K1L7l8K10l53K06j97K70o3k3j1Q9k11K32j56j00j31K32j04j4
5079i9J36M7K7k55L91l97J94j45L12j67j39J35R1j48K4j06L73k67J92j49M9k8
5101G1L9l0j30k68M10j27Nn5L1L1j94nL42k6Rl31N1K07o6P9o1k71J00L75n9p7
5127E0j77J97j05K22n19M64k14L59m00L32k10O1O4l85M02j87R4K5k84J81R6l89
5149c23M64j6N3q6N0k28L48l11j62J18J43O8N8j41j32Q4j20J65j17j61M77j45
5171H6l6Op8N3P0N7l53OJ69l9P0l8K01n4R0j06l61Q3J48j63jJ12K32K85m11n3
5197b5J0pj10K53j18j0j8qR3K7l22L61k2nj59J3J16q1Lj5O2R0l48K10p3K35q3
5224F9p0J93o6k34J16K7k32J29k3rK20k21l0m8K85j05N2k2j01J57k87n3K14J00
$$ plain form
5248 61 176 239 -149 17 -39 234 -109 -224 290 -4 14 115 -80 -169 124 -41 66 101 32 -38 -263 121 -175
5271 -175 -100 270 229 108 11 24 107 -147 43 81 -55 -232 31 201 -3 -6 72 -33 -109 25 66 218 22 113
5295 113 96 107 209 -69 -95 67 -107 -133 47 59 90 115 183 -165 199 -29 -139 -137 -163 179 -332 -158 -101 204
5319 204 304 -65 39 -14 76 74 -112 50 227 -198 -67 1 -160 -168 164 -233 -91 94 79 40 -88 -89 84 -289
5343 -289 -166 -182 -116 -41 -182 -114 256 236 -158 131 -78 -74 -100 -5 64 -25 -207 42 -141 -29 -113 26 128 -97
5367 -97 125 0 -52 -83 -130 103 282 -133 76 -138 -35 -304 -113 -165 26 -58 128 -113 -202 -41 87 54 -57
5390 -57 88 -6 192 -277 127 -78 -63 -65 115 -209 6 -26 -16 -184 -127 2 -77 85 -34 -396 -180 22 192
5413 192 -264 -90 100 201 -10 7 59 -86 88 105 13 40 -5 -35 -18 -232 -21 -170 187 12 195 116 43
$$ packed form
5248F1J15O3l88J66n6K73l43j15N14k94J8J01j95q9K93j65J07L5o9p0k25L84k96
5271a75P5L70m1j21r7J3Q3k54J90L8j36j77K63J70k04lP8j05p6J34M1J52j96R1
5295A13j7J1J02k78k6J62j74k6J80J2L1K5O8l48L64k28j10Kk6L42n11J74N7L05
5319B04J00l69J04n3R0kj86J62J77m25J31O8j61qL32l97J42J85j5l9j28jJ73l73
5343b89J23j6O6P5j41O8L70k0l94K89k09Mk6R5O9q9j82K49j83J12q4J39J02k25
5367i7K22j25n2l1m7K33J79m15K09k14J03k69J91n2J91q4J86k41q9J61J28l3j11
5390e7J45r4J98m69M04k05J5kJ80l24K15l2J0j68N7J29p9J62j19l62K16K02J70
5413A92m56J74J90J01k11J7N2j45J74J7r2K7m5l0J7k14K11j49L57j75J83p9p3
$$ plain form
5436 43 236 1 5 83 -141 142 11 181 -17 -28 -47 -188 20 -8 -103 299 72 78 -61 -11 88 87 -142 -51 -55 65
5462 65 157 -275 9 -18 -38 135 106 75 234 -10 -177 -9 -236 13 96 -198 -157 384 83 6 -58 -21 329 4
5486 4 23 -35 -157 74 -79 152 -30 187 15 175 -92 119 21 -161 -52 86 -174 -75 57 -154 -147 241 26
5509 26 -198 -176 -97 -33 -77 -187 22 -171 69 165 86 106 30 61 -268 -100 289 34 -146 -56 -6 -18 -286 4
5533 4 -114 -92 188 -119 -154 -121 275 -40 213 -78 -108 102 348 -59 -129 -98 126 35 -14 -39 13 161 93 246
5557 246 -140 18 173 47 -418 37 107 -43 105 132 -195 188 -332 196 9 91 -152 -242 -1 -105 237
5578 237 -148 175 26 7 8 -41 99 181 -24 143 -89 -15 -50 200 128 -61 269 -104 -77 149 34 76 -64
5601 -64 89 96 -113 -58 -172 -65 -302 -21 170 -171 -30 41 -328 54 35 -170 117 400 165 -48 106 248
$$ packed form
5436D3J93k35MP8k24K83j31J70j98j1j9j41K08k8r5M02k27Oj39N0R9jk29R1mJ20
5462F5R2m32K84k7k0J73k9l1J59k44j67J68k27K49Q3k94M1N41l01p7o4L7L50l25
5486DJ9n8j22K31j53K31j82K17j72J60k67K11r8j82J09J38k60R9J32k11PL88k15
5509B6k24K2P9O4m4j10K09j93K40R6p9K0p6L1l29J68L89k55j80R0N0j2k68K90
5533Dj18K2K80l07l5L3L96l15K53k91l0K10K46m07p0L1K24r1m9k5N2J48o8J53
5557B46l86J58J55j26m65M55P0j50J48K7l27L83n20N28j87Q2k43r0K41j04L42
5578B37l85L23j49j9Jm9J40Q2k05J67k32P4l5K50p2j89L30l73K7K26j15M2j40
5601f4J53Pk09N5j14J07k37K81J91l41J41P1l69L82j9k05K87K83k35k13J54J42
$$ plain form
5623 248 29 -92 11 96 -36 -176 -134 10 75 -81 201 -130 -237 -240 2 36 118 -119 116 70 -31 47 123
5646 123 -2 -86 81 -258 -39 -218 -16 -22 59 -118 -132 98 -38 31 80 -31 -186 9 -112 65 101 44 -135
5669 -135 12 109 72 -194 63 155 92 103 84 -53 -134 58 -19 191 75 -196 -249 71 121 9 153 180 77 162
5693 162 -107 -211 57 -176 36 -51 69 -330 89 67 17 -9 12 -68 7 66 326 73 145 264 -23 99 45
5716 45 76 64 26 70 -13 -14 -102 -141 102 -143 282 -41 -149 54 28 -154 186 39 -89 98 133 -62 84 54
5740 54 -275 -33 140 86 90 -132 36 206 -125 140 131 -119 -103 -68 -179 -249 130 -75 29 -82 117 -134 -179
5763 -179 -75 9 -201 -294 -291 89 -6 -38 -60 83 3 116 -73 161 -26 8 -30 72 -126 80 71 -106 -173 107
5787 107 66 -188 -64 -36 -25 49 -24 60 87 230 -325 144 41 157 89 358 20 19 -21 -34 -231 89 -89 -48
$$ packed form
5623B48k19j21J03Q5j32j40M2J44O5j56K82l31j07lK42L4Q2k37K35m6j01P8P6
5646A23j25q4J67l39K19j79K02oQ1j77j4K30j36O9M9j11j55J95j21J77L6n7j79
5669a35J47R7l7k66K57R2o3J1j9j37q1J92p7K10j16k71n3L20N0j12J44K7j03Q5
5693A62k69j04K68k33K12q7J20l99M19k2n0k6K1q0P5N9K60k53P2J19k87J22n4
5716D5L1j2l8M4q3jq8l9K43k45M25l23j08K03k6j82L40j47j28J87L5j95J46l0
5740E4l29K42J73n4Mk22J68J70l31K65rk50J6L5j11p0L79k05J04j11J99k51m5
5763a79J04Q4k10r3LL80r5l2k2J43q0J13j89K34j87L4l8J02j98K06rj77o7K80
5787A07m1k54J24K8J1P4p3Q4K7J43n55M69j03J16o8K69l38jm0j3j97L20j78M1
$$ plain form
5811 -48 99 75 290 -111 55 -108 -24 100 170 65 -83 -5 125 -106 58 -138 188 148 26 -214 20 60
5833 60 -358 165 65 84 44 -77 -172 220 -77 82 195 7 108 35 -49 -18 15 167 -61 31 -42 7 31 -33
5857 -33 -124 -52 76 284 -144 157 -62 -46 287 161 29 69 116 181 180 112 62 127 -55 20 -131 85 -145 -256
5881 -256 197 -108 -233 -155 -205 77 -9 192 153 8 90 -73 -45 48 183 156 -83 -355 103 94 92 0 7 262 80
5906 80 27 -55 -316 59 -60 53 -205 -117 108 12 -50 5 92 -147 -84 -84 -280 133 181 166 19 -140 125 192 -47
5931 -47 -161 64 -213 56 -117 -85 98 37 -116 218 99 286 -26 231 -71 -7 113 -88 347 15 127
5952 127 62 101 -52 15 241 -90 -82 191 -171 -155 11 8 -33 229 64 16 -37 70 -25 -117 11 -187 -44 97
5976 97 144 198 -121 -196 -16 23 -173 -3 -10 39 90 -16 -120 352 92 121 -22 4 -163 -187 -13 9 308 39
$$ packed form
5811d8J47k4K15m01J66j63Q4J24P0j05j48P8J30k31J64j96L26m0j22k40K34M0
5833F0m18N23j00J9m0j21r5L92k97J59J13j88J01p3q4L1L3J52k28R2p3M9K4o4
5857c3r1P2J28K08m28L01k19J6L33j26j32M0M7O5jo8n0O5j82P5j51K16k30j11
5881b56M53l05j25P8n0K82q6K01l9j45Q2j63K8R3J35k7k39k72M58rkr2PK55j82
5906H0n3q2k61L75j19J13k58Q8K25r6o2N5Q7k39O3%j96M13M8j5j47j59K65O7k39
5931d7j14K25k77K69j73L2J83o1j53L34j19J87l12K57l02O4J20k01M35l32J12
5952A27o5L9j53O7K26l31QK73l62J6J66lm1K62j65m8n3J07r5r2J28j98J43J41
5976I7M7N4l19p5J80L9j96J70pM9N1j06j04M72k60K9j43K6j67k4J74K2K99k69
$$ plain form
6000 39 183 -252 175 -296 174 -261 118 155 -153 247 137 -107 41 61 -2 16 -122 -64 63 -89 2 109
6022 109 -187 12 -72 48 -102 -32 -188 145 120 -66 5 65 -76 166 -31 -72 84 -113 1 -287 -187 -1
6044 -1 71 -82 -302 447 -266 -111 -2 50 178 97 143 -44 -51 73 13 -8 37 45 -249 -8 40 47 -33 -33 -113 48 98
6071 98 257 -154 -216 34 17 8 136 84 226 -14 13 52 40 292 -279 -2 -109 -103 -178 155 -176 68 -21 -83 143
6096 143 -50 -16 143 -10 171 -128 173 -37 131 -69 77 275 28 -214 -138 -157 59 219 -107 5 -215
6117 -215 11 -62 -114 -161 184 40 78 -251 -153 16 -16 144 189 220 148 -34 24 53 181 93 66 48 -189 -33 -98
6142 -98 -202 -44 -176 -223 -123 -213 230 102 -26 -128 -221 18 -257 129 -45 75 115 45 -114 35 -51 -9 78
6165 78 -32 -261 53 159 -199 -162 -103 -196 30 126 79 3 11 -228 -113 181 63 103 27 -1 50 115 -49 -90 -100
$$ packed form
6000C9J44m35M27m71M70m35L79L7l08M00j10k44J48K0o3J8j38N8J27j52R1J07
6022A09k96J99q4J20j50P0j56L33k5j86P1O0j41K42j97m1J56j97J14k88J00J86
6044aP2j53k20P49p13J55J09N2J28q1M6j87pJ24o0k1M5Qk94K41M8Pq0%q0J61N0
6071I8J59m11o2K50j7rJ28n2J42k40K7L9j2K52n71K77j07Op5L33l31K44q9o2K26
6096A43j93L4J59j53J81k99L01k10J68k00J46J98k47k42P6j9K16J60l26J12k20
6117b15K26p3n2m7L45j44L8l29R8J69l2J60M5L1p2j82N8K9J28q8k7j8k37J56o5
6142i8j04J58j32m7J00r0M43j28j28j02r3K39k75L86j74J20M0p0j59J49q6M2Q7
6165G8j10k29L14J06l58L7N9r3K26R6m7p6Qk39J15K94j18M0p6k8N1O5j64m1j0
$$ plain form
6190 -100 -152 41 97 51 146 -50 105 -80 -170 -41 38 -114 52 -140 -363 -97 39 -50 -56 -336 -112 -13 -128
6213 -128 -107 110 -176 -182 36 244 0 89 175 86 141 66 -59 106 156 -113 -116 -217 -105 74 137 -62 36 -60 38
6238 38 65 -20 -120 -21 31 128 36 31 -28 -48 -10 299 -83 36 65 -22 -67 25 53 -383 83 252 -149 -120 100 -199
6264 -199 -20 61 -158 151 -38 -170 94 -120 189 -91 106 -59 140 88 200 -11 189 155 94 87 159 -144
6286 -144 176 -85 41 -169 -71 -33 -42 -57 -70 278 -32 105 107 -144 384 215 80 8 107 156 184 200 -86 11 7
6311 7 33 69 1 320 26 -51 63 -67 -57 106 -155 102 -14 164 -58 -197 32 94 61 -187 122 -158 137
6334 137 -116 138 119 -88 -62 344 -40 21 -26 13 -119 -6 130 91 63 167 6 -79 107 109 86 24 -89 127
6358 127 -122 -111 -49 177 238 42 -183 3 77 187 25 -32 56 -27 47 116 39 192 72 200 -162 -80 45 23
$$ packed form
6190a00n2J93N6m6R5j96J55j85r0J29P9j52J66j92k23K66J36q9ok80K24R9j15
6213a28K1K17k86oK18K08k44Q9Q6q9N5p5j25J65N0k69lj01J12J79O3j99R8r6R8
6238C8K7q5j00R9N2R7r2nn9k0L8L09l82J19K9q7m5R2K8m36M66J69m01K9K20k99
6264a99J79Q1k19L09j89j32K64k14L09k80J97j65J99n2J12k11K00l4o1pP2l03
6286a44L20k61J26k10R8L8rj5j3L48l10J37Kk51N28j69j35p2R9M9K8J6k86R7m
6311GK6L6o8L19k94p7J14j30J0J63k61K57j16J78k22j39K29O2l3k48L09k80K95
6334A37k53K54j9k07K6M06l84O1m7L9j32J13J36l9k8J04j61q5J86Kk3o2j13K16
6358A27k49J1O2K26O1j96k25J86P4J10j62n7Q8q3P4O9p7J53j20J28l62Q2J25k2
$$ plain form
6382 23 -23 -97 -106 -124 225 3 -71 -32 -80 -20 -144 -2 -59 -58 -4 89 77 107 -120 -26 -77 -41 19 425 288 16 73
6409 73 20 -85 107 -42 -77 -81 -81 -221 52 349 -18 36 12 -171 -34 54 14 12 156 50 66 -76 284 -33 -17
6434 -17 -74 -303 35 -5 -124 217 -67 234 89 11 8 -187 79 -268 -338 -100 3 -42 370 23 -29 303 202
6457 202 129 -48 206 -64 -75 -94 289 -102 -101 -51 41 103 43 -79 70 -243 -178 143 -103 154 219 -228 -53 -135
6481 -135 32 -42 17 74 -74 -18 -37 -107 226 104 193 77 -222 -41 -46 -71 -180 -114 97 221 198 141 -124 -109 -238
6506 -238 -2 -51 42 57 -7 79 -179 219 148 80 -50 49 54 -10 144 -20 97 -62 -54 149 -54 88 79 207 -103
6531 -103 -36 69 185 -92 235 119 -141 0 72 109 38 -14 8 -80 -113 -3 63 149 -2 103 9 1 -24 22 65
6556 65 -69 -53 52 142 -5 203 -8 27 252 10 -157 -112 132 -152 -216 -57 153 -203 -69 127 18 -133
$$ packed form
6382B3m6p4rj8L49k22p4L9m8O0j24J42n7JN4R3j2L0k27R4n1L6O0M06j37k72N7
6409G3n3j05J92j49l5m%j40K73K97l67N4k4j83J37Q8m0kJ44j06J6j42L60l17J6
6434a7n7k29L38m0j19L41k84L01j45p8lj95K66l47p0K38J03m5M12l47n2L32j01
6457B02p3j77K54k70j1j9L83l91JN0R2O2o0j22J49l13O5L21k46K57O5m47J75q2
6481a35J67p4N9N7j48N6j9p0L33j22Q9j16k99J81nk5j09O6K11J24k3n7k65J5j29
6506b38K36m9R3J5o4Q6k58L98p1o8j30R9No4J54j64J17j59QK03k03J42rJ28l10
6531a03O7J05J16k77L27j16k60J41P2L7p1n2K2q8l3J10O6Q6j51J05r4qk5M6M3
6556F5j34J6J05R0j47K08k11L5K25k42j67M5K44k84o4J59K10l56J34J96j09j51
$$ plain form
6578 -133 35 -13 194 -14 108 -19 165 -106 85 135 118 86 -14 83 13 72 -36 166 -63 146 71 -51 199
6601 199 -104 46 -22 126 163 89 14 -59 -38 -97 -13 168 -106 55 -210 8 121 -5 9 -64 156 109 56 -62
6625 -62 113 90 23 44 -104 -64 -221 103 -13 319 -5 279 74 95 -213 -43 63 110 232 -43 42 77 -84
6648 -84 59 19 86 -55 -153 126 121 118 1 -101 104 -79 106 278 3 123 231 -104 154 -54 -212 -45 162
6671 162 276 145 -23 -117 -14 -95 -263 76 -122 -159 -117 -2 39 22 9 -28 150 -258 96 12 84 -125 -325
6694 -325 168 141 -56 90 -24 -206 -287 87 -13 -72 109 1 134 -127 109 -87 -28 20 -160 93 -105 -122
6716 -122 -52 -36 90 -140 12 91 46 -146 -110 -19 -85 10 68 -231 69 -61 1 123 134 -94 -193 -132 -73 -162 -208
6741 -208 12 -119 -130 148 90 -90 199 178 -16 -105 -242 -180 -44 272 126 0 164 -85 -56 -146 168 -200
$$ packed form
6578a33J68m8K07k08J22j27J84k71J91N0j7l2j00R7p0N9j08K02k29K09p5j22K50
6601A99l03J50o8J48L7p4p5p3K1n9Q4J81k74J61k65K18J13j26J4p3K20m7n3j18
6625f2J75k3o7K1j48M0j57L24j16L32l24K84k05K1l08J70J06M7J22k75Q5L5j61
6648h4J43m0O7j41r8K79nlj17j02K05j83J85J72k75J20J08l35K58k08j58J67K07
6671A62J14j31j68r4J03q1j68L39j98l7M2J15M1j7j3l7J78m08L54q4P2k09k00
6694c25M93k7j97J46j14j82q1L74j00n9J81j08J33k61K36j96N9M8j80K53j98j7
6716a22P0J6J26k30J52P9m5j92L6R1o6R5N8k99L00j30O2J22J1k28r9O1N9q9m6
6741b08K20j31j1K78n8j80K89k1j94q9j37O2J36L16j46j26J64k49K9r0L14l68
$$ plain form
6763 -200 153 -181 200 -7 50 148 -161 113 -224 11 -127 78 82 23 -132 41 230 -126 91 8 18 78 -31
6786 -31 100 14 -12 63 -23 -97 21 22 -83 -5 -189 73 -90 -242 35 -45 26 92 -95 -152 8 267 -240 65
6810 65 252 16 -27 -73 -52 29 -449 264 116 5 51 -158 -137 -265 -152 -10 -55 18 -24 221 62 -187 -228 -109
6834 -109 -232 -184 -123 159 -177 33 -172 -4 -140 -91 -127 -303 -98 -47 -114 -277 -126 -61 -123 -60 37 -92 -95 92
6858 92 165 184 107 276 107 104 281 94 -29 -113 -112 -219 81 -75 136 -22 -94 43 -239 -243 -18 -4 26 225 -16
6883 -16 218 91 95 -84 -40 -223 99 56 -41 -64 325 -33 144 99 232 -194 -88 -59 79 -115 15 101 74 -37
6907 -37 -99 27 -5 -188 15 136 -196 225 -3 120 -50 -223 12 -4 47 -106 -8 113 31 29 165 -131 -35
6930 -35 46 4 -58 -118 -66 180 66 -45 -266 165 97 -151 -3 61 -258 173 196 -104 -97 -67 -84 -174 -47 -149 -5
$$ packed form
6763b00L53l34L81k07N7R8l09K74l37K35j38K05Mn9j55J73J89l56K17q3J0O0j09
6786c1J31q6k6P5q6p4J18Jj05P8j84K62j63j52K77q0P1O6j87n7J60K59n07L05
6810F5J87k36m3m6K1Q1m78P13j48j11M6k09K1j28J13J42m5P3m2K45j59k49m1J19
6834a09j23M8O1K82l36K10k05J68j36M9l6j76K05N1o7j63J51O5o2O3R7j29lJ87
6858I2P3J9p7J69j69lJ77j87j23q4Jj07L00j56K11j58p2J37k82mK25J4L0J99k41
6883a6K34j27Mj79M4j83L22m3r7k3L89l58J77m5J33m26J06K9J38j94J30Q6k7j11
6907c7o2J26l2j83K03J21l32M21k28J23j70j73K35j6N1j53R8J21q2kJ36k96R6
6930c5Q1m2o2o0N2K46j14j11k21M31o8k48J48O4l19M31K3l00PL0j7r0J27j02J44
$$ plain form
6955 -5 -17 -89 -150 -68 -14 -18 -42 -66 23 -11 181 216 26 -195 -87 -376 -120 25 6 163 -144 -103 69 -14 67 -13
6981 -13 -112 254 352 98 110 -22 36 -28 -104 -114 16 115 121 41 45 -80 265 66 5 -89 19 -29 236 -78 -97 -87
7007 -87 -214 -108 -73 -23 4 -3 26 -52 34 -79 -82 -60 -44 126 126 310 -26 152 130 -51 22 -2 -133 92 -120 -159
7033 -159 -322 -42 13 101 -4 46 -184 -171 358 -30 139 -109 -243 105 -79 44 191 -209 17 72 -75 246
7055 246 121 119 314 46 -27 65 -244 140 5 8 108 -32 90 341 82 56 209 77 108 125 -28 -205 -4
7078 -4 -66 180 34 -6 -133 -108 8 54 -31 12 47 -17 -42 -84 -206 -90 22 -106 22 180 -211 -93 -87 176 -219
7103 -219 110 98 12 47 14 -7 68 78 -48 56 20 90 -127 197 57 -177 -105 -69 -206 0 -201 51 -97 -61
7127 -61 -98 91 -176 123 -7 -3 40 45 27 50 56 131 32 90 -295 -92 -126 -75 -64 132 -297 127 210 -119 58 -218
$$ packed form
6955ej2p2o1Q2N4mk4k4Q9l4J92L5j90k21J08k89K56J45j9J57l07M1J72q3Q1q0
6981a3r9L66R8k54J2j32N8o4p6j0J30R9Oq0Mj25L45j99o1r4J08m8K65l14j9J0
7007h7j27J06L5N0K7pK9p8Q6j13lK2J6J70%J84l36J78k2j81P3k4j31K25k12l9
7033a59j63K80N5Q8j05N0k30J3N29l88J69k48j34L48j84J23J47m00K26N5j47L21
7055B46j25kJ95k68p3R2l09L84j35LJ00j40J22K51k59k6J53j32L1J7j53j77K01
7078do2K46j46m0j27K5J16M6q5M3L5o4k5m2j22J16J12j28J28J58l91J18OK63l95
7103b19L29j2q6L5l3k1P5J0j26J04l6P0k17L24j40k34P2L6j37K06k01K52j48L6
7127f1l7J89k67K99j30MM3Nj8K3OP5r9N8l85K03l4N1J1J96m29M24Q3l29J77k76
$$ plain form
7153 -218 -134 103 -75 -182 -127 -343 -17 -188 -178 -146 -65 -72 -26 56 -20 -186 156 -133 50 288 -238 -290 174 -148
7177 -148 159 -373 -103 37 111 -55 -55 -204 -143 125 16 -32 -12 -191 -2 39 14 -150 100 4 -92 165 -49
7200 -49 55 94 51 -73 -31 -18 206 -127 -65 -51 82 -20 19 -14 189 -152 -197 107 -56 -201 218 -136 99
7223 99 32 262 62 95 151 -56 -93 45 -39 -140 60 50 -184 86 -24 -170 111 -257 177 70 166 -136 24
7246 24 -19 120 130 -38 -205 177 116 -218 197 127 -51 -129 -17 -161 -239 -29 -239 332 21 6 102 2 39
7269 39 -204 -97 -216 -176 32 163 -113 120 41 1 -47 212 96 -4 105 207 147 -4 114 -312 -48 104
7291 104 -174 -152 -14 -54 -52 87 199 87 -60 -24 -77 -74 -45 -86 81 -178 139 178 107 195 -37 33 72 -185 -82
7316 -82 238 83 263 -77 96 54 -112 96 29 97 8 -116 -82 69 200 -82 168 177 -134 -110 -24 -94 36 57
$$ packed form
7153b18Q4K37j78j07N5k16L26j71J0L2Q1pM6Q2p6j66L42k89J83K38n26n2M64l22
7177a48L07n32K70J40P4j66%j49O1K68j09m8K0j79J89M1k5j64K50r6r6K57k14
7200d9J04L9m3j24M2J3K24l33O2J4J33j02L9l3K03l41m5L04j63j45M19l54K35
7223I9o7K30k00L3N6k07l7J38q4j01K00j0k34K70j10j46K81l68M34j07R6l02J60
7246B4m3J39J0j68j67L82o1l34M15p0j78p8J12j44p8K10k10N71l11j5R6j00L7
7269C9k43J07j19M0K08J31k76K33p9m0m8K59j16j00J09J02o0j51J18m26K64J52
7291A04k78K2J38m0KJ39J12j12j47L6n3LK9m1J67k59L17L9p1Q8k32P0L9k57J03
7316h2L20j55J80l40J73m2j66K08o7O8q9j24L4J51J31k82K50Rl11K4Q6p0J30K1
$$ plain form
7340 57 -24 -72 -49 -121 130 9 -30 -307 103 67 150 109 -140 -13 8 92 -36 -193 -58 22 209 45 -237 -123
7364 -123 43 -54 -176 22 -125 12 -99 124 -127 33 56 -149 -117 72 212 -50 28 -23 -19 1 -59 -78 299
7387 299 -59 -226 203 78 -7 -56 112 49 6 -102 224 112 -216 -78 -42 86 10 147 -270 212 -82 -70
7409 -70 39 103 22 230 -16 34 19 3 88 165 -184 237 96 94 184 62 207 -233 179 -35 61 -59 17 83 -194
7434 -194 -41 -268 -56 4 231 -262 59 40 -59 46 -28 90 46 -123 -90 -117 -3 -200 -172 -26 255 33 -23
7457 -23 159 -4 -141 39 33 186 -195 -99 64 -82 -93 97 88 -241 70 -64 149 29 88 48 -145 -301 60
7480 60 39 71 -35 -52 72 -23 -5 32 69 32 131 55 -26 99 -98 210 -191 -125 -108 132 -216 46 -94 -108 101
7505 101 41 31 110 -198 -81 214 34 49 -112 292 -116 81 15 -38 -53 14 -320 17 58 -135 -8 -201 14
$$ packed form
7340E7q1m8K3p2K51j21l9k77M10l6Q3m1k49J27K1Q4j28j57J35Q0J87j64k82J14
7364a23J66r7j22J98j47J37j11K23k51J60K3k05L2J89J40k62P8n1MK0o0j9L77
7387B99l58j67M29j25q5m9J68o3m3j08L26j12l28J38L6J28p6J37m17M82k94J2
7409g0J09O4q1K08k46N0j5j6Q5P7l49M21j41kR0j22J45m40M12k14R6j20P6O6k77
7434a94J53k27K12O0K27m93L21j9r9J05p4J18m4j69L3k7J14j97K8J46K81k22n6
7457b3J82j63j37J80oJ53l81R6J63j46j1J90rl29L11j34K13j20N9m0j93j56L61
7480F0k1L2j06j7J24r5J8L7L7l7R9p6q1J25j97L08m01O6J7K40l48K62j40j4K09
7505A01o0j0P9l08J17K95j80J5j61M04m08J97o6n3j5O7l34L37M1j93J27j93K15
$$ plain form
7528 14 243 -39 -53 114 28 -40 208 24 -263 142 165 -31 108 -52 -142 154 165 -46 -182 -45 76 88 -168
7551 -168 119 114 -96 -31 -174 -39 -361 61 -93 110 87 -75 178 71 168 1 -129 -1 -21 33 -140 -35
7573 -35 180 -120 205 -59 42 145 69 -51 -101 315 -93 -89 -23 -107 -103 205 -64 163 100 264 34 95 53 -11
7597 -11 45 72 40 -31 -87 -6 141 -34 -94 -56 108 -117 44 200 -31 -207 99 -201 204 -253 -136 55 11
7620 11 56 177 167 -96 275 134 -95 -74 120 -4 37 170 -77 -34 139 -11 276 -85 -56 -204 49 -85
7642 -85 102 -38 40 183 96 23 75 -43 66 -324 45 154 33 309 30 -4 -16 39 -3 26 62 130 282 63
7666 63 -78 14 -37 40 -113 -93 -16 7 -5 4 -149 16 -2 17 -98 227 -114 -11 49 57 -24 67 -57 175 62 -128
7692 -128 -204 -81 -65 -165 -240 -23 123 -43 39 -47 48 46 20 163 -51 42 30 49 -34 -120 118 -56 19 5 2 194
$$ packed form
7528A4K29k82j4J67q6o8K48j84k87M05K3j96J39j60r0K96J1k11j36J37J21J2k56
7551a68K87nk10O5j43J35l22M22j54K03k3j62K53j07R7j67j30J28k0N4j73J05
7573c5K15l00L25k64J01J03p6j20n0M16m08MO6q4ML08k69K27o3J64k30O1m2o4
7597a1N6K7l2p1n6Q1J47j75o0L8J64k25J61J56k31j76L06l00M05m57J17J91m4
7620A1M5J21j0k63L71j41k29K1J94j24M1J33k47M3J73j50K87l61K9j48K53j34
7642h5J87j40P8J43q7p3N2j18J09l90L69J09j21K76k79l4j2N5m2K9L6O8J52k19
7666F3j41R2n1P7j53K0P7K3j2Rj53J65j8J9j15L25l41J03O0Qq1R1j24K32j13j90
7692a28p6J23J6j00p5K17J46j66Q2q6R5kk6J43k14R3j2J9q3q6K38j74P5j4lJ92
$$ plain form
7718 194 7 -197 -90 -243 -134 -37 -163 48 -10 25 -26 71 -107 -32 -64 -156 30 -17 9 -95 -149 -121 -72 -219
7742 -219 -178 162 6 -191 100 165 29 -34 -264 79 120 67 12 -108 -100 -186 -153 -172 68 340 125 -236 102 -114
7766 -114 264 -76 156 -106 278 -186 91 -70 -122 25 45 -90 -120 -218 -107 -28 -80 37 100 34 -304 -27 -10
7789 -10 51 49 -141 12 6 -52 36 -82 32 -19 -14 -140 37 -194 -60 134 79 29 103 221 252 -21 89 32 -233
7814 -233 -13 -6 289 -40 -112 37 86 -129 60 53 -49 87 271 6 18 66 99 97 83 -181 -39 271 -62 55
7838 55 -171 -55 -107 200 106 -212 103 -126 11 1 -123 -162 -80 17 5 -67 68 -143 209 -28 19 127 -62
7861 -62 -15 -234 -15 -104 -47 105 43 196 99 -119 254 -242 -80 160 -161 -20 208 -106 163 52 -189 88
7883 88 79 -31 12 -2 40 -243 38 -110 53 82 -137 -206 -6 51 -219 67 -55 -328 -46 -117 -144 39 320 -191
$$ packed form
7718A94j87k04J07j53J09R7j26K11n8L5n1R7j78P5l2r2J86m7K6j04n4K8M9j47
7742b19M1L40j56j97K91O5j36o3k30L43M1n3n5j20Qq6L3j9K40K72k15l61L38k16
7766a14L78l40K32k62L84m64K77j61n2J47K0j35l0r8J11P9n2J17O3o6l38K77J7
7789a0O1kj90J53on8Q8j18J14n1Nj26J77k31J34J94n5n0P4J18L1k73J10n7k65
7814b33K20PK95l29p2J49M9k15J89pj02J36J84k65J2M8L3kj4k64J42L10l33J17
7838E5k26J16n2L07r4l18L15k29J37j0j24l9Q2R7j2p2J35k11L52k37M7J08j89
7861f2M7k19K19q9N7J52o2J53r7k18L73m96J62K40l21J41K28l14K69j11k41K77
7883H8rj10M3j4M2k83K81j48J63K9k19o9K00N7k70K86j22k73K82p1k7J83K81n11
$$ plain form
7907 -191 -12 55 166 -83 12 142 89 -39 -103 130 227 346 -238 -59 88 -103 -47 -113 -48 140 6 -140 -137
7930 -137 -36 -56 -14 -80 82 -122 -133 -39 31 38 -2 243 139 -157 -79 50 -47 -164 89 1 14 20 78 -134 -152 222
7956 222 -66 77 180 86 300 112 -58 124 53 128 -31 -117 8 60 74 192 -198 -146 -23 -38 58 24 166
7979 166 -302 -94 117 204 83 140 -96 -10 -10 6 151 -80 -262 -33 158 -230 -47 -65 -81 108 -46 84 6
8002 6 -11 -30 -362 69 84 -67 -89 164 -39 -1 70 -4 -75 -63 -71 109 -24 16 -109 21 96 161 202 -43 -32 64
8028 64 119 189 99 -180 399 7 -179 221 -252 252 5 -116 -134 -204 77 -6 -68 -12 107 -338 -25 45 174
8051 174 5 -37 -15 283 -156 -40 16 -21 13 134 -40 30 -256 107 25 -25 0 -17 -86 154 76 -146 -198 -14
8075 -14 104 -96 162 -71 30 32 74 -67 45 -119 -9 10 -169 17 -21 -87 20 46 -70 49 -45 -231 -218
$$ packed form
7907a91J79O7J11k49R5J30n3j28o4K33R7J19n84J79J47j91N6o6O5J88j34j46L
7930a37J01k0M2o6J62k04j1R4P0Pm0K45j04k96P8J29r7j17K53q8J3ON8k12j8L74
7956B22k88J43J03r4K14j88j70J82p1P5j59q6J25N2J4J18l90N2J23j5R6l4J42
7979A66m68K08K11Q7j21N7k36Q6%J6J45k31j82K29J91l88J83j8j6J89j54J30p8
8002Fj7j9l32M31J5j51k2K53k03L8P1p4p1J2qJ80j33M0j25J30P5O5M1k45J1R6
8028F4N5P0r0k79N79l92j86M00m73N04k47j21j8p0K81q3o2N6J19m45L13P0J29
8051A74j69m2K2K98m39J16N6l7L4J21j74P0k86L63q2n0K5j7o9K40p8k22n2J84
8075a4J18k00K58k33J01KM2j41J12j64J10J9j79J86l8o6J07K6j16J19r4j86J3
$$ plain form
8098 -218 -142 -27 -11 38 39 -5 -48 9 -50 27 162 23 39 130 162 -200 48 -156 52 108 -32 63 172 91 -35
8123 -35 -35 47 55 -7 73 -28 31 11 -40 -23 -225 19 -171 21 9 -108 11 298 30 189 -238 127 -378 66
8147 66 -221 128 77 28 212 -126 76 157 -74 -16 104 83 130 56 28 52 37 234 318 134 -305 41 -30 188
8171 188 74 5 115 -1 -42 92 -69 -80 43 -225 28 114 -87 151 67 172 69 -134 239 -279
$$ packed form
8098b18P6J15J6M9Jm4m3N7n9P7J35j39J6R1L2l62K48k04K08N6j40R5J09q1j26
8123c5%Q2Qo2Q0j01N9k0n1J7k02K44j90J92j2j17J19K87k68J59m27L65n05M44
8147F6k87L49n1m9J84l38K02Q1k31N8J20k1M7p4k8K4j5J97Q4j84m39L46p1K18
8171A88j14o9J10j16m1J34j61j1J23k68K53Q6k01K38q4J05j03k03L73n18
8191b79
$$ Imaginary data points
##PAGE= N=2
##DATA TABLE= (X++(I..I)), XYDATA
$$ plain form
0 0 0 0 0 0 0 0 0 0 0 0 0 -8 8 -8 8 -8 16 -16 24 -24 32 -40 48 -56 64 -72 88 -96 112 -129 149 -169 192
33 192 -217 248 -277 313 -349 390 -437 486 -542 598 -662 734 -812 895 -987 1087 -1198 1319
51 1319 -1453 1604 -1767 1954 -2162 2399 -2673 2989 -3361 3805 -4350 5036 -5921 7128 -8863
66 -8863 11591 -16511 28181 -118056 -174 166840 -103172 765 103737 -83914 -75760
77 -75760 100551 -30424 -54618 103613 44050 -76131 -11239 -18210 -18762 69697 38938 -36539
89 -36539 10684 -740 -30399 17700 7380 -6136 64210 5491 -88544 -15254 25960 -13575
101 -13575 35910 20290 -58429 7113 29383 -65718 1232 76363 -20373 -16803 33139 -68452
113 -68452 -38530 93672 -250 -57868 64909 9013 -81940 40607 43115 -62005 39554
$$ packed form
0@%%%%%%%%%%%qJ6j6J6j6K4l2M0m8N6p2Q8j04J20j36J60j84K08k41K78l18L61
33A92m09M65n25N90o62P39q27R23j028J140j260J396j546J707j882K074k285K517
51A319k772L057l371L721m116M561n072N662o350P166q155R386j0957J3049j5991
66h863K0454k8102M4692j46237J17882J67014k70012J03937J02972j87651Q154
77g5760J76311j30975k4194J58231n9563j20181O4892o971n52Q8459l0759p5477
89c6539M7223j1424k9659M8099j0320j3516P0346n8719r4035P3290M1214l9535
101a3575M9485j5620p8719O5542K2270r5101O6950P5131r6736L570M9942j01591
113f8452K9922J32202r3922n7618J22777n5896r0953J22547K508j05120J01559
$$ plain form
124 39554 73481 -78241 -44618 60420 -16498 -26102 50850 -9017 -40160 26918 -5391 -38368
136 -38368 29456 28927 -18520 -2564 -6953 -21615 12008 12519 -5598 11831 -408 -14959 11112
149 11112 -3338 -13903 33628 16663 -33401 2769 12710 -26793 10477 29032 -26859 -4381
161 -4381 29700 -27145 -21673 35353 -1925 -17673 26480 -10610 -36593 24551 12308 -32634
173 -32634 14881 23025 -29831 -4100 21270 -17670 77 31815 -10162 -18587 17483 1314
185 1314 -12824 13582 8459 -8119 3671 1524 -8646 946 5252 2246 1354 -7789 -5951 3746
199 3746 -5191 -5314 8130 -2873 -9010 6475 -3806 -13472 11426 10496 -11910 1956 8443 -10436
213 -10436 1723 13466 -6438 -795 15519 -5262 -9799 11143 2745 -5847 8283 603 -10969
$$ packed form
124C9554L3927j51722L3623J05038p6918r604P6952n9867l1143O7078l2309l2977
136c8368O7824n29m7447J5956m389j4662L3623N11j8117J7429j2239j4551K6071
149A1112j4450j0565M7531j6965n0064L6170R941l9503L7270J8555n5891K2478
161d381L4081n6845N472N7026l7278j5748M4153l7090k5983O1144j2243m4942
173c2634M7515Q144n2856K5731K5370l8940J7747L1738m1977q425L6070j6169
185A314j4138K6406n123j6578J1790k147j0170R592M306l006q92r143J838R697
199C746q937j23J3444j1003o137J5485j0281r666K4898r30k2406J3866O487j8879
213a0436J2159J1743j9904N643J6314k0781m537K0942q398q592J4130p680j1572
$$ plain form
226 -10969 3947 3493 -9887 467 5942 -6298 -4428 1394 -5374 -2772 3714 -1442 -2298 515
240 515 -1009 590 1655 55 3276 3664 -849 1738 3067 -1258 3699 5614 -3241 -1221 4912 -2560
256 -2560 -3338 4408 -1731 -4663 3543 -2076 -7618 1917 1594 -6561 -374 1664 -4715 115 3044 -4099
272 -4099 -497 5676 -1351 -1746 4075 1005 -421 3967 1346 -764 3691 1491 -1720 2000 1602 -1357
288 -1357 256 -375 -2185 -154 -953 -2962 358 -760 -3820 -32 1334 -3187 -1561 1906 -1177 -934
304 -934 1199 -536 -33 2234 336 -446 2493 1416 -152 1870 1514 -80 1804 663 -1563 239
320 239 901 -1259 -714 98 -1012 -562 83 -1476 -955 478 -1585 -2069 -19 -883 -1733 -138 260 -1210
338 -1210 136 1984 828 484 2221 2100 356 1277 2089 476 -52 974 723 -362 -281 -149 73 -75
$$ packed form
226a0969J4916m54j3380J0354N475j2240J870N822o768K602O486n156q56K813
240E15j524J599J065j600L221L88m513K587J329m325M957J915q855K020O133p472
256b560p78P746o139k932Q206n619n542R535l23q155O187K038o379M830K929p143
272d099L602O173p027l95N821l070j426M388k621k110M455k200l211L720l98k959
288a357J613o31j810K031p99k009L320j118l060L788J366m521J626L467l083K43
304i34K133j735N03K267j898p82K939j077j568K022l56j594J884j141k226J802
320B39O62k160N45Q12j110M50O45j559N21J433k063m84K050q64q50J595L98j470
338a210J346J848j156l44J737j21j744R21Q12j613n28J026k51j085Q1J32K22j48
$$ plain form
356 -75 -449 -1171 -109 -572 -2483 -2111 -351 -965 -1833 -1676 -589 252 -486 -231 1647 1541 -258 881
374 881 2238 400 892 2643 8 -323 2769 791 -963 2485 1816 -1286 482 952 -2353 -294
390 -294 551 -3493 -2320 668 -3774 -3840 1935 -794 -3514 1926 1431 -3302 1059 3136 -1665 364
406 364 4176 -917 -1498 3877 1581 -976 3305 2375 -1100 804 1479 -932 -170 1067 -1127 -2509
422 -2509 -1746 -1053 -1421 -2239 -211 932 -1619 -2107 1292 -187 -1990 2116 1546 -3146 996 2413 -3060
439 -3060 1011 5579 -1618 -1229 6276 -743 -4110 6007 2406 -5697 2914 3161 -7329 -501 5544
454 5544 -5505 -3061 6046 -3283 -6475 4847 502 -6280 3586 3277 -7002 -571 4534 -3173 -1026
469 -1026 5494 815 -1550 2605 1100 -157 2256 1879 369 67 -466 270 -501 -1631 2205 1194
$$ packed form
356g5l74p22J062m63j911L72J760o14q68J57J087Q41p38K55J878j06j799J139
374H81J357j838M92J751k635l31L092j978j754L448o69l102J768M70l305K059
390b94Q45m044J173K988m442o6N775k729k720N440m95m733M361K077m801K029
406C64L812n093n81N375k296k557M281r30l475J904O75k411P62J237k194j382
422b509P63O93l68q18K028J143k551m88L399j479j803M106n70m692M142J417n473
439c060M071M568p197L89P505p019l367J0117l601q103Q611K47j0490O828O045
454E544j1049K444R107r329l192J1322m345o782R866l09j0279O431N105p707K147
469a026O520m679k365M155j505j257K413l77j510l02n33P36p71j130L836j011
$$ plain form
485 1194 -4278 -692 2586 -4559 -1892 4801 -2729 -4232 4436 -2319 -6468 5223 2450 -7220 4308
500 4308 5810 -7961 227 9156 -4210 -2135 9904 -2560 -6246 8002 1027 -7591 6761 5097
514 5097 -8659 1019 5901 -6374 -1916 6581 -3730 -4437 3910 -2413 -5670 2438 1050 -3441 450
529 450 896 -1942 -282 381 1103 2191 -158 710 2289 -1893 109 4867 -1229 -1198 6006 -1182 -5697
546 -5697 4998 2014 -6772 3701 4097 -8379 -453 5392 -7462 -2567 8488 -4457 -6991 7530
560 7530 -1116 -8842 6130 4520 -7533 2627 6208 -6661 -577 8527 -2252 -2284 7612 -319
574 -319 -4881 3681 2392 -2864 2055 2519 -2834 -1628 113 -1167 -936 -17 209 -922 -3438 -1119
590 -1119 920 -2365 -595 3784 -1737 -3247 3061 -310 -3458 5107 3916 -4431 2308 4307 -4874
$$ packed form
485A194n472L586L278p145K667O693p530j503Q668o755m149J1691k773r670J1528
500D308J502j3771Q188Q929j3366K075J2039j2464l686J4248o975q618J4352j664
514E097j3756R678M882j2275M458Q497j0311p07Q347o323l257Q108j388m491L891
529D50M46k838J660O63P22J088k349Q68J579m182K002M758o096L1P204p188m515
546e697J0695k984q786J0473L96j2476P926N845j2854M895J1055j2945k534J4521
560G530q646p726J4972j610j2053J0160L581j2869O084R104j0779l2R896p931
574c19m562Q562j289n256M919M64n353J206J741j280K31R19K26j131k516K319
590a119K039l285J770M379n521j510O308l371l148Q565j191q347O739J999r181
$$ plain form
605 -4874 301 6968 -1488 -2450 5401 -1997 -5271 4492 1031 -5301 2754 2340 -6958 -1280 3339 -3785
621 -3785 -1592 4338 -1925 -4615 2116 557 -2962 2315 3968 -1920 -1469 2832 299 -1566 2621
636 2621 4063 -1025 -1034 2539 -834 -2754 3366 2696 -4031 -291 2699 -4532 -3175 4383 -461 -4258
652 -4258 2165 149 -5290 798 2880 -3027 -135 3392 -2570 -2540 3121 888 -908 2794 1561 -1695
668 -1695 159 1457 450 725 1903 361 -1440 -334 589 -588 -1116 1806 387 -3418 -632 1006
684 1006 -2975 -747 2736 -2184 -2839 2493 -1000 -3617 3495 2389 -3558 1687 3173 -3204 402
699 402 4703 -1485 -991 4123 -1093 -2644 3037 1111 -2425 1820 584 -2367 -54 136 -2104 636
715 636 -46 -2393 -357 -247 -2386 305 574 -1520 811 545 -2222 740 2788 -1591 143 2979
$$ packed form
605d874N175O667q456r62P851p398l274R763l461o332Q055m14r298N678M619p124
621c785K193N930o263k690O731j559l519N277J653n888M51M301k533j865M187
636B621J442n088rL573l373j920O120o70o727L740K990p231J357P558m844l797
652d258O423k016n439O088K082n907K892L527n962L0N661k233j796L702j233l256
668a695J854J298j007K75J178j542j801J106R23j177n28K922j419l805K786J638
684A006l981K228L483m920o55N332l493k617P112j106n947N245J486o377L606
699D02M301o188M94N114n216j551N681j926l536M245j236k951K313J90k240K740
715F36o82k347K036J10k139K691K69k094K331k66k767K962K048m379J734K836
$$ plain form
731 2979 -1285 -750 2854 -402 -635 3408 -292 -2242 2494 215 -2989 1923 944 -3328 223 844
747 844 -3637 -172 1425 -2887 -540 2225 -2504 -1224 3014 -1361 -1612 3007 -67 -2255 2283 1148
763 1148 -1397 2276 1335 -1266 1618 921 -1647 1277 1414 -1878 147 1623 -1879 -757 958 -1865
779 -1865 -559 657 -2314 -1084 1664 -1410 -1960 1615 -13 -2026 1446 548 -1299 1600 934 -1173
795 -1173 1539 1845 -1071 698 1871 -627 385 1494 -989 -162 1305 -1079 -1095 1069 -766 -1558
811 -1558 616 -273 -1803 142 -238 -1470 -26 143 -941 154 705 -526 297 888 229 638 1027
828 1027 337 741 1286 114 172 1355 5 -171 861 -163 -472 551 -390 -1304 164 59 -1052 -819
846 -819 -66 -742 -549 -642 -818 -83 -111 -382 -8 420 279 279 617 608 579 572 114 694 607 358 56 443 517 -27
$$ packed form
731B979m264N35L604l256k33M043l700j950M736k279l204M912r79m272L551O21
747H44m481L465J597m312K347K765m729J280M238m375k51M619l074k188M538j135
763A148k545L673r41k601K884o97k568K924J37l292K025J476l502J122J715k823
779a865J306J216k971J230K748l074n50L575j628k013L472q98j847K899o66k107
795a173K712L06k916J769J173k498J012J109k483Q27J467k384j6K164j835p92
811a558K174q89j530J945l80j232J444J69j084J095N51j231Q23N91o59M09L89
828A027o90M04N45j172N8J183j350j76J032j024l09J023r41r14J468j05j111K33
846h19P53o76J93r3j76P35k8k71L74M28j41%L38rk9pm58N80q7k49l02L87P4n44
$$ plain form
870 -27 -333 -65 -16 -323 -379 -282 -568 -648 -327 -330 -1099 -289 125 -848 -540 659 -78 -314 777 546 273 598
892 598 459 -45 928 930 120 434 890 -184 -402 310 396 -325 -254 -398 -529 -452 -765 -635 -388 -425 -564 -795
914 -795 -312 -302 -348 -132 251 73 2 245 430 70 1005 1417 252 -248 1056 512 -253 752 850 -121 -402
935 -402 117 -814 -445 410 -381 -827 35 -575 -1703 -194 217 -573 -321 380 -755 -1107 677 616 324
954 324 971 920 -544 -297 1181 393 198 1408 588 -650 324 417 -391 575 910 -671 -726 -224 -874 -1143
974 -1143 93 287 -1256 -764 -325 -837 -281 773 462 -47 149 72 -493 70 1502 1421 252 400 393 -386
994 -386 -115 1128 497 172 835 -980 -1676 509 826 -1078 502 602 -2033 -1836 546 -476 -324 1288
1012 1288 -399 -2060 -182 271 -942 1594 2123 -810 -641 789 -583 28 2436 1089 -324 794
$$ packed form
870b7l06K68M9l07n6R7k86q0L21lp69Q10M14r73L08J199p37k36J091k31k73L25
892E98j39n04R73Kq10L14M56j074k18P12Q6p21P1j44j31P7l13J30K47l7j39k31
914g95M83J0m6K16L83j78p1K43J85l60R35M12j165n00J304n44p65J005R8r71k81
935d02N19r31L69Q55p91m46Q62o10j128J509M11p90K52P01j135l52J784o1k92
954C24O47n1j464K47J478p88j95J210q20j238R74R3q08R66L35j581n5N02o50k69
974a143J236J94j543M92M39n12N56J054l11n09J96p7n65N63J432q1j169J48pp79
994c86K71J243o31l25O63j815o96K185L17j904J580J00k635J97K382j022J52J612
1012A288j687j661J878M53j213K536N29k933J69J430j372O11K408j347j413J118
$$ plain form
1028 794 -278 -1215 123 1747 476 -672 -535 -747 -1114 -662 707 506 -289 -833 -1150 -1720 -469 977
1046 977 403 -36 665 -599 -1691 903 1773 -139 1328 1453 -1353 -613 1586 40 244 2489 99
1063 99 -2213 309 378 -1399 711 1660 -1636 -914 -212 -1897 -625 1403 201 -1165 -351 -1010 -1366
1080 -1366 510 1159 200 563 402 -997 -410 622 1201 1011 482 15 -369 -956 -384 1304 467 -468
1098 -468 228 -911 -1752 -51 229 -524 555 399 -2262 -1253 780 -536 -245 1413 -23 -1409 478
1115 478 388 -515 1762 1667 -978 -70 1246 -825 -115 1908 290 -649 682 -647 -1135 342 747 -631
1133 -631 -147 -119 -1492 -931 27 5 32 -172 -302 -840 -240 -156 604 549 159 294 -283 -68 963 986 123
1154 123 649 757 -590 -602 1264 85 -60 897 -348 -1447 176 58 -1151 403 653 -1533 -921
$$ packed form
1028G94j072r37J338J624j271j148J37k12l67M52J369k01p95n44l17n70J251J446
1046I77n74m39P01j264j092K594Q70j912J467J25k806P40K199j546K04K245k390
1063I9k312K522O9j777K110R49l296P22P02j685J272K028j202j366Q14o59l56
1080a366J876O49r59L63j61j399N87J032N79j90n29m67l84n87N72J688q37r35
1098d68O96j139q41J701K80p53J079j56k661J009K033j316K91J658j436j386J887
1115D78r0r03K277r5k645R08J316k071P10K023j618r39J331j329m88J477M05j378
1133f31M84K8j373N61R58k2K7k04j30n38O00Q4P60n5l90J35n77K15J031K3q63
1154A23N26J08j347j2J866j179j45R57j245j099J623j18j209J554K50k186O12
$$ plain form
1171 -921 401 -913 -737 1355 3 -742 315 142 -901 653 1131 -71 476 705 -269 65 937
1188 937 356 99 765 -115 -525 1 78 -169 -151 -231 -583 -22 -527 -220 6 -298 -497 -172 -462 -400 326
1209 326 126 -212 667 415 -441 153 830 -183 447 862 -146 259 822 47 -202 637 -115 -616 109
1228 109 125 -1046 -151 300 -1167 -471 106 -777 -423 225 -387 -241 96 107 -397 432 256 298 449 519 -194
1249 -194 175 695 184 241 381 223 351 -109 -244 92 -66 -492 -467 -321 -567 -470 -153 -347 -390 49 -536
1270 -536 -440 230 -132 -381 360 94 50 512 367 89 508 664 -233 406 410 -7 158 271 260 -229 -103 -73
1292 -73 -252 -279 -383 -382 -297 -419 -335 -411 -385 -268 -244 -114 0 -8 -10 284 328 272 54 219 -116 -120 191 436 293 22
1318 22 390 179 -20 424 12 -36 -399 -106 -17 -378 -454 -384 -145 -304 -174 -187 -259 -39 158 -47 6 360 58
$$ packed form
1171i21J322j314J76K092j352p45J057j73j043J554M78j202N47K29r74L34Q72
1188I37n81k57O66q80m10N26P7k47J8q0l52N61n05L07K26l04j99L25k90O2P26
1209C26k00l38Q79k52q56N94O77j013O30M15j008M05N63p75k49Q39p52n01P25
1228A09J6j171Q95M51j467O96N77q83L54O48o12J46L37J1n04Q29j76M2J51P0p13
1249a94L69N20n11N7J40j58J28m60j35L36j58m26K5J46k46R7L17j94m3M39n85
1270e36R6O70l62k49P41k66m4M62j45k78M19J56q97O39Mm17J65J13j1m89J26L0
1292g3j79k7j04JQ5j22Q4p6K6J17K4J30J14qkK94M4n6k18J65l35mL11K45j43k71
1318B2L68k11j99M44m12m8l63K93Q9l61p6P0K39j59J30j3p2K20J97k05N3L54l02
$$ plain form
1341 58 175 437 217 255 455 475 -70 491 426 25 439 209 -272 32 9 -588 -134 -285 -721 -163 74 -343
1363 -343 -626 -77 -191 -342 200 -78 -406 551 247 -159 528 264 18 285 299 251 342 377 20 441 456 -53
1385 -53 74 373 24 -379 -231 -166 -309 -119 -663 -512 179 -183 -685 8 -174 -391 218 -52 -143 451 375
1406 375 -164 589 606 25 245 613 281 165 715 101 -112 328 -157 -601 342 37 -562 -239 87 -536
1426 -536 -229 -188 -610 -589 79 -440 -191 240 154 -239 262 379 50 266 313 143 348 429 415 239 260 104
1448 104 176 -213 191 209 -140 -403 179 -343 -488 43 -433 -471 -88 100 -518 -251 56 -440 -423 195 76
1469 76 -378 396 496 -251 425 617 58 227 461 -231 -259 250 199 -476 195 300 -336 -194 -11 -402 -389
1490 -389 98 -95 -655 -461 59 -702 -349 239 -52 -144 301 122 -118 199 893 -146 267 863 -15 -44
$$ packed form
1341E8J17K62k20L8K00K0n45N61o5m01M14k30m81L04k3n97M54j51m36N58K37m17
1363c43k83N49j14j51N42k78l28R57l04m06O87k64k46K67J4m8R1L5l57M21J5n09
1385e3J27K99l49m03J48O5j43J90n44J51O91l62n02O93j82k17O09k70r1N94p6
1406C75n39P53J7n81K20L68l32j16N50o14k13M40m85m44R43l05n99L23L26o23
1426e36L07M1m22K1O68n19K49M31q6l93N01J17l29K16M7j70K05Q1j4j76K1j56
1448A04P2l89M04J8l49k63N82n22j45N31m76l8L83J88o18K67L07m96J7O18j19
1469G6m54P74J00p47O76J92n59J69K34o92k8N09n1o75O71J05o36J42J83l91J3
1490c89M87j93n60J94N20p61L53N88k91r2M45j79k40L17O94j039M13N96q78k9
$$ plain form
1510 -44 677 205 -422 382 523 -504 -203 432 -438 -476 386 -212 -449 -4 147 -683 -403 75 -332 -641
1530 -641 187 307 -402 253 533 -353 30 740 71 -82 415 279 -649 325 626 -170 -4 345 -73 -253
1550 -253 417 248 -823 95 167 -883 -350 378 -244 -450 191 -239 -453 146 363 -417 194 829 -256
1569 -256 -47 862 129 -56 461 585 -120 -37 441 -230 -474 642 107 -613 57 321 -668 -397 229 -614
1589 -614 -592 -38 -185 -797 170 115 -303 127 646 -35 -316 465 349 -335 590 338 -74 240 462 129 -41
1610 -41 494 -169 -595 283 127 -264 -265 80 -217 -481 11 -23 -635 86 66 -427 48 529 -124 -225 489 217
1632 217 -237 419 348 -137 295 678 59 243 678 -124 -332 460 339 -439 65 108 -405 -308 27 -380 -393
1653 -393 -34 -268 -369 135 332 -135 -24 142 -54 -116 93 151 5 379 585 106 120 649 204 -154 114
$$ packed form
1510d4P21m72o27Q04J41j027L01O35q70l8Q62n98k37M45J51q30K80M78m07l09
1530f41Q28J20p09O55K80q86L83P10o69j53M97j36r28R74L01p96J66L49m18j80
1550b53O70j69j071R18P2j050N33P28o22k06O41m30k14N99K17p80O11O35j085
1569b56K09R09p33j85N17J24p05Q3M78o71k44J116n35p20O70K64r89K71O26q43
1589f14K2N54j47o12R67n5m18M30N19o81k81P81j16o84R25k52m12L14K22l33j70
1610d1N35o63m26Q78j56l91jL45k97k64M92l4o12P21k0m93M75M81o53j01P14k72
1632B17m54O56p1m85M32L83o19J84M35q02k08P92j21p78N04M3n13R7L35m07j3
1653c93L59k34j01N04J97m67J11J66j96o2K09N8j46L74K06m79J4N29m45l58K68
$$ plain form
1674 114 284 -134 -78 364 -355 -274 140 -92 -370 120 -42 -677 253 75 -395 20 -49 -356 -40 352 115
1695 115 -92 261 170 -8 604 663 -214 20 510 134 -36 277 433 -48 0 172 -321 -286 35 -347 -243
1716 -243 -133 53 -382 -444 -106 -37 -532 106 -59 -262 -48 22 59 203 556 157 210 419 259 80 548 321
1738 321 -80 153 122 -325 199 28 21 -172 -62 -81 -107 -114 -225 -104 -141 -105 -298 -111 154 140 206 155 104 80 -31
1763 -31 262 301 251 171 323 314 57 224 476 -78 306 118 -235 166 168 -327 -234 -204 -325 -319 -296 -114 -159 -73 -323
1788 -323 -63 54 -55 -26 -310 -27 56 3 -43 54 249 481 -62 112 150 -51 97 -59 10 -145 -147 -144 -38 -67
1812 -67 -233 43 -340 -180 115 45 -276 -217 -2 -174 146 128 -63 96 58 76 192 186 119 177 125 -12 -18 -273
1836 -273 135 34 66 135 -84 118 -315 -237 -150 -115 -226 -168 -373 -349 -388 119 93 106 242 224 -50 38 279 227
$$ packed form
1674A14J70m18N6M42p19Q1M14k32k78M90j62o35R30j78m70M15o9l07L16L92k37
1695A15k07L53r1j78O12N9q77K34M90l76j70L13J56m81M8J72m93L5L21l82J04
1716b43J10J86m35o2L38O9m95O38j65k03K14P0L7J44L53l99N3K09j60j79M68k27
1738C21m01K33l1m47N24j71pj93J10j9k6pj11J21l7L6j93J87K65j4O6n1n1k4j11
1763c1K93L9n0q0J52rk57J67K52n54L84j88l53M01Km95R3L0j21OK3J82m5Q6k50
1788c23K60J17j09K9k84K83Q3n3m6R7J95K32n43J74L8k01J48j56O9j55kLJ06k9
1812f7j66K76l83J60K95p0l21N9K15j72L20j8j91J59l8J8J16oo7N8n2j37ok55
1836b73M08j01L2O9k19K02m33P8Q7L5j11N8k05K4l9N07k6J3J36j8k74Q8K41n2
$$ plain form
1860 227 260 -101 217 143 87 48 182 280 -16 61 55 -45 -76 65 38 -212 -188 -346 -221 -229 -502 40 -222 -46
1884 -46 279 -93 14 -82 -7 -42 54 198 -85 218 124 116 432 538 -22 -22 188 31 -162 -96 -63 42 39 18 -198
1909 -198 -105 -256 -512 -27 -55 -289 270 210 -143 -60 207 -303 -219 483 -9 258 307 328 366 52 -114 76 424
1932 424 106 131 185 124 33 -113 -11 -92 20 -365 -184 0 -164 -416 -154 -217 -195 -15 2 -199 141 251 -115
1955 -115 -114 241 135 -101 254 177 -139 296 240 -232 40 190 -26 -163 174 -37 -160 -211 -225 -481 -107 -170
1977 -170 -199 -155 -236 -47 -218 100 -43 -92 -88 191 228 52 6 418 193 -14 229 109 257 191 104 -49 423
2000 423 265 -97 -164 209 -291 -228 92 -246 -246 -258 -92 -361 63 188 -237 -320 187 63 -118 67 77 1 173
2023 173 342 98 75 90 94 44 -33 302 -57 74 -1 143 -34 -209 -70 -250 -122 170 -212 0 66 -395 -221
$$ packed form
1860B27L3l61L18p4n6l9J34R8k96P7oj00l1J41k7k50K4j58J25qk73N42k62J76
1884d6L25l72J07r6P5l5R6J44k83L03r4qL16J06n60%K10j57j93O6L3J05lk1k16
1909a98R3j51k56M85k8k34N59o0l53Q3K67n10Q4P02m92K67M9K1L8l14j66J90L48
1932D24l18K5N4o1r1j46J02q1J12l85J81J84j64k52K62o3K2J80J7k01L40J10l66
1955a15JL55j06k36L55p7l16M35n6m72K72J50k16j37L37k11j23n1j4k56L74o3
1977a70k9M4q1J89j71L18j43m9MK79L7j76m6M12k25k07K43j20J48o6q7j53M72
2000D23j58l62o7L73n00O3L20l38%j2J66k69M24J25m25q3N07j24j81J85J0p6J72
2023A73J69k44k3J5Mn0p7L35l59J31p5J44j77j75J39j80J28K92l82K12O6m61J74
$$ plain form
2046 -221 -20 -148 -25 112 102 -70 337 342 156 240 505 -149 139 471 77 157 441 93 -233 239 129 -162
2068 -162 -191 9 -7 -595 -95 -192 -252 -147 -134 45 -139 5 -202 -65 133 208 -140 234 279 -99 102 425
2090 425 51 145 237 179 87 -318 129 61 -212 37 -50 -353 106 58 -32 -61 208 -339 -313 -56 -361 151 196 -70
2114 -70 -120 239 317 -17 171 272 -3 -77 -34 -11 59 123 26 111 10 187 -74 14 77 -170 -201 -51 -56 -59 -186 -36
2140 -36 -147 -71 -391 -207 -504 12 13 -104 -105 295 -149 -21 109 326 20 180 328 -133 -42 22 -99 -117 295
2163 295 -114 -256 -134 226 -161 -118 240 -150 -5 -34 -148 -158 -149 213 1 109 28 22 76 88 292 125 305
2186 305 -194 192 349 21 8 -200 273 -119 62 -46 76 130 -58 108 -206 -33 -121 -75 -58 -326 184 -75
2208 -75 -134 111 -90 -59 201 187 -16 34 113 268 -83 316 149 -49 282 223 157 -40 133 -299 27 22 10 -60
$$ packed form
2046b21K01j28J23J37j0j72M07Nj86Q4K65o54K88L32l94Q0K84l48l26M72j10k91
2068a62k9K00j6n88N00r7o0J05J3J79j84J44k07J37J98P5l48L74M5l78K01L23
2090D25l74R4R2n8r2m05M47o8k73K49q7l03M59m8r0k9K69n47K6K57l05N12M5k66
2114g0n0L59P8l34J88J01k75p4M3K3P0O4r7Q5j01J77k61Q8O3k47l1J50nlj27J50
2140c6j11P6l20J84k97N16Jj17jM00m44J28J30K17l06J60J48m61R1O4j21j8M12
2163B95m09j42J22L60l87M3L58l90J45k9j14j0RL62k12J08q1oN4J2K04j67J80
2186C05m99L86J57l28j3k08M73l92J81j08J22N4j88J66l14J73q8M6J7k68N10k59
2208g5n9K45k01L1K60j4k03N0P9J55l51L99j67j98L31n9o6j97J73m32L26nj2p0
$$ plain form
2232 -60 -85 -539 -269 8 -229 -298 27 -67 -124 -163 120 97 59 21 149 124 76 175 -77 202 -25 74 2 256 206
2257 206 -323 -15 30 -6 -316 -101 -31 -294 -217 9 -114 -150 -71 37 -171 -31 -148 -88 -29 -163 20 171 239
2280 239 132 178 96 -74 15 2 86 163 -33 111 -27 -134 72 -217 -244 -248 -120 -49 31 86 250 -17 -15 -187 -90
2305 -90 -196 -181 48 -11 27 -153 200 -81 197 25 -103 195 77 35 -99 220 108 -28 -68 0 -201 -134 3
2328 3 61 -51 142 -70 -467 72 3 -22 -79 -317 -118 -15 -3 -20 394 78 43 -26 109 79 26 182 -99 -5
2352 -5 178 -70 -125 12 65 -239 -134 12 -23 87 -118 130 -139 -430 -13 -182 225 -184 -139 -90 129 52 167
2375 167 128 23 -87 132 289 -103 245 72 202 92 155 16 128 73 13 -27 171 -173 -98 -81 180 -106
2397 -106 -75 -422 -119 -140 -159 -21 -49 -36 17 32 127 351 -26 175 165 109 265 17 55 199 5 -6 216 169
$$ packed form
2232f0k5m54K70K77k37o9L25r4n7l9K83k3l8l8J28k5m8R9k52K79k27R9p2K54n0
2257B06n29L08M5l6l10K15P0k63P7K26j23l6P9J08k08J40j17O0N9j34J83J51O8
2280B39j07M6q2j70Q9j3Q4P7j96J44j38j07K06k89k7mJ28P1Q0N5J64k67Kj72R7
2305i0j06J5K29n9L8j80L53k81K78j72j28K98j18m2j34L19j12j36m0O8k01O7J37
2328CN8j12J93k12l97N39o9k5n7k38J99J03J2j7M14l16l5o9J35l0n3J56k81R4
2352eJ83k48n5J37N3l04J05J46l5J10k05K48k69k91M17j69M07m09M5M9K19p7J15
2375A67l9j05j10K19J57l92L48j73J30j10O3j39J12n5o0m0J98l44P5J7K61k86
2397a06L1l47L03k1j9J38k8J3N3J5R5K24l77K01j0n6J56k48L8J44j94j1K22m7
$$ plain form
2421 169 -54 140 31 -99 117 -304 -54 33 -406 134 -212 -235 -187 -200 171 -49 81 -32 -187 -17 -14 26
2443 26 -124 167 239 61 -142 120 57 -76 105 -91 -29 -169 141 -40 -85 28 -35 -147 -93 -101 -70 -38 -50 -39
2467 -39 -174 85 -224 154 145 -24 111 128 209 395 98 1 26 304 285 -1 422 -175 -53 156 14 -11 -102
2490 -102 -275 -250 -186 -118 -36 -76 77 -47 -172 -24 14 -33 38 55 321 216 174 26 62 -77 187 189 15 118
2514 118 -27 136 -108 -100 -32 -161 -57 -32 58 -223 -66 -52 -125 97 19 43 157 -74 -11 -165 248 36 42 -91
2538 -91 252 21 -6 137 -196 343 362 183 -24 130 211 81 -23 11 -42 -147 -3 181 -152 -24 -28 -308 -263
2561 -263 -330 -177 -206 160 -8 -66 -131 93 85 209 150 149 -47 -59 206 -62 148 57 334 293 360 -157 -201 95 -14
2586 -14 102 32 -319 4 -248 131 -100 -136 -109 56 41 -54 -96 -269 361 108 -189 -257 83 -44 193 -59 321
$$ packed form
2421A69k23J94j09j30K16m21K50Q7m39N40l46k3M8j3L71k20J30j13j55J70LM0
2443B6j50K91P2j78k03K62o3j33J81j96O2j40L10j81m5J13o3j12N4qL1L2j2J1
2467c9j35K59l09L78rj69J35J7Q1J86k97r7K5K78j9k86M23n97J22K09j42k5r1
2490a02j73K5O4O8Q2m0J53j24j25J48L8m7P1J7K66j05m2j48L6j39K64Kj74J03
2514A18j45J63k44QO8j29J04K5R0k81J57J4p3K22p8K4J14k31O3j54M13k12Oj33
2538i1L43k31k7J43l33N39J9j79k07J54Q1j30j04L4n3j05J44J84l33J28mk80M5
2561b63o7J53k9L66j68n8o5K24qJ24n9jj96j2K65k68K10r1K77m1O7n17m4K96j09
2586a4J16p0l51L23k52L79k31l6K7J65j5r5m2j73O30k53k97o8L40j27K37k52L80
$$ plain form
2609 321 -219 -33 387 -150 -207 82 -139 90 29 -419 -138 -208 -118 44 -77 162 -330 -366 -64 123 -129 181
2631 181 10 -11 475 239 146 -144 96 160 -193 -105 -59 68 192 44 -172 212 -18 -316 -5 67 -108 -129
2653 -129 -171 -133 -15 -122 43 -269 -303 -17 -145 93 176 325 44 92 -179 201 95 -14 210 -70 -104 143
2675 143 83 -108 253 81 -97 -196 -26 -125 -90 -169 -98 -82 154 -98 -193 -66 -282 -67 -27 -218 -18 -23 142 12
2699 12 -100 208 -42 6 89 208 -36 15 -31 61 -61 248 -45 67 54 251 -85 -108 -5 207 -83 97 -118
2722 -118 -150 -257 -22 212 -123 -140 -256 160 -24 55 -126 156 33 104 -33 94 30 -62 55 121 -64 -199
2744 -199 -8 141 108 -55 -44 0 -246 -289 -236 202 140 -160 -137 110 -29 -162 68 68 -147 -49 63 69 -177 -98
2768 -98 -113 154 419 180 -206 -257 94 -45 -10 132 -21 56 64 -83 78 29 -127 -325 -52 -214 -126 -107 18
$$ packed form
2609C21n40J86M20n37n7K89k21K29o1m48K81p0R0J62j21K39m92l6L02J87k52L10
2631A81j71k1M86k36r3k90K40O4l53Q8M6J27J24j48k16L84k30k98L11P2j75k1
2653a29m2L8J18j07J65l12l4K86j28K38Q3J49k81M8k71L80j06j09K24k80l4K47
2675A43o0j91L61j72j78r9J70r9L5p9P1J6K36k52r5J27k16K15M0j91K00nJ65j30
2699A2j12L08k50M8Q3J19k44N1m6R2j22L09k93J12j3J97l36k3J03K12k90J80k15
2722a18l2j07K35K34l35j7j16M16j84P9j81K82j23P1j37J27o4r2J17O6j85j35
2744a99J91J49l3j63J1M4k46m3N3M38o2l00K3K47j39j33K30%k15R8J12Ok46P9
2768i8j5K67K65k39l86n1L51j39L5J42j53P7Qj47J61m9j56j98K73j62Q8J9J25
$$ plain form
2791 18 -6 -24 148 -154 19 125 348 82 194 77 -227 -50 16 74 -25 251 -89 90 -35 93 47 77 -216
2814 -216 -60 -68 -49 99 -48 -169 -124 -14 -267 -9 146 123 -207 -41 54 -37 -164 10 29 254 63 207 8
2837 8 55 12 124 -46 -39 258 202 19 128 -48 -183 230 -20 101 -203 173 95 -336 -28 -185 21 156 12
2860 12 -23 -122 154 -93 359 201 241 -59 22 -40 -52 -105 -104 206 298 -217 60 85 10 -158 -117 -216 197 -56 12
2885 12 121 -60 -97 96 -104 119 118 73 26 -88 -8 -83 122 -31 -26 -125 71 -61 56 43 82 -15 69 128 -9
2910 -9 -29 -114 -66 -106 68 57 -3 -249 -33 -24 -77 137 -50 -87 -105 70 142 -100 240 36 227 157 -195 226 -197
2935 -197 291 36 155 -44 48 197 -18 -71 -74 86 -165 -191 71 -141 -107 123 -126 -58 -80 25 -45 -204 193
2958 193 40 95 261 243 19 64 41 -235 301 34 182 -27 63 116 -25 70 -163 -166 71 156 -274 -24 126
$$ packed form
2791A8k4j8J72l02J73J06K23k66J12j17l04J77O6N8r9K76l40J79j25J28m6L0k93
2814b16J56qJ9J48j47j21M5J10k53K58J55k3l30J66R5r1j27J74J9K25j91J44j99
2837HM7m3J12j70PK97n6j83J09j76j35M13k50J21l04L76p8m31L08j57K06J35j44
2860A2l5r9K76k47M52j58M0l00Q1o2j2n3JL10R2n15K77K5p5j68M1r9M13k53O8
2885A2J09j81l7J93k00K23jm5m7j14Q0p5K05j53Nr9J96j32J17j3L9r7Q4N9j37
2910ik0q5M8m0J74j1o0k46K16Rn3K14j87l7j8J75P2k42L40k04J91p0l52M21m23
2935a97M88k55J19j99R2J49k15n3lJ60k51k6K62k12L4K30k49O8k2J05p0j59L97
2958A93j53N5J66j8k24M5k3k76N36k67J48k09R0N3j41R5k33lK37Q5m30K50J50
$$ plain form
2981 126 -22 -153 207 -11 -79 -94 108 -77 27 145 -229 60 112 99 -62 53 208 -9 254 15 14 92
3003 92 -16 -105 63 86 -174 -53 -33 -91 -300 125 93 -41 27 186 -149 -38 216 -28 100 44 285 56 1
3026 1 -147 80 -91 -150 100 13 160 123 -153 202 -73 62 -296 -98 55 -326 172 -28 -12 -70 -188 -267 -30
3049 -30 122 430 -399 50 304 -241 30 -6 73 -81 201 345 -364 -50 323 -170 141 107 186 -4 240 -118
3071 -118 -76 -45 -80 -157 -43 161 -46 -244 74 274 -176 -120 -25 -110 125 125 -167 198 47 -142 -244 -146 -38
3094 -38 82 102 161 71 -68 155 -179 -34 97 243 -7 -199 47 -57 -199 80 -254 -351 -102 -325 -152 -98
3116 -98 21 -58 -222 11 103 -22 -61 -233 33 124 283 -45 64 190 15 -198 -19 -110 -103 -16 238 -215 5
3139 5 302 18 -107 -223 -140 -147 1 -137 -77 -122 -1 138 -154 190 -45 211 172 155 142 -103 65 32 -34 -128
$$ packed form
2981A26j48j31L60k18o8j5K02j85J04J18l74K89N2j3j61J15J55k17K63k39jP8
3003I2j08q9J68K3k60J21K0n8k09M25l2j34O8J59l35J11K54k44J28n6K41k29n5
3026Aj48K27j71n9K50q7J47l7k76L55k75J35l58J98J53l81M98k00J6n8j18p9K37
3049c0J52L08q29M49K54n45K71l6P9j54K82J44p09L14L73m93L11l4P9j90K44l58
3071a18M2L1l5p7J14K04k07j98L18K00m50N6R5q5K35%k92L65j51j89j02R8J08
3094c8J20K0N9r0j39K23l34J45J31J46k50j92K46j04j42K79l34r7K49k23J73N4
3116i8J19p9j64K33R2j25l9j72K66R1J59l28J09J26j75k13J79r1PQ7K54m53K20
3139EK97k84j25j16Q3pJ48j38O0m5J21J39k92L44k35K56l9j7j3k45J68l3o6r4
$$ plain form
3163 -128 -162 -228 -296 165 1 -294 -29 -301 -92 26 16 251 -49 263 -16 -53 26 -49 12 -23 36 -250 0
3186 0 86 -297 -81 154 7 -124 359 18 159 103 291 -45 34 214 -222 166 126 59 -287 -139 -245 -16
3208 -16 -70 276 -86 -44 -113 156 123 50 -88 -11 105 80 -33 -30 66 -10 -90 165 -83 104 157 122 123 157 -142 81
3234 81 91 -32 117 57 154 37 145 -170 25 67 -185 -85 119 -25 252 92 -105 -38 34 -10 40 10 20 94
3258 94 179 158 95 13 -175 13 136 45 49 -103 -128 91 -18 -215 103 -83 -198 -311 -39 194 166 136 34 -35
3282 -35 106 56 38 92 211 -236 62 54 145 -73 65 -120 -56 111 7 36 -116 23 48 -35 89 37 -152 -96
3306 -96 -269 -84 -158 -251 -12 92 -87 -149 -127 164 -119 156 -165 109 138 119 166 -59 -125 54 -110 -139 195
3329 195 -120 129 -344 -87 80 -210 -235 175 -111 55 238 -27 161 -31 -136 -145 262 73 85 -124 167
$$ packed form
3163a28l4o6o8M61j64k95K65k72K09J18j0K35l00L12k79l7P9p5O1l5N9k86K50
3186@Q6l83K16K35j47j31M83l41J41n6J88l36P9J80m36L88m0o7l46J48j06K29
3208a6n4L46l62M2o9K69l3p3j38P7J16k5j13LR6p6q0K55k48J87N3l5JL4k99K23
3234H1J0j23J49o0R7j17J08l15J95M2k52J00K04j44K77j60j97O7P2m4N0l0J0P4
3258I4Q5k1o3q2j88J88J23r1Mj52k5K19j09j97L18j86j15j13K72K33k8l0j02o9
3282c5J41n0j8N4J19m47K98qR1k18J38j85O4J67j04K9j52J39K5q3J24n2j89N6
3306i6j73J85p4r3K39J04j79o2K2K91k83K75l21K74K9j9M7k25o6J79j64k9L34
3329A95l15K49m73K57J67k90k5M10k86J66J83k65J88j92j05rM07j89J2k09K91
$$ plain form
3350 167 -130 268 -53 -258 -126 -90 -116 -130 -9 168 -121 -100 -32 143 -277 -210 -179 -227 -211 -85 257 42 14
3373 14 104 -148 -104 -160 -280 -113 -18 204 -201 -108 -25 -41 505 97 -369 -257 -108 -308 278 98 -128 -190 79
3396 79 -175 -133 111 -164 -188 -219 85 22 -126 92 -33 116 10 -172 11 56 227 -155 34 -13 159 113 35
3419 35 199 53 -158 -41 -128 -118 87 -212 108 -102 -294 15 143 -236 -321 256 -22 -34 31 -15 -38 -52 93
3442 93 -39 -226 -93 173 20 206 163 135 50 -47 28 47 148 -258 49 267 -75 267 200 -62 -99 3 -156
3465 -156 -11 -12 -119 60 -17 -269 -253 60 46 -174 -143 23 179 -126 -138 -17 -12 -5 -13 -49 59 -135 -166 190 -172
3490 -172 95 9 -48 101 177 50 88 80 83 -163 -61 -105 8 -48 -12 114 -124 103 -8 -142 57 30 70 144 -171
3515 -171 368 187 19 107 -224 -58 -15 -63 -93 18 1 61 -329 106 -62 -59 36 117 71 39 111 -146 -194 -49 -125
$$ packed form
3350A67k97L98l21k05J32L6k6j4J21J77k89K1O8J75m20O7L1m8J6J26L42k15k8
3373A4R0k52M4n6j20J67R5K22m05R3Q3j6N46m08m66J12J49k00N86j80k26o2K69
3396G9k54M2K44k75k4l1L04o3j48K18j25J49j06j82J83M5J71l82J89m7J72m6p8
3419C5J64j46k11J17q7J0K05k99L20k10j92L09J28l79q5N77k78j2O5m6k3j4J45
3442I3j32j87J33K66j53J86m3k8q5r7P5J9J01m06L07K18l42L42o7k62l7J02j59
3465a56J45jj07J79p7k52J6L13j4k20L1J66J56l05j2J21NPql6J08j94l1L56l62
3490a72K67q6n7J49P6j27L8qLk46J02m4J13n6L6J26k38K27j11j34J99k7M0P4l15
3515a71N39j81j68Q8l31J66M3m8l0J11j7O0l90M35j68LR5Q1m6l2P2k57m8J45p6
$$ plain form
3540 -125 -314 229 296 -48 125 47 -175 49 18 204 56 122 253 -24 -132 43 -57 -252 90 258 103
3561 103 66 -175 218 309 58 -120 5 -6 -107 66 48 -57 -105 -157 276 -86 189 83 43 55 202 -264 -181
3584 -181 -19 46 47 -139 -137 -71 -238 -12 -60 -104 101 -188 -233 -186 107 -83 -103 -61 14 2 -236 292 -290 73 170
3609 170 108 116 -4 161 -57 -91 -2 88 -153 -73 -83 -49 19 -191 5 132 55 -164 -148 -48 -164 24 28 -58 7
3634 7 86 -59 24 143 -10 3 -27 303 154 -144 -75 130 -155 -87 377 32 -122 -207 -261 16 -127 -98 -55 -16
3658 -16 239 78 37 -55 60 279 39 123 -119 275 19 -25 -53 89 -113 103 -238 34 9 280 83 24 67
3681 67 -65 189 8 72 17 -75 3 90 -43 108 10 54 -102 30 101 78 -164 -180 -172 69 280 -80 68 -69
3705 -69 135 -30 58 44 -48 154 -32 68 89 -65 205 188 -5 19 -60 193 54 -53 -84 -142 200 169 89 224
$$ packed form
3540a25j89N43O7l44J73p8k22K24l1J86j48O6J31k77j08J75j00j95L42J68j55
3561A03l7k41L93R1k51j78J25j1j01J73j8j05m8n2M33l62K75j06m0J2J47m66Q3
3584a81J62O5Jj86KO6j67K26m8m4K05k89m5M7K93j90k0M2P5j2k38N28n82L63R7
3609A70o2Qj20J65k18l4Q9R0k41Q0j0L4O8k10J96J27p7k19J6J00j16J88Mq6O5
3634GP9j45Q3J19j53J3l0L30j49k98O9K05k85O8M64l45j54q5n4K77j43K9M3L9
3658a6K55j61m1r2J15K19k40Q4k42L94k56m4k8J42k02K16l41K72k5K71j97n9M3
3681F7j32K54j81O4n5r2P8Q7j33J51r8M4j56J32P1k3k42j6QK41K11l60J48j37
3705f9K04j65Q8j4r2K02j86J00K1j54K70j7j93K4p9K53j39j07l1n8L42l1q0J35
$$ plain form
3729 224 -133 124 205 18 87 29 -133 -36 -162 -27 208 -63 307 87 -189 33 76 -17 -32 -67 73 35 -66
3752 -66 -177 22 46 -162 -45 -79 -10 96 -73 72 123 115 -157 60 -214 -60 29 91 59 -129 -116 113 -6 101
3776 101 284 5 -213 44 -96 53 -198 -167 -189 -250 -11 -85 66 -165 -45 -314 -21 12 -34 -82 -39 -28 118
3799 118 240 -194 94 218 -136 118 91 234 48 61 -163 -149 -177 98 -103 -145 9 -90 123 -215 -136 173
3821 173 -158 147 175 79 171 206 -16 -284 103 -177 -34 -189 -16 115 7 88 358 187 169 34 152 -107
3843 -107 0 15 -86 -16 5 1 -94 130 -117 -61 -140 -213 -203 88 -163 -23 -140 -202 11 96 -80 277 203 3
3867 3 42 -77 -177 -232 -181 62 -93 77 142 -91 35 -126 140 -45 -58 66 -93 108 -144 -54 -301 -37 -242
3890 -242 -58 159 55 14 -69 131 -156 58 23 262 339 -95 124 -84 -69 1 -91 131 51 -20 -179 -178 52 172
$$ packed form
3729B24l57K57Q1j87O9n8j62R7j26J35K35k71L70k20k76K22M3r3j5l5J40l8j01
3752f6j11J99K4k08J17l4O9J06j69J45N1qk72K17k74J54Q9O2l2j88J3K29j19J07
3776A01J83k79k18K57j40J49k51L1k2o1K39p4J51k31J20k69K93L3m6m8M3J1J46
3799A18J22m34K88J24l54K54k7J43j86J3k24J4k8K75k01m2J54r9K13l38P9L09
3821A73l31L05K8r6R2L5k22k68L87k80J43j55J73J31j08Q1K70j71j8j35J18k59
3843a07J07J5j01P0K1mr5K24k47N6p9p3J0K91k51J40j17o2K13Q5j76L57p4k00
3867CL9j19j00n5N1K43j55J70O5k33J26j61K66j85j3J24j59K01k52R0k47K64k05
3890b42J84K17j04m1q3K00k87K14l5K39P7m34K19k08J5P0r2K22q0p1j59JK30J20
$$ [...]
8191b0
##END NTUPLES=NMR FID
##END=
