##TITLE=1H_DE-14HK2HCl
 D2O
 8 sc, 
 23.10.2023
##JCAMPDX= 6.0         $$ Bruker NMR JCAMP-DX V2.0
##DATA TYPE= NMR FID
##DATA CLASS= NTUPLES
##ORIGIN= UXNMR, Bruker Analytische Messtechnik GmbH
##OWNER= root
$$ XWIN-NMR		Version 3.5
$$ Mon Oct 23 16:38:09 2023 Russian Standard Time (UT+4h)  she@DPX200
##.OBSERVE FREQUENCY= 200.13135
##.OBSERVE NUCLEUS= ^1H
##.DELAY= (6, 6)
##.ACQUISITION MODE= SIMULTANEOUS
##.ACQUISITION SCHEME= undefined
##.AVERAGES= 8
##.DIGITISER RES= 18
##SPECTROMETER/DATA SYSTEM= spect
##.PULSE SEQUENCE= zg30
##.SOLVENT NAME= D2O
##.SHIFT REFERENCE= (INTERNAL, D2O, 0, 15.7039)
##AUDIT TRAIL= $$ (NUMBER, WHEN, WHO, WHERE, WHAT)
$$ ##TITLE= Audit trail, XWIN-NMR		Version 3.5
$$ ##JCAMPDX= 5.01
$$ ##ORIGIN= Bruker BioSpin GmbH
$$ ##OWNER= she
$$ F:/spectra/data/she/nmr/H-F/1/audita.txt
$$ ##AUDIT TRAIL=  $$ (NUMBER, WHEN, WHO, WHERE, WHAT)
(   1,<2023-10-23 16:37:09.89 +0400>,<she>,<DPX200>,
      <created by zg, POWCHK disabled, PULCHK disabled
       configuration hash MD5:
       00 E9 B6 7A A2 85 ED C7 34 08 36 98 17 FE 4E 26
       data hash MD5: 16K
       CC 29 14 6A 1E 5B 8A 33 70 28 A2 2C 00 01 BE 20>)
$$ ##END=
$$ 
$$ hash MD5
$$ 80 49 98 54 D0 80 3C 4F 8A 26 5A 23 DB 45 BA 41
##$RELAX= 
##$RELAX= 
##$RELAX= 
##$RELAX= 
##$RELAX= 
##$RELAX= 
$$ Bruker specific parameters
$$ --------------------------
##$DU= <F:/spectra>
##$EXPNO= 1
##$NAME= <H-F>
##$PROCNO= 1
##$TYPE= <nmr>
##$USER= <she>
##$AMP= (0..31)
100 100 100 100 100 100 100 100 100 100 100 100 100 100 100 100 100 100 
100 100 100 100 100 100 100 100 100 100 100 100 100 100 
##$AQSEQ= 0
##$AQ_mod= 1
##$AUNM= <au_zg>
##$AUTOPOS= <>
##$BF1= 200.13
##$BF2= 200.13
##$BF3= 200.13
##$BF4= 200.13
##$BF5= 200.13
##$BF6= 200.13
##$BF7= 200.13
##$BF8= 200.13
##$BYTORDA= 1
##$CFDGTYP= 0
##$CFRGTYP= 5
##$CHEMSTR= <none>
##$CNST= (0..31)
1 1 145 1 1 1 1 1 1 1 1 1 1 1 1 1 1 1 1 1 1 1 1 1 1 1 1 1 1 1 1 1 
##$CPDPRG= <>
##$CPDPRG1= <>
##$CPDPRG2= <>
##$CPDPRG3= <>
##$CPDPRG4= <mlev>
##$CPDPRG5= <mlev>
##$CPDPRG6= <mlev>
##$CPDPRG7= <mlev>
##$CPDPRG8= <mlev>
##$CPDPRGB= <>
##$CPDPRGT= <>
##$D= (0..31)
0 1.2 0 0 0 0 0 0 0 0.06 0 0.03 0 0 0 0 0.0002 0 0 0 0 0 0 0 0 0 0 0 0 
0 0 0 
##$DATE= 1698064629
##$DBL= (0..7)
120 120 120 120 120 120 120 120 
##$DBP= (0..7)
150 150 150 150 150 150 150 150 
##$DBP07= 0
##$DBPNAM0= <>
##$DBPNAM1= <>
##$DBPNAM2= <>
##$DBPNAM3= <>
##$DBPNAM4= <>
##$DBPNAM5= <>
##$DBPNAM6= <>
##$DBPNAM7= <>
##$DBPOAL= (0..7)
0.5 0.5 0.5 0.5 0.5 0.5 0.5 0.5 
##$DBPOFFS= (0..7)
0 0 0 0 0 0 0 0 
##$DE= 6
##$DECBNUC= <off>
##$DECIM= 32
##$DECNUC= <off>
##$DECSTAT= 4
##$DIGMOD= 1
##$DIGTYP= 9
##$DL= (0..7)
0 120 120 120 120 120 120 120 
##$DP= (0..7)
150 150 150 150 150 150 150 150 
##$DP07= 0
##$DPNAME0= <>
##$DPNAME1= <>
##$DPNAME2= <>
##$DPNAME3= <>
##$DPNAME4= <>
##$DPNAME5= <>
##$DPNAME6= <>
##$DPNAME7= <>
##$DPOAL= (0..7)
0.5 0.5 0.5 0.5 0.5 0.5 0.5 0.5 
##$DPOFFS= (0..7)
0 0 0 0 0 0 0 0 
##$DQDMODE= 0
##$DR= 18
##$DS= 0
##$DSLIST= <SSSSSSSSSSSSSSS>
$$ [...]
##$SUBNAM2= <"">
##$SUBNAM3= <"">
##$SUBNAM4= <"">
##$SUBNAM5= <"">
##$SUBNAM6= <"">
##$SUBNAM7= <"">
##$SUBNAM8= <"">
##$SUBNAM9= <"">
##$SW= 18.05172834244
##$SWIBOX= (0..15)
0 0 2 0 0 0 0 0 0 0 0 0 0 0 0 0 
##$SW_h= 3612.71676300578
##$TD= 16384
##$TD0= 1
##$TE= 0
##$TE2= 300
##$TE3= 300
##$TEG= 300
##$TL= (0..7)
0 120 120 120 120 120 120 120 
##$TP= (0..7)
150 150 150 150 150 150 150 150 
##$TP07= 0
##$TPNAME0= <>
##$TPNAME1= <>
##$TPNAME2= <>
##$TPNAME3= <>
##$TPNAME4= <>
##$TPNAME5= <>
##$TPNAME6= <>
##$TPNAME7= <>
##$TPOAL= (0..7)
0.5 0.5 0.5 0.5 0.5 0.5 0.5 0.5 
##$TPOFFS= (0..7)
0 0 0 0 0 0 0 0 
##$TUNHIN= 0
##$TUNHOUT= 0
##$TUNXOUT= 0
##$USERA1= <user>
##$USERA2= <user>
##$USERA3= <user>
##$USERA4= <user>
##$USERA5= <user>
##$V9= 5
##$VALIST= <valist>
##$VCLIST= <CCCCCCCCCCCCCCC>
##$VD= 0
##$VDLIST= <DDDDDDDDDDDDDDD>
##$VPLIST= <PPPPPPPPPPPPPPP>
##$VTLIST= <TTTTTTTTTTTTTTT>
##$WBST= 1024
##$WBSW= 4
##$XGAIN= (0..3)
0 0 0 0 
##$XL= 0
##$YL= 0
##$YMAX_a= 985946
##$YMIN_a= -976932
##$ZGOPTNS= <>
##$ZL1= 120
##$ZL2= 120
##$ZL3= 120
##$ZL4= 120
##$ABSF1= 10
##$ABSF2= 0
##$ABSG= 5
##$ABSL= 3
##$ALPHA= 0
##$AQORDER= 0
##$ASSFAC= 0
##$ASSFACI= 0
##$ASSFACX= 0
##$ASSWID= 0
##$AUNMP= <proc_1d>
##$AZFE= 0.1
##$AZFW= 0.1
##$BCFW= 1
##$BC_mod= 2
##$BYTORDP= 1
##$COROFFS= 0
##$CY= 11.3945322036743
##$DATMOD= 1
##$DC= 2
##$DFILT= <>
##$DTYPP= 0
##$F1P= 15.7292609196834
##$F2P= 12.9074282941183
##$FCOR= 0.5
##$FTSIZE= 0
##$FT_mod= 4
##$GAMMA= 1
##$GB= 0.15
##$INTBC= 1
##$INTSCL= 1
##$ISEN= 128
##$LB= 0.24
##$LEV0= 0
##$LPBIN= 0
##$MAXI= 10000
##$MC2= 0
##$MEAN= 0
##$ME_mod= 0
##$MI= 1.114404
##$NCOEF= 0
##$NC_proc= 0
##$NLEV= 6
##$NOISF1= 3.799351
##$NOISF2= 2.8
##$NSP= 1
##$NTH_PI= 0
##$NZP= 0
##$OFFSET= 15.70392
##$PC= 1
##$PHC0= -23157.64
##$PHC1= 13.2527
##$PH_mod= 1
##$PKNL= yes
##$PPARMOD= 0
##$PSCAL= 0
##$PSIGN= 0
##$REVERSE= no
##$SF= 200.130013532006
##$SI= 16384
##$SIGF1= 3
##$SIGF2= 2
##$SINO= 400
##$SIOLD= 16384
##$SREGLST= <1H.CDCl3>
##$SSB= 0
##$STSI= 0
##$STSR= 0
##$SW_p= 3612.71676300578
##$SYMM= 0
##$S_DEV= 0
##$TDeff= 0
##$TDoff= 0
##$TI= <>
##$TILT= no
##$TM1= 0
##$TM2= 0
##$TOPLEV= 0
##$USERP1= <user>
##$USERP2= <user>
##$USERP3= <user>
##$USERP4= <user>
##$USERP5= <user>
##$WDW= 1
##$XDIM= 8192
##$YMAX_p= 0
##$YMIN_p= 0
$$ End of Bruker specific parameters
$$ ---------------------------------
##NTUPLES= NMR FID
##VAR_NAME=  TIME,          FID/REAL,        FID/IMAG
##SYMBOL=    X,             R,               I
##VAR_TYPE=  INDEPENDENT,   DEPENDENT,       DEPENDENT
##VAR_FORM=  AFFN,          ASDF,            ASDF
##VAR_DIM=   8192,          8192,            8192
##UNITS=     SECONDS,       ARBITRARY UNITS, ARBITRARY UNITS
##FACTOR=    0.0002768,     1,               1
##FIRST=     0,             0,               0
##LAST=      2.2672688,     0,               0
##MIN=       0,             -976932,         0
##MAX=       2.2672688,     985946,          0
$$ Real data points
##PAGE= N=1
##DATA TABLE= (X++(R..R)), XYDATA
$$ [...]
3051f351l66K135M202M364K792m42k726m270m282j923R21L254M410L510J780j466
$$ -6351 -6717 -4582 -380 3984 6776 6334 3608 -662 -4944 -6867 -5946 -2692 1718 5228 7008 5542
3067E542l789m500l225p67J946M046M320K782J30k235m458m280k402L85L177M500
$$ 5542 1753 -2747 -5972 -6739 -4793 -747 3573 6355 6485 4250 -208 -4488 -6890 -6505 -3328 1172
3083A172M042J802j034l756m263l655r91J559L811M209L259M97k320m066m003
$$ 1172 5214 7016 5982 2226 -2037 -5692 -6683 -5124 -1313 2896 6155 6652 4332 266 -3737
3098c737k846P6K840M124M030K302n26l379m132l730j817J046L862M302L289J199
$$ -3737 -6583 -6507 -3667 457 4487 6789 6263 2884 -1248 -4978 -6795 -5749 -1887 2415 5704 6903
3114F903j967l816m205l148m08K400M140L829L020m48k761m229l938k224P89L406
$$ 6903 4936 1120 -3085 -6233 -6641 -4241 -101 3728 6748 6300 3539 -690 -4628 -6852 -6063 -2657
3130b657M211L841J376j628l310m439l313r17K237L720M071L336J1k394m149m140
$$ -2657 1554 5395 6771 5143 1833 -2606 -5919 -6836 -4599 -879 3192 6528 6539 4145 -4 -4144
3146d144k282K63K734M713L619J715p68l580m222l616j359J572L674M193L469
$$ -4144 -6426 -6163 -3429 1284 4903 6618 5850 2270 -1952 -5568 -6927 -5355 -1681 2512 5981
3161E981P71k241m065m178k665j73K761M426L863K273o40l279m362l584j797J590
$$ 5981 6752 4511 446 -3732 -6397 -6570 -3809 617 4480 6753 6113 2834 -1528 -5112 -6909 -5319
3177e319L140M365L273J242j282m343m139k965n64K269L824M555K172q5k691m157
$$ -5319 -2179 2186 5459 6701 5419 1076 -3063 -6028 -6592 -4323 -499 4056 6228 6143 3452 -705
3193g05m011j856P90L142M285L572J281j220l667m036l349o69J640L779M248L041
$$ -705 -4716 -6572 -5782 -2640 1645 5217 6498 5278 1611 -2425 -5774 -6443 -4803 -1024 3224 6265
3209F265L33k286m299m155k523M97K983L926M194J582q29l238m239l562j437J519
$$ 6265 6598 4312 13 -4142 -6665 -6168 -3185 741 4935 6517 5688 2450 -1789 -5351 -6788 -5269
3225e269L752M534L017O93k181l912m235k859RK494M324L811K306m30l092m278
$$ -5269 -1517 3017 6034 6727 4546 634 -3601 -6460 -6451 -3957 367 4178 6484 6054 2962 -1316
3241a316l642j797J161L823L964L260J077j630l545m254k994p32K235M071M105
$$ -1316 -4958 -6755 -5594 -1771 2193 5453 6530 4900 1355 -2899 -5893 -6625 -4390 -319 3786
3256C786K430j54k422m236m005k008O27L207M378L634J405j135l801m293l239
$$ 3786 6216 6062 3640 -596 -4601 -6609 -5982 -2775 1603 5237 6642 5507 1706 -2587 -5826
3271e826o88J907L751M052K947L3k149m093l955k335O7L245M063L751J866j031
$$ -5826 -6514 -4607 -856 3196 6143 6176 4027 -66 -4021 -6356 -6289 -3044 1019 4770 6636 5605
3287E605l186m148l635j235J266L832M274K902Q34j944l909m048k613l18K418
$$ 5605 2419 -1729 -5364 -6599 -5333 -1501 2773 5675 6509 4565 656 -3392 -6005 -6323 -3905
3302c905L999L987K388n43k762m107l767j576R24L179M254L423Q52j411l681m071
$$ -3905 94 4081 6469 5926 3164 -943 -4710 -6286 -5362 -2183 2071 5494 6346 4935 1254 -2817
3318b817k997l54J778M111L856K578M7k440m343l753k091O43L127L925L834J262
$$ -2817 -5814 -6168 -4390 -279 3577 6155 6202 3762 -581 -4334 -6425 -5782 -2655 1270 5104 6366
3334F366r90l558m022l383q37J776L937L874K591L88j995m006l965k446L23K848
$$ 6366 5376 1818 -2204 -5587 -6424 -4648 -711 3163 5754 6142 4147 141 -3824 -6270 -5947 -3099
3350c099M059L674J625q34k967m338l426j209J447L596M083L053P00k059l760
$$ -3099 960 4634 6259 5425 2458 -1880 -5306 -6515 -5068 -1472 2611 5664 6364 4305 545
3365E45l841k838j62K512L898L985K169l32l199l892l847j587J292L153M211L169
$$ 545 -3296 -6134 -6296 -3784 114 4099 6268 5936 2737 -1155 -5002 -6589 -5297 -2144 2067 5236
3381E236J086j904l356m051k584n20J955L838L895K421n5k361m406l456j926P21
$$ 5236 6322 4418 1062 -2989 -5573 -6093 -4138 -300 3595 6016 5961 3600 -806 -4262 -6188 -5467
3397e467L106L991L368J243j167l376l863l467p23J727L885L710K822K69k239
$$ -5467 -2361 1630 4998 6241 5074 1698 -2165 -5632 -6355 -4628 -743 2967 5789 6058 3819
3412C819l867l553k299k38L085L963L515J769q07l078l610l773j079J409L194
$$ 3819 -48 -3601 -5900 -6138 -3053 910 4425 6194 5387 2309 -1301 -5074 -6153 -4744 -1550
3427a550L894K988Q63j923l664m042k278l4K163L797L861J981l38k899l923l334
$$ -1550 2344 5332 6195 4272 608 -3434 -5712 -5746 -3583 214 4075 6056 5718 2819 -1104 -4438
3443d438j795R40L138L959L426R78j515l431m187k413p43J845L973L492K338L06
$$ -4438 -6233 -5293 -2155 1804 5230 6208 4693 1262 -2925 -5338 -6081 -4236 -263 3229 5567 5873
3459E873k544l725l794j624M13K980L508L447J561j166l041m173k866j056J802
$$ 5873 3329 -396 -4190 -5814 -5401 -2421 1087 4534 6095 4929 1888 -2285 -5151 -6207 -4405
3474d405L275L986K696K93k156l460l899k499O35K549L858L663J633p33l201l859
$$ -4405 -1130 2856 5552 5845 3689 229 -3670 -6169 -5534 -2985 873 4536 6169 5436 2235 -1624
3490a624l287j037J268L250L904K939M52j756l639l687k326j04K386L455L723
$$ -1624 -4911 -5948 -4680 -1430 2474 5413 5865 4109 470 -3217 -5543 -5647 -3261 194 3917
3505C917K014n68k355m139l126j864Q93L278L775L303J066j948l077l800k790
$$ 3917 5931 5363 3008 -1131 -4257 -6121 -5228 -1950 1825 5128 6194 4246 1169 -2631 -5421
3520e421n30J963L623L752K053N26k788l619l731j656N98K645L749L078J703j098
$$ -5421 -5951 -3988 -365 3387 5440 5966 3178 -441 -4172 -5828 -5230 -2585 1164 4242 5945 4847
3536D847l048l889k854q02J209L432L955K434N01k011l622l709k075K16K469L683
$$ 4847 1799 -2090 -4944 -5746 -4537 -1105 2850 5284 5785 3774 152 -3557 -5632 -5416 -2947 736
3552G36L289J727n93k927l930k803j118J088K909L833K765P33j511l432m001k275
$$ 736 4025 5752 5159 2232 -1698 -4501 -5619 -4531 -1622 2211 4976 5709 4198 766 -3235 -5510
3568e510oK118L408L445K160j35k602l807l417j503R77K708L875L101J095j685
$$ -5510 -5516 -3398 10 3455 5615 5480 2878 -929 -4346 -5849 -4872 -2164 1711 4812 5907 4222
3584D222l143l548k792m80J991L429L306K363O7k301l623l250k078N77K729L720
$$ 4222 1079 -2469 -5261 -5741 -3750 -321 2985 5348 5415 3114 -509 -3759 -5837 -5260 -2531 1189
3600A189L169J448j050l062l652k835j007J591L255L526K416O27k029l402l632
$$ 1189 4358 5806 4756 1694 -1958 -4793 -5800 -4209 -954 2572 4988 5615 3586 184 -3448
3615c448j874Q8K154L648L386J460m45k766l505l235r29Q56K852L777K849P78
$$ -3448 -5322 -5234 -3080 568 3954 5414 4969 2203 -1302 -4537 -5466 -4610 -1758 2019 4868 5646
3631E646j423l396l585k556j86K158L282L623J757k32k301l462l141j496N14K749
$$ 5646 4223 827 -2758 -5314 -5500 -3342 -60 3563 5320 5088 2787 -675 -3816 -5312 -4798 -2049
3647b049L632K834J266j161l083l937k488m06J640K844L816K207K01j939l706
$$ -2049 1583 4417 5683 4522 1439 -2498 -4986 -5392 -3752 -908 2908 5115 5316 3377 -329
3662c29l201j762L73K222L738L119J385q78k818l546k854r88J180L087L554K732
$$ -329 -3530 -5292 -4919 -2697 1041 4160 5545 4667 1849 -1697 -4551 -5539 -4359 -1272 2282 5014
3678E014N14k089k993l575k021L9K064L689K993J612k71k471l908k787j372J047
$$ 5014 5528 3439 446 -3129 -5150 -5111 -3047 642 3635 5247 4976 2505 -1403 -4190 -5562 -4515
3694d515L070L494K444R44j410l014l768k288k52J935L193L386K064j81k341l342
$$ -4515 -1445 2049 4493 5437 4027 1013 -2755 -5043 -5295 -3360 -167 3219 5283 5102 2761 -581
3710e81l260j453N81K820L172L164J103j330k634l619k659n96J516L118L422K128
$$ -581 -3841 -5294 -4713 -1893 1279 4443 5546 4216 1582 -2037 -4696 -5292 -3776 -658 2764 4892
3726D892K86k012l166l473j637N70J982L636K643J558q51k415l585k690r67J065
$$ 4892 5178 3166 0 -3473 -5110 -4540 -2558 1078 3721 5279 4428 2013 -1572 -4262 -5229 -4164
3742d164L056L367K441O49j818l204l415j971J96J807L434L204J488m54k392l101
$$ -4164 -1108 2259 4700 5349 3531 327 -3088 -5059 -4863 -3056 378 3582 5070 4616 2224 -877
3758h77l163j287J102K576L453K770O93j479l036l375k016n88K089K839L505J777
$$ -877 -4040 -5327 -4225 -1649 1804 4574 5267 3788 752 -2623 -4639 -5227 -3138 -299 3206 4983
3774D983K4k200l376l070j390L61K479L696K781Q59j081k743l482k387n04J740
$$ 4983 5007 2807 -569 -3639 -5029 -4668 -2189 1507 4288 5147 4066 1323 -2159 -4546 -5050 -3310
3790c310K602L386K243R4j952l000l044k010K90K158L235K818J462n78k692l292
$$ -3310 -708 2678 4921 5015 3063 63 -2981 -4991 -4701 -2543 692 3510 4972 4394 1702 -1590
3806a590k640r94J369K612L162K913N2j348l142l181k188J12J888L340L197J384
$$ -1590 -4230 -5224 -3855 -1243 1919 4832 4884 3536 394 -2787 -4975 -4863 -2975 365 3562 4946
3822D946k97k263l302k927j399R77K556L204K788N45j091l088k893k293n54J662
$$ 4946 4649 2386 -916 -3843 -5242 -4265 -1709 1495 4283 4828 3737 649 -2244 -4537 -5091 -3429
3838c429L047L161J914M8k272l084k842j394N28K391L226K361J335q17k661l719
$$ -3429 -382 2779 4693 4741 2469 -615 -3457 -4851 -4323 -1932 1294 3655 4990 4173 1512 -2207
3854b207j929p05J058L006L219K156L66j954k909l134j605J79J938L183K937J229
$$ -2207 -4136 -4841 -3783 -777 2442 4598 4964 3010 101 -3033 -4638 -4459 -2521 662 3599 4828
3870D828n37k788l012k438r62J065K812L140K116Q15j451k895l152k214J4J814
$$ 4828 4291 1503 -1509 -3947 -4909 -3844 -1032 2108 4224 5039 3588 693 -2459 -4673 -4659 -2845
3886b845K885L063J716o17k032k978k757j317O44K650L140K427Q55j093k837l168
$$ -2845 40 3103 4819 4202 2170 -808 -3565 -4882 -4238 -1588 1552 3979 4834 3741 904 -2264
3902b264j948n16J625K819L066J791r0j865l027k861j488L15K412L048K625J316
$$ -2264 -4212 -4728 -3103 -284 2782 4573 4483 2618 -409 -3270 -4758 -4443 -2031 1017 3642 4958
3918D958j078k234l258k659m28J371K179L499J964M07j965k530k986j840Q0K271
$$ 4958 3880 1646 -1612 -4271 -4699 -3328 -1149 2350 4314 4721 2756 226 -2760 -4600 -4520 -2249
3934b249K813K880J096m35k214l329k442p29R66K434K999K210N10j426k528l023
$$ -2249 564 3444 4540 4105 1891 -1438 -3880 -4609 -3643 -1209 1790 4000 4510 3084 556 -2467
3950b467k102k8J979K638L099J328j20k059l017k691j218Q29K138K853K402Q95
$$ -2467 -4569 -4597 -2618 20 3119 4447 4327 2268 -749 -3440 -4658 -3829 -1691 1162 3564 4459
3966D459p76k736l014k134k62J370K873K854J567J84j806l065k438j606M70K271
$$ 4459 3683 947 -2067 -4201 -4463 -3093 -220 2634 4201 4385 2579 -486 -2924 -4530 -4060 -1789
3982a789K789K757Q03j131j818l064k527m19R16K926K806J885J41j340k652k968
$$ -1789 1000 3757 4560 3429 1611 -1453 -3980 -4399 -3483 -557 2249 4134 4275 2935 283 -2685
3998b685j604l6K066K692K525J196j65j948l201k059j346R76K216K831K351M46
$$ -2685 -4289 -4325 -2259 433 2958 4154 3989 2041 -1160 -3219 -4565 -3589 -1373 1458 3809 4255
4014D255r53k724k748k119P0J620K558K586J584lj923k921k552j143M88K325K878
$$ 4255 3302 578 -2170 -4289 -4219 -2599 -41 2545 4129 4126 2203 -718 -3270 -4413 -3925 -1600 1278
4031A278K244O49p44k267l012j897m48J364K494K629J704N6j602k507k613j644
$$ 1278 3522 4171 3427 1160 -1852 -3749 -4197 -2833 -339 2290 3994 4050 2448 -59 -2672 -4316
4047d316L32K186K525K446R64n20k115l035k078n69J007K375K959J682N88j523
$$ -4316 -3984 -1798 727 3173 4137 3617 1502 -1533 -3611 -4180 -3173 -798 2161 3843 4431 2908
4063B908k614l040j444K89J883K505K280J579m35k312k626k542o12Q01K090K959
$$ 2908 294 -2746 -4190 -3901 -2018 487 2767 4346 3911 1599 -1027 -3569 -4181 -3380 -1290 1669
4079A669J972L36j147k340k652j646k96J560K476K604J339o3j830k755k279j054
$$ 1669 3641 3977 2830 490 -2162 -3808 -4104 -2544 -68 2536 3875 3812 1982 -773 -3052 -4106
4095d106O03K151K489K186R39j150j963k696j924n68J130K319K997J507Mj629
$$ -4106 -3503 -1352 1137 3323 4262 3112 1149 -1547 -3471 -4039 -2909 -590 2407 3914 3918 2289
4111B289k520k467j194K54J551K843J995J342n93k195k355k246l96N04K448K522
$$ 2289 -231 -2698 -3892 -3638 -2087 756 2751 4093 3500 1305 -1050 -3296 -3692 -3188 -740 1782
4127A782J821L58j596j856k610j703N2J410K691K288J040j25j505k862k119r39
$$ 1782 3603 3961 2365 509 -2101 -3804 -3752 -2342 349 2637 3677 3552 2047 -815 -2934 -3873
4143c873P04J882K603K012N37j005j958k445k328J12J157K549K455J536m20j538
$$ -3873 -3169 -1287 1316 3328 3865 2860 902 -1543 -3871 -3759 -2602 -53 2402 3938 3518 1980
4159A980k376k252j224M37J916K220K371J111r12k147k437k022p60J242K346K459
$$ 1980 -396 -2648 -3872 -3435 -1519 701 3072 4183 3271 1124 -1313 -3335 -4095 -2853 -507 1952
4175A952J499Q5j323k197k418j255J25J425K734K138J016n95j802k360k446k71
$$ 1952 3451 3536 2213 16 -2402 -3657 -3532 -2107 627 2765 3781 3186 1384 -976 -3422 -3693
4191c693L84K278K752J766J90r67k200k352j460k33J344K438K099J237j88j720
$$ -3693 -3309 -1031 1721 3487 3677 2710 510 -1842 -3302 -3535 -2191 247 2346 3583 3395 1675
4207A675k374j767j151L60K196K060J993Q32r32k128k201j822l83J200K053K172
$$ 1675 -699 -2466 -3617 -3257 -1061 999 2992 3824 2892 764 -1437 -3259 -3642 -2442 -389 1783
4223A783J729o0j428k413k074j060L33J618K230K089Q12n93j989k287j836j51
$$ 1783 3512 3452 2024 -389 -2463 -3523 -3190 -1572 658 2747 3559 2966 977 -1310 -3146 -3297
4239c297P24K026K108J561O40j500k157k230j351J94J490K213J971Q64o7j627
$$ -3297 -2573 -547 1561 3122 3762 2262 105 -2125 -3476 -3282 -1792 421 2392 3256 3189 1562
4255A562k569j956p05N89J946K546J650L90q45k246k288j308j13J114K108K398
$$ 1562 -1007 -2963 -3668 -3079 -1133 1413 3063 3453 2608 362 -1926 -3234 -3347 -2233 -125 2273
4271B273R91p4j461k300j829j086K96K125J869J994O58q07j872k253j597k62J156
$$ 2273 3264 3190 1729 -571 -2400 -3486 -3190 -1065 804 2798 3456 2649 777 -1476 -3073 -3335 -2179
4288b179J621K340J456K8j218k193k300q54J89J569K172J777R54l84j970j900
$$ -2179 -558 1782 3238 3266 2048 -145 -2445 -3299 -3110 -1541 631 2408 3362 2978 1008 -892
4304h92j912m28O18J883K098J369N45j002j943k212j009q5J229K012J894J167
$$ -892 -2804 -3232 -2614 -731 1367 2736 3281 2279 336 -1876 -2885 -2970 -1741 271 2165 3332
4320C332l90j280k113j955q71M03J831K087J641M40o53j773k104j620K3Q57J990
$$ 3332 2942 1662 -451 -2406 -3277 -2874 -1043 1044 2685 3125 2472 699 -1405 -3025 -3002 -2145 -155
4337a55K027J218K5j466k192j765p57L2J701K047J828Q25o57k036j776j775j90
$$ -155 1872 3090 3115 1649 -543 -2308 -3065 -3033 -1332 715 2543 3368 2711 675 -1101 -2876 -3066
4354c066Q14J652J984J675n4j298j742j815j274R0J531K206J569P89m45j507j856
$$ -3066 -2252 -600 1384 3059 3005 1707 -35 -1850 -3124 -3034 -1503 703 2272 3061 2616 1109 -747
4371g47j924l64O70J716J864J340L77p07k081j809j317K4J043K014J878J158n26
$$ -747 -2671 -3035 -2365 -649 1215 2555 2932 2225 144 -1665 -2982 -2958 -1915 99 1977 3135 2609
4388B609j229j975j669r69O38J585K091J330N30p24j498j878j544l64R95J951
$$ 2609 1380 -595 -2264 -3233 -2595 -1010 1081 2411 2941 2217 719 -1159 -2703 -3067 -2072 -121
4404a21J853J364j26j207j812j925r33Q0J453K085J603P78o18j412j915j727m07
$$ -121 1732 3096 2970 1763 -49 -1974 -2907 -2827 -1374 711 2314 3092 2474 1062 -853 -2580 -2987
4421b987P45J796J923J035M05j100j818j636j212J05J014J952J516J023k71j343
$$ -2987 -2242 -446 1477 2512 2917 1817 -1 -1637 -2849 -2744 -1730 222 1738 2761 2490 1147
4437A147j912j464o53N37J453J771J548K16o67j670j814j178j03Q13J858K151
$$ 1147 -765 -2229 -2882 -2345 -892 879 2427 2643 1976 306 -1508 -2686 -2789 -1976 -118 2033
4453B033P68j14j209j959j690o58O99R38J885J483Q73r83j410j555j760J9O83
$$ 2033 2801 2687 1478 -481 -2171 -2829 -2130 -1192 693 2176 3049 2066 656 -899 -2659 -2640 -1957
4470a957J474J884J168K42j121j862j601q56J46J240J538J743Q17n05j210j975
$$ -1957 -483 1401 2569 2811 1690 -172 -1773 -2629 -2483 -1243 295 2038 2855 2350 1140 -835
4486h35j404n97O52J424K036J072N26r60j552j662j281j46J145J721J660J007
$$ -835 -2239 -2836 -2184 -760 1276 2348 2874 1914 362 -1300 -2581 -2727 -1582 139 1799 2806
4502B806m66j252j804j439p37N35J588J773J213L83n98j722j339j356l55J023
$$ 2806 2340 1088 -716 -2155 -2892 -2357 -769 1004 2217 2600 2002 280 -1059 -2415 -2770 -1747
4518a747J636J895P20j23r21j617j754p40J90J561J556J428O12o37j178k009j294
$$ -1747 -111 1784 2504 2381 1460 -157 -1911 -2651 -2461 -900 656 2084 2696 2059 881 -1128 -2422
4535b422k38R27J368J734R21K71r46j652j226j150j89R70J882J606Q17k19j701
$$ -2422 -2660 -1733 -365 1369 2290 2561 1615 -37 -1263 -2413 -2602 -1632 250 1856 2673 2454 753
4552G53j464j277n94K76J527J794J251J90o43j594j582j074J47R21J542J465Q76
$$ 753 -711 -1988 -2582 -2306 -779 1015 2266 2456 1813 219 -1363 -2437 -2290 -1369 173 1638 2514
4569B514j81j058j726j481l53K5J273J687J255P79q05j352j576j280p2O31J529
$$ 2514 2333 1275 -451 -1932 -2285 -2260 -987 700 1955 2734 1929 577 -999 -2279 -2351 -1720 -191
4586a91J522R27R9r87j368j785r44N37J191J489J449N32n22j078j438j420l07
$$ -191 1331 2258 2357 1370 2 -1783 -2727 -2190 -999 490 1939 2471 1949 871 -567 -1987 -2294
4603b294M30J388J483J213M2o62j492j452q73QR90J673J400P07m26j203j421j246
$$ -2294 -1864 -476 1007 2220 2262 1600 108 -1344 -2217 -2209 -1219 454 1854 2561 2135 932 -489 -1735
4621a735p48L25J386J391J511L08o59j535j525r07J78M43J639J349Q69j59j063
$$ -1735 -2483 -2158 -772 619 2130 2438 1779 244 -1281 -2188 -2010 -1567 72 1421 2290 2131 1068
4638A068j195j468p56L26Q42J762J205N81m74j342j378j294m60Q38J460J530R21
$$ 1068 -127 -1595 -2351 -2025 -1183 579 1784 2365 1891 549 -829 -2123 -2583 -1745 -285 1245 2166
4655B166J56r17j631j485o00J87J002J424J463N06j47j202j672j051n54N81R33
$$ 2166 2322 1405 -226 -1711 -2311 -2124 -1122 302 1765 2271 2124 922 -750 -1801 -2355 -1774 -841
4672h41J700J139J99p39j338j465p97m0P78J373J383R10l08p92j510j281o16N12
$$ -841 859 1998 2197 1458 120 -1345 -2142 -2182 -1404 -31 1352 2262 1954 1162 -348 -1629 -2245 -1733
4690a733R31J547J092M07o21j134j412j187j50J095J191J222Q07J3q23j384j410
$$ -1733 -802 745 1837 2244 1623 489 -923 -2110 -2260 -1165 26 1248 2055 2068 1245 -139 -1549
4707a549n28P2Q77J635J507K31n05j067j683q06o46R49J197J470J016j48p43j102
$$ -1549 -2077 -2005 -1128 507 2014 2245 1740 673 -1010 -1816 -2462 -1513 -316 1154 2170 2022 1279 177
4725A77j422o71r4J064J166J357M63o4j122j153j295n17L40J231J223J161L83
$$ 177 -1245 -1916 -2010 -946 220 1577 2040 1976 854 -299 -1594 -2111 -1771 -540 683 1844 2227
4742B227n88j487j079j060r4Q31J411J250P93n26o33j136j548l44J10J428J101
$$ 2227 1639 152 -927 -1987 -2081 -1250 161 1411 2204 1678 1045 -91 -1639 -1983 -1873 -445 656
4759F56J149L90m01j162j384j099n0M07J191J343R94Ko44j478r64r37J11Q06J494
$$ 656 1805 2195 1794 632 -752 -1851 -1901 -1494 -303 1040 2034 2036 1392 -86 -1050 -1987 -1876 -1070 424
4778D24J012O99m81r78j287j095j57M46J045J082R92L21n59j345j178n80j35N89
$$ 424 1436 2135 1654 676 -611 -1706 -1863 -1417 -372 710 1702 2023 1464 119 -1059 -1639 -1774 -1185
4796a185J447P78O31op55j466p11o72N29M54J303J190M99o73q68j298q25j73N78
$$ -1185 262 1040 1671 1665 910 -556 -1267 -1939 -1410 -956 347 1537 2036 1363 495 -803 -1628 -1801 -1223
4815a223J061J321P72o3p42j175j203n42J87Q76J147J031L36k35p87j409j006
$$ -1223 -162 1159 1931 1868 1126 -49 -1252 -1794 -1607 -731 416 1447 1783 1548 761 -648 -1654
4832a654j88K62J177J307P88J41m63j389j118n52P4O72J027J072P26k53r57j087
$$ -1654 -1842 -1580 -403 904 1692 1833 1370 -19 -1137 -1689 -1615 -943 84 1156 1882 1629 672 -415
4850d15q93l97J09R76J344Q34M23n19q39j648o96K5M70J343P33R39m2q03j017
$$ -415 -1308 -1705 -1596 -620 724 1558 1981 1462 623 -1025 -1721 -1696 -1226 117 850 1789 1747 944 -73
4869g3j225m75j13J135J179R15K35j79p69j320p26j64L71Q24J134J043op53j118
$$ -73 -1298 -1773 -1886 -751 428 1343 1578 1399 630 -690 -1416 -1580 -1209 -385 749 1792 1786 1033 -85
4888h5r54o73J6Q89J030J067N85m33p88j138j006k81K39J181J329L97M76o12r25
$$ -85 -1039 -1712 -1696 -807 223 1290 1875 1442 654 -484 -1490 -1771 -1532 -351 978 1375 1851 1239 314
4907C14j241p29N7O84J077P38O76J91r55j075q81n85L09R70R24P40N04l97r64
$$ 314 -927 -1656 -1599 -915 162 900 1576 1767 812 -263 -1144 -1729 -1420 -450 474 1214 1718 1321 357
4926C57j037p90m08O45R89J127O38M9n22j243r46n20L26O72R60J132J32j94p09
$$ 357 -680 -1470 -1878 -1233 -244 883 1521 1570 1048 -195 -1141 -1661 -1335 -663 297 1429 1561 1367 658
4945F58j138q81l38O63P66J218N13K30n81j008j180n86oQ76R40R55N63l81o79
$$ 658 -480 -1361 -1699 -1036 -270 948 1461 1691 1110 102 -1078 -1664 -1670 -794 146 1101 1664 1283 604
4964F04q27q95m48L6J054J078P37K96o65p52r78o88j21M33J027R80P18k06o38
$$ 604 -223 -1118 -1566 -1530 -476 602 1339 1635 970 218 -760 -1448 -1569 -1136 -109 871 1589 1383 745
4983G45p48q17n48j00P42Q19J237K27j40j170p70p88k29M62Q10Q80R52r6l61r71
$$ 745 -3 -820 -1368 -1468 -726 93 1330 1557 1417 247 -523 -1311 -1540 -1078 -268 612 1564 1468 1107 136
5003A36r73o88N4R38Q37P63N78l33p84j072q13l32O46O86J001P55k6k14p11j208
$$ 136 -837 -1525 -1471 -533 304 1067 1645 1312 528 -544 -1357 -1689 -1043 -357 644 1399 1373 1159 448 -760
5023g60o73j94N04J264Q22P21m06o07o85q38n31K06N42J251N31K19j74r93p64
$$ -760 -1433 -1627 -1123 141 963 1684 1278 671 -14 -852 -1383 -1177 -635 616 1147 1366 1192 199 -565
5042e65q60r5M94Q94Q22R55q8n03j134r92m54NN86J245Q93M29k26j049m95j176
$$ -565 -1425 -1520 -1026 -132 690 1645 1557 1054 -80 -1072 -1526 -1521 -935 310 1203 1632 1406 357 -138 -1314
5062a314k30L97R28Q84N88m9j21j008r45n97L18L44J179N90K98K33q38p66r27
$$ -1314 -1544 -1147 -219 665 1253 1204 1083 75 -870 -1467 -1149 -805 374 964 1262 1495 657 -109 -1036
5081a036n08L34O72J051P74j3l34p01j217l81j22N38P65J123M54Ln19r71n98q36
$$ -1036 -1544 -1210 -538 513 1287 1274 940 239 -978 -1359 -1481 -943 -178 945 1399 1402 883 -88 -686 -1522
5101a522K43O45J160L28L76P5q60q94p50j72K50J129O10O30J60l45j016q38m84
$$ -1522 -1279 -634 526 854 1230 1305 445 -449 -1199 -1371 -1121 8 618 1248 1408 1063 47 -791 -1275
5120a275j40P17O37P46O53J71q07r57r35p6J03P79J054L85L71m59o78j016m35
$$ -1275 -1415 -698 -61 685 1338 1509 702 -255 -1190 -1266 -1163 -384 670 1055 1426 967 289 -727 -1162
5139a162p6K43P93R79O63J83p65q66r54m03J38N56J121P13K24l44o40r41p07j35
$$ -1162 -1238 -995 -202 777 1440 1623 858 -8 -962 -1365 -1227 -671 450 1163 1387 1043 403 -538 -1245 -1380
5159a380N69P16Q45L73km08o96p76n68%N41Q47P78M97j80n76r61o92j29J12Q69
$$ -1380 -811 -95 750 1123 1121 713 17 -759 -1327 -1327 -786 61 839 1336 1156 580 -381 -1073 -1202 -1090 -221
5180b21P54N31M14n47p31q00n35l97P59P71P49O14kq88p25q16l60M51N57P06P75
$$ -221 533 1064 1478 931 200 -600 -1135 -1532 -773 -2 747 1361 1359 471 -254 -1070 -1430 -979 -422 284 1059
5201A059J66K9j005n17q37k29O01O39Q75L48L30r05o78n77o23K6O70Q14O52M37
$$ 1059 1225 1254 249 -268 -1105 -1334 -733 -94 781 1129 1459 554 -124 -701 -1324 -1298 -628 186 838 1275
5221A275r6o82q12n58m43J27P03R31O94L08m62r76r28l64j32O72J034P24J07R7
$$ 1275 1179 497 -315 -873 -1316 -1189 -486 445 1139 1447 985 9 -919 -1283 -1415 -743 291 1015 1122 1219
5241A219o36o46r94l13K93O96J144L62K30l40q95n57o54j75L84O67Q17O10p1m66
$$ 1219 583 -63 -1057 -1370 -1077 -381 763 1125 1355 1015 120 -437 -1091 -1266 -882 -215 602 1212 1141 675
5261F75p22n29o29Q9P52M69O80M78r6j051m11p53j43K23R13N83N57J21l53q87
$$ 675 -47 -576 -1205 -1116 -364 105 785 1263 1167 116 -295 -1048 -1191 -968 -55 528 1085 1206 853 -34
5281c4p47k42l7L91P47P93L11k85m86p00p52M6o4N75Q16P93n7j69m95q78q91K04
$$ -34 -781 -1023 -1060 -669 78 871 1182 897 411 -289 -1041 -995 -1059 -484 332 1125 1068 899 404 -474 -1365 -1161
5303a161O96K24R59N26k60m91p22p28k07J71O67M58P59M25l53o99q66m34k22M59
$$ -1161 -465 -241 718 1244 984 493 -229 -957 -1164 -993 -326 132 891 1316 963 264 -602 -1036 -1258 -799
5323g99Q22N28M96J74m66p19p00m61Q8M98Q04L86M73o9n39p69q44j83mQ78O05
$$ -799 23 551 1047 1221 755 36 -664 -1125 -1037 -539 265 651 1124 1055 516 -253 -1097 -1280 -1284 -406 199
5344A99P42K61n35m11p21m78r1K46P42P25M78m9m62p74q46P8j19L27R59P76k4
$$ 199 941 1202 667 256 -465 -943 -1034 -788 -46 679 1157 1108 646 -128 -974 -896 -1015 -688 271 1047 1023
5365A023k1o54q56k78j06M72J10R74L28K79l46r40n41m47j71O95P13L94L18J84
$$ 1023 1002 348 -508 -786 -892 -420 -310 664 992 1271 925 -15 -556 -1003 -1174 -479 234 628 946 1130
5385A130q39o38p94j02M64M84Q83M70Mk45p11o53m52k47M92N99J026K26J70q05
$$ 1130 291 -347 -1141 -1243 -779 -295 588 1058 1062 817 106 -547 -999 -1246 -754 -155 871 1097 1267 462
5405D62m78r23j15k7P48P85N26K2j63q82m09n67P1L70N62O38L39K1m62o19o70
$$ 462 -16 -939 -1054 -1081 -333 452 978 1000 837 -45 -454 -1021 -950 -580 -18 620 959 980 518 -101 -771
5426g71l76J22M58R27L48L32J12j087n75n26k73L64Q33P11L35K24m97n36q32k37
$$ -771 -1147 -1025 -567 360 708 1040 1152 65 -510 -1036 -1309 -945 -112 599 934 1158 661 125 -707 -944
5446i44l9P54L09N73P24m52n59o19p55J32j86Q18Q15M21k0N5q81p55m89N7L84
$$ -944 -983 -229 80 653 1377 925 366 -253 -1008 -876 -1062 -244 571 992 972 1027 146 -609 -1098 -1041 -657
5467f57N45P33M44N2m27o21j100J88J2L20P05P79o0k18l93o18m37m12K42P46O36
$$ -657 -112 621 1065 1117 690 69 -1031 -843 -831 -511 194 973 913 695 302 -316 -753 -1165 -923 -177 459
5488D59O49q5l91q62l34n67J02K78P62N84N34j84o90n76p61P6K97M99N05M38K24
$$ 459 1108 1023 632 -230 -564 -1131 -1029 -751 11 595 1129 945 255 -321 -1082 -1006 -709 -210 295 733 957
5509I57l14l74p15n15o4K66Q15N52M75Nl20j083m69l38K17M89Q41L47K54l20n64
$$ 957 643 269 -446 -961 -1025 -759 56 608 1083 1088 768 -315 -784 -1122 -905 -416 425 772 1026 706 142
5530A42o69m09p4K97Q68O08K06J9l88p78k02p07j52R28M18Q87J32m29l10n10n08
$$ 142 -527 -936 -1010 -713 155 763 969 988 600 -178 -380 -1087 -1239 -311 107 994 1126 697 387 -123 -631
5551f31l39LO44Q76K33J51m28m58o53k13k34N24N49J007J25m21m02m85o92k20
$$ -631 -970 -967 -323 553 786 937 509 51 -602 -815 -1049 -525 24 1031 1156 735 333 -152 -844 -1064
5571a064J75O05O25M44J49j52n38q52j93r5K87N90L58P06r9m94m13o83O5k99N14
$$ -1064 -889 -284 341 785 934 782 244 -608 -801 -896 -609 -19 339 1045 946 452 39 -644 -579 -878 -364
5592c64O55N87J85k82o81n95k68l10K18O82O63N73k02k80m69r76k56J89M01Q22
$$ -364 291 878 1063 781 100 -495 -763 -1073 -855 -173 490 1063 861 581 112 -864 -1120 -931 -530 292
5612B92N88O2o1n57m85n17j51p0N82N85N19J26k28l90q88m08J51K79P13M49M88
$$ 292 880 942 881 324 -161 -678 -829 -899 -317 268 787 913 685 295 -593 -1001 -850 -571 142 591 1079
5633A079k03k65p83m91n15K27N39N40O12K51p8o66n24o46j26J28P77N96L63J75
$$ 1079 876 611 -172 -663 -1178 -951 -412 128 740 991 913 247 -277 -923 -1049 -921 -144 452 815 990
5653I90m00p49m67j66k4K64P22O16L64j86n15o64m85m10K75P17M48N67L00l92
$$ 990 590 -159 -626 -792 -816 -552 170 786 1150 964 449 -215 -700 -1110 -835 -118 330 897 1197 805
5673H05o97p29m72P0N05O64O26K59L5p91n44o63j77L02M38O67M94L29m85m37p48
$$ 805 108 -621 -1093 -1023 -518 146 772 1031 1066 275 -269 -932 -1109 -807 -369 298 792 1121 636 199 -549
5694e49n13M7M38O13L29O66J15j79r98o52k41j6O11N04N87K80j86n27o66q79K61
$$ -549 -1062 -1015 -577 36 365 1031 1146 967 -31 -683 -924 -940 -329 175 762 1042 856 329 -337 -1216 -955
5715i55Q1O17N90P13p8k43q76l56k89j30J66R37K93O12k70l04o49q53k18L45N58
$$ -955 -874 -257 333 1046 968 725 -151 -507 -796 -926 -760 177 470 1082 812 508 -141 -994 -1212 -867 -309
5736c09P23N13j48n3l77r24l11m11M84P22Q31Q2Qj32q76l79m04N1M47O22P79N5
$$ -309 414 927 779 726 349 -575 -886 -1297 -813 -91 740 822 830 698 -178 -557 -961 -910 -463 159 938 993
5758I93o5q15m43n99j6J10O96O51O17q9m04q38n09O9k72K86P74O93k1K59o24n58
$$ 993 928 113 -330 -929 -945 -835 -139 512 1129 1040 636 -202 -711 -642 -914 -628 146 839 818 1077 453 -105
5780a05m40m32P2N42M76P90J02l26o13m90n30k69M46Q20M92L31J70n28o35m95
$$ -105 -545 -977 -905 -363 113 903 1005 679 66 -424 -954 -1223 -777 43 535 866 1036 508 -127 -622
5800f22n87L41L75O72P53K79l64n96p17l70J18J27N44O14K71R6l94n31m99m50
$$ -622 -1209 -868 -493 179 932 1211 847 251 -466 -836 -718 -591 -47 567 838 934 540 9 -490 -940
5820i40P9N10M75Q52R3l11k12r34m07p9J16L96R58K42j59qm86o64n25j83P55L96
$$ -940 -861 -351 124 976 1069 758 546 -388 -795 -874 -758 -362 596 838 679 671 185 -479 -1004 -1187 -432 -36
5842c6N83M28o8n22n90n15p0J3M36P32M26moo45n38n48p4N09O51M54K27J61l39
$$ -36 547 975 907 385 -205 -720 -790 -777 -341 391 817 813 807 162 -376 -924 -998 -489 162 616 843 1004 665
5865F65p28n22l91q4Q59N27N18K73m28m55o33m57j81L02M66J036R2Q7l41o33l44
$$ 665 -63 -585 -976 -1060 -201 326 844 1117 689 234 -399 -856 -1037 -735 -269 767 859 946 605 -28 -372
5886c72o17L3M50Q06K87L20Mm16p84m50k49K56N42N22O50o9J5r30n92l08k09L36
$$ -372 -989 -956 -506 300 587 907 911 495 -289 -739 -988 -732 -190 332 982 913 928 -2 -594 -902 -1111 -775
5908g75P62L90N93p9l04p56n42l26K31N58O43N29M37o86m46o26o45J6N62K18R85
$$ -775 -13 377 970 891 587 -169 -711 -1037 -806 -248 395 924 1361 675 229 -397 -1042 -1026 -464 -246 739
5929G39N05l83m39m84p05k54K39L21L51P84K17J2p27p19k89k67M19N16O03N50
$$ 739 1244 861 422 -62 -767 -1021 -782 -461 -110 674 891 903 176 -543 -832 -1099 -680 -164 439 989
5949I89q8o9q15n28l60M7J88O42N40K96J04n56o55n48p5P1O05O99K38J96k68l38
$$ 989 901 832 17 -511 -871 -824 -636 6 546 842 946 390 -265 -813 -888 -817 -212 487 725 921 653 315
5971C15j034k90m8K80P49N36L83O4l35p96k75p16L18M44N51Q28J03n39j15q75
$$ 315 -719 -1009 -1057 -777 -28 508 891 955 620 -176 -451 -1167 -849 -405 146 974 1077 538 423 -452
5991d52k94j55K40M61O69L81K62l93p04o05n01J99M05O82N00K09Ql48o78p73j58
$$ -452 -746 -901 -661 -200 469 850 1112 719 15 -590 -1091 -892 -487 195 695 904 912 564 -114 -887 -1045
6012a045L08N04N42N71K23o05j72j069k83N9K07P19P31K85Pm19p80k08n13j28
$$ -1045 -737 -233 309 880 1103 498 326 -743 -1026 -967 -760 -41 690 975 982 563 -217 -425 -938 -1066
6032a066M56P79O89L34k47p42m13m11l48K87N90P44J76J83o13m80m33o08J43N64
$$ -1066 -610 169 858 1192 945 203 -210 -621 -969 -682 -92 652 828 1011 398 -82 -515 -1123 -980 -416
6052d16P19M78N5qo70m21m90k85J55O59N50P06J65o51n49o83l75nN53P90N15K44
$$ -416 303 781 836 828 158 -263 -753 -1038 -883 -224 326 1032 1197 546 -3 -686 -1061 -1066 -513 277 792 1036
6074A036j47n62m62n80j9m8L33Q36N00j04j95l75p52m94J74K43P76N1P31k5o67
$$ 1036 889 327 -135 -715 -734 -782 -449 387 887 783 588 213 -539 -1033 -859 -616 160 211 942 917 250
6095B50l78n46k76J04O59M79M12L66r3o85m79n85k70Q2Q55O82M04lk74m28q18
$$ 250 -128 -674 -950 -846 -187 292 704 1070 977 292 -187 -772 -1042 -960 -105 577 981 978 704 276 -542
6116e42l31j20L23O89N17L49m8k73p23o10n1M9N48Q63M36k64K1p14n93k56k53
$$ -542 -873 -993 -670 19 536 885 837 564 -159 -769 -820 -771 -223 640 1076 812 833 119 -474 -730 -983
6137i83N03L75P83K92M3n62p55n01k25N8N05O75N51L32l15o31n88m27j46K10N27
$$ -983 -480 -105 678 970 1013 451 -304 -805 -1030 -972 -467 208 759 1091 776 145 -443 -870 -1016 -806 -279
6158b79P97L86r0n04j60p72l01k9M30N59Q57J79l26l02p06o55j14L60N43O47M39
$$ -279 518 904 814 310 150 -622 -923 -952 -522 37 894 1073 747 445 -261 -916 -1030 -670 -127 520 959
6179I59n4q2p01n65n80j6N25M83Q11K54j27n13p60n44k52K61O51Q72J97M40m67
$$ 959 905 823 122 -443 -1023 -1039 -514 -31 780 1034 907 394 -366 -910 -1162 -901 -250 622 819 1259 792
6200G92p91n57m78o9N32Q30L36L33M1l80p56q75J29J23K21Q84M81J66j92o98o67
$$ 792 1 -556 -1034 -1103 -571 259 595 928 969 589 -167 -1042 -913 -790 -569 315 796 962 770 72 -595
6221e95k11k19N01K92P11O24j48n00l99n81p31K32O64O72J64N05j57l59r69k94
$$ -595 -806 -1025 -524 -232 479 1103 955 455 56 -525 -1256 -1024 -360 312 476 981 824 465 -504 -798
6241g98j40J50M15Q50J50K94n33m03n98l98PK96R28N55O5P4o72o81n06J11mM10
$$ -798 -938 -788 -373 477 627 921 388 -15 -613 -1011 -1004 -708 220 775 840 914 242 -439 -945 -834 -838 -428
6263d28Q43N63k09l18n48n38k68j66N97L90N97K53J98m83o98o22k80J20N36O26
$$ -428 415 978 769 451 -97 -635 -903 -1069 -472 -82 515 768 966 483 -215 -837 -1117 -997 -461 165
6283A65O81J26j71m95n69l42l34L38N53O06M07n4k61p09q94J72k6L33M79P39M04
$$ 165 846 972 801 306 -263 -605 -939 -601 -48 558 965 911 650 -59 -953 -781 -807 -474 5 744 1148
6304A148l86n45m35n61k71L29M46P42M83K7n38k13q45j65m34O62P75L15L20J57
$$ 1148 762 217 -218 -779 -1050 -721 -275 467 950 977 439 226 -619 -784 -1218 -556 219 534 854 1011
6324A011o64n42n92j58r2P62O83L80J57l8q69m58p01K30M38K89N47M64K69p61
$$ 1011 347 -195 -787 -945 -1037 -275 408 788 945 907 38 -420 -1121 -891 -453 -164 383 847 1116 355
6344C55l41p72l53P9P40P77K92K49q6l44j161m43j8L51L87R20N49K4o58m34r50
$$ 355 14 -758 -1111 -1032 -292 485 777 1026 940 596 -565 -1008 -1026 -675 -288 632 1181 1205 547 113 -837
6365h37j30j6M85O40O81P0%k58o09p69k83L46N00O70O79j78k99m70r74j07J65
$$ -837 -967 -983 -498 142 823 893 893 635 26 -743 -1026 -680 -180 490 1169 991 692 222 -752 -859 -694
6386f94J6P22M28M73l2m32o34m44l10o1Q24N18M95O2o6o36n51o31N5M98K62O92
$$ -694 -678 44 472 945 913 481 -153 -597 -907 -968 -144 374 869 931 865 229 -322 -953 -898 -400 -138 554
6408E54J14L21m66p21o15k40K34M03N88M07M68m5o74o97o37R2L19O13O60K1J47
$$ 554 668 989 523 -198 -813 -1053 -819 -416 172 579 1047 1002 328 -369 -1006 -914 -595 18 678 699 846
6429H46l59m41n40o52K99M01M54O55L48k45l90n71p74K5MO47O15P05J01l81o21
$$ 846 487 46 -494 -1146 -847 -446 8 663 1011 766 376 -195 -969 -944 -940 -293 322 1027 1128 747 126
6450A26p20m21j75P03O58M63M21q1p76l31p02M6J18N80N65L27K27k17o04q57k71
$$ 126 -594 -1015 -1190 -487 171 634 1055 974 198 -133 -835 -789 -671 -91 474 801 1028 811 207 -650 -921
6471i21M9K09O73M73L46k0k63m00q37l66J07N22M73Q42P0j56o85o24n18o3L26
$$ -921 -872 -663 10 483 829 809 546 146 -691 -1057 -950 -428 45 887 957 801 116 -508 -1026 -1089 -763
6492g63P24M08O35J20l98p59o26l52J4O25M07O18K67R9p09m86q61J04K32N39L58
$$ -763 -39 369 1004 1124 726 -33 -659 -1011 -997 -372 35 653 920 1019 310 -176 -1037 -933 -701 -162 196
6513A96O91ok81o11n68m26k67P97N11N33N42k8o98m57o85l98M19L56Q03N69K3
$$ 196 887 881 600 -11 -579 -1005 -1272 -475 36 569 1111 1083 385 -72 -757 -1155 -736 -380 423 992 1015
6534A015l92j35r10n36k82L55J028K32N52j6j84r08o23j51n1O20O58N11K01k72
$$ 1015 623 488 -422 -958 -1240 -885 143 375 927 911 727 -181 -804 -955 -1006 -386 272 783 984 712
6554G12m91o43l40j81K0O53R06M60k3l21n13r52j99K02L6P80P70P6m3n50o94l39
$$ 712 221 -422 -762 -943 -923 -270 636 1096 1073 752 239 -713 -912 -710 -674 106 876 952 909 359 -335 -674
6576f74k59m7O74O74P48j52p3q76k59n91j9L26P15M85L01O7n97o54o97j34K06
$$ -674 -933 -980 -306 368 1116 964 891 15 -244 -835 -854 -528 187 672 973 1040 443 -211 -908 -1042 -836
6597h36N99P44L16N2r1q24l26m49m19N50R04M26M75j87n64k18r86k40L4P99N87
$$ -836 -237 507 823 875 784 -40 -366 -815 -1234 -684 220 646 1121 934 370 152 -834 -1074 -1040 -241 346
6618C46M23J96l63l30o12l77m05N75M48O23P94l97k38o54o97q0l4K43P98M91K65
$$ 346 769 965 602 272 -340 -717 -1122 -547 -99 524 1318 921 683 29 -668 -748 -782 -539 259 750 1015
6639A015j83m10r37m08j66L91N23O94L80J02m12m19p60k78j53N12P39L31N54k89
$$ 1015 832 422 -515 -923 -1089 -698 -175 519 899 1001 589 170 -590 -868 -1021 -509 230 561 1115 826
6659H26l63p33n29j12L51L94O27K94M15l42q04m54n20k09N91O07N75K6M28n82
$$ 826 463 -270 -799 -911 -560 -166 461 755 1170 828 24 -430 -950 -1159 -568 39 614 640 1068 486
6679D86m21o39n12K60N51O43K60L15k24n51n04m96k15L66M03O13N94j73j87n22
$$ 486 65 -574 -1086 -826 -275 368 628 943 719 168 -336 -832 -1047 -681 -278 335 929 756 569 47
6699D7m59n16K38N7P53M44N04j37n39n43m80m21M26L88M08P56J30l09o83m96k72
$$ 47 -412 -928 -690 -633 120 564 1068 931 392 -151 -631 -1052 -626 -238 170 926 1056 747 64 -432 -704
6720g04k26M84M81O29L29o3m16n41n86m59L87K88N90P15J93n80m27m94p51J08
$$ -704 -930 -446 35 664 993 930 514 -27 -613 -1072 -685 -397 193 908 1101 521 94 -400 -1151 -1043
6740a043L96L27Q58L81q6k16q72o43J87j05O35M45O86k12j3l03q09m12j84J81
$$ -1043 -647 -320 538 919 833 617 -255 -898 -711 -816 -181 264 950 738 725 422 -387 -799 -983 -802
6760h02O39O96M94o4m85m07m43n52N0K64O21P72K68l36j32r15l38j94J15O55O31
$$ -802 -163 533 1027 963 478 71 -372 -924 -874 -610 11 783 1051 715 583 -332 -670 -864 -749 -94 537
6781E37M10k58m3n12q59k48J32K19N58P33K91o2n75m53m08m70K68L74O40M07J14
$$ 537 947 689 646 134 -725 -973 -841 -622 -64 669 960 898 323 -130 -538 -1008 -740 -366 274 681 795
6802G95j48l44n86o20J79R0P62M53K34j68m28m02n09k56L24R4N69O91K90n41k91
$$ 795 647 303 -283 -903 -724 -634 128 581 815 647 219 -183 -692 -948 -624 -530 39 730 1020 479 188
6823A88n86o19n7N57M02N10M10J41k33q41n78n3k91N22N77L57M81J8m23p25o20
$$ 188 -398 -1017 -1074 -517 -115 395 805 946 713 -128 -706 -759 -1050 -528 49 406 887 905 482 -243 -863
6844h63Q7j6O43M21N83J78l69m51n29l97K5K6P71K78O45k03p48k62m29k20N8N68
$$ -863 -776 -792 -149 272 855 1033 664 213 -316 -713 -688 -662 109 387 1032 829 81 -181 -610 -830 -772 -204
6866b04L12O75r3K5m96m92n44r0L17M46L89P42Qn82n88m04l88M29o6P76O24J62
$$ -204 108 783 690 715 219 -273 -817 -907 -590 -144 245 987 995 413 -175 -579 -967 -538 -604 172 796 958
6888I58J7p76o33l04k91M27O31L50N48J33m39p11m62k68l15O00Q16Q25r5k94k65
$$ 958 975 199 -434 -738 -1029 -602 29 379 927 1060 621 -90 -552 -820 -1135 -535 281 1106 1011 717 452
6909D52o06n58m18M86L26N07P53J5n64p8q03l66k24L99Q38M49M34k66m51l74o36
$$ 452 -154 -712 -1130 -644 -318 189 942 957 393 315 -488 -854 -1078 -679 159 608 1042 776 325 -49 -685
6930f85k32J44M89P73J97J7q4n22o08o25M97J64M36O08M72j12n80m27l72n00j6
$$ -685 -917 -773 -284 489 686 703 619 97 -511 -1136 -639 -475 -39 569 1041 929 349 -78 -450 -950 -966
6951i66N47N57N73J51o4p55l04n00l05O27J42Q12P7L17l21o35o85k87L19J36Q49
$$ -966 -419 138 711 862 798 43 -261 -761 -1066 -439 -297 515 592 909 588 -47 -732 -1019 -700 -564 285
6972B85K43L71j4o91n05m69j20P6P55N45L64Q3l39o11m73n23mO07M62N75M05k9
$$ 285 528 899 885 194 -311 -780 -900 -824 -69 476 840 923 584 -27 -500 -1023 -1027 -420 42 617 1022 993
6994I93q16j79o56j30J36L84M31N97K35k49m70r61j80p2L22N97O67OJ34k98o37
$$ 993 177 -2 -658 -788 -652 -268 163 760 995 746 276 -685 -865 -937 -615 -18 649 655 789 491 -146
7015a46m09k92R1M17N97M64J14o5n36o60n44Q9K60N20N02K76K04k68m81r56j04
$$ -146 -555 -847 -756 -339 258 722 836 771 235 -425 -969 -880 -620 -100 402 678 882 614 133 -823 -927
7036i27J4M21O36L48M10k40l86n25m33k12J25P02N94L13J81l38n53o37j11j72
$$ -927 -913 -492 144 492 902 662 276 -249 -682 -894 -769 -67 527 840 1021 683 130 -507 -618 -790
7056g90J45M52P85L90N8n62n74o57O7j50K71Q25O75O0l03m49n88m34l00M70L75
$$ -790 -645 -193 592 982 1040 478 -96 -753 -686 -836 -565 260 935 995 692 243 -345 -779 -1079 -609 -234
7077b34P34N80m09po26o52k91K22L49N16M61K47k66m48m64n26m9K02M82N87M08
$$ -234 500 1080 671 664 38 -614 -905 -683 -334 182 643 890 624 176 -288 -814 -863 -661 -179 408 816
7098H16J67n55n26m34m50Q9N44L78O23L76m18Or20l81k39m8Q21M74N16k47P5o22
$$ 816 983 428 -98 -532 -982 -893 -349 29 652 1028 610 616 -304 -685 -924 -972 -151 323 839 592 667 45
7120D5o10k04o9K39P20M01K09l1j71p98k78l47j40O96P73L32K45k31m91q79k08
$$ 45 -565 -769 -838 -599 121 522 731 700 529 -269 -547 -894 -1034 -338 435 767 1012 781 290 -589 -797
7141g97m8K72M76O58L14m1k13p89n42j88l1O77N64L00J28j95l26o13l40k14K72
$$ -797 -845 -573 -97 561 875 834 621 -168 -710 -898 -929 -252 312 612 740 545 219 -394 -734 -948 -676
7162f76N37O44J79J44p9q27k74m31k54Q16K85N54L41q8l73n95n16l57O5N82P78
$$ -676 -139 505 684 828 749 -78 -352 -783 -1037 -221 64 618 959 871 498 -97 -613 -970 -905 -323 455
7183D55L64L8l32l60o34k01k51K08P41P72Q8Nn68l83l45l67n2M42O34L22K52j38
$$ 455 819 857 525 165 -469 -670 -921 -713 28 800 888 893 325 -58 -403 -770 -822 -380 254 576 828 690
7205F90o69m92k09j61J11O45N58K07j4o16k84m05j10j29L30O53L97L12k14l45
$$ 690 21 -471 -680 -841 -730 -85 473 680 666 50 -234 -639 -749 -878 -548 105 502 814 600 255
7225B55j13j146K36J07P15M74P3K37j51m83n40l79k08N00N34N55J75k69j91m92
$$ 255 142 -1004 -768 -661 54 528 601 838 687 204 -336 -715 -923 -423 111 666 841 572 381 -111
7245a11n97j24o1Q13M18M78L53p29j46p27k00k9JR07K12L67j54j95o24o10o4J03
$$ -111 -708 -832 -893 -80 338 816 1169 440 294 -433 -633 -662 -661 246 458 825 671 476 -148 -758 -822 -719
7267g19M07O35L37K32j47o35n34k99j95M04K87O94M81J54p48k55p67o6j85M80
$$ -719 -312 323 660 892 745 110 -424 -723 -918 -514 -227 467 948 1102 354 99 -668 -734 -919 -439
7287d39O24N56lN2p07l05o17J2K31N99N43K42K3l75m18k71l52l20N48L48O61M6
$$ -439 185 741 738 790 83 -222 -839 -827 -596 3 546 788 811 436 18 -253 -605 -925 -377 -29 632 678
7309F78m0l53m10m22k71J28M89M90N61j69J43q18m16l44q0J52P28M56M47j34l80
$$ 678 638 285 -125 -547 -818 -690 -201 289 850 681 824 6 -410 -754 -834 -682 46 502 949 815 435
7330D35o52m09Q3l58Q03J66N56N7r9l94o69l05l1J38O66N19K29J14m42n66k20
$$ 435 -217 -626 -543 -901 -98 68 624 681 582 188 -481 -786 -817 -679 -13 506 735 849 407 -159 -379
7351c79m03J31L06M28P64K1kn58n59l56m78M10M87L89M98M2O8j014l05l34jK43
$$ -379 -782 -651 -345 83 847 868 866 308 -251 -607 -1085 -675 -188 201 699 741 809 -205 -510 -844 -845 -602
7373f02M23Q22N17n40l15l83n19p3k4M62P31K92Mk06l96o31l43k6J27N94M88K96
$$ -602 -179 643 1160 620 305 -78 -597 -670 -694 -232 499 791 795 589 193 -438 -781 -807 -680 -86 402 698
7395F98R6n41k33n49j08L9J86O99L62O9j05l19m69o14K29P8M23N56K57K0q7o77
$$ 698 794 253 20 -529 -637 -598 -412 287 649 718 613 294 -175 -789 -560 -482 -59 497 754 774 687 10
7417A0l80n16%P20J51O45M59l13o00j12o82q9K22K47O50K59J11j48m56m62o60
$$ 10 -370 -886 -886 -166 -15 630 1089 776 176 64 -618 -707 -485 -238 412 671 782 634 178 -284 -944
7438i44O0M64J66Q73R4K5j82p89n20j63O1O41L17M08M07l13m22o73m43M2K34N27
$$ -944 -884 -420 -254 619 713 738 556 -233 -753 -916 -855 -214 103 511 918 605 183 -490 -933 -891 -657 -130
7460a30P69R2k07J26p39n96j08lM34N99O07j03j87m36j36o55p8K69K60N02K89
$$ -130 639 731 524 650 -89 -685 -793 -796 -362 237 844 741 554 118 -18 -673 -751 -482 -222 280 569
7481E69K2l3n43l86m16K17O1N90P03k17N1k90k70o78k06M11L12M53L48L00n09
$$ 569 591 558 15 -371 -787 -570 -509 81 784 567 618 328 58 -620 -826 -415 -103 350 698 998 489
7502D89n48r9n26N9J92N63L01L41p3k43n57m25j96P6M69L74N60j06l3n36o90k
$$ 489 -59 -158 -684 -625 -433 130 431 772 699 456 -101 -526 -722 -646 -177 197 757 651 618 82 -608 -610
7524f10jJ6N69P16J49L8l51n17n43m1n8M95N45J6J53J43j15q63m45j73M74K63
$$ -610 -611 -595 -26 690 839 877 526 9 -534 -575 -633 -138 407 423 576 719 604 -259 -704 -877 -403 -140
7546a40M41L83N6k42k32p59k67J54J09M79O82k2o0k73o31k40j49m5N22N13L02
$$ -140 301 684 740 498 266 -493 -760 -606 -497 -18 664 642 582 309 -322 -562 -711 -756 -234 279 581
7567E81K67l68l08n75l09j0N3Q46J85M39q7m06l70n26j0j90Q27K15L53K08k73
$$ 581 848 480 172 -403 -712 -722 -669 177 362 801 714 308 -62 -588 -598 -788 39 254 607 815 542
7588E42l38m99n7l69J33L81O32K72n2j27o43l26l31L09J93M40L90J37k12k55l20
$$ 542 204 -295 -352 -721 -588 -207 425 697 645 518 -125 -451 -782 -473 -280 160 550 687 475 220 -100
7609a00o78M5k9P01J72L18L25j31m88n87m25K80K17M47Q01j70n2j45n92n98J00
$$ -100 -778 -733 -762 -61 111 429 754 623 135 -452 -877 -597 -380 67 868 698 646 501 -91 -689 -589
7630e89j4L88L20L76M42m99k75k89o01K02J57L51M94J78P2n21k2m56m95J47M70
$$ -589 -603 -215 105 481 923 424 149 -140 -741 -539 -382 -31 463 641 713 192 170 -286 -781 -634 -164
7651a64K57N79NP0m36k89q22O2K79L43N16L7J69j39m23p21n6J92P8O01N24K54
$$ -164 93 672 677 747 311 22 -800 -738 -459 -116 400 437 606 467 44 -677 -733 -541 -463 138 662 916
7673I16m39k50l37l57k49K01J51P02K94N5r1n13o89o1q6JQ67K75L16k6l32l96
$$ 916 477 227 -110 -467 -716 -515 -364 338 632 687 596 83 -606 -667 -753 -752 115 390 706 680 348 -48
7695d8l10j00l55M09N34K92L29l73l01l29n49O1K28M17O57J29j38j63m86m17j10
$$ -48 -358 -458 -813 -404 130 422 751 378 77 -252 -801 -740 -512 -95 562 691 553 390 -96 -513 -623
7716f23k02L70O71L15J18j49k02n49p8l88R3O18M83K02j0k2p14m78R3l56N52L41
$$ -623 -825 -455 216 531 649 500 298 -251 -329 -717 -624 -6 477 679 669 647 -67 -545 -452 -808 -256 85
7738H5M16K44p9l37j82n74m03L41L07M93M48n2j48l81n49j77k48N47K22L24M89
$$ 85 501 745 666 329 147 -427 -830 -489 -182 311 759 707 559 178 -371 -548 -796 -249 -27 297 786
7759G86k3m30n52k72l00L38j65O94N56J24l75n09l4l21m35N32N51J18J69J50l55
$$ 786 763 333 -219 -491 -791 -453 -618 76 632 756 381 -128 -162 -483 -918 -386 165 283 452 602 247
7780B47j91o14j47j34N12O67L06Rj36j96l94m97m1R3K95P18j52J26Q1m72k67n95
$$ 247 56 -558 -705 -839 -327 340 646 655 519 323 -71 -568 -609 -516 -221 497 345 471 552 80 -187 -782
7802g82J01M37L44K98K62J4m76l20l62l86M04J86N91l7P71m12n96l31l49q7L40
$$ -782 -681 -244 100 398 660 674 198 -122 -484 -870 -466 -280 311 274 1045 633 37 -294 -643 -730 -390
7823c90L53L83J86L16l63o62k5m47oM46N80K15P8j4k65m25n13n0K36K08O75NJ49
$$ -390 -37 346 532 848 485 -177 -202 -649 -655 -209 371 586 664 650 385 -40 -553 -603 -367 -159 516 521 670
7846F70j47n51l96j21l0K82L07M67J06mj13n54n67m8J23M49L06M03N1j53k90n06
$$ 670 523 -28 -424 -545 -575 -293 14 481 587 583 470 -84 -651 -699 -576 -127 179 582 633 480 190 -316
7868c16k09J01o4M74M66m8K1p6m00k11k62l3L89N77L85l71K29m60m70r4m0l7M54
$$ -316 -525 -424 -488 -14 452 404 425 349 -51 -262 -524 -557 -168 409 794 423 652 192 -278 -372 -412 -449 5
7891EK53N41k84j26k53o62j62P1M96L86K36K65l73k43m37l90J29L0M90K28J87
$$ 5 258 799 515 389 136 -526 -688 -617 -121 265 501 766 393 150 -287 -677 -548 -518 -28 200 387
7912C87J72l09l91k34m2k4J04L58M04P5k00k61j64k67k49M9L66N94J53Q7j94k04
$$ 387 559 250 -141 -375 -417 -441 -337 21 425 500 300 39 -125 -392 -641 -592 -226 368 521 608 414 210
7934B10m45m22j27M10M57L58L2L25n70m19k58j74J72L50K50M63Q6l56r7o13j45
$$ 210 -235 -657 -784 -374 83 441 473 798 228 -191 -449 -623 -451 -101 149 612 698 342 245 -368 -513
7955e13j18M21K14L50J01L3j99l58n30J6lK45N78L53K16l69k67m46p0j37j6L12
$$ -513 -631 -210 4 354 455 488 289 -69 -599 -583 -586 -341 237 590 806 437 170 -276 -346 -483 -499 -187
7977a87L79M17j55j33l00m11k09J4J74M51N02J47j57k06m54l96J51jK01L70J08
$$ -187 192 609 454 321 21 -390 -599 -585 -411 40 542 689 532 326 -128 -524 -373 -374 -173 197 305
7998C05K83k2k77l93n89rJ63N22L00K54p7l00j89o05L74j61M1N54K97R0k17p5
$$ 305 588 566 289 -104 -693 -702 -539 -17 283 537 460 160 -29 -634 -260 -421 -380 174 471 561 344 269
8020B69l19l91j68O7M01N79K73p8m94k10j46m72K81J16M92L17J00k85j07n61l51
$$ 269 -50 -441 -609 -542 -141 438 711 633 139 -71 -217 -689 -408 -292 200 517 617 332 225 -336 -687
8041f87P7O2O13K51K28r7p4k58j47n52J16N9N60L65l1j52M9n51k42j04J79j16
$$ -687 -610 -548 65 316 544 447 373 115 -32 -584 -468 -409 151 516 485 333 382 -169 -411 -515 -336 -452
8063d52O60J02j9jl13k21l09k00J93P60m2M13j74o5l99l71j35J03L13M66j3R1
$$ -452 208 310 291 290 -23 -244 -553 -753 -560 200 158 571 397 332 -67 -438 -573 -470 -157 309 296 387
8085C87J92l83m22k76j41J15L57N58j34K81j54k09l16m14k0M71K85L85P8j3l43
$$ 387 579 196 -226 -502 -643 -528 -171 387 253 534 380 171 -145 -559 -579 -108 177 562 640 627 284
8106B84m75m33L69m4k0O13K39L72o76j96j70k81J67o1Q8M16M09j93k70j24o72
$$ 284 -191 -624 -255 -299 -319 294 533 905 229 33 -137 -418 -251 -312 -224 192 601 408 138 14 -658
8127f58M53OK1K27L99M9k6l18n64L8o6r0N34J70L79k85r6k32l75%j68L72M53L2
$$ -658 -205 -199 -178 49 448 497 471 153 -411 -373 -439 -529 5 175 554 269 173 -59 -434 -434 -602 -230 223 255
8151B55K69K30n17l34k70L8J08K17L68N4K96n55j09k32n44Q2K94L63L42K48l43
$$ 255 524 754 237 -97 -367 -329 -221 -4 364 418 714 159 50 -182 -726 -644 -350 13 355 603 260
8172B60J03l05n44PkNP95K07R2m09p2k41l31r1J73N48O4R5P0
$$ 260 363 58 -486 -479 -481 -476 319 526 618 209 137 -104 -435 -526 -353 195 259 354 424
8191D24
$$ Imaginary data points
##PAGE= N=2
##DATA TABLE= (X++(I..I)), XYDATA
0@%%%%%%QqNj3J6k4L2m0N6o4Q0j04J20j45J74k06K50k91L41m02M66n42O26p23
$$ 0 0 0 0 0 0 0 8 0 5 -8 8 -16 16 -24 32 -32 48 -56 64 -81 93 -113 137 -154 187 -215 251 -291 335 -388
30c88Q27r43J076j216J375j551J743j959K191k448K730l034L370l733M131m568
$$ -388 439 -504 572 -644 731 -820 923 -1036 1155 -1293 1437 -1597 1773 -1960 2171 -2397
46b397N043n564O131o758P445q199R040r968J1006j2176J3497j5011J6759j8806
$$ -2397 2646 -2918 3213 -3545 3900 -4299 4741 -5227 5779 -6397 7100 -7911 8848 -9958
60i958K1248k4213K7908l2654L9020m8069O2026q6669J43229n16938j92586P27128
$$ -9958 11290 -12923 14985 -17669 21351 -26718 35308 -51361 91868 -425070 -617656 109472
72A09472L79526M96948j16122m44580n51675n33188l17313K14054M08169O13183
$$ 109472 488998 985946 869824 425244 -126431 -659619 -976932 -762878 -354709 258474
82B58474N08052J29431j94871m59192o51350l60937q8225K05494N81540N65191
$$ 258474 766526 895957 701086 241894 -409456 -770393 -858618 -653124 -71584 493607
92D93607K77719Q9539l46931n94041m28179k96491j5597M55362N24168M23817
$$ 493607 771326 860865 513934 -80107 -508286 -804777 -820374 -365012 159156 582973
102E82973K63217j53514m38192m75863m53459j37866K29217L96200N25603L92197
$$ 582973 846190 692676 254484 -221379 -674838 -812704 -583487 -187287 338316 730513
112G30513J2614k20590m44931n37123k54454J7830K39420N13596M57728J93649
$$ 730513 743127 522537 77606 -459517 -713971 -696141 -456721 56875 514603 708252
122G08252k7062l50539n08073l59935j84872J05633M11193M39447L54355J44006
$$ 708252 681190 330651 -177422 -537357 -722229 -616596 -205403 234044 588399 732405
132G32405k24144l99209m11937l48319l2932K69504L76093M32897K74790n2463
$$ 732405 508261 109052 -302885 -651204 -684136 -414632 -38539 394358 669148 616685
142F16685k61828m15396m23530j67979Q5761K89629M45456L49211J17976j07251
$$ 616685 354857 -60539 -484069 -652048 -566287 -276658 168798 518009 635985 528734
152E28734l57403m27626k84659r1180J78691L87385L75373K62727M1329k50086
$$ 528734 171331 -256295 -540954 -632134 -453443 -66058 309315 572042 613371 363285
162C63285l74965l55881k35084M2140K79749L65152L50425J64761j00899k82671
$$ 363285 -11680 -367561 -602645 -560505 -280756 84396 434821 599582 498683 216012
172B16012l82392l21487r2780J32563L12455L85535K59291M8683j64710l46818
$$ 216012 -166380 -487867 -580647 -448084 -135629 249906 509197 557880 393170 46352
182D6352l58051k14317j2866K20116L56699L22060J81955m2357k60146l45116
$$ 46352 -311699 -526016 -538882 -318766 37933 359993 541948 499591 239445 -105671
192a05671l02217j38851J00345K78051L43493K78155P6896j39917k91421l43595
$$ -105671 -407888 -546739 -446394 -168343 175150 453305 530201 390284 98863 -244732
202b44732k34349k6987J69684L15823L27080J85079j1406k08499l28508k93972
$$ -244732 -479081 -506068 -336384 -20561 306519 491598 480192 271693 -56815 -350787
212c50787j49322N4133K46686L22260K67726J11324j05885k67281l11896k44468
$$ -350787 -500109 -445976 -199290 122970 390696 502020 396135 128854 -183042 -427510
222d27510o1100J47557K76501L08551K09284Q482j75245k90441k96598j61925
$$ -427510 -488610 -341053 -64552 243999 453283 461765 286520 -3921 -300519 -462444
232d62444L0748K01983L05021K68047J19398o4140k36173l03613k33541q6102
$$ -462444 -431696 -229713 75308 343355 462753 398613 162440 -141173 -374714 -460816
242d60816J06403K61198K87921K08188M6634j50161k68708k75274j81904K876
$$ -460816 -354413 -93215 194706 402894 449528 299367 30659 -244615 -426519 -423643
252d23643J80454K71629K66039J42061m7345j99897k79181k45767r7221P9688
$$ -423643 -243189 28440 294479 436540 389195 189298 -89883 -335650 -432871 -353183
262c53183K22188K82780K12901N9593j09875k46470k72139j78685k7870J44912
$$ -353183 -130995 151785 364686 424279 314404 67934 -204205 -382890 -410760 -265848
272b65848K61275K52738J50364r501j78065k62356k36227j20756N2694K00453
$$ -265848 -4573 248165 398529 389028 210963 -51393 -287620 -408376 -355682 -155229
282a55229K58802K20188Q3019r0647k14094k57739j96445m2244J18973K28021
$$ -155229 103573 323761 406780 316133 102039 -155700 -352145 -394389 -275416 -47395
292d7395K52439J63830P694j43682k42905k37692j29714K2925J70566K50191K15772
$$ -47395 205044 368874 376568 232886 -10019 -247711 -377425 -354500 -183934 66257 282029
303B82029R9135n5259j95327k47242j94087o8641R0606K12517K39148J72285L3695
$$ 282029 381164 325905 130578 -116664 -310751 -379392 -288786 -76269 162879 335164 368859
314C68859j23353k21337k30573j46572M649J47411K27240K20009J15020l9272
$$ 368859 245506 24169 -206404 -352976 -348327 -200916 26324 246333 361353 322081
324C22081j67628k31687k02392q1707O9195J87094K31782J78143M9896r6415k05305
$$ 322081 154453 -77234 -279626 -361333 -292138 -105044 126738 304881 354777 258362 53057
335E3057k25090j50288k0105J24035K16992K12901J23974j2388j49224k20933
$$ 53057 -172033 -322321 -342426 -218391 -1399 211502 335476 323088 173864 -47069
345d7069j98591r7069M6789J69459K18453J83004O7890p9143j84263k14901j62846
$$ -47069 -245660 -342729 -295940 -126481 91972 274976 342866 263723 79460 -135441 -298287
356b98287l5349J05436J96086K09064J36746N138j27188k06661j98521j07847
$$ -298287 -333636 -228200 -32114 176950 313696 318834 191646 -15015 -213536 -321383
366c21383K3482J47672K11822J82972Q0382n2366j66761k10160j65277n2978Q1365
$$ -321383 -297901 -150229 61593 244565 324947 272581 105820 -104340 -269617 -322595 -241230
377b41230J81000K04179J44742K4606j07763j91426j95592j21080N000J29623
$$ -241230 -60230 143949 288691 313297 205534 14108 -181484 -302564 -297564 -167941
387a67941J98175J83839R5015l3578j48269k00604j69234o7530O1729J63561J98597
$$ -167941 30234 214073 309088 275510 127241 -73363 -242597 -310127 -248398 -84837 113760
398A13760J51565L9378q6945j75574j93036j30992j1045J09748J83882J84857
$$ 113760 265325 304703 217758 42184 -150852 -281844 -292889 -183141 741 185598
408A85598J06086j5482j28401j90617j71631q0674M0096J46631J92330J54377
$$ 185598 291684 276202 147801 -42816 -214447 -295121 -255025 -108394 83936 238313
418B38313N6030o4956j62548j87885j35579l1795R0616J72569J79020J17958M789
$$ 238313 294343 229387 66839 -121046 -256625 -288420 -197804 -25235 153785 271743 276532
429B76532j13865j76695j70506r6856K4423J29842J79385J60516P0242m8900j42721
$$ 276532 162667 -14028 -184534 -281390 -256967 -127125 52260 212776 283018 234118 91397
440I1397j82704j43745m2850O9058J56454J80715J21784J9039q9134j68378j71064
$$ 91397 -91307 -235052 -277902 -208844 -52390 128325 250109 269148 180014 11636 -159428
451a59428j01340L002J12357J73510J56317Q3244k7770j31436j71745j45362o1258
$$ -159428 -260768 -257766 -145409 28101 184418 267662 239892 108456 -63289 -208651 -269909
462b69909N4738J42187J70385J32361L3364p5356j48804j69754j13750o924R1431
$$ -269909 -215171 -72984 97401 229762 263126 187770 38966 -130788 -244538 -251462 -160031
473a60031J58555J63391Q9798j4094j08256j65716j48927o9262L3259J26877J66396
$$ -160031 -1476 161915 251713 237619 129363 -36353 -185280 -254542 -221283 -94406 71990
484G1990J32558N0032n6208j40675j59898j19268k8054P8531J46439J56366J04263
$$ 71990 204548 254580 198372 57697 -102201 -221469 -249523 -170992 -24553 131813 236076
495B36076Q56r6505j49427j50126q4024K2552J09059J54713J40645O0418m1957
$$ 236076 236932 140427 -9000 -159126 -243150 -220598 -111539 43174 183819 244237 202280
506B02280j23154j56409j23811l9050N9569J34974J53247J07974J8500p9795j43682
$$ 202280 79126 -77283 -201094 -240144 -180575 -45601 107646 215620 234120 154325 10643
517A0643j45863r0797M073R7209J46182J37962P2997k6581j11718j48213j27058
$$ 10643 -135220 -226017 -221944 -124735 21447 159409 232406 205825 94107 -54106 -181164
528a81164n0830M6386J22322J47707J12687L1368o4872j33392j43469r6467r919
$$ -181164 -231994 -185608 -63286 84421 197108 228476 163604 30212 -113257 -209724 -219643
539b19643Q3168J38664J35491Q0460j1001r8386j41648j28288o0930L2667J10215
$$ -219643 -136475 2189 137680 218140 207139 108753 -32895 -161183 -222113 -189446 -79231
550g9231J42081J16717M0247m9494j20048j42850j01481k0581O6134J30338J36424
$$ -79231 62850 179567 219814 170320 50272 -92578 -194059 -214640 -148506 -18168 118256
561A18256Q4050M096q2949j36119j26761p0491J5649R9772J35926J17406N4003
$$ 118256 202306 206402 123453 -12666 -139427 -209918 -194269 -94497 41429 158835 212838
572B12838l6816j09248j34026j09836l3561N5931J15082J34861R5147J1234o7309
$$ 212838 176022 66774 -67252 -177088 -210649 -154718 -39636 95225 190372 201606 134297
583A34297j22586j32428p6357N279P9820J31947J21570N8088j9117r6270j32995
$$ 134297 11711 -120717 -197074 -191795 -111975 19972 141542 199630 180513 84243 -48752
594d8752j07913m5665L7023J10614J27880R7817L0342n8990j15069j22883q9015
$$ -48752 -156665 -202330 -165307 -54693 73187 171004 201346 142356 27287 -95596 -184611
605a84611q747P4206J16975J21751P3204j3521q2029j21926j16575n1617K7395
$$ -184611 -193358 -119152 -2177 119574 192778 179257 97228 -24698 -141273 -192890 -165495
616a65495R1851J28061J02566L3852l9843j05640j25668q6173k1622N6263J15756
$$ -165495 -73644 54417 156983 190835 150992 45352 -80316 -166489 -188111 -131848 -16092
627a6092J16729P5045O501p4969j17529j08746o5018J4804Q7090J15333J05169
$$ -16092 100637 175682 182183 107214 -10315 -119061 -184079 -169275 -82185 33148 138317
638A38317M8383l4511r2698j17479r6509k7356M6134R9797J18851Q1305J1496
$$ 138317 186700 152189 59491 -57988 -154497 -181853 -135719 -35922 82929 164234 175730
649A75730n7268j09597j12716o5728J349P1418J14527J02593N3927j6469q5873
$$ 175730 118462 8865 -103851 -169579 -168230 -96812 17715 120308 174235 157766 71893
660G1893j12870r4219m1461L5290R3236J10364Q6881K3729m9887r7513j09648
$$ 71893 -40977 -135196 -176657 -141367 -48131 62233 149114 172843 122956 25443 -84205
671h4205p5145o043O0629J03150J05908N9977q318p1003j08157r7056m5860K1168
$$ -84205 -159350 -165393 -104764 -1614 104294 164271 155953 84950 -23207 -120263 -166123 -144955
683a44955Q2841J08376Q6781L3482l6418r1478j04923p8398j8397N1317R6104
$$ -144955 -62114 46262 133043 166525 130107 38629 -66294 -144692 -163089 -111772 -15668
694a5668J01292O7668K263o2299r9592r7324n3928J1713P2484J02772Q9460L9899
$$ -15668 85624 153292 155555 93256 -6336 -103660 -157588 -145875 -73391 29381 118841 158740
706A58740k4976q1948j02623p9633k7387L9177Q9529R8857P0918J3001n3567r1795
$$ 158740 133764 51816 -50807 -130440 -157827 -118650 -29121 69736 140654 153655 100088 8293
718H293r5135o1687L503O3055R4538R2029M6627j6917p0314r8527q3728l1901
$$ 8293 -86842 -148529 -145026 -81971 12567 104596 151223 134306 63992 -34535 -118263 -150164
730a50164K7296P9328R9602P1756K0079l8996q8256r4016o2031r333N3695R1608
$$ -150164 -122868 -43540 56062 127818 147897 108901 20645 -73371 -135402 -144735 -91040 568
742E68Q7065N4860n441o6467q9863q3137m4281K2543P1439R0737P9426K7086l4154
$$ 568 87633 142493 137052 70585 -19278 -102415 -146696 -124153 -52714 38023 117449 144535 110381
755A10381p5076r3832o8599j1509M0725Q2965R2255N4594J842n1604r0215q2712
$$ 110381 35305 -58527 -127126 -138635 -97910 -14945 77310 131904 133746 82142 -8073 -90785
767i0785m4402P135O5539R0289P3567L7620k2405p4532q6112o9624k4704L7720
$$ -90785 -135187 -128052 -62513 27776 101343 138963 116558 42026 -44086 -113710 -138414 -100694
779a00694P6121Q4959O4183P882m6948p7964q5714n1863O690N1989Q3851Q1000
$$ -100694 -24573 60386 124569 132451 85503 7539 -78175 -130038 -123348 -71359 12492 93492
791I3492L6893j4209o1047q8656o9809k6430K2534P2474Q5434O0004J8721l6209
$$ 93492 130385 116176 55129 -33527 -103336 -129766 -107232 -34758 50676 110680 129401 93192
803I3192p8255p9411n4761o369M9722P7238P6538M7760r504n6099p7605p5134
$$ 93192 14937 -64474 -119235 -125604 -75882 1356 77894 125654 116150 60051 -17554 -92688
815i2688l4203K1806N9743Q1050O8267J9837k8605o6263q2742n6371j0278L6302
$$ -92688 -126891 -105085 -45342 35708 103975 123812 95207 28944 -53798 -110169 -120447 -84145
827h4145P4849P7539M6321J860m7570p7470p0350l9642R094N7857P5624O5861
$$ -84145 -9296 68243 114564 116424 68854 -8616 -78966 -118608 -109514 -51657 23967 89828
839H9828L1422k3266o2346p4164o1646j9076L3432O4506P5557N3920N378l9416
$$ 89828 121250 97984 35638 -38526 -100172 -119248 -85816 -21310 54247 108167 113545 74129
851G4129o9228p3459m2647L530M6617P3825O7295L2845j1830n5444p4403n9728
$$ 74129 4901 -68558 -111205 -107675 -61058 12767 80062 112907 101077 45633 -28770 -88498
863h8498k5233K2269O2075P1933N4044J6029l3140o5921o9189m7809m346M1596
$$ -88498 -113731 -91462 -29387 42546 96590 112619 79479 13558 -55631 -103440 -107786 -66190
875f6190O7171O7107L9386o956m7564o9563o2625k9051J5911N3304P0804N6128
$$ -66190 981 68088 107474 100518 52954 -16609 -79234 -108285 -92374 -39070 31734 87862
887H7862J9403k3903n9605o9382m8468j0567L2557O3783O6142M1636J260m1249
$$ 87862 107265 83362 23757 -45625 -94093 -104660 -72103 -8320 57822 99458 100718 59469
899E9469o5706o2568l3803Q981M7867O6190N7950K5088j8458n3098o6388n2009
$$ 59469 -6237 -68805 -102608 -93627 -45760 20430 78380 103468 85010 31912 -34476 -86485
911h6485j5243K6586N7112O5523M4725O117l3986o0899o2645l6986L149M1006
$$ -86485 -101728 -75142 -18030 47493 92218 98335 64349 3450 -59195 -96181 -93032 -52026
923e2026O2913N8308K9044j1740m7470o3374n3332k0583K0570N2143O2743M7369
$$ -52026 10887 69195 98239 86499 39029 -24345 -77677 -98260 -77690 -25547 37196 84565
935H4565J1620k8008n5894o1209m0513l077L5458N8498N7882L3194n808m1435
$$ 84565 96185 68177 12283 -48926 -89439 -92516 -57058 1440 59322 92516 86708 45273
947D5273n9961n3849k5095J3781M6682O0179M9010J7412k1994n1413n8939m3246
$$ 45273 -14688 -68537 -93632 -79851 -33169 27010 76020 93432 71438 20025 -38914 -82160
959h2160q759K9644N4177N7151L6297J03l5905n6316n3920k9031P999M1576N7168
$$ -82160 -90919 -61275 -7098 50053 86350 86453 50548 -5768 -59688 -88719 -80720 -39144 18024
972A8024M9668K1357j5617m6190n7433m4449j3438K3157N0027N5729L8586N614
$$ 18024 67692 89049 73432 27242 -30191 -74640 -88078 -64921 -14894 40835 79421 85035
984H5035k9908n2531n3419l2077K232L5838N4073N0185K5158r910m1006n4631
$$ 85035 55127 2596 -50823 -82900 -80668 -44830 9243 59428 84586 74676 33670 -20961
996b0961m5652j7848J7319M5208N4213L9956J0742k4167m8507n2419l4880k704
$$ -20961 -66613 -84461 -67142 -21934 32279 72235 82977 58810 10303 -42116 -76996 -79700
1008g9700L0418N0590M9945K8468m831l5793n1888m6444k1649J2443L9967N2099
$$ -79700 -49282 1308 51253 79721 74890 39097 -12791 -59235 -80884 -68441 -28474 23625
1020B3625M2348J4079j9080m3939n1376l6767o454K4981M6814M9592L0675m92
$$ 23625 65973 80052 60972 17033 -34343 -71110 -77564 -52583 -5769 43823 74498 74006
1032G4006l0573m8684m6724k4151O741L5983M9724M2506J8216j4141l9908m9077
$$ 74006 43433 -5251 -51975 -76126 -69385 -33402 16322 58828 77044 62903 22995 -26082
1044b6082l8459j1274K0412M2883M7965L3484M137k5962m5015m6426k7250K414
$$ -26082 -64541 -75815 -55403 -12520 35445 68929 73066 47104 2089 -44337 -71587 -69173
1056f9173L0808M7094M2451K1454q461l5417m7671l8532j5447J4991L9653M6093
$$ -69173 -38365 8729 51180 72634 64173 28756 -18915 -57447 -72894 -57903 -18250 27843
1068B7843L4701R339k1587m1471m5337l0255k041K6864M2971M3361K4900n279
$$ 27843 62544 71883 50296 8825 -36512 -66767 -68808 -41944 1027 44388 69288 64009
1080F4009l0369m4285m0568j8276J0601L4050M5762L5964J1606j5250l8344m4690
$$ 64009 33640 -10645 -51213 -69489 -58888 -24838 20924 56888 68494 53244 14900 -29790
1092b9790l0587o611K0915M1755M1587K6610Q36k7663m1945l8947k2411O262L1924
$$ -29790 -60377 -66988 -46073 -4318 37269 63879 64715 37052 -4893 -43840 -66251 -59989 -28065
1105b8065M1543L7260J6411j3629l3770m1843l4178q884J7812L6068M2705K8133
$$ -28065 13478 50738 67149 53520 19750 -22093 -56271 -65155 -47343 -11275 31430 59563
1117E9563K894k1552l9787m0195k2002J667K6347M1790L5839J7718o880l1583
$$ 59563 62457 40905 1118 -39077 -61079 -59412 -33065 8725 44564 62282 55402 23819
1129B3819m0892l2391j3691J3640L4963L8363L0359P794j9803l5416l8276k6639
$$ 23819 -17073 -49464 -63155 -49515 -14552 23811 54170 61964 42161 6745 -31531 -58170
1141e8170m15K3183L6640L8091K0256n226k5720l9128l4773j3733Q500K9698L9911
$$ -58170 -58585 -35402 1238 39329 59585 54359 28639 -10489 -45262 -58995 -50495 -20797 19114
1154A9114K9080J0509j2998l4297l7244k5511p001J9674L5490L4670K3566N12
$$ 19114 48194 58703 45705 11408 -25836 -51347 -58348 -38674 -3184 31486 55052 55564
1166E5564k4716l4580l3954j9483O839K6107L5428L2812J2670j1406k7737l6997
$$ 55564 30848 -3732 -37686 -57169 -50330 -24223 11205 44017 56687 45281 17544 -19453
1178a9453k8848o524J3893L1459L6525K3214K803j7850l4415l3554j8873L81K3195
$$ -19453 -48301 -54825 -40932 -9473 27052 50266 53069 35219 804 -32750 -51623 -51242 -28047
1191b8047L5233K9967J6442o517k7151l3330k8696j2148J2900K8367L2883K6870
$$ -28047 7186 37153 53595 47078 19927 -13403 -42099 -54247 -41347 -12980 19903 46773
1203D6773N146j6259k9020l3655k2148K41J8347L1753L2335J6216l542k1758l3819
$$ 46773 51919 35660 6640 -27015 -49163 -48922 -30575 1178 33513 49729 46187 24429 -9390
1216i390k8137j2630O803K6423L2832K4730R592j1993k8857l0650k2964n152J7048
$$ -9390 -37527 -50157 -43354 -16931 15901 40631 50223 38230 9373 -21277 -44241 -49393 -32345
1229c2345K9099L0229K0153j074j9932k9369k9401j5261N250K1767L1006K7088
$$ -32345 -3246 26983 47136 46062 26130 -3239 -32640 -47901 -42651 -20884 10122 37210
1241C7210J0158q486k4176l1625k3134o625J1948K7151K9966K0140L054j6301
$$ 37210 47368 38882 14706 -16919 -40053 -46678 -34730 -7579 22387 42527 45581 29280
1253B9280k8750k7651j7491J100K0328K8530K6550J3787o227k2040k8796k4699
$$ 29280 530 -27121 -44612 -43512 -23184 5346 31896 45683 39456 17416 -11380 -36079
1265c6079r042R701K3771K9102K1736M709j2871k5640k8491j7643j485J6016K7535
$$ -36079 -45121 -35420 -11649 17453 39189 43898 31027 5387 -23104 -40747 -42232 -26216 1319
1278A319K6279J4987k711j9571k7554k4087j2089P124K2026K6820K2452P926j0776
$$ 1319 27598 42585 39874 20303 -7251 -31338 -43427 -36303 -14277 12543 34995 42921 32145
1291C2145k3216k7109j9747l284J3225K4890K6421J6244l09j5989k6332k4955
$$ 32145 8929 -18180 -37927 -41211 -27986 -3096 23325 39569 39260 23271 -3061 -28016
1303b8016j2237L101J9597K6561K2025R470p145k1743k5733j9758o586J1422K2918
$$ -28016 -40253 -37152 -17555 9006 31031 40501 33356 11613 -14120 -33878 -40464 -29042 -6124
1316f124K5192J7729J830j4198k3503k4545j4495J865J6433K4414K2977J0748
$$ -6124 19068 36797 38627 24429 926 -23619 -38114 -36249 -19816 4598 27575 38323
1328C8323m649j8535k5561k0265p460P568K1060K4759J7849M411j1136k2478k3302
$$ 38323 33674 15139 -10422 -30687 -38147 -30579 -9519 15240 33089 37500 26364 3886 -19416
1341a9416j5707j100J4503K3156K2093J2626k522j6438k3087k1422r279N891J8180
$$ -19416 -35123 -36223 -21720 1436 23529 36155 33633 17195 -5892 -27314 -36593 -30702 -12522
1354a2522K3865J8872N740q570j9993k3781j5781k819J1216K1860K2104J3281
$$ -12522 11343 30215 35955 27385 7392 -16389 -32170 -34989 -23773 -1913 20191 33472
1366C3472Q9j4115k2492k0241j1208L320J6825K2084J8864Q242o797j7998k1973
$$ 33472 33561 19446 -3046 -23287 -34495 -31175 -14350 7734 26598 34840 28043 10045 -11928
1379a1928j7502m758R508J9331K1900J4883J201j1874k0031k1078j1861J420J3833
$$ -11928 -29430 -34188 -24680 -5349 16551 31434 32635 20761 730 -20348 -32209 -30789 -16956
1392a6956K1072J9578R104l962j6385k1205j7480o806P239J7980K0760J5358M023
$$ -16956 4116 23694 32798 28836 12451 -8754 -26234 -33040 -25801 -7821 12939 28297 32320
1405C2320j0126j9182j9854j3367o47J2380J9758J9113J0745k358j4159k0085
$$ 32320 22194 3012 -16842 -30209 -30856 -18476 1282 20395 31140 28782 14623 -5462
1417e462j8075p688M939J6052K0094J5888N227p571j7346k0179j3655k448R888
$$ -5462 -23537 -31225 -26286 -10234 9860 25748 30975 23404 6058 -14121 -27776 -30224 -20336
1430b0336J8601J9085J1495j91j2373j9116j7829r021L129J4139J9073J6380O770
$$ -20336 -1735 17350 28845 28654 16281 -2835 -20664 -29685 -26556 -12417 6656 23036 29806
1443B9806n735j5647j9105j4652l803P922J6692J8673J2755J438j0180j7683j8044
$$ 29806 24071 8424 -10681 -25333 -29136 -21214 -4522 14151 26906 28344 18164 481 -17563
1456a7563j0269J095J2195J8255J6631Q078l759j4166j8152j5015n379O011J5393
$$ -17563 -27832 -26737 -14542 3713 20344 28422 24663 10497 -7655 -22670 -28049 -22038 -6645
1469f645J7930J3087L332q625j6189j7502j1226o77J0547J6843J6488R504k201
$$ -6645 11285 24372 27704 19079 2890 -14612 -25838 -26515 -15968 875 17363 26867 24666
1482B4666j1924j7384j5387o861M462J3320J7407J3914M223o177j5058j7200j1525
$$ 24666 12742 -4642 -20029 -26890 -22428 -9108 8299 22213 26436 20259 5201 -11999 -23524
1495b3524k112Q445J5470J6272J0465m30j0480j6215j5185q109K484J2121J6452
$$ -23524 -25636 -17191 -1721 14551 25016 24586 14106 -2109 -17294 -25403 -22919 -10798 5654
1508E654J3984O030m976j3370j6395j2490l472O932J4342J5950J0945R56q894
$$ 5654 19638 25668 20692 7322 -9073 -21563 -25035 -18103 -3761 12189 23134 24090 15196
1521A5196j4745j5253q791O55J0653J5465J3868P220l341j1870j5591j2812m732
$$ 15196 451 -14802 -23593 -22938 -12285 3180 17048 24268 20927 9057 -6534 -19346 -24078
1534b4078N689J2442J5525J1310K540p017j4046j4736r740m44Q842J4499J4095
$$ -24078 -18389 -5947 9578 20888 23428 16411 2365 -12371 -22111 -22555 -13713 786 14881
1547A4881P692j339j0454j4609j3032o211L613J1811J4485J1903M033n457j2588
$$ 14881 22573 21234 10780 -3829 -16861 -23072 -19459 -7648 6837 18740 22773 17316 4728
1560D728j4819r942j992P092J3527J4051Q587j49q990j3728j3091o650J804J0323
$$ 4728 -10091 -20033 -22025 -14933 -1406 12645 21232 21083 12093 -1635 -14726 -21376 -19572 -9249
1574i249J4032J1974M865l903j1306j4226j0609l094N753J2712J3190R176J409
$$ -9249 4783 16757 21622 17719 6413 -7813 -18422 -21516 -15763 -3051 10139 19315 20724
1587B0724p556j2851j2925p760P86R205J3033J2276N971k897j0028j3614j0720
$$ 20724 13168 317 -12608 -20368 -19582 -10377 2656 14932 20903 18006 7978 -5636 -16356
1600a6356m506M719J1140J3128R664K260n739j2019j2548q698n27P876J2344J1964
$$ -16356 -20862 -16143 -5003 8125 17789 20049 14310 2291 -10257 -18955 -19482 -11606 738 12702
1614A2702O647j190q759j2683j1312m821K630J0090J2582J0239L646m787j0643
$$ 12702 19349 18159 9400 -3283 -14595 -19416 -16786 -6696 5886 16125 19771 14984 4341
1627D341j2509r115j822O181J1341J2180P620M0p868j1293j1393o308J575Q879
$$ 4341 -8168 -17283 -19105 -12924 -1583 10597 18217 18257 10389 -904 -12297 -18605 -17030 -8151
1641h151J2012J0231M630l471r532j1833r651k709M753J0364J1871Q120J213n967
$$ -8151 3861 14092 18722 15251 5719 -6114 -15765 -18474 -13721 -3357 8514 16634 17847 11880
1655A1880j0778j1622o912N60P189J1340J0598N364k031q327j1527r552l926L596
$$ 11880 1102 -10520 -17432 -16872 -9683 1657 12255 17619 15588 7261 -4266 -13818 -17744 -14148
1669a4148R253J1499Q415K348m930j0156j0934p169q18O121J0575J0483N972q20
$$ -14148 -4895 6604 15019 17367 12437 2281 -8653 -15822 -16640 -10519 56 10539 16511 15691
1683A5691p277j1010r543m672K212Q273J0985Q870L197l637r184j0642p703k086
$$ 15691 8414 -2596 -12139 -16811 -14599 -6326 4659 13529 16726 13089 3905 -6737 -14440 -16526
1697a6526N251R910R829O920J70o090j0295r597n367R58P408J0237R336L707k494
$$ -16526 -11275 -1365 8464 15384 15554 9464 -831 -10428 -15795 -14837 -7429 2808 12144 15851 13357
1712A3357q028j0341q036k634L665Q797J0130P074J485n241r171r422o082j20
$$ 13357 5329 -5012 -13048 -15682 -12017 -3220 6910 13984 15469 10228 1057 -8365 -14447 -14567
1726a4567O050R402R178N179j606p112r375q648l441K884P408R613P683J911l487
$$ -14567 -8517 885 10063 15242 13636 6524 -2851 -11499 -14940 -12056 -4648 4965 12648 14559 11072
1741A1072q213r755o490r36M707Q858R095N304K7n886r040q469m435J547O848
$$ 11072 2859 -6896 -13386 -14322 -9615 -757 8338 13642 13669 7783 -1257 -9726 -14161 -12614 -5766
1756e766R107P653L431k954p294r083p082k021L911Q014Q554O242P63m860q396
$$ -5766 3341 10994 14425 11471 4177 -4906 -11988 -14009 -10098 -2084 6470 12712 13475 8615 219
1771B19q414m913L38N912Q288Q013L935j660o518q548p150k749K927O789Q691
$$ 219 -8195 -13108 -12770 -6858 1430 9443 13378 11718 5200 -3348 -10498 -13247 -10320 -3531 5160
1786E160O141J735l809p664p956n623l56M559P726Q011M324l88n622p962p571
$$ 5160 11301 13036 9227 1563 -6393 -12016 -12372 -7813 -87 7924 12248 11860 6238 -1724 -9295
1801i295l108J442O309Q208O495K313k397o994p893n723j625L500P310P642N156
$$ -9295 -12403 -10961 -4652 3556 10051 12364 9967 2973 -4920 -10643 -12268 -8768 -1458 6184 11340
1816A1340M63m667p384p343m115O34N343P580O934L232j900n818p646o271j964
$$ 11340 11803 7136 -248 -7591 -11706 -11072 -5729 1851 8785 12017 10117 4299 -3347 -9618 -11582
1831a1582K562O574P152N266J579l719o726p211m486k48M203P085O693L800o88
$$ -11582 -9020 -2446 4706 9972 11551 7832 1106 -6105 -10591 -10839 -6636 449 7142 10942 10254
1846A0254n268o770o619k576J827N174P252N791J761k247o392p093m801r72L353
$$ 10254 4986 -1784 -8403 -10979 -9152 -3978 3274 9065 10826 8579 2187 -4906 -9707 -10679 -7326
1861g326O575O519M271L33m320o576o129l420N23M902O661N642K925j732n444
$$ -7326 -751 5768 10039 10372 6052 -524 -6653 -10073 -9550 -4648 2013 7655 10580 8848 3404
1876C404o598n632j344K367N643O604M825N48l130n967o438l523l88M243O162
$$ 3404 -3194 -8826 -10170 -7803 -2160 4444 9269 9817 6687 720 -5718 -9241 -9629 -5386 776
1891G76N837K904o17m827o167n338k420K119M893N911M938J424k461n185o181
$$ 776 6613 9517 8900 4073 -2094 -7432 -9852 -7733 -2840 3071 8009 9433 6972 1787 -4394
1906d394m461j85K974N376O200L345m25l276n951n633k598R71M227N788M817K335
$$ -4394 -8855 -9040 -6066 -690 5510 8855 8430 5154 -797 -6430 -9028 -8057 -3830 1958 6775 9110
1922I110j488m902n888m253j546K565M970N655L951K33k855n349n324l328J33
$$ 9110 7622 2720 -3168 -7421 -8967 -6402 -1432 4223 8174 8407 5552 203 -5121 -8449 -8316
1937h316L710N214N362K682q31m386n442m518j973J542M574N346M122J314k058
$$ -8316 -4606 608 5970 8652 7821 3435 -2007 -6525 -8498 -6956 -2382 2964 7086 8400 6342
1952F342m867n434l599l77K750M984N017L105j00l373n242m866k380J198L596
$$ 6342 1475 -3959 -7558 -7935 -5185 -201 4816 7921 7821 4448 -794 -5660 -8040 -6842 -3246
1967c246N133M364J722j514m327m810m204r33K199M230N017L683M05k907m773
$$ -3246 1887 6251 7973 6459 2132 -2678 -6882 -7815 -5616 -1386 3631 7314 7719 4812 39
1982C9m688k810M55K860M705M549K495j113l408m700m210j829J636M089M548L748
$$ 39 -4649 -7459 -7004 -4144 561 5110 7605 6492 3084 -1616 -5826 -7655 -6019 -1930 2618 6366
1998F366Q96j652m407m817l257l70K433M635M520K788k16l116m624m267k079P23
$$ 6366 7262 5610 1203 -3614 -6871 -7241 -4808 -173 4347 7135 6919 3803 -821 -5088 -7167 -6444
2014f444L471M852L951J180j464l594m514l304q38J735L952M386L141L30k682
$$ -6444 -2973 1879 5830 7010 5546 1952 -2562 -5866 -6704 -4969 -1017 3369 6510 6840 4158
2029D158l969m433k332O2K940M414M035J873q90l176m185l740j758J526L579M317
$$ 4158 189 -4244 -6576 -6514 -3574 840 4875 6748 5858 2682 -1503 -5243 -7001 -5475 -1896 2421
2045B421L324R98j909l722m287l067k20K197M176M100K380l76k657m043l904j682
$$ 2421 5745 6743 4834 1112 -3175 -6242 -6462 -4265 -89 4011 6391 6015 3358 -685 -4589 -6271
2061f271O27L311L735L716J458j373l509m046l067j088K021L593L990K595K91
$$ -6271 -5644 -2333 1402 5118 6576 5203 1694 -2352 -5419 -6507 -4486 -893 3097 5692 5983
2076E983k088l538l867k248J78K446L684L634J810r33k482m138l197j350J163
$$ 5983 3895 357 -3510 -5758 -5580 -3134 550 4184 5994 5061 2579 -1559 -4756 -6106 -4943
2091d943L328L917K780J114j581l860l802k612l60K173L664L672K062j15k440
$$ -4943 -1615 2302 5082 6196 4615 755 -3047 -5659 -6019 -3846 -182 3490 5552 5437 2997
2106B997l604l605j606O61K491M125L281J117r97l015l858l052n18J622L121L554
$$ 2997 -607 -4212 -5818 -5157 -2666 1459 4740 5857 4860 1845 -2013 -5065 -5583 -3961 -840 2714
2122B714K618J32j868l527l386k309K48K405L305L519J855o44k930l267l349j087
$$ 2714 5332 5464 3596 69 -3317 -5626 -5378 -2973 332 3851 5706 5062 2132 -1135 -4484 -5571
2138e571J084K715L878K715P59j360l163l314k661k03J576L124L391K152j25j911
$$ -5571 -4487 -1772 2106 4821 5580 4220 1057 -2257 -4918 -5121 -3545 -421 2970 5122 4997 3086
2154C086l486l247j717N79K487L480L052J386j100k885l637k554o15J005K897
$$ 3086 -400 -3647 -5364 -4785 -2298 1182 4234 5620 4520 1635 -2002 -4556 -5171 -4166 -1269
2169a269L629K583Q1j480l176l120k307J74J958L196L229J645k56k434l413k973
$$ -1269 2360 4943 5024 3544 368 -2752 -5059 -4885 -2927 269 3498 5143 4887 2453 -960 -3933
2185c933j604J185K571L505K752O62j197k857l238k206o37J567L034L211K193
$$ -3933 -5537 -4352 -1781 1724 4476 5138 3941 1084 -2154 -4360 -4997 -3430 -396 2815 5008
2200E008P9k285l126k936j991N03K321L093L147J531r07k596l453k683r26J090
$$ 5008 5087 2802 -324 -3260 -5251 -4748 -2427 666 3813 5344 4437 1841 -1612 -4295 -5221 -4131
2216d131L210L065K560M91j383l369l154k126J1J657L165L098K016k86k482l183
$$ -4131 -921 2144 4704 5195 3812 443 -2711 -4837 -4826 -3169 -4 3094 5110 4824 2342 -841
2232h41k855j419P72K604L173K747Q12j162k519l140k413p73J453L083K887K340
$$ -841 -3696 -5115 -4343 -1739 1434 4181 4993 3831 1312 -1828 -4241 -5014 -3561 -478 2409 4749
2248D749J29j890l248k713j893K51J782L564K858J500p82k380l200k860q09O54
$$ 4749 4878 2988 -260 -2973 -4866 -4615 -2833 731 3589 5089 4307 1927 -1273 -4133 -4942 -4288
2264d288K750L456K380Q91j351k962l466j857l69J684K975K885K194pk028l350
$$ -4288 -1538 1918 4298 5189 3838 876 -2590 -4447 -4816 -3132 -157 2728 4922 4915 2887 -463
2280d63l122j570O57K525L106K822R02r67k388l112k807o77J218K967L292K077
$$ -463 -3585 -5155 -4498 -1973 1133 3955 4857 3890 1502 -1610 -4417 -5094 -3876 -909 2383 4460
2296D460M20j700l002l091j652l68K157L097K914J904p79k179l315k699j483J129
$$ 4460 4880 3180 178 -2913 -4565 -4933 -2776 321 3235 5139 4360 2181 -1134 -3833 -5316 -4187
2312d187K638L434K415P21j558k417l377k249l19J368L048L549J398k7j702l015
$$ -4187 -1549 1885 4300 5021 3463 1046 -2331 -4580 -4899 -3531 -483 3066 4464 4437 2735 -280
2328b80l065j442R4K612L109K693J429q25k574l292k771p60J005K851L333K391
$$ -280 -3345 -4787 -4693 -2081 1028 3721 5150 4325 1751 -1541 -4312 -5072 -4067 -1216 2117 4508
2344D508N27j501l206l204j831j29J911L119L284J658k64k680l108k899j282N72
$$ 4508 5035 3534 328 -2876 -4707 -4836 -2925 194 3478 5136 4872 2192 -916 -3815 -5097 -4525
2360d525K824L176K842R47j243l144l130k382m66J484L209L181K114P2j813l361
$$ -4525 -1701 1475 4317 5264 4021 877 -2253 -4635 -5101 -3617 -408 2773 4887 4959 3146 -215
2376b15l254j719N15K323L403K702J284o82k549l386k674j001J027L031L504K614
$$ -215 -3469 -5188 -4673 -2350 1053 3755 5039 4357 1808 -1578 -4252 -5253 -4226 -1195 2309 4923
2392D923L64j428l011l587k424J5K055L301L053J989n06k471l281l122j092N47
$$ 4923 5287 3859 848 -2739 -5163 -5148 -3093 208 3261 5250 4744 2273 -1008 -4130 -5222 -4675
2408d675K839L357K822J058j262k958l387k642p32J724L345L443K084J26k000
$$ -4675 -1836 1521 4343 5401 4139 1181 -2206 -4848 -5580 -3856 -511 2932 5016 5142 3142
2423C142l038l555j594R0K403L505L008J541r41k742l362k853j061J214K958L578
$$ 3142 104 -3451 -5045 -4955 -2552 953 3961 5502 4561 1819 -1543 -4396 -5457 -4243 -1285 2293
2439B293K678N35j840l169l556j954l94K058L461L407J725k97k460l652k904j445
$$ 2293 4971 5506 3666 497 -3059 -5013 -5407 -3349 112 3519 5244 4947 2487 -1165 -4069 -5514
2455e514R84K637L547K904J133j082l493l296k748o04J831K969L734K256J32k126
$$ -5514 -4530 -1893 1654 4558 5691 4609 1116 -2180 -4928 -5532 -3701 -732 3002 5258 5390 3264
2471C264l598l222k032M01K728L421L042J771r09k941l556l078j161J573L056
$$ 3264 -334 -3556 -5588 -5187 -2459 962 4004 5775 4866 1925 -1631 -4709 -5870 -4297 -1241
2486a241L446K877L99j594l338l669k343j92K434L646L279J956n68k249l754l350
$$ -1241 2205 5082 5481 3887 549 -3120 -5463 -5655 -3221 425 3704 5660 5092 2843 -911 -4261
2502d261j391P33L071L669K944Q19j248l294l484k857m82J914L541L567K148J11
$$ -4261 -5652 -4919 -1848 1821 4765 5584 4336 1042 -2442 -5299 -5781 -3867 -326 3241 5389 5500
2518E500k294l459l577j806L11K865L590L281J313q17l126l821k833j013J574
$$ 5500 3206 -253 -3830 -5636 -5325 -2460 1130 4411 5724 4907 1781 -2040 -4873 -5886 -4312
2533d312L220M092K223N60k032l364l612k582J83K293L879L420J860n00k597m173
$$ -4312 -1092 3000 5223 5783 3751 387 -3225 -5807 -5624 -3331 548 3968 5828 5328 2731 -1442
2549a442l080j302J138L037L849L147P86j906l331l849k625j84J756L923L718
$$ -1442 -4522 -5824 -4686 -1649 2200 5347 6133 4227 896 -2953 -5578 -5762 -4006 -83 3635
2564C635K201k52k469l509l769j927R36K745L932L359J089r67l464l885l171n17
$$ 3635 5836 5584 3115 -394 -4163 -6090 -5154 -2409 1523 4882 5971 5004 1540 -2345 -5516 -6033
2580f033J859L622L597K625M22k231l786l870j952M97K322L734L582J703j070
$$ -6033 -4174 -552 3045 5670 6092 3861 75 -3795 -5747 -5250 -2928 806 4388 6091 5021
2595E021k910l719l353j309J543L215L989L128N33j924l595m011k475K42J895
$$ 5021 2111 -1608 -4961 -6270 -4727 -1512 2477 5605 6138 4214 619 -3392 -5867 -5625 -3730
2610c730L948L683K219j93k965m054l410j784P72L708L817L166R03j476l238m056
$$ -3730 218 3901 6120 5927 2962 -1092 -4502 -6286 -5514 -1806 2011 5177 6080 4604 1366 -2690
2626b690l081l42J956L724M028K192L14k552l918l814k113O04K798M056L533J638
$$ -2690 -5771 -6113 -4157 -433 3595 5787 6101 3549 -369 -4183 -6296 -5692 -2894 1162 4695 6333
2642F333j074l335l913l277j030J623L655L723L068K96k145l670l828k598L43
$$ 6333 5259 1924 -1989 -5266 -6296 -4673 -1018 2705 5773 6069 3924 254 -3574 -6172 -5829
2657e829K258M189L860J889o03l111l907l731j258R31L444L988L260P46j521l466
$$ -5829 -3571 618 4478 6367 5764 2653 -1254 -4985 -6243 -5312 -1868 2120 5380 6126 4605 1139
2673A139m128k739k64J918L820M247K312l90k417l973l820j945N78L134L920L620
$$ 1139 -2989 -5728 -5992 -4074 -254 3993 6305 5915 3498 -475 -4295 -6240 -5662 -2528 1392 5012
2689E012J617j438l464m283l070p64J912L680L959K819K34k479l671m039k061
$$ 5012 6629 5191 1727 -2556 -5626 -6390 -4478 -798 3161 5980 6214 3735 64 -3975 -6036
2704f036N5K693M170L711J843j085k977l998l572j322J379L295M543K962P62j809
$$ -6036 -5981 -3288 882 4593 6436 5351 2374 -1624 -5196 -6518 -5139 -1844 2699 5661 6423 4614
2720D614l880m074k716j89K507L832M045K193n14k799m045l745j597J112L168
$$ 4614 734 -3340 -6056 -6245 -3738 94 4139 6332 5818 3019 -1026 -4771 -6368 -5256 -2088
2735b088L783L695J323j659l803m123k930o62K085L920M000K604j22k184m235
$$ -2088 1695 5390 6713 5054 1251 -2872 -5802 -6464 -4379 -459 3541 6145 6023 3839 -396
2750c96m018j778K42L147M155L454J804j162l442m088l665q43J819L579M267K778
$$ -396 -4414 -6192 -5950 -2803 1352 4806 6610 5448 2006 -2082 -5747 -6590 -4771 -1192 3075 5853
2766E853M25k270l688l935k443j11K437M403M151J726p99k902m505l577j134J298
$$ 5853 6278 4008 320 -3615 -6058 -6169 -3732 671 4822 6548 5749 2847 -1658 -5235 -6369 -5071
2782e071L160M144L596P81j721l932m043k955k41K246L882M209K151nk947m237
$$ -5071 -1911 2233 5829 6610 4889 957 -3086 -6041 -6282 -4036 -154 4055 6206 6201 3254 -983
2798i83l791j729R37K976M264L626J340j519l267m529l218o01J870L752M265K806
$$ -983 -4774 -6503 -5566 -2590 1674 5300 6640 5121 1854 -2675 -5893 -6494 -4624 -872 3393 6199
2814F199K71k597l959m089k493N62K805M459L842J815j301l304m196l635j200
$$ 6199 6470 3873 -86 -4175 -6668 -6106 -3301 1158 5000 6815 5514 2210 -1986 -5621 -6821
2829f821J586L755M298L107O93k234l761m303k546k99K638M067M313K243m03l407
$$ -6821 -5235 -1480 2818 5925 6618 4384 623 -3680 -6226 -6525 -3887 180 4493 6736 6333 2926
2845B926m285l689j628R74L522M257L346J252j377m122m385k687q10K432L847
$$ 2926 -1359 -5048 -6676 -5702 -2180 2077 5423 6675 5298 1176 -3209 -5896 -6706 -4274 -427
2860d27M148K625M8k983m025l941k098O45L237M200L958J388j206l592m429l367
$$ -427 3721 6346 6394 3411 -614 -4555 -6653 -6008 -2771 1429 5387 6775 5569 1977 -2452 -5819
2876e819j073K124L637M407K836N06k482m193m000k632M21K875M240L892J946
$$ -5819 -6892 -4768 -1131 3276 6112 6618 4136 -57 -4057 -6689 -6268 -3393 847 4739 6685
2891F685p49l374m551l363j504J451L850M129L428P94k203l683m390k905j35K377
$$ 6685 5936 2562 -1989 -5352 -6856 -5405 -1555 2574 6002 6796 4593 910 -3480 -6385 -6520 -4143
2907d143M373M088K311l76l043m304m007j843J232L394M350L495J420j549l975
$$ -4143 230 4318 6629 6253 3210 -1094 -5101 -6944 -5712 -2318 2032 5527 6947 5398 1423
2922A423m499k912o38K073M165M224K689J75k809m352m212j978M83L007M403L971
$$ 1423 -3076 -5988 -6626 -4553 -388 3836 6525 6700 3891 -461 -4673 -6651 -6168 -3161 1242 5213
2938E213J572j238l520m079l708r88J563L928M312L182O01k251m204m350k599
$$ 5213 6785 5547 2027 -2052 -5760 -6748 -5185 -1257 3055 6237 6838 4587 383 -3967 -6566
2953f566MK870M250M290J935m29l399m404m028j358J158L699M614L265Q59j421
$$ -6566 -6562 -3692 558 4848 6783 6354 2955 -1449 -5477 -6835 -5677 -1978 2636 5901 6760 5339
2969E339m103m356l328k67K507M118M386K304Ll224m324m147j928J122L309M421
$$ 5339 1236 -3120 -6448 -6715 -4208 -90 4296 6600 6603 3379 -945 -5092 -7020 -5898 -2589 1832
2985A832L631J447j526l497m660l241q07J903M253M256L012l7k537m282m122k614
$$ 1832 5463 6910 5384 1887 -2773 -6014 -6821 -4918 -665 3591 6603 6566 4029 -253 -4375 -6989
3001f989P14K767M612M228J561j261l282m188l908j264J609M088M469L040P66
$$ -6989 -6275 -3508 1104 5332 6893 5632 2350 -1838 -5746 -7010 -5401 -1313 3156 6196 6962
3016F962k379m188m465k413j86K846M227M171K259o51l316m403l793j668J120
$$ 6962 4583 395 -4070 -6483 -6669 -3823 404 4575 6834 6183 2867 -1536 -5329 -6997 -5877
3031e877L549M685L303J386j956l952m369l102m26K250M219M326K754l41k934
$$ -5877 -2328 2357 5660 7046 5090 1138 -3231 -6333 -6759 -4509 -290 4036 6790 6449 3515
3046C515m055m102k098O87L107M492L966J479j219m006m259l407q84J724L797
$$ 3515 -540 -4642 -6740 -6053 -2946 1546 5512 6991 5772 1766 -2493 -5900 -6784 -5060 -1263
3061a263M625L044L51k612m384m161k142K11K883M428L929K006q04l644m369l660
$$ -1263 3362 6406 6757 4145 -239 -4400 -6542 -6331 -3448 980 4909 6915 6111 2467 -1902 -5562
3077e562j275J433L854M597K982Q72k109m132m435k690j48K667M302M001K277
$$ -5562 -6837 -5404 -1550 3047 6029 6901 4792 660 -3775 -6465 -6613 -3946 356 4357 6634
3092F634j32l323m668l839j251J093L514M094L705J140j859l729m484l111m61
$$ 6634 6502 3179 -1489 -5328 -6579 -5486 -1972 2122 5827 6967 5108 1379 -3105 -6216 -6677
3107f677K242M021M366K623j07k888m280m026j932O70L423L944M074J583j382
$$ -6677 -4435 -414 3952 6575 6468 3580 -700 -4726 -6658 -5988 -2565 1379 5453 7036 5654
3122E654l926m352l369n43J640L844M283L103L26k511l872m200k616J73L113M161
$$ 5654 1728 -2624 -5993 -6536 -4896 -1052 3231 6334 6660 4149 277 -3923 -6539 -6366 -3253 908
3138I08L949K062j139l343m460l412j222J471L417M428L381Q09k145m258m019
$$ 908 4857 6919 5780 2437 -2023 -5435 -6657 -5186 -1769 2659 6040 6849 4704 446 -3573
3153c573k755j71K456M186M089K161k07k967m416l619j927J180L266M528L424
$$ -3573 -6328 -6499 -4043 143 4232 6393 6186 3219 -1197 -4816 -6743 -5563 -2297 2231 5655
3168E655J142j627l695m480l147k42J994L945M259K430O8k608m092m077k119O11
$$ 5655 6797 5170 1475 -3005 -6152 -6394 -4400 -455 3804 6234 6302 3694 -398 -4475 -6594 -5983
3184e983L031M381L654J778j527l242m260l619q04J744L823M429K625O86k360
$$ -5983 -2952 1429 5083 6861 5334 2092 -2168 -5787 -6591 -4847 -1024 3405 6030 6716 4356
3199D356m160m186k312J94K622M416L976J758p79l404m142l745j503J519L807
$$ 4356 196 -3990 -6302 -6108 -3486 930 4906 6664 5885 2481 -1661 -5406 -6909 -5390 -1583
3214a583M177L368P66k044l841m182k886k2K219M110L875K426k5l127m330l804
$$ -1583 2594 5962 6728 4684 843 -3339 -6225 -6247 -4028 82 3957 6383 6358 3231 -1099 -4903
3230d903j642R59L279M329L631Q48j239m098m289k711q08K409L767M294K592l30
$$ -4903 -6545 -5586 -2307 2022 5653 6501 5262 1164 -3125 -5836 -6644 -4235 -468 3826 6418 6088
3246F088k608m057l599k253L06K953M447L439J902j125l230m460l428q50J623
$$ 6088 3480 -577 -4176 -6429 -6123 -3170 1277 4716 6618 5493 2263 -2197 -5625 -6475 -4852
3261d852L469M567K890M09k052m246m199k203K40K622M089M069J797q30k978m234
$$ -4852 -1383 3184 6074 6483 4431 185 -4014 -6217 -5977 -3355 734 4803 6600 5770 2792 -1442
3277a442l714j218J122L557M356L025O35j499m072m060k767o9J954L909M570K038
$$ -1442 -5156 -6374 -5252 -1695 2661 5686 6321 4822 750 -3310 -6077 -6146 -4192 -283 4287 6325
3293F325k20k890m327l677j792J052L249M420L180J341j550l546m086l077j036
$$ 6325 6105 3215 -1112 -4789 -6581 -5529 -2280 2140 5320 6661 5111 1565 -2521 -5598 -6634
3308f634K373L635M135K309N23k566m121m011j789K20L184L887L697J729j175
$$ -6634 -4261 -626 3509 5818 6341 3775 -346 -4357 -6146 -5926 -2742 1145 4842 6571 5396
3323E396l311l927l652q96J583L721M244K863L29k307l807m012k403K74K555L865
$$ 5396 2085 -1842 -5494 -6390 -4807 -1086 3158 6021 6350 4043 236 -3776 -6179 -5905 -3350 515
3339E15L924J844m68l224m191l430j400J257L346M258L261O71j659l739m246k753
$$ 515 4439 6283 5815 2591 -1600 -5030 -6430 -5173 -1827 2431 5692 6363 4704 965 -3281 -6034
3355f034k08K597L775L872K081j12l037l776l797j958R74L307M288L220J001j306
$$ -6034 -6242 -3645 130 4002 6083 5971 2934 -842 -4639 -6597 -5623 -2316 1972 5192 6193 4887
3371D887l731m053k959n24K282L398M104K572N8k486m087l657k057O75K586M563
$$ 4887 1156 -2897 -5856 -6380 -4098 -700 3404 5976 6034 3548 -539 -4196 -6253 -5578 -2992 1571
3387A571L334J381r33l212m373l298r42J786L642L927L065J0j924m118l566k234
$$ 1571 4905 6286 5353 2141 -2232 -5530 -6472 -4686 -1044 2883 5948 5958 4034 -84 -3650 -5884
3403e884l7K635L913L656J825q14k721m185l179j394J264L589L617K994R33j754
$$ -5884 -5921 -3286 627 4283 6108 5294 2573 -1612 -4791 -6185 -4921 -1332 2285 5279 6212 4458
3419D458l524m083k627j83K362L613L859J957j31k669l918l536j978J351K754
$$ 4458 934 -3149 -5776 -5959 -3597 16 3875 5832 5701 3032 -886 -4422 -6400 -5049 -2295
3434b295M270L077J252j496l320m044k717p39J925L610L845K442j48k177l840
$$ -2295 1975 5052 6304 4808 1488 -2556 -5273 -6012 -4087 -477 3368 5810 5662 3485 -355
3449c55l871j817N66K651M212L220J550q72l508m020k987r08J666L352M037K290
$$ -355 -4226 -6043 -5477 -2826 1386 4606 6156 5284 1776 -2244 -5231 -6139 -4473 -1121 2916 5206
3465E206R17k479l515l720k378J88K654L519L581K066o31l148l886l218j205J327
$$ 5206 6123 3644 129 -3591 -5969 -5781 -3127 392 3973 6039 5408 2260 -1626 -4844 -6049 -4722
3481d722K978L725L125P46j515l513l998k477j94K366L650L505K099m40k470m003
$$ -4722 -1744 1981 5106 5852 4337 824 -3174 -5651 -5845 -3479 171 3676 5775 5335 2865 -1138
3497a138l409j261P37K747M067L214J070j533l190l843k772m09J721L231L948
$$ -1138 -4547 -5808 -5071 -2324 1743 4957 6027 4494 1304 -2539 -5311 -5720 -3999 -768 3180
3512C180K506j21j994l901l677j728M92K573L728L386J377r19k924l909l122q69
$$ 3180 5686 5565 3571 -330 -4007 -5735 -5243 -2670 1058 4444 5821 4902 1978 -1931 -5053 -5922
3528e922J581L003M046K726L02j829l536l798k032l40K848L376L614J777o76k774
$$ -5922 -4341 -1338 2708 5434 5736 3907 371 -3427 -5459 -5799 -2951 425 4039 5816 5140 2366
3544B366l694l309j311J295K979M037K747N41j470l250l764k706l0J769L559L830
$$ 2366 -1328 -4637 -5948 -4653 -1674 2363 5110 5651 4181 931 -2833 -5539 -5569 -3800 -241 3589
3560C589K132m37k281l782l453j489P11K829L675L381P87j073l275l680k753n50
$$ 3589 5721 5284 3003 -779 -4232 -5721 -5010 -2181 1494 4875 5662 4589 1314 -2366 -5119 -5669
3576e669J765L498L554K411q6k141l337l672j928K69K721L776K951J619j083k716
$$ -5669 -3904 -406 3148 5559 5473 3332 -5 -3677 -5605 -5336 -2615 1161 4112 5731 4648 1932
3592A932l985k800r33J275L250L823K423P04j651l726l531k445J33K423L554L359
$$ 1932 -2053 -4853 -5786 -4511 -1261 2562 4985 5689 4038 312 -3219 -5664 -5531 -3108 446 3805
3608C805K028q38k589l505l309j365J095K846L920K799R96k004k801l833k330
$$ 3805 5833 4995 2406 -1099 -4408 -5773 -4678 -1832 2088 4887 5883 3879 1078 -2755 -5085
3623e085m80K015L304L405K418j18k756l356l249j826P85K731L840K813J181j126
$$ -5085 -5565 -3550 -246 3159 5577 5459 2703 -653 -3902 -5728 -4943 -2212 1628 4441 5622 4496
3639D496l324l542k625m59J525L280L770K027K84k112l539l591j723L36K623L335
$$ 4496 1172 -2370 -4995 -5454 -3929 -649 3121 5148 5432 3320 -219 -3810 -5533 -5197 -2574 761
3655G61L348J417q33k848l605k770j021J428L007L485K592M94j907l142l253k231
$$ 761 4109 5526 4693 1845 -1760 -4530 -5551 -4123 -1116 2369 4961 5455 3548 406 -2847 -5078
3671e078k51K167L503L328J900p34k486l573l158j056Q19K990L147L011Q86j368
$$ -5078 -5329 -3162 341 3669 5569 4835 2349 -1224 -4382 -5438 -4619 -1629 1518 4529 5415 4047
3687D047l166l516k147p43J927L376L473J975k20k052l518l144j699N15K803L206
$$ 4047 881 -2635 -4782 -5525 -3598 -222 3251 5226 5006 2954 -564 -3708 -5407 -4892 -2089 1117
3703A117L158J117j192k813l318k719p01J519L111L288K418M80k108l348l407
$$ 1117 4275 5392 4200 1387 -1931 -4650 -5351 -3832 -721 2567 4985 5465 3357 9 -3398
3718c398j788K59K248L511K872J751p17k755l627k543j263R79L184L664K415O13
$$ -3398 -5186 -4927 -2679 832 3704 5455 4738 1983 -1644 -4187 -5450 -4471 -1287 2377 4792 5405
3734E405j638l448l253k245J73J926L032L512J665l98k487l212l016j514P70K999
$$ 5405 3767 319 -2934 -5179 -5006 -3080 -48 3464 5129 4731 2244 -968 -3984 -5498 -4728 -1729
3750a729L637K594Q31j272l108l405k308m40J639L245L278K005J01k163l513l140
$$ -1729 1908 4502 5333 4061 953 -2452 -4760 -5200 -3561 -316 2962 4967 5068 2905 -608 -3748
3766c748j624Q66K332L357L013R37q40k635l530k771p22J595L219L138K276K14
$$ -3748 -5372 -4506 -2174 1183 4196 5133 4293 1658 -1872 -4643 -5365 -3770 -551 2587 4863 5077
3782E077j929l138l263j596J74J961L208L058J768j000k326l261k927q94J075
$$ 5077 3148 10 -3253 -4849 -4675 -2714 494 3552 5320 4320 1994 -1267 -4194 -5088 -4013
3797d013K735L297K633N23j514l240k962k153k98J993L186L023J592k46j846l508
$$ -4013 -1278 2019 4652 5175 3661 421 -2541 -4694 -4992 -2999 187 3210 4802 4556 2710 -798
3813g98l143j089O95K619L175K644J060j169k820l498k206n16J532L063L400K041
$$ -798 -3941 -5030 -4335 -1716 1459 4103 5163 3994 1174 -2324 -4530 -5046 -3514 -451 2949 4990
3829D990p4j830l622k668j712M25K329L338K393J277o47k736l061k664p04J047
$$ 4990 4916 3086 -536 -3204 -4916 -4491 -2162 1176 3569 4846 4199 1463 -1598 -4262 -4966 -3919
3845c919L032L145K035L52j554k867l155j789L9J927L582K627J204l00k258l530
$$ -3919 -887 2258 4293 4645 3091 224 -2931 -4720 -4681 -2754 828 3455 4659 4359 2101 -1429
3861a429k519r48Q55K802K948K514N79j307k889l243j964j85J718L242K875J731
$$ -1429 -3948 -4896 -4041 -1239 1709 4223 4802 3495 606 -2637 -4601 -4786 -3068 174 3049 4780
3877D780j82j983l316k944j174M44K519L310K456Q92r15k812l041k370m11J247
$$ 4780 4598 2615 -701 -3645 -4819 -4375 -1856 1454 3910 4802 3887 1075 -1966 -4336 -4747 -3500
3893c500L269K927K129j78j849k924l222j584O60K216K926K999J022q34k573k937
$$ -3500 -231 2696 4825 4647 2798 -126 -3348 -4932 -4272 -2056 870 3869 4891 4057 1484 -1453
3909a453k433j128J319L055L039J980K58j526l090k898j599j21K222K925K650
$$ -1453 -3886 -5014 -3695 -640 2399 4379 4637 3111 21 -2877 -4476 -4597 -2375 550 3200
3924C200J468m55k307l021k499j204Q57K788K913K243Q14j493k575k931k112l50
$$ 3200 4668 4213 1906 -1115 -3614 -4818 -3961 -1173 1740 3983 4797 3304 729 -2202 -4314 -4664
3940d664J539K934L232J496j79k134k665k923j348O14K382K876K476R04j005k402
$$ -4664 -3125 -191 3041 4537 4358 2224 -441 -3364 -4712 -4098 -1716 1160 3636 4540 3535 1133
3956A133k937k305l72J446K494L087J681K9j628k477l163j556L95K100L114K553
$$ 1133 -1804 -4109 -4481 -3035 -541 2546 4227 4256 2628 151 -3012 -4568 -4173 -2073 1041 3594
3972C594Q32n31k557k804k312p85J332K216L234J881L54j348k860k885j497J3
$$ 3594 4426 3895 1338 -1466 -3778 -4563 -3231 -1015 2219 4100 4454 3106 246 -2639 -4136 -4123
3988d123J793K733K538J519o23j945k745k662p19L55K864K485K213Q92j428k301
$$ -4123 -2330 403 2941 4460 3837 1892 -853 -3515 -4234 -3879 -1015 1470 3683 4575 3147 846
4004H46l021j879m01J614K840K707J461k86j758k836k239j132L30J806L109K281
$$ 846 -2175 -4054 -4455 -2841 -1 2706 4167 3881 2123 -713 -2952 -4084 -3754 -1948 1161 3442
4020C442J000r13k387k775k172m91J182K524K603K074K06j558k931k551j405K32
$$ 3442 4442 3529 1142 -1633 -3805 -4296 -3114 -590 2013 4087 4293 2735 -196 -2747 -4152 -3920
4036c920K151K421K630P45n63k058k588k273q67J114K230K634K315L18j594k335
$$ -3920 -1769 652 3282 4027 3464 1406 -1182 -3455 -4322 -3208 -978 1656 3971 4289 2695 360
4052C60k873j556J6J680K653K492J588m69k185k719k237p69P07J942K811K091
$$ 360 -2513 -4069 -4053 -2373 280 2772 4360 3891 1706 -1013 -3250 -4019 -3312 -1370 1441 3532
4068C532O70r87k614k337k165m67J783K519K282J832r4j643k551k796j028L27
$$ 3532 4202 3215 601 -1736 -3901 -4368 -2585 -66 2216 4048 3954 2311 -240 -3036 -4064 -3737
4084c737K194K707K006J048r68k245k631j958p14J325K486K544J926n8j473k391
$$ -3737 -1543 1164 3170 4218 3250 1005 -1626 -3584 -4298 -2973 -487 2057 3983 3925 2452 61
$$ [...]
8191d5
##END NTUPLES=NMR FID
##END=
