##TITLE=1H_DE-146-TFA
 200.13Hz,CCl4.
 8 sc
 
 5.5.2026
##JCAMPDX= 6.0         $$ Bruker NMR JCAMP-DX V2.0
##DATA TYPE= NMR FID
##DATA CLASS= NTUPLES
##ORIGIN= UXNMR, Bruker Analytische Messtechnik GmbH
##OWNER= pz
$$ XWIN-NMR		Version 3.5
$$ Tue May  5 14:08:03 2026 Russian Standard Time (UT+4h)  she@DPX200
##.OBSERVE FREQUENCY= 200.131
##.OBSERVE NUCLEUS= ^1H
##.DELAY= (6, 6)
##.ACQUISITION MODE= SIMULTANEOUS
##.ACQUISITION SCHEME= undefined
##.AVERAGES= 8
##.DIGITISER RES= 18
##SPECTROMETER/DATA SYSTEM= spect
##.PULSE SEQUENCE= zg30
##.SOLVENT NAME= CDCl3
##.SHIFT REFERENCE= (INTERNAL, CDCl3, 0, 14.3821)
##AUDIT TRAIL= $$ (NUMBER, WHEN, WHO, WHERE, WHAT)
$$ ##TITLE= Audit trail, XWIN-NMR		Version 3.5
$$ ##JCAMPDX= 5.01
$$ ##ORIGIN= Bruker BioSpin GmbH
$$ ##OWNER= she
$$ F:/spectra/data/she/nmr/H-C/1/audita.txt
$$ ##AUDIT TRAIL=  $$ (NUMBER, WHEN, WHO, WHERE, WHAT)
(   1,<2026-05-05 14:06:22.89 +0400>,<she>,<DPX200>,
      <created by zg, POWCHK disabled, PULCHK disabled
       configuration hash MD5:
       00 E9 B6 7A A2 85 ED C7 34 08 36 98 17 FE 4E 26
       data hash MD5: 16K
       16 82 F5 39 E3 59 80 CC F3 1A 4F DC CD 10 B8 D6>)
$$ ##END=
$$ 
$$ hash MD5
$$ 94 9E 0B 46 14 9D 6F 38 4C 39 CA 5D 1D 65 D2 70
##$RELAX= 
##$RELAX= 
##$RELAX= 
##$RELAX= 
##$RELAX= 
##$RELAX= 
$$ Bruker specific parameters
$$ --------------------------
##$DU= <F:/spectra>
##$EXPNO= 1
##$NAME= <H-C>
##$PROCNO= 1
##$TYPE= <nmr>
##$USER= <she>
##$AMP= (0..31)
100 100 100 100 100 100 100 100 100 100 100 100 100 100 100 100 100 100 
100 100 100 100 100 100 100 100 100 100 100 100 100 100 
##$AQSEQ= 0
##$AQ_mod= 1
##$AUNM= <au_zg>
##$AUTOPOS= <>
##$BF1= 200.13
##$BF2= 200.13
##$BF3= 200.13
##$BF4= 200.13
##$BF5= 200.13
##$BF6= 200.13
##$BF7= 200.13
##$BF8= 200.13
##$BYTORDA= 1
##$CFDGTYP= 0
##$CFRGTYP= 5
##$CHEMSTR= <none>
##$CNST= (0..31)
1 1 145 1 1 1 1 1 1 1 1 1 1 1 1 1 1 1 1 1 1 1 1 1 1 1 1 1 1 1 1 1 
##$CPDPRG= <>
##$CPDPRG1= <>
##$CPDPRG2= <>
##$CPDPRG3= <>
##$CPDPRG4= <mlev>
##$CPDPRG5= <mlev>
##$CPDPRG6= <mlev>
##$CPDPRG7= <mlev>
##$CPDPRG8= <mlev>
##$CPDPRGB= <>
##$CPDPRGT= <>
##$D= (0..31)
0 0.7 0 0 0 0 0 0 0 0 0 0.03 0 0 0 0 0 0 0 0 0 0 0 0 0 0 0 0 0 0 0 0 
##$DATE= 1777975582
##$DBL= (0..7)
120 120 120 120 120 120 120 120 
##$DBP= (0..7)
150 150 150 150 150 150 150 150 
##$DBP07= 0
##$DBPNAM0= <>
##$DBPNAM1= <>
##$DBPNAM2= <>
##$DBPNAM3= <>
##$DBPNAM4= <>
##$DBPNAM5= <>
##$DBPNAM6= <>
##$DBPNAM7= <>
##$DBPOAL= (0..7)
0.5 0.5 0.5 0.5 0.5 0.5 0.5 0.5 
##$DBPOFFS= (0..7)
0 0 0 0 0 0 0 0 
##$DE= 6
##$DECBNUC= <off>
##$DECIM= 32
##$DECNUC= <off>
##$DECSTAT= 4
##$DIGMOD= 1
##$DIGTYP= 9
##$DL= (0..7)
0 120 120 120 120 120 120 120 
##$DP= (0..7)
150 150 150 150 150 150 150 150 
##$DP07= 0
##$DPNAME0= <>
##$DPNAME1= <>
##$DPNAME2= <>
##$DPNAME3= <>
##$DPNAME4= <>
##$DPNAME5= <>
##$DPNAME6= <>
##$DPNAME7= <>
##$DPOAL= (0..7)
0.5 0.5 0.5 0.5 0.5 0.5 0.5 0.5 
##$DPOFFS= (0..7)
0 0 0 0 0 0 0 0 
##$DQDMODE= 0
##$DR= 18
##$DS= 0
##$DSLIST= <SSSSSSSSSSSSSSS>
$$ [...]
##$SUBNAM0= <"">
##$SUBNAM1= <"">
##$SUBNAM2= <"">
##$SUBNAM3= <"">
##$SUBNAM4= <"">
##$SUBNAM5= <"">
##$SUBNAM6= <"">
##$SUBNAM7= <"">
##$SUBNAM8= <"">
##$SUBNAM9= <"">
##$SW= 18.0517599122864
##$SWIBOX= (0..15)
0 0 2 0 0 0 0 0 0 0 0 0 0 0 0 0 
##$SW_h= 3612.71676300578
##$TD= 16384
##$TD0= 1
##$TE= 0
##$TE2= 300
##$TE3= 300
##$TEG= 300
##$TL= (0..7)
0 120 120 120 120 120 120 120 
##$TP= (0..7)
150 150 150 150 150 150 150 150 
##$TP07= 0
##$TPNAME0= <>
##$TPNAME1= <>
##$TPNAME2= <>
##$TPNAME3= <>
##$TPNAME4= <>
##$TPNAME5= <>
##$TPNAME6= <>
##$TPNAME7= <>
##$TPOAL= (0..7)
0.5 0.5 0.5 0.5 0.5 0.5 0.5 0.5 
##$TPOFFS= (0..7)
0 0 0 0 0 0 0 0 
##$TUNHIN= 0
##$TUNHOUT= 0
##$TUNXOUT= 0
##$USERA1= <user>
##$USERA2= <user>
##$USERA3= <user>
##$USERA4= <user>
##$USERA5= <user>
##$V9= 5
##$VALIST= <valist>
##$VCLIST= <CCCCCCCCCCCCCCC>
##$VD= 0
##$VDLIST= <DDDDDDDDDDDDDDD>
##$VPLIST= <PPPPPPPPPPPPPPP>
##$VTLIST= <TTTTTTTTTTTTTTT>
##$WBST= 1024
##$WBSW= 4
##$XGAIN= (0..3)
0 0 0 0 
##$XL= 0
##$YL= 0
##$YMAX_a= 86814
##$YMIN_a= -104914
##$ZGOPTNS= <>
##$ZL1= 120
##$ZL2= 120
##$ZL3= 120
##$ZL4= 120
##$ABSF1= 10
##$ABSF2= 0
##$ABSG= 5
##$ABSL= 3
##$ALPHA= 0
##$AQORDER= 0
##$ASSFAC= 0
##$ASSFACI= 0
##$ASSFACX= 0
##$ASSWID= 0
##$AUNMP= <proc_1d>
##$AZFE= 0.1
##$AZFW= 0.1
##$BCFW= 1
##$BC_mod= 2
##$BYTORDP= 1
##$COROFFS= 0
##$CY= -3
##$DATMOD= 1
##$DC= 2
##$DFILT= <>
##$DTYPP= 0
##$F1P= 0
##$F2P= 0
##$FCOR= 0.5
##$FTSIZE= 0
##$FT_mod= 4
##$GAMMA= 1
##$GB= 0.15
##$INTBC= 1
##$INTSCL= 1
##$ISEN= 128
##$LB= 0.25
##$LEV0= 0
##$LPBIN= 0
##$MAXI= 10000
##$MC2= 0
##$MEAN= 0
##$ME_mod= 0
##$MI= 1.114404
##$NCOEF= 0
##$NC_proc= 0
##$NLEV= 6
##$NOISF1= 3.799351
##$NOISF2= 2.8
##$NSP= 1
##$NTH_PI= 0
##$NZP= 0
##$OFFSET= 14.38212
##$PC= 1
##$PHC0= -4065.493
##$PHC1= 10.59229
##$PH_mod= 1
##$PKNL= yes
##$PPARMOD= 0
##$PSCAL= 0
##$PSIGN= 0
##$REVERSE= no
##$SF= 200.129724274929
##$SI= 16384
##$SIGF1= 3
##$SIGF2= 2
##$SINO= 400
##$SIOLD= 16384
##$SREGLST= <1H.CDCl3>
##$SSB= 0
##$STSI= 0
##$STSR= 0
##$SW_p= 3205.1282051282
##$SYMM= 0
##$S_DEV= 0
##$TDeff= 0
##$TDoff= 0
##$TI= <>
##$TILT= no
##$TM1= 0
##$TM2= 0
##$TOPLEV= 0
##$USERP1= <user>
##$USERP2= <user>
##$USERP3= <user>
##$USERP4= <user>
##$USERP5= <user>
##$WDW= 1
##$XDIM= 8192
##$YMAX_p= 0
##$YMIN_p= 0
$$ End of Bruker specific parameters
$$ ---------------------------------
##NTUPLES= NMR FID
##VAR_NAME=  TIME,          FID/REAL,        FID/IMAG
##SYMBOL=    X,             R,               I
##VAR_TYPE=  INDEPENDENT,   DEPENDENT,       DEPENDENT
##VAR_FORM=  AFFN,          ASDF,            ASDF
##VAR_DIM=   8192,          8192,            8192
##UNITS=     SECONDS,       ARBITRARY UNITS, ARBITRARY UNITS
##FACTOR=    0.0002768,     1,               1
##FIRST=     0,             0,               0
##LAST=      2.2672688,     0,               0
##MIN=       0,             -104914,         0
##MAX=       2.2672688,     86814,           0
$$ Real data points
##PAGE= N=1
##DATA TABLE= (X++(R..R)), XYDATA
0 0 0 0 0 0 0 0 0 0 0 0 0 0 0 0 0 0 0 0 0 0 0 0 2 -6 7 -8 8 -8 8 -8 10 -14 15 -16 18 -21 23 -25 29 -32 36 -39 44 -48
44 -48 53 -58 63 -70 77 -84 94 -103 114 -125 138 -154 172 -192 219 -248 284 -331 390 -473 590
65 590 -770 1073 -1667 3215 -13436 -8366 86814 30599 -70726 -52486 -12013 23284 59300
78 59300 24274 -46809 -54688 -30191 18037 79318 35130 -39409 -47442 -33657 13494 56400 35241
91 35241 -20487 -47358 -23676 12027 51559 40486 -21477 -41810 -31386 377 51584 53639
103 53639 216 -45662 -36842 -2421 38257 55507 6493 -31945 -34038 -13081 42562 51299 2716
116 2716 -30516 -33024 -5492 33163 48543 15497 -23030 -33027 -20023 28707 47351 16293 -5744
129 -5744 -27832 -22993 15762 40076 29243 -9200 -30301 -18654 14239 38612 25265 -1605
141 -1605 -31571 -29035 15781 36172 26313 -827 -25354 -19908 2088 27817 26269 2444 -16791
154 -16791 -22904 1981 22207 20781 8870 -17585 -23611 -6091 17699 28448 8875 -15541 -29009
167 -29009 -11120 18457 20785 11714 -12528 -28637 -10763 11997 22700 7136 -14832 -20829 -13765
180 -13765 7129 14935 10773 -6309 -28144 -15595 2516 10360 12431 -4129 -20686 -24382 -5452
193 -5452 14822 12459 -3292 -25070 -21895 -4729 5342 16441 -2777 -24799 -22075 -9002 6226
206 6226 6160 -3787 -16880 -22174 -11922 -1779 7292 355 -18823 -19105 -16562 -5460 7406 1271
220 1271 -11292 -24026 -19554 -5593 5910 4279 -15154 -20981 -15789 -9822 4881 135 -13749
233 -13749 -21349 -19329 -5035 -72 -1398 -12079 -18863 -15631 -14567 -1724 3371 -10166 -15252 -17433
247 -17433 -12690 -5265 -241 -3912 -17994 -19708 -13328 -2169 3616 -10989 -17179 -18250 -17216 -1079
261 -1079 2177 -4670 -16407 -19484 -11603 -7567 -1054 -5715 -11918 -13803 -16489 -5890 -1602 -6641 -9792
276 -9792 -17666 -16585 -9547 -474 1254 -9433 -15423 -19654 -10446 1692 -3069 -6565 -13137 -15996 -8125
291 -8125 -3226 -1844 -8601 -13838 -12320 -9145 -2087 -5143 -6177 -7877 -16790 -12262 -5040 -2159 -2395
306 -2395 -9153 -11529 -14273 -7435 -1630 -3667 -6995 -15684 -10963 -1008 -4222 -4103 -8979 -13120 -10242
321 -10242 -5293 -560 -4801 -8034 -9895 -10519 -5638 -7233 -3948 -2266 -10261 -8715 -7047 -4520 -2851
336 -2851 -6222 -8712 -12215 -6910 -1860 -1997 -2683 -12946 -12671 -6019 -4664 -1570 -5625 -8470 -8961 -8155
352 -8155 -3608 -4378 -4572 -8359 -9145 -4596 -7233 -4165 -1577 -7657 -9888 -10895 -5879 -2543 -3257 -4217
368 -4217 -10410 -10291 -8581 -4074 -18 -8937 -10234 -7146 -6354 -3644 -5298 -6112 -9121 -9214 -5537 -5891 -3754
385 -3754 -6436 -7810 -6286 -11292 -7905 -3828 -5430 -6068 -9296 -7879 -7171 -4708 -4362 -9318 -8217 -8714
401 -8714 -6455 -1313 -6662 -8296 -8930 -7270 -5229 -6334 -5381 -7751 -7188 -6910 -8210 -4618 -7714 -7898
417 -7898 -5255 -8873 -7716 -5670 -4474 -5418 -9342 -8298 -7361 -4707 -4069 -6136 -7607 -10364 -7896 -2424
433 -2424 -5581 -7775 -8495 -6811 -6870 -6616 -4443 -8015 -7191 -7542 -8297 -4962 -6805 -6471 -4323 -8040 -8629
450 -8629 -7771 -4675 -4140 -6765 -7413 -9951 -6339 -4094 -5910 -5197 -9132 -8460 -4753 -4763 -4858 -6960 -6323 -5867
468 -5867 -5866 -5616 -6791 -4333 -5243 -7035 -4420 -7173 -5750 -4514 -5285 -5737 -8296 -5113 -3180 -4651 -5483
485 -5483 -7702 -5476 -5079 -5094 -3252 -6608 -6189 -4487 -3597 -4210 -7147 -5050 -4767 -4597 -3616 -5318 -4005
502 -4005 -4803 -5749 -3931 -5817 -4975 -3416 -3544 -4553 -6766 -4206 -3675 -3386 -3903 -6707 -4551 -3877 -3644
519 -3644 -2106 -5291 -5804 -5649 -4077 -2911 -4398 -4107 -4836 -3755 -4114 -6324 -3200 -3713 -4093 -3057 -5136
536 -5136 -3739 -4090 -2888 -2658 -5814 -5371 -4223 -1451 -2357 -5630 -3808 -5188 -4665 -2984 -4482 -4757 -4923
553 -4923 -3035 -2862 -5109 -4944 -4404 -3418 -2916 -4595 -2473 -3924 -3528 -2576 -4549 -4394 -4883 -2779 -2264 -4254
571 -4254 -3615 -5129 -2595 -3168 -6060 -3956 -4216 -3296 -2259 -3654 -3766 -4517 -3973 -3538 -3559 -2860 -5004 -3045
589 -3045 -3259 -5417 -3905 -4148 -3902 -4099 -4593 -3416 -4975 -3642 -2934 -3477 -5065 -5871 -3184 -1648 -4017
606 -4017 -3615 -4661 -4007 -4081 -3819 -3495 -5232 -3676 -3557 -3673 -4186 -5957 -3463 -3648 -5090 -4048 -4842 -3606
624 -3606 -3126 -3524 -3847 -5363 -3828 -3364 -3192 -3414 -5146 -3955 -3737 -3425 -3581 -4426 -3368 -3900 -2993 -3546
642 -3546 -4211 -3168 -3455 -3463 -2617 -4950 -3859 -2458 -3301 -3697 -3765 -3375 -3176 -3272 -2840 -4003 -2836 -3518 -3250
661 -3250 -2689 -5982 -3414 -2582 -3152 -3206 -4167 -3073 -3747 -3268 -2385 -3426 -3240 -3759 -2034 -2764 -4353 -2990
679 -2990 -2739 -3200 -3223 -4330 -2702 -3132 -2496 -2457 -4103 -3430 -3570 -2248 -2048 -3463 -3134 -3229 -2269 -2188 -3064 -2782
699 -2782 -3265 -2250 -2430 -3004 -2045 -3225 -2221 -1762 -3484 -2989 -2895 -1487 -1709 -2862 -2459 -3093 -1947 -2172
717 -2172 -2347 -1807 -3256 -1674 -1386 -2654 -2613 -2523 -1502 -2079 -3114 -2298 -2569 -1914 -2090 -1861 -1911 -3561 -1598
736 -1598 -685 -2196 -1958 -2471 -1075 -1635 -2283 -1809 -2723 -1789 -2131 -1993 -1291 -3260 -1384 -995 -2094 -2235
754 -2235 -2640 -1521 -1421 -1475 -1767 -2954 -1641 -1953 -2257 -1623 -2692 -1377 -1455 -1752 -1860 -3057 -931 -1245
772 -1245 -1707 -1690 -2413 -1048 -1440 -1705 -1277 -2640 -1831 -998 -605 -681 -3093 -1411 -1923 -1663 -2701 -2247 -1300
791 -1300 -2568 -85 -1657 -2566 -2147 -1645 -1047 -1701 -2176 -1708 -1966 -1734 -2120 -2021 -1509 -1689 -1027 -1478 -2558
810 -2558 -890 -1513 -584 -2552 -2665 -1299 -1286 -386 -1434 -1987 -1802 -1152 -2259 -908 -2144 -1478 -1227 -1449
828 -1449 -1712 -2532 -1643 -2304 -1056 -1064 -3507 -1785 -1110 -523 -2541 -3032 -1581 -2763 -682 -1159 -1896 -1246
846 -1246 -1704 -1415 -1772 -2365 -713 -2499 -1299 -1582 -2609 -2313 -1506 -1633 -830 -1673 -1472 -1772 -899 -2186
864 -2186 -1487 -1434 -2481 -533 -907 -1323 -1337 -930 120 -1917 -1837 -1430 -1400 -288 22 -1620 -1961 -1186 -651
883 -651 -1332 -1158 -1272 -1904 -1131 -825 -1460 -958 -2065 -1276 -716 -1315 -903 -1300 -198 -944 -1220 -953 -1682 -1031
903 -1031 -720 -13 -1096 -1404 -468 -654 -1318 -1361 -867 -670 -929 -456 -654 -1473 1 -304 -1083 -286 -1785
922 -1785 -76 -203 0 -238 -1244 -675 -625 -188 -390 -828 -313 -285 -238 -1082 -1209 -435 -518 -307 -477 -744 -332
943 -332 -343 132 -450 -1026 -413 -425 -30 -826 -715 152 -100 212 -510 -707 -157 -390 -90 -287 -907 -552 -344
964 -344 572 -419 -1330 -309 -99 -145 -157 -333 51 -954 -305 -236 -192 -376 -312 -111 -331 -665 -35 -354 438
985 438 -404 -610 -268 -218 324 -250 -355 -827 -514 278 247 -28 148 -555 296 -387 -572 6 -169 442 -359
1006 -359 -371 -389 -653 323 -67 -56 -202 -527 237 -214 -505 45 -413 51 -372 -76 5 -657 304 -268 -849
1027 -849 -512 -365 638 -204 -335 -221 -494 277 -271 21 -17 -903 327 -351 -305 -265 -354 12 -358 -263 -314
1048 -314 -306 264 -209 -46 -219 -737 453 -144 111 -316 -248 345 -359 -170 -8 -249 548 -373 -148 -428 -462
1069 -462 42 -303 -117 -382 -463 294 -19 97 -456 -411 33 -126 263 213 -89 187 139 318 -280 -309 131 200
1091 200 54 -254 -200 -101 -125 471 -117 -506 167 54 333 -82 -216 247 -79 33 -148 -483 212 76 244
1112 244 73 -65 511 253 -113 -37 -405 -305 35 54 236 -236 -33 -19 315 -682 197 366 99 808 -349
1133 -349 308 -887 655 421 144 185 565 564 156 347 -503 47 -48 350 -40 369 -130 366 721 137 4
1154 4 445 728 857 -213 100 1078 379 1548 -347 100 150 664 766 -1109 1049 738 106 985 94
1173 94 490 432 150 675 464 411 117 367 773 251 424 -24 44 551 142 91 914 251 696 599 833 -214
1195 -214 282 753 657 432 -106 24 617 335 379 457 -177 447 216 392 405 492 713 293 276 325 346 237 548
1218 548 549 244 158 600 332 512 56 376 364 162 533 373 265 362 336 597 242 377 430 416 381 197 143
1241 143 973 224 761 -52 409 310 -287 249 301 -633 -638 126 324 433 441 485 346 1089 123 645 255 428
1263 428 478 2 164 499 567 658 269 159 388 215 293 401 404 564 423 870 196 277 384 427 477 206 272
1286 272 381 503 380 404 187 505 358 817 231 174 282 296 372 334 317 456 619 258 416 309 236 487
1308 487 817 33 4 95 367 332 45 146 65 -1 297 873 322 149 593 291 650 244 169 437 244 478
1330 478 270 438 571 429 493 542 262 356 565 379 765 449 295 503 375 283 71 781 494 -364 293
1351 293 -461 215 697 947 871 -147 770 -27 477 1101 73 782 997 1279 -265 134 1261 1236 372
1370 372 1499 -667 1015 -128 306 553 -297 100 213 860 319 717 1008 272 467 793 677 1035 1743
1389 1743 541 510 1062 180 517 64 351 641 -129 -438 399 454 754 329 929 876 499 125 429 874
1409 874 336 235 135 -296 -12 558 134 -469 318 -48 -57 804 -935 529 -589 956 1584 1200 452
1428 452 27 1027 1234 468 84 1409 1716 572 451 449 871 756 727 137 -89 582 -305 -419 693 565
1448 565 228 19 39 144 -52 -59 890 455 178 367 458 -69 553 140 723 250 321 405 359 264 600 450 285
1471 285 643 819 105 351 405 374 731 260 333 241 481 -289 -454 265 -211 750 615 441 -102 384 65
1492 65 429 388 671 1242 -589 880 429 -268 192 311 -344 358 948 56 -643 1038 -189 -210 205 210
1512 210 -114 -485 205 185 209 340 -80 80 543 297 451 -122 295 -94 415 512 104 214 475 -53 175
1533 175 46 236 420 141 262 -60 80 94 198 323 255 426 445 483 555 561 -111 297 394 156 390 446 139
1556 139 292 233 -45 209 549 496 286 12 364 336 -35 141 200 431 282 467 272 318 369 -199 160 -29
1578 -29 442 526 372 233 -101 530 156 99 407 360 534 344 100 144 312 260 -117 184 479 227 505 261
1600 261 -82 249 492 452 283 83 339 93 306 381 367 199 296 127 61 211 334 491 269 120 282 578
1622 578 529 288 317 180 441 755 394 431 168 248 456 316 398 -58 237 99 244 345 170 157 163 22 55
1645 55 117 373 287 295 -5 294 -21 29 354 316 374 548 381 511 354 258 689 262 914 340 578 -58 10
1668 10 -115 243 -254 370 -216 684 776 556 212 32 250 -191 229 -210 93 -32 364 196 239 288 -146
1689 -146 -92 544 -258 327 463 164 179 270 -182 -101 93 -194 470 158 -97 -119 -78 146 286 646 181 376
1711 376 -340 457 1225 385 380 604 237 687 736 718 414 -88 -266 410 48 119 576 782 686 252 -213 199
1733 199 36 309 -260 246 206 364 336 262 282 738 458 -73 623 -156 -233 183 -43 26 -189 377 331 978
1755 978 -520 517 -471 188 608 1202 702 460 -562 547 -104 -281 -1 -164 -16 476 713 152 571
1774 571 -68 708 1191 -392 85 211 -290 38 67 -191 -128 145 353 426 10 5 561 1 455 142 60 500
1796 500 251 129 8 267 212 459 -214 172 -195 -471 -468 450 446 346 -363 1218 369 -109 424 3 578
1817 578 672 -607 39 1225 11 -21 500 1289 524 -462 -632 -378 241 667 123 -2 -411 -236 -294 -516
1837 -516 242 -1226 120 -220 247 -166 -237 -563 -852 1067 295 368 659 -147 -148 -502 -682 1301 -1099 189
1857 189 660 -65 1039 -28 466 -779 -460 1194 842 243 1449 75 394 237 -116 75 706 631
1875 631 96 99 426 -37 -128 131 320 -263 -476 204 550 14 334 754 779 -290 -425 -724 840 259 582
1896 582 255 -761 -69 -749 -213 -91 654 801 -312 -187 672 421 -165 65 -337 78 517 916 -222
1915 -222 412 115 563 191 37 790 -207 13 1 -170 298 271 -195 -491 724 -121 339 497 -337 14
1935 14 111 -308 337 -154 778 986 -352 824 698 26 508 -322 578 625 762 -658 -507 177 234 -1069
1955 -1069 353 -145 -84 391 365 360 974 -201 -302 -268 186 615 570 223 102 341 195 673 -629 687
1975 687 529 588 760 -165 304 -127 151 -3 -1057 -539 192 107 -104 969 -8 -874 769 407 -531 -901
1995 -901 62 639 -800 -51 -269 109 -696 -6 35 255 193 -36 -78 -159 -165 -427 -527 421 620 106 357 286
2017 286 165 321 532 -194 -67 522 -525 428 -192 304 381 39 113 500 -472 460 242 -23 132 -60
2037 -60 -239 86 373 157 -593 125 -396 -846 -781 -96 210 461 44 631 64 308 -144 -355 -423 310 358
2058 358 82 -150 -149 4 -377 -49 732 -633 120 341 -25 -152 4 -44 -43 17 59 -53 143 31 106 148 60
2081 60 104 -68 -36 79 -93 39 278 -87 -57 113 -87 23 -46 28 2 -72 -62 37 -92 -131 304 309 119 -264
2105 -264 -148 -63 -376 -122 -2 161 16 126 -444 278 71 101 -505 -62 226 -471 -308 -322 54 276 107
2126 107 -359 98 441 -362 16 91 148 -14 -421 -390 -129 483 -58 223 -212 538 520 318 -15 -252 -64
2147 -64 -193 412 21 615 -147 1367 152 -211 1063 41 -903 303 -77 188 0 -274 -122 1015
2165 1015 8 -99 115 -364 334 394 -279 526 440 31 -836 64 -34 25 530 89 -889 149 232 273 -83
2186 -83 -494 -343 144 304 289 -543 -611 378 -1561 -593 647 498 207 101 85 -122 12 -246 -30 50 -145
2207 -145 -21 445 84 -410 286 236 -90 -74 10 39 248 -188 28 254 136 147 -88 -154 -148 98 35 74 215
2230 215 70 134 -44 45 40 -20 -71 -179 -134 212 -41 35 -106 -165 516 -67 -48 -52 15 30 -141 -242 149 -117 29
2255 29 -30 121 -10 -209 4 96 33 -101 -23 26 -25 129 44 -19 -290 -463 -142 -40 -166 113 -120 90 98 170
2279 170 197 300 -690 222 61 262 -596 640 -345 426 72 -804 507 -592 -217 -903 677 -322 -336
2298 -336 -348 148 6 -65 -80 -800 507 -861 -683 -216 -49 221 -268 -297 86 -150 145 -100 -591 -648 749
2319 749 -422 -356 366 245 -140 830 180 -172 540 -163 -71 -466 -760 178 -361 -384 -160 -228 -504 138 -50
2340 -50 -580 -459 -593 134 -82 -205 -283 847 -372 572 -123 308 -64 289 187 -381 -333 -258 -175 57 183
2361 183 238 -378 55 -110 29 165 36 -107 100 -98 -155 312 93 -348 -352 -358 -464 276 -142 -170 -252 284 225
2384 225 64 -508 -372 3 140 -49 134 178 35 60 4 138 25 -39 -96 25 200 -13 -161 -24 193 -440
2406 -440 -65 -144 -92 28 -129 -38 -309 -34 12 83 168 175 -51 10 -307 104 102 121 -5 16 -2 -197 247 76 21
2431 21 -40 -239 -32 66 -212 -4 45 -228 -49 -250 290 -11 21 133 42 -52 -369 30 125 109 -119 31 -162
2454 -162 -86 -33 49 -74 -21 -373 -114 -151 223 -198 -408 266 -371 446 60 139 153 343 -486 504 89 -81
2476 -81 102 273 782 -437 588 -184 128 79 117 805 11 176 -264 592 836 -49 797 456 -471 -80
2496 -80 762 547 -839 -94 -670 -96 -616 1112 613 1381 513 -528 -806 -638 -100 1237 -834 -342 123
2515 123 404 93 -414 744 -1058 -190 142 -116 -359 309 -117 -241 -514 -599 493 -65 291 112 -41
2534 -41 -80 458 157 -770 -983 530 -685 -109 682 -442 -271 38 -584 -981 -458 752 74 256 -155
2553 -155 63 -407 -241 -361 167 210 -595 -99 -65 -209 -21 220 550 666 -598 548 -217 -477 1051 -858
2573 -858 139 228 -528 -669 -55 883 -524 -542 -981 -779 116 -791 68 -129 722 -190 220 -239 306 -206
2593 -206 593 131 -492 -860 486 346 -352 -243 482 -493 -478 -656 -133 14 -693 -64 -651 -322 -1209 -184
2613 -184 -62 -485 365 -1049 -43 -163 -872 -48 220 247 -724 -362 452 -118 -755 -477 74 -259 833
2632 833 26 -118 -46 -975 416 -232 -350 -644 -752 -63 71 768 -588 -893 198 -188 334 -984 -677
2651 -677 -174 209 124 -562 655 839 66 -81 -771 4 269 -812 -99 -674 -217 112 -86 444 -494 -1012
2671 -1012 174 -232 258 7 -493 148 257 341 262 -90 -365 -383 -203 557 802 -556 -157 -179 -138 33 -325
2692 -325 -115 25 -398 -28 88 193 -232 125 -101 -85 9 14 -101 -93 195 -52 14 97 -230 -247 -85 114 -74
2715 -74 -91 127 -181 -219 117 10 -122 -356 -237 -596 -350 -284 76 -304 223 284 -494 -244 237 -160 -381 -243
2737 -243 -375 459 -658 -379 371 -560 367 -96 -1236 -211 -254 -502 74 451 556 207 -653 111 -143
2756 -143 376 -15 -172 253 406 -365 184 226 -10 -19 -175 240 324 197 -122 346 -113 -570 -360 317 -38
2777 -38 702 552 -441 -185 -647 259 -4 -1126 -549 -467 541 -771 -389 254 956 1473 740 401 -764
2796 -764 530 -955 -262 -426 312 -338 -239 -1911 -49 717 -317 2206 -1134 218 -682 -40 121 -636
2814 -636 -924 122 234 -623 -1816 -569 1043 452 -730 -780 -900 -1071 -16 -1124 1324 895 364 66
2832 66 -1671 1111 636 -288 231 90 250 -913 1094 -311 -240 -190 -220 -1995 -555 120 83 1104 -846
2851 -846 -190 -470 -1842 105 -691 86 580 614 1377 1297 1247 -609 341 849 -587 723 -191 4 -1193
2870 -1193 42 260 405 1129 -644 346 -714 -437 -235 -1287 -1081 234 819 -123 -703 -464 -92 725
2888 725 852 657 430 -532 -777 218 -596 -323 708 -182 -176 187 116 -66 -1313 -814 702 -412 409 -308
2908 -308 -550 172 -64 -285 -182 -519 -643 474 -1206 269 504 -1128 361 709 -207 -324 -986 -695
2926 -695 -467 -606 102 -12 -588 650 -118 -267 -27 -493 -511 13 1070 -634 649 45 -656 -20 747
2945 747 519 -35 -492 -337 588 -918 -1155 73 -865 120 472 -1416 746 166 303 -271 -400 737
2963 737 -438 234 -632 -685 -439 1161 -815 300 409 9 -99 473 25 -86 575 86 -2 -703 -672 148
2983 148 212 -136 71 819 43 -51 745 -377 -584 -124 73 -1796 -1774 640 284 -157 546 675 -175 -21
3003 -21 -430 -80 250 -227 77 -160 112 371 805 -953 -583 -382 -207 433 475 -33 -196 -237 655 -6 -262
3024 -262 194 331 381 -397 81 -104 -180 341 755 -79 -148 906 604 -3 447 -294 -696 363 453 -588
3044 -588 814 -20 -1214 -77 -2 755 -150 -637 -420 66 -628 -369 652 12 57 551 898 -705 -312
3063 -312 -510 566 582 -500 -419 -500 625 705 -625 -589 259 95 -163 -494 -494 406 464 -112 -61 884 -155
3084 -155 281 226 -531 -187 464 98 -407 -72 318 -4 448 -102 -75 -126 2 -350 -552 -339 138 -527 -3
3105 -3 400 237 588 -228 140 -240 46 -305 -88 -282 -223 -453 -50 142 -292 -6 -306 -54 -275 371 499
3126 499 247 -12 329 -103 148 -327 -616 -30 704 -871 85 -387 -351 -9 305 -131 310 308 169 213 169
3147 169 -94 -506 -95 576 144 -747 -38 490 75 -705 496 23 -374 -49 663 283 588 -423 -530
3166 -530 401 393 639 -1100 136 -407 88 -326 -714 -503 -74 -277 -191 -736 393 -3 -503 -220 -776 -332
3186 -332 -542 275 -89 111 311 -743 -414 194 -117 506 120 570 257 -51 638 -168 823 563 644 1134
3206 1134 -301 35 1051 -735 -116 1258 -216 -1258 1258 -684 -761 700 657 315 498 -822 -383
3223 -383 -37 308 -599 119 1093 -52 -55 847 348 165 5 -540 492 78 303 514 -282 -497 76 -179
3243 -179 -255 225 595 -258 3 -117 184 345 40 -136 -47 486 166 183 -6 201 381 13 460 -528 -424
3264 -424 -69 -391 95 32 345 379 388 -282 276 511 -69 -96 38 -35 246 172 -343 190 -234 273 302 480 -538
3287 -538 -322 226 -63 392 136 115 38 510 -404 236 67 -160 307 -387 279 -15 -177 162 1017 16
3307 16 -597 99 -918 396 -221 683 1201 170 85 783 -406 -690 -368 -888 -564 -121 516 84 80 300
3327 300 409 197 776 263 -274 -286 -399 296 295 -52 677 111 195 281 13 381 -277 -46 14 -153 -153 -490 -452
3350 -452 -426 -32 780 143 -228 -151 609 -26 261 -391 -208 226 166 -2 -409 -463 -130 548 -92 709 363
3371 363 139 -404 -136 342 -480 467 235 -137 534 -239 -749 148 -37 159 188 313 243 437 417 -104 -459
3392 -459 -143 -39 838 106 -512 171 942 -423 286 -259 -361 317 1095 863 -309 540 -900 685 -246
3411 -246 -604 419 -241 -70 -872 -236 -194 45 762 105 232 -463 391 -355 -157 184 258 526 -95 65
3431 65 235 19 -26 -389 289 345 546 -287 -275 -145 -186 337 -554 66 -52 246 -191 240 185 397 -95 274
3453 274 -148 152 -192 61 -157 -78 45 339 -261 141 -194 102 203 45 686 -1093 531 185 -46 100
3473 100 -93 -179 231 -146 596 -41 -367 47 157 326 181 52 -202 -53 42 9 49 -34 302 -10 -257 100
3495 100 -12 -43 77 -129 -133 -201 -116 -37 248 -146 -62 46 -78 51 -27 -13 -96 244 147 119 -73 -110 -184 -88 34
3520 34 -373 135 107 54 179 191 36 -44 51 77 -14 -143 -4 189 132 2 -117 -114 -114 -182 62 -137 -149 -9 -162
3545 -162 -91 -67 37 -42 -88 -243 88 -46 -33 94 -72 61 -21 -100 18 131 164 -232 136 -61 157 -97 -51
3568 -51 87 1 -124 -60 37 139 106 -83 71 196 183 -91 55 24 -19 27 -66 -118 -66 -80 87 -287 -79 504
3592 504 -53 -56 -215 252 -259 -195 -211 105 -120 140 9 -265 44 -11 -122 -121 -302 99 11 -27 -39 214 -181
3615 -181 -118 238 -146 134 111 -132 357 157 84 78 123 -93 13 -68 -39 146 -74 264 191 65 84 140 -23 190
3639 190 -222 150 193 46 -64 -213 58 -109 -94 44 -83 198 352 -121 61 181 -163 195 76 126 46
3660 46 -3 119 40 135 -45 51 -10 -158 54 -38 -98 -187 212 -81 -42 -227 -319 -99 5 -176 -43 -163 50 -201
3684 -201 -107 -124 -87 111 53 -268 154 -41 -217 -231 57 -68 -120 177 -74 -178 -233 119 55 142 -216 113 79
3707 79 -220 232 -298 -69 -30 -263 -184 -284 13 -119 44 -25 62 85 190 -14 -43 -184 -4 64 111 220 -160
3730 -160 88 119 5 120 -89 109 -142 -43 285 -7 -58 -40 -134 -191 -590 -141 171 66 187 -92 50 145
3752 145 5 -151 -59 45 -96 -235 18 62 21 272 -341 -171 92 310 79 228 -180 -27 17 34 -82 17
3774 17 148 110 -242 155 26 57 -62 -360 -134 -179 202 171 -87 55 -55 -54 -206 104 -309 36 -17 -431 80
3797 80 138 198 308 -195 76 768 -1399 322 600 193 -410 -324 456 -302 600 -425 141 167 -218 30 -58
3818 -58 703 295 -559 -535 748 -511 -574 -1146 -223 -381 -94 -92 -99 -109 -57 -993 -552 127 173 -31 105 49 -26
3841 -26 -45 -100 -115 598 73 -196 -54 482 392 -79 -168 -134 665 481 -167 110 24 460 564 84 -248 -483 5
3864 5 -34 331 325 -82 -87 508 -209 -195 -499 248 35 447 68 -399 552 -181 -193 -28 -95 365 290 192 -95 -103 -172
3889 -172 -84 93 54 459 18 98 -111 -91 105 22 -106 201 34 265 -69 241 -73 -205 -73 213 -72 126
3911 126 103 61 -153 -192 151 87 15 94 56 164 -110 -30 28 129 313 -18 107 -87 -251 74 70 54 105 168 58
3936 58 38 46 -83 -170 -155 79 230 82 85 208 -105 108 -11 74 -45 82 -15 97 -141 191 -84 217 13
3959 13 -73 -2 98 167 90 252 79 63 46 411 406 -147 208 400 -156 -31 259 338 166 51 -211 135 91 130
3983 130 -202 253 -682 -199 301 342 272 -474 306 17 162 96 -92 155 -425 282 50 153 87 121 -382 -130
4005 -130 -490 -65 210 -304 209 -47 -185 -279 -477 316 -407 -129 -13 52 -73 -476 11 342 67 116 -198
4026 -198 226 100 643 10 -65 -427 192 160 -423 58 -413 -80 67 361 135 -380 36 273 206 451 -116
4047 -116 18 11 -122 624 252 -117 93 109 -33 -313 -9 702 36 478 -364 -263 186 521 382 -252 175
4068 175 280 363 77 35 233 -130 -200 -384 -105 368 195 -265 -217 533 -12 267 -278 -246 208 -310 -441 89
4090 89 -95 278 -191 15 207 -517 -71 -278 -372 -512 -149 -223 -352 135 185 -179 -297 -32 243 343 -113
4111 -113 635 120 -236 101 -672 -287 -280 -539 -51 -404 202 -302 24 0 -351 -558 -556 -195 -163 562 350 1567
4133 1567 -212 -150 -164 259 106 -60 -36 -412 73 14 172 525 -139 -1044 -279 529 -987 257 -1028 -603
4153 -603 61 -599 358 -248 404 -56 464 653 -73 -539 -60 132 248 419 390 751 346 345 725 349 544
4174 544 -1060 -132 -231 -682 -115 -427 686 -1 82 -25 -474 -579 802 814 -319 -26 -103 -562 748 347
4194 347 56 -25 536 1087 104 -632 -683 -476 351 -621 479 -723 -598 -1359 -78 453 -752 299 1369
4213 1369 -1050 177 470 77 -459 295 -539 595 -347 -445 459 867 740 287 1105 177 -248 1319 -1161
4232 -1161 -939 740 620 1341 -779 134 -275 403 -679 1004 -524 868 563 -737 539 310 733
4249 733 346 -1182 208 399 110 264 344 14 468 394 492 -200 427 -275 -510 -91 957 1178 279 236
4269 236 144 383 -851 -779 1066 999 666 -431 245 81 -432 249 -301 533 -146 -122 -217 -428 -58 120 -314
4290 -314 645 -72 466 -111 321 9 188 379 -187 191 1169 593 81 218 116 445 -334 -413 -354 751
4310 751 549 -284 -76 372 -1134 264 238 -22 249 460 744 833 868 370 -37 -468 303 -148 208 772
4330 772 -801 -490 523 620 -352 497 -58 590 237 148 333 -118 505 278 -39 -449 780 54 618 -114
4350 -114 -61 338 -369 91 750 680 -325 -658 529 80 336 149 440 301 366 -202 827 162 -68 151
4370 151 -397 420 -94 -624 -171 -6 -154 39 -216 271 527 165 35 632 101 167 -860 466 223 -191
4390 -191 -164 -125 372 -203 -214 -54 537 326 -103 55 -515 320 -239 346 795 -486 -775 676 330 -54
4410 -54 -697 -142 247 681 205 563 509 -1146 507 179 -12 -479 209 -457 -840 -794 1171 -542 1833
4429 1833 73 866 -177 526 395 -815 299 608 -141 1107 594 259 -633 334 797 -1211 816
4446 816 183 -1174 -612 -997 -1185 -988 1199 -177 508 -415 1152 -706 -509 -1000 421 -31 394 -251
4464 -251 -368 495 -290 -652 393 -1363 -305 -75 -253 -1008 1182 818 -910 -358 -431 -249 -78 -285 769
4483 769 -190 -1262 -367 494 -887 660 -924 -147 395 886 -46 -1093 264 27 18 31 -7 39 -641 103
4503 103 518 -561 146 -133 302 -82 60 198 299 -162 317 -413 -45 30 426 83 -387 375 -177 -402
4523 -402 -259 271 -63 -188 -135 -149 -225 -417 129 143 41 69 35 -53 576 -124 -164 -146 -6 -62 -152 -5 451 171
4547 171 -74 -209 -372 -220 -194 -10 -279 -20 87 215 -99 17 -174 219 -109 -133 154 -131 12 2 260
4568 260 26 67 -180 614 54 -52 231 -315 104 404 -291 473 133 -474 -666 -58 -17 576 -302 -304 -476
4589 -476 -698 399 279 699 -193 139 -37 596 -352 456 -425 82 109 -745 -333 -106 523 -219 429 480
4609 480 667 -49 -77 -516 96 329 -968 138 328 -688 -258 -319 -58 -466 335 -33 -447 598 -783
4628 -783 125 365 110 664 -210 89 203 448 389 -630 -262 365 250 149 -1018 -467 -198 -965 -108 -422
4648 -422 -277 466 518 127 -277 -31 -98 -310 -326 -464 -116 -239 -165 498 16 183 554 -163 185 347 -204
4669 -204 7 27 751 16 376 225 165 185 -567 998 -424 877 504 461 134 -301 269 -604 480 450
4689 450 27 679 -656 -82 60 195 -241 -389 -310 -444 391 -631 294 -477 444 466 364 -365 -185 402
4709 402 1278 -459 282 227 469 -326 1269 -25 361 789 -171 274 -106 642 472 -722 -605 618 -495
4728 -495 796 -336 605 -312 203 -493 -814 569 154 1294 -1487 -990 560 -235 -369 516 249 -498
4746 -498 -721 -642 -242 -640 1494 992 -1042 -559 -824 733 872 184 628 147 72 -519 339 378 802 -1117
4766 -1117 946 59 -116 -234 1232 -767 -894 -571 620 -543 994 -1015 -239 492 -1571 550 -724
4783 -724 7 353 894 476 -1023 -966 1939 -808 218 581 80 -178 -390 -679 20 649 -336 251 -238
4802 -238 200 -1006 576 -803 73 468 -414 643 -317 77 56 640 531 963 -540 -980 -193 -62 257
4821 257 -888 932 314 -519 385 -217 -284 -384 -130 -796 -294 137 -949 -105 -120 -454 234 -248 -315 -286
4841 -286 -600 -754 -506 -44 123 545 817 739 669 -259 959 -524 -323 169 417 384 156 -980 116 -288
4861 -288 -355 287 84 -1402 303 33 -33 -281 -128 -507 -438 9 458 287 -548 542 -298 490 398 -205
4881 -205 -441 606 448 60 -345 209 -1116 -267 -141 -217 -257 937 360 -31 119 437 -251 -214 -244 -426
4901 -426 155 814 81 -307 559 -74 177 -134 -229 717 -391 -1 316 178 892 528 132 -892 -200 -700
4921 -700 430 213 150 596 94 468 727 604 506 78 -442 -295 782 91 151 -263 -528 270 466 445 911
4942 911 34 905 102 37 640 866 -118 96 -162 694 -386 212 138 366 -661 370 803 -686 825
4961 825 737 1024 -486 828 -159 628 569 -90 282 883 23 796 22 331 80 -734 -99 -592 -138 -486
4981 -486 568 30 -54 789 -48 -408 61 -126 -80 -719 -556 333 394 -447 -367 -1077 -348 929 -174 170
5001 170 78 45 332 -321 390 -526 -694 -39 -221 -59 228 -57 335 -43 410 -314 -141 393 -117 254 -1059
5022 -1059 97 466 -439 -259 138 -191 748 340 -135 -43 -382 1 -195 -362 -200 -280 -667 -526 -175 -254
5042 -254 -620 -37 49 -196 255 -414 -286 189 -267 -332 197 -83 49 -251 -207 -705 78 -18 67 -44 -286 523
5064 523 -91 436 259 -649 167 -125 449 540 747 524 -527 108 200 655 -489 273 101 -179 216 723
5084 723 172 147 -561 274 341 -246 753 -9 -347 -420 294 -231 168 52 -234 213 20 196 561 117 386
5105 386 536 0 -176 -628 161 138 -27 79 142 -429 192 -209 474 -197 -381 -132 -73 -50 249 -572 -442
5126 -442 -498 765 -173 294 546 -95 590 -139 553 -208 -330 -690 -269 -117 -649 -853 576 180 -187 1818
5146 1818 527 -127 166 558 -17 -562 -378 -185 301 -844 -386 732 109 658 322 136 -370 488 -229
5165 -229 393 -374 480 -213 735 228 16 -366 755 174 758 984 -381 -1029 796 -42 -316 -632 254
5184 254 -436 244 1238 -275 -260 435 -39 -312 227 1467 -244 -453 -469 -243 253 1140 -565 -165 -229 53
5204 53 -356 1214 1032 -10 776 559 1736 -666 -1073 851 581 907 -130 -431 634 -355 124 -448
5222 -448 -473 1213 1409 951 610 -269 922 -740 -537 1181 1072 -214 2018 -143 -671 591 -1126
5239 -1126 -65 19 161 806 1682 298 354 -1182 1789 -490 9 -661 -1080 1423 -345 739 -1026
5256 -1026 -410 787 -1260 886 -540 -1058 342 452 1005 -188 -1455 825 335 649 435 334 1564
5273 1564 -434 237 435 289 485 204 108 -130 868 959 -1188 1116 -9 -132 97 698 -419 -89 818
5292 818 -1436 566 72 479 -523 887 -34 183 715 -142 -80 -992 -372 -597 689 -380 -961 -562
5310 -562 -184 -437 322 595 181 42 -325 -454 -1014 621 321 -479 -46 298 -836 349 420 -662 588
5329 588 1478 841 -209 71 -208 484 228 48 176 -541 -218 917 -118 -480 -971 410 1469 -449
5347 -449 307 -532 -526 -224 -793 578 -195 1 -125 -348 -571 -421 -211 -140 502 -259 -10 -144 358 -709
5367 -709 -233 787 -457 516 989 -966 -588 682 249 -223 38 590 -271 643 -622 62 731 -287
5385 -287 483 312 -144 -156 634 620 -219 -380 590 -825 -798 -1280 1052 114 -595 584 -265 -625 -135 845
5405 845 353 1606 -128 -17 -333 -1217 -230 -696 1533 -328 404 -1283 -18 817 720 1150 160 902
5423 902 480 837 -90 -1017 304 582 -896 1021 4 626 -523 220 77 321 -338 -639 342 121
5441 121 -257 76 -625 -500 172 -520 948 456 -257 -581 243 207 295 424 537 -902 185 -4 189 497
5461 497 -59 -393 295 -544 269 -632 98 4 -678 193 -303 499 113 627 10 -585 -148 659 215 232 252
5482 252 -258 -2 395 -43 552 -272 -244 1716 1255 3 976 344 1147 266 74 287 -651 506 -19
5501 -19 -139 -1168 -497 336 5 284 379 121 26 188 1120 402 -832 -850 -841 -270 525 280 650 -291 -261 625
5523 625 -425 -762 651 572 177 -68 789 54 138 -939 -567 -852 -1034 20 293 107 -167 -286 -209 655
5543 655 663 -609 801 291 -618 268 374 -457 140 1065 -256 -329 -391 328 189 -76 1186 109 -484 573
5563 573 -163 -589 202 -330 999 -310 -197 -1090 -518 597 336 -324 235 -132 -575 -290 0 463 406
5582 406 -311 1454 261 -115 117 1072 -586 -226 981 285 -569 -142 408 -200 1164 407 18 929
5600 929 -66 -8 -19 -257 -460 -403 58 -599 567 357 -182 642 -850 -309 -854 506 606 -283 -543 547
5620 547 -22 -990 -502 -504 495 -335 206 -169 384 759 -581 -358 44 -616 112 395 541 292 530 313
5640 313 761 -207 -344 240 164 718 300 -458 -1082 -262 -102 407 791 353 -207 503 317 -302 82 212
5660 212 -25 -11 -481 -1206 -634 -462 -624 -89 -830 -1258 258 740 -229 84 -619 -753 734 -45 154 -917
5680 -917 510 -621 158 -147 6 177 -35 -240 39 1 -225 -13 -596 195 -209 -282 252 529 -708 -84
5700 -84 60 320 -22 -194 284 -253 -161 389 -171 197 -262 244 -420 -8 -810 -357 330 -188 389 -215 343
5721 343 594 -438 93 -522 685 -329 14 222 -78 217 533 113 649 7 -73 73 480 -143 -156 654
5741 654 -339 -925 17 528 -430 -38 403 780 -235 786 -266 -610 714 177 -141 1274 642 -869
5759 -869 -1227 715 68 371 -116 -879 247 -700 -566 216 192 -454 474 -219 242 337 -880 -117 62 -501
5779 -501 -509 419 -474 678 514 310 70 221 310 462 -424 490 699 442 -863 -219 -71 138 296 57
5799 57 -346 -535 -23 -369 -160 -1184 -243 200 -237 -166 486 24 86 435 -880 -142 1091 -485 352 -877
5819 -877 -2273 -838 221 506 -194 175 386 585 174 -418 -399 -458 -1039 -168 1108 434 -1681 143 -371
5838 -371 -1130 -797 -1665 -87 116 -676 6 -255 122 -1432 -1725 13 1047 249 705 -599 290 1227
5856 1227 432 355 158 -218 -170 852 907 -451 267 227 49 -472 847 119 583 -150 -577 202 -753 197
5876 197 44 934 1211 963 382 -621 -1434 147 -116 -306 -852 73 172 -348 -432 115 269 680 973 -151
5896 -151 428 200 32 -1329 -410 -185 -409 -100 468 131 677 -370 -242 535 890 -70 -174 412 518
5915 518 -215 -1435 684 113 3 -856 -7 806 -681 -1204 -541 339 -479 -826 388 -717 -329 511
5933 511 -705 -115 637 -774 -604 673 -306 1062 782 723 271 -130 325 222 -1138 301 -125 -131 -1259
5952 -1259 -1276 794 255 -1169 -400 736 -386 582 -397 -868 1254 205 288 -350 223 -605 -132 -310
5970 -310 -80 -61 529 -239 -74 -1136 12 -240 138 -466 794 -150 -720 -1091 -48 183 335 141 -1473
5989 -1473 423 -488 1238 -1074 -501 -183 -1334 137 617 -248 -118 1673 704 -659 -545 -201 273
6006 273 -340 246 -111 -437 832 -761 -429 -1538 177 -214 -1439 -73 -1340 -858 -356 -389 -572 -849
6024 -849 361 -438 -1122 143 193 -215 -981 -100 -229 297 -505 -176 950 -261 -267 333 24 250 302 -563
6044 -563 -648 -1447 -85 361 -1450 -685 1173 187 -543 0 -514 390 366 -24 -615 -298 -1037 209 -38
6063 -38 -202 21 -8 -1095 140 69 480 11 -404 -76 -1056 132 810 -169 97 -181 -771 99 -181 -569
6083 -569 316 -117 -561 68 -539 -70 474 31 -286 -45 172 -387 -572 -331 60 221 -250 -216 -819 196
6103 196 133 -130 -542 -294 -303 28 97 -72 -94 116 354 102 687 176 301 -448 521 284 -430 366 -357 36
6125 36 -66 530 -177 188 -300 -200 -41 -330 405 -24 -292 824 -216 -830 642 652 527 -1121 -944
6144 -944 1039 809 78 -96 -1220 -371 223 179 188 736 -385 -366 -331 -8 67 375 -36 -621 -84 154 231
6165 231 431 -349 -7 251 -195 41 -897 -185 100 159 -845 -530 207 15 -126 -671 -245 464 89 0
6185 0 386 -434 -145 -142 -160 -183 13 -499 -176 -662 -215 -420 343 -706 -133 -173 563 -155 -285 275 209 24
6207 24 2 105 -624 852 -298 910 -201 -133 -284 468 -534 163 -147 784 778 -377 -249 282 -317 135
6227 135 144 -257 -103 6 276 -1277 -143 -191 31 -375 239 262 1016 165 499 -776 1598 -705 -295 -384
6247 -384 253 -478 618 -352 177 -741 592 618 222 324 43 47 -429 -283 848 -655 96 334 -548 92
6267 92 128 16 -721 216 249 -297 281 -209 324 497 -305 178 -194 -303 -149 -653 152 425 -133 -599 -111
6288 -111 -58 141 229 -454 681 65 -123 126 -955 499 132 23 -358 367 187 -322 415 342 -417 -349
6308 -349 -441 161 186 565 880 -605 -339 -170 -244 -1250 -263 418 -1015 551 677 326 750 350 531 -207
6328 -207 -522 -550 2 -104 -123 -386 58 -131 -464 -77 511 344 -695 -164 -83 435 -474 -391 25 98 94 -144
6350 -144 -465 -29 -832 208 -365 320 423 286 203 39 442 129 806 225 -83 102 557 -583 -457 91
6370 91 -900 -724 138 -484 697 294 -1376 3 -561 -381 -739 -411 -79 16 -766 -370 236 12 205 112
6390 112 104 -173 464 322 -698 926 -802 -26 -300 334 450 -32 -91 266 -151 -319 401 245 -157 -281
6410 -281 -431 -380 326 280 -678 -130 -362 326 997 -764 -523 -474 339 -603 -411 309 -825 -769 -235 601 506
6431 506 254 -785 -1061 -634 -353 682 761 353 -378 353 -319 979 740 -457 629 -691 -507 504
6449 504 -324 -146 -419 91 -1004 164 457 -327 68 176 -1778 374 705 1817 1504 962 9 -529
6467 -529 1303 -445 -399 132 604 -501 -365 -257 641 109 -457 -71 -65 -7 -469 -374 395 -1293 -550 198
6487 198 823 21 -529 432 419 -37 -747 -310 1000 -1020 -179 -208 -643 96 65 -66 19 419 -196 -735 -248
6508 -248 792 718 -332 520 -285 163 -56 -378 -181 220 69 -199 168 -405 630 434 387 -73 148 34
6528 34 -87 34 -82 -667 -421 -167 -373 -256 87 204 341 -316 197 8 -342 -63 -306 556 -286 -408
6548 -408 -204 -187 69 281 -236 165 109 278 -484 -113 -159 585 -174 178 172 381 11 469 -173 -257 -468 -144
6570 -144 82 225 52 223 -63 234 139 15 119 239 -342 95 -233 84 51 7 -252 -579 -666 -432 343
6591 343 -9 200 -275 103 -172 -156 46 -151 358 701 331 -129 252 -85 -137 248 392 160 274 -99 -135
6612 -135 -228 94 -368 279 -100 -252 -112 156 22 64 36 -132 68 -132 142 -283 -100 287 317 9 27 -397
6634 -397 375 859 -111 -178 351 -241 -501 -21 -170 1025 -507 439 -219 170 -64 -320 408 -997 -1071 -164
6654 -164 -476 -945 814 759 290 377 265 426 -311 480 -858 561 245 21 61 -308 341 863 -393 256
6674 256 398 340 404 300 418 165 611 213 1061 -283 890 -602 -139 -71 23 -30 -17 -221 481 738 -513
6695 -513 -172 74 410 -296 676 -355 -127 -16 578 453 338 -509 338 -703 -1070 -83 379 72 -682
6714 -682 -424 860 -395 337 358 -24 -376 -972 -351 -369 -198 297 -53 -414 76 -236 -381 834 939 329
6734 329 203 914 -708 -227 -179 717 217 148 -398 474 198 -682 -298 -193 -741 505 -510 1161 -670
6753 -670 48 75 -727 -261 -968 -782 -274 720 -331 456 -30 -700 -511 -450 -60 -36 -39 913 -1076 -667 -316
6774 -316 -470 248 182 526 50 -351 -363 -21 304 -307 -190 150 104 14 -314 604 96 124 -114 40 81 19
6796 19 36 -46 -77 -108 -100 -35 -9 134 130 -133 -25 188 87 -108 -61 -153 -221 251 -33 -11 -121 35 -176 -1 -11
6821 -11 -50 150 -298 -6 -54 120 -86 132 -47 227 -118 -31 53 50 -141 115 -30 -312 152 103 39 -70 -246
6844 -246 -95 47 -87 -6 57 78 20 -1 11 241 27 90 -98 84 147 -137 -124 135 -7 -68 156 -43 -120 -68
6868 -68 46 153 2 -84 113 182 143 -75 121 -28 -31 -262 131 351 186 -152 275 -82 127 -39 182 115
6890 115 226 130 -47 -122 166 -152 111 -261 -106 105 -1138 536 232 -90 -425 -1270 -887 -40 125 -63
6910 -63 261 -336 755 12 -497 42 -613 363 -417 136 197 -576 619 225 -371 10 146 290 330 -163
6930 -163 -76 88 -156 -275 -101 -127 -118 -47 -174 47 491 251 129 -65 -253 25 162 -596 -417 -441 -467 -1307
6952 -1307 614 314 127 -630 -11 -104 -530 -405 -688 -304 522 -411 55 230 -68 -719 529 8 122
6971 122 -936 -1132 389 527 -805 -967 -292 -215 1410 -542 -14 -635 -1353 -464 -422 -228 -658 -15 -438
6990 -438 236 21 -59 -722 -632 699 -416 -93 189 116 -199 -327 23 24 -180 -6 27 95 -407 -63 147 -367
7012 -367 -104 -34 -149 123 113 -1 -16 188 -168 -102 65 -125 -142 -83 64 13 -220 13 226 117 177 115 117 248
7036 248 89 -6 62 -133 -163 49 258 211 -32 -108 6 108 -216 -233 -38 -280 -31 -33 -38 -4 224 -424 -467 -131
7060 -131 -90 24 240 -399 162 -519 -345 248 -154 383 131 429 -86 99 -457 -49 -406 237 -424 151
7080 151 -388 60 -75 -125 -297 -80 184 -449 471 219 360 88 106 265 -24 -465 -174 250 72 224 109
7101 109 -138 69 -270 -97 -220 108 151 -57 -102 -31 46 -266 603 -38 27 274 -306 469 394 81 -712 521
7123 521 5 -110 181 273 -486 -244 100 98 352 -418 554 -673 136 469 128 573 219 -571 724 -227
7143 -227 197 134 650 -525 -67 895 -194 317 745 453 -305 340 387 252 -75 -327 292 -68 -443 -1209
7163 -1209 570 2 -136 215 -672 755 128 -396 23 359 35 159 -363 -79 195 -263 1001 466 -512
7182 -512 -178 -302 -64 159 159 -36 -1 28 395 269 -214 -246 305 -398 380 -31 607 -59 106 292 -159 144
7204 144 -138 363 -417 -165 130 188 6 885 457 145 799 371 413 -11 369 -229 -159 320 394 -186 480
7225 480 269 629 -303 -36 531 37 343 213 -510 140 -258 603 259 -48 -972 141 102 1053 82 539
7245 539 687 -1062 304 576 -114 206 -318 -20 -529 -758 -721 155 29 745 -555 -788 402 -288 -352
7264 -352 -1100 58 -347 -191 491 -212 -371 -308 98 35 -538 -417 -55 -575 -691 194 215 575 -602 591
7284 591 -491 -976 178 -69 816 135 -1019 1381 215 -117 244 -184 469 507 -1136 18 -915 -585
7302 -585 -876 -1439 419 -1727 46 -115 884 682 -437 520 -41 204 910 -105 857 -467 -760 -540
7320 -540 -192 -470 107 97 704 -80 -5 29 953 -441 -174 -885 -679 245 -318 238 -92 73 272 -155 -617
7341 -617 -616 345 86 -195 -351 395 -35 -320 -457 -227 -36 -62 341 -392 -291 -280 206 -300 -158 -142 -115 160
7363 160 285 70 -79 165 169 133 -185 -314 -670 -603 -245 -425 408 694 -231 688 314 -173 -132 -644 -391 362
7385 362 -286 339 -311 580 186 877 200 366 -591 1050 663 872 -313 -315 1074 162 551 -97 434 -726
7405 -726 -417 -302 591 284 -1152 -47 -217 652 157 868 90 74 -403 108 -125 -184 251 -199 194 329
7425 329 228 -177 307 550 -315 -191 448 -443 855 807 138 332 348 -61 -108 -74 -187 192 -241 145 -38
7446 -38 -121 114 -176 33 185 -23 -247 -81 115 -32 -148 29 -126 -37 -33 -27 -58 -111 -176 -85 -70 -54 54 217
7470 217 -86 -224 69 -160 -70 286 281 -53 -3 36 -112 315 26 494 71 102 523 87 -583 762 3 211
7492 211 208 -810 -270 -122 133 149 -277 83 -98 -41 -46 44 -72 -213 550 335 -188 92 -231 -362 -144 43
7514 43 -673 -121 -405 -329 -124 298 -467 -385 157 40 -303 -600 46 -237 183 164 -349 -272 -104 -239 -24 -86
7536 -86 44 -322 -120 -2 26 159 86 -206 23 -57 17 140 -56 107 11 -65 -319 -347 31 348 155 -82 222
7559 222 299 101 230 21 21 373 73 -361 -320 -209 -7 149 -4 -15 24 -62 -20 -53 85 217 70 -69 292
7582 292 -433 489 -463 -199 -111 168 100 9 456 -210 280 -220 58 54 654 -208 -209 236 234 -87 -162 627 285
7605 285 1346 348 346 -389 26 1895 938 239 444 -1120 -212 95 125 278 -112 -76 -89 209 -717 -198 -19
7626 -19 -551 -126 237 1179 27 405 1 183 240 -606 559 339 399 90 62 67 -250 -6 282 613 713
7647 713 1 -450 -75 -608 432 -112 414 381 621 -26 -238 -811 138 -83 -18 -131 772 -162 -270 366
7667 366 94 60 295 367 1186 632 -836 150 789 261 661 475 -118 127 -200 -115 -185 -279 -136 -392 -106
7688 -106 -125 339 715 609 -19 -179 368 -806 274 -1263 685 309 772 704 660 -153 653 -317 401 -191
7708 -191 -233 -182 -450 392 -303 -519 -169 240 166 -729 -22 293 -60 632 255 -426 577 495 -152 -378 -579
7729 -579 1342 78 -293 296 523 1334 255 299 -170 -391 533 -817 642 -525 -54 -1015 254 29
7747 29 26 -428 -98 274 -1102 -82 -456 -133 374 -30 -502 65 214 -301 -206 -303 91 -6 245 85 -297
7768 -297 -181 -505 -327 140 1048 -323 127 -309 -360 191 -67 36 -71 568 -419 32 -615 -398 3 110
7788 110 -120 396 -54 -390 -186 -29 123 -240 563 366 238 -205 -278 114 -235 264 95 449 -815 -69
7808 -69 464 -217 -53 174 -457 683 -278 -30 706 -436 379 -143 -77 -482 147 408 292 174 -7 440
7828 440 -181 159 13 100 92 -152 -182 -4 86 74 111 342 154 666 290 15 135 -438 159 -288 -700 191
7850 191 -93 -190 648 -32 -218 357 -36 -363 -46 -565 223 -275 -168 -311 -52 -594 379 165 -573 -233
7870 -233 438 -151 911 334 -121 553 -395 -10 117 106 790 76 73 557 103 -506 -123 -242 518 -326 22
7891 22 82 588 -577 -112 873 468 126 -440 -469 -874 -729 -557 -217 60 -935 -303 -638 -757 -551 -116 -139
7912 -139 -70 348 228 -1224 -125 -35 288 -398 44 877 -28 -374 -647 -165 21 -69 -144 373 -552 587
7932 587 -433 158 -417 -397 -174 788 119 -382 213 -262 8 -316 472 54 -128 329 -180 -399 -107 -627
7952 -627 -468 -363 681 -245 -260 -146 -313 207 -310 228 -329 -48 143 40 -204 58 119 246 -352 317
7972 317 -111 -260 -483 181 284 -680 -32 38 -248 76 -182 91 -143 -207 87 201 149 26 -77 -249 42
7993 42 -63 -47 57 35 15 277 192 123 -292 -171 53 -112 -42 -20 162 78 104 96 225 -203 77 61 -26 25 74
8018 74 3 119 -154 -34 -3 -158 79 262 -102 116 -74 10 -111 83 -13 4 54 146 221 40 60 -139 -79 74
8042 74 -231 -121 -165 -38 79 -207 -13 -503 115 431 33 -603 -105 334 147 -65 -26 -54 -470 -27 159
8063 159 -440 -335 138 508 74 228 184 105 181 -48 -382 -156 -340 -64 136 324 -229 109 -7 -599 -233
8084 -233 43 640 25 24 242 431 803 -543 26 37 -332 -187 -454 280 -422 180 460 -77 -333 689
8104 689 -20 852 -142 207 -275 -259 -278 -20 385 511 -413 485 335 -890 281 -1030 1015 -73 282
8123 282 -935 -120 -520 740 -190 -94 397 379 484 -169 -28 -593 -381 -11 15 128 -10 -206 329 131
8143 131 418 96 452 1 288 -195 -403 104 -21 -261 64 7 -38 -169 172 22 -22 -15 114 -207 177 -98
8165 -98 -208 -12 -508 -523 -102 -173 -21 139 507 -1 251 -250 -725 148 133 -285 87 -520 -506 -314 99 -14
8187 -14 -117 -300 214 149
8191A49
$$ Imaginary data points
##PAGE= N=2
##DATA TABLE= (X++(I..I)), XYDATA
0 0 0 0 0 0 0 0 0 0 0 0 0 0 6 -8 8 -8 8 -8 16 -16 24 -24 32 -32 40 -48 56 -64 73 -86 97 -112 128 -144 161
35 161 -182 204 -228 256 -285 317 -354 393 -435 481 -531 586 -645 712 -784 864 -953 1050
53 1050 -1157 1279 -1415 1574 -1753 1958 -2205 2499 -2860 3314 -3906 4717 -5892 7767 -11240
68 -11240 19875 -91928 -102068 31232 1575 28821 -30622 -104914 -90686 -13312 12090 15768
80 15768 -39718 -98971 -68563 -12580 2765 24341 -29196 -93907 -83147 -31267 13913 26220
92 26220 -11811 -74087 -89566 -38628 -740 23299 -1127 -67162 -75420 -34014 751 12897
104 12897 -6853 -51111 -77054 -38845 379 15521 5548 -48768 -67443 -41862 -18515 14803
116 14803 14606 -28232 -59915 -48751 -13662 12851 14253 -27321 -54222 -40596 -20230 18709 21689
129 21689 -25693 -51583 -45643 -14570 13055 14457 -8201 -41059 -44480 -23463 9150 18040 -10295
142 -10295 -27531 -37211 -28286 6266 19407 4017 -28037 -42919 -24642 2925 24000 7686
154 7686 -22207 -37732 -32253 3418 22263 8513 -15822 -35510 -24479 -1539 15878 10737 -12718
167 -12718 -24483 -28135 -6755 17858 10515 -4362 -23024 -27324 -10146 9368 19169 471 -22747
180 -22747 -28373 -12424 14180 12451 859 -14708 -30269 -11616 11338 15359 980 -17707 -19749
193 -19749 -12140 4405 11735 3922 -8350 -24388 -13063 5412 5711 6856 -6595 -20305 -18178
206 -18178 -3387 13600 8832 -6996 -21113 -18939 965 6874 9933 -3252 -22217 -14557 -2821
219 -2821 7826 6001 -7124 -15573 -16720 -4200 3324 4441 1919 -17135 -18808 -8299 163 7459
233 7459 594 -10769 -18636 -14574 286 7147 4273 -14141 -20883 -7661 -2889 4577 3394 -12091
247 -12091 -19606 -14261 -290 3722 -650 -7465 -15409 -11861 -9146 -1297 5866 -8407 -13707 -11613
261 -11613 -8978 -1886 1655 -1863 -15373 -17262 -8414 -279 5716 -6669 -15669 -13969 -13093 -1071
275 -1071 2156 -5292 -11417 -13997 -7896 -4614 -2438 -5204 -11682 -8907 -11041 -5859 1691 -5055 -9291
290 -9291 -14323 -12831 -5381 -1082 723 -7523 -13096 -13752 -8431 3306 -3358 -10347 -9795 -11330 -3875
305 -3875 -719 -1577 -7976 -13965 -9361 -5296 -177 -1869 -6601 -5486 -13498 -10881 -1659 -1941 -2395 -7726
321 -7726 -9775 -8904 -4485 1414 -3177 -7356 -11964 -9118 2396 279 -2920 -6186 -11433 -7604 -3563
336 -3563 256 -1632 -5389 -5813 -7883 -3153 -3167 -4007 -529 -6481 -7070 -3810 -1375 1488 -3546 -6523
352 -6523 -7580 -4658 1129 304 480 -6743 -9394 -1303 -1172 -1416 -2796 -4616 -3618 -3255 81 -976 -3785
369 -3785 -4143 -5205 -98 -1718 -2072 2430 -2799 -5399 -4658 -1939 1158 -524 -1177 -4798 -4481 -835
385 -835 -27 2001 -4341 -7160 -995 -102 1970 276 -2718 -3620 -3985 120 -823 343 -412 -3451 -554
402 -554 -3079 -2542 1964 -855 -2114 -4619 -2888 297 1328 431 -3745 -4376 -2593 -1671 3657 529
418 529 -4711 -2235 -2335 609 -1630 -946 -262 -2240 -1469 -2138 477 -1709 -2108 -806 -2611 -3720 -614
435 -614 386 244 -2451 -2380 -919 -740 1722 -1644 -1801 -2727 -2272 2305 -534 -2922 -3126 -2028 -12
452 -12 -596 -572 -1848 -1874 -531 -2506 -99 -986 -2556 380 -1259 -2081 -1310 164 596 -2005 -2849 -2864 36
471 36 1878 -1660 -978 -2715 -3663 773 578 -383 -2853 -2351 211 -976 -320 -1258 -784 -458 -2635 454
489 454 -470 -797 960 -810 -1881 -3187 -462 1762 -319 -637 -2379 -1302 419 -731 917 -1354
505 -1354 -2204 564 971 887 -1207 -378 87 -725 917 -1262 185 1355 -1096 617 -952 -1179 1127
522 1127 599 1037 -1065 -200 1386 885 905 -1991 -63 1866 751 2075 58 -473 308 721 2119
539 2119 -401 -643 1066 1782 1973 -899 1164 1142 -762 1226 1288 1235 1277 1688 2441 -1193 41 2052
557 2052 2675 2524 143 629 1569 334 3152 1099 125 517 2286 3129 848 1793 867 720 2234 -278
575 -278 1588 2542 1569 2753 717 935 1488 2160 2881 1311 1783 980 1755 3668 244 1032 1555 1258
593 1258 3060 1418 2042 1447 1285 1882 1435 1461 519 2711 4287 254 1480 1479 1851 2161 1685 2012 1046
612 1046 1697 3166 1124 894 539 2626 3434 1254 2205 1626 1885 2561 1899 1560 -266 1690 2953 1816
630 1816 2252 831 1811 2081 518 1376 1537 1709 2686 1970 1890 727 1347 1849 1473 1762 -569 1073 3307
649 3307 2033 799 -908 1915 2286 723 2229 1160 1591 1456 912 2698 -169 764 2720 1737 1096
666 1096 818 1214 2056 1558 2060 735 1208 1431 1996 2493 -211 1086 1775 1110 1556 631 1608 1781 1647
685 1647 2045 348 959 1647 1680 2206 186 1173 1767 1477 1634 527 1054 1134 1696 1670 322 1541 1458 1402
705 1402 2383 399 752 1658 2152 2315 738 963 1295 1773 1898 1244 1882 455 1299 2476 698 889
723 889 1357 1628 2033 620 1394 1902 1557 2186 1218 1146 792 1870 2915 1276 1146 1347 1762 2001 564
742 564 1681 1174 1941 1141 1395 1404 305 1864 2014 1153 1573 1486 2149 2656 1647 1781 859 2485 2550 1622
762 1622 2395 1158 2000 2324 919 1180 1277 2771 2695 1607 1663 1004 2489 1805 1325 2787 1801 1549 3249
781 3249 1454 2036 660 2120 2119 1869 2002 1749 2354 1446 1955 2717 685 1643 2150 2709 2255 1172 2186
800 2186 2885 1885 1798 1887 2474 2541 1892 2648 1895 1524 2312 1738 1797 710 3840 3103 2597 2839 243 1901
820 1901 2543 1817 2617 2249 1558 2262 2424 2360 722 2049 1800 2647 2079 851 3138 2348 933 2783
838 2783 1018 1150 2370 1912 1944 1223 2128 2293 2301 2069 1518 2333 2523 2710 2301 1187 992 1803 1784 1627
858 1627 520 506 2045 906 2549 1069 1717 2244 2187 1746 1656 1865 1466 1014 1862 559 1688 1406 2503
877 2503 1678 1498 1488 1284 1732 2571 1196 862 1643 1256 2084 1242 1098 951 2090 1527 1170 1729 1243 1077
897 1077 1542 966 1818 675 1752 2361 1742 1374 740 2098 2165 439 1673 1333 1618 1645 1285 1799 1297
916 1297 1974 2194 1332 1953 1001 1997 1913 1302 826 1022 1788 1637 1501 1528 898 1532 1689 1317 1456 1277 1816
937 1816 1943 1088 1757 1068 1862 2058 1541 1257 671 1500 1940 1797 1373 739 1400 1949 1572 1442 1478 1820
957 1820 1491 1728 1803 898 1996 1693 1749 1903 661 1717 1961 2095 1762 648 1620 1657 1795 1940 957 1300
977 1300 978 1497 1726 1002 2106 2141 1657 1441 1137 1699 1473 2012 1675 912 1608 1550 2353 1919 1154 2043
997 2043 1874 1726 1379 1370 1660 1630 1816 1700 1190 1456 1572 1863 1928 1272 1474 1388 2096 1655 949 2155 1634
1018 1634 1835 1704 1413 1754 1169 1752 1665 1149 1707 1672 2204 1790 1096 1398 1342 1942 1718 1585 1501 1036 1731
1039 1731 1803 1083 1323 1304 1863 1551 1344 1482 1273 1738 1744 1343 1330 1176 1828 1999 829 1279 1117 1517 1384
1060 1384 1032 1294 1356 1565 1318 1135 1022 883 1486 1463 972 1041 868 1628 1719 1268 1420 839 1699 1164 1167 1465
1082 1465 898 1284 1373 977 1022 982 1649 1494 857 989 954 1458 1176 1006 1120 420 1369 1338 1245 1037 660 1131
1104 1131 1211 1346 1342 784 1118 1477 1044 1091 524 1463 946 1522 955 820 1348 1117 1387 1102 7 654 1365
1125 1365 764 1131 671 1250 1512 1055 1416 496 1576 747 809 877 776 1173 1253 754 1060 995 381 760 1147
1146 1147 641 597 1773 1299 1124 366 665 1569 461 1078 1252 945 1288 1175 998 487 885 952 628 1268
1166 1268 754 1557 1466 251 1578 487 911 542 816 1244 816 615 920 719 1318 784 775 711 15 864
1186 864 1103 154 1264 1306 253 981 1003 1180 591 1402 935 1093 640 723 1538 932 833 818 453 943 809
1207 809 435 582 673 922 561 640 898 721 921 469 664 636 383 914 965 833 657 528 1044 735 830 836
1229 836 620 967 648 831 459 256 712 617 959 668 676 801 790 857 298 524 853 896 564 949 849 422
1251 422 1083 812 93 27 319 854 462 759 703 794 596 776 646 443 710 749 1338 535 453 610 530 595
1273 595 848 577 547 382 605 224 446 627 518 1132 253 180 572 652 554 486 430 694 488 783 483 552
1295 552 418 384 521 254 33 694 259 742 95 345 70 562 633 472 298 635 712 606 707 414 778
1316 778 470 32 319 322 311 601 343 346 352 181 273 632 535 562 429 327 605 354 201 225 366 532 372 343
1340 343 382 97 783 555 757 407 504 37 417 287 -259 1027 331 1232 -320 42 285 773 -426 115
1360 115 -261 747 -266 729 986 -180 -68 671 631 1142 67 6 122 1017 974 438 -2 141 835 -489
1380 -489 -668 832 -65 323 -69 766 351 514 -231 301 263 292 -561 -410 718 -159 571 22 94 1193
1400 1193 -127 254 1033 -374 567 440 -333 -104 644 338 27 -1011 -18 261 557 374 -11 287 -143
1419 -143 -2 -104 98 -437 601 622 -453 1156 712 325 143 516 -223 457 118 197 -416 -131 665 172
1439 172 -488 203 801 -214 -345 11 52 84 -62 348 195 317 887 307 558 323 -11 201 373 -297
1459 -297 339 -279 548 380 140 226 364 64 -31 272 289 23 -11 100 473 273 72 -333 165 195 484 -443
1481 -443 286 -574 666 489 55 370 145 54 435 722 404 43 -186 101 318 -232 -207 367 597 234
1501 234 66 200 269 209 424 839 -249 -110 -31 230 53 200 288 407 285 161 66 -85 306 -11 410
1522 410 44 155 425 114 260 245 -235 341 47 247 113 127 164 175 13 -417 25 164 -77 341 -196
1543 -196 84 423 -133 101 -34 335 -47 14 222 -158 103 -14 98 27 68 68 56 212 130 -426 -166 69
1565 69 69 -116 253 -340 -138 -73 462 -56 -267 157 -66 40 92 216 -172 -111 11 -248 -70 -26 91 211
1587 211 -94 33 -63 132 -71 40 255 143 -128 -228 31 134 -67 390 179 117 126 217 -191 -35 -156 42
1609 42 314 314 253 -13 -147 -221 -142 161 37 180 -172 288 316 -177 -211 -100 74 491 -250 156 -100 405 164
1632 164 64 -1 -207 200 -42 14 122 61 -127 108 14 359 -316 -170 234 -123 -88 106 345 10 -168 -135
1654 -135 -349 -110 276 -6 164 -39 129 -194 -47 258 -203 -436 34 -99 -27 -542 -189 -49 540 -319
1674 -319 -268 136 273 -119 411 -324 47 32 -72 289 168 301 -268 53 -82 107 -125 80 -192 190 -524
1695 -524 213 198 92 -76 522 -74 40 70 313 65 -30 -13 348 -51 102 -11 -116 -258 -508 1129 -455
1716 -455 -501 -91 -81 -290 -383 -215 -175 387 170 634 439 -68 129 -210 -312 -139 -188 -138 -250 -355 -414 625
1738 625 -832 -24 255 -30 431 -266 -33 -518 -248 -75 -168 -191 -768 83 44 -143 -257 -12 -483 -258 -370
1759 -370 -341 -99 -446 3 -1296 -139 83 32 244 -320 321 -60 -444 34 -10 -481 -321 -371 -155 193 -530
1780 -530 179 -97 78 -493 -586 -190 541 -388 72 -86 206 -310 -90 -168 -684 -456 -62 -31 -420 -434 -95
1801 -95 -550 -487 -145 -635 -40 239 91 -210 -414 -409 409 -412 -223 -125 -200 -1113 -808 345 -219 -451 749
1822 749 -623 345 -204 803 -702 -881 772 -52 -178 -852 445 405 -1045 -186 -141 114 -328 313 107
1841 107 -682 -737 135 -702 -213 -493 1106 224 -196 -321 796 271 -731 554 30 -51 69 137 -62 10
1861 10 -429 842 -197 -329 40 251 -794 -635 318 375 207 231 214 77 329 -33 -242 808 125 -632
1881 -632 -148 41 -690 -738 -1211 -75 -587 140 -717 -759 -816 460 -615 -492 609 -445 -809 -530 -257
1900 -257 204 -275 -308 -240 -658 241 -317 -392 -81 -738 279 -684 -16 199 518 -244 -259 71 -563 -797 -72
1921 -72 -708 75 -273 -216 -35 -217 -720 -296 10 -6 -238 -220 -550 -642 -600 -621 -550 -596 187 -260 -119 -354 -310
1944 -310 -1398 -1247 154 -186 11 142 -573 -835 -283 -284 412 149 -411 -733 -141 272 -15 -251 -963 -460
1964 -460 -39 130 -256 14 -350 -818 -225 -33 -193 -493 -327 -40 57 356 125 -172 162 -926 -480 -859
1984 -859 -640 177 90 -124 -1125 -4 155 -223 -110 378 -1055 -997 -372 -439 -317 -1165 -607 -20 112 -163
2004 -163 -702 456 -36 -764 -465 74 44 -313 209 -562 -515 -347 19 -54 -347 322 449 -33 -202 -793 -44
2025 -44 -148 -205 187 -111 294 -172 -319 355 117 -637 -57 -603 156 71 -578 -37 111 -246 -788 -21 148
2046 148 174 -590 170 -330 -31 -175 -56 -164 -172 -624 -375 -273 -49 -131 -79 -613 -402 311 -588 665 -168
2067 -168 -219 24 80 -191 -107 201 -190 20 107 -22 -111 48 -254 -78 183 148 63 -167 -203 -277 9 -163 -27
2090 -27 -68 -93 -15 -215 59 92 69 -292 -36 -140 -264 -264 -199 248 -440 -855 -158 -253 -162 70 150 -111 -317 129
2114 129 -155 -468 -312 141 1 10 20 -251 393 143 -248 -127 -194 -500 -268 39 -376 -144 -463 -400 -40 271
2136 271 -876 -189 19 -111 -580 -131 18 405 687 -24 676 477 -268 -202 96 -541 -742 -408 -1000 658
2156 658 948 -798 -25 138 -468 -725 -75 -37 111 -6 164 962 -583 -295 435 212 -271 -856 207
2175 207 -560 264 -460 -265 -195 -337 413 -355 -546 140 43 -753 -368 -366 -247 108 -533 21 -1483 -1204 -894
2196 -894 -78 -139 490 -402 -268 167 -13 -490 -416 -410 -735 -82 370 138 -360 36 -340 -85 67 23 -34 -139
2218 -139 -130 -165 -79 75 24 -132 -18 161 -50 -41 -25 103 -317 43 -236 190 -31 -59 -150 -191 -51 -146 -3 -156
2242 -156 -199 -64 31 -170 -171 74 -24 210 -33 164 10 -27 99 155 68 25 15 150 286 -20 -5 104 -135 -213
2266 -213 -265 -35 -189 36 60 -227 -120 30 -213 -53 70 351 -62 257 -312 -582 1163 -397 216 -194
2286 -194 -136 290 226 -296 -114 760 63 380 264 400 -499 -194 122 -99 -42 291 -572 -353 306 -208 -325
2307 -325 590 -126 132 117 86 -696 -120 -909 -854 1201 98 -223 -636 116 124 59 -217 -149 150 -1023 -468
2328 -468 -514 305 -592 1366 394 351 647 606 -959 953 -28 133 -87 27 331 -291 -111 -54 480 -676
2348 -676 -35 -463 25 100 -237 62 150 -200 -193 402 53 144 63 79 602 347 -251 185 -99 -875 -285 -287 -217
2371 -217 160 -92 192 191 218 -77 -219 -320 -76 -212 -431 -109 -412 -197 370 -19 -530 -118 54 -60 -94
2392 -94 -221 -114 -78 283 -77 219 -115 -202 -115 -272 109 183 -85 15 3 -227 -9 -112 -369 301 261 153
2414 153 203 -354 -83 33 -48 -52 -168 -50 -207 -57 -162 106 133 -3 -93 -269 81 -170 -155 155 -94 -259
2436 -259 24 -183 -64 133 223 159 -68 -95 -6 230 -259 61 -160 -127 180 -131 -122 66 -203 142 -48 162
2458 162 137 -77 141 -69 235 21 -181 -324 192 -600 313 -300 -18 599 -615 657 -156 -603 266 -493
2478 -493 -98 348 182 -180 2 825 -339 -923 -243 158 500 -32 207 -536 167 -748 1 -187 312 -214
2498 -214 228 -1508 715 1117 -530 -292 642 -129 280 -298 838 1526 407 -556 -537 -187 833 -151
2516 -151 -198 1154 -223 -828 157 773 -230 110 -1256 405 -32 351 1307 -97 478 445 -330 224 322
2535 322 -149 786 897 604 -537 575 472 -108 136 -476 492 -30 -210 -41 870 531 255 -527 -17
2554 -17 331 -5 -628 99 -30 324 611 314 -1254 178 -1057 336 224 -12 449 -191 758 -295 378
2573 378 498 827 328 -317 177 -425 333 307 156 904 -421 -613 381 731 -144 641 53 919 -223 -890
2593 -890 225 -917 -3 -287 -410 177 116 -305 615 7 -285 984 336 -586 367 -22 1021 -463 455
2612 455 -686 331 147 -486 200 -195 468 625 392 677 546 -843 -424 -177 -402 -1814 -517 -169
2630 -169 840 1291 279 -555 -540 971 596 807 -586 -137 -71 424 -623 127 138 -351 -301 458 -625
2649 -625 769 158 730 404 -96 291 693 43 -11 -90 72 189 -25 29 617 38 244 -135 119 140 -117
2670 -117 760 -387 173 182 123 558 120 -16 -576 -578 133 141 -612 207 104 -272 45 118 -19 -474 -4 53 -341
2693 -341 -335 91 -116 152 254 149 295 42 -187 109 -137 115 86 -188 -7 113 -182 -143 -128 155 -127 -45
2715 -45 -40 -182 -16 -367 110 -221 215 -368 151 145 -47 685 765 -262 -484 -806 -296 38 -164 55 637 396
2737 396 -497 255 -139 454 285 -268 -731 74 -112 -306 1 -139 -378 -128 127 -235 900 -68 -834 401
2757 401 -525 -259 203 -111 -124 123 253 -71 153 -128 89 -58 -249 255 -267 -25 -77 5 13 -295 212 216
2779 216 -361 710 -152 -381 390 -383 96 1061 1080 -18 407 426 -68 -712 -855 -1196 -1136 -1195 993 -706
2799 -706 151 580 354 -514 -770 1685 0 -992 432 -1605 1006 24 955 447 550 -1057 -30 155
2817 155 -221 249 -1012 -141 -58 0 364 1164 -383 101 468 459 -2 471 -569 -4 -352 -601 -595 116 317
2838 317 189 333 -2123 -761 -198 748 -1447 -105 -100 -223 -772 320 21 1505 960 162 -496 -223 80
2857 80 -286 -119 421 1178 -290 720 -1240 -1599 447 -704 -418 -233 -1585 599 -65 -428 497 1456
2875 1456 837 -515 -106 2365 440 103 -118 336 1173 -256 -242 -565 830 438 505 596 417 10 814
2894 814 -1209 -444 -341 -1070 -303 -840 -699 -248 -270 762 -943 314 -116 948 -129 -55 -238 -318 1297
2913 1297 -581 171 -855 1187 398 384 519 138 1710 75 229 842 360 -701 43 994 -770 555
2931 555 468 378 -642 508 -881 -343 35 -374 546 -723 23 -268 -795 587 -481 810 -110 858
2949 858 -1079 351 -711 333 -811 -847 -1067 -170 926 -1272 -652 -184 643 -879 460 40 -273
2966 -273 30 -585 208 -552 398 -362 -70 -835 -261 262 613 629 -901 56 970 275 -376 -408 422 100
2986 100 89 -322 -1082 -457 -882 607 854 205 -133 773 -530 -1177 -776 590 -359 -189 -281 -669 -61 149
3006 149 1 1197 -657 -239 450 -328 -407 -223 -659 -140 336 448 573 -593 16 -104 70 162 25 141
3026 141 -504 230 122 -243 -100 691 168 -275 122 109 -279 -590 -253 200 -293 -119 329 187 672 227
3046 227 101 773 -458 -130 -290 -183 232 -304 616 -528 149 172 227 -156 227 -269 -27 104 194 -1
3066 -1 -332 -166 -67 162 -499 -477 -42 -331 -282 -781 -543 -195 -439 244 -20 93 265 -604 547 507 -628
3087 -628 342 279 -16 -27 -38 -87 493 -113 -97 15 161 -235 -787 -379 220 -322 13 80 -16 26 -613 -87 141
3110 141 -15 121 -129 -450 47 -117 284 1 301 -348 -343 -440 -67 -380 -26 -234 -18 648 612 -319 -12
3131 -12 347 -360 -288 57 126 -566 6 247 -158 -27 -107 -175 -144 48 -569 -653 -231 -552 528 559 -308 -208
3153 -208 -142 313 -90 -43 -132 -302 -94 493 100 -21 -306 -369 758 -212 102 335 -334 -52 465 220 -38
3174 -38 175 -781 -641 394 366 -1018 -285 271 189 -436 70 33 -69 -300 -343 -25 -203 9 -50 59 -264
3195 -264 830 -435 155 -106 878 -435 -160 83 238 -183 -560 -17 -149 48 -283 -286 932 4 106
3214 106 317 1003 55 381 -121 -424 376 -462 -284 145 -466 -383 -249 -800 -489 567 527 190 -493 55
3234 55 31 -803 -642 -138 58 540 -931 -158 33 77 228 -586 -114 -173 120 153 146 -116 632 -50 242 -18
3256 -18 -17 -235 284 -328 130 56 315 272 -335 -153 106 204 -487 -568 -84 8 -74 -81 -350 139 -20 281 -203 126
3280 126 -160 304 182 37 -56 120 -368 -213 -202 -62 -86 28 445 272 -294 -911 450 94 -117 93 -273
3301 -273 474 -580 -240 611 381 -393 456 349 -305 -515 -799 -659 -349 -588 601 29 928 402 -202
3320 -202 -101 -338 -191 -179 -651 -201 -294 -183 -166 -520 -131 -319 -276 -293 98 -99 -138 37 -69 -202 -153 -249 171
3343 171 83 44 347 469 -545 -167 398 218 582 -191 -659 16 511 400 270 333 124 7 -439 -358 -126
3364 -126 -254 -494 94 -170 68 404 -39 -308 -580 641 -540 43 -48 -94 316 -479 60 -439 -114 -203
3384 -203 355 276 -170 -373 -883 348 -875 -759 113 -114 370 -189 -327 -141 124 -792 -443 -126 522 -52
3404 -52 -183 -1023 517 -184 372 -331 5 -97 -844 618 -289 378 -168 -456 -201 174 -326 515 758 214
3424 214 -623 252 255 572 -219 -232 197 118 -202 -284 19 -3 -536 9 83 438 365 -137 107 87 -117 -141 -65 -511
3448 -511 83 -254 -38 -139 204 -310 147 -11 106 106 136 150 307 24 -54 35 -78 202 -183 -60 -151 32
3470 32 -319 -18 -154 157 -321 -134 -295 -329 300 5 -160 283 -8 38 207 -161 215 266 238 -175 -6 54
3492 54 144 -157 -171 265 -140 -112 165 -114 32 236 -91 -112 -46 -158 -110 134 100 174 61 -134 4 133 47
3515 47 172 9 84 16 155 132 122 -114 -126 -119 4 -135 146 156 -104 74 86 127 36 149 -117 245 298 -93
3539 -93 68 -11 -129 144 190 -154 -223 43 -116 169 32 50 152 163 -71 173 -5 207 74 -56 4 70 121
3562 121 532 -164 45 301 -197 108 -157 -181 190 58 -208 80 191 -21 225 51 122 -95 -72 -255 41
3583 41 131 30 198 153 300 64 39 -164 296 -289 -37 103 450 -122 -7 116 -64 16 14 64 32 86 203
3606 203 183 83 64 143 -69 -50 -53 -73 152 -167 -114 292 144 -154 -107 241 254 99 -2 216 -322 248 -13
3629 -13 217 -42 78 217 -150 127 156 13 14 -82 92 -168 -227 70 -247 78 273 172 87 -14 79 238 146
3652 146 133 80 -115 36 -9 -42 87 -49 -6 -94 145 -15 -8 139 -48 -16 129 -24 -43 -6 84 -200 147 10
3676 10 68 270 104 -141 300 -39 263 212 12 434 100 228 -56 209 211 250 154 54 -21 70 -173 173 190
3699 190 12 104 265 -32 2 -41 103 60 172 41 -104 -131 -142 -69 -13 16 132 -197 14 258 10 28 -30 96
3723 96 203 263 171 147 140 381 194 95 99 6 -80 -27 19 40 76 -15 -130 -129 -127 -44 253 235 -118 214 -191 14 27 -68
3751 -68 -10 78 -69 -131 -95 -116 151 -61 97 -193 -3 -21 239 180 48 -100 29 -119 166 327 65 152 100
3774 100 262 78 100 118 74 148 -83 -125 2 56 28 -171 -21 22 -73 53 -114 -116 -86 432 300 -481 533 -543
3798 -543 356 -159 -593 22 171 27 -109 -269 150 -227 509 89 -70 176 -212 185 253 538 -678 -26
3818 -26 -809 -233 508 967 771 780 592 555 935 366 -97 176 779 -845 161 250 225 731 75 -88 -802
3839 -802 980 -402 590 496 384 364 -53 -333 98 -38 3 -86 -108 -317 84 -481 -73 -272 -62 117 153
3860 153 191 -23 48 -230 375 565 226 -43 196 188 197 -1041 -292 54 -419 362 567 -390 55 -222 -227 10
3882 10 -155 -66 -41 542 -139 156 -75 -407 223 86 61 -53 602 140 224 -295 -82 209 208 239 257 -80 -154
3905 -154 82 6 -164 190 129 42 74 225 -228 -191 -153 44 11 23 -120 -166 306 -264 -1 -148 215 4 -69
3928 -69 -77 -93 30 -171 -137 59 -135 -112 278 265 42 172 256 -105 61 49 214 -172 -45 56 -94 39 -47
3951 -47 -157 79 -117 -12 -72 -46 -56 154 -93 -84 170 180 12 -178 29 143 -93 -2 69 145 227 52 -118 38
3975 38 46 69 -175 -102 -206 39 136 -124 -223 -115 -430 497 346 328 178 324 139 -497 -205 188 431 -599
3997 -599 -348 86 233 109 367 429 -92 -127 -173 12 266 316 -64 276 -304 61 -193 -192 -33 127 755 -330
4019 -330 206 -310 621 -5 49 -1 24 447 171 558 -128 177 -263 -349 295 -182 -3 422 -18 -231 -46
4040 -46 -59 197 137 108 261 66 -80 -426 -42 -570 -433 236 97 -235 388 334 -657 -366 -494 581 88
4061 88 -443 165 -48 -535 103 -69 -73 20 -213 171 175 -51 125 -117 -322 79 291 367 122 183 -280 346 -54
4084 -54 -261 436 105 126 -179 85 469 107 535 167 -185 156 253 -169 193 -56 164 -430 -272 -328 642
4105 642 63 160 -192 -124 -115 -81 -109 -126 451 -75 -652 1 -9 346 333 879 369 -210 24 -335 97 -80 309
4128 309 173 -347 -838 -65 -641 24 -130 -90 8 -639 923 -51 177 67 -80 -143 652 288 -124 574 -469
4149 -469 -92 314 245 82 -888 -11 -690 -552 -166 60 1272 93 -250 -258 4 -1505 -445 -291 -618 -484
4169 -484 191 22 -566 -267 494 -221 1461 426 568 -29 -366 493 -1154 -641 -793 349 62 -85 534
4188 534 -245 1011 107 -170 -788 -171 20 -187 1354 75 374 631 -205 1872 1387 427 -189 271 -1542
4207 -1542 449 -1197 -318 -651 753 -1314 -285 628 -424 766 613 540 -107 135 78 394 1124 475
4225 475 950 247 816 -1699 -1304 1141 662 861 -1565 -466 767 663 -626 231 -468 496 905 309
4243 309 -361 151 1316 -432 -88 987 -1218 258 -477 541 -903 490 -907 -565 -169 541 112
4260 112 -23 815 -541 549 537 -810 -102 12 108 -352 -108 -395 -41 -441 181 995 128 -163 362 -348
4280 -348 -238 890 -509 835 151 31 -43 -841 -979 120 -848 -589 -1047 -393 49 -518 -588 -345 68
4299 68 471 925 -215 105 668 -225 -16 -297 -29 373 -68 -486 243 569 -914 610 238 60 184
4318 184 115 -660 -793 42 263 -504 -190 212 -357 -737 -169 -510 -307 -95 -1684 -182 543 -41 -687 78
4338 78 680 906 883 -484 -46 -510 239 334 -156 -84 -254 -252 -96 -164 -47 -284 253 12 -774 634 848 631
4360 631 -405 -158 -421 -729 -109 188 236 -183 -217 32 -8 -655 -357 -165 81 -204 -261 567 -2 220 214 269
4382 269 -374 350 -157 679 312 -259 98 -517 -330 -82 -12 -776 -96 1057 -103 63 91 -682 -231 -314
4402 -314 373 71 -179 -752 -55 473 -97 496 10 -384 -156 7 -74 540 -960 -627 288 3 -76 -992
4422 -992 -662 321 -1213 -897 -226 -627 -774 -1097 96 -82 -425 -50 -341 -462 26 251 1149 380 974
4441 974 -382 415 -1497 -159 -571 -814 313 446 107 -332 2 -609 -398 375 687 -714 824 -42
4459 -42 -724 -872 -307 -1104 -1118 1 -381 -241 68 -286 -60 407 -505 265 1481 -323 -140 -1079 -732 246
4479 246 -432 -552 -348 462 -584 135 462 -458 -274 -373 -396 -1054 -468 -115 -126 -380 276 -438 -764 -354 146
4500 146 769 483 -804 -135 592 -644 332 9 12 -338 153 -411 -556 -771 -629 -338 663 -156 212 -493
4520 -493 317 -101 -569 -819 214 -732 -199 142 -315 -226 -87 32 -575 61 97 223 -41 -237 132 276
4540 276 -104 151 -310 116 -258 -3 -308 203 -157 24 136 -280 277 96 -164 -85 60 66 128 210 37 -164
4562 -164 67 18 -163 94 16 -500 -283 25 -547 -297 -208 455 -424 97 457 53 95 -297 -103 -530 -146
4583 -146 -58 -270 884 1119 7 -164 15 1 -651 211 855 -544 -638 -57 -530 -670 -213 -240 343 55
4603 55 -439 460 261 609 707 332 1158 -343 -65 62 -163 379 -139 -450 -225 188 197 -178 356 -39 264
4624 264 36 -885 -446 136 176 440 -97 -583 -27 27 -20 351 253 486 178 -83 401 726 206 -345 118
4645 118 -71 -631 538 -868 277 -322 -143 -442 -46 608 -1200 268 -6 -235 292 236 -1 -457 288
4664 288 -75 -157 -248 -122 377 -570 624 -33 -608 431 -379 -452 313 -209 -145 246 -738 129 -181 200 -720
4685 -720 351 706 200 595 208 -1037 1154 -118 1080 498 -294 257 986 -1519 -291 -215 32 31 681
4704 681 -458 -615 24 -383 70 862 -107 -1861 711 -272 -347 -1237 14 -715 -541 114 805 323 311
4723 311 -206 -262 278 -245 823 -596 540 -574 389 -174 -29 -813 -488 -709 -561 -770 -501 -284 1364
4742 1364 -82 -1125 284 -541 -301 -352 -415 -542 420 -154 378 -404 15 -408 1020 -1697 -951 639
4760 639 -936 857 122 -428 711 -938 181 94 177 -1533 -1293 541 -706 373 725 220 3 -278
4778 -278 -263 -665 -1550 631 -374 -165 1254 -779 606 96 785 -12 -154 811 -1230 1449 227 -219
4796 -219 -496 673 -651 285 -116 -137 -23 326 -663 943 159 -1585 -190 544 58 -818 650 1067
4814 1067 -130 -2 -17 62 -561 1293 35 -23 -1022 -627 579 -693 349 916 182 3 -417 -47 -615
4833 -615 -104 88 -808 119 360 -1002 -45 587 -1045 -46 -821 118 1009 190 570 191 -472 -985 -458
4852 -458 699 84 -125 127 -315 297 -550 -253 -163 349 83 33 -103 -615 159 87 415 -362 59 629 -279
4873 -279 516 381 929 824 -362 100 5 -41 -59 -41 -474 -292 -656 -69 166 -469 -174 -25 -175 -60 -659
4894 -659 -162 778 -304 -119 552 -539 358 493 -236 22 -466 -1052 175 -402 -176 325 -235 -792 -333
4913 -333 -245 -24 275 68 346 -417 575 -168 799 -241 -366 938 -470 10 120 217 174 419 156 -381
4933 -381 291 -370 -358 305 -915 233 -115 588 -253 282 485 113 -473 -343 498 -275 48 -655 6 -41
4953 -41 1093 516 380 1080 655 349 -807 -112 -131 439 -785 -127 589 745 -860 -357 834 54 364
4972 364 935 483 -437 -91 1109 397 -19 -871 -727 36 670 -276 -462 29 629 627 -28 -102 -302 -260 128
4993 128 -151 -31 242 -209 488 97 -482 402 113 665 -212 -547 -443 -543 -62 601 443 65 -81 -351
5013 -351 292 -679 -410 -279 870 -379 9 112 -465 281 -225 -9 -366 313 371 490 -8 433 -140 35
5033 35 258 35 -638 -249 254 -162 -24 46 183 244 -449 -129 -78 349 -42 285 49 403 -86 -157 573 0
5055 0 -113 -246 212 475 -549 -230 640 537 451 224 177 -72 220 -119 106 34 -698 -73 -91 -55 -68 47
5077 47 -243 488 -551 364 -93 139 11 50 65 -303 -493 -384 151 -364 23 -103 -41 177 -32 -662 210
5098 210 109 -583 -11 323 33 -207 -294 -179 197 -538 96 405 -93 219 961 -162 -590 -332 103 443
5118 443 -245 -16 -364 320 -78 112 60 564 235 -183 50 439 -1026 14 -366 -680 -827 584 278
5137 278 608 640 184 -436 -722 136 -9 -86 17 454 -115 236 98 426 -120 -110 247 424 -550 -127 577
5158 577 -311 322 552 -171 -545 -440 374 480 -104 87 610 -670 300 1030 239 -465 -67 163 95 44
5178 44 -145 -132 -208 -372 -911 866 -629 -1004 189 -266 696 -780 68 -637 -409 589 -789 16 -222
5197 -222 -366 -247 -735 -91 -837 556 -135 42 -105 -552 345 478 -861 -708 1360 -334 413 -301 671
5216 671 113 -386 -98 -1181 -1012 -410 677 -43 -86 741 269 -1523 194 -720 359 2149 -537 428
5234 428 855 -290 -389 642 370 -1392 -244 461 -1181 22 275 -367 -1116 -231 -1691 -130 -286 -589
5252 -589 -1124 -425 -830 -982 -74 -1659 -1222 644 -1000 -494 336 1360 1414 663 -449 -649 473 -25
5270 -25 -127 -1451 -1260 -998 -430 -453 1183 -47 -186 840 -85 -75 -1124 -304 221 -797 -676 152 1246
5289 1246 451 -513 754 -568 -414 -546 -489 49 1232 -310 278 949 -1518 -120 366 302 -150 213
5307 213 -1217 744 -1036 -259 -94 716 898 -594 71 1113 -914 87 1148 -418 -988 -1916 -671
5324 -671 -731 -1230 -310 -675 -582 432 -431 -673 -1263 -20 534 31 70 497 -370 722 -468 -1251 -829 -165
5344 -165 563 -494 134 -407 42 -840 281 347 87 -25 -335 -1377 820 422 -198 192 695 586 -225
5363 -225 1024 327 -146 -1180 -752 -664 586 -121 174 -606 -245 922 -526 -490 -173 -557 614 85 113
5382 113 -530 -99 762 -706 1 -525 59 -628 -213 337 -162 1039 850 -1205 454 -432 -178 -563 -271
5401 -271 226 215 -227 -649 1106 -851 1501 101 -117 -728 -1502 -241 -192 -344 159 434 81 -189 -669
5420 -669 109 342 632 -787 -278 290 -436 -954 634 -22 870 -1029 -414 -112 -387 -83 -478 200 237
5439 237 -314 325 8 202 212 207 662 932 867 14 -163 126 148 26 -281 -431 -345 -1665 -97 54 -953
5460 -953 518 -146 -145 656 914 87 -284 600 -844 -1265 196 541 77 290 39 40 365 508 273 1129
5480 1129 503 1105 -225 -426 -18 -253 -804 1118 1 -180 -125 -465 -91 -16 -282 1810 555 140 -88
5499 -88 -456 356 922 67 -489 417 -668 -492 -784 180 -265 343 359 -416 901 -507 -530 -308 -799 477
5519 477 5 762 -377 -882 626 -1208 -230 1248 880 247 530 -164 270 184 -209 239 602 -842 -333
5538 -333 -232 648 -492 -497 1114 -369 -128 554 -4 -255 295 -616 169 167 1034 -448 645 -56 -92 -267
5558 -267 310 418 167 994 131 -663 320 -695 55 -207 508 -1105 -717 390 74 -194 30 -850 864
5577 864 623 447 590 1155 -471 -648 -248 -484 703 -252 449 -60 -190 -472 -568 -345 -188 -242 762 1271
5597 1271 -83 93 842 503 287 370 1543 -665 -336 105 952 -210 -342 -373 -69 1130 329 -280 1072
5616 1072 -644 552 48 -67 182 303 411 -549 -876 689 474 271 -568 -530 -313 -86 -285 -211 -267 -168
5636 -168 -273 89 180 -355 -227 67 545 -145 -946 -762 312 -187 437 -753 53 73 287 678 -462 849
5656 849 -312 401 285 -324 271 168 705 -40 257 -136 -633 -155 -378 -1096 -302 399 -311 518 112 -180
5676 -180 -548 -581 -105 -95 143 -445 -574 57 -130 201 -78 -219 -282 85 -25 24 -505 -582 -306 -371 -206 400
5698 400 -479 459 52 -193 141 -36 16 356 336 1533 -69 179 211 -781 471 -83 31 -483 -597 562
5718 562 376 147 -261 667 238 617 470 342 -130 649 551 -243 -123 957 -472 -338 360 -168 572 171
5738 171 286 -188 -407 -690 360 117 591 -385 744 -683 919 -321 -624 -198 -700 -63 -1094 -12
5756 -12 -628 1421 -507 -600 -332 493 -517 560 826 489 455 -333 897 -43 735 425 523 199 -392 144
5776 144 -405 -307 -545 -339 239 -219 -49 -182 -78 -424 -157 -371 -255 -434 -455 152 619 -27 384 1153 678
5797 678 -591 -80 -339 163 283 -86 217 -612 -409 -422 767 -742 -114 -691 355 -393 33 -1211 -248
5816 -248 781 -574 763 -1867 -184 -910 -271 -793 -878 -1599 -418 35 893 319 -1008 -176 68 -208
5834 -208 533 -117 489 -158 -360 489 -918 -356 83 376 347 -714 210 473 -641 -1242 -70 1381 -510
5853 -510 299 -232 -231 399 -307 90 478 -562 182 90 222 74 -1657 -400 395 -452 -250 -1034 172 365
5873 365 575 381 -72 -778 119 499 308 22 188 -321 416 -113 329 -289 -217 -1228 -575 -574 -71 -778 427
5894 427 205 -549 -54 519 290 -875 -581 -225 -125 -33 -453 -935 673 -37 253 -95 -20 -394 -779 -100
5914 -100 -640 -1068 12 6 3 358 -176 463 521 -1112 645 616 427 1066 182 28 122 256 148 -241 -33
5935 -33 4 -1007 -302 1121 -469 -1326 -165 -1026 26 -638 274 117 -282 456 -1138 158 519 -467
5953 -467 326 444 -680 113 595 -464 -1506 1090 -965 -541 -340 645 779 -704 -136 -1196 206
5970 206 348 116 -598 -72 -411 920 -1057 -201 91 653 455 -166 -427 -1633 -607 1143 -252 -228
5988 -228 -505 -173 -131 -1544 -261 525 216 -1168 -522 1113 -1048 -728 388 79 -246 -830 234 -130
6006 -130 277 451 -371 -856 374 -1241 65 -240 -785 29 -786 69 -305 768 650 -41 336 -589 -668
6025 -668 325 -618 -533 -242 -559 -180 -1012 -534 918 -387 819 -411 1261 -215 859 660 -641 361
6043 361 155 -623 -664 -52 159 -190 461 -7 964 873 -828 -155 597 -427 830 430 532 164 -401 249
6063 249 -631 212 -181 -151 -124 -3 -26 439 101 286 36 50 -379 -417 -405 -831 380 -79 -126 -730 308 -434
6085 -434 -78 -86 22 219 -583 1 -765 -131 11 -136 109 -209 611 -650 -512 26 -781 196 -469 253
6105 253 -15 192 -308 -368 -63 210 16 72 -345 246 -649 260 580 -332 510 118 652 98 84 137 763
6126 763 496 462 -610 -1 -580 -146 234 478 -124 225 -949 -667 -876 -153 788 -622 182 -643 36
6145 36 92 -1248 -242 -149 85 1024 228 -581 -200 719 -461 21 285 -859 -470 681 547 175 -33
6164 -33 -135 278 288 -682 406 -571 -69 563 -259 -190 -888 -487 553 -390 -163 367 237 -34 -111 340 148
6185 148 597 -411 -184 176 142 428 -679 -95 235 -82 199 239 -196 -426 411 353 85 -339 -58 -239
6205 -239 -89 746 637 -277 -212 28 -656 61 531 493 -365 836 -140 255 3 -437 344 -97 176 477
6225 477 340 184 -51 -368 -425 -523 193 451 717 -528 -666 -350 216 243 -1589 -320 -712 1247 -20
6244 -20 697 -1122 490 787 -306 567 50 694 -86 -669 312 641 267 -63 -103 153 -182 -146 118 161
6264 161 53 -638 253 506 29 -765 129 94 356 165 -462 84 -845 17 307 445 -78 243 523 196
6284 196 215 41 446 -213 -11 -470 -67 161 64 219 204 237 -315 -540 -375 -122 -203 -19 -621 824 232
6305 232 -362 301 56 48 -477 -61 729 -171 432 -95 -509 920 115 592 569 -504 85 -858 -143 -105 -739
6326 -739 82 -312 -250 470 -453 -333 204 -218 185 25 262 -165 151 -139 80 -488 -123 39 -232 526
6346 526 378 -592 -408 859 335 -104 -188 -1256 89 -885 -546 -878 386 31 200 149 -807 -550 -1060
6365 -1060 -545 -130 -252 504 -92 -173 282 1131 -239 48 481 44 429 -659 -97 -1190 -661 -508 511
6384 511 -415 -542 35 -1003 -1005 509 173 218 169 133 430 -152 -38 -146 30 -229 -287 37 186 -181 455
6405 455 249 -563 -398 -250 -876 -242 394 -213 -47 60 18 818 -35 -403 32 119 446 -637 -480 418
6425 418 -564 355 42 -657 -361 244 475 734 -34 -35 862 438 139 71 -119 -86 -256 899 -567 636
6445 636 242 -334 1287 -368 -19 449 -107 -634 -127 -139 849 -554 -747 892 -404 -631 323 929 -538
6464 -538 229 237 1 267 -890 -145 1010 -330 -1005 625 -382 -72 -376 -964 -30 -1049 -14 -139
6482 -139 -537 -435 -479 -725 -646 224 99 250 286 -1196 -194 -4 -569 -740 -324 -423 -899 -824 -889 535 170
6503 170 -304 -505 -471 131 -576 778 655 889 -152 -291 122 -9 341 -702 737 387 -246 357 -801
6522 -801 -294 -767 -908 -235 19 95 246 47 -295 -413 198 -133 -702 -294 -161 -194 338 -102 -166 211 33
6543 33 -224 450 865 -90 -401 856 -37 305 320 -292 -161 496 -91 -434 -235 -19 150 -233 -130 -132 -512
6564 -512 129 -3 193 286 282 -373 -89 -239 223 -97 33 -68 32 -515 -629 392 291 121 -24 407 175
6585 175 -524 116 871 13 -519 335 68 -45 -357 -83 -37 125 -210 -314 -383 -434 697 -177 150 -62 -357
6606 -357 -14 -639 479 -240 -536 50 -459 102 98 -105 -58 -411 -366 400 217 -450 42 -288 -67 270 242
6627 242 -187 -74 21 -206 -56 -170 52 -310 291 -287 -263 332 688 -14 403 4 -259 -123 -1055 57
6647 57 -38 545 561 25 11 -32 75 -129 96 -525 -86 -985 -625 -19 -791 424 -1094 -72 775 225 -50
6668 -50 221 -110 331 -221 -249 259 -613 -166 -1065 -62 19 -238 -80 416 262 -1223 744 -283 107 -90
6688 -90 -323 -948 -464 294 257 -335 -32 -741 -904 923 59 -229 -644 -376 -146 -783 -291 60 -179 460
6708 460 -62 185 -251 -866 425 -174 -244 665 -455 193 297 352 -205 -123 51 613 -540 -607 446 -454
6728 -454 326 578 -163 24 -136 -900 149 -580 -91 -71 276 204 -80 228 473 -577 -526 -681 357 -643
6748 -643 -1643 63 737 -337 -50 -112 -334 1207 -243 -491 27 -608 48 -585 -329 -693 -405 -304 -629
6767 -629 -240 -1188 -6 -253 -658 132 521 -136 192 186 161 51 -576 -100 -535 -203 -66 685 290 -250 -509
6788 -509 327 -94 519 186 -85 -17 270 195 -108 -120 200 307 161 202 -270 -114 135 -238 13 29 -99 -36
6810 -36 -24 96 -69 35 -81 -30 0 -163 -272 149 100 351 72 24 47 399 27 -139 -188 152 22 27 -70 -164
6834 -164 160 73 135 -271 -46 9 168 -74 210 -44 63 -30 -106 -28 -43 55 39 49 -246 110 22 -128 179 0
6858 0 145 -140 149 -260 150 47 -127 200 30 71 108 90 -180 -14 -7 -141 76 -18 58 -68 -156 -81 -19 -192
6882 -192 97 41 73 81 -165 -9 -217 178 234 -83 117 -109 -50 -206 612 704 201 82 180 -543 -1169 -393 32
6905 32 450 -16 1063 8 434 123 -90 39 626 -537 -163 224 -505 -428 -117 -320 380 126 268 223
6925 223 -133 -225 93 -130 40 158 156 98 -67 -63 20 -129 281 -189 145 -11 -28 -172 140 -11 68 -148 321
6948 321 335 -683 -51 -397 -55 406 -123 -901 -305 -618 406 -218 -200 -826 -62 -62 347 -597 -862 -140 -452
6969 -452 76 57 509 133 -305 -646 468 987 478 216 211 202 440 322 -527 -365 -475 135 -314 431 235
6990 235 93 -681 -235 -387 141 172 177 -226 -336 228 -179 7 -428 -17 220 -405 -455 120 -63 204 278 168
7012 168 -16 482 -211 120 -232 44 131 -190 -1 -314 -389 -29 191 -87 3 -41 -56 -55 -95 -14 7 70 -157 211
7036 211 313 243 -110 -162 -23 147 -31 235 392 -10 -140 -269 255 -127 -15 165 -164 -35 -103 2 3 -149
7058 -149 69 -185 -301 57 -414 67 601 -86 580 31 -307 -77 457 -88 -181 32 -730 28 87 -602 -89
7079 -89 -325 -222 -304 -666 483 19 268 -561 385 -251 77 -160 -13 -319 -172 -360 -307 -99 -6 124 -132
7100 -132 -87 -215 -60 -278 340 -782 13 664 66 -644 -53 -99 -216 28 -185 -44 427 169 204 -159 59
7121 59 -310 360 -71 -239 -384 -106 -690 692 -366 -118 76 -513 333 37 -238 -482 -301 -162 482 -704
7141 -704 -29 120 728 -721 1066 711 172 432 -320 -509 -15 463 -240 -332 26 -66 666 206 111 347
7161 347 160 162 -371 506 -69 -736 247 -358 311 -269 528 -135 621 -3 96 57 -462 -490 -620 58 -116 92
7183 92 -15 -520 -210 -287 136 516 141 -214 -345 -184 -759 5 -52 -335 -424 368 -28 -214 -36 -218 -351
7204 -351 278 -299 -14 164 -27 524 198 -553 327 -405 -145 66 -648 -94 -448 -4 252 394 -513 183
7224 183 -180 -368 -287 838 -415 -581 563 514 -907 -232 -75 286 1072 137 186 -567 119 423 972 171
7244 171 48 -544 -308 -691 1380 951 22 -416 -981 480 -114 -411 519 -665 446 111 41 -3 -353
7263 -353 -95 -71 820 821 84 -402 -530 -683 -47 1513 -748 -6 -294 380 -175 -1683 -331 89 179 376
7283 376 1171 1115 845 357 279 950 -1099 -115 -121 21 580 -84 -334 -432 71 114 442 643 320 3 542 529
7305 529 -21 -152 -293 -34 -585 -351 -853 -331 -848 -135 661 520 -747 -90 -587 -476 -662 -228 -298 759
7325 759 931 1381 288 313 204 -439 95 -416 -688 268 559 262 543 -124 -4 -165 335 185 -1059 -258
7345 -258 160 315 -183 217 -401 283 138 -184 243 134 70 -470 147 -497 -182 -228 -250 147 8 -5 315
7366 315 36 -22 -120 293 233 -117 2 -582 -129 -151 24 -134 -812 -126 -295 218 92 503 -234 -533 295
7387 295 947 70 87 -829 -577 375 -180 -476 -719 -192 35 909 -330 -165 -383 790 -200 522 -294 185
7407 185 -194 19 -147 396 -121 -615 595 289 -189 187 374 299 -417 -898 153 -262 319 -358 112 -95
7427 -95 -417 101 -374 -1079 -475 -467 -346 473 862 -650 -544 -127 317 94 -101 65 46 -144 208 -254 -56
7448 -56 8 26 -304 -190 141 -104 11 334 -155 -158 -174 50 120 -116 -152 186 214 88 -87 245 -33 -157 -106
7471 -106 -158 -172 226 -169 -19 131 153 252 -24 -268 -424 -179 -166 -207 -486 -122 -204 -267 118 -504 55 111 333
7494 333 117 76 392 -79 -456 -211 -231 57 196 91 -311 72 273 -6 -15 208 -264 12 280 309 798 -381
7516 -381 -33 687 179 -159 133 68 49 -10 328 139 222 -132 -400 115 -143 -143 44 -246 -138 159 -324 -300
7538 -300 -24 -2 260 263 -148 53 93 -84 -102 -145 -41 -170 285 150 313 -75 -259 -232 95 -87 -21 -2 -123
7561 -123 348 28 54 44 -28 41 -294 518 -126 -107 -64 487 -226 422 -237 166 320 -201 3 102 534 -110
7583 -110 -379 -458 98 141 -353 -343 -138 -835 -359 826 761 -250 -217 56 -355 -799 -773 -476 541 -1278 350
7604 350 1007 542 -942 -55 -42 735 493 563 566 363 -282 -561 -397 767 -55 -48 188 -42 658 -591 945
7625 945 333 -210 750 996 -651 -438 858 57 -119 -230 -374 187 -559 -337 -205 113 553 -131 -498
7644 -498 -392 -938 -486 -930 627 390 -351 -742 243 -6 -294 -490 950 693 -284 -12 -229 -283 -280 752
7664 752 -168 164 212 -78 306 507 -525 225 -184 794 522 -1040 -216 564 277 278 111 146 -160 -442 33
7685 33 168 239 211 -168 113 -114 843 -399 659 -141 -908 639 -13 1437 170 -273 -160 109 197 293
7705 293 -187 198 -982 278 -405 495 -676 711 255 95 619 -33 -213 322 -58 -174 -535 186 -35
7724 -35 -10 102 -494 -446 733 -300 124 -817 38 -35 370 -326 449 262 659 936 -358 945 17 476
7744 476 215 198 -978 -482 -457 489 71 -331 537 39 -553 -474 291 -235 366 310 244 -315 74 -94 -358
7765 -358 566 685 -40 192 -425 -659 -1 -175 164 238 405 -415 -302 -1059 407 -102 -273 643 654 465
7785 465 621 463 404 117 368 104 401 123 -25 -384 514 -196 78 -500 161 -1071 -109 378 563 -655
7805 -655 274 163 -11 -977 11 519 -107 -311 -256 307 98 -183 115 182 -39 391 -208 650 -92 42 -162
7826 -162 -377 -5 357 249 323 -295 -593 -231 -217 523 458 -381 158 -8 -94 138 121 -519 -323 -237 482 -375
7848 -375 681 -357 -207 444 191 -217 -269 497 -232 -103 -345 -421 -123 367 -418 11 -968 -617 -303 250
7868 250 -74 628 160 -294 -211 590 49 -264 -626 -660 370 -470 -106 -636 -499 -684 416 -540 452 440
7888 440 -456 -47 -420 -17 629 -24 -84 -588 -6 -381 -491 203 281 -353 -449 373 788 -1232 -500 -304 800
7909 800 -280 -613 -310 -607 -353 120 343 367 370 100 -38 394 5 -395 391 -217 -90 105 265 24 381
7930 381 20 293 577 -276 624 117 -197 -164 -199 -295 -521 267 -281 -905 3 -394 362 399 563 -676 207
7951 207 581 152 -304 143 81 -373 4 855 -55 -382 269 -562 -583 -62 -261 -132 -68 258 95 -102 -472
7972 -472 -231 387 -548 -139 -82 22 -242 -302 52 -85 -233 57 -155 -128 -56 512 -215 20 -98 -18 -35 26
7994 26 147 391 -40 -160 -21 -48 105 -84 88 224 -63 33 136 74 177 72 -140 48 -39 -131 -94 -11 12
8017 12 -3 -230 -105 141 73 -85 257 -150 -26 -69 90 -23 24 -79 69 47 4 -24 -83 40 -23 -123 47
8040 47 2 24 8 -138 -115 -13 262 153 227 71 -271 -724 -104 -139 -341 -192 -540 -9 222 571 -3 -225
8062 -225 92 -811 253 257 185 425 -12 -193 -424 98 -45 -140 81 918 -256 42 -421 351 -325 417 319
8083 319 -52 -34 -502 -189 411 -377 119 240 -514 -222 238 41 -484 -308 337 -33 -348 256 -357 -348 294
8104 294 270 650 205 715 -19 557 450 -592 -222 519 -372 -452 -572 -1274 -102 -368 583 -750 -864 107
8124 107 -709 -238 376 -13 738 555 28 1 418 89 518 7 137 -64 148 -3 153 -71 -400 61
8144 61 -77 246 116 98 -17 -152 -161 72 273 160 -228 46 337 -162 -15 -552 -182 160 171 98 193 -105
8166 -105 70 -243 196 -391 382 240 144 -231 497 -226 -704 376 -64 74 -584 319 -319 -15 479 -479
8186 -479 -22 187 -48 -689 83
8191H3
##END NTUPLES=NMR FID
##END=
