##TITLE=1H_DE-145K_TFA
 200.13Hz,CCl4.
 8 sc
 
 4.5.2026
##JCAMPDX= 6.0         $$ Bruker NMR JCAMP-DX V2.0
##DATA TYPE= NMR FID
##DATA CLASS= NTUPLES
##ORIGIN= UXNMR, Bruker Analytische Messtechnik GmbH
##OWNER= pz
$$ XWIN-NMR		Version 3.5
$$ Mon May  4 16:27:47 2026 Russian Standard Time (UT+4h)  she@DPX200
##.OBSERVE FREQUENCY= 200.131
##.OBSERVE NUCLEUS= ^1H
##.DELAY= (6, 6)
##.ACQUISITION MODE= SIMULTANEOUS
##.ACQUISITION SCHEME= undefined
##.AVERAGES= 8
##.DIGITISER RES= 18
##SPECTROMETER/DATA SYSTEM= spect
##.PULSE SEQUENCE= zg30
##.SOLVENT NAME= CDCl3
##.SHIFT REFERENCE= (INTERNAL, CDCl3, 0, 14.3821)
##AUDIT TRAIL= $$ (NUMBER, WHEN, WHO, WHERE, WHAT)
$$ ##TITLE= Audit trail, XWIN-NMR		Version 3.5
$$ ##JCAMPDX= 5.01
$$ ##ORIGIN= Bruker BioSpin GmbH
$$ ##OWNER= she
$$ F:/spectra/data/she/nmr/H-C/1/audita.txt
$$ ##AUDIT TRAIL=  $$ (NUMBER, WHEN, WHO, WHERE, WHAT)
(   1,<2026-05-04 16:25:40.87 +0400>,<she>,<DPX200>,
      <created by zg, POWCHK disabled, PULCHK disabled
       configuration hash MD5:
       00 E9 B6 7A A2 85 ED C7 34 08 36 98 17 FE 4E 26
       data hash MD5: 16K
       42 02 97 4B C3 8D 6E E2 BC AF FF B0 0A 8B 8A 0F>)
$$ ##END=
$$ 
$$ hash MD5
$$ 65 9F 8E 7B C6 13 07 71 7C 84 ED DF 5B 4C 5C D6
##$RELAX= 
##$RELAX= 
##$RELAX= 
##$RELAX= 
##$RELAX= 
##$RELAX= 
$$ Bruker specific parameters
$$ --------------------------
##$DU= <F:/spectra>
##$EXPNO= 1
##$NAME= <H-C>
##$PROCNO= 1
##$TYPE= <nmr>
##$USER= <she>
##$AMP= (0..31)
100 100 100 100 100 100 100 100 100 100 100 100 100 100 100 100 100 100 
100 100 100 100 100 100 100 100 100 100 100 100 100 100 
##$AQSEQ= 0
##$AQ_mod= 1
##$AUNM= <au_zg>
##$AUTOPOS= <>
##$BF1= 200.13
##$BF2= 200.13
##$BF3= 200.13
##$BF4= 200.13
##$BF5= 200.13
##$BF6= 200.13
##$BF7= 200.13
##$BF8= 200.13
##$BYTORDA= 1
##$CFDGTYP= 0
##$CFRGTYP= 5
##$CHEMSTR= <none>
##$CNST= (0..31)
1 1 145 1 1 1 1 1 1 1 1 1 1 1 1 1 1 1 1 1 1 1 1 1 1 1 1 1 1 1 1 1 
##$CPDPRG= <>
##$CPDPRG1= <>
##$CPDPRG2= <>
##$CPDPRG3= <>
##$CPDPRG4= <mlev>
##$CPDPRG5= <mlev>
##$CPDPRG6= <mlev>
##$CPDPRG7= <mlev>
##$CPDPRG8= <mlev>
##$CPDPRGB= <>
##$CPDPRGT= <>
##$D= (0..31)
0 0.7 0 0 0 0 0 0 0 0 0 0.03 0 0 0 0 0 0 0 0 0 0 0 0 0 0 0 0 0 0 0 0 
##$DATE= 1777897540
##$DBL= (0..7)
120 120 120 120 120 120 120 120 
##$DBP= (0..7)
150 150 150 150 150 150 150 150 
##$DBP07= 0
##$DBPNAM0= <>
##$DBPNAM1= <>
##$DBPNAM2= <>
##$DBPNAM3= <>
##$DBPNAM4= <>
##$DBPNAM5= <>
##$DBPNAM6= <>
##$DBPNAM7= <>
##$DBPOAL= (0..7)
0.5 0.5 0.5 0.5 0.5 0.5 0.5 0.5 
##$DBPOFFS= (0..7)
0 0 0 0 0 0 0 0 
##$DE= 6
##$DECBNUC= <off>
##$DECIM= 32
##$DECNUC= <off>
##$DECSTAT= 4
##$DIGMOD= 1
##$DIGTYP= 9
##$DL= (0..7)
0 120 120 120 120 120 120 120 
##$DP= (0..7)
150 150 150 150 150 150 150 150 
##$DP07= 0
##$DPNAME0= <>
##$DPNAME1= <>
##$DPNAME2= <>
##$DPNAME3= <>
##$DPNAME4= <>
##$DPNAME5= <>
##$DPNAME6= <>
##$DPNAME7= <>
##$DPOAL= (0..7)
0.5 0.5 0.5 0.5 0.5 0.5 0.5 0.5 
##$DPOFFS= (0..7)
0 0 0 0 0 0 0 0 
##$DQDMODE= 0
##$DR= 18
##$DS= 0
##$DSLIST= <SSSSSSSSSSSSSSS>
$$ [...]
##$SUBNAM0= <"">
##$SUBNAM1= <"">
##$SUBNAM2= <"">
##$SUBNAM3= <"">
##$SUBNAM4= <"">
##$SUBNAM5= <"">
##$SUBNAM6= <"">
##$SUBNAM7= <"">
##$SUBNAM8= <"">
##$SUBNAM9= <"">
##$SW= 18.0517599122864
##$SWIBOX= (0..15)
0 0 2 0 0 0 0 0 0 0 0 0 0 0 0 0 
##$SW_h= 3612.71676300578
##$TD= 16384
##$TD0= 1
##$TE= 0
##$TE2= 300
##$TE3= 300
##$TEG= 300
##$TL= (0..7)
0 120 120 120 120 120 120 120 
##$TP= (0..7)
150 150 150 150 150 150 150 150 
##$TP07= 0
##$TPNAME0= <>
##$TPNAME1= <>
##$TPNAME2= <>
##$TPNAME3= <>
##$TPNAME4= <>
##$TPNAME5= <>
##$TPNAME6= <>
##$TPNAME7= <>
##$TPOAL= (0..7)
0.5 0.5 0.5 0.5 0.5 0.5 0.5 0.5 
##$TPOFFS= (0..7)
0 0 0 0 0 0 0 0 
##$TUNHIN= 0
##$TUNHOUT= 0
##$TUNXOUT= 0
##$USERA1= <user>
##$USERA2= <user>
##$USERA3= <user>
##$USERA4= <user>
##$USERA5= <user>
##$V9= 5
##$VALIST= <valist>
##$VCLIST= <CCCCCCCCCCCCCCC>
##$VD= 0
##$VDLIST= <DDDDDDDDDDDDDDD>
##$VPLIST= <PPPPPPPPPPPPPPP>
##$VTLIST= <TTTTTTTTTTTTTTT>
##$WBST= 1024
##$WBSW= 4
##$XGAIN= (0..3)
0 0 0 0 
##$XL= 0
##$YL= 0
##$YMAX_a= 155820
##$YMIN_a= -197795
##$ZGOPTNS= <>
##$ZL1= 120
##$ZL2= 120
##$ZL3= 120
##$ZL4= 120
##$ABSF1= 10
##$ABSF2= 0
##$ABSG= 5
##$ABSL= 3
##$ALPHA= 0
##$AQORDER= 0
##$ASSFAC= 0
##$ASSFACI= 0
##$ASSFACX= 0
##$ASSWID= 0
##$AUNMP= <proc_1d>
##$AZFE= 0.1
##$AZFW= 0.1
##$BCFW= 1
##$BC_mod= 2
##$BYTORDP= 1
##$COROFFS= 0
##$CY= -3
##$DATMOD= 1
##$DC= 2
##$DFILT= <>
##$DTYPP= 0
##$F1P= 0
##$F2P= 0
##$FCOR= 0.5
##$FTSIZE= 0
##$FT_mod= 4
##$GAMMA= 1
##$GB= 0.15
##$INTBC= 1
##$INTSCL= 1
##$ISEN= 128
##$LB= 0.25
##$LEV0= 0
##$LPBIN= 0
##$MAXI= 10000
##$MC2= 0
##$MEAN= 0
##$ME_mod= 0
##$MI= 1.114404
##$NCOEF= 0
##$NC_proc= 0
##$NLEV= 6
##$NOISF1= 3.799351
##$NOISF2= 2.8
##$NSP= 1
##$NTH_PI= 0
##$NZP= 0
##$OFFSET= 14.38212
##$PC= 1
##$PHC0= -4067.684
##$PHC1= 14.59229
##$PH_mod= 1
##$PKNL= yes
##$PPARMOD= 0
##$PSCAL= 0
##$PSIGN= 0
##$REVERSE= no
##$SF= 200.129724274929
##$SI= 16384
##$SIGF1= 3
##$SIGF2= 2
##$SINO= 400
##$SIOLD= 16384
##$SREGLST= <1H.CDCl3>
##$SSB= 0
##$STSI= 0
##$STSR= 0
##$SW_p= 3205.1282051282
##$SYMM= 0
##$S_DEV= 0
##$TDeff= 0
##$TDoff= 0
##$TI= <>
##$TILT= no
##$TM1= 0
##$TM2= 0
##$TOPLEV= 0
##$USERP1= <user>
##$USERP2= <user>
##$USERP3= <user>
##$USERP4= <user>
##$USERP5= <user>
##$WDW= 1
##$XDIM= 8192
##$YMAX_p= 0
##$YMIN_p= 0
$$ End of Bruker specific parameters
$$ ---------------------------------
##NTUPLES= NMR FID
##VAR_NAME=  TIME,          FID/REAL,        FID/IMAG
##SYMBOL=    X,             R,               I
##VAR_TYPE=  INDEPENDENT,   DEPENDENT,       DEPENDENT
##VAR_FORM=  AFFN,          ASDF,            ASDF
##VAR_DIM=   8192,          8192,            8192
##UNITS=     SECONDS,       ARBITRARY UNITS, ARBITRARY UNITS
##FACTOR=    0.0002768,     1,               1
##FIRST=     0,             0,               0
##LAST=      2.2672688,     0,               0
##MIN=       0,             -197795,         0
##MAX=       2.2672688,     155820,          0
$$ Real data points
##PAGE= N=1
##DATA TABLE= (X++(R..R)), XYDATA
$$ [...]
2148b4p8J56l15J12LR4l68M11k31N8j31J03L93k29j52r0L01k74K89K65l2l43j00
2171a82J89l61J13J86k08kL23j01q4j1J5nK18j99k38J56j36M64j46l86L19R1k19
2194b04J4j63O0Q9P4m5K38j2j25J46k87J48k13J26R5J13l68J68P9j76L12n16J54
2217b93J73J16j19q1K33k38o1J01l87L62j02J50L05m00J33j81K40j13M4K5k05
2238b98L12%k47l0j11K35l43K18K79l45L65l87L8j30O7K94j57j77j07K42j80N36
2260G4m74K06j50J65R2j63L5Qj8jj5k22L26l2K61k67k50J60K27j1j63K18l00J17
2284a77m1N9j13nJ86p8l28L72rP8j57J20j48j61L93q0j82j29J72J51Pl1j23k0
2308b44R0j82K16k61J38J16j6j45K48O0n5j18P8k22K31k34J30R1l28j75N34o62
$$ y = [-24, -102, 54, -261, -149, -146, -52, -420, -9, -240, -182, -313, -210, 183, -46, -198, -288, 13, -261, 28, 293, 261, -82, -182, 7, -354, -241, -55, -263, -265, 58, -43, -127, -138, -123, -128, 90, -109, -347, -191, -327, 137, -9, -395, -76, 15, -204, -190, -353, -293, -204, -130, -175, 63, 51, -74, 72, -215, -67, -280, -154, -59, 54, -314, -146, -67, -243, 69, -447, -293, -120, -4, -123, -204, 29, -209, -270, -169, -556, -194, -296, -146, 159, -241, -108, -289, -49, -162, -118, -93, -298, 14, 14, -233, -263, -374, -139, -482, -264, 15, -330, 35, -352, -314, -444, -377, -83, -240, -417, -524, -282, -462, 74, -400, -194, -344, -179, -87, -250, -215, -207, -225, -226, -241, -463, -137, -169, 92, -175, -425, -265, -38, -49, -212, 6, -294, -177, -218, -159, -272, -277, -91, -169, -497, -125, -134, -56, -213, -93, -241, -402, -9, -89, -271, -400, -228, -77, -70, -101, -224, -244, -154, -336, -120, -381, -243, -127, -143, -288, -40, 20, -35, -153, -75, -297, -66, -300, -170, -79, -407, -582, -48, -710]
2330g10P26n01L65J61k51l9j13J47L2k17RK4L3j9J154j100O51p12O39k13j09j49
2352a92m48O45n75N53m46Q0J71J83k53L11m07M07m00J55r0k77J95J69j0q7J68
2373a48k36K41J78k65J20k26J33j62Q7r5J93J94m25M2M07j57j05J13n9j12P5K76
2395F9k28l46K10L72j34k19j69L17Q7j55J09k39K5J16o7L18n39k6N14j18J08J59
2417A64k29k13r7K07k61j8N1J45j3j2j3R8J68p0m6J22m6l3qj2k47pJ10J89n46
2442f17K27K54q3J09j55J56K07j78j84K84k51q6K35k2L0l52M18n8k27l9Q1j76
2464d27N1M50l75M12l43j04L53k63j62L22r8J08m06L21Q8m8K25m33K13k82M98
2485A00m06K91J63m43k25M75k20l1K9J34O7J05k21K24j53M5N8j68J03o9K09j41
$$ y = [-710, 16, -485, -120, 41, -210, -249, -362, -215, -183, -400, -391, -367, -334, -353, 801, -299, 352, -360, 279, 66, -43, -192, -640, 5, -570, -17, -463, -383, -212, -29, -282, 29, -378, 29, -371, -216, -306, -583, -388, -219, -229, -316, -148, -384, -143, 35, -230, -110, -336, -203, -365, -278, -373, -180, 14, -411, -369, 38, -119, -224, -111, -170, -282, -207, 69, -159, -505, -295, 77, -57, -276, -445, -128, -41, -196, -87, -326, -301, -185, -252, 66, -473, -499, 15, -103, 5, 164, -65, -278, -375, -168, -429, -447, -396, -251, -264, -276, -289, -191, -23, -93, -139, -17, -63, -96, -104, -116, -363, -370, -260, -71, -617, -390, -136, -219, -110, -265, -109, 98, -80, -264, 20, -231, -317, -82, -104, -74, -426, -8, -66, -293, -332, -251, -427, -376, 74, -301, 111, -232, -336, 17, -246, -408, -86, -184, -76, -482, -161, -73, -121, 104, -329, -116, -398, 100, -306, -15, 148, -295, -520, -45, -265, -296, -267, -133, -66, 39, -182, 42, -111, -66, -8, -176, -73, -142, 67, -74]
2507g4J99l97K48k3k06O52m56M1p5m78O06k1q6k27K96j08o0J49n2j05O6R1l1J34
2531H3J12k90J28j50O7J17k19N0k01K14j19L07l52L20J89k44p5o7K64l58K03j38
2553a59j27K65J62o3k97L1L90j77Q0j84m1k6kK20K72m03M7j40J4N4m0P8J1J72
2577A37l2o9p6K54k7k10j32K40k69J95JR8q6k09M02j73k84K58j00J93m2r1J38
2600A16j50J19j59K3J56m5k35L24m60K62k39L08K09q3K49m19K02j23M8k25Q7K7
2622hK96k45K06m4l52N5L06l01q1M15k30M97l90k78M20k11j9m4k35J45K14j3J94
2645B97j67L45o1q4rj17m3J25n83L21j71L25j52J98J09l61J92j11j58J76j98K46
2667A19M8k42JK39K03n07J02M1j2pQ0R0J0M6M5j54l5k18K60K29k37J09l62j46
$$ y = [-74, 125, -272, -24, -47, -253, 399, -57, -16, -91, -569, 37, 16, -70, -297, -1, -109, -169, -20, -72, -177, -111, -20, -51, 83, 195, -95, 33, -117, -50, 67, -152, -102, -303, -89, -208, 99, -253, 67, 256, 12, -63, -130, 134, -224, -21, -159, -286, -21, 141, 78, -219, -188, 202, 25, 105, -79, -120, -146, -148, 72, 344, -59, -12, -152, -138, -84, -124, -46, -35, 137, 105, 36, -40, 214, 187, -23, -155, 85, -184, 11, 12, 110, 24, -185, 217, 44, -240, 18, -82, 111, 69, -22, 116, -34, 85, -74, -51, 105, 60, -175, 149, -311, -49, -288, 20, 229, 146, 395, -24, 178, 55, 103, -122, -35, -8, 288, 43, 249, 205, -147, -92, 214, -87, -168, 247, 17, 514, 124, -154, 266, 55, 36, -8, -243, -98, 116, 103, 297, 130, 475, 414, 330, 321, 204, 161, 286, -297, 24, -147, 178, 26, 224, 333, -28, 164, 53, -105, 71, -127, 119, 167, -75, -74, 165, 368, -139, -37, 4, -8, -15, 65, 155, 165, 211, 256, 102, 67, -151, 109, 338, 101, 210, -152, -298]
2691b98O00k22j5Q5R2j61j65O6J89j89J95m4J82j46R8j83k49L65J22j31j69J43
2713A65M4j74j72J86K50l4l81K45%%J41j7n7Q6j72J62j69J17p1L6q5K91l86k13
2737b08K03N78j49l24R7J13n4k97J91K21j72l28j9K81J36j68j09L05k24L8K23
2758C34Mk66j37K67L5l2r5J51l1k42L04k9k32j41L43j98K81K1k39J34q2J13k26
2781C7K05J13j68J69k55K46K74n15K7j96L46j21K70k57J67k5j71J62l16K22j65
2802D9P4K86k7j31q1j14M2Q7M01k53m95M16j19L92m11m8J02r4LJ70j19J74j7L2
2826C19k12N0J54j81j7Lq1L58j58k03K43l26K45r4k6k9L15O3p5p2k61k27N59N3
2850D00k1k13k0L60m81P5j7L38q3o3L79p02L09J14k0k57j8K14j26J58j54K46J09
$$ y = [-298, 302, 80, 65, 150, 242, 81, -84, -18, 171, -18, 177, 133, 315, 169, 267, 84, -165, 200, 322, 191, 22, 165, 209, 35, -137, 49, 299, 265, -116, 129, 129, 129, 270, 253, 196, 282, 110, 272, 103, 220, 149, 185, 100, 391, 5, -208, -5, 573, 424, 100, 197, 310, 256, -41, 150, 371, 199, -129, -148, 133, 269, 101, -8, 297, 73, 111, 334, 338, 72, -65, 202, 237, 205, 110, 261, 230, -12, 292, 263, 31, -110, 233, 35, 316, 337, 98, 232, 150, 263, 37, 242, 355, 187, 356, 101, 347, 621, 106, 133, -63, 283, 162, 432, 175, 342, 317, 146, 308, -8, 214, 49, 123, 409, 382, 251, 170, 56, 98, 185, 586, 333, -162, 254, 135, 527, 116, 68, 170, 76, 79, 249, 130, 304, 287, 319, 107, 157, 311, 130, 113, 116, 35, 393, 235, 32, 275, -51, 194, 100, 74, 45, 360, 423, 348, 276, 15, -212, 347, 400, 379, 166, 146, 506, 25, 100, 83, 421, 338, 275, 654, -48, 261, 375, 355, 98, 80, 294, 168, 326, 172, 418, 527]
2873E27l41Q9k44J29J0J11l10R1N3K90n8j94K61m79K50o7N0N7l8J44j95O2k3R8
2897B73J14q4k19J93l06K13P7l6K76l21K82m85K95J45m71K01r3K38P3Nn1j17l7
2920A65K40m63M5O6Q6J12m5q7K60j79M6j7r5J56j01N7j95J05J40P3j18j63K3k1
2944I0K33K44m72rj75N03k24l20L71k10M26n08K3L40l74L30K27l57l96P47L5p14
2966a90O53K89j365J162m60q0Q2Q3L0r4K53n83L08P4J62j21o7J64l68m8K86j20
2988E0K73l56L38j20K27m94N43j71l07K93j76Q3j82K54l03L95l05J01j32L77m99
3009a11L20K42k24j7O4j20J6r3j45K81l3P9j74M7N9K28m91P7oPK20j4k47J3M5
3034B3J66m9J36M6k89R9J37k01J02r2o5M0R3K5L3Q5o6j90K56l45J77K05j09k88
$$ y = [527, 186, 275, 31, 160, 170, 281, -29, 62, 115, 405, 347, 153, 414, -65, 185, 118, 168, 225, 187, 331, 136, 198, 175, 273, 387, 303, 84, 277, -29, 184, 261, 225, 501, 180, 462, -23, 272, 417, -54, 147, 54, 292, 365, 370, 319, 202, 165, 405, -58, -13, 53, 139, 251, 206, 119, 379, 200, 246, 229, 134, 290, 189, 246, 51, 156, 296, 369, 251, 88, 111, 90, 323, 567, 95, 86, -89, 414, 190, -130, 241, 31, 457, -51, -28, 312, -62, 268, 495, 138, -258, 489, 524, -190, 463, 752, -613, 549, 89, 9, 91, 174, 204, 110, 363, -220, 88, 162, 324, 203, 136, 300, -68, -116, 170, 50, 323, -33, 305, 185, 412, -82, 461, 290, -17, 276, 100, 183, 1, 255, -48, 347, 42, 143, 11, 388, -111, 209, 451, 227, 210, 274, 154, 170, 77, -68, 213, 180, 259, 85, 132, 191, 419, -72, 5, -1, 6, 226, 212, -35, -22, 23, 189, 140, 276, 322, 33, 132, 269, 68, 170, 78, 13, 53, 146, 171, 204, 289, 223, 33, 289, -56, 121, 326, 217, -71]
3058g1J01J69n7J0k25J32l2j36K03J69m14J76L01j12l00J29o4J43J22k14K39m96
3080b27J55L18j50Q8j08k79J70j30mO1K93j89j78K14p8j24L85J88n42K84q8J69
3102B28J5o7k0q4J84m42J13Q8j33O1O0N7o8K9J32Pr5k04L1L8O4j42P3Q0P89p83
3128A1L59m02m23J45R8O56n11L0L32l19k44L15P3k36K64M43m96j072J263j225
3148i39J675j330M59l43j09L40Q8Q32p40k61n22O81j13P52k56j24j168Q26Q48
3167E96j175J207l45j406R20j071J345j00k3q5P29q86o3L16r0l62N52j3J67j97
3187A6J00R2j58m89M53k06M1M5J25J04j34O3l93L06J6n16M00J50k63J69R9j34
3209a14P2k71K21M7l08M32j15j15K3j24J78k37K07J69j72M7m8Ok17M97l08P1J7
$$ y = [-71, 30, 199, 142, 152, -73, 59, 27, -109, 94, 263, -151, 25, 326, 214, -86, 43, -21, 122, 244, 30, 269, -227, -72, 246, 96, 184, 76, -203, -33, -163, -167, -106, 187, -2, -180, 34, -44, -168, 217, 405, -137, 147, 59, 228, 243, 176, 156, 72, 256, -186, -73, 15, -118, -57, 3, 60, -8, 21, 153, 160, 65, -139, -108, -70, -6, -148, -75, 5, 794, 11, 370, -32, -455, -310, -212, 444, -67, -37, 295, -24, -268, 47, 120, -116, 148, 591, 95, -977, 286, -939, 736, -594, -135, -478, -587, -247, -159, 673, -67, -328, -850, -169, -282, 470, 214, 90, -1078, -252, 596, -579, 628, 283, -1123, -203, -1274, 71, -29, -52, -137, 592, -294, -357, -41, -131, -493, 59, 46, 213, 16, 116, 208, 50, -439, 14, -192, -151, -106, 19, 123, -11, 52, -341, -35, -19, -535, -135, 15, -248, -79, 20, -114, -42, -313, -92, -45, -353, 79, -36, -151, -128, -252, -74, -311, -104, 65, -107, -60, -108, -102, -319, 178, -130, -59, -42]
3232d2j75n4N4P6J92l6o3K0q5N0l5q3K3M3lk83N51j33o8j94J00K09l72r6J77O
3258b21Q3j10K75r8j12L18m45J77j3j88L06l4Jj66J76K83m56Q0N2q4L18l9l21
3281b18J95j18K92l84M43l74K59j08k20J10j0Q7J72k62r9J34N2Q8m56K19M2N7
3303i9Q4r5q0O2l25N73j79r1l56P36k63k05Q2l9J88j11MM7j78L7J28K6l14L24
3327d4Q2Q0k75p6K18k02O8N01o48Q2R9k8j67Lj24J61K87p2j89J2O5n0J86j89M23
3352B03k81j12k10K80O0r6J05J61o9m17K28M5J13k50K32O2p3j92mQQ8j45J60P7
3376b7O3MO0l83L03l74K80j75J50p4p6J62q0J31k49l1K41p6O9L1k52Q9K10j04
3400a08J10l51R3J13P9N1j41J72r3p8k05O7K1J51R3m8J1j04L03l54NJ62M2Q8o8
$$ y = [-42, -217, -271, -217, -141, 51, 15, -48, -28, -113, -63, -98, -181, -158, -115, -118, -401, 150, 17, -51, -245, -145, 64, -308, -404, -227, -221, -138, -248, 27, -71, -183, 135, -310, -133, -146, -334, -28, -62, -61, -227, -51, 232, -224, -144, -92, -176, 142, 103, -218, -23, -141, 151, -233, 210, -164, 95, -13, -233, -123, -133, -46, 126, -136, -235, -101, -49, 39, -417, -198, -156, -99, -15, -110, -190, -128, -453, 120, -59, -150, -506, 230, -33, -238, -156, -195, -7, -118, -114, -67, -245, -208, -80, -54, -368, -44, 38, 118, -157, -233, -15, -217, -149, 352, -296, -214, -115, -143, -310, -307, -431, -270, 17, -55, -244, -232, -167, -217, -31, -220, 203, -78, -190, -400, -120, -60, -156, -51, 110, 41, -376, -148, -103, 10, -240, -8, 54, -19, -211, -215, -207, -119, -264, -104, -27, 36, 40, 100, -283, 20, -354, -74, -249, -99, -173, -249, -87, -167, -36, -285, -316, -75, -151, -82, -51, -303, -214, -4, -108, 2, -349, -256, -143, -64, -13, -154, 18, -75, -153, -358, -291, -270, -119, -26, -74, -63, -167, 136, -218, -213, -51, -9, 79, 11]
3425A1l10J28K73q1p5J01j07j78j98P3L71P6j13k98J18k46K37K99o75N13J16m76
3447d41L58k45j7J68J72j26j77K94j17j62K41J60l82J88l17N57k39Q1l19L70R8
3468A45n75J50M09p2k97K35l30K6O32o51L16k97M90k76R4o7N4q4l71M07M19n14
3490a57j8m6K59k47P9Q0p7N5k43N39m12k04K54K1K2O8j11j65J70J85ql51L08l08
3514c07K75J1R8m7l83J38L7J23Nm54L97Mk70J64r1j49J51J43QJ20j07KLJ55l00
3539b74L87j58j9J7k2J66j38k41M9L32l32L47j11j37j45J70Q5k04p1j11K17K51
3561E8J74n10ML57q8Nj72K5jJ74l40L9K13p5j0K91p2j77Q8m0P8j42J16m9J49k72
3587a77p4j8j22K38K43o8o2Q9j45o3J77k8p1m1J0j84O1K27k15J9K72j62j23L0
$$ y = [11, -299, -171, 102, 21, -54, 47, -60, -238, -436, -363, 8, 84, -29, -327, -209, -455, -218, 81, -594, -81, 35, -441, -83, -328, -345, -177, -5, -131, -308, -14, -131, -293, -52, 108, -274, -86, -403, 154, -85, -4, -323, 47, 145, -430, -280, 129, 57, -240, -5, -335, -309, 323, -328, -12, -309, 181, -95, -1, -68, -14, -98, -469, -62, 357, -157, -175, -221, 38, -209, -130, -50, -127, -72, -315, 224, -188, -392, -138, -117, -95, -27, -138, -303, -133, 52, 44, -307, 1, -307, -32, -21, 77, 30, -353, -215, -178, -55, -50, -504, -107, -103, -373, -209, -300, -449, -298, -155, -147, -27, -134, -132, -129, 26, -274, 113, -45, -64, -47, -69, 97, -41, -282, -233, 99, -233, 114, 3, -134, -279, -109, -24, -228, -299, -410, -193, 58, 232, -278, -274, 83, -5, 0, -172, -147, -148, 26, -314, -275, -62, -137, -147, 144, 72, -105, -17, -57, 21, -121, -5, -54, 95, -177, -251, -269, -391, -153, 90, 22, -40, 49, -96, -159, 18, -10, -81, -122, -112, -296, -235, -8, -223, -204, 68, -94, -217, -187]
3611a87L10l02K89q4k7j03l3rM7k01o8K45j61P8Q0m0K39j97m3Q3J78l03K75m35
3635c69J09J80k10J23J94k24L58n3l4j77J83n1Q9k08J38l84J03R9R6j55J09m5
3657a29J67K3j30l6K87l68k03K13j2M9K7L17k92q2M12j59k84J00J08p0j82K72
3679B8Q3j3J1r8l03J78j3O6o7K76l78n0L81q4k6pj54J31K44j17l54P4P1ML4j58
3705b41M9J27L7P3pl29J49JO2L0K28K2j88l26K25J67J29k17n1K67l72R7n3ML36
3730B19k90kR4q3%j83K8K77J30k39K0K78m42L46Qj22o0j42P5J53J11l60K35J12
3754A63J25L50r35RK11K41j08n5Q2l98M43J49o93M15J44l51L52j49k16L91l06
3775a36R12q22k49N31n9L6N59p36j55K00j14J33l89M87n90P74o05R46j159K10
$$ y = [-187, 123, -179, 110, 26, -1, -104, -137, -146, -99, -300, -368, -123, -284, -206, -126, -166, 73, -124, -167, -84, 94, -209, 66, -369, -260, -80, -290, -167, 27, -197, 161, 108, 74, -103, 80, 29, 118, -90, 48, -336, -233, -134, -38, -193, -84, -129, 38, 61, -69, -105, 182, -186, -389, -176, -188, -139, -112, 205, -87, -169, 243, 84, -200, -100, 8, -62, -244, 28, 111, 98, 109, 11, -292, -114, -127, -61, -128, 148, -230, -280, 101, 17, -9, -16, -170, -39, 205, 88, -266, -192, -121, -117, -83, -241, -192, -65, -28, 45, 38, -291, -142, -141, -79, -49, 179, 201, 13, -313, -88, 79, 208, -9, -60, 207, -165, -68, -121, -117, 219, -71, -73, 21, -62, -62, -245, -217, 60, 190, -49, -29, 249, -193, 153, 161, 39, -21, -163, -88, 65, 176, -184, 51, 163, 288, 638, -297, -288, -77, 164, 56, 1, 83, -315, 128, 277, -416, -1, 143, -208, 144, -5, -221, 170, -136, 776, -46, -295, 236, 177, 213, 772, 36, -119, 81, -33, 100, -289, 198, -392, 382, -223, 723, -436, -226]
3795b26Q54k64j56q45M67J066q83O9K12k77k20N46l54K67J37o05J52J04J53l62
3815a65N30k29j33J8NJ76j51J88J23o67R9n1k24L15Q56n35r1K74n98K91pj61P8
3838e9K47LJ42k88L3R16j066O63q2l96L34j30k7r1K13K75l35q69J21Q75m59j89
3860a69L2K3K68q4J81r8j53k32N23n07M07l84M36j14k25Lk8J63R1j88N7P4R5J71
3884C42k83k07O3M81m03K72j70M0l59J10M75k19k26L4L58k53J1n7M25m52R1K39
3906C12j75J1p2n5Jr5N1j29J69J98k76K81k10mJ98j71m9L21l07R1l8j75J92L17
3930C86j34l11K74l00J82K9j84L49n22M20r5j02j98Q4M42m38K37j42k41P8L44
3951A58l99N17k69J41q5o0P8m2M0J48k49Q3o9J87j64p5Q7J87j24qN4r9l4oL03
$$ y = [-226, 628, 364, 208, -637, -170, 896, 13, 82, 294, 17, -203, 343, -11, 256, 393, -212, -60, 44, 197, -165, 365, 136, 3, 21, 26, 202, 51, 239, 362, -305, -206, -257, -481, -166, 690, 155, 64, 338, -260, 31, 24, -137, -59, 188, 191, 333, 45, 78, 994, -72, 591, 509, 113, 447, 317, 290, 199, 412, 687, 352, -517, -396, 479, 20, -169, -137, -114, 154, 70, 251, 153, 0, -232, 291, -216, 191, -193, 243, 129, -96, -93, -121, 42, 133, -55, 2, 76, 171, 342, 59, -148, -85, 396, -7, 265, 95, 135, -224, -114, 361, 142, -84, -50, 308, 55, 66, 9, 434, -18, 73, 312, 137, 148, 76, 21, 22, -73, -22, -151, 18, 216, -60, 221, 11, 7, 205, 34, -15, 306, -1, 90, 52, -123, 69, 386, 252, -59, 215, -85, 97, 126, -58, 291, -231, 189, 94, -8, -206, -122, 320, -118, 119, -23, -264, -186, 158, -241, 276, 7, 148, 63, 3, 81, 39, 79, 227, -22, 61, -8, 179, 15, -60, 27, 214, 90, 82, 136, 37, 3, -3, 300]
3976C00l56J73j95K67j38n4K39j62k03J68o1K59k07P6m7qQ0Mk34K79j79K48l93
3999a44K01J59k22p0K75J6k24j8N8J92j69J97m80M05j5j62k22M66k62K62j92k03
4021a52Q5K79j43J53r8n7n5J86l3l19K19O5j53R3K12j83k4K6P7p7j6rr6j28K21
4046G3K2N5O0j9j70J23R1k67r5J58R5q3J84Nk62J02R3K0j54l1K34J00n0m18L3
4071a01K44j49l1J96j76P1J35j82K19J3j56mq6J52k5j38N0K32k21Lj36n0M17j27
4095A50O3j9j31j00j31M34l77P1Nk14O7L90j46j87n00R38J77n16J05J69k23K15
4117B40K20n08Q3J21L5m22L86l36J03K52m7Po2J9n7N8J48m0lJ61m09M12l08M1
4141I4k39J96q3k8L26l12j82K75NJ12k29R6m6r6J53R8O1m49L34j14P0l16M61j92
$$ y = [300, -56, 117, -78, 189, 51, -3, 236, 74, -129, 39, -22, 237, 30, 106, 59, 51, 131, 135, -99, 180, 1, 249, -144, 57, 216, -6, -76, 199, 215, -9, -27, 31, 223, 54, 251, -229, 176, 161, -1, -223, 243, -19, 243, 51, -152, -67, 212, 69, 222, 124, 67, 12, 198, 165, -154, 65, 130, -23, 70, 282, 99, 75, 101, 178, 101, 85, 76, -20, -148, 73, 95, 150, 210, 191, 21, 144, 235, -32, -127, 31, 126, 43, 227, 232, -30, 72, 165, 185, 31, 0, 234, 334, 284, -134, -101, 143, -6, -37, 159, -17, 54, 189, 7, 226, 239, 83, 79, -7, 145, 120, -18, 32, 264, 43, 46, -90, -140, 277, 150, 213, 194, 63, -37, -168, 266, -111, -40, -35, -249, -182, 208, 62, -125, -625, 313, 490, -26, 79, 248, 25, 240, 460, -48, 35, 156, 191, -231, 155, -181, -78, 174, 127, 134, 72, 91, 34, 92, 240, 200, 197, 358, -51, 361, 53, 94, -145, 51, -32, -60, 266, -46, -228, 47, 52, 164, -65, 31, -15, -111, 42, 140, 201, -248, 86, -28, 42, -274, 187, -5]
4165eM9J32j61J27j87P2K19k45J27J77n26M65r9j1m1p2j37O0k21M80j42j17rJ15
4189E0N5j0j0k98K24l92N07O6k12J07k94K87K05l17j71M13k91L94j80l59L92j74
4211hO8k0n1P3k85K29K11j10Kk52p0L23N0k2j00K10r9p7Nk9r4J15j4Q4n7J29k76
4238f5O7j5r1P1o8J55pm9M0k47nL93j91N8J63j22K25k63J9Q5l12K66j17L50l10
4263C0K9j52R7M0q9J67n9R7J49k49J71o10L11l0J40k7j58M90n59Q7J84%j54o4
4287a59K39K23ml56k4J68j14p3J48l5k9J59Qk95l3j40M22P5k34J51j7J1k27q1
4311b17Q5qQ0j74M24l7l12J36k85M38m4J32o4k06K48k69M5N5p5K1m3j51J17K92
4335A88j13o9J55R3j76k5N5j99L74n01J83l5k7J87q8q3J30l3O7j45j98M85m52
$$ y = [-5, 44, 176, 15, 142, -45, 27, 246, 1, 128, 305, -221, 244, 145, 134, 93, 21, -116, -56, -277, 203, 61, -56, -65, 50, 105, 95, 85, -213, 11, -381, 126, 192, -20, 87, -207, 80, 285, -32, -203, 210, -81, 313, 133, -226, 166, -8, 60, 40, -11, 62, -223, 6, 217, 107, 109, -143, -213, 110, 160, 138, 38, 248, 149, 72, 77, 48, -46, 69, 55, 139, 82, 211, -65, 2, -13, -104, -33, -101, 54, 47, -2, 38, -209, -214, 179, -12, 46, 209, 87, 312, 49, 68, 153, -159, 107, -10, 340, 30, 59, -93, 4, 44, -45, 122, 63, 160, 309, 60, 231, -379, -68, -98, 42, 15, -143, 347, -212, -125, 59, 59, -95, -159, 80, 303, 299, -57, -81, 87, -27, -100, 48, 13, -16, 143, 151, -144, -177, -317, 105, 180, -54, 97, 80, 91, -136, -217, -132, -140, -60, -234, 190, 153, -159, -23, -308, 130, 86, 218, 154, -52, 196, -73, -28, 27, -48, -27, -70, -221, -104, 188, 75, 6, 161, 254, 78, 53, 108, -91, 283, -218, -35, -70, -97, 90, 2, -81, 49, 16, 83, -62, -260, 225, -227]
4358b27P6r8K4o6K42K58m89M89n7l30L18j5m25r3K19L48k77o4O1R1K28j56L4j40
4382d9J6n8P6M4J25k32MP7j44J64K34m78K05o5Ll1N6K12k65k01K25l3J16O0J1
4407G2k6J33r0l90M44m9rk70J19l1q0L9J46j81K28j55M5J86K17k79p1l02K08n4
4431a50J66K18k04K47K57m97qJ56m01N40k91k81J50M64m48J37R1m06j60P75k83
4452G2N27o87M1K64l38L41k32j88k1n2J55j23L87l23J11J07q8l54l03N96L51o52
4474d09k26M59L42p6M0J32l4j26m21J29O15k19p74N47N66n61k96L16m27K44P4
4495a05J78j18J61m33O94J81J23r0j036pJ150j445J419r03j72N19M52M28j444
4514d48p11J604n71N29p98O45J59k21p74Q7J254n98m63M22K87n76K0j64N97K31
$$ y = [-227, -151, -249, -225, -291, -49, 209, -280, 209, 152, -178, 140, 125, -300, -393, -174, 174, -103, -167, -106, -15, 213, 57, 91, -49, -33, -91, -15, 29, 154, -78, -74, 3, -141, 23, 257, -221, -16, -81, -78, -109, -53, 159, -106, -307, -82, -115, 1, 61, 72, 46, 179, 89, -301, 143, 94, 85, -185, -66, -97, -177, -138, 8, -173, 55, -100, -55, 131, 348, 69, -2, -304, -96, -150, 16, 234, 30, 277, 534, 37, 29, 185, -216, 324, 33, -248, -98, 366, -82, 55, 146, -260, -420, 355, 72, 599, -88, -47, 217, -121, 220, -12, -200, -221, -273, -118, -241, 146, -177, -66, 41, -47, -401, -704, -108, 243, -409, -635, -176, 166, 90, 130, 262, 228, 102, -319, -190, 425, 206, -568, -21, 545, -16, -312, 4, -423, -179, -105, 73, -45, 116, -317, 377, 558, 681, 591, -445, -452, 698, -747, 672, -231, -403, 116, 568, 996, -448, -1159, 445, -126, 403, -395, 250, 409, 188, -586, -499, 755, 157, -306, 116, 403, -173, -153, -317, 280, 511]
4534E11r65L92j45M1N58j64L4o35K65m85N61q37R99l47l2L56Q02j020L55j81n50
4555d87K74j69M39N7l92k8Q24j82K39j16j23m59L53m16P61l95L27q78O31J49n37
4576a28J90m81Q72j050J304p09k46K30p52j13O54K46j81M00L21j28J131j379n26
4595c45J040j95r24P66m04J76K19K14p47r55M33M79P04n20l41L85J56j83M08l04
4615F2N6Rr6J40Q3l63J97m5p78O62k31K84O4j53K0P4P54j187J04N03l24O86m16
4638A05j51m62m5N71o5j35N58k34l64K47j08M7j27P2J91k59L84QK92o33M55o6
4660B81j09n14L53j80L78l90Q18k00k30p14L74J31N25k38n76J16K74l58n7K16
4680a00N4j82M45o2r0J7j89K86l52j27P13O6q7q97P10K92p30j52P11Mr3l90n67
$$ y = [511, -454, -62, -207, -166, 392, 228, 262, -373, -108, -593, -32, -869, 130, -217, -249, 107, 909, -111, 244, 63, -487, -213, -382, 57, 114, -278, -306, 518, 336, 575, 459, 336, -123, 230, -186, 575, 180, 507, -371, 260, 409, -128, 62, -419, 453, -597, 707, -2, -248, -18, -770, -883, -229, 17, -164, 236, 557, 429, 1560, 181, -345, 695, 500, -424, 342, -62, 114, 333, 547, -200, -1155, -722, -243, 461, -59, -400, -15, 141, -42, 366, 62, 118, 127, 31, 171, 254, -109, 88, 43, -735, -73, -304, -20, 44, -109, -89, -15, 739, -448, -344, 159, -165, 521, 105, -46, -508, -553, 18, -47, -182, 376, 142, -222, 25, -83, -36, -163, -91, 100, -159, 225, 233, 525, -108, 347, 281, 172, -342, 11, -169, 209, -181, 637, 437, 207, -507, -133, -2, 523, 285, -291, -175, 99, -259, -316, -100, -46, -228, 217, 155, 65, 82, -107, 179, -173, -300, 413, 479, 392, -505, 205, 497, -233, -385, 326, 330, 237, -153, -720]
4703g20R72r73j2P98l0K72J61J54l42J20j047J145j04P8j038O3R13o82O06J57
4723D91j77k96J67o09P1M18N9k28M93l21K79q10N54J30R9J34n88J94J62J60m18
4744c6m19J69P1O08o23M26j077L33L33r9M25k64l9n8kJ9MJ82L29k61M6k40J60
4767a3j30J48j19J85p1L49m68n8M2J19j01L5J59J02J99m00J5l5J85k54J27J12
4789A28j86j4j49K52K64m38Q4J34k80L50j89p1J44J68l31J31k05L5L16j22j20
4810i9j91K36j01J51N9K11k40k55L13R5l12M1L33r5k18K77k85J26k87L28J0j45
4832d8r7J34Mk8kR7L3p0J39k06J58l37J32L14k40K3J95o1k19J4K3J25J19j16k70
4857a84J15K19j26P6l4M6p8l0RJ34j55R8r6n9n3J03J15j97J9K14k59J09K9P3m0
$$ y = [-720, 252, -721, -733, 65, 35, 307, 468, 622, 280, 400, -647, 498, 394, 472, -566, -503, 410, -272, 334, 491, 314, 18, 185, -424, -353, 65, 124, -104, 389, 68, 347, -463, 91, 221, 320, 454, -134, 60, 222, 382, -36, -455, -286, -215, 393, -230, 196, -881, -548, -215, -314, 111, -153, -192, -250, -252, -233, -229, -47, 282, 21, 67, -173, -13, -143, 5, -114, 71, 0, 349, -119, -177, -135, -16, -117, -82, 77, 179, 378, -22, -7, -42, 143, -111, 16, 128, -58, -72, -221, 31, 295, -143, -59, 75, -205, 145, -44, -115, 29, 197, -134, -3, -208, -173, 143, 21, -99, -290, -54, -155, -4, 55, 266, 26, -229, 84, 179, -133, -92, 241, 146, -72, 205, -80, 46, -241, 87, 97, -48, -145, -11, -7, -35, -37, 60, 93, 23, 162, -44, 114, -223, -91, 223, -17, 6, 201, 140, -79, -65, -42, 83, 202, 86, -184, -69, 150, 24, 100, 66, 112, 34, 4, 13, 147, -8, 90, -6, -65, -118, -15, 100, -97, -78, 136, -123, -14, 15, 88, 48]
4882D8o6l09M35L4l86L81k47R1J39j21J5Q8k23L00k28J70M4j14k6J37j16k44K30
4905C2q5L30j95O9m32L54k18K78j72J33J92k29M2pjk49N0K49k66k0J47j26M1J24
4929D1L9N3K13l33K06nk28l7J56j28jr1j40R3J15r7J47J46J0k09m1M37n74J40
4953h8j4k61J021j34n46J40j63j2p0K49j53lK61k06j40L06k15J02m4J87j43j14
4975d0j68J41R5k43M06r9J24k68K73n3k80K06P4o9J51l75m2m8K18n5k83J20J86
4998b9K10q6k93K22M8M1k66J31k48J34O3R7j65j24N99l78q4J92n2J98J81m71l3
5021a13K63Kl11mJ09j71J64j07K02K2r0j2J77J42m11K70k69oQ2K41j67O6k36K19
5045F2k4P1n3J5k48J74O1k8J06k72K77o6k45L11k24r0K50k66J87K98k00j01J38
$$ y = [48, -18, -327, 108, 142, -244, 137, -110, -19, 120, -1, 14, 102, -121, 179, -49, 121, 165, 51, 25, 162, 46, -198, 32, -53, 277, 82, 151, -281, 73, -145, 133, -39, 94, 286, 57, 99, 92, 91, -158, -108, 141, -125, -145, 2, -124, -83, 41, 80, 133, 346, 13, 219, 214, -14, -51, 105, -23, -24, -115, -255, -162, -47, -144, 3, 149, 159, -50, -91, 346, -228, -88, -102, -363, 658, 524, -22, 118, -45, -57, -127, 122, -31, -34, 227, 21, -119, 187, -28, 74, 30, 217, 74, -40, -208, -67, 28, -215, 191, 92, 216, -52, 221, 168, -112, 94, 168, 99, 250, -125, -167, -215, 3, -52, -335, -215, -29, 181, 95, -198, 24, 72, 113, -153, -22, -270, -136, -73, 24, -141, -265, 334, -44, -128, 64, 12, 210, 391, -80, -113, 150, 152, -159, -163, -54, -225, -61, -168, 34, 56, -34, -46, 131, 273, -138, 132, -137, -143, -61, 180, 13, 79, -157, 62, 38, 109, 56, 71, -177, -3, 58, 30, 136, -136, 141, 75, -170, 141, -83, -173, 77, -189, -2, 296, 96, -5, 133]
5068A33j4N8j86O1j86j52L51O0k48J49l50K58N6K59m74L5N3J22J28m31N81q1K2
5091B04j66J25q0j95L26k90K51pj20M1pJ97j91r9J50P5p9l18M62k24J73m2k33
5114d7Q6m2m47N90q3K78j93p0J43M1k07k98L37j59P3j06K79j1l73rP4R1R4K6J4
5139H1k32K92J00l17J42j65o62J072q0l85M33J21m59L55m77N0J45L35n05q3k16
5160d55Q14l00n5l55l36M57P02j118Q5J122q20J72K92j13k40R4R0k7j01K82j81
5181Ir2o2J53J6K86j37k44J0o1J87MN1J46n01J42q2p7L44j21J9k06K03J88P4l42
5206i3l5K18k07R1J18J09m05K24K41m79n7L43j5j95J93o9j96K06p2R3j26P8O5
5229C0l7J81j25l4J29j46j45M8J95%k95j30O03k49j20R3N2r4N6j16lK5L84l13
$$ y = [133, 119, 177, -9, 52, -134, -286, 65, 125, -123, 26, -324, -66, -10, 249, -225, -190, -137, -15, 113, -318, 263, 182, 204, 38, 163, 83, -112, 214, -76, 175, 168, 48, 89, 82, 279, 88, -11, 139, 214, 135, -183, 279, 55, 228, 186, -47, 39, -3, -450, 140, 57, 335, 142, 72, 215, 256, 49, -249, 88, -71, 2, -104, 175, 164, -209, -218, -144, -53, 41, 67, 81, -151, 141, 241, -76, 66, -99, -761, 311, 231, -154, 279, 400, -59, 296, -181, -131, 14, 349, -156, -239, -455, 359, 59, 4, -351, -687, -230, 472, -646, -561, 561, -259, -87, 205, 92, -148, -54, 36, 9, -92, 190, 9, -83, -145, 8, 24, 310, 173, -71, -61, -122, 65, 69, 120, 266, -235, -93, -175, -252, 92, -29, -10, -216, -13, 175, 249, -93, -128, 90, -117, -26, 92, 201, -204, 20, 261, -218, -275, 68, 53, -142, 51, -18, -214, -8, -80, 13, -113, -35, 30, -7, 174, 49, 15, 144, -2, -147, -99, 96, 96, -199, -329, 274, 25, -95, -2, 50, -44, 12, -104, -107, -82, 302, -11]
5253a1k4q6R0J90j14r2j48J06J72N6q4j39P0j06K89q8J88K2m10J88m5l9J69j35
5277A9Rk27K28L3k78Q9K01j49L1k24K99M6J35J30m49K5L7m9L02k99j53K06Kn3
5301h9K12k14J22K16j20j11R9j8j72j19K05M0k4J08k7k17L84K9l89k27J89J22
5323aM61l39j79L5K03n6m18M29j6J71l15k00J16K27j70j5r0L65j64K8q2N2j14
5346g2Q0j65M2M5NL36l57M5j09K92q8K23k63k52J62K02l57K87k6j92K65J34l80
5369a43M50l41O4ql53L35o7j13O26m93j32k91N0L39k15L56l76K12L09n01nO81
5391C84o27q4P02j79q09O07l93J43J5L98l09N32k11k92pk99R47n56j36M38m70
5412b06k05K12K83k99K23l02K41p3K22m3J62l92L39K3l16rQ6l3K52M7K9j43P5
$$ y = [-11, -35, -121, -31, 159, 45, -47, -195, -89, 83, 139, 55, -84, -14, -120, 169, 81, 269, 291, -119, 69, 24, -15, 154, 19, 28, -199, 29, 62, -216, -127, 74, -75, -44, -268, 31, 77, 212, 342, -107, -82, -45, -94, 208, -91, -244, -38, -36, -89, 123, -91, 31, 247, 127, 16, 115, 97, -75, -194, 11, 51, 27, 135, 108, -109, 275, 304, -85, -312, -123, -1, 460, 121, -58, -23, 180, 124, -294, 135, 119, 290, -25, -225, -109, 118, -52, -67, -157, 208, 44, 72, -10, 42, -72, 8, -157, -115, -70, -65, 271, -86, -41, -150, 142, 54, 277, 14, -238, -76, 126, -231, 56, 30, -162, 103, 237, -143, 307, -34, 30, 22, -331, 4, -63, -176, 450, -43, -175, -466, -416, -77, -292, 64, -312, -100, 209, -292, -297, 384, -243, -327, 375, 196, -613, -6, -399, -256, -241, 157, -152, 380, 169, -123, -130, -429, 518, -38, -174, 264, -206, -411, -199, 84, -215, 8, -294, -53, -126, 96, 53, 215, -177, 162, 185, -131, -140, -54, -87, 165, 212, 241, 98, 173]
5435A73k46M9m8J34nj06k11K09J26rL4j90p3J32k9N1l0L0m4L2j33M27j74j19J0
5460a0o2k65J22R5L06k53k2J5Q9k8o1J10J41J46k69q6Q3k52r3N42m05K75j94P
5484f9J06k32K66j57pn0o1M14j19P1k37R7J21k84Q5K59M0l63rJ74l7J96n3J4k09
5509d4M5n3J45k54J32m3L70k57j50M18m58MK50p7K09j09p7k20K79O3r0m41N28
5532A70n5P3m63L60Jk54L31l0k88J53j54J08L0PJ61k20K32l60J54n6P9K00j62
5555A7L23n07k1K62l8j22J11L1n8j02J12p3J71l20J65Q0j36kl5k4J32j55M33l10
5579f6j20m3k6J95K79l14J72j44R5m5m7P6j35k1j2J40j41J98J35k06K27j30JQ
5603G6j87K79l56J98J53k30J15l70L87j15L6J60j93J32l46K36K6m7J12l41J54
$$ y = [173, -73, -24, -72, 62, 57, -49, -260, -51, 75, 66, 100, -90, -163, -31, -60, -9, -39, -9, -53, -21, -154, 273, 99, -20, -10, -72, -337, -215, -120, 186, -67, -89, -74, 15, -13, -74, 36, 177, 323, 54, -32, 51, -201, -294, 248, -157, 118, -76, -69, 37, -195, 71, -86, -93, -143, -204, 210, 91, 162, -75, 22, 143, -141, -56, 203, 243, -120, -129, 45, 8, 204, 151, 165, -44, 1, -52, 93, -161, -29, -72, 298, 41, -109, 309, -149, -145, 105, 28, 237, 128, 51, -169, 110, 173, 83, -358, 170, 115, 188, -275, 85, 86, -168, 163, 133, -155, -2, -156, -48, -18, -11, 150, -70, 162, -198, -44, -100, -21, 179, 17, 340, -167, -188, 74, 36, -86, 25, 56, -2, -104, 8, -65, 106, -214, -49, 31, -105, -107, -142, -166, -34, -189, 244, -66, -186, -229, -255, -60, 219, -95, 77, -67, 28, -17, -64, 12, -123, -144, -156, -16, -157, 41, 176, -30, 197, 67, 68, 76, -111, 168, -188, 10, 163, -67, 48, -322, 65, -50, -14, 146, -47, 85, -261, -25, 1, -46, 66, -275, -121]
5624a21o7K55j67n6K90k98J80j2J14l04L19k34K38K01l58k14R89q10J52j51QK6
5646b0k81L30P6j18m0K67m02K38J12k88R4nJ8K6K5oJ48j41p2J13k25L51k05j12
5670a17L28j44jq9jj89N35m72L10L15p38J137p28L16m21LP86l79J68l70j059R72
5692A62L5q51J153o51L03M1l69M05j28j91r3J11Q64n95k05P19o27J08j00n88P23
5713B26r6k20L59J05k79k45J15O2K0Pm0K64k70q0J20J9k07L05j45M0p4K32k65
5736d7j10K55j53J14J26j63J19j41j01N9J9k4m9j16N3K12r6J4kp0P0j18M02l22
5760f9J7K39j11l3k20L22n3j77J32J52k55K06o7k22J30QK01m62L75k36J96j21
5782d8j15K47N0p1j15J76j9l06N0K76k89L1N23n30J49j15O2k4j31K11J9k7q8Q6
$$ y = [-121, -188, 67, -100, -156, 134, -164, 16, 4, 118, -186, 133, -101, 137, 338, -20, -234, 755, -55, 97, -54, -46, -20, -301, 29, 105, -13, -53, 214, -188, 50, 162, -126, -32, -37, -19, 7, 32, 26, 174, 33, -39, 74, -151, 200, -5, -117, 211, 67, 66, -23, -24, -213, 322, -150, 160, 475, -263, 874, 146, 462, 41, 44, 830, 451, 619, 249, -810, 162, 197, -654, 499, -152, 151, 192, -177, 228, 100, -91, -184, -73, 791, 196, -9, 710, 83, 191, 91, -497, 226, 130, -90, 269, 374, 95, -150, -35, 27, 47, 54, 14, 278, 8, -72, 48, 67, -140, 165, 20, 60, -14, 218, -47, -157, 98, -55, 59, 185, 22, 141, 0, -101, -42, -23, -47, -96, -212, -159, 53, -43, -29, -31, -101, -31, -149, 253, -69, -52, 187, 76, 43, -177, 145, 92, -85, 47, 199, -56, 150, 83, -139, -9, -1, 200, -262, 113, -123, 73, -48, -163, 84, 134, 63, -52, 124, 105, -201, -151, 125, -164, -133, 390, -140, 9, -106, -44, -68, -199, 12, 31, 4, -84, 2]
5806BL1K6o5r3p1K80K51l12J28k21J61j34P4k61L70j92q5K58k99J31J68j36P1
5829H2j11j28K64L3J26o6r5k84M96l41j21J99m6n5J41K7l90N39m44J61K03l66
5851a76K84P2j10p9k28J54k0MN9J86L9k51J30m16K81q6K35j95K56J51J39m82q6
5874a39K20j90J15p8J78P5j09j03j24L8j27K03R0m7R8q4n8J12J47j20l09K20K2
5897C0K21k19M0J07q2L3K3j3j08o5L23j82k09j84M79l20Q8J11L1J83m71l58P47
5920B05n25L20j47KJ00%J35j17M4Q6k42K20l5l06K19n1L48k21O7R2j92J48n4k18
5944a22O2K21k0K35m08K5j42J85n5O7j1N3J41j31L9j18J35m63J55K30k76M75k57
5967B0K57n5l07j50M70k00l10K36R2k21K61l2J49p1k56M87j07k33m2j20K69k09
$$ y = [2, 33, 59, -6, -99, -170, 110, 361, 49, 177, -44, 117, -17, 57, -204, 166, -26, -111, 147, -152, -21, 147, 11, 82, -29, -157, 107, 140, 266, 200, 105, -179, 317, -24, -145, 54, 8, -47, 94, 121, -269, 270, -174, -13, 190, -176, 108, 180, 70, -9, -237, -83, -103, -99, -40, 146, 185, -66, 64, -352, -71, -157, 78, -117, 139, 290, 429, -53, -139, 81, -109, 6, -72, 106, 181, 72, -31, -155, -117, -244, -41, 49, 2, 100, 16, -42, 70, 217, 97, -212, 8, 30, 251, 32, 72, 179, 97, 130, 153, 140, 32, -33, 290, 108, -101, -285, 194, -126, -38, 73, 104, 287, -184, -542, 205, -320, 0, -147, -145, -45, -45, 90, -27, 17, 103, -139, 81, 46, -260, -41, -92, 256, 35, 102, 194, 2, 150, 96, -122, -60, 161, 141, 376, -32, -7, -149, 36, -19, 48, 37, 90, 231, 100, 139, 21, 156, -307, -152, 78, -198, 277, 20, 277, 222, -85, -235, 235, 35, -275, -39, 53, -168, 93, 61, 210, 139, -117, 370, 263, 30, -12, -132, 137, -72]
5989g2J01P1j14j5K70p9k73L41m83j03M12J26m34K32K54m6J92K54q39l54N3O48
6011A42l65L39j38J7k12L62n5K20k00j75J93j42o8p8N05o67K75j83K88j54j49
6032b45Q5J26m8Q6l5Q8qJ85k66J09r5J41l20K45L20l65j80pJ20j86K71l38O60
6055C43m37R4o8n09M74J15n6Q7m86R51m70j20J42j18j75O6o0M4J5r3M84l98p6
6078b51K06K11l21M19k25K10Lk71J77j10j5j80L87m78N72l04k02N0N67J80j94
6099D31pJ75Q2m88n25K36J23N03J50m75r02Q15n62J32N79M98j742R21K26J4l01
6120a17J51n76L51P81r36M43k07K35n83K13L24M17m80p2K90k29l05R50j169N98
6140G9nN33l80l80N92k11K82j53l25L81j41N11j511R33P35j828J054o48Q54l9
$$ y = [-72, 29, 100, -14, -29, 241, 162, -111, 230, -253, -356, 56, 182, -252, -20, 234, 188, 380, 634, -205, -559, -506, 142, -223, 116, -22, -5, -217, 145, 90, 310, 110, -65, 128, -14, -82, -160, 345, -322, -47, -230, 58, -96, -245, -160, -34, -82, 4, -31, 57, 49, 234, -32, 77, -18, 123, -197, 48, 368, 3, -177, -184, -64, -250, 21, -317, 343, -94, 0, -68, -577, -103, 12, -44, 43, -443, 508, 38, -82, 60, -58, -233, -167, -227, -183, -168, -261, 223, -175, -251, -45, 166, -155, 264, 39, 249, 252, -19, 158, 48, 33, -147, 240, -238, 334, 30, -172, -122, 445, 625, 431, 424, 599, 681, 193, -332, -96, 27, 530, 680, 205, -697, 118, -444, -312, 267, 765, -977, -56, 170, 184, -117, 34, -542, -191, 590, -346, 97, -110, 125, -458, -245, 79, 496, 16, -56, 234, 5, -300, 650, -519, 79, 74, 607, 227, -153, 439, 228, 510, 357, 32, 413, 272, 783, -728, 205, 940, -888, 166, -482, 372, 333]
6160C33l79j41J9M18M83j046n2M97m72Q80n66q4o54M93L39J084j484M44J31q03
6180e60K0M2Q87O21j182P77p2o7m43R30l38o35p46J252l48L14j51q70O36N59n81
6201D5N3o2j022J110n90N30K35M0l26k67k17N21J127k66j213L86L74J80jM34l55
6222G16j180N81J46M8l90L04m49j76L20J22K15l89J126o55n05L38j63J95M97p49
6242d8J232j362R4j37k04J28J868k621J350o54J018l11J01L07r09n8J29n0j559
6261a686K194q92J201j277J025k85n79m9M20j57L59J93r41k25J197m85M51J94
6279F58j351J106K34O06j493O45k89p6k18R09q36J62Q94j657p75J687p82J4J851
6298A289k092J373o20R22J59j283k95L92M81k06k8P45r76jJ082j874Q18k5m27
$$ y = [333, -46, -187, -168, 250, 733, -313, -365, 132, -340, 540, -26, -110, -764, -271, 68, 1152, -332, 112, 243, -560, -540, -498, 389, 1010, -172, 605, 533, 466, 23, 953, 615, -20, -766, 486, 138, 452, 301, -569, 67, 626, 45, 98, 36, -986, 124, -466, 64, 299, 339, 13, -254, -471, 50, 1177, 911, -302, 84, 458, 638, 637, 1071, 716, -464, 117, 263, 311, -79, 225, -224, -400, -80, 42, 257, -132, 994, 339, -166, 172, 9, 204, 701, -48, 1184, -178, -84, -221, -425, -297, 1571, -1050, 300, -354, 664, 353, 454, 761, -148, -206, -77, -127, -1686, 508, -384, 817, -460, 565, 280, -299, -348, 72, -85, 274, 467, -474, -699, 498, 13, 464, 658, -693, 413, 647, 1253, -240, 405, 116, 40, -178, 731, -105, 57, 951, -706, -1481, 206, -576, -562, 1289, -803, 570, -50, 872, 1031, -252, -547, -155, 326, 120, 92, 837, -139, -140, 942, -932, -114, -139, -566]
6317e66R27K75l19p02k80R10n81J84Q65N05q51j137J182q07J316j398K61k98L05
6336b09R62p02P97j767J071q40P64o48K87K1k10J027o53p0J071o68l20l74L48
6355a13n9P37Kn98Q51q22K27o48L5K26p6J646j515oJ36n29R16n85J52k00M57p69
6377e35j55N38L88k25R16j035J61O55o73k35J071j09m70k4q93J53M39L65r0j26
6397A16Q9r43J436p06m56q21J456P49j686M55M95R39j474J807j201r90J190j47
6415C08j015J798p02m80p62j73K05L84k12L10K49R93j408N23P63p55Q46r53P26
6434F45Q84j861L33J23r37O06j80P33M91o78k58M23L40o54K77r64K172p43q52
6453a00n10R43r62Q00R9J76n40K54J77j92n72K67K59o67J360R7o85J93L70j469
$$ y = [-566, 361, 636, 317, -385, -665, 245, -336, -152, 713, 1218, 367, -770, 412, -395, 921, -477, -216, -514, -209, 753, 51, 848, -919, 152, -688, 76, -572, -285, -264, -474, 553, -100, -170, 901, 233, -87, -461, -113, -172, 565, 567, -31, 820, -2, 225, -423, -388, -162, -238, 1408, -107, -113, 23, -506, 410, -175, -23, -223, 234, -535, -690, -152, 236, 11, 927, -108, 53, 708, 35, -200, 871, 762, 292, 268, -625, -472, -33, 332, 242, 116, 205, -738, 698, -8, -464, -1285, 171, 920, -766, -311, 184, 1123, -351, 1456, 255, -735, 455, 308, -707, 1091, 389, -91, -853, -1026, -821, -437, -649, -339, -90, 903, -505, 18, 781, 26, 872, -81, 645, 1529, -332, 1, 124, -813, -207, -387, 346, 837, 159, -99, 324, 664, 10, 287, -677, 1495, 752, -100, -610, 333, -629, 171, 270, 446, -94, 160, 337, 145, -427, -160, 99, -568, 792, 889, 204, 397, 767, -702]
6473g02Q45n69R96j184L34l57O75k65O45j10l36j49J273o20P08m53l09o40J699
6492A481o43m63o57Q83j457Q9J344o21J26l85N70j26K76j42q7m09J55l08L15l56
6512d15O20n46N64L4K82l81L40o83K96L85m46l0K53o7Q0p7j130J470l61o3l70
6533b45L50l37p3M47Q17j106R58j298J100k28q6M53j801J381k61l39M58o07j82
6552e99P44K48p98P80p06j38O91l83Q0P80q90K04L81p97J70j32J05N08r6M40l43
6573B49l04K9N23p46p12P41K67Q4p5l3j96j72L3LJ92O1j22K22k98m03O09J89L4
6596A75O8l8m10Q84j508N21M93n11N03j93j81J72j61N28o76O21j05m08Q02q35
6616b59O77l47j27J36l5l20j37M15Q7L22j48p04L85l40L54L6J22J88m11J22J7
$$ y = [-702, 143, -426, 570, -614, -280, -637, 38, -227, 418, 308, -28, -177, 1096, 476, 1184, 731, 422, -218, 1481, 838, 375, -282, 601, -856, -767, 577, -44, 82, -303, 267, 141, 417, 275, 188, -221, -66, -374, -59, -415, 205, -341, 223, 257, 539, 158, 498, -185, 111, 496, 50, 20, 273, 206, 286, 209, -921, 549, 188, 125, -245, 105, -232, -305, 142, 959, -147, 811, -487, 613, 385, 299, 752, -1049, 332, 71, -268, 190, -417, -599, 145, 393, -405, 375, -331, -469, 222, -161, -81, 699, -191, 13, 394, -403, -233, -365, -260, 248, 152, 592, 249, -55, -26, 497, -249, -961, -220, 47, 131, 56, 23, -173, -345, -312, -309, -117, -56, -178, 44, -254, -657, -48, 141, 175, 243, 205, -205, 679, -829, -308, 185, -326, 177, -16, -197, -25, -186, 342, -334, 287, 182, -226, 576, -259, 418, 71, -56, 80, 45, -275, -412, 3, 90, 412, 264, -440, -55, -395, -41, -5, 117, 305, -106, 16, 33]
6637C3k04j44L97k83M65k57p27O39O27l57l30P28n36j68L50l62j81M73j59J84
6657A88k89l17J7O51j150Q65k2l1P18o10K41j13p38M48k60J010j46m34n34M66
6677d0P75j044k23O00k30J77m3K21K12j48J18j482J544j192J538n44J14r95R88
6696C46j113J025k29n48m44Q62J0m63P97K87l15N20n55n39O48k66Q9l05q7O96
6716D16k36J2o9m06N47n48q3L3J144p77m26J247q38l51o30M76N47l88R65p22K94
6737B07k70q04N94L52J19l64L89p33j35J048n23q55J834j682J633J49j406j49
6755e96O35m12m78M6J299m16K63j010n16J307k84q5N60o12R19N54j367K82J16
6774B05j034M98l27q62J610m61J061j603J384O77r08p24J206o6p50o44M6J381
$$ y = [33, -171, -315, 82, -201, 264, 7, -720, -81, 546, 189, -141, 587, 51, -117, 233, -129, -310, 163, 4, 188, -101, -418, -401, 250, -900, -35, -57, -88, 630, 20, 261, 148, -590, -142, -402, 608, 462, 28, -506, -40, 735, -309, -532, 68, -162, 15, -28, 193, 405, 257, 375, -1107, 437, -755, 783, 239, 353, -642, 346, -767, 258, 29, -519, -963, -101, -91, -554, 243, 530, 215, 735, 180, -359, 289, 23, 112, -193, -280, 416, 180, 192, 123, -283, 264, -284, -367, -334, 810, 33, -393, 854, 16, -335, -965, -489, 58, -330, 635, -87, 207, -63, -867, -273, 79, 198, -166, 223, -510, -645, 403, -120, -975, 859, -823, 810, 959, -447, -596, 39, -373, -851, -805, 494, 78, 341, -669, -1185, 122, -162, -247, 313, -299, 620, 1174, -193, 89, 205, -829, -331, -658, -1520, 90, -371, 690, -913, 471, 1148, 240, -484, 722, 656, -94, -738, -692, 689]
6792F89q16k83R04k71j48m31J046r64R15m98k28J671k052Q16R91k078Q37K23m24
6811a01l0m10J873j486j283K471j294r7O82m39p56Q8lJ334j077R60m95K72j079
6830h70J282J6j51k48O84r16k81Q88k14n27j73K45q23R48P64n51n08J477j515
6849d73J006p26J392j324J337Q39k404K50O17j043j62J060N42j674K14J368K8
6866H47l70J72q55k00m78K43n56J905j193P38K33l68j386O52K210j632n8k9J098
6885I73l140K740l98L4r96k04J357J9j290p74K128o13O34j50n63p98J641R16j342
6904A74J77o19j8O53K12k062K230p61J041n39k55O65q80Q14P52k125J23M75O15
6923F72q04J50j09L06O0J61M09j180j146K844p15j439K83K29n38Q8J657k015J907
$$ y = [689, -127, -410, 494, 223, 75, -356, 690, -274, 641, 143, -85, 1586, -466, 350, 1341, -737, 100, 323, -101, -131, -541, 1332, -154, -1437, 1034, -260, -357, 325, -114, -870, -782, -785, 549, -528, 432, -63, 209, -870, 412, 428, 277, 29, 713, -203, -484, 404, 190, -337, -510, -265, -1088, -140, 624, 73, -435, 1042, -473, 533, -193, 1199, -125, 1212, 2051, -353, -103, 514, -529, -691, 369, 911, -763, -549, 819, 847, 477, 649, -206, -406, -884, -641, -1197, 708, -485, 253, 486, 118, -1268, -616, 1594, -38, -96, -125, 973, -2167, 573, 175, 209, -787, -991, 366, 385, -905, -1679, 449, -164, 470, 320, -243, -1041, 600, 1516, 174, 351, -268, -286, 367, 579, -1483, 747, -14, 1027, 488, 233, 898, 18, 832, 1584, -541, -418, 57, 672, -132, 18, -91, 215, 275, 436, 845, -335, -1481, 1363, 648, -791, -508, -279, -817, -729, 928, -1087, 820]
6942H20j86r66j18l45L84M87m28J35M36m39l67Q03N53r06K49K16j421K662j428
6961A41P40o33m69o82J378j182R69l5j430J899o19K65p00M12k95o30L45O89l97
6980b34m20M53J134j564Q44o52J681n28j155M94Rl19J52J22O1m11M2J86l37J094
7000F52l10o3N75j502J16N12m44L90M9j91k63j48J206q08j1J16n9k9l01J090p22
7021a45k18l4M93J87J5N26m17K50q98M07L44o30j4K47r74P43j25P65r69N69k37
7042a15m99J390j165Q09p70O22o08j73J6K99k43J080n78J05m86P82p41n19J052
7061B58m81J038j353j92J134j030O02K1J20o91k05J110K57j060k03J80k57J207
7079D55l42j16Q93r34L09o11j98M36k3O87o98R96r59K91l62M30m71k43O74m63
$$ y = [820, 634, -332, -450, -795, -411, 76, -352, -217, 219, -220, -587, 216, 769, -137, 112, 328, -1093, 1569, 141, 881, 248, -221, -903, 475, -707, 262, 227, -1203, 696, 77, 342, -358, 54, -241, -871, -526, 163, -234, -654, -201, 933, -631, 213, -439, 1242, 714, -441, 53, 62, -257, -105, 17, 78, -333, -291, -105, -442, 652, 342, 279, 854, -648, -532, -20, -464, -74, -25, -216, -479, -627, 579, -229, -240, -124, -183, -212, -513, 577, -145, -363, -397, 96, 283, 298, 824, 407, 657, -241, 166, 510, -120, -134, 113, -861, -118, -243, 522, -447, 122, -115, -614, 776, -389, 420, -350, 272, -336, -509, -493, -194, -437, 643, 65, 170, -316, 466, -275, -794, 258, -223, 815, -538, -730, 404, -626, -24, -3, 117, -574, -779, 331, 588, -472, -675, -495, -752, 455, 113, -3, 890, -44, 265, -346, -544, -108, -131, 556, -142, 854, -105, 186, -176, 254, -217, -460, 214, -249]
7099b49m73k9r1O22k50J22K50Q7N69j113J101l53r91O65M20n44L36p1J25k22p1
7120a60J34m1J03j11K86j96oq1l6P3J61j34M2Q1J3j84K30J4j11j96K53j47n3j33
7144a99L75j95j00L8k78N59l53L99k35J5l52M21J3N0p6J33k97K43j48n3n7J76
7166G9k92K12j08j00Q5K03J86l54K60pk54j12J25k4J77O4j29J34n7l10K19K8J52
7189A77j1O0k91o7M66j77j96N6J03j11q1L53j17j99J67k91N5K54M9j58O8j15J27
7212A21j43J13J85k25N3j83K3K68j49j00P9k13M44n12J09L58j09k63O6K98l11
7233i1J07l04K86j49K52k89j3Q2K43k0k72R9j67L70j33J2l02J35J78j08oK51k05
7256d4j88j01K29R1J69k47r5J55O0J95o2j66k16J50L9K94l84J58M2k90P6P0R3
$$ y = [-249, -722, -751, -842, -220, -470, -348, -98, -11, 558, -555, 546, 193, -798, -133, 287, -257, 79, 8, 133, -89, -160, -26, -67, 36, -75, 211, 15, 9, -72, -108, -35, 126, -8, 34, 115, 128, -56, 174, 188, 77, -119, 134, -13, -66, -199, 176, -19, -119, -81, -359, 200, -153, 246, 11, 26, -326, 95, 108, 158, 82, 215, -82, 161, 13, -40, -97, 79, -213, -1, -109, -209, -124, 79, 265, -89, 171, 164, -90, -202, -77, -101, 76, 140, 11, 145, 88, -222, -3, 25, 177, 166, 226, -65, -132, 334, 157, -39, 17, 120, 9, -72, 281, 164, -35, 132, -159, -104, 150, 199, 41, 109, -6, 121, -22, 91, 276, 51, 104, -79, -56, 212, 63, -37, 42, -171, 273, -239, -130, 228, 119, -144, -78, 220, -91, 16, -288, -2, -151, 101, -188, -201, -119, 124, 104, -168, -69, -236, 134, 1, 13, -289, -154, 24, -84, -90, 161, -44, -232, -333, -104, -13, 156, -91, -186, -31, 29, 224, 162, -4, -220, -70, -31, 263, -121, 37, 79, -211, -135, -65, 28]
7279B8l81L09J65j92N2o2r1K08p2N6N7k42J50J69O6j20j21P0Q7k4J4j19M3n2L
7304Aq7o8K61k21J78j47P5L6k11L30l10K06q3J54r4Q4l4k01J09j25K27K6lq7k7
7329a1J8j10J61n46L61K28k83K64jk7J42k85j7M7j61K73q3p2J96J88j05k01R4
7352G0J08k86J56P3l51P4K55p6J96n5M8o5r0K15j28l24L43j91J77j47K7J36k44
7375g9J83j31K57m32N03m14j28J69J02l26K63q6J1L72k20Lj51J49j74K65j62l4
7397f0k01K41p7L10P0l93n9K66l22L78j93J8K51l37J23Qj59j01L02r0N3k24K95
7420I9j61N2M50m54k00M22k93M5N0j25K63n53L66J14K03k78o7J24m3j8j57m1j11
7443c13L56j36k28L58J63m38K37N0K03o88N83j45m6M5k2J09L2P2j35l35L72m20
$$ y = [28, -353, -44, 121, -71, -19, -81, -172, 36, -36, 20, 77, -165, -15, 154, 220, 100, -21, 49, 136, 112, 126, 7, 50, -2, 1, -86, -154, 107, -114, 64, -83, -8, 28, -183, 147, -163, 43, -40, 114, 20, 104, 70, -131, -22, -147, 80, 106, 103, 16, -11, 7, -103, 58, -488, -127, 101, -182, 82, 81, 54, 196, -89, -106, -59, -220, 53, -30, -102, 94, 282, 177, -24, 70, 178, -108, 48, 121, -230, -156, 99, 23, 219, 164, 212, 147, 57, 272, 144, -180, 163, -28, 149, 2, 29, 165, -79, 104, -27, 230, -202, 301, -113, -241, -72, 30, -296, -33, -119, -108, 264, 44, 47, -104, 45, -129, 136, -26, -60, -261, -20, -97, 213, 283, -110, -169, 97, -225, 153, -40, -22, 229, -108, 15, 23, -136, -237, 65, -25, 28, -196, 99, -62, -10, 440, -14, -214, 208, -85, -40, 10, -115, 148, -405, -39, 75, 278, 0, -67, 57, 14, -4, -161, -202, -313, 43, -93, -321, 37, 200, -238, -1, 49, 252, -436, 147, 2, -44, 1, -21, 88, 120, 192, 57, -278, 94, -326]
7465c26L23j92J09K36j00O4J7j06M6l87L53j20K06j73K3J05j50K29K4Mk18q2J61
7488D6o4k6k13K2L78l09J56N9r5Kp6mJ27j77M31j20p5j12P4k29K55n4m8L46k35
7513E9M9J07J65j61j56j08j6%n1J71n16K32L03l4m4J29j34j88N13k67K6q7K99
7536B91l54J47j09J5j05L0LrK03M0k16j22K02p8R5k51K60j57J6q8J48J33k07k4
7560a37J32j34K23j58K98k7k48J43J05L6j66J27k15k6K0l34L62j25J47m03J96
7581a84Q2j01l8K25J78l34K25j69K02j28O5p1j83K97Jk42K57o8j51J80m0j41K60
7604A22j90P8j17p6K2K96j54j65J97Mj48j41M11m6k50NQ6j72L31K61J18p54P61
7627D79j62k99j84N26o64L04j39L43j78m48L11r82J688o45j6m02Q17ok72K95p28
$$ y = [-326, -3, -195, -86, 150, 50, 114, 131, 25, 71, -316, 37, -83, 123, -50, -27, 78, -72, 157, 181, 185, -33, -115, 46, -18, -44, -257, -235, 143, -166, -10, 49, -46, -44, -120, -124, 3, -174, 257, 137, 62, -50, 24, -205, 50, -4, -52, 294, 59, 108, 215, 380, 219, 63, -45, -61, -61, -112, 59, -457, -225, 78, 44, 0, 129, -5, -193, 320, 53, 79, -8, 291, -63, 84, -25, -10, -115, -85, -82, -91, 112, 152, -64, -186, 16, -62, 33, -218, 42, -115, -99, -187, -39, 94, -113, -137, -5, -139, 84, -74, 224, 197, -51, 92, 197, 233, 67, 194, -21, -47, -27, -361, 1, -124, 23, -380, -184, -102, -203, -241, -16, 162, -172, 53, -116, 86, -42, 23, -48, -231, 66, 67, -175, 82, 14, -137, 43, 3, -138, 122, -68, 10, -107, -183, -161, 135, -19, -184, 13, 17, -131, -272, 139, 93, -157, -152, -66, -238, 93, 354, 472, -282, 479, 317, 18, -166, 360, -304, 0, -139, 204, 26, -422, -111, -1093, 595, -50, -66, -468, 349, 343, 71, 366, -362]
7648c62J96R2nl52M81j4k3L6O5k29k5P4K78k06r1R4k44J78R2j03k00K33lJ57k12
7673i3K08r8p3P0j34J88j06J79j19k40%J32J73k6j99K06j07L8J03k02P1L5qj54
7697a56J21M6o1Kk81K61l37K26J40J0j74K19p7J88j43Q2k51K93j44p3J66nr0M95
7721D57m29j43J96j49O7p5L4l0J91k93L01k68qJ06l6K13j42J00l16J84n5L8oL2
7745c1j39J86k09O5L2j08L4L44O6k46k50K76j86J89j84J19j11OL07k09M02j41
7767B12j2l87L84j80n26L61j18K95n8l0J59p8j35M7O3J27k39r0Q1M8K95k43j05
7790a29J24L61l14n1K11k27r3R8j22L71k20m8K23j93m9R5l11M44j22r1PK56k82
7813f2L09k3m0j95O1k02p0J94J22k71J99K4j34L8J08j06l23K80M5r0K79l84N40
$$ y = [-362, -166, -74, -79, -431, 50, 36, 13, 49, 114, -115, -140, -66, 212, 6, -85, 9, -235, -57, 35, -68, -268, -35, -38, 119, -93, 115, 17, -56, 14, -120, 68, -38, 141, 22, -218, -218, -86, 87, 61, -138, 68, -39, -1, 102, -100, -29, 6, -2, -156, -35, 11, -50, -48, -329, -68, -405, -179, -39, -29, -203, 16, -61, 127, -16, 66, -185, 108, -36, -109, 57, 52, -38, 457, 28, -115, 81, -68, -1, -76, -42, -72, 119, -174, 127, -141, -149, -43, -79, 134, -8, 92, -224, -40, -95, -57, -63, -31, -170, 16, -193, -128, -96, -204, -170, 174, 240, -6, -256, 20, -166, 23, -161, -42, -153, -147, 160, -49, 353, 212, 200, -187, 197, 17, -509, -148, -266, 29, -29, -59, 100, 22, -113, -66, -3, 124, -115, -205, -124, -76, 219, -24, -129, -5, 356, 42, -9, 202, -25, -118, -20, -142, 229, 9, -39, 184, -9, -58, 37, -274, 170, 48, -43, -36, 220, -62, 247, 224, 184, -11, 50, -152, -222, -28, 94, -177, 22, 46, -88, -50, 58, -48, -371, -91, -46, -136, 143, -241, 299]
7836B99m82J06j73J43L19l98N16n02N31Q6r47O75P6l57J79O4q41O95J82r31J043
7857B83J91p26J76N8j0J28p3MPJ13l90K41l8j17L94m09L75o65L19J74l5J4J27
7880A41j50p7L9Qmj34J01K31j33P6j34j54L28j04J5j67L2K82j74j11J19l04pJ32
7904a49J77j27n22O95j11j83Oj12k72N16k63K14R5M92P7o52o63J006J72M44j579
7925g39K80m13R69P7j99M8O3R4m37j44M20r8q32R85P6o5N13K26n96p74O68M37
7947E59j83M42j248m24P25O9k11P09p21Q03n11p61M35J461j209q05P37j74K17
7966i0o88P59J82o57O86k81j81L85M6m7q20O42l4M83l79J0k62q84J233o50P52
7987B05o54Q08r94k3J057k60n96O70l20j81M9n58J852j129N18r73m67Q25l11O94
$$ y = [299, -183, -77, -250, -107, 212, -186, 330, -172, 359, 445, -502, 173, 249, -108, 71, 135, -706, -11, 171, -760, 283, 474, -252, -76, -18, -28, 100, 27, 31, 38, 151, -239, 2, -36, -153, 241, -168, 207, -458, -139, 35, 0, 14, 141, -9, -86, -47, -39, -43, -177, -76, 155, 22, 98, -36, -190, 138, 34, 49, -118, -86, 196, 22, -89, 30, -274, -281, -149, 28, -99, -621, 74, -37, -220, -214, -326, -598, -82, -345, -131, -36, 456, 533, -119, -782, 224, 396, 840, -739, -459, -872, 97, 174, -25, 23, 86, 180, -257, -401, 19, -79, -911, 74, 150, 85, 598, 824, 228, -546, 122, 559, 376, 818, -430, -854, -129, -60, -271, 438, -283, 520, 9, -752, -317, 1144, -65, -870, -133, -307, -90, -778, -19, 163, -494, 192, -89, -270, 115, 161, 114, -706, -64, -98, 385, 6, 16, -246, -1130, 103, -547, 205, -449, 359, -635, -658, 399, 139, -457, 213, -107, -288, -239, -797, 1055, -74, 444, -529, -996, -171, -482, 212]
8007B12j63N1l19L65m06N57J26m64k33j29K66K8N16n62M39j17K62m67K19R59o65
8028D75o72L79n33r1N42l06N80m49L15J37J3k71l8n94q6M69K03k98k29O36n72
8049c90l00N89k66K90r5K95m27k1k97Q68p0o71J264q22k40m12J132Q9p88N12l40
8070a00K81j39m4J0n7K65j88J01L73l75J3J54l87R9l9K92l04j78K41J49k05k18
8092b56J67k4P6K16k57R6J35j05N3j44O1O2J3j72J32J58j47K0k15J16mR7j82j71
8116b75K81Q1P2k12j39L4K65k83K95L5k92P9K14j18K8j01K6j2o9N3J23J72m10
8139a53Q9k98L20j70K03k04J65N8R6J51k97M3J25q9Q9mk18J21j45J92l47K41q8
8162a20j0J92Ok27L04q9m48M20P5j51k8P3J58K0k13j18M71j31l76K92J09k39J27
$$ y = [212, 49, 100, -219, 146, -260, 297, 423, -41, -274, -403, -137, -109, 407, -155, 284, 167, 429, -38, 181, 1140, 475, -197, 182, -351, -442, 100, -206, 374, -75, 240, 377, 390, 119, 81, -513, -599, -130, 73, -225, -454, 182, -390, -690, -101, -367, -77, -172, 123, -304, -325, -622, 246, 176, -495, 769, -53, -293, -705, 427, 516, -272, 240, -100, 181, 42, -2, 8, -49, 216, 28, 129, 502, 127, 140, 294, -93, 6, -33, 259, -45, -223, 18, 167, -38, -256, -89, -113, -37, 179, -78, 18, 153, 48, 101, -43, 18, 80, 93, -79, 53, 211, 64, 84, -131, -15, -19, 78, -104, -275, 6, 87, 159, -53, -192, -158, 107, -176, 119, 154, -138, -59, 155, 37, 65, -36, -10, -22, -91, -38, 85, 257, -153, -64, -362, -42, -212, -9, -213, -48, 10, 106, 257, -40, 3, 128, 39, 128, 124, -94, 27, -118, 74, -273, -32, -120, -130, 62, 68, -159, 145, 56, -392, 28, 103, -48, -76, -3, 155, 175, -38, -156, 315, 184, -192, 100, 209, -30, 97]
8185I7m7k94L26l04L36j04
$$ y = [97, 50, -244, 82, -222, 114, 10]
8191A0
$$ Imaginary data points
##PAGE= N=2
##DATA TABLE= (X++(I..I)), XYDATA
0@%%%%%%%%%%Qj6J6j6K4l2L2m0N6o4P2q8J06j30J52j76K08k40K78l20L66m19M77
33B54n41O10o89P77q70R73j085J209j344J491j656J832k025K235k464K719k995
50a569L298l634M004m415M876n393N978o648P419q322R399j0701J2321j4401J7176
65I388k1090K7065l7420O0423k05138K8762K17404j37112J24073j09659j54491
76a97795Q2045Q0479L1183N6550j60835o3724J12346K6636L4932L7321j37616
87i8478m6845K0924N8950J27500k6176r9959l4029n4707P6999J03266l2765k7684
99c3004l2885p0050P1486J01033m2644m0830l5929m4077Q0384N0985J0375N602
111B0446j16914l6636R0165J9985L5352K4813q8763n4692M2901M1796L6737o72
$$ y = [0, 0, 0, 0, 0, 0, 0, 0, 0, 0, 0, 8, -8, 8, -8, 16, -16, 16, -24, 32, -32, 40, -48, 58, -72, 80, -96, 112, -128, 150, -170, 196, -223, 254, -287, 323, -366, 411, -459, 514, -571, 638, -706, 785, -871, 961, -1064, 1171, -1293, 1426, -1569, 1729, -1905, 2099, -2316, 2560, -2833, 3145, -3503, 3916, -4406, 4993, -5708, 6613, -7788, 9388, -11702, 15363, -22057, 38366, -166772, -138010, 79394, -57718, 66355, -43304, -197795, -115750, -35271, -4088, 52462, -108373, -172097, -59751, -33115, 1817, 39138, -98478, -145323, -124399, -65449, 62051, 35875, -64084, -98113, -152820, -75821, 27445, -5320, -33004, -65889, -135939, -64453, 36580, -6064, -46894, -82823, -126900, -46516, 4469, 14844, 20446, -96468, -133104, -42939, -22954, 12398, 37211, -51552, -106244, -63343, -21547, 15190, 14518]
123A4518p5344k0520K3548K7726P9232j7336r3747j9540J1546M6002N4946l053
135B7978m2544n6729j2193N6675N7094r622l3332k4550l2062M2441O3366m831
147C1691k2849o1693k7664O5423M4116J0999j3618o5193l8218M9184N6251R335
159C7764p521o2120l5488N8785K5066J4832O621o9121k6360L9204L6712K9912
171D8286j1634n3721k9670J8834K8658M4830J0035o6097k9888J6855L0618M1811
183D8917j3009l2093l0743j5768N6594M4227j8514l9157k9834J212K8583L8068
195C8483R951k6784m4013j3775M6283K0850j735l020m2446j4147K7209L3415K3775
208E4046l2798m2875n858J9714L4447K0719j1477m4810k2383K1200L0026K1986
$$ y = [14518, -60826, -81346, -57798, -30072, 49160, 31824, -61923, -81463, -69917, -23915, 31031, 27978, -14566, -71295, -83488, -26813, 30281, 20659, -12673, -37223, -69285, -26844, 36522, 31691, 8842, -52851, -80515, -15092, 29024, 40023, 26405, -38788, -77006, -27822, 28429, 37764, 30243, -31877, -67365, -8580, 16486, 31318, 37939, -31182, -57542, -18338, 18374, 48286, 36652, -17069, -46739, -27905, 753, 45583, 55618, -10479, -40367, -23512, 7106, 48917, 35908, 3815, -26928, -42696, 13898, 58125, 39611, 454, -29380, -28168, 415, 38483, 48434, 21650, -22363, -36138, 10145, 30995, 29260, 26240, -16206, -30353, -3144, 30271, 54046, 21248, -21627, -27485, -7771, 26676, 47395, 35918, -8892, -31275, -10075, 19951, 41937]
220D1937k0001k9408q493K645L2115J9443j2892k7860k9112J4998L2143J7715
232C3230O05k8690k3767j0428K6658L7882l996k6137k7086L743K5458J4099P601
245B9172k3993l3208j114L1244L1962j2847j6293j7248j9178J9359K6627J2992
257B7475j1113l4782j813J4652R861J3261l867k5433k2501K2020K9367P351j1078
270A3400l4780o356O898J5736L4963j4021l0637q957K320K2112J1959o980j3003
283g346j2321O5J5773K2582p831k3422j1543m839K4469J6783J306n615l3772o260
297c1971K3196J6705O682j8781j4115r04M954J9575Q138j6320k6754M901K1693
310c001N740J0661j0554j9417p199k579K9292J2468j6480p817q471O17J1774J7405
$$ y = [41937, 21936, -7472, -15965, -13320, 18795, 38238, 25346, -2514, -31626, -16628, 15515, 33230, 33835, 5145, -18622, -29050, -2392, 35490, 31494, 5357, -21729, -17986, 7472, 21571, 29172, 5179, -28029, -29143, 2101, 34063, 21216, 4923, -12325, -31503, -12144, 14483, 27475, 16362, -18420, -20233, -5581, 4280, 17541, 13674, -11759, -34260, -12240, 17127, 24478, 13400, -21380, -27736, -20838, -5102, 29861, 15840, -14797, -23754, -21434, 678, 12637, 5657, -7346, -19667, -19602, -3829, 18753, 10922, -12500, -24043, -28882, -4413, 12370, 13676, 8061, -25711, -31971, -8775, 7930, 14612, -4169, -18284, -19188, -14234, 5341, 13479, -2841, -29595, -24694, -3001, 2739, 13400, 2846, -16571, -23770, -26349, 2943, 15411, -1069, -8886, -17357, -16740, -4966, 12439]
324A2439n87k5834r654R629K0629Q862j2085q805j6547j083K5328J1567n32k0698
338g371q495N652L868J3147J439q566j1201n153J7322J0947m24q601j6089J474
352a2051N807J6645J2169j5025j6355q856J6189J3776j192J55j2623q004P890
365a475J2506J0080j6328j2927M284L167Q975P942K386j4731j6115R106J2384
378I254Q969l082q176m587j0500J3930J7218q362j2748p685R838J1047N021L200
392B3337j5488r903r24J2346J5335q552l831m804p808O781P097N578n015j0833
406C316J334L755J1638n85o805p473r456J1170J2990P067o620j8346R55N125L392
421A1457Q836m467m865o279K419J2154j499n877m873J194j858K501J8026n419
$$ y = [12439, 11852, -13982, -23636, -14007, 6622, 15484, 3399, -5406, -21953, -23036, 2292, 13859, 13327, -7371, -15866, -10214, -6346, 6801, 8240, -326, -11527, -16680, 642, 11589, 11165, 2564, -13525, -12051, -6244, 10401, 22570, 7545, -8810, -17666, -1477, 12299, 11107, 11262, -1361, -9365, -1475, 11031, 21111, 4783, -8144, -3860, -693, 8282, 16224, 18610, 3879, -12236, -3130, 9254, 18223, 15141, 6965, 2378, -8122, 5808, 23026, 14664, 1916, -5769, 4069, 15116, 20137, 23337, 7849, -2054, -2978, 9368, 24703, 16151, 12320, 7516, -292, 6489, 13586, 19164, 14149, 3316, 4650, 8405, 20043, 19458, 12653, 5180, -4276, 6894, 19884, 26951, 20331, 1985, 2940, 8065, 11457, 20293, 15826, 10961, 4682, 7101, 19255, 17756, 11879, 7006, 8200, 6342, 8843, 26869, 21450]
435B1450j3718m871l652J1173M950K656O54j4011m555J0877Q795n512r561J801
449F476k328N113R739k129n564j3760K258R907J853O616m109m816n298m051J0656
464A0563M104n070n258j912K856L615P469o078j1458r54j655J5361Q583j3528
478F638m555o65j802K693R800q22j1268K723n89L826N496j0195J073Q5r777R904
494B565J2912n538j0982Q56k246k736J3081J27n706k160p632J0568N047j0548
508b392J276Q09k495Q99J0617o08j1212J010k313j197P238J530J557l019p197
523e497J151N169L969n678L21j12n421J0357J858o065k737o830N431P487m52j962
539I89R3j451o852M664N138l938J570k047L214k277k266R206m649o131J07K996
$$ y = [21450, 7732, 2861, -791, 10382, 15332, 17988, 18642, 4631, 76, 10953, 19748, 14236, 4675, 6476, 4148, 9261, 19000, 16871, 11307, -2453, -195, 9712, 11565, 18181, 14072, 9256, 3958, -93, 10563, 14667, 9597, 4339, 2427, 5283, 8898, 16367, 10289, -1169, -2123, -3778, 11583, 20166, 6638, 2083, 1418, -384, 2309, 12109, 11287, 19, 2742, 2153, 5979, 11475, 1280, 2353, 2438, -7339, 2565, 15477, 9939, -1043, -187, -2433, -5169, 7912, 8039, 2333, 173, -7459, 3109, 8156, -2392, -1116, -307, -2802, -1903, 8714, 8106, -3106, -2096, -4409, -5606, 1632, 3162, 4719, 1700, -5497, -4346, 823, 4792, -886, -565, -677, -6098, 4259, 6117, 52, -2685, -9515, -4084, 3403, 2951, 989, 1082, -369, -7221, -2557, 2581, -1357, 213, -1834, 1380, -897, -3163, 6043, 1394, -4737, -4630, -1634]
555a634P356j489k906p48n932j512P323R158r075m039O443k854O66K328k437J704
571B352n642K35Q789J882m727m029L278n866L3J4008j685o132k506k436O602L151
587G307l669j304K67j934K479J0388p424q670N259k312N143L723k436J333l894
602D256l239K541M876j654m205N673k047k573O205k61j545o170O4O092J880J584
618A1477l702j62l084l013J0579j087o545L592L29L32m83o52N56j676r40J937
634G458M721k062k212M203p047q34N160P97L731m809k135K860k007J320J514k112
650H546k392K164L120j120J167m775l26N239n841L537M278m730J417k195j184
665F905K389o52J877L26l153k774N077L468o923Q19j92r57M436q54J774l663m191
$$ y = [-1634, 5722, 4233, 1327, 579, -5353, -6865, 458, 9616, 541, -3498, 2945, 91, 757, 3085, 648, 2352, -3290, -3055, 5734, 7616, 2889, -1140, 2138, -3728, -3695, 10313, 8628, 2496, -10, -2446, 4156, 7307, 3638, 2334, 2601, 667, 3146, 13534, 6110, -2560, 2699, 387, 5530, 9253, 6817, 8150, 4256, 1017, 3558, 8434, 6780, 2575, 8248, 6201, 3628, 9833, 9572, 8027, 1857, 1921, 8013, 9893, 11477, 7775, 7613, 4529, 1516, 12095, 11008, 4463, 8055, 8384, 8716, 8233, 7581, 8137, 6461, 5521, 7458, 12179, 10117, 7905, 12108, 5061, 4227, 9387, 10184, 13915, 9106, 6971, 9831, 7824, 9144, 10658, 8546, 6154, 8318, 11438, 10318, 11485, 6710, 6384, 11623, 5782, 9319, 13597, 8867, 10284, 8089, 6905, 9294, 8642, 10519, 10845, 7692, 4918, 9995, 13463, 6540, 7359, 7167, 6210, 10646, 9792, 11566, 7903, 3712]
682C712M561J572j196k135J415J933m643J539K686j298j476j526K490j629L73
697F378L850k856j929k956K418N144l833p9m7j575J528L61J670l312j681J737
713D818O51K371m173J95K567m306J104J177O39J001l063O79k17p82J139R87K02
730D989n647K697M450k718O5l082M26J131r23L862j397k803k69J393R71l559K587
747B173J980l011%o83J517j93k494K380j560j91J894R78r6n042J365J983p54J036
765A282j089K85k77j816K811p96o77N6J504P64l055J646l36j101J239l621L786
782F05Q63j758K458k031j807J27J454K036k369j273J614L190k906k436K731k416
798a918m19M110q16r7j426n66L255m041K55K561j7j229o98K543k493P18J256j421
$$ y = [3712, 8273, 9845, 8649, 6514, 7929, 9862, 5219, 6758, 9444, 8146, 6670, 5144, 7634, 6005, 6378, 10228, 7372, 5443, 2487, 4905, 10049, 6216, 6137, 6090, 4515, 6043, 6404, 8074, 4762, 3081, 4818, 5469, 7840, 3667, 3862, 6429, 2123, 3227, 4404, 5043, 6044, 2981, 3660, 3443, 2661, 3800, 4787, 4989, -658, 2039, 6489, 3771, 3836, 754, 1180, 2311, 1388, 5250, 3853, 1050, 781, 2174, 3145, -414, 2173, 4153, 1142, 1142, 459, 1976, 1783, -711, 1669, 109, -82, 1812, 2790, 2694, -2348, -983, 1000, 246, 1282, 193, 478, 201, -1615, 1196, 400, -277, -221, 1283, 2047, -1008, 638, 302, -799, 440, -3181, 605, 1468, -290, 2168, 137, -1670, -1543, -89, 1947, -422, -1695, -81, 3109, 203, -2233, 498, -1918, -2337, 1773, 957, 860, -566, -1132, 2123, -1918, -1663, 898, 881, -348, -1046, 1497, -996, -278, 978, -443]
816d43J408k182K896J593m120l92L24J099M66n10O88p55q82K302k70n12j639J858
834I29N37j235J069j162K102q50k656J883O1P51J439k015O06k097O55K935j678
851A274q03r87L602j287j163J310j682J21J363J82Q93k173Q14J474j839p85N30
868H44K184n37j949J866j204l50K74O21O30l274K592J576j137n93j439J847m66
885A485q79K131j303R2m71R29M59k677J608O25p22j1j428K262l07p50j75q69J684
904A683p39J207L32k873P40J090O56j314j804K027O44m88K18p27O91k340J553
921E56R65k060J167L54M59q48k458K403k74K95j81l32J586k976J928P19l194K94
939a597J182J778j219j068J235q30k52m45J07J422j712J682L57k722J066k7M84
$$ y = [-443, 965, -1217, 1679, 3272, -848, -1240, -916, 183, 649, 139, 827, 72, -810, 1492, 1222, 710, -929, 929, 1466, 231, 1300, 138, 2240, 1390, -1266, 617, 678, 1429, 2868, 853, 1459, -638, 17, 2952, 1274, 471, -516, 3086, 1799, 636, 1946, 264, 385, 1748, 1930, 2823, 650, 1464, 2938, 1099, 314, 844, 3028, 2491, 542, 2408, 1204, 854, 1128, 1749, 2379, -895, 1697, 3273, 2136, 1543, 104, 1951, 1485, 606, 2737, 1434, 1526, 1055, 1984, 2443, -234, 1374, 1999, 1277, 1266, -162, 2100, 1793, 1043, 868, -1, 1683, 944, 2151, 2483, -390, 350, 1440, 2096, 782, -1022, 1005, 1649, 1161, 1379, 652, 1343, -997, 556, 1521, -539, 628, 982, 1441, 593, -1865, 538, 264, 559, 378, 46, 1632, -1344, 584, 1303, -1891, -1597, -415, 1363, 144, -924, 311, -519, -771, -1216, -1109, 313, -1399, 283, 640, -2082, -1016, -1043, -559]
956e59n86o10J378r9N90j068j201J45r23K168Q5m28j10r68J527j066j940K024
974a641O7L89l28k7M96j717M86N3j12Q1j02L256j953k603J423j70N07p77P58Q28
994a086j548J439k13p35j328m78L062p49j081J258o42j58j250J062R8p84K151
1011i82r33M3n19j251J957m41j527Q70R08P60r73k90o76p82J674l34R26o15j338
1030c523K195m16j493P5K19R70p22R91m74n68P30j116O54Kq59K691n76j212m27
1049b859P69M21j338J190k64j12R95j107J218j650q21K769m53r35J97L50J49o62
1067b143O10p23J14M35J92J754k457n77J866j041P84l61p64J539n92j97M56l93
1085a498o58N28J299j513N24P88r50R14j555P7J958j692M58L35k22j86j06J042
$$ y = [-559, -1145, -1755, -377, -476, 114, -954, -2155, -2010, -2933, -765, -680, -1108, -1218, -2186, -659, -1725, -3665, -1641, -1574, -1185, -1513, -1540, -1044, -2761, -2275, -2222, -2334, -2253, -2355, 901, -1052, -3655, -2232, -2402, -1895, -2672, -1914, -1086, -2634, -1195, -1408, -2143, -3471, -3949, -887, -1636, -2717, -1459, -2101, -2259, -3509, -2447, -2349, -3133, -982, -1915, -1872, -2391, -3642, -1685, -2126, -3653, -2783, -1875, -1115, -2088, -2378, -3054, -3836, -2162, -2496, -1570, -2185, -3523, -1328, -1744, -3237, -3162, -2943, -1973, -2695, -1704, -2178, -2746, -2016, -3132, -2478, -2476, -3335, -644, -1220, -2432, -2859, -2090, -1669, -3007, -1817, -2081, -2193, -1198, -2305, -1087, -2737, -3558, -789, -1242, -2177, -1980, -1630, -1481, -2143, -1533, -2256, -2142, -1707, -1515, 239, -2218, -2795, -929, -1970, -1186, -1547, -2311, -772, -1364, -1561, -1105, -1498, -2156, -1628, -329, -1842, -1318, -530, -1480, -566, -2121, -2044, -86, -1778, -1320, -985, -1207, -1393, -1499, -457]
1103d57j246l68Q23N30Q54k378Q30R63j401Q13p4K63r25L65J426j173q14R80J72
1122h17K32j253N90Q08l57J46q94R20r66L4J866j710j5M81l83R27j130k62Q99
1141h84N3m28K27K72j156K16J687j765R17p36K28J759k078K34N49l31nk94M21
1160a114m08L33M67m25K5j375J184J143j960O45J90l31L05m50O24o13M0Q21j69
1179a068m0r03M96O99j591R39k13K06J77n90J139j618j14J462p95M00p19M05O71
1198a057r47k9k4L45M1j97O55r53K61K79k49M5q49Q62P79j142O07q29P29K10j016
1219b479J119n93j80O11M5l62j231J067P15k36k70q42J117l80o87J448j178k42
1237b558J007j9j32q76P08K08k79k87l68J316o68q8L36p73J90J65O24P0j095O44
$$ y = [-457, -1703, -2071, -1248, -718, 136, -2242, -1412, -449, -1850, -1037, -1111, -848, -1773, -1408, 18, -1155, -1969, -989, -817, -585, -1838, -1248, -440, -797, -651, -1545, -625, -1591, -1557, 309, -1401, -1416, -935, -1318, -391, -1521, -1783, -884, -831, -1259, -1032, -760, -1916, -1700, -13, -1778, -861, -1597, -1369, 390, -1688, -1454, -905, -1236, -1241, -1535, -1114, -1522, -1189, -722, -1147, -1122, -2497, -1313, -170, -2130, -1485, -1295, -1626, -1321, -1771, -1147, -1760, -1720, -899, -1068, -1108, -2011, -1515, -816, -2407, -1468, -1681, -1475, -1298, -1888, -749, -2367, -2481, -1019, -1814, -1414, -2133, -1728, -1057, -2004, -2033, -2057, -1712, -1671, -1868, -1213, -2166, -1905, -1626, -1875, -1830, -2679, -1817, -1038, -2180, -1573, -2402, -1673, -1463, -2479, -1360, -1953, -2133, -1522, -1477, -1839, -3070, -2003, -1288, -1524, -1794, -2636, -1519, -1899, -2586, -1138, -2316, -2558, -1551, -1570, -1702, -2578, -1870, -1662, -1941, -2228, -2596, -1280, -1948, -2036, -1700, -2473, -2283, -2118, -1494, -1424, -2519, -1875]
1257a875K38r1j37n30N38M8JK79o3J43n26M16K64j107P38P7K72J50j137R32l43
1278a713j93P01o19L00m04P39J75p05J0M99L53m24n86J063k36m10N8k21M20k72
1298a465Q81J75j143M05J56q9Nm77N09j97K38N56l47m2l70M14J22o71O59k80O21
1319c40k67n17L42n68Q45j56j64J87k97K68L25l71j39J73N39j54k59K91j47J23
1339b86n44P3N07p06R88m5n70N3k45Q45n25o1M92l18L63l72L25l68q51J090L88
1360B33j99l60J46N16l79l62J73m08O46k45N63n62l98P49k09Mk62Q1Q90m43j33
1381D1J04n81O70j46p2R8l34N79p2J14n12n48R10k62N0l4j24N43j44j98k67k35
1403d20P74k92M54o45m8Q93o30K50q10P55n8n58P86J18q52k48J646n97j38q33
$$ y = [-1875, -1637, -1728, -1865, -2395, -1857, -1809, -1808, -1529, -1592, -1449, -1975, -1559, -1295, -2402, -1664, -1587, -1315, -1165, -2302, -1370, -1713, -1906, -1205, -1824, -1524, -1928, -1189, -1014, -1719, -1709, -1210, -857, -1281, -1867, -804, -1040, -1450, -1392, -1613, -1193, -1465, -584, -409, -1552, -1147, -991, -1080, -1075, -1552, -1043, -1240, -1002, -446, -793, -835, -1205, -791, -669, -1340, -681, -961, -340, -607, -1124, -782, -1350, -505, -661, -825, -638, -935, -667, -342, -713, -852, -679, -140, -294, -553, -262, -409, -286, -830, -757, -250, -956, 32, -13, -583, -530, -775, 70, -455, -516, -24, -342, 21, -351, -26, -394, -1245, -155, 233, 34, -326, -180, 336, -43, -405, -232, -640, 6, -239, 324, -238, -636, 113, -96, -92, -354, -273, 617, 174, 41, 145, -436, 234, 88, 16, 114, -220, 359, 287, 401, -111, -659, 251, -11, 39, 5, -119, 424, 280, 82, -185, -420, 354, 62, 516, -129, -177, 716, 86, 336, -474, 281, 223, -335, 451, 569, -283, -531, 1115, 518, 380, -453]
1423d53J090o21N94k55j16J47n62Q7K09L46r55P33J51j201l01J283J288q46K81
1442H99j36l14k67j65J464j383R6N27N50j218k22n99O44L89j59o16J554j547Q07
1461C04K38r26M83n9N55L21o11M20r36L05n97J048Q70j145K47k10N86j129N94
1480C58J43j550P62K93l31N62N69m81L24l79K43j32l36j61J15M23m80k2J100j95
1500H25k98N02q13K52j32P26k53j02l96O52Q15j699l20O98M40o14p85O57J123
1519A278r11L58p1j93p01k28J514o94Q5p7O31r38j19J034j118O54k31L29K80j048
1539a66P3J280p56j47J06k01L12k94O89n28k73R13m89j15L20m14N77n43j29K55
1559D70K04J40o94P59n70J89K3K00m6K03l57M55o37L07j71l34L17l14R72p49N05
$$ y = [-453, 637, 16, 610, 355, 239, 386, -176, -89, 120, 466, -489, 244, 395, -806, -1107, 176, 1464, 618, 899, 763, 449, 182, 17, 1481, 98, 194, 721, 1271, 53, -169, -768, -124, 265, 106, -510, 1044, -503, 304, 542, -384, 99, 40, 595, 916, 305, 725, -211, 94, -503, 545, 1415, 270, 517, 307, 893, -236, 358, 501, -1049, -287, 6, -325, 237, 806, 325, 649, 270, 513, 381, 45, -116, -1, 422, -58, -80, 1020, 825, 527, 1029, 216, 468, 336, 1062, 809, 707, 311, 963, 1778, 79, -241, 457, 897, 283, -502, 155, 1278, 367, 725, 654, 461, -240, -468, 1046, 352, 437, 360, 991, 53, -66, 968, -150, 504, 273, 602, 882, -166, -93, 1187, 431, 284, 390, 189, 501, 207, 896, 368, 95, 1008, 519, 404, 724, 310, 887, 344, 215, 470, 674, 814, 120, 879, 309, 498, 521, 721, 675, 878, 521, 976, 339, 646, 475, 141, 458, 144, 1116, 367, 872]
1580H72k91k96N38p5o04P75m22L2k2r9L27J89p08M88k02N65p4Jm1q22L64L57l23
1603E29j93R0R15q15j41J0J122j206L19N29r60K40N05k44K49l22N37m58m79P21
1623I48l83m8J17P31m67j76o83P23o99K59M3OJ28P2M3j2n1L3j80N10o51M32n15
1646A80Q29O0r84K18K49l89M36j04L5j32K68l43L16o4j13Q3k29j21J52k38P4N1
1668B34K99L2m81Q22m91k1l74L27K56j49J38n06R9k3Q86q55K59M96j554J165K15
1689G74p52m8R8l31J174o63l91O3J65q69K95J538p00M30Qp40K48k72O71r0q52
1710b44J080j64m9J5q64Q18o69M82L01o52K45l26N52R06j513j18K28K66K43k11
1730C26j83K85J19J33m73J72l7JN29m46N9jn18M13J71m70Q9M26l41K32m1K85o39
$$ y = [872, 581, 285, 823, 748, 144, 919, 497, 529, 507, 408, 735, 924, 216, 704, 502, 1067, 993, 994, 953, 131, 495, 852, 529, 336, 426, 1341, 526, 385, 395, 1517, 311, 630, 1159, 199, 439, 944, 700, 949, 627, 1164, 706, 227, 948, 565, 517, 634, 1365, 898, 722, 39, 762, 63, 322, 365, 371, 499, 571, 614, 602, 551, 584, 404, 914, 263, 695, 180, 1009, 1069, 85, 303, 552, 163, 599, 495, 530, 398, 666, 323, 639, 575, 462, 545, 316, 195, 347, 109, 183, 234, 533, 565, 84, 906, 415, 394, 20, 347, 603, 454, 592, 86, 185, 162, 1048, 193, 452, 948, -606, 559, 774, 22, -26, 72, -259, 915, 252, -139, -76, 89, -780, -485, 1053, 353, 783, 791, 51, 299, 27, 698, 608, -244, 836, 672, 623, 638, -226, 592, -77, 405, 706, 54, 299, -27, 525, 1431, -82, -200, 28, 294, 537, 326, 143, 428, 547, 680, 207, 379, 342, 343, 872, 426, 485, 484, -34, 379, 550, 80, 169, 595, 254, 486, 445, 730, 91]
1753I1q2L48n98N32m1j84K08pk83M33J06k29m10m7O80l78K0o6K45r5K58l30M67
1776F38r23n1N18l25L23K15PJ08k22m55J54l82R39o07m5N27M03o30J80p4l0L94
1798F62J52j120J003k78k95Q6K05J0N9O35l06j85j34q11R03r62J03R11k38m03
1818cj00k41K15r3M33l74k34k90J474m73N41J48m2o82n20J92n0J83k1K39p80O7
1840d11l3J52Q26J10o17j53L89L42r10o7J39Kl47L90K10J63o52J035K25j008N22
1861C07l95j01J66J17L33j22p10M92k66m23K27M55k48J039j293J68k47q5O03R33
1881I50j096p02O30K90N08m69l26N20k57m20O16q99J90J68j50O01R7j12K75l57
1901E7R9p71K98N48o5j90K95o04n7O10l55p1pJ19J04j12K61k55k36P34q65O1M00
$$ y = [91, 9, 357, -241, 291, 250, 66, 274, 267, -16, 417, 523, 294, -116, -163, 517, 139, 159, 93, 338, 243, 501, 171, 638, -285, -336, 182, -143, 180, 395, 402, 510, 288, -167, -13, -395, 544, -63, -108, 419, 822, 192, 372, 298, 268, 662, 814, -306, 697, 419, 124, 210, 415, 425, 484, 1119, 813, 628, 494, -317, 586, -376, -273, 638, 400, -3, -103, -344, -129, -222, 211, -163, -397, -687, 787, 314, 855, 1003, 961, 279, -241, -49, -99, 84, 63, 302, -478, -411, -444, -292, 534, 644, 27, -126, 263, 605, -305, -372, -233, -231, -578, -188, 22, 185, -467, 568, 793, -215, 307, -88, -189, -23, 94, 427, 305, -405, 87, -179, -602, -375, 80, -168, 871, -422, -254, -501, -586, 17, 950, -146, -848, -218, 72, 580, 111, -215, 305, 48, -372, 244, -655, -465, -297, -447, 154, 251, 139, 414, 57, 156, -615, -317, 231, 166, -24, 271, -333, -390, 220, -135, -206, -213, -94, 10, -102, 159, -96, -332, 402, -463, -402, -2]
1924bK04k51m95O56Q3j88L30l75J82l01L39n35m1N77m33k58R70p54K72j13M17
1945B84q60J241m23J07J30k43L10Q63j621m90J234J81q14K73K8j87N35p77p06
1964i35P83N12q39J03N59k85q4M42r06k63J290j80l29M82l37Q1n21k0l26M64j004
1985a313J548m5j075J097p52K25k83L9M68m11J46O45q69M18p84J199l2j63k44
2004a86k04n43N33l9R21p07r38M31P31l45O40q25L85j97l11N26o30J72j68P55
2024Aq14L00k6J86o73L50O96K53j170L46L55J0j4L10j135J136o19L87R14j367
2044e74J163r17j1Q8o69Q22M51j239K7l68R12m15M68m68m9L55L34R10j014o8L71
2065A09P9p15Q58m82J09K10n75N8o9J81j77K99l16j08M19j10k9j79j35M34m8k48
$$ y = [-2, 202, -49, -544, 112, 195, 7, 337, -38, 144, -157, 182, -353, -394, 183, -250, -508, 462, -292, -20, -133, 284, -576, 665, 242, 349, 479, 236, 546, 1409, -212, -702, 532, 713, -101, 172, 200, 13, 548, -229, -935, -152, 360, -479, -376, 183, -102, -186, 256, -650, -913, 377, 197, -132, 350, 13, 94, -427, -447, -773, -309, -1313, 235, 190, -885, 212, -540, -315, -598, -559, -91, -502, -356, 289, -580, -162, -946, 253, 221, 58, -186, -390, -933, -400, -439, 482, -225, -1163, -732, -1, -346, 294, -531, -146, -343, -654, -128, -758, -586, -754, 1, -813, -513, -539, -353, -1026, -676, 20, 273, -897, -551, -196, -186, -200, 110, -1025, 111, -508, -121, 793, -574, 589, -328, -339, -251, -920, -98, 353, -886, -859, -1227, -315, -730, -262, -730, -779, -424, -90, 820, -194, -262, 109, 188, -527, 331, -151, -42, 168, -407, -349, -418, -237, -414, -115, -431, -539, -120, -230, -259, -438, -573, -139, -187, -435]
2087d35L91k03J95k26j92K39J32j03L4K13l65K64j72O2M8j07R1j64J55Q8k29J45
2109a39J37k03O1m7K1j10J45L7J49j35l2P2L0k75L0Q0k22K39k48K61O5j10J40
2132e4m75K90l75M90j58J03j53n7J85J59m51M85k34J82q7j70K70M0n0m3J72n57
2154d88K01J59L7k10K6J03J27O4J2j78k72l7O07j25j18k4M4j06l03J84l3M4J20
2177a66L53o22N24m38r7L44k7j61kN34n06J57Kk5p8j8J28k46J58r9l8J09P4O7
2201g3P9j81j81J91J25n2n0j1j42L28k06j84J13p7K49P5j9l54R4J83J89j15m5
2224f4l44L94l66M8Q3M9N4j54K86j33j12m9J10J86j37k64M6L49L4j77j6p3L94
2247A44k43o3j33R2M3j0K71j30M5k21K8kr5n1L93j93j83J98J06k09P5K9N0P2k51
$$ y = [-435, -44, -247, -52, -278, -470, -231, -99, -202, -168, 45, -320, -56, -228, -166, -118, -225, -134, -298, -143, -55, -284, -139, -2, -205, -144, -191, -170, -280, -135, -98, 51, -84, -116, -44, -14, -289, -259, -179, -401, -162, -410, -149, -84, -194, -54, -529, -239, -614, -124, -282, -179, -332, -389, -204, -45, -496, -11, -245, -63, -150, -320, -50, -10, -60, -103, 69, -488, -287, -128, -91, -301, -275, -172, -45, 19, 31, -147, -419, -456, 151, 26, -92, -116, -72, -178, -481, -297, -330, -286, -166, 187, -435, 89, -349, -446, -102, -129, -290, -292, 242, -264, -107, -105, -130, -208, -226, -98, -344, -186, -285, -323, -214, -140, -73, 6, -175, -356, -165, -40, -92, -142, -153, -295, 33, -173, -357, -244, -321, -72, 3, -16, -370, -276, -93, 96, -19, -64, -408, -14, -380, -332, -249, -200, -146, -300, -14, -147, -259, -308, -198, -12, -149, -413, -367, -18, 16, -161, -177, -250, 144, -99, -162, -295, -203, -160, -170, 101, -29, 16, -205, -177, -179, -274, -325, 68, -125, -308, -110, -4, -213, -138, -109, -59, 13, -238]
2272b38L20k13m5L7j5k5j27j53O75m98L59J54l29k34L78j90J35P8l0q0J12j49
2294g8pR4N4P3L5l23o9L17k43L52m49K35Q0J02m06J82j06N9K15m6j39J47k26L54
2318B07J31l76L8J47k83K01k54M19l12%N8k0J43n53P87L1k75k88K02j23q8K94
2340H6K2k29M36k6m15O12n68k47Q78J43n70L4M58o20J45k77K61J5k43K17R1j46
2362E7j73Q9J2j60K41M4J41o2l37K01K80m07J2J50K32j01k29J07RK8J35l2l37
2385a00o0J82O8K29o56K62j8L55q4jOm6L09n15N0L6j38Q4L78k52j06N8k6l0j9
2410c4L30m41K13j69K92l59J6K52L3j35L15j11J22j1J64m87J35K22j99J13j32
2431A29r8l5K00n6qm4j86Q2L97l02l12L79K42k44o6J27k53L35j64R4M8l44L36
$$ y = [-238, 82, -131, -176, -139, -154, -179, -306, -459, 216, -282, 77, 231, -98, -332, 46, -144, -9, 69, 39, -41, 71, -78, -85, 9, 63, 136, 171, -152, -221, 96, -147, 205, -244, -9, 71, 173, -233, -51, -157, -98, 117, 71, -68, 79, -147, 207, 338, -38, 0, 147, -136, 65, -189, 230, -82, -82, -24, -44, 99, -454, 333, 364, 89, -199, 3, -120, -208, 86, 108, -121, 315, 289, -126, 486, -82, -329, 549, 692, 122, 156, 614, -6, 139, -138, 123, 138, -105, 112, 203, 57, -116, -27, -15, -175, 66, 110, 251, 189, -148, 53, 333, -74, -62, 88, 320, 219, -10, 97, 106, 134, 269, 237, -100, -160, 22, 90, 319, -337, -75, -93, 262, 178, 177, 183, 137, 446, -69, -19, 17, -121, -37, 341, 89, -17, 41, 15, -15, -34, 296, -145, 68, -101, 191, -168, -152, 100, 133, -2, 313, 202, 324, 313, 477, -10, 125, 347, 148, 261, 129, 31, -4, 196, 140, 132, 88, -98, -16, 381, 79, -233, 146, 388, 144, 78, 205, -48, 287, 123, 217, 265, -79, 257]
2454B57J72q1j93K2J19p7L8J8o4k10L62j19Jp0j59M8j09R7P4Q6J21k29K49n45
2478a92M33J02k14J84j30N8k5j52r8J54l26K47L65j13j37m9J13l4K1k15J97l7
2500A52j63K14J47l74L71nJ0l11J34J69l2P7j48j20Q7M2j02q2M6k6k61M67J53
2523D45j93n9Q9k09l37K23J27L92l19JP8Q7k27J54Rk2j82K71j56j6NP6K4K8k82
2548GM71j44J35j58k07J4k24L78O8k41j28M49k13J75j64k45K07K35j09k59m4M70
2570D73l00L99o40Q0K55q3J42q6P1Q0j02K3j60j23K06J7K85k46M3P8k31J70p5
2593B76L7J87n48K77j64K08j62J84J33j41j21J98j22n5r1m1K43l1J28l1j99J5
2615A80L65k20n4j21k47J92Pk12M04p2k36M03k68J61r6J06J09j63P3o3l2k36j38
$$ y = [257, 429, 348, 155, 177, 296, 219, 257, 275, 211, 1, 363, 244, 245, 175, 16, 64, -45, 52, 126, 212, 333, 104, 353, -192, 241, 343, 129, 313, 183, 241, 216, 64, -34, 120, -206, 41, 406, 293, 156, 107, 220, 186, 207, -8, 189, 152, -11, 203, 350, -24, 347, 342, 352, 41, 175, 344, 312, 389, 241, 121, 208, 250, 148, 66, 112, 86, -175, 292, 445, 252, 193, 282, 73, -264, -41, 86, 478, 159, 160, 238, 325, 98, 252, 261, 239, 57, 328, 172, 156, 161, 237, 261, 289, 7, 478, 334, 469, 311, 104, 118, -106, 272, 340, 99, -29, 420, 207, 382, 218, -27, 180, 415, 306, 47, 3, 473, 173, 572, -68, 12, 267, 184, 326, 240, 311, 391, 289, 312, 152, 29, 235, 252, 537, 291, 334, 412, 181, 351, 276, 313, 500, -48, 229, 65, 273, 111, 295, 428, 287, 166, 364, 242, 187, 96, 55, 298, 267, 395, 364, 165, 180, 545, 325, 271, 150, -97, 95, 102, -110, 294, 222, -14, 389, 121, 282, 186, 292, 401, 238, 311, 248, 216, -20, -158]
2638a58K84l3k2L25k14K50k25r2K41k91j10J96L06l8j50j02p9L12j54n7p7J48
2660B60j25K26l60L34q3J8o3q7J90qj6k68K45J36j48K09k74q7P5j70Q9L2J11o
2684B30j35L97m07r1K14P8j32j43J92qo6L45J16n63j1j49M41l07J98o7n2Q6J66
2707C32m14M26k40K00K14m87K51L9k10J21q6Ok32K39RqJ28j87P9o4L07p9j26k15
2731CK26J78r0k57L36l60L96l86M46m86L2M1k68N8K15P0Q5J4o12N65Kr6k70j23
2755b81N00K70k15l97J84O4j8P2j07jjL17l26J97n7k36J0J15Jm13N10o0q0K35
2779B83k27J65k95J87r8j3N2N3ok49L08J31k22q9m6K32j7j98J69l93N99q2p3j29
2803D2K1m3K1j7k59N20k47J86j97J87k39K76k37M9J0j05j80M35j5j32K17l11j42
$$ y = [-158, 126, 93, 71, 396, 182, 432, 207, 115, 356, 65, -45, 151, 457, 419, 269, 167, 88, 400, 246, 189, 112, 260, 135, 361, 1, 335, 252, 270, 207, 120, 310, 302, 286, 18, 263, 399, 251, 460, 186, 99, 174, 4, 93, 125, 236, 230, 95, 492, 85, -6, 208, 286, 154, 11, 203, 195, 129, 474, 590, 27, 16, -133, 308, 1, 199, 132, 80, 166, 332, -82, 344, 104, 304, 518, 31, 282, 321, 111, 232, 146, 152, -80, 159, 168, 160, 288, 101, 180, 116, 423, 344, 218, 3, 229, 407, 317, 60, 396, 36, 432, 46, 492, 6, 38, 79, -189, -131, 84, 154, 239, 253, -359, 206, 208, 112, -158, -281, 219, 489, 274, -123, 61, 125, 107, 179, 72, 71, 70, 387, 61, 258, 201, -35, -25, 90, 91, -322, 188, 128, 48, 283, 56, 221, -74, 113, 15, 2, 54, 107, 101, -148, 160, 291, 69, -20, -66, 166, 149, -49, 120, -273, 326, 244, 171, 42, 63, 20, 41, 24, -235, 285, 38, 224, 27, 214, -25, 251, 14, 63, 73, -32, -212, 223, 208, 76, 293, -18, -160]
2826a60J93J61j39J2n7M7j4j67R8J04q8J38p2jm4J4R3m01L96l10L68Q0j53p9k4
2851ej7m3j41N09l11l3K54j23j61o5K43J88m06L6m1N5K64k81J07q7OP0J9Q6p4
2876D9P6J01n34J67J71k7J2m21N59l85L5K75j90K19l74PL34P9m13R3R8j9K07K
2900A21m4k55J37l7J94k21N7j7J34j10n8N0K3j75J94j13k10L50q5M27o39K62J29
2923A14j84K60l39J97l5j79J41O5j89M6J47j24K20k87M20m13L17k44n8n3J49p4
2945a03j63K89k0p2J44k43Q7j7L77Pn98P5o5J1M76l87l72%K68K63k90rJ69p04
2969h77J036k77o57K53K07J33p61O32j59L57n3j2j54M29N2k30j65L9k4j21L00
2990e2J17l41J09O2j29J67Kl1J97k78k80M96m29M45J06l32P1M5k07O9o8K11J57
$$ y = [-160, 33, 194, 55, 67, 10, 57, 43, -124, -26, 78, -10, 128, 56, 55, 11, 25, 118, -283, 113, -197, 171, 251, 98, 19, -5, -22, -65, -206, 303, -8, -41, 213, 90, -71, -136, 107, 295, -111, -75, -116, -61, 203, -78, 29, -58, -52, 18, 37, 123, 49, 125, 226, -308, -141, 30, 3, 15, -406, 153, -232, -197, 78, -112, 107, -267, -260, 74, 153, -260, -167, -69, -88, 119, 121, 77, -178, -41, -78, 116, -105, -48, -65, 69, -41, -99, -49, -26, -201, -7, -120, -330, 20, -65, 362, -277, -15, 114, -70, 190, -149, 48, 13, -166, -25, 40, -149, -103, 44, -80, 140, -147, 273, -140, 177, -67, -125, -178, -29, -103, -266, 23, 3, -69, 75, -168, -81, -98, 279, 286, -312, -237, -302, -291, 185, -202, -574, -574, -306, -43, -333, -342, -173, -877, 159, -118, -775, -522, -315, -182, -943, -311, -470, -113, -166, -178, -332, 97, 149, -81, -246, -207, -231, -352, -52, 65, -276, -167, -105, -234, -67, -65, -96, 101, -177, -457, 39, -390, 55, 161, -171, -100, -55, -262, -193, -261, -50, 107]
3013A07m96M01k23J6q2K79J96l22j20K42j5k42K23k5m58N99k54R5K54m17J62j29
3035b09mj18J95J49k95j17J79j39M7k07L54L5pJ80k25j04J22J33j99P9l79K67
3057b63J71Q6k93k1L14M1j71P0l43K24q8J75j84K71j84K5R0k8j89K9N5K85j87
3080a15j50j12J0M21k03J90o1n87K78L23k74J32P7K51j82n3j78Q6m0L42j40R6
3102A11m22k74N16j64J27J23%k65M00k13j44J2o7J25j28j16J92J04j53J82j5J1
3124e8j44K49l67K23n25J83M14l34M77j88J17o75P14l68k95K75J29j92Q53j138
3144f50l00K15K64Q2m24q03J928J196j098p77M88O03q82r66J478j134O59k70L99
3163Hk82K5Q6m50P52j098Q38J60n22n59R22K12j6k60j59k77L04K03j41K58K22
$$ y = [107, -389, 12, -211, -195, -277, 2, 198, -124, -244, -2, -17, -259, -36, -61, -519, 80, -174, -79, 175, -242, -80, -209, -213, -331, -136, 13, -282, -399, -220, -359, -312, -519, -165, -130, -137, 43, -182, -286, -164, -31, -230, -151, -530, -263, -92, -6, -299, -320, -6, 35, -136, -66, -409, -185, -273, -98, -282, -11, -195, -170, -80, -108, -297, -268, -213, 72, -115, -265, -377, -367, 54, -149, 41, -20, -607, -329, -6, -280, -148, -71, 180, -2, -55, -233, -147, -187, 155, 15, 111, -311, -585, -69, -233, -106, 17, 17, -248, 152, -61, -205, -193, -260, -135, -263, -379, -187, -83, -236, -54, -69, -58, -202, 47, -320, -97, -622, -439, -25, -359, 118, -70, 47, -628, 86, -282, -577, -302, -173, -365, 488, -650, -950, -735, -471, -389, -813, -1616, 312, 1508, 410, -367, 121, 724, -158, -1124, 354, -780, -121, -391, 8, -274, -249, -163, -613, 139, -959, -121, 39, -483, -1042, -120, 92, 76, -184, -343, -620, -316, -113, -254, 4, 226]
3184B26k22k07l1K26j97Oj05L3Q2j58L26J39j03k38K76k93L62j62m79Q0N4K88
3206i7k8J08n6j44J4m02L69J36L5K58l66L5m3j54J09o2J88k32k8J79j91L18j76
3229b30o9O6K75k57j48Q0J53M9R4j17k58N72l17J33l9k92L56k81P6k01L84l80
3251c51K3J69K30k69J38K12l40K93j31K2j14M1r7k17K68J41K35j07l62J44kK9
3273d5k26j06K14J85k55K04j81P5L8R3k11k08J93j9K09l42J41J88l34O4L19J36
3295A32j28R3K36k87j7j80R4q0O7j04J71k82K04L3l26L00N7N4l6M3k97r2K71j84
3319b58K20j31l0L36j81j99K58m55L56J16j76j67K60J6k91N2R0J77K5n7j40p8
3341b57j0J79J02l2m6j08J18l31K56L5J8mk59L62Q7k43N1O4j83L96l26K62l78
$$ y = [226, 4, -203, -234, -8, -205, -199, -304, -271, -189, -347, -21, 118, 15, -223, 53, -240, 122, -40, -519, -439, -385, -97, -125, -17, -73, -217, -203, -605, -236, -100, -65, 193, -173, -138, -181, -335, -226, -288, -100, -332, -360, -181, -372, -54, -230, -299, -233, 42, -215, -363, -283, -130, -81, 13, -104, -362, 210, -107, 26, -13, -305, 51, -230, -154, -355, 29, -351, -328, -159, 71, -198, -60, 152, -188, 105, -26, -4, -118, -77, -174, -391, -123, 18, 253, 146, -216, -72, -74, -45, -271, -377, -163, 22, -233, -29, -210, -135, -97, -4, -215, -423, -230, -249, -40, -382, -241, -53, -387, -323, -4, 132, 4, 97, 333, 46, 29, -151, -57, -137, -70, -174, -3, -285, -81, -48, -374, -74, -17, 37, 1, 44, -253, -345, -74, -258, -38, -169, -199, 137, -44, -243, 15, -440, -84, 32, -144, -311, -51, -35, -326, -274, -184, -7, 18, -39, -179, -257, -267, -88, 14, -18, -64, -172, -54, -385, -129, -94, -76, -80, -339, 23, 110, -133, -82, -18, -201, 195, -131, 131, -247]
3364b47J90l3J46j84K52j20r5J96o7l36J59J95j27N26m66Kk54J63J24jk17N0l5
3387a79L40k21L03p41N19j39K02k04j8P0k7K37l8m61K24K32j13O4l3K14k11m6
3409b6J1j76O8K89m09N92l73r3p8JJ76J8K7k26K27N4m30L90j27K61k28k03J92
3432f3O9K42l70q4L35p7r0N6L5j05l8J07J1R0q2M3M5O4M9j01m07K18K12j92R7
3457F4j98pJ36J79kl35q8M9J86k71N24l65J08n2N9J28j4J05k7k49K57j49j92n3
3481b07L61k52N8J5J33J38j56o4J00k74L7L15l70L14j22k9K5j25J47pJ61k16J5
3504cl0J29J3O3r6J39j78J2k64J10L17m61r3N49j03l23O6J18ok16N82l08J63m02
3528b22L18j11K00n0M0j47k97L58o3P7j80L58j86j30R3r8M51j05k57m0k10K35
$$ y = [-247, -57, -90, 56, -128, 124, 4, -91, 105, 38, -298, -139, 56, -71, 455, -11, -9, -263, -100, 24, 23, -194, -144, -179, 161, -60, 243, -498, 21, -118, 84, -120, -138, -68, -95, 142, 104, -357, -133, 99, -14, 50, 17, 231, 20, -26, -15, -191, -123, 166, -243, 349, -24, -117, -195, -194, -18, 0, 27, -199, 28, 82, -348, 42, -85, 176, -52, -255, -63, 6, 248, -122, -206, 129, 52, -38, 18, 53, -52, -90, 17, 28, 118, 36, 79, 124, 188, 237, 136, -271, -53, 159, -33, 64, -134, -141, -5, 174, 172, -163, -251, -202, -16, -287, 237, -128, -20, -72, -13, 115, 101, 206, 179, -70, 187, 38, -154, -207, 154, -98, -40, -25, 108, 246, 90, 26, 126, -148, -111, 204, -166, 148, 26, -3, 22, -103, 44, 37, 198, -18, -3, -33, 96, 109, 172, 76, 215, 37, 49, -215, -105, 212, -249, -342, 207, 104, -219, -153, -35, -41, -257, 325, 17, 180, -222, 96, -15, 185, 135, 175, 28, -269, 89, 26, 103, -77, 281, 95, -35, 58, -40, 411, 306, 49, 9, -201, 34]
3550C4P7j87J62l45L19j91K22J39j28m9RK9k8k84J73mL68l42R5n1o2J88p3K78
3574C49m4j69N6l54K20j9J36k46J12p6J04l9J48j61k46K80K26J57n67K67o9P1
3596A36j40J17k81J46K05l26N22k33r8L9J9O3o9oJ13j36k76K07K77N4j10r8j52
3619b7k12N51j49k17N0l01L51Q5j78L02l31Q7K23l07K12m7J52j59K34l01N9J26
3641B03o0l6j3l17M42n6m4Jq8R1m37L23Ok2J97o1M3j11q4K25j35l4L13m83L21
3666A84j18J20l73M29pM0k78J63j61o9j54J6K36j23j77N05N9j11o4n2J52J19r9
3689B37k02L17j10j52n2N10m13O7m5P1q9J15k19k09O12m72K56k87m0L20j07J04
3711B12p3k20Q7M2R0R7j59N3pj91L73k12j03r5N7O9O2r8J0K54k38R0J57L6K17
$$ y = [34, 111, -76, 86, -259, 60, -131, 91, 230, 102, 53, 62, 91, 63, -221, -48, -52, 316, -26, 69, 18, -44, 144, 71, 349, 305, 136, 192, -162, 58, 39, 175, -71, 41, -35, 69, 30, 178, 17, -229, 51, 277, 434, -133, 134, 65, 136, -4, 113, -168, -22, 183, -143, 379, 146, 48, 87, 106, 169, 100, 94, 207, 71, -205, 2, 279, 333, 223, 125, -27, -239, 312, 163, -54, -4, -305, 46, 131, -47, 255, -76, 11, 234, -73, 139, 92, 244, 85, 319, 18, 77, 203, 143, 107, 94, -223, 219, 163, 119, 120, 32, 123, -314, 9, 15, -7, 190, 129, 172, 61, -23, 202, 67, 33, 346, -137, 184, 66, 186, -187, 242, 235, 275, -3, 160, -1, -70, -224, -208, 28, -95, -272, 233, 292, 181, 117, 65, 217, 336, 237, 35, 352, 242, 90, 38, 548, 135, 202, 157, 228, 139, 254, 35, -174, 438, -34, 222, -65, -105, 215, 108, 212, 139, -81, 6, 48, 138, 235, 76, 129, 122, -69, 304, 92, -11, -106, -49, 20, 82, -16, -6, 248, 10, 100, 257, 293, 510]
3736E10l98l7R0J5j10m0K92k45N3L1l02K24k71N9K33L6j57K21k29k1k9j0M67j74
3760B08k1o46P47n15p4M74j58l0l23O41m80J92n47O82l74K64J8J35k48L05l5N56
3782G71q17N63n12M3m39L50K70l30J42L10j66L65m50l09l9M34k91L00M64q63M68
3803B64NN9k76J51l52K97p25Q17k26K82l56K45l68J30J10N72p42N28P41l95l29
3824D32j62m63m00P87j52j32n01J108m20O8j94M15j633J058K83J90n51M77K54
3843D64k69l04M28N16j275K74J279p93o01N58l20M46n63N30m09O3J71n5j95j0
3863f5j44K04j60L74K2Lk69N2p0K20l23Q1J28p2p8k10P29k18j83M83j63j17j24
3886A00J43j88J52k30p9m4K39k15K92k87M34j53J55l13Kk65K03K49l79L70k52
$$ y = [510, 112, 75, 165, 180, 70, 30, 322, 77, 130, 161, -141, 83, -188, -129, 104, 140, -17, 204, -25, -46, -75, -85, 382, 208, 187, -459, 288, -227, -301, 173, 15, -15, -338, 303, -177, 15, -532, 150, -224, 40, 58, 193, -55, 250, 215, 771, -46, 517, 5, 48, -391, -41, 229, -101, 41, 351, 185, 550, 100, -209, -248, 186, -105, 195, 659, -204, 264, 269, 328, 52, 203, -149, 148, -577, 240, 14, 296, -60, 185, -183, -53, 57, 629, -113, 415, 1156, 761, 432, 270, -193, -593, 194, 42, -90, -591, 517, 97, 165, -29, 386, -1247, -189, 94, 284, -267, 210, 464, 195, -109, 319, 835, -440, -166, 1113, 320, -281, 277, -43, 403, -160, 370, -39, 24, 195, 140, -55, -65, -209, -5, -165, 209, 231, 234, -35, 17, -53, 167, -156, -75, 53, -19, -97, -307, 422, 204, 21, 504, 341, 224, 100, 243, 55, 207, -23, -102, -146, 93, -122, 170, -117, 317, 164, 319, 6, 8, -257, -54, 195, -184, 186, -66]
3907f6L5R7l1j62L06j50K11K3l15J64j17R1l4j51J53L1J82l77K44j93K58j94J27
3930A32Ln00L21n9J79k03L2n5J30J35j46k58K53K52k91J26p2P1j99J94P0M5m1
3953A19Nj86R5K2m2K80k16j6k28M5K58q4L9L7j26J0K78l14J90k10j19J91K4J8
3977G0k33J15K17j11K00j55o8l01K92j54r9J72J77R2j06k95J53k31O2J50K68J35
3999C50k94R9j89q6M64m26K77j60k18K87k54K99kk61L7M35o08L9J87J43j15j37
4021a33m5K39k28K85l9O3l7J1j31j2L42k50m9Kj24J2J16K24l04j4K75n3k84lJ6
4046a21J09J14k74J74k30J50j16P4J90j82J01J35j71j11J13L4j28r1K47k49K54
4067B2K03l35J94j03M3k84K21K0J44k43j80K55J12j33j4Q8L7k3J04j16j70J74
$$ y = [-66, -31, 66, 35, -127, 179, 29, 240, 263, -52, 112, -5, 86, 52, -99, 54, 85, 267, -110, 134, -59, 199, 5, 132, 135, -365, -44, -103, 76, -127, -95, -150, -20, 115, -31, -289, -36, 216, -75, 51, -21, 50, -149, 45, 115, 160, 119, 124, -62, 33, 55, 13, 293, 77, 61, -167, -122, 136, 52, 91, 128, 2, 12, 290, -24, 166, -44, -163, 28, 52, 70, -163, -48, 169, 58, 258, 103, 35, -266, 26, -128, -227, -55, 122, 214, 108, -187, -34, -265, -203, -53, 215, 350, 56, 155, -34, -120, 344, -82, 195, 35, -183, 104, -150, 149, 147, -114, -77, 358, -250, -211, -24, 119, 4, -133, -178, 61, -167, 118, 79, 142, 105, 116, -15, -27, 315, 65, 16, 18, -106, -94, 22, 246, -58, -72, 203, 150, -134, -137, -121, -12, 102, -172, 2, -228, -78, -194, -120, 70, -112, -11, 124, -47, -158, -45, -11, -139, -230, 17, -232, 22, 225, -110, 84, -19, 24, -260, -39, -19, 125, -118, -298, -43, 69, -64, -78, 10, 47, 24, 128, 12, -158, 16]
4089A6m6j48K90nm06N20l00L5J21O4j54j68L02PMj64K26k41R6k57K51m38M53l0
4113B8n8j16J28J02l22K82J76k94J67p1j27O4k14K33O6l97N2J9L51J0j68P8J45
4136A34m91K66J14K1j45j05K71n98L41M92m58J42J50k15j6p7N4J01k2L24j91j52
4158f0qM52k80j99N4kJn1Q0M2R2k18J55J18j83J58l85K56j62J07J42j30P1r9J61
4183A12j95J53r1m54L43K0m7J50j38K41j92K04l84K70j69J83o1N7k88K90j59K03
4205D8R1l59K48j83Q2K76ll51K92m20K07J27k42rO8R4L09l50K59k1l6l57J29K80
4229A79L0J55o23l6Q0R3p0K67j50J16j57K03Rl33L01l29L21L2k00J00J71k96K99
4252A62j46o6oJ13j14J73K3r7j47o0J33K3j90R2J30k04o7K42j4OM2j98J01K08
$$ y = [16, -30, -178, 112, 107, -299, 221, -79, -44, 77, 141, -13, -181, 121, 128, 132, -32, 194, -47, 49, -208, 43, -395, 58, 28, -30, -146, -18, 84, -238, 44, 220, -74, 93, 22, -105, -41, -255, -22, 44, -353, -301, -282, 69, 79, -89, -11, 134, -357, -91, 23, 44, -101, -206, 65, -533, -192, 300, -158, -16, 134, -81, -97, -174, -120, -19, -41, 283, 92, -60, -68, 384, 104, -95, -41, -43, -42, -93, -13, 29, 121, -97, 58, 176, -7, 151, -234, 22, -140, -33, 109, -21, 50, -49, 112, -83, 70, -21, -475, -132, -112, -159, -9, -147, 94, -98, 106, -278, -8, -177, 6, -55, 2, -286, 4, -155, 48, 139, -220, 28, -155, -73, 203, 200, -151, 141, -279, -72, 55, -187, -196, -128, -34, 275, -75, 184, 163, 127, -230, -101, 179, 209, 364, -259, -295, -215, -122, -192, 75, -75, 41, -116, 87, 96, -237, 64, -265, 56, 88, -112, -12, 159, -137, 162, 16, -50, -56, 57, -57, 116, 139, 42, -105, -165, -32, -9, -199, -107, 23, -181, -248, -6, -20, -14, 28, -170, -69, 139]
4276A39k34n1Kn3j85L37R6l13o4L48j01K6K43L1k90j7J21O1p8j13o8J33R7lm38
4301c74K00J14jJ00n8K4O3L6j75K8J64k0Q8l90j2j1J63k5p5m4J18J54k33K5L94
4326B53l50j01lL50j56K31o6j56R9J91m95L01K6n51L25k5J21J72j16l17k9J80
4348a16J80k1j75N0K92j67K18l27J58j87M95n60k11L35Q1N8k13P3r0j33K82l7
4370a5M24o46J06r1j9L22k75J49K43l85K36N1j51K02lj8k12l34L52j07J03k62
4392c30L85j6l3M0k22R1L39k89Qo3J28J1l96O23k72%J2q1l1K9J16l4n61O82l97
4417b61K63L19k29k88K53k37J84K7k16K34K6p9k90K83k65M68m07j2K05k03M92
4438B67n60O31o65K04n7p9K77q1k66M54n33J52K31M76r09K50K64p32j26J20Q60
$$ y = [139, -95, -146, -144, -197, -382, -45, 51, -262, -326, 22, -79, -53, 190, 221, -69, -86, 35, 96, 18, -95, -163, -30, 67, 64, -374, -174, -60, -61, 39, -19, 5, 68, 104, -71, -43, 121, 101, 189, -201, -213, -224, -61, -86, -161, -205, -87, 67, -166, -141, 253, -97, -198, -201, 149, -7, 224, 158, 2, 101, 292, -203, 98, 124, -427, -102, -127, -6, 166, 50, -267, -296, -116, 64, 43, -132, -82, 210, 43, 261, -66, 92, -95, 400, -160, -371, -36, 45, 103, -110, -37, -127, -260, 22, -15, 409, -237, -131, -222, -241, 81, -194, -45, 198, -187, 49, 100, -51, 151, 148, 130, -82, -416, -64, -171, -68, -330, 55, 39, 6, 46, -176, -85, 254, -35, -27, -90, 38, 49, -347, 276, 4, 4, 16, -65, -96, -67, 49, 15, -546, 136, -261, 2, 321, 92, -196, 57, -180, 4, 31, -185, 49, 75, -4, -294, -11, -276, 192, -215, -227, -22, -225, 267, -293, 338, -327, -123, -180, -259, 18, -63, -329, 125, -408, -256, -25, 451, -458, -208, 56, -676, -802, -682, 178]
4459A78p39N33q7m13J41l9Q90N4o22l2Q85r69J84R6Lm56O03P4n19j06K36M78m5
4482C28k8n27KL94N2m46l10N15K3k19l4O46l15j86R89k78j49m15K71K45l60j11
4504H7o09K67O51K9l19R60j446M76l50l3J39N71m84L63j41j146L62J172j162J015
4524D02O88k83n44J6l74L04L43n19p89J233k83JO34J22j333P07p11N98p08L44
4544a52J6N39k10j6m43M71J56l44O8m78L74l36n43J338k74J45K76j081N50J32
4564A88j01m34K40l57Q41o74O89o04N15p10Q0P15N0r93p9L14J01N4L36n11J49
4585a91j10J359j235R04p92l88J63O27k72L14o33l30J192q24J46p5K94m17P15
4604D47l62on83K12L81j74K16k81J63J41K76o40pL58l01R87p04p42R15k16m23
$$ y = [178, -561, -28, -115, -528, -387, -426, 464, 518, -104, -136, 749, -220, -36, 60, 63, -393, 210, 284, -235, -341, -105, 373, 328, 300, -227, -225, 169, 221, -225, -535, -20, 3, -216, -250, 396, 81, -105, 884, 606, 457, 42, 313, 558, 198, 87, -522, -255, 396, 425, 106, 1066, -380, 96, -254, -287, -148, 423, -61, 302, 161, -985, -623, 549, -613, 402, 1090, 807, 263, 279, -95, 209, 552, 33, -756, 477, 194, 195, 829, 951, -382, 325, -386, 212, -496, -152, -136, 403, 193, 177, -266, 205, 361, 17, 85, -393, -19, -355, -898, 440, 166, 311, 587, -494, 56, 188, 87, -347, -107, -464, 377, -297, 392, -212, 303, -407, -327, 388, 438, -555, -634, -320, -219, -165, 171, -340, -191, -301, 1058, -177, 727, -65, -453, -290, 337, 65, 379, -254, -584, 608, -216, -70, -145, 149, -268, 447, 85, 79, -504, -292, 89, -85, 131, -150, 13, 154, 430, -210, -217, 141, -160, 827, 123, -619, 296, 80, -343]
4625c43J29N04K62k44p08j73R34j53l35O84q01J01K0MJ61J04J06L5l86k79N35
4646A57j56oQ20o1p16K0k01o8K53K0o3K85l97k68N74j60pN58p88L23j66j3O8K57
4670B65j21k53o7K83l21l26O19l51M48M1l65k58L20J65K98l7k41j55n69Q41J46
4691C62k31J34q33L70K43K5p10J076J23J7j19m74K58lK1l58P65q04P47m26L50
4712E33n17l44P54K79j445Q31k14O77q23N33K25j1j25l76k47k1M77k90Q20j170
4732d54N74j78j52O99l87j92Q94p27Q54j154K17m00N82O43r56O74j010P81m40
4751a32J87l96O91j62K49k41n0o82M81k96P00k69oO9J02l54K24k78L19r5k27K02
4773C6J56m8j92L03j47r6J55k2j74J28K79k38k63k5P3j0K28k11L11j99j43J47
$$ y = [-343, -214, 290, 552, 308, -400, -573, 361, 208, -127, 557, -244, -143, -123, -119, 42, 146, 252, 287, -99, -378, 157, 1, -5, 815, 754, 38, 58, -143, -211, 42, 62, -1, 284, -113, -381, 193, 33, 26, 584, -204, 119, -47, -60, 8, 265, 144, -109, -176, 107, -214, -540, 79, -272, 176, 217, -148, -406, -86, 79, 377, 340, 99, -56, -625, 216, 362, 131, 265, -568, -198, 45, 70, -640, 436, 559, 576, 457, -17, 241, 238, 259, -99, 666, -138, 609, 183, 533, 16, -328, 426, 705, -740, 91, -123, 554, -269, 264, 489, 478, 353, -23, -270, -291, 186, -104, 716, -454, 120, -58, -210, 489, 102, -90, 804, 77, 931, -223, -6, -406, 176, 819, -137, 537, -473, 308, -132, 55, -341, 350, 188, 437, 196, 146, -536, -55, -351, 349, 80, 74, 143, 245, -109, 115, -163, 156, 61, -166, 36, 192, 144, -48, 255, 108, 12, 167, 145, -29, 99, 378, 140, -123, -148, -75, -85, 143, -68, 243, 44, -99, 48]
4795D8l7R7n6k58J33k22L41L0j54K69l58K83L07n61q1J80K16j58N9J4n4nk5k11
4819b03J30K2j17R3J55K0k09M7r9K20J84k49K33k78r9J87L0J21j04j83N4k12Q4
4842a73K13k43K8K87m4Q5q3j46J01q2Q5J06J94j75K27k68o2j46J69P0n4j91j02
4865b04K71Jj84P8N8j52L2J84j7J91k08m23N07k5r2N4j3j53K8j01J77K65j04k93
4889a23Q3P8j38K09k39o0J92j8J18p7Lj06L0j29L02L3j2R3r3j0j06p4J21j95J32
4914A4j28J74k90K91j4NQ1oK4l1o2j89L29k59Q1j2J29Rj91l0L9K06k16K6j91P2
4940a39J16j39M10k39j48L08j39j49L24l24N41m47j7K03P15m25p64J3M51M2k34
4961d1J38k43M1L40l04K20k29Q3j5k47J24J79j56J87j15N7Kk40J94K24k13K14
$$ y = [48, 11, 108, 52, -206, -73, -295, 46, 76, -78, 191, -167, 116, 423, -138, -219, -39, 177, 19, 78, 92, 38, 33, 8, -203, -73, -51, -168, -75, 80, 100, -109, -62, -161, 59, 243, -6, 227, -51, -150, 37, 67, 188, 84, -99, -45, -257, -173, 40, -203, -175, 112, 68, 153, 70, -76, 25, -57, 28, 134, 328, 153, 380, 112, 50, -96, 73, 143, 89, -102, -204, 67, 68, -116, -38, 20, -132, -100, 84, 67, 258, 50, -373, 134, 109, 17, 71, 58, -95, -67, -168, 9, 274, 170, -123, -40, 38, -100, 109, -130, -190, 2, -16, 102, 25, 28, -78, -48, -177, 125, 158, 146, 239, 146, 136, 30, -44, 77, -118, 14, -114, 60, -230, 61, 47, 52, 133, 127, 151, 120, 58, -131, 198, -61, 20, 8, 137, 146, -45, -75, -36, 170, -46, -20, -211, -139, -23, -162, 248, 9, -139, 169, 30, -119, 205, -119, 422, -25, -42, 161, 876, 451, -313, -300, 151, 193, -41, 97, -146, -105, 235, -69, 151, -78, 5, -10, -257, -133, 46, -110, 77, -38, 19, 21, -219, -25, 199, -14, 200]
4983B00k41k0N7J74J9k44Q6J29p7J6J13j77q9m4J45Oj31r5J15j73L34j16J22P7
5007A86k00K34k20J08j90k9K04M0j32n9o8J40M1J35j05j67K16j87J83J31q8j03
5029G0r6J81l36P9k14L20p1J16K52k61J09L9j17j36J3J83j74P9p8p7J34j44K96
5052A67j33j17J93k67J34j52R2k7J02K08j20m7K7J53j91k4L6P1j11j05p8P6J11
5075bj55J76n5L2J6j25l0j17M98k12p3Q6k07L69k97N9j64N11l40k1J66l70K16
5098c9j94M57j67k36K93j30p5K32q0j21j41K32K48l1r1M8m41J62J73K32k79k10
5120a58K03N3k94L20j52n7J58j61Pk8j90M56l58K95J14n25J9L01N5j14J85m8k70
5143a89N64l50L51Q2L64q36K25m02M55l11J17j95M06K99p35L83r86L52K5K8J64
$$ y = [200, -41, -61, -4, 170, 189, -55, 31, 160, 83, 99, 212, 35, -54, -98, 47, 53, -78, -173, -58, -231, 103, -13, 109, 186, -14, 220, 0, 108, -82, -111, 93, 133, 1, -58, -126, 14, 55, 190, 85, -82, 134, -53, 130, 261, 173, 70, -26, 155, -181, -102, -316, 4, -67, 49, 301, 40, 149, 188, 71, -65, -52, 131, -43, 36, -42, -119, 15, -129, 167, 34, -83, 110, -157, -23, -175, -83, -110, -8, 200, 80, 33, 60, 213, 22, -2, 34, 105, -6, -111, -189, -113, -2, -157, 19, -36, -4, 12, -113, -143, -260, 238, 26, -47, 39, -168, 201, -96, -37, -201, 310, -30, -51, 115, -255, -39, -233, 224, 57, -179, 114, -16, -91, 141, 61, -60, -201, 31, 279, 248, 157, 205, -236, -74, 99, 331, 52, -158, 45, 98, -196, 124, -28, -85, 73, -88, -81, -109, -299, 157, -201, 94, 208, -317, -298, 3, 58, -56, 129, 81, -189, 375, 25, 376, 458, 822, -14, 211, -191, 264, -47, 70, -125, 281, 580, -155, 228, -758, -406, -381, -353, -189]
5164a89K88K40m34n59J047o81L50j20K20L2j60Ko5L4j78N5L05k67K13n1r7n1Q2
5187A6n7J20j82J10P0o4j88J29J81m31K05J87k89J46k3K3K11l38L19k58J93k32
5209a52K24m5j22K62r9j80o3M22j31j68J22j66M2L02j81Qj8k14N22n17L27p3J42
5232B44j98j82J67k48J60r4J84r4Q3l48M01r7n1M6kK9R1j89J56mj96K98l40L90
5256B06l70j1J90K3j47M3j24J27N7Q5qk20K97l44J13K39j64K3J8n1K43n78M59
5279A06m00K47J03r1J04J07j75J05j65J58n2P9r5J50k34K67m3l77L42l21L30k75
5301a30J16J32k49K40J31k07K95l19nrk1rO5j54N1m9L3L0J6j19K52J92l34j8j25
5326a95J97J1r6M1J4jJ47k68K84o5j87j15Q5L82l48j39K42J4l0l2j80K74j91K13
$$ y = [-189, 99, 339, -95, -654, 393, -288, 62, -58, 162, 194, 34, 36, -29, 5, -173, -118, 187, -80, 133, 82, -15, -66, 16, -41, 79, -103, 7, 77, 13, -175, -46, 135, -296, -91, 96, -193, -47, -70, -47, 164, -174, 145, -113, 80, -152, 72, 27, -95, 167, 68, -112, -175, 247, 116, -52, 70, -96, -54, 248, 67, 75, 57, -157, 365, -152, 175, 102, 244, 46, -136, 31, -217, -57, -151, 33, -61, 22, -326, 75, -22, -73, -27, -29, 0, 91, -98, 58, 54, -142, 156, -184, 206, -164, -175, 15, 38, -109, -66, -190, -63, -6, 79, 71, -149, 148, -196, -83, 156, -8, 15, 33, -18, 225, -353, 106, -294, -47, 56, -35, 69, 176, 1, 106, -59, 99, 47, 126, 31, 181, -53, 214, 171, -206, 136, -185, 145, -130, -14, 118, -131, 109, 240, 33, 328, 9, 4, -5, -26, -35, 30, -124, -73, -122, -89, -59, -43, -162, 90, 282, -52, -70, -195, 2, 13, -83, -42, -28, -29, 118, -150, 134, 69, -118, -233, -148, 234, -114, -253, -11, 3, -27, -59, -239, 35, -156, 57]
5350E7Q6k03O6Q2j63J83j10L0k81L94j6p4r0k1q6R5k52L86l30J87L7K7k66K57
5374eK5k09l9L86l72N23o3m71N52J31l46k55K2kK5J21L6k30k21M22r7n52P17m7
5398E1K15j29K13j49k64j29N78k99n08L67K64q76J11Q13k95j63K77r9j92L05L04
5419C95k19mk34J18k30M21j43p7J95j26K3k19n4K40J92k59m4r0J01j7j47J0L25
5442A57j9k95J58j19N5L7j92M48l42n6J07n9PP1j75K21k31M61j31o7J67k93N4
5465c6J23K4L6J2j39J28j46O9j78M8r2N9R7Q0j11O8L53n32K11o1r4K55m1j34r4
5490i5P6j79J55j15J13J40k69M03q8n10L01p9O3J32k11Q5r4L5K79k06K64o4J76
5513C12j00j08o6L9M5j52k5J35O2k05r5J30j25K48l71K48j54M28j40k27Q4J18
$$ y = [57, 143, -60, 6, 88, -75, 108, -2, 28, -253, 141, 125, 51, -39, -60, -146, -51, -303, 83, -247, -60, -23, 4, -262, -5, 20, -189, -228, 158, -214, 309, 246, -225, 327, 458, 112, -143, -121, -123, -98, 23, 59, -171, -392, 30, -67, -619, 98, 51, 266, 137, 350, 201, -63, -192, 386, 87, -421, -54, 210, -666, -555, 258, -37, -200, 77, -22, -214, 91, 395, 176, 172, -62, 56, -174, 247, 104, 27, 222, 96, 119, -100, -154, 86, 278, 19, -25, -115, -14, -31, -178, -168, 157, 138, -157, 1, -118, -63, -26, -218, 230, -112, -168, -61, -120, -113, -42, -217, 4, -227, 234, 103, 36, 203, -90, -36, 87, 111, 147, 159, 20, 148, 2, 71, -107, -59, -151, -92, 5, 85, -26, 42, 395, -137, 74, 13, -81, 174, 133, -1, -95, -19, -198, -43, -158, -45, 95, -174, 229, 141, -369, -68, -147, -84, 48, -163, -78, -172, -137, 142, -64, 200, 136, 312, 212, 104, 38, 77, 122, -30, -55, 80, 142, -63, -158, -28, -153, 95, -276, -28, -182, 246, 106, -121, -37, 81]
5535H1O9j20k75K44J90j23K17l47J13J09q5N0k1M1l03j41K14k2P6J79P1p6Q5j83
5559D3j28k73L51O7O9N4M9q2l10J86k7J43l19K99j81R4m6K13m15M57j12r9J06
5582A39j53K76j69j45J51j21K59l30K07j92r1J21LQ3q0o8pK00N5Oq8r5J39j8L54
5607D36k52j77K76j76O2k17J63k8J19j39K03k51N3q9j21K13j10r9J1K73k95K41
5629I6j45J24k45J43J77l01J96r2L94m39K94K28l29k49N8J83q8l27K45J76l4O6
5651A31j14J19j02J78k46j7K3N3N7J0k80J58j76J52K3m1L02m66K21M7p1R3k07
5674a53L19j93j77J29R0j64K71q33J399l48M63r63N88Q18j012m49q3O25n36o1
5694b70N25j78L67n19o74P78l70M66J20K84l22m48N44j10l07R06m62J58Qo63p5
$$ y = [81, 150, 30, -245, -1, 189, 66, 283, -64, 49, 158, 73, 123, 102, 143, -160, -301, -87, -109, -33, 146, 217, 141, 226, 43, -85, -358, -7, 60, 129, 183, 232, 150, -160, 26, -1, 142, -177, 122, -59, 35, -11, 202, -213, 244, 132, 33, 139, -14, 262, 93, -52, 99, -22, 237, -93, 114, -78, -169, -48, -45, 38, -42, -110, -117, 83, 138, 144, 56, -39, 100, 82, 436, 184, 7, 283, 107, 169, -48, 115, 87, 206, 67, 270, 19, 72, -17, -138, 75, -35, -134, -123, 150, -145, 96, -49, 75, -170, -27, 150, -151, 45, -47, 347, -92, 202, 430, 101, -148, -90, 93, 5, -322, -77, 99, 65, 131, 17, 136, 34, 212, -34, -51, -28, 25, 82, 92, -188, -30, -206, -54, -31, -72, 230, -236, -15, 32, -39, 54, -153, 166, -27, -204, -75, 15, -149, 122, -711, 688, 340, 803, -160, 428, 1246, 234, -215, -298, 327, -209, -270, 255, 77, 444, -75, -749, 29, -341, 125, 245, 529, 207, -241, 303, 193, -114, 792, 330, 488, 496, -167, -242]
5715b42N72k93L76n43k77L65J26M31k58m82J6J42L8J52J22j74j09J46K6k93K97
5736A38l15M93l77J50j61o9K55l18J93O0R5l15%K28K61l24J52k30J19K3J36j44
5758E0O5J57l72q0K64M2O6J21k91j74J06K9m7JN8J71j41O5j16p1K75j06k5l03
5782b56L92j20o2j18J26L1P5J28O3j54O9l13K98j53pJ62m2o8L6k9k5kj81O4R3
5807GK41Q3m06q6K6o2L33L2L9l87nJ86J43l0k81J41N2n2K8j24r0p4N12k96P8j4
5833fL7j64L56r7n7j24j64K50J08L0J47m53J17M45n85L39J09m70L01o3k15K56
$$ y = [-242, 330, 37, 413, -130, -407, -42, 84, 515, 257, -225, -209, -67, -29, 123, 245, 71, -38, 108, 134, -159, 138, -177, 316, -61, 89, -72, -141, 114, -204, -11, 49, 144, -171, -171, 57, 318, -6, 146, -84, 35, 58, 194, 50, 115, 272, -100, -180, 84, 126, 192, 313, 22, -152, -46, -17, -64, -63, -5, 166, 25, 90, -26, -97, 178, 72, 47, -256, 136, 16, -46, -164, -38, -7, 68, 196, 259, 105, 174, -139, 159, 6, -1, 161, 119, 51, 87, 58, 33, 31, -150, -86, 7, 248, 331, -75, -161, -135, -197, 136, 168, 207, -180, -185, 1, 144, 114, -167, -26, 26, -26, 2, -122, -212, -286, 226, -70, 8, -6, 31, -133, 223, 126, 69, -55, -219, 31, 139, 169, 316, -137, -20, 425, -160, 179, 288, -182, 119, 56, -159, 97]
$$ [...]
8191G4
##END NTUPLES=NMR FID
##END=
